##TITLE=AC1430_MEXAH13241_7764312_et2x0JPw3M
##JCAMPDX= 6.0         $$ Bruker NMR JCAMP-DX V2.0
##DATA TYPE= NMR SPECTRUM
##DATA CLASS= NTUPLES
##ORIGIN= BRUKER
##OWNER= Administrator
$$ 1.72 TOPSPIN		Version 2.1
$$ 2013-04-11 23:45:26.810 -0700  Administrator@X
$$ Compression mode = diff/dup
##.OBSERVE FREQUENCY= 400.02188249412
##.OBSERVE NUCLEUS= ^1H
##.ACQUISITION MODE= SIMULTANEOUS (DQD)
##.ACQUISITION SCHEME= undefined
##.AVERAGES= 8
##.DIGITISER RES= 22
##SPECTROMETER/DATA SYSTEM= spect
##.PULSE SEQUENCE= zg30
##.SOLVENT NAME= COFFEE_meoh
##.SHIFT REFERENCE= INTERNAL, COFFEE_meoh, 1, 14.98509
##AUDIT TRAIL= $$ (NUMBER, WHEN, WHO, WHERE, PROCESS, VERSION, WHAT)
$$ ##TITLE= Audit trail, TOPSPIN		Version 2.1
$$ ##JCAMPDX= 5.01
$$ ##ORIGIN= Bruker BioSpin GmbH
$$ ##OWNER= Administrator
$$ $$ E:\/data/COFFEE/nmr/AC1430_MEXAH13241_7764312_et2x0JPw3M/10/pdata/1/auditp.txt
$$ ##AUDIT TRAIL=  $$ (NUMBER, WHEN, WHO, WHERE, PROCESS, VERSION, WHAT)
(   1,<2013-04-11 23:45:18.544 -0700>,<Administrator>,<X>,<go>,<TOPSPIN 2.1>,
      <created by zg
	started at 2013-04-11 23:44:12.310 -0700,
	POWCHK enabled, PULCHK disabled,
       configuration hash MD5:
       33 CF 6A 21 5C D3 B9 40 6C 15 AA 8D 27 A2 4F 13
       data hash MD5: 64K
       B8 CD A8 43 FD 63 D8 A7 DC CC E1 92 AA 10 9C B2>)
(   2,<2013-04-11 23:45:21.857 -0700>,<Administrator>,<X>,<proc1d>,<TOPSPIN 2.1>,
      <Start of raw data processing
       efp LB = 0 FT_mod = 6 PKNL = 1 PHC0 = 0 PHC1 = 0 SI = 32K 
       data hash MD5: 32K
       94 50 22 BB 19 57 D5 37 BE 1E 64 55 A7 98 2F 94>)
(   3,<2013-04-11 23:45:22.310 -0700>,<Administrator>,<X>,<proc1d>,<TOPSPIN 2.1>,
      <pk PHC0 = 99.31091 PHC1 = 0 
       data hash MD5: 32K
       81 D7 C1 72 84 E8 E3 D3 5F 4D DC 14 9A 25 D9 14>)
(   4,<2013-04-11 23:45:22.544 -0700>,<Administrator>,<X>,<proc1d>,<TOPSPIN 2.1>,
      <abs ABSG = 1 
       data hash MD5: 32K
       AD CA F7 A7 8D 40 8C 23 3D AD B2 A3 08 D3 66 7F>)
(   5,<2013-04-11 23:45:22.685 -0700>,<Administrator>,<X>,<proc1d>,<TOPSPIN 2.1>,
      <abs ABSG = 2 
       data hash MD5: 32K
       58 B7 21 39 BF F1 1C 6A 99 A7 76 F5 F4 FC 96 1D>)
(   6,<2013-04-11 23:45:22.841 -0700>,<Administrator>,<X>,<proc1d>,<TOPSPIN 2.1>,
      <abs ABSG = 3 
       data hash MD5: 32K
       A3 12 95 2F D3 75 93 C0 46 B4 C1 55 8D 15 A5 EF>)
(   7,<2013-04-11 23:45:22.982 -0700>,<Administrator>,<X>,<proc1d>,<TOPSPIN 2.1>,
      <abs ABSG = 4 
       data hash MD5: 32K
       47 9B 57 D7 82 F0 1A 46 97 8F C9 7B 66 43 24 54>)
(   8,<2013-04-11 23:45:23.154 -0700>,<Administrator>,<X>,<proc1d>,<TOPSPIN 2.1>,
      <abs ABSG = 5 
       data hash MD5: 32K
       2F 12 28 80 1A 90 2B D3 D7 B9 3B 94 30 01 89 9D>)
$$ ##END=
$$ 
$$ $$ hash MD5
$$ $$ E1 93 97 9A C9 33 04 80 DA 7C FE C2 BC 5D D4 42
##$RELAX= 
##$RELAX= 
##$RELAX= 
##$RELAX= 
##$RELAX= 
##$RELAX= 
##$RELAX= 
$$ Bruker specific parameters
$$ --------------------------
##$DU= <E:\>
##$EXPNO= 10
##$NAME= <AC1430_MEXAH13241_7764312_et2x0JPw3M>
$$ [...]
##$TP= (0..7)
150 150 150 150 150 150 150 150
##$TP07= 0
##$TPNAME0= <>
##$TPNAME1= <>
##$TPNAME2= <>
##$TPNAME3= <>
##$TPNAME4= <>
##$TPNAME5= <>
##$TPNAME6= <>
##$TPNAME7= <>
##$TPOAL= (0..7)
0.5 0.5 0.5 0.5 0.5 0.5 0.5 0.5
##$TPOFFS= (0..7)
0 0 0 0 0 0 0 0
##$TUNHIN= 0
##$TUNHOUT= 0
##$TUNXOUT= 0
##$USERA1= <user>
##$USERA2= <user>
##$USERA3= <user>
##$USERA4= <user>
##$USERA5= <user>
##$V9= 5
##$VALIST= <valist>
##$VCLIST= <CCCCCCCCCCCCCCC>
##$VD= 0
##$VDLIST= <DDDDDDDDDDDDDDD>
##$VPLIST= <PPPPPPPPPPPPPPP>
##$VTLIST= <TTTTTTTTTTTTTTT>
##$WBST= 2048
##$WBSW= 25
##$XGAIN= (0..3)
0 0 0 0
##$XL= 0
##$YL= 0
##$YMAX_a= 656321
##$YMIN_a= -559247
##$ZGOPTNS= <>
##$ZL1= 120
##$ZL2= 120
##$ZL3= 120
##$ZL4= 120
##$ABSF1= 14.98509
##$ABSF2= -5.573092
##$ABSG= 5
##$ABSL= 3
##$ALPHA= 0
##$AQORDER= 0
##$ASSFAC= 0
##$ASSFACI= 0
##$ASSFACX= 0
##$ASSWID= 0
##$AUNMP= <proc_prof1d_extract_pilot.lims>
##$AXLEFT= 0
##$AXNAME= <>
##$AXNUC= <1H>
##$AXRIGHT= 0
##$AXTYPE= 0
##$AXUNIT= <>
##$AZFE= 0.1
##$AZFW= 0.1
##$BCFW= 0
##$BC_mod= 0
##$BYTORDP= 0
##$COROFFS= 0
##$CY= 15
##$DATMOD= 1
##$DC= 0
##$DFILT= <>
##$DTYPP= 0
##$F1P= 0
##$F2P= 0
##$FCOR= 0.5
##$FTSIZE= 32768
##$FT_mod= 6
##$GAMMA= 0
##$GB= 0
##$INTBC= 1
##$INTSCL= 1
##$ISEN= 128
##$LB= 0
##$LEV0= 0
##$LPBIN= 0
##$MAXI= 10000
##$MC2= 0
##$MEAN= 0
##$ME_mod= 0
##$MI= 0
##$NCOEF= 0
##$NC_proc= -8
##$NLEV= 6
##$NOISF1= 0
##$NOISF2= 0
##$NSP= 0
##$NTH_PI= 0
##$NZP= 0
##$OFFSET= 14.98509
##$PC= 1
##$PHC0= 99.31091
##$PHC1= 0
##$PH_mod= 1
##$PKNL= yes
##$PPARMOD= 0
##$PPDIAG= 0
##$PPIPTYP= 0
##$PPMPNUM= 2147483647
##$PPRESOL= 1
##$PSCAL= 4
##$PSIGN= 0
##$PYNMP= <proc.py>
##$REVERSE= no
##$SF= 400.02
##$SI= 32768
##$SIGF1= 0
##$SIGF2= 0
##$SINO= 400
##$SIOLD= 32768
##$SPECTYP= <>
##$SREGLST= <1H.CDCl3>
##$SSB= 0
##$STSI= 32768
##$STSR= 0
##$SW_p= 8223.68421052631
##$SYMM= 0
##$S_DEV= 0
##$TDeff= 65536
##$TDoff= 0
##$TI= <>
##$TILT= no
##$TM1= 0
##$TM2= 0
##$TOPLEV= 0
##$USERP1= <user>
##$USERP2= <user>
##$USERP3= <user>
##$USERP4= <user>
##$USERP5= <user>
##$WDW= 1
##$XDIM= 32768
##$YMAX_p= 456960735
##$YMIN_p= -805865
##$CURPLOT= <Network HP LaserJet P1505>
##$CURPRIN= <$Network HP LaserJet P1505>
##$DFORMAT= <normdp>
##$LAYOUT= <+/1D_H.xwp>
##$LFORMAT= <normlp>
##$PFORMAT= <normpl>
##$SURQMSG= 1
$$ End of Bruker specific parameters
$$ ---------------------------------
##NTUPLES= NMR SPECTRUM
##VAR_NAME=  FREQUENCY,     SPECTRUM/REAL,   SPECTRUM/IMAG
##SYMBOL=    X,             R,               I
##VAR_TYPE=  INDEPENDENT,   DEPENDENT,       DEPENDENT
##VAR_FORM=  AFFN,          ASDF,            ASDF
##VAR_DIM=   32768,         32768,           32768
##UNITS=     HZ,            ARBITRARY UNITS, ARBITRARY UNITS
##FACTOR=    0.250966925370066, 1,           1
##FIRST=     8223.43324360094, -130407,      -1156
##LAST=      0,             -109484,         19952
##MIN=       0,             -805865,         0
##MAX=       8223.43324360094, 456960735,    0
$$ Real data points
##PAGE= N=1
##DATA TABLE= (X++(R..R)), XYDATA
$$ [...]
23865 -186197 -237706 109753 385519 -12430 -191838 36297 258730 88149 100560 75560 29876
23853 -69264 -149491 -40035 240477 -124398 150649 124433 -19636 -138252 -63543 -62017 -16291
23841 30550 -19127 159101 277755 42228 -229292 -334646 -179513 -77673 129735 -86713
23830 -85578 -157104 -132668 -391706 109621 71772 148606 295594 -200454 -104161 -284930 123144
23818 153296 -149515 -222683 69540 -195227 -201330 -19087 68908 -55771 -41921 152382 319394
23807 319394 43123 -184003 346270 -99104 71507 -174758 20677 -34047 -30372 -274040 -209459
23796 -209459 -247612 -104981 48465 -182982 -69370 60324 -70205 306252 325025 -86910 -133946
23785 -133946 -127773 -274355 -268851 -404834 36649 -35786 -330797 262023 -44020 -154322 -92539
23774 -92539 280285 130275 34528 -159400 -207532 -49316 -52723 205269 14490 8328 -239281
23762 -223907 49580 82505 -144526 124615 84347 189998 31320 -230979 -5982 -21348 -273461
23751 -273461 286527 -83512 -152596 -111811 -41114 -10219 -17970 307358 -288061 -290307 -77282
23739 179237 253867 189998 220215 -234877 -59654 329320 -242 250000 -226580 43773 412018
23728 412018 90815 -27572 -158948 229673 183426 -104910 43357 187953 169854 -25152 162887
23716 -18408 176775 -44910 195047 -34379 -260327 -17325 267172 254891 -134649 143952
23705 -137698 -61572 -263721 158189 55869 22603 -152659 -278457 -57367 -259151 20820
23694 147293 189278 114982 -159961 -79202 176541 49185 91728 -74132 -129457 129107 -66340
23682 -255665 68636 -377189 24380 -191178 223281 106522 208237 -142291 53878 -57806
23671 157855 -27223 -55110 119467 -38916 192447 3775 77301 -174948 -230182 -152671 102392
23659 -249965 -89360 116655 240056 133258 64502 213137 254680 24355 -313245 -88673
23648 -134622 -22063 -87119 100730 -209547 -23733 9180 -40961 39816 184112 5436 33144
23637 33144 1206 123964 -189643 -32792 367581 251101 39137 -26807 55197 -92968 31344
23625 139832 -186940 -360874 -152183 302627 88029 -114274 118667 82598 -31785 301491
23614 -141794 32772 101933 -190855 26871 -152408 -163018 -93602 -100713 68050 48641 -23249
23602 -123917 -232562 -483433 -131383 72743 -75333 -26363 -90323 38296 126327 -376832 67598
23590 -98360 100517 206447 -142520 -327395 55456 255385 25899 -186229 -59819 328858
23579 32932 -38494 -382944 63913 151712 -165472 -93398 139277 2694 391762 -124525 -89687
23568 -89687 185595 -39124 -329272 890 -73297 108378 147866 -5038 69902 219929 -55270
23556 -154534 -47309 221438 -24074 49760 -145138 -179665 -214277 203973 -66252 33612 -65399
23544 -174683 -42033 -319061 -68301 3381 74279 -154770 410421 -40369 -94154 -244431 292491
23532 65257 160417 84429 33504 -244091 92652 -87694 -104603 -234895 215133 -180471 -356055
23521 -356055 309782 140725 -181743 -268979 84075 -49402 125703 -170301 25776 84169
23511 84169 -135012 -157367 -266239 -468203 -367988 109204 24858 18736 -189359 -19149 -16225
23500 -16225 -234350 36150 -68359 -116507 -44660 -330729 -152263 -133079 -87890 -8180 -5560
23489 -5560 -85591 -337351 120100 141209 39926 -172225 -87450 122487 -315868 -75688 -37798
23477 169665 -253911 -91 177091 101832 208246 427249 -228793 -131811 -155524 21060 -149964
23465 148862 11412 -175446 -344671 193063 235836 -48857 91532 92809 -422522 165063 34084
23453 176593 -26894 -85458 -280303 -64260 -123553 -346763 -144644 30769 -72640 -87048 -117118
23442 -117118 -79271 13997 -202336 -37287 -54555 -142299 133168 161107 515641 -20042 -140155
23431 -140155 149424 -164089 16344 138444 138435 -185937 -429234 -21674 -110100 -201340 145438
23419 213545 -98385 64907 -186413 85298 -36795 -128952 -331111 -101810 -76601 71608 29253
23407 94348 -236428 77366 621 -343588 318614 71548 -117116 -29383 -124702 296086 151423
23396 151423 -24505 -58577 201016 -125128 494592 -8073 -168414 233127 -265386 18595
23385 20399 -70022 138389 -28637 66254 -107523 -91554 162531 2966 -232376 -235075 -93742
23373 55177 -122732 67044 5899 -5488 40245 -106390 -170043 162058 -91348 -180827 124269
23361 67202 -228941 197367 12373 18038 -148866 521535 157244 -212550 -128809 137469
23350 184247 -127364 208654 -86745 -157660 147334 -1154 268802 -36962 4096 47820 94294
23339 94294 -27663 174682 30532 -32569 -281385 -219327 120515 330542 -69365 -76318 -132402
23328 -132402 -317182 -4457 276624 -59401 29129 -48926 -135220 -213187 173533 144407 -217120
23316 37403 -110516 2714 237742 53232 -206313 28610 -32260 325055 -271885 -177660 -93518
23305 -93518 -301314 -57312 234202 -180704 -320222 -127960 -58118 71228 74214 244656 -44985
23293 282944 -36306 -8548 48914 -12377 -228799 -416163 -62321 94967 36917 41296 -275854
23281 63486 -344373 205809 244058 -97421 122375 -186249 110859 147512 -130334 278161
23270 -71317 210412 -72511 -93945 -89214 163875 -23626 -153211 41705 -193247 168484 90265
23259 90265 69230 -37107 72944 143879 8816 208202 27466 -77635 139414 5944 54173 -211513
23246 -38725 -147408 66189 41743 -3329 -156161 -104432 139364 157497 -81944 -116073 -81699
23235 -81699 -114766 321195 -106429 -11749 97244 -194028 38166 37354 163482 -251304 -300508
23224 -300508 16306 -26877 79799 -7320 -283506 207487 6826 -253955 175685 234634 -185019
23212 -144259 -39773 116119 -150616 227592 -51932 -51560 92667 -235715 69550 -148854 240334
23200 -231701 -328662 81420 -3163 -1595 42336 -21850 -159948 214323 -207034 -247971 191696
23188 -7476 112227 -211590 -63991 363978 -44772 -12949 -230046 22677 74228 -86650 -107680
23177 -107680 -52469 26483 160384 -44485 16704 -132159 105968 124967 -89551 42247 264
23165 141206 268242 -74190 -155506 -70415 -112547 -142785 -104319 -236891 -354268 35855 -53019
23153 16609 -147249 -60924 -67618 314737 27283 352670 -195816 -150720 139280 -307995 -133683
23141 -21039 -298531 -148436 18982 -132061 47331 17394 -453177 -320328 154071 -108524
23130 856 278475 189712 -54351 3409 436176 65931 -3578 -40620 283900 43110 183439 -114642
23117 204467 205195 -579 -44898 40733 -387 -355833 162885 27571 -26217 -332503 148321 -98234
23104 114172 -45613 -31769 166420 38639 70143 82121 -125838 298269 194354 268911 13056
23092 -138780 21290 -84512 -341127 94526 -33118 -45000 -31555 -32489 158044 79836 -40790
23080 54231 477821 -87738 -89622 -8286 -5664 57996 -10335 -64967 32959 163380 58703 -291996
23067 213162 85889 -19094 13680 -270794 281798 -100849 -195790 71276 -25756 93671 -289272
23055 -143387 -171677 140296 54974 11449 -56797 20486 32657 -7336 156156 239473 149790
23044 149790 223364 -46605 -171733 265188 -120378 93090 -222468 157245 107504 -57551
23033 -79752 62297 -12449 -494384 -134983 135760 -321598 149640 -8958 -62626 -56943 -144685
23022 -144685 273108 23184 137194 112211 -180173 -43156 -88771 -24493 95719 -46966 284798
23010 1069 354714 219029 107519 93623 162912 -155672 168902 53492 225461 48877 157581
22999 157581 -211603 -183195 4075 -70706 -444722 71891 -385432 266623 155845 82543 95930
22988 95930 55372 -61232 -176120 246428 -37933 -140473 151348 146717 -28938 -206827 42200
22976 -52099 -104329 -41495 64128 -195984 -240617 312284 119750 101515 323651 -25105 -215274
22965 -215274 182279 81364 -140872 -39234 21938 -256736 335544 -109888 20921 -137669
22954 56075 -335794 302280 41062 -346104 -232954 266832 -412170 64336 -16517 -152248
22944 -152248 229997 -341493 256478 285985 -61951 -171976 -308833 56592 41026 -99307
22933 130571 -306179 -219497 -48214 -187098 -76450 -212972 144411 -195957 -30419 -208826
22923 -208826 -70916 -97977 -359241 71706 224957 -348866 -145942 131420 -136335 -201762
22913 -201762 -186886 -165561 -36669 -20436 -78359 -74996 -83624 -266440 492125 -75063 305436
22901 122542 42238 -142815 425458 -13041 -238392 -23286 -135576 -112646 63442 108104 -159961
22889 -445473 -185202 21323 -2906 -48800 123013 -416697 195128 205523 -201080 107577
22878 -182363 -203507 160828 -185257 -8176 111218 -148623 -156926 -6967 -236047 45538 -130273
22866 -337303 -88137 -70096 193007 -106212 80559 254183 -195134 -3678 257570 248350 -165738
22854 -128864 14039 68875 54219 -91506 -11752 45411 -70404 7277 25860 -28735 -33923 121895
22841 -81902 -248022 -131828 23758 150032 -1713 -147636 -91876 -141500 53353 -77084 -117330
22830 -117330 -86896 -385709 -177256 26929 17271 339760 -136997 -209495 -103634 -53673 65026
22818 150027 -89984 328970 -33046 161722 -90195 308098 294539 -158087 221708 -76517
22807 -106701 -65597 125469 123123 -81352 -66938 -139874 40789 8400 -274704 -300965 294193
22795 -104655 9028 -101447 -17918 112566 169289 -103753 -16751 102389 -211774 -232960 16546
22783 -8625 37262 -256396 150453 -159926 -229944 -63829 -117724 19595 104170 -180032 159068
22771 56155 119601 134100 360253 -128659 -462628 -47379 -147852 -84835 72412 10916 -42366
22759 -158245 110016 -316999 152794 -43734 316239 -22118 161251 -352348 23491 60643
22749 60643 -5617 275798 -334772 60006 12809 39504 -319004 -113611 8496 -51142 258539
22737 -30188 285023 -348134 -23032 284669 -200794 211612 -129162 -34117 102273 342982
22727 342982 -61090 80044 -51279 -32183 -171830 181064 -202256 -243468 -104344 -157776 69202
22715 -146877 420505 -211757 -274395 135615 91922 -47389 881 -83449 -70005 -16504 -18551
22704 -18551 -48567 69806 32635 57074 -233888 -270517 -255725 -227993 5959 6390 47332 -208202
22691 21786 174474 2320 -34904 -205750 39770 -147627 102798 100874 -13727 119515 96936
22680 96936 78206 138430 24801 -231289 92112 -228159 -65356 -47061 35945 67406 -392194
22668 25426 -153854 225037 216769 42093 -106158 -95333 -77409 -15671 -165641 -187150 -284913
22657 -284913 173849 216379 278606 78463 -63054 48687 -102145 -284787 131279 -136786
22646 -1301 -89547 -146714 62732 277469 -41803 -370464 158307 -1624 -22105 95421 -363880
22634 -105693 87236 213588 34706 -331165 134324 -54942 -171716 51381 -6686 -77786 256222
22622 -86798 -70983 -176146 70687 8646 -84960 -28022 4370 176391 -343656 17013 -163179
22610 19516 -178270 -112043 -72461 25072 62868 35585 -143504 215806 -212947 107342 -197299
22598 51294 9964 -257285 -75147 -124287 -40572 95233 11492 166797 45031 -49467 -25987
22587 -25987 -163759 -153488 49601 7108 -170819 146843 -18337 -288399 234424 -150869 303393
22575 322067 -42834 -72888 -317875 -60232 -88308 158487 55792 172659 -240344 132938
22564 100420 195729 -4244 14111 202800 -99995 -11043 -222892 -78781 -334060 -23761 -13380
22553 -13380 -275947 -52419 -35026 -40704 206464 -21023 161686 366076 -295667 42402 40759
22542 40759 66051 55534 -163410 158905 95440 217640 -154348 -22898 120459 61497 -416474
22530 -402519 -48814 233168 -81834 -371328 -148570 164965 6403 186649 -153175 -58955
22519 -7202 -52496 101285 -112977 -140758 2575 65633 -44654 93922 23037 294328 -5226 49316
22506 -136163 -144278 81894 82867 106288 -155866 113827 -74055 -261193 -26714 102499 162817
22495 162817 7576 240830 -57305 -35940 -130008 -25592 -31003 233501 -179649 -101069 334956
22483 -72682 76256 -167016 193587 -85936 137142 217351 -169385 56461 -231230 -262844 21934
22471 699 -169077 -49060 12597 -87817 -255774 -21744 -94956 -74786 -106045 -143663 -20637 -368479
22459 -368479 107298 -196166 -288333 140164 -12384 127596 19911 283225 44250 -211249
22448 -249172 -241748 -427911 459604 215866 -34336 -250506 22385 -192518 190134 -282094
22437 -290476 -49350 17218 160795 51246 258247 30821 17900 -60693 307004 42647 -144154
22425 54306 -94098 76467 -208110 298860 -37489 90076 168684 49364 418580 -216085 -51400
22413 -271138 -315537 -169516 -506045 291388 -16649 -48363 242206 -201994 282230 -106118
22402 -114090 176840 -29704 49397 -143358 76369 -109928 159763 -41862 24618 -59257 161964
22390 -94747 -67946 -114075 -181074 47601 -241009 -7507 136089 96607 52277 26942 -167780
22378 248033 -32568 -222308 -165467 -45705 170780 -45936 -159611 -301399 -357865 -5870 -311554
22367 -311554 107184 -354664 -219006 -35186 -85736 -103155 -221711 193540 -254697 34168
22356 -40001 -136156 135170 -60707 257722 -20011 79758 -84725 -350666 -276134 47836 -224893
22344 -26739 -110496 -42441 -23261 -130626 -52271 56065 11961 181558 -129689 -24375 110235
22332 228776 105985 292314 -190005 -73825 232942 151314 -106792 91149 320836 -18474
22321 -45173 -151361 -108923 -201039 232619 -100553 204457 -50820 -113124 -277715 -156939
22311 -156939 74319 157121 -109762 -60398 133379 -331629 -64767 -87343 90281 -196433 106831
22299 72210 106878 41987 -155146 55174 -314258 -68922 93413 -79755 160883 3367 161700
22288 161700 -153633 -129575 -5088 67226 -268221 -220653 17495 -64332 58866 -13329 -188858
22277 -188858 -156775 255057 -11587 41396 34844 93444 206172 -114676 -13663 74980 -120739
22265 -104331 -6037 -159520 44038 79737 -184583 132544 50986 22556 -4398 255762 132248
22254 132248 134907 -77967 51415 325876 65721 -8597 -41192 7451 -18918 64650 -177266 -80940
22241 1868 157103 173908 151003 49323 -75123 -299248 -68416 115830 -55167 -253718 -20750
22229 69974 19532 157571 -43314 -202830 -131918 -6604 135857 -97691 -203178 -200322 -130369
22218 -130369 53375 110867 48405 55728 -47873 -53436 -230392 -71805 -117377 32225 17358 -23954
22205 -175788 -274246 17795 28586 -80484 -150591 -173835 93545 148237 142165 -130281 -125000 184069
22192 -160293 46616 -138974 -290251 33898 -227497 343818 -131154 -124638 -230025 365550
22181 -152547 83127 -305027 216911 312454 -17871 -130974 -390827 59141 -280748 41735
22170 -97764 246210 73259 -284528 -124164 -137391 77672 12100 -152658 244366 -502193
22159 -82821 -153143 -336034 212992 31893 -142339 -273304 -77980 -113919 70864 301923 180085
22148 180085 -457996 99473 -114659 -41671 -259431 29857 -24491 -85456 -41236 307899 111174
22136 40699 -8801 101698 318398 -149470 -101860 -256080 -264327 -84102 -43585 263036 -53771
22124 -50151 -357065 -3961 -219538 89966 -23305 -38891 209655 -186481 -310064 64271 90580
22113 90580 59094 25906 165564 498441 -90013 -179151 -260581 -103708 -118107 30200 -231297
22101 -74142 -30419 77355 -66863 -87566 39825 235494 218872 3883 -35661 271576 100388
22089 -237904 52528 -83414 63355 58760 -63561 -191599 28510 80297 -138776 -158851 75504
22077 128513 55062 -82624 -262008 -147002 237004 -120952 59030 -165881 -39202 -9403 -497278
22066 -497278 -276340 86732 -66948 54643 140285 9823 -243466 -111332 -255158 4627 72738
22055 72738 76103 138808 141734 117966 16744 -241626 -112625 -161415 137244 38259 -231298
22043 -116701 105636 111260 -79826 -70089 -228298 182468 82243 -140691 -211878 -41334 -6836
22031 50204 -424144 -305166 -54173 -208120 173381 -396008 -37302 -172416 -121247 -146531
22021 -146531 -309078 124211 -676128 -146832 -31567 -77765 -187300 85047 19621 26901 -89770
22009 26676 152426 55313 134312 -90238 -51199 -282906 71947 -69083 227817 28586 -320682
21997 212917 168079 174002 -32419 129225 170547 -33388 -55457 -219110 137118 522075 -131311
21985 33605 -112390 -180481 -171618 -16886 -114505 231641 -155770 -228780 -188480 247668 -160797
21973 -240658 115103 92908 181548 -88077 73512 -18868 296088 -51122 197202 273094 -307673
21961 47881 -437331 124790 -79534 -177156 -323879 -41840 -59981 -146899 -154399 -71524 232549
21949 -29231 -100345 -41944 -173408 123403 157779 83529 -86903 229793 -179870 -21178 -300475
21938 -300475 -167577 153487 -480936 114278 -16572 19156 -102157 222265 -303874 -195280
21928 -195280 -281908 -231722 93610 -190711 127427 -164877 59640 -164616 117949 -214133
21917 91000 75529 -274852 13740 -1502 -79675 108234 -194727 -147314 -217220 245673 59972
21905 -320854 -219039 334713 -49113 -46726 38544 -90706 -51192 209717 49051 166554 -121407
21893 13593 216489 -107509 -84973 139943 -259764 -198623 95753 19297 -86747 5197 -311256
21881 232794 6566 -437735 -181586 110215 276084 -129899 -115901 -54936 -94135 -251173
21871 -251173 359659 226052 122018 -101229 207642 142267 102722 -254017 -97271 116354
21860 -210181 281427 20734 72981 -296501 245433 -79707 -120409 -74931 109019 -129860
21849 -147457 -2811 -430828 -129638 110830 -111806 -192777 -186102 -10112 -393817 -221175 130904
21837 59297 50269 -147899 25627 -66114 -82411 -74105 193126 1459 -39327 -109207 -221954 -122014
21825 -122014 343318 332958 -9245 76583 -57931 -237505 378154 -168900 118676 -202159
21814 -343321 239790 -95712 -321693 -16627 -165534 -2566 -50364 197934 -218184 21384 67718
21803 67718 5123 -212523 21029 90501 122103 -210468 181055 -310993 -5929 -174074 116725
21791 4209 -146680 50307 -269336 4849 -281538 -193064 -14968 227635 -160797 -410742 -82350
21779 362667 -78912 -14172 124743 -131581 -118372 58568 -43688 17892 -392982 34761 118037
21768 118037 116606 -85668 39864 119063 61009 51479 -158373 73967 133234 179234 -1781 -137177
21756 -137177 1843 249408 -79112 111125 118044 -212956 -63570 29449 38131 217753 30973
21744 104642 46791 -57860 1598 -31082 -33493 279076 16884 -139325 -159499 -18182 -21672 -296912
21732 -296912 83781 -213555 -161435 133041 -298385 -235064 88274 -47767 14207 -410322 -62423
21720 -220246 76082 97264 -62678 -29512 -104605 -19745 14180 -27774 192486 59283 71387
21709 71387 -89200 38487 -172948 -28160 -97622 -226291 -114529 -195884 -47425 -32088 291737
21697 666 113840 -123113 -329214 -15189 44591 -18146 67470 -269014 -31603 -109564 -162894
21686 -162894 -142172 -317173 -139069 91567 56056 -395876 -70847 74733 -307892 65442 -185340
21674 -152823 366072 -197167 -97019 -26077 -69845 -110034 -288367 -36102 54271 109136 59582
21663 59582 -272208 -21118 -226427 -138933 -38837 3006 167263 -298378 -170935 34363 -32134
21651 90067 -235278 -185433 -72160 48117 -65628 255481 97620 12622 -178924 -161627 138067
21639 -228349 188190 -84317 -143613 101678 -68360 254114 -108298 -105704 121289 -33136 -55988
21628 -55988 -201419 -268825 102706 -129986 66172 -210262 224560 48941 -306953 80327
21617 -97880 -66159 -55097 -12746 -50615 -40049 -46379 -55172 75974 65164 -118128 70808 -214327
21604 146620 -271058 -201055 -191516 -57508 -89564 99462 -176972 152474 -141350 -277155 -373787
21593 -373787 -165224 -157276 8318 -266955 -291007 -116359 -51937 165889 237401 -315747 310688
21581 -109711 -65451 -9564 -582309 -75810 -27225 -116862 -75067 -277730 5195 -20807 339374
21569 -188212 6117 -4584 40765 95427 142191 43308 101464 -212188 -127409 6215 -264240 -198765
21557 -198765 -192337 41153 146279 -117594 -261777 -4276 -238864 69549 431086 -208668 131339
21545 -197470 51084 -52231 284509 74440 159658 -65525 -178332 -28772 -103763 236885 -301586
21533 -101682 -172165 200244 -240415 181334 75662 65860 114804 81358 -162693 180290 126418
21522 126418 40785 -545363 -82583 -208609 -111961 35771 50066 117669 -152209 -164868 2892
21510 -101069 114153 -112220 59774 -212405 -26709 -51584 -280715 -66966 6594 -142917 -92265
21499 -92265 -34273 -283367 97607 47415 90862 167335 121326 137158 48807 66968 70032 -53546
21486 -98181 114162 -16618 149130 21436 -347879 -153680 169646 -101005 67590 141371
21476 141371 -14935 -80666 -381742 -152927 -168850 -168861 199739 -195565 -282875 -101558 55623
21464 31840 -144100 -253517 -241454 -396901 -198342 -39769 -154949 -130720 -5854 -176839 -286634
21453 -286634 106642 -259886 -100320 83135 -70614 -171781 -92698 -159983 139961 166727
21443 166727 129751 83303 28262 310048 -60208 328750 40729 541559 484927 420058 -117249
21431 103478 236793 -87445 -99844 -114861 51773 -332315 40624 164618 -22852 -141194 -134442
21420 -134442 41539 -280 -93985 -64350 -65822 -54500 77905 -114895 -768 57126 29546 -70081
21407 -302836 -369509 -45861 -166801 -178849 157096 109985 183634 40297 -93154 -140520 99178
21395 -163343 -43180 -85742 -46523 192534 -431567 -211941 -227434 121091 -67851 -139983 -393589
21384 -393589 140416 16272 -133581 -400771 -107073 94341 -268206 140821 -30312 -149477
21374 -149477 -38760 181441 57634 50258 153721 -356556 202576 -320722 -368632 163275
21363 -139480 -80690 87766 130 -118768 -46008 -28733 164850 -13681 56619 38127 54439
21352 54439 -75169 -96417 -202262 -63428 -268480 -63724 -99498 -331385 -129641 -141634 324548
21340 -150536 -177549 -534401 -147875 -221222 238616 -112427 1437 81162 -404706 248416
21329 -63307 -278834 141529 -251114 -308492 144528 -238255 126331 162272 -151397 -23547
21318 -114070 -147755 107063 -56157 97905 210445 83690 99669 -292443 -28967 185204 -44412
21306 -25053 -105355 12304 -166912 -30311 132678 129043 -256733 48399 -228351 10343 -262490
21294 -353213 -33741 -159232 -147175 39018 -321813 -61146 -187023 61738 -23116 -19965 100702
21282 -294855 -219919 5114 282230 157326 -280885 56455 -118376 -258903 37752 -401693
21271 -90501 90920 -157873 167990 -270557 -75400 -239656 -124494 36131 -86735 -54877 214682
21259 287309 -62986 7211 -370988 -145929 -68647 -208091 -170180 104788 -64513 190489 -101819
21247 154417 -436511 -295493 -6753 -99537 -139604 38326 -113364 -84703 -49583 -98913 -129515
21236 -129515 -118237 -109241 101108 -151086 -29545 -113443 -83936 -237894 147797 73102 212469
21225 212469 138259 -153911 6892 -274693 3673 -152672 38423 59822 -110255 -185455 -194312
21214 -194312 -203399 -59058 -25609 -139347 21088 155216 379906 -223289 -141494 191373 -462173
21202 -6972 -10898 -20491 59846 57242 109334 -217949 -25850 -305603 60480 221280 -283482 -35105
21189 -223205 -58268 -374683 -76794 29553 70797 97529 -69428 -214841 -453553 165892 -83033
21177 292166 -3829 -185783 47989 -148131 480235 118383 129157 -49696 -205279 386827
21166 -24197 141991 132322 285260 -110606 -8246 -258087 -214064 -188112 -199459 38776 -82760
21154 -61502 -257095 -87397 -79511 -31237 10902 183204 212877 -38000 -70484 62633 104764
21143 104764 -407675 -208503 -20780 -108976 369648 117903 -143165 -35294 183045 161206
21133 161206 -92010 -262822 -144765 -212770 -471007 -207865 114058 -420137 208797 164034
21123 164034 -359659 25374 62660 59837 -15392 -185111 -440957 -428186 -26417 331163 71169
21111 121844 197232 -48154 -316633 -4296 -268839 -64178 -302804 -247199 -203541 226569 -45198
21099 -95058 -74041 -253243 -81792 -177362 -125977 -33073 127259 -575485 71289 154339 7680
21087 46940 -202624 291935 19441 -178230 107286 -274857 294073 -109781 -381110 283743
21076 -58259 1214 281547 21992 -16136 -146465 170999 -144590 -116748 -130106 -295748 -244051
21065 -244051 -196481 -186124 262275 146984 316223 -353895 -29907 13799 -179739 -139778
21055 -139778 233702 -1296 208975 45970 -95371 -103123 13908 -147120 169787 83067 -59879
21043 -54670 -74462 -146263 -138626 1249 78025 -30050 -244278 40001 -150953 150581 104667
21032 104667 -234751 6140 83407 -24074 -129059 70976 173646 -164516 2441 83800 -28464
21020 -41143 87751 3887 -81950 -126626 126509 124203 -11033 57936 -299928 43506 50221 55660
21008 55660 70191 -175559 -49005 -428846 301354 -56124 277584 -357099 -4477 -93329 -253666
20997 -253666 -217944 -88603 108068 -76691 -14279 109218 -14777 25189 -120654 -103511 264733
20985 -276071 -79718 161330 -183443 165236 -150846 -37900 -98718 -26474 32525 139070
20975 139070 -474425 -22265 233371 -37515 -140789 -7249 -343260 193689 -344 32970 -203279
20963 240172 -51670 -164871 -173577 179664 2433 87971 -376565 -256815 -471517 79744 -311251
20951 -242998 -182358 84397 12050 42998 -86106 60140 42183 -192887 38475 123979 181000
20940 181000 122962 -177907 -76711 -44833 54225 55298 12504 -107671 -323503 -11254 -175779
20929 -175779 165641 181606 73906 -176335 -26095 -240787 -246558 85264 -336517 105144 -120859
20917 -235424 -170410 -122872 -16074 -327663 -146410 92513 -163229 -484619 -32280 230153
20906 -226775 113025 -165840 -156516 26479 -218483 123830 144676 -65688 -117079 181767 99202
20895 99202 -333352 340921 268797 131288 -96028 172882 9026 -61379 -245879 -109147 358659
20883 -97995 190070 -71762 40806 -91951 -53519 -248914 126249 -84491 -82749 -153125 21608
20871 -150148 133868 -127058 -179121 292652 -251211 -518837 -29063 -64743 -21972 100475
20860 -6763 -311176 -198676 -200288 -81784 109104 -42088 -155217 -29171 -3111 50748 102697
20849 102697 128642 -80665 -188214 16496 -16976 -277860 -6820 173116 253126 -261966 -100674
20837 251815 45828 -364025 54350 -194508 -174496 -92757 -116246 -233579 -110312 -316253
20827 -316253 14384 266496 -63388 257096 13148 -312080 -88910 30397 -222407 -157100 172592
20815 -91909 -214709 183973 142964 51392 16165 262548 -232029 26060 -272300 -42813 -17878
20803 88275 373558 -173653 -60888 110758 -373896 -344987 203877 -414904 73814 -334420
20792 -38696 -104710 61309 -293222 132311 -19033 -95012 50514 -189613 -190766 -3266 40497
20780 -205552 -114167 -57204 -155405 -102328 -160241 -172761 319962 -256674 -149763 311627 78335
20768 -28746 -118434 -12340 -2657 145396 12781 -317398 342829 22254 -482972 -56361 13851
20756 181597 -111823 -99814 -382221 -31907 -171779 49446 10240 -60645 -154090 107171 -33990
20744 9624 135599 -134485 -324309 -230562 81072 -19624 -24758 103000 -112537 -385271 -60275
20732 -186940 -198754 94824 -309196 -156000 122869 61774 -196199 -16348 -203844 388072
20721 56561 -186349 36123 257124 -92604 -180386 -159825 -162743 192160 66573 -648 121117
20709 -69492 321242 -207926 -160810 62624 -134732 180892 -75753 -238550 -111790 -259077
20699 -259077 -52203 69070 -167056 -74834 80529 -100224 -69259 -66027 -212485 -30723 24380
20687 -212232 96943 453406 198121 -167329 -173879 -292174 62593 60848 9298 -133807 37763
20675 -30659 108355 89496 -175656 328755 -190451 -222992 -84090 59798 1206 -8242 175982
20663 146642 -72727 -177052 -185245 -51870 273074 -190940 -43190 -204854 101538 -99290 -19976
20651 -114629 25106 -359316 -95792 20574 277333 10884 110944 -50428 -62297 -204519 -277240
20640 -277240 -425928 -117536 94738 -201264 20654 -39998 95275 157377 -37124 -328747 137932
20628 -174014 -79882 38167 -151826 29761 178441 294158 -164291 7583 17477 -38144 40668
20616 -251645 -247840 77992 -254046 104348 -280280 18516 55995 -317879 -117557 -192399 -76660
20604 -62649 -230012 -160844 -31487 -168838 -147513 -223944 -52830 200476 136240 2752 73438
20593 73438 -38044 48164 -81966 104834 -286578 -58868 18482 189375 208829 164496 252447
20582 252447 165810 -62927 -8203 3232 -234910 -76925 94179 46123 -41275 -200899 -258053
20571 -258053 -293453 45783 -30742 -2155 -34235 -246412 -294629 231640 -97642 -218671 -155216
20560 -155216 121332 -331272 -20701 422448 -128553 -105664 55500 -19466 -209946 100618
20549 180949 118870 -144387 -272389 -147185 58205 3205 168697 -43120 -35236 -38471 -12530
20537 -116971 -162784 -397551 -266028 -6024 237394 228646 -166578 140857 -70976 204266 -23272
20525 53664 -173053 -142358 -209771 -227489 -189695 -256237 -5824 29726 -42985 -48016 -348103 -141406
20512 -292140 -49862 -28123 -72002 68061 -339707 -56951 248574 42222 29219 -36587 -60936
20501 -60936 -59521 -131708 -158834 116531 191475 -164359 16910 -423715 73226 55825 -183109
20489 -220577 -66826 130979 181068 -94007 -136490 -322291 175486 -154486 -41033 -5768 -84070
20478 -84070 -238566 -109392 -259776 -125772 178190 -73884 -91527 -17934 -287771 -195605
20468 -195605 -288832 -359175 190213 -157438 216683 346047 -35098 27392 375700 230609
20458 230609 -108544 54147 -36107 -217218 -186250 -145204 217653 119523 379423 217863
20448 217863 -505068 100977 124275 1564 -108274 260437 -446615 -331594 4003 -157902
20437 -190832 213990 -57903 -84949 131201 61368 10494 283445 -149737 -233695 -217656 -15671
20425 111348 -121840 -374522 -144773 -56120 -53531 -381998 -172408 -185238 25694 5034 230310
20414 230310 77101 87564 13524 137962 -201286 -440852 -140225 155095 51542 -13335
20403 -204433 92813 188434 -113452 -250305 140357 -124902 -113755 72322 -62025 -128346 96928
20391 -18886 173785 82851 329071 -306641 -269289 -77422 80365 241043 -55033 -76483 -148670
20380 -148670 -140038 -39085 -90809 -59451 105411 55734 87289 -247438 -91731 -264540 -1710
20368 -76751 175430 -163845 -56096 -140177 189857 -148320 -279592 -186302 277102 -11813
20357 -55316 -321118 -204561 -73364 66785 -64421 -87254 -44185 -123578 -421799 2123 261942
20346 261942 -138218 92126 -162920 -447499 -428443 -555611 9034 -165543 -82424 -56658 135700
20334 226540 92049 421878 -124960 -125660 228272 52319 -175851 -538103 86914 68771 108471
20323 108471 85594 -47747 52117 155889 174700 -150887 -169051 -159046 -91444 -281836 -292975
20312 -292975 -28590 -114881 76476 -234087 86045 116618 -237404 25646 -109585 -464492 104973
20300 -4814 190618 -199468 -262533 -137053 318552 -44981 -5872 -84375 -31929 -316999 -122107
20288 114884 -90945 -173680 -441694 -78849 -224362 74199 135869 -76678 81615 -70956 125145
20276 40036 -55355 14763 213785 156210 96223 -135855 153038 -17936 -255774 -105638 -64616
20265 -64616 100803 -141840 5760 -103465 -13915 -139314 -175028 -85907 182321 200707 -121176
20253 -553668 -228179 -123054 310947 171408 -83675 -396376 -41843 -227666 131890 -109257
20242 19083 -48603 -19852 91687 15084 -249303 -186530 -353354 -387199 -449255 -87177 -17705
20230 138840 -187654 -55877 22868 -79319 -224478 97944 212157 -165944 -254021 -47017 -22492
20218 101273 -35652 76926 106104 -12608 -321952 -185608 -74050 -125364 -62468 -1733 -30165
20207 -30165 -403019 162157 -119537 -93086 54968 36006 -182233 39011 -106401 151396
20196 23848 116889 28941 169677 42149 -89445 16044 -95841 -60690 -16786 -152890 -359055
20185 -359055 -331411 -149105 10376 -188199 196876 -445273 -61475 117667 -142733 -57000
20174 -333001 41053 80789 -357369 -97303 -71281 -173467 -64004 -195883 -340372 -164661
20163 -77049 -135578 -338357 -128305 10476 96729 -56246 -112383 213844 110284 17060 200843
20152 200843 227215 -346040 -149270 188909 34826 -244268 -119018 -78732 -317936 23631
20141 -315097 -199109 97870 -354065 -134511 123882 384508 37414 154350 -104033 -26253
20130 348917 -47042 -17703 -208663 -57857 -32115 -171342 -251586 -84589 144737 299531 107491
20118 -224525 -193115 -83750 -2939 84691 -43938 -312971 -11761 -107555 -223273 110645 -208911
20106 -123090 102965 -229618 133311 -262871 -47168 -55365 -381508 15947 -283579 -109095
20095 79957 -53495 211807 268828 -383830 29144 24216 126621 103914 -47969 -20198 149367
20083 -234077 -264601 171677 -185449 118445 -369567 106498 61491 -24237 -117779 -114244 434857
20071 18388 -86132 -323397 -62944 -338539 -97029 186610 -96514 71421 101489 -42184 45136
20059 -111557 -210747 -4888 -240660 167658 70726 -91486 44768 -207946 175289 -95681 63839
20047 -112638 71370 -132567 73435 128699 -399593 51048 322243 -46863 -109714 -80006 -294063
20036 -294063 -182108 36840 -62300 -267035 -119531 -303543 -29459 16340 161347 -87558
20025 151665 36811 -31916 -208765 106343 87871 -49143 -155008 -208078 27073 -458927 -266132
20014 -266132 84803 -21619 109780 308780 25296 -24397 -18062 -108514 -236531 -22796 110317
20002 -73464 -45364 -52979 41637 -101454 -181394 -230648 -34118 -408436 -26202 94100 8088 23338
19990 23338 -138855 81640 -347293 -127576 114802 104877 200883 -41155 -335727 -108669 -150002
19979 -150002 87819 109671 -254875 -33848 305763 -115740 261633 166120 -20923 315983
19968 51128 -150893 351970 46301 285659 257698 44078 -70416 -338637 275307 -136762
19957 63967 -143286 27970 -48202 -124296 109431 -3350 -248036 -137343 -82491 214529 149419
19946 149419 -237450 83592 50002 -395748 64597 -357056 2845 -21712 246839 -193223 -79564
19934 170056 -213138 -166884 115716 -256097 -49100 -91247 -7561 70046 245285 56958 186208
19923 186208 -51976 -114163 -131525 147516 93704 -173024 -344312 -57224 -252829 -112130
19912 -211973 -162300 -291193 -293105 -122796 51641 -54795 347236 -84087 -189280 -75053 24409
19900 12467 -229200 123816 -59633 -294235 -155328 70063 152283 -155463 -175769 -77109 -11505
19888 -444109 -69105 -164236 -44331 -132038 63925 -17737 -397023 -10609 -172334 -74186 123498
19876 -353079 -102181 -102298 64492 -321531 -345968 -128031 401872 -147710 -88503 -157082 320545
19864 198299 -36692 -75426 -113889 -59729 -184007 -2727 1334 -2292 -204815 394490 -14647
19852 258635 -86535 72530 -96591 -125289 138863 184683 189144 145615 197534 -86012 242692
19840 -206860 -597109 -198089 228852 -28132 -179644 82605 -22603 -15960 -184706 -31999 -248921
19829 -248921 185848 -75911 -125930 32291 -4425 -131515 109382 67173 -191484 -66242 208791
19817 49819 -176948 94216 -135070 -194917 -357043 -324871 -113007 192956 351390 48197
19806 -195695 -147590 100555 -242835 -477518 104790 -17753 -103617 133838 -16394 43893
19795 -2425 -97704 -151658 56942 -138246 -93905 316035 -101059 50705 -171871 35454 -887
19783 -183205 -329751 -20334 -220074 -106911 8307 -197090 -256641 66061 -32457 92441 -23272
19771 -182353 316349 -334237 64556 -160715 75720 -156597 265068 268889 68614 -240488
19760 181701 -18696 -176720 10352 -90364 -73824 -396271 121729 -265394 163012 28014
19749 130456 -160812 187093 -33383 51411 112468 82638 -118201 -45187 101303 -108867
19738 67360 -223819 -12805 59492 66357 -167499 122705 -30896 -558329 -208766 108908 -110887
19726 -184084 -202059 122415 -77472 57695 33872 -153293 33268 -199004 -13842 74404 73524
19715 73524 -69833 54040 -453748 109291 -31273 -25590 2185 152484 89954 -225926 33031
19703 -200960 -50593 -48657 -369811 -38 -181487 -131779 -65038 -192309 -222 47984 -111954 -298398
19691 -298398 526 76944 91260 379792 -349395 -207665 63800 -65243 -101690 101280 -8706
19679 242510 32645 -13594 -40332 -107897 93655 170817 22354 -48555 19067 444 -88318 -58359
19667 -58359 -90906 48006 -48515 -137110 -70339 -151637 -168051 -149315 -175753 -62270 -259414
19656 -259414 -182184 -310156 29562 -156512 -83751 -297552 278547 -217331 -178788 126439
19645 -61001 -230430 108919 -156535 -18323 -121351 202869 -292661 101068 -32273 -175748
19635 -175748 -244991 -37720 -122556 -200235 -335323 -233755 -290595 56778 -160192 -151767 58889
19623 -84397 105510 -14456 -62692 60075 20078 -13556 82015 -202409 43541 -305368 -159990
19612 -159990 123413 -58824 26517 154565 -30846 -51296 -1146 270800 -54607 -220117 -221648
19601 -221648 61419 15490 -129636 94607 91735 244118 -9083 100254 288369 -98415 -238489
19590 -238489 51654 -116701 54832 -43877 -24880 109206 -184228 -292916 25942 61035 -165846
19578 -58795 -121163 -148898 67366 -5430 58709 265093 179399 31760 -71476 150710 -155284
19566 -66023 -70426 -42805 -108035 71839 -47915 27572 -336337 -203404 51455 -214527 -336891
19555 -336891 -227835 -39267 8893 -163858 -132285 17678 81 -57562 -136562 236393 12938 -31598
19542 -86445 -101079 158625 -39594 -236661 56512 -169267 -317259 -68205 -299624 -90588 -198151
19531 -198151 -211799 -57433 -144723 195175 129000 -388160 20699 198730 -251877 -60510 41212
19519 -163693 -265650 -112362 -38598 -150261 -233678 49822 312290 -114703 -44210 -4246 89308
19507 55507 -225222 87716 52315 -157494 -236706 -249452 -54520 103336 134843 2684 -21896
19495 -659347 141150 11453 320637 44392 -115029 60531 76771 -192540 91784 126954 123990
19484 123990 -255978 -198732 -311789 -177827 -19770 193599 5287 203101 -362006 -81601
19473 -121257 176021 -42745 -230745 -24350 -105272 -189757 -44227 -94289 -116966 24097 -161311
19461 -155570 100721 -91026 -50973 -27614 -126073 309654 38512 49478 22618 147696 44200
19449 102492 -167801 304011 -284327 -106454 -192058 -222209 -234822 39994 -176345 -260721
19439 -260721 -16843 18609 -62784 48961 -109458 -113583 271334 115023 -18638 -80381 -109755
19428 -109755 -107222 226988 -157383 147776 -176844 -59266 129839 -345023 184542 90800
19417 -66326 72495 86175 -126358 -34736 -18280 78414 77007 -99267 4226 -198982 -185205 265407
19404 -46459 -49459 -18818 24521 -79421 -151320 -43903 -151215 -63595 143810 -17621 -265483
19393 -265483 96560 -182467 -150030 531 -60565 -40267 -258582 34698 97372 -218641 -92699
19381 -239531 144765 101196 159017 188371 59850 161198 172512 259858 -41101 -107561 -160240
19370 -160240 116546 -206861 -151205 29241 -57039 655 64152 123778 59018 -68635 -28526
19358 162768 49237 133306 -140576 -219469 -111551 -227164 -348530 60968 107375 40565 73596
19347 73596 -75355 6557 -91118 -65274 -207497 136106 -463171 -133564 -169322 -143983 -204036
19336 -204036 -233724 -145293 -313572 -319738 -165319 2328 -125698 -52235 -78904 223059 29596
19324 66643 -52061 150118 -59748 -159307 286640 189178 42503 -42099 16012 153493 -189743
19312 -116101 -98178 96933 -15946 -103018 -193562 -301928 -85780 -63430 476578 -184942 -158154
19301 -158154 -97221 -50843 -257379 -63267 -46008 -52930 52577 300065 -297324 59965 -42084
19289 105814 -121473 -359043 -247696 -92393 -77536 -160266 121752 133829 10494 82482 -174416
19277 -219453 -201473 -295914 224119 -129191 -179246 74781 -291656 -110088 -104836 67337 40826
19266 40826 -301276 222572 159954 23879 -151043 -133170 -72265 180061 128129 -141776 -315988
19255 -315988 -34132 -200326 -21593 41831 -195544 192998 -106003 -194247 -32950 12374 96364
19244 96364 -228358 -131439 -5968 -90937 -229926 -155103 -16920 -327475 33192 -46445 -361290
19233 -361290 -158183 74200 -58070 -164427 -157515 110572 -157083 21067 59643 47007 -178063
19221 -69519 -334258 -46952 111181 72913 -262877 -80553 139228 -474630 35648 -232417
19210 -402547 -273224 -90229 -148998 177712 -252450 164577 -186548 -69191 -188660 286671
19199 -185979 -104728 -11144 -77281 1418 -155900 187926 65789 21972 -458002 69908 -143228
19187 94360 -33473 -81411 195260 255774 -370883 196175 169582 -97125 -126899 -107019 -139511
19176 -139511 65381 -196439 83249 77473 -220635 -59473 -236092 13829 -156257 -22240 -275344
19165 -275344 -29031 -10677 -191589 -36138 -134284 -130256 -88947 1158 -37113 -287328 -226236
19154 -226236 -44118 148259 -24895 23334 20720 -38246 222155 -86418 1029 255392 -111185
19142 -182373 -237247 31521 -102453 10194 7573 291247 -172696 -72420 -370687 70847 81400
19131 81400 -35989 58484 -334459 -45920 -103854 -66921 -136689 -410300 -163413 -108098 -226344
19120 -226344 -142433 -27027 -312535 -137561 49513 140395 88740 159530 -146445 201205 15912
19108 -4716 158232 -247317 -158656 181104 -86631 100294 105306 -155708 221600 7948 -146361
19096 -359881 22297 47993 134868 -128586 297860 178674 -231458 136293 157844 -142600
19085 -8966 -275 -101672 -266822 -26828 243335 -43610 -176794 167147 -132465 -203347 -10625
19073 -347302 7709 -70150 193799 -203741 -160848 -66349 -202003 -70603 17681 14226 -137860
19061 130049 -48016 -14022 191058 259958 65398 274042 -215477 30504 -190066 455052
19050 144594 -880 46563 -164501 -36257 102958 69677 -230609 -137824 210492 84896 314836
19039 314836 -21640 -150838 -70722 -151298 14504 -72475 -190428 102319 32689 147186 -222820
19027 38418 -31370 82872 39759 189579 -15260 225155 40488 -299732 69390 141440 57343
19015 -241477 -91585 -68867 93956 -228066 -55402 43877 12301 226609 -144638 -30889 -21071
19004 -21071 -115056 -161486 79187 -343864 -209335 44792 -119764 -103178 -177269 102557 199152
18993 199152 60782 -126180 -815 -184589 -125348 126516 -124967 -151185 -39496 191947 239163
18982 239163 -308935 107903 164368 83272 -390543 69506 -440741 -284512 -224763 -126514
18972 -126514 -105160 2630 -291418 197843 -26083 167919 -137947 62713 132895 -110923 -283324
18961 -283324 -94136 104290 -81719 158548 -90812 8239 131194 -157238 -117787 -278940 38398
18949 80868 -64960 167515 -155448 -63985 -26771 76053 -84463 -283582 -77561 -43429 -155515
18938 -155515 -53064 -17269 8857 -75659 -172725 -75394 -46251 -135312 -231350 -313527 -23857 166485
18925 -263901 -132338 12886 -113677 -264130 33777 -238915 -31795 -183388 -10363 -264328
18915 -264328 42490 -141328 -41144 237829 -64255 64331 270037 -315484 132218 -66446
18904 -89309 -112711 62392 255 265207 17432 -184584 -97235 41458 130889 459344 197474
18892 -3877 45008 -211792 -313906 -38532 -63679 -8015 -263060 10541 -50829 -125965 -48295
18880 113127 113762 -394886 223318 -148802 21551 -481756 -173731 334050 171810 -68963
18869 -253430 22597 -34993 110494 102166 371869 -96653 -67305 58393 118815 -156498 32614
18857 -107142 60817 -40231 127824 21209 -5610 -15180 -225923 171051 143812 -103149 -156575
18846 -156575 -75867 -367586 -6031 362947 -137278 -370172 195800 286125 -119727 -151393
18836 -151393 85075 -283697 3330 -192593 83895 15321 11121 20301 348589 -201969 64513
18824 -66891 -118240 25794 223297 125854 -61718 334132 -33089 -14263 280637 -154274 -13413
18812 -79968 145341 -98815 136507 364520 -206251 -266636 -68311 227316 207806 -102917
18801 680 -193064 -36155 -52834 -620 -155915 -316220 -160534 33231 -6291 -90222 -50535 -34454
18789 -34454 -246775 -222423 -18843 106941 42839 -14076 -292422 5565 -88773 107519 382660
18778 382660 175093 -137430 28456 -233800 -74133 -119371 -203770 -176185 -129105 -83389 204040
18766 62868 6013 -186081 112193 182049 146345 -246101 -84567 -476134 18094 -369308 209429
18754 -15578 -203480 -178159 -265566 39857 139464 -90895 -179911 -113625 -290483 4471 -188141
18742 -472663 918 -127005 -216628 -195194 -133186 -108585 -4428 102378 131242 -124738 -5197 140228
18729 -59469 -33744 -276967 -58285 107332 -180135 -245719 53602 -14786 -208376 -61695 50207
18717 -314101 20082 -97251 -72733 -394701 154820 -8939 232302 -186563 41035 135526 342479
18706 342479 -219190 286047 -24135 -26188 -123519 205658 66520 72364 -15708 -294738 -70466
18694 82952 -305695 -229672 62396 55670 -335185 55300 -105408 -91091 86438 -118731 -95391
18683 -95391 36036 -90746 -301040 -113796 -56341 -10601 22278 -72281 -143401 -276118 -40045
18671 -70859 -225083 -130862 -12880 -70156 -230984 205947 82753 202358 -178292 -51049 31563
18659 -223563 89086 -53142 93778 -134422 126965 1409 22117 292737 -186191 179963 -210502
18647 -299539 310747 -70538 -18408 61260 -177744 18891 -185845 -44550 -111216 -128273 -55036
18635 -147438 -106551 33228 -62859 40116 37042 -221970 -18794 -68766 -319663 45815 -168789
18623 23122 -356031 -109077 -325446 -202374 -330929 -267845 -26183 18228 82168 29765 -229901
18611 157979 -298555 63368 -437504 103376 -339267 -149369 99540 -56186 77140 -29495
18600 -80715 98516 -65472 -771 -140372 -81993 234363 -86470 -92143 -128848 119636 -87563 -71206
18588 -71206 283754 -67232 163083 55351 155139 44056 -81833 -135565 -42993 -314185 -87124
18576 -102064 -496233 -133307 -22904 -215564 79267 -61549 -201050 -55321 111554 231702
18566 231702 -84104 -122367 -176947 -468969 153979 -170366 -247733 235203 -26160 -129469
18556 -129469 -176546 87905 197369 -268549 -69281 -136311 9300 -214290 -317714 22552 -10729
18544 -213162 119256 -30463 51432 -34225 -183098 -166585 26797 42353 -181911 143160 272123
18533 272123 -19586 -265151 226079 -44030 -215931 -178555 -141690 -382018 -85617 -279556
18523 -279556 141301 -17339 7138 -57377 -109879 -133852 -178492 276496 43001 356934 -171995
18511 27924 -32012 349614 -94479 -176979 233279 160361 -135177 94122 102870 -53914 -94962
18500 -94962 -45262 13886 -162836 31148 -367679 -46370 291924 -124492 -80825 -77854 28090
18488 31861 29382 -130178 -147578 -155098 109497 -417372 125727 -30085 -207322 -247277 -82978
18476 93113 61877 209908 135239 -43617 31362 -143461 -144721 -136804 -166728 -213588 -90477 -124374
18464 -124374 225813 -74426 -179957 -222506 9745 -253283 -57157 116211 121251 -77605 -66997
18453 -66997 -119922 -37532 -54926 86987 104812 -266101 24248 -181878 -201861 -40491 -84033
18442 -84033 -389780 138934 -56500 224449 51052 155876 320649 -11345 58308 -30864 -92431
18431 -92431 132104 172668 -378534 -170850 -210145 -119217 -307971 -51723 30413 -200356 60023
18419 56170 -201678 -321496 -101439 100647 138790 124250 41259 52926 -208070 -45150 214462
18407 -88051 37649 -248469 237486 151479 74015 -99640 -204040 34570 244956 117872 -41456
18395 -97093 254988 86883 -295506 -324852 -469003 -114769 37013 163023 -80478 -15100 381705
18383 -2845 -77491 -16965 -44925 -228871 88051 -30076 -441977 -83137 97983 2139 76024 -255911
18370 206415 25675 163767 310673 -6199 -152236 93584 46771 113325 -279655 83138 116385
18359 116385 230239 -144197 -58657 -14185 222893 -15442 -95511 -54524 109628 -116920
18348 -21564 87904 146916 -530340 103383 56234 -22372 -24027 22479 116088 -125472 305925
18336 -182207 -3175 -232409 -189011 5501 -202307 91480 47057 17377 -256924 -184480 -515406
18325 -515406 5109 398 124074 83650 -168043 71573 -287112 262402 -213450 312635 -169440
18313 -303212 -7674 -220653 -56412 -317214 116305 -151153 -324960 -259502 54346 -185257
18302 126537 84536 40471 193900 72854 258694 -57987 41809 -165521 51355 -504735 124457
18290 71655 77844 47722 -103135 161654 -161127 -137391 -236559 -257661 -160475 173745 -180554
18278 -150352 62233 -230609 477 -43793 79143 -888 228050 -333374 316915 -135765 215463
18266 -207920 -145613 11530 92614 41624 9045 -13865 -225754 -175224 118720 218434 330379
18255 330379 -49694 -107547 5544 58883 -69880 -305201 -85099 24395 -335758 54766 96856
18244 96856 2955 -4286 25185 52112 -74559 -119585 395243 195121 -136521 -34295 -189142
18233 -189142 -56490 94140 212362 12252 60585 53830 -48320 -260639 98732 -200981 -45757
18221 -63502 -88605 241959 -95231 81407 -410528 -87041 -44194 -14094 -258494 -18154 51606
18209 -180114 -113138 -92330 -64853 -82776 398702 -219972 -357369 -139065 349412 -10840
18198 -48908 186687 -40701 413465 -203222 -285876 131469 185224 -419844 193791 -62160
18187 312540 261338 -182960 140580 -63795 124178 131941 106069 38472 -166052 -14971 -225707
18176 -225707 -160259 30767 -286590 142714 -21204 -36555 -43142 -108502 -43069 51671 -52354
18164 -101235 -121222 60343 -150549 65013 -37940 20248 15499 -11795 -168850 228967 28792
18152 36385 -334760 -25609 118427 -157437 -153789 -43218 -244373 96982 46025 -106101 -129391
18141 -129391 -183628 -37384 -118626 13798 -196834 83652 -8191 300482 -50672 172799 -311386
18129 124958 -146455 102231 -24200 109260 -17298 79845 -18546 -57351 -27763 -51288 -128634
18118 -128634 -186311 -131555 29991 -22099 74567 360143 -177299 -23386 -75789 52897 155557
18107 155557 -148376 -11887 -110494 -20555 412068 -77872 -309939 -143467 32785 72145 -161220
18095 -268070 6081 -30606 154974 31675 -18103 79939 -93551 -142192 18808 -193776 -111770
18084 -111770 -99596 2098 83211 -80027 69978 -13947 73917 49709 -132648 -203094 -75926
18072 -208837 -141171 -186402 -38003 -283561 -83976 -254896 -141546 -94172 -23567 -25297 -204848
18061 -204848 -51753 -21088 336696 -28153 47250 -330431 -210011 -18134 138924 50616 -99764
18049 5547 38831 330904 207431 200923 276074 187732 -62177 -289379 83176 -191922 44027
18037 -91944 166584 -283081 177582 -146760 117895 -125946 -202931 -55117 56284 -155791
18026 9872 -231992 190624 -127783 -19226 -170348 -81972 -144071 114752 -151314 139355
18015 110501 30737 -257171 86134 117333 157594 27640 -128180 120180 35579 289821 62432
18003 -150473 -352219 -115195 256258 104027 -16639 -79477 -71380 140443 177793 -229282
17992 -151733 -59808 330207 -168239 -53366 289386 10813 39767 -45946 6554 201472 14
17980 -136025 253178 108301 -19213 -228560 -110695 -366676 -266297 -129709 -30393 137780
17969 213626 137356 221067 175002 69076 66179 220782 229598 -17353 -95440 244938 88123
17957 -397905 -30996 -360623 -110511 94716 -108934 106577 -214289 -128082 -344931 3682
17946 18964 -145942 -320342 320395 56179 139954 -237399 244180 -9326 -368388 496090
17935 -355529 -139410 -226336 -141600 -92799 -84528 -353198 347741 23588 65817 -201247 -12995
17923 52435 -214609 194692 -199926 83038 -7021 105289 223805 140819 -38900 309517 -52087
17911 242096 172601 215373 167795 -74021 -293578 -84684 -280856 31534 -88901 102355 -226414
17899 -204947 -252842 22857 -104953 -251108 104734 -201488 -117400 -273207 -127415 294947
17888 -160974 150098 -8632 -212752 33675 284702 -26886 -67203 -59339 227543 -73287 -235967
17877 -235967 45466 -182076 316764 -134432 -46319 56838 12861 59244 37630 -109026 -228089
17866 -228089 74183 -57244 24939 -85859 75713 -141115 73333 89438 230661 -89077 25486
17854 254874 -286003 123769 135159 93365 114562 14111 -52418 -61194 308550 -131295 102971
17842 -18569 13799 201078 -209317 245957 -141879 163748 -194463 40439 -173090 122706
17831 -84096 -123132 -360215 120865 36749 2989 133541 -147660 30913 132016 125268 -343160
17819 -31355 -94970 137650 -44100 75347 67699 198925 -194442 289873 -12695 98415 -175633
17807 7277 211258 -250674 -134132 -150344 334770 92437 162802 -172592 -312674 -145342
17796 -193790 36772 297738 289741 283313 198540 -25245 180251 74718 5254 20397 177061
17785 177061 -132589 26605 -125853 -121924 -246663 46689 -43913 -142007 -151661 -42757 -205632
17774 -205632 186665 87030 -104094 4545 -122164 -36422 -206278 -212457 128715 -248543 34298
17762 209034 128791 97364 -204541 -143244 -26457 64995 90056 -400906 390738 -222502 -172762
17751 -172762 34793 -84069 197109 -54991 110414 -338411 33284 -68276 122197 -163636
17740 215482 -310581 -94686 196946 -31868 -20817 -71056 250455 81197 -175166 19065 229836
17729 229836 -538760 103958 -5982 -101506 -92994 -71991 -233251 86484 97712 279250 299922
17718 299922 -94418 41222 38587 222415 -5119 25763 12349 -23152 -171941 -152378 74877
17706 -227802 -130091 -185364 142383 -45260 -143775 -19170 -365250 211047 317415 94401 357502
17695 357502 19337 -147500 -234779 -77390 -300066 13683 57363 -205679 450180 -172993
17684 -302289 21656 -98478 -130007 -128905 -16189 23472 -199232 -122168 -37974 -73940 -88845
17673 -88845 24650 263073 -38 12199 245759 79587 68714 189456 153650 158016 21251 -68918
17660 82573 -181369 3960 264812 -286432 61914 -123069 -224325 -187065 77117 38600 5072
17648 71859 235384 -110880 270016 -96233 106306 138356 476939 55932 -8461 208519 124265
17637 124265 114327 369225 -138857 -84728 134276 -122376 56119 171512 -85289 71296 244225
17626 244225 98465 -68168 -204057 13929 -15477 136740 -165512 -3285 42383 276228 291209
17615 291209 -82562 101213 -220320 94481 25409 318221 -70207 214742 -59978 -154926 -101747
17604 -101747 104876 214917 99000 -196994 23639 -97498 71822 49492 18324 669 105324
17593 105324 -73597 73112 161934 -16941 28299 104298 5690 233684 71317 56269 -116042
17581 149055 -151194 114748 -34010 -46224 -154583 52579 -86082 -29150 -485085 41875 22515
17570 22515 49405 -262294 -28885 -114837 -424690 -34007 244847 218554 213979 323282 48447
17558 139508 28946 -40007 172211 -260063 -11086 -19674 57557 -136092 90818 123438 97938
17547 97938 216724 247205 210961 6087 8915 377892 309052 318977 251331 -12488 251354 -76836
17534 -1024 248858 442726 -4427 -12776 110577 -159257 -9405 271222 60422 -298103 103626
17522 71631 -143865 191546 31808 -11935 -30679 252404 -165878 54276 5722 -41444 -129051
17511 -129051 101022 -17447 -121503 -188448 174560 227363 50108 369145 197979 275137
17501 275137 31598 116606 297130 -84583 443482 100623 59547 61423 9897 115229 207194
17490 207194 584398 -88810 333092 236469 205397 70115 170600 288119 -30882 -113256 -159490
17479 -159490 203986 40805 183440 16936 130452 214622 221820 45739 598620 -391840 169922
17467 382179 -107973 212878 50756 254865 6039 -66300 65058 243979 -199889 5664 213164
17456 213164 351356 201774 108643 302689 269443 491678 142156 392207 379435 645248
17446 645248 79843 216961 160867 -9777 -351370 -44749 294912 174040 355549 447185 506201
17435 506201 207492 91525 434095 362937 56061 26121 271539 167743 404442 -38056
17424 148928 -43460 312776 439231 144317 234232 -55478 301613 55709 218761 225125 497821
17413 497821 432045 198137 213247 -27111 249845 -20170 113735 -78655 103441 126036 248397
17402 248397 13272 -69759 -124611 263637 135282 104398 -82453 229419 16857 -139204 531728
17390 92526 169810 182152 68746 551139 -12636 126007 385963 -59163 216953 94927 87413
17379 87413 78982 313695 -18162 35759 -2245 162819 -23124 138946 181689 136196 109281
17368 109281 281187 270695 -49911 -161777 41083 68150 18036 148326 -93257 -263187 135717
17356 108755 -25525 272181 -175812 263183 47546 244206 -48818 142246 246618 114896
17345 155524 387605 186517 203127 -182912 110158 -21310 431812 163304 208496 367640
17335 367640 75246 260453 -20490 986 -23720 220922 220799 6735 72447 186710 48220 354290
17323 354290 152671 246487 159119 -1452 72965 272744 182469 56913 39031 354434 9663
17311 -66863 69389 245016 427766 -97047 43095 171516 93596 12821 19361 62832 267638
17300 267638 174225 83417 178632 477039 272674 91728 -240667 -169430 8582 451798 270094
17289 270094 117479 295798 -284158 71906 279665 148938 -26190 181466 111282 171679
17279 171679 298006 170903 269327 352950 154992 -20583 431047 308966 161833 131190
17269 131190 231352 180616 132938 422586 181502 397705 43930 116175 23065 97480 356379
17258 356379 314389 485661 206868 224566 253444 177737 212238 408573 54538 -129816 74190
17246 173387 67937 -14836 -10620 208700 28159 165205 190398 88874 218327 106324 279308
17235 279308 256038 -38665 312270 189339 193860 222120 -65023 431265 142038 250855 114222
17223 258491 193383 178965 190707 16093 110569 327806 286693 161853 -111355 297845 221483
17212 221483 785 229070 456745 336157 285014 208047 203599 188788 277500 163692 267526
17201 267526 297824 112950 325205 190761 121780 197277 407843 304268 497417 476123
17191 476123 81005 345389 427083 363847 294705 124193 264967 451046 217152 274445
17181 274445 290430 357765 452235 248501 617097 587493 364180 348798 112666 36335 217491
17170 217491 327914 98858 443348 590203 137137 185410 303873 159415 528636 339400
17160 339400 410838 -6962 311800 482313 97760 279475 616242 169937 221137 796441
17150 796441 329285 269144 596619 472157 496064 410161 549254 255565 422946 181267
17139 274949 321980 198629 533740 111159 262224 -97925 103217 489494 361483 373589
17129 373589 500716 288713 312454 -3749 -145864 70784 333293 136125 476833 174257
17118 687949 369082 -42707 301783 662760 154396 342280 270645 221177 305445 243618
17108 243618 360756 517225 268656 284641 391979 416552 406553 468552 400120 151835 81344
17097 81344 448828 422216 351999 505147 471079 380782 375808 62564 123172 184083 351717
17086 351717 148001 368038 553854 723832 257104 151852 75625 435265 534786 280581
17076 280581 182080 412312 376863 532681 436854 479794 289709 579959 323254 452077
17066 452077 570814 504584 485613 395187 746523 552831 629198 551554 396413 544304
17056 544304 604093 526894 146881 519056 417608 476566 324689 462686 244973 605531
17046 605531 628308 803709 1122699 698785 395398 475412 416072 556997 688308 657148
17036 657148 434022 309097 543548 407316 690136 718448 191484 821439 621800 467475
17026 467475 695230 832265 574827 890545 912457 664224 560075 412578 652410 543457
17016 543457 665274 629021 601245 739707 328253 590747 679266 568475 693694 582631
17006 582631 775370 463789 932444 829946 780079 567843 796957 658522 775672 838641
16996 838641 456652 385835 799631 878642 593235 736463 846012 802021 854724 876708
16986 876708 626645 843571 810148 854931 908401 977512 831262 901139 800791 560487
16976 560487 836832 783241 946019 1031403 923549 918487 1187598 758731 779905 821978 653219
16965 653219 948347 1183075 953961 1021794 723191 1064399 892900 750780 881765 981010
16955 981010 1079457 1009934 1162496 1047427 1154363 946074 921318 1047614 1109279 1365761
16945 1365761 919750 1048473 1227067 1253787 1096687 1150447 1185409 1207286 1304710 1480534
16935 1480534 1386319 1341617 1307812 1598264 1332874 956586 1335582 1178797 1092336 1451821
16925 1451821 1244274 1599623 1564643 1553287 1587777 1210028 1314293 1157347 1334805 1242319
16915 1242319 1684829 1807582 1612810 1214217 1621032 1467603 1699881 1430411 1496981 1708896
16905 1708896 1415767 1606513 1586760 1818328 1771370 1790594 2077644 1511279 1553705 1716425
16895 1716425 1910630 2008626 2017180 2031221 2212751 2164159 1898464 1997116 2078897 1935216 1899114
16884 1899114 2096585 2202331 2164477 2256618 2076821 2057592 2283731 2106261 2190605 2334802
16874 2334802 2196041 2557045 2211006 2255725 2433780 2492567 2789013 2220203 2492506 2670946
16864 2670946 2818809 2270054 2599840 2759759 2614700 2717497 2864303 3019177 2984448 2975104
16854 2975104 2893875 3268930 3368907 3356566 3321729 3457284 3595845 3581167 3373794 3536343
16844 3536343 3589693 3398059 3736295 3826461 3924284 4106820 3862028 3958710 4351046 4250060
16834 4250060 4368969 4199969 4080952 4499053 4672952 4871466 4754666 4578925 4672790 4923056
16824 4923056 4938262 4788642 5497608 5525490 5634051 5572177 5940279 5756545 5803327 5972555
16814 5972555 6192559 6234797 6206838 6314700 6520803 6758093 6791729 6799083 6960129 7279623
16804 7279623 7200846 7497985 7707268 8374664 7974875 8210441 8710679 8964645 8930073 9080642
16794 9080642 9086231 9556952 9944547 10133215 10508601 10569440 11207918 11478979 11124510 12022908
16784 12022908 12637868 12457251 12772118 13248935 13789849 13777851 14442579 14851343 15400160
16775 15400160 16055497 16376835 16749747 17404133 18146687 18410850 19277780 20002078 21293594
16766 21293594 21438823 22329657 23002394 24130563 24919168 26068454 26908672 28136825 29060018
16757 29060018 30440190 31961424 33284482 34472769 36369110 37836810 39594614 41690263
16749 41690263 43793801 45700975 48497901 50838772 53316156 56386388 59342752 62462921
16741 62462921 65963646 69813304 74012454 78213965 82618622 87633617 92940627 98448163
16733 98448163 104012051 110499587 117030669 124071782 130974365 138346172 145446580 152298025
16725 152298025 159716958 166943380 173229214 179076520 184083727 188490224 191378098 193312526
16717 193312526 193876605 192692628 191264819 188036189 183878446 178879119 173136861 166602733
16709 166602733 159551833 152065716 144869240 137367251 130207776 123112435 116199882 109325294
16701 109325294 103269320 96920255 91595393 86158547 80934688 76549964 72169455 67888612
16693 67888612 64016349 60825518 57255131 54255604 51241967 48893239 45943487 43946040
16685 43946040 41750083 39487380 37910813 35877905 34594586 32866304 31434971 29936301
16677 29936301 28498913 27520095 26243985 25419449 24511062 23419462 22288230 21489377 20935845
16668 20935845 19950363 19323397 18190129 17899178 17348789 16521053 15824464 15600412 14770864
16659 14770864 14736880 14179517 13544919 13264303 12529507 12531641 12048149 11863457 11534780 10687044
16649 10687044 10962940 10276861 10201124 9719920 9688691 8975848 9129210 8777904 8148014 8579920
16639 8579920 8254368 7829519 7718750 7327530 7345598 6989348 6922161 6611444 6622912 6671447
16629 6671447 5962438 6095725 5974930 5996888 5614235 5892120 5619171 5215200 5268493 4756130
16619 4756130 5299572 4865994 4961481 4748371 4739934 4465784 4879394 4343776 4395588 3926568
16609 3926568 4036360 4370176 4027868 4192967 3779805 3741491 4086037 3849694 3716186 3493403
16599 3493403 3462985 3334683 3368971 3463704 3126439 3296673 3173669 3023671 3178458 3096499
16589 3096499 3071475 2793217 2570763 2820254 2830770 2705393 2545708 2575657 2748385 2404710
16579 2404710 2929201 2299515 2457479 2476633 2374998 1903333 2654413 2743343 2014164 2405286
16569 2405286 2055590 1874907 2136160 1988271 1523200 1948449 1998712 2031275 2029545 2176963
16559 2176963 1991958 2027900 2220880 1611664 1743742 1659813 1948339 1795557 1734429 1631432
16549 1631432 1720354 1371648 1837763 1276451 1509900 1363243 1860044 1537616 1473286 1544993
16539 1544993 1188442 1397893 1423045 1000803 1283540 1516113 1292091 1264608 1138129 1009438
16529 1009438 1223088 1489558 1253522 1280457 1566005 1543433 1107152 933320 1163198 1412362
16519 1412362 1101790 997056 1192670 1112511 972978 709325 1145899 1070685 819924 1207697
16509 1207697 897919 1112147 1125328 829120 999523 809813 798152 989462 1212431 979469
16499 979469 779131 904890 1198803 729702 809758 956555 967595 855824 837878 759769
16489 759769 1019726 806147 842013 991317 725153 846504 932638 865568 538147 730682
16479 730682 586803 734785 755076 793736 645917 655703 668000 629385 611082 622423 686619
16468 686619 678124 709397 702379 574402 468393 635590 687400 689661 489038 689147 846919
16457 846919 564278 660050 716357 548844 571085 705843 426480 697349 395620 704300
16447 704300 518283 957834 468417 378456 365457 470461 848935 345279 404547 455275
16437 455275 294734 421391 487120 541514 532317 561600 654180 635659 258657 436115 595954
16426 595954 474819 316444 406726 424175 129997 493462 413084 154521 191603 508245
16416 508245 369029 296040 742181 412059 139198 48239 149998 416640 214688 444106
16406 444106 387291 502635 514765 391180 459285 213533 470291 1752 401484 344609 289165
16395 289165 533147 534479 376672 184739 144019 448753 439192 -50782 577496 500528 368494
16384 368494 249234 357407 277723 148410 240806 224584 90239 218085 436684 129781
16373 463687 452445 298481 328048 382652 240371 54104 319922 191111 367937 434458
16363 434458 202359 497773 416666 370617 455308 87300 313822 207140 609038 212858
16352 196592 -141615 134609 485240 53319 104841 232383 329344 52433 183472 286004
16342 286004 228570 46740 16657 278857 294944 372472 325361 479457 262664 105094 246098
16331 246098 267321 -12808 330119 202183 414538 229605 1483 287480 379964 68314 277010
16320 277010 200306 162019 353706 130568 123423 199970 69362 170165 124984 477840 404279
16309 404279 162660 97282 4583 24948 321012 120204 84014 307213 89408 7336 84020
16298 84020 59084 194862 469748 88357 -81849 243198 141211 29919 285336 313487 249328
16287 249328 171718 131498 -22292 90198 468710 258386 134251 171376 -17870 268076 77098
16275 -56556 191512 273657 143837 -2993 107774 112580 -19147 -168366 -68814 -248611 254917
16263 58222 240565 298393 1339 -8112 235055 323216 169460 -62111 37929 -22038 -42818
16252 -42818 161348 16001 211187 252139 -116890 139119 351782 405853 238985 -30085
16241 214583 238464 173255 -171911 -253884 -9801 -198715 158520 169828 83745 108972 -29808
16229 23228 -289910 117453 86 -18356 218587 -79110 232980 250928 164342 362802 92543
16217 112777 37193 38755 -43873 290135 -13336 395997 -44765 126170 162340 84603 225450
16206 225450 -263198 46049 1794 103844 -274903 258603 127372 116322 15789 -167680
16195 -139500 36110 -306078 99340 -229911 -111671 221564 49821 383460 201309 263811
16185 263811 -239148 71589 372022 -158765 -184892 -23675 160562 19892 41867 4106 77486
16174 77486 -100101 107191 -141353 49471 -97233 -63396 350311 147473 15673 48899 66004
16163 66004 54255 229895 -156784 -179214 264404 195378 -89631 -58446 -55162 -104185 -16781
16151 185033 -285022 -65159 20157 3330 -89107 209941 276219 -194755 -23454 -7333 186656
16139 -43190 46372 196299 -182115 -122939 76098 85446 -12353 135202 -26500 -41809 39989
16127 100361 -121059 194551 132007 367692 99442 122039 443550 -266133 130422 -128368
16116 311401 -50160 2528 -57630 -45355 -89631 -107398 218469 -61504 115254 193737 107154
16105 107154 154666 12348 -372079 672 64173 178536 119220 144613 -218395 23246 90010
16094 90010 71411 119174 -162689 -60802 24436 -62689 214908 105633 172573 358544 231099
16083 231099 -236770 66084 -1812 -148070 -130840 -133066 -483607 42680 -101094 225386 -133214
16071 -209704 178696 167826 283286 -79820 69988 -306503 294288 146751 180938 64982
16060 -117470 -108886 -96002 -254546 -121540 -9299 62021 -259551 31088 130043 70191 220552
16049 220552 121480 98868 -256280 -188779 -230974 -112567 -49122 -207877 -164846 18963 -89509
16037 104816 -75480 -126494 -58174 -285089 -101086 -121799 103849 -70925 8774 -29399 4650
16025 5836 -179344 -51658 44652 -181743 -376408 -289245 214115 -3153 -275800 -220325 97795
16013 -188552 350682 -11664 97413 153351 -70019 -173006 341189 3748 158009 12661 -219276
16001 22316 131101 -335318 -35227 49298 -271796 155548 129820 116944 -74077 -26456 -267068
15990 -267068 -125749 266169 -26354 -50864 110295 159882 -168544 207584 465480 511898
15980 511898 377942 292951 416708 -32101 94479 112403 -85568 131197 71586 -324333 40358
15968 -257159 -41650 125147 -50853 332863 -70621 66786 -98117 110419 110271 -190485 171590
15956 -104903 -48690 -29829 -101906 100094 -56268 166894 82038 -161936 -186038 314741 -200030
15944 -57154 -22982 204587 -147557 -92620 161802 -54546 -181965 -177093 -26177 -11773 -329157
15933 -329157 209981 161352 -6688 -198364 275655 -14968 -92072 -38027 -244985 -42172 43133
15921 78635 77894 -138322 -204225 134855 -145795 -123120 -92181 86427 -197470 -211119 55720
15909 -295165 47327 92211 253396 153265 140726 -268730 -31177 17489 51761 -238598 -29061
15897 -179234 -308992 -107149 172443 247798 -95782 -128163 24003 162042 -83325 -32855 369056
15885 79475 -5460 125229 -53914 1492 -35195 -70238 -277563 9842 102509 -46998 -62951 -103083
15873 -103083 177076 90222 -181413 -225922 -175975 -54925 180503 -238496 -124078 35858
15862 -336943 -199702 200144 -280501 -25031 -265664 -57999 -89510 5792 -292920 -46053 70236
15850 48415 62491 111467 168386 -91646 -244188 -453115 33973 47926 -223783 -220658 183067
15838 -87270 130017 -264649 -187625 -275436 74516 136570 212641 391551 235618 92220 -218358
15826 -121408 -191687 -36394 -77244 -134398 -363485 -60781 41142 -19448 -118646 22924 -70969
15814 -334817 91596 -168694 -173798 6324 -40597 -83975 160927 -53589 4925 -67599 -156746 264731
15801 363629 65277 -151745 -197671 26674 -58544 9343 46833 -72329 -39868 -15737 -339641
15790 -339641 17198 -284249 -196442 19401 -195654 -165290 189371 -105392 -114856 -64502 -12376
15778 -146153 3561 -69482 -37421 -107500 86428 113778 -249756 -22393 23198 -86113 127997
15766 45780 -19340 -70790 -105146 -15139 137445 -65778 218246 134957 264965 174680 219038
15755 219038 -86473 76931 143474 47123 73680 -164352 -170745 -30543 -239846 94778 115279
15744 115279 243563 -25105 -20515 178864 243635 -61680 -85851 -187879 -6015 -58729 -346338
15733 -346338 -206988 -111681 -4290 239130 35139 -77946 -263940 63805 -31192 40070 425288
15722 425288 71342 -154157 -50887 -301067 -340879 283257 -112392 29654 274015 -133768
15711 -110833 6215 18323 -29173 -346100 -252503 -261217 -261423 -186573 -357039 -8070 443403 -216374
15698 -124161 -182746 82283 90127 135093 24330 90057 -111272 -32987 28739 -72116 164746
15686 92591 175930 -86230 100895 -137083 153397 -145884 249515 -5945 183661 -148489
15675 6526 216660 73442 -190265 -40232 -273412 -133970 81503 396098 -220880 -110385
15664 54958 -234326 -11712 -33117 172024 -9580 -230982 -189763 13151 176830 -248707 25103
15652 -59505 225085 116229 -138461 88582 -369751 136181 -61882 -317973 -263421 16255
15641 -59515 78045 -183737 -90612 263258 50029 -214633 -178535 -403548 -96242 -74206 -92130
15630 -92130 15761 121637 -244084 -64056 389265 100653 -160752 -240143 -164294 -120448 -92911
15619 -92911 26828 232861 95644 563407 -29547 184221 1926 41912 268633 -175866 -64685
15607 -98863 74562 -133282 62416 151735 -159820 155403 44308 193613 -80114 238751 -190915
15595 -308806 -197560 -205796 -111035 56236 -51927 11335 82387 -24643 -262448 -11242 -318451
15584 -318451 -59575 25609 -40685 -125151 -118526 23104 113012 37485 -217737 -130339 19880
15572 -137272 187987 87699 -7693 109411 -308070 151908 57070 -173185 112451 -21107
15561 116384 3413 -22100 59528 -52579 -162401 58659 -242816 253187 -88837 143313 -17162
15549 -29315 -73712 -114961 -56320 33341 100448 -159832 -112563 149590 95926 -14122 188437
15537 -286532 184186 51967 77107 19369 -314107 268149 -294703 113955 -58465 209563
15526 197350 -141118 16669 -4007 43912 -192975 207493 -206245 137394 -41814 162877
15515 -18321 -145218 114188 -45543 -66507 141071 102230 157345 -72771 -144649 39770 208257
15504 208257 23555 -170245 -301421 90740 262750 145029 28725 288786 272125 -60687
15493 -321630 11712 122944 -83803 -267073 -9740 262332 -179876 -81129 -121968 149493 -305700
15481 -290050 -420264 118832 -135264 -36932 -162830 231793 39611 -137096 -126867 171019
15470 97176 -116775 154137 -31320 274381 -159574 280784 -37779 -25801 -361333 146906
15459 301860 159590 -321347 32612 16109 169052 113220 10916 285909 -152067 200446
15448 -119812 239751 97752 143068 -23517 -1805 -80451 244781 -118559 97844 221874 -108271
15436 331096 -56592 -38753 -163611 91396 278997 -45127 244281 8199 -466003 -30524 -208652
15425 -208652 -127394 164706 309483 122280 77212 209493 35495 63433 -25795 310155
15414 153149 -17177 61844 39555 -130191 -307366 -251957 -29246 -108435 -30823 -55099 60095
15402 -283780 151741 -106372 108704 181881 -156518 58492 56627 9344 207272 137217 -5097
15390 -253276 -316031 66967 258568 189473 14449 -65564 -271960 -37140 -282051 -120746 12991
15378 -30983 65988 -451895 -32564 -405548 -100221 130055 2065 -211205 -178461 164543 256023
15367 256023 196824 54730 100223 -467004 58481 -57959 -202996 -75802 -189995 -50869 58267
15355 12824 -105486 9429 282250 -95185 -124717 -161539 148700 208317 -88946 -1425 62345
15343 138902 193934 164679 -321782 160762 147083 -153357 -5545 -22663 203293 70558 87101
15332 87101 42835 245730 -51672 112821 147788 -127562 111948 246996 -31518 -123956 221785
15320 -223686 -60321 -377539 49030 71142 34788 107071 160637 -154582 214185 -222797 312657
15308 -134056 289165 211364 -18575 -64509 68634 -130425 -48331 124826 -181541 61596 448992
15297 448992 -257919 -139808 75732 -203872 220493 -23681 -27400 -104238 95542 98453 -116645
15285 129705 159116 -23662 66529 -75679 -142865 93155 -121593 73508 47379 175957 101591
15274 101591 192311 51125 -355495 182617 325193 416885 -111416 -96215 262371 245885
15264 245885 -53229 246790 234331 337262 -202710 -39356 -31174 195099 244015 -100874 23232
15252 121779 14353 101087 360506 380919 1373897 1441833 963418 1685332 855790 458495
15242 458495 11216 51669 256183 296915 183434 307905 42331 135118 341400 44455 -44283
15230 -205042 374436 181778 103476 -99720 -89594 -42095 64244 -118418 -130023 238362 -10403
15218 77749 -312800 19864 54688 68304 18638 313970 168124 25826 174671 -86362 109230
15206 61389 201636 -117377 105451 346963 -81159 70815 270212 132044 114823 29197
15195 7910 141642 128889 -186371 188908 122844 -53761 203154 -189284 55064 93321 118646
15184 118646 168774 -58059 234739 -41481 -51116 104701 316764 497481 -56101 180229 -353461
15172 90226 89854 -99405 -174130 118498 28021 74136 12409 -129684 93367 89519 100231 -185556
15159 66201 54678 38740 -118752 405035 192270 -54358 380756 243740 -41368 -197915
15149 -197915 49924 218421 56602 58695 235691 -233974 -82683 107432 344305 -196913
15138 -164163 298796 -49352 -225114 634 134249 -94455 204555 399100 191702 22610 170191
15127 170191 -51202 437765 266727 -133287 218449 124236 -214231 213416 398353 177112
15116 311939 -152976 -145715 388872 37652 154606 -157225 189472 94637 -37371 334232
15105 218561 260115 282516 -66569 169956 157539 502583 404903 147486 122703 214281 260373
15094 260373 404502 130510 -162156 228822 121589 258061 -20239 568755 45370 559513
15084 559513 7130 40589 432911 -13771 -47195 413781 -40425 385473 298543 96750 199248
15073 199248 170789 256731 207468 319868 47930 187785 -87169 -13230 -250263 142293 262007
15062 262007 265002 -4447 -96374 -114579 14600 -58228 -289418 -196726 4245 -10315 78826 305020
15050 305020 105839 201132 368712 227067 89532 278097 368253 343611 137834 411294
15040 411294 283200 -4637 189768 413064 435640 116372 107968 270026 -139475 -167480 282479
15028 -35069 87175 185839 211968 550673 50638 5940 134187 80353 171315 188517 369131
15017 369131 366675 448205 459742 45498 51336 15247 395695 222739 39390 49291 356820
15006 356820 196385 338917 36147 58993 -31985 431660 -30765 256540 389186 129773
14995 22006 284487 295761 213886 266812 363518 422812 95946 369844 333982 284958 -139511
14983 191556 -3218 -147219 177724 154580 -186351 402804 146282 -204075 -15476 317577
14972 164350 10520 159810 208984 199095 460937 194210 180815 537656 -107541 140791
14961 79697 55435 182756 37734 504397 230951 338741 164159 417639 230460 714241
14951 714241 -23863 45774 222844 197900 366655 342738 464939 145685 324778 235001
14941 235001 451604 404562 483825 385721 300426 159501 426099 268408 449375 320688
14931 320688 103924 170857 314635 319686 472613 486873 473887 357403 244808 248667 237600
14920 237600 352655 229252 313945 235225 491499 225300 424533 405113 138419 371018
14910 371018 352536 256975 326366 56964 639310 180671 285232 300421 453616 63336 218829
14899 218829 234673 404142 530743 312737 348823 291270 410373 362050 276151 42725 -1810
14887 312965 533394 544630 361274 58792 139641 294060 189289 361667 227586 158047
14877 158047 418600 456678 418478 557033 219375 216356 234396 89182 509927 379459 275026
14866 275026 271198 198997 304159 666080 217104 306866 191802 401537 745448 310329
14855 547367 424180 655017 355972 432671 678354 560656 246417 324609 409362 493499
14845 493499 451765 183057 512444 343524 283749 412505 371205 354585 396916 228851
14835 228851 554392 196628 614710 458458 329952 271242 668078 375404 625080 414853
14825 414853 457725 691537 637305 484696 598739 426994 235956 474923 451310 470256
14815 470256 751302 512496 575156 203546 520332 568700 654326 398138 432975 580335
14805 580335 439379 61586 805392 192436 201486 460106 777039 393458 656730 753596
14795 753596 399461 369211 401031 181745 458831 616008 574093 645841 609654 695035 679973
14784 679973 585485 733452 515144 570518 270482 594101 673260 803224 804376 657636
14774 657636 644589 563138 1019530 871641 635014 627810 585549 565230 556078 1005609 435814
14762 707959 878287 424577 509636 513119 463824 541150 871768 859218 1132300 320417 541577
14751 541577 847057 643371 420976 655609 688716 844464 542076 683731 855099 481146
14741 481146 847388 572125 973956 586335 807153 941329 746475 614093 509247 588800
14731 588800 663534 543983 675065 847728 917905 1004917 750543 767291 560260 626733
14721 626733 839704 320776 736973 866067 810822 672701 945075 618912 970720 717786
14711 717786 833191 813233 782050 953087 546083 915172 505231 981520 880030 870185
14701 870185 825933 1225522 1080279 946287 1151776 1042546 460993 1164040 926723 853182
14691 853182 901184 791808 664576 816633 869005 1035039 881618 773001 881305 1219958
14681 1219958 986933 718553 1162075 761596 1127864 1032092 821267 1072250 1113751 699138
14671 699138 1284643 1128593 814254 1049664 1156669 532100 1345796 981684 1100951 909260
14661 909260 850979 1120773 1082775 831165 1090317 1098959 1180715 1158693 1075064 1343652 934098
14650 934098 1005020 1354200 1059645 1176627 1057980 1375390 1197395 1179824 1197495 970340
14640 970340 1251467 1353239 1219650 1427366 1074954 902453 1297508 1417401 1291602 1074412
14630 1074412 1237485 1212718 1555141 1313007 1321736 1282431 1145166 1305604 1463571 1721681
14620 1721681 1439082 1415019 1394468 1437230 1352158 1672766 1342932 1255874 1314765 1610152
14610 1610152 1689698 1500515 1650144 1608387 1687992 1432730 1620524 1704303 1250529 1962321
14600 1962321 1671413 2074440 1568994 1534270 1568165 1536496 1903078 1754038 1690484 1693493
14590 1693493 1600735 1287037 1826529 2054288 1646877 1689120 1806404 1635218 1871602 2239003
14580 2239003 2062212 1950755 2171638 2340755 2069314 2130762 2377664 1905909 2061067 2208739
14570 2208739 2479026 2342076 2236222 2405682 2566830 2454121 2586488 2266496 2435053
14561 2435053 2637142 2592925 2964862 2864967 2936001 3094983 2903626 3552741 3878463 4005714
14551 4005714 4801484 6034633 7513970 11613054 20106261 37990643 45884859 23318408
14543 23318408 11022691 5289130 3371414 2596626 2450852 2355423 2129630 2087154 1783719
14534 1783719 1809467 1796587 2001735 2324922 2198902 2379903 2411757 2429429 2486174 2362329
14524 2362329 2519129 2443723 2570416 2352048 2492520 2450949 2705239 2357345 2625940 2894583
14514 2894583 2820078 2757040 2553733 2880524 2739116 2329949 2924391 2612411 2863333 2784413
14504 2784413 2744126 3131892 2688451 3078812 3439147 3355558 3283312 3257750 3100408 3265718
14494 3265718 3037892 3220571 3697038 3563405 3299414 3486243 3428533 3170242 3671592 3610366
14484 3610366 3750557 3890761 3769417 3782355 3753257 3926278 3954472 4134117 4039176 4208678
14474 4208678 3985406 4150073 4575898 4230763 4310116 4194524 4600882 4519839 4509127 4682188
14464 4682188 4736808 4804004 4760960 4999064 5189659 4438531 5124205 4929764 5222739 4968164
14454 4968164 5346747 5277538 5278079 5021818 5585077 5645281 5503342 5631968 5495913 5500427 5838977
14443 5838977 5777271 5767653 5977426 5953710 6098367 6488939 6469917 6310938 6454192 6515334
14433 6515334 6496197 6765059 6832805 7026385 6796586 7083858 7197473 7218094 7426846 7898393
14423 7898393 7518594 7617791 7644509 7993210 8002975 8376069 8259688 8051650 8684636 8595479
14413 8595479 8691525 8505555 8973446 9020435 9049145 9157861 9549528 9422351 9945575 10089360
14403 10089360 10020150 10293718 10079672 10494108 10756731 10783462 11222982 11240363 11477284 11772150
14393 11772150 11964275 12038113 12427219 12374754 12979629 13028125 13269026 13560149 13631716 13734443
14383 13734443 14155473 14534201 14825573 15542935 15484981 15697263 15732423 16275048 16074368 16532596
14373 16532596 17089718 17374281 18029376 18229313 18456469 19062341 19207138 19541397 20250425
14364 20250425 20559891 21012058 21228681 21653553 22050714 22608480 23145782 23878487 24300345
14355 24300345 24722246 25377257 25993447 26206616 27115457 27762836 28580629 29177944 29815167
14346 29815167 30747151 31432315 31796542 32671150 33837590 34674109 35791082 36335536 37592949
14337 37592949 38646375 39519302 41125320 42058321 43147360 44638090 46043689 47123789
14329 47123789 48701463 50028235 52040368 53155862 55126445 56773037 58954175 61117794
14321 61117794 62995351 65273838 67478272 70077632 72654906 75004089 77884755 81156436
14313 81156436 84169347 87437770 90904726 94459276 97983240 102304693 106819908 111292810
14305 111292810 116390836 121335350 127188819 132385295 138748625 145143773 152067638 159040044
14297 159040044 166968005 175066412 183760990 192903284 202587694 212504560 223226068 234628135
14289 234628135 246074191 258671994 271197769 284630473 298725381 313007411 327593067
14282 327593067 342723219 357275934 371925089 386517094 400575811 413597109 425655767
14275 425655767 436480763 445724040 452166343 454833007 455723365 455628727 456960735 454900567
14267 454900567 451347060 446648125 439863354 430791039 420297470 409049193 396125010
14260 396125010 382109490 367526492 352417325 337565382 321989099 307573490 293944268
14253 293944268 280168292 266597558 253556596 241237809 229444937 218056907 207306303
14246 207306303 197153222 187914579 179327132 170878659 163002739 155025608 148267018 141617461
14238 141617461 135556472 129655286 124146713 118407823 113363892 108911741 104367516 100323820
14230 100323820 96653088 92311388 88919506 85286267 81872719 78969511 75972894 73349901
14222 73349901 70664694 68324610 66550168 63739534 61967704 59868841 57821659 55981099
14214 55981099 54763233 53166217 51123352 49349798 48095164 46485361 44895369 44396639
14206 44396639 43546771 41731233 40525944 39081164 38218697 37484337 37054468 35354829 34129684
14197 34129684 33352701 32604503 31820193 31259668 30614005 29793179 29111911 28158237 27370734
14188 27370734 26599984 26127630 25635056 24975227 24481523 23799033 23340582 22963061 22570021
14179 22570021 21454210 21099818 20808383 20084001 20093176 19659214 19219130 18879243 18307997
14170 18307997 18162743 17540404 17504615 17282726 16741935 16385188 16334439 15882932 15600951 15629115
14160 15629115 15330620 14717384 14658041 14298874 14012216 13949585 13585198 13478630 13239860 13035411
14150 13035411 12923555 12474429 12443794 12358356 12176748 12109934 11833256 11531087 11787336 11023328
14140 11023328 10929741 10924555 10609583 10555658 10386827 10394918 9875452 9924328 9973538 9533709 9119497
14129 9119497 9276508 9288276 8850836 8953374 9165849 8983961 8874034 8546566 8513826 8469445
14119 8469445 8339109 8207047 8142504 8015966 7802070 7922872 7753924 7511579 7284483 7373264
14109 7373264 7137861 7017860 7055083 7188635 6784683 6873214 6647316 6715634 6700000 6346475
14099 6346475 6480584 6339377 6109568 6318855 6252184 6054663 5820693 5844865 5796725 5651538
14089 5651538 5670636 5299236 5515274 5755497 5147725 5534702 5519295 4920231 5179337 4866808
14079 4866808 5162261 4868366 4958412 5143665 5006950 4527789 4713413 4280515 4653779 5026508
14069 5026508 4606039 4514613 4281182 4257252 4537955 4674357 4294094 4179235 4458467 4509418
14059 4509418 4294493 4608950 4120155 4059370 3804553 4015580 3977608 3927764 3858455 3537560
14049 3537560 3731705 3944465 4027066 3783736 3732195 3864863 3383200 3479294 3231408 3436485
14039 3436485 3417399 3556061 3859414 3337591 3328943 3085936 3622003 3143837 3365627 3193738
14029 3193738 3305174 3512891 2934165 2973099 3048905 3056605 3118876 3061992 2811510 2755696 2669352
14018 2669352 2916108 2658956 2880754 2490468 2830080 2732116 2747124 2657246 2624554 2577337
14008 2577337 2403956 2421184 2478319 2332618 2008760 2246588 2368823 2310297 2375620 2194743
13998 2194743 2352534 2092810 2287124 1948405 1990358 2261371 2393569 2476745 3015328 3498776
13988 3498776 6639770 13443336 31188662 47067514 27801835 15047521 8910363 6528996
13980 6528996 5181700 4243900 3958921 3738542 3500187 3086876 2987506 2914322 2839101 2766492
13970 2766492 2619869 2739658 2672574 2463874 2220002 2511167 2451671 2220470 2428864 2323797
13960 2323797 2260309 2109060 2226121 2430372 2335601 2102705 2155698 2099353 1952036 1999379
13950 1999379 2294783 1975234 1881496 2144842 1882770 1802466 1678230 2147585 1764247 1857816
13940 1857816 2349063 1990362 1733251 1860500 1445469 1938392 1664603 1764687 2032150
13931 2032150 1611671 1524071 1790793 1639584 1804815 2004762 1720191 1562210 1741498 1625758
13921 1625758 1243110 1471453 1720276 1757458 1683139 1659631 1532681 1608699 1715360 1535264
13911 1535264 1893018 1609008 1608712 1781307 1610280 1650520 1516709 1578583 1627596 1658365 1224469
13900 1224469 1552158 1182120 1304028 1331254 1479370 1595844 1415398 1470968 1277751 1574998
13890 1574998 1768214 1275321 1597364 1498972 1267389 1834724 1322177 1384336 1114720 1503657
13880 1503657 1096295 1012258 1677337 1328397 1241108 1567406 1294773 1237378 934566 1118673
13870 1118673 1405233 1029192 1182078 1155187 1261526 1446609 1223312 946992 1027029 1298035
13860 1298035 1034557 1680787 1275890 847123 1361524 1114350 971464 946007 1055676 1285329
13850 1285329 1109849 905568 902276 1179846 986461 1132094 840676 1160305 1080338 1027003
13840 1027003 1175455 1076142 793885 1113394 947520 1095383 852734 883167 717830 810349
13830 810349 1227802 510433 894569 943283 942744 909707 855987 1087774 757390 997488 1054744
13819 1054744 932214 661667 899927 914626 624217 729527 830347 958697 775969 859805
13809 859805 892094 810468 976253 925521 809266 852051 1076446 658907 973199 766668
13799 766668 593893 1027675 1000620 634554 691705 1192835 936983 1044276 389361 691094
13789 691094 509929 901715 963568 1002119 1091714 753864 833290 747463 412369 862083
13779 862083 1026229 894575 930180 783428 611014 798418 797481 784787 961341 601195
13769 601195 906385 719296 589552 514803 770088 1077328 1124780 357921 747156 624464
13759 624464 638372 802398 786594 800742 1003972 506483 730665 449719 821174 535426
13749 535426 609418 787147 434658 941336 630598 630654 567368 370040 988708 497457 694461
13738 694461 591988 408469 653037 665718 505597 467076 1007267 765906 427201 676329
13728 676329 670821 494427 762911 706745 732852 534882 623560 842052 793144 632520 553070
13717 553070 736626 480528 506946 307006 714028 605892 696464 445566 584970 604839
13707 604839 394610 323958 456691 572435 924915 531379 668003 460250 671592 684026
13697 684026 454633 164688 917405 367724 516897 368877 169854 616850 527209 700654
13687 700654 351803 452886 356429 851149 591156 265884 720869 402840 301885 535045
13677 535045 716101 480422 461741 526286 551959 782984 426267 476190 457780 406035 521815
13666 521815 593583 460011 655621 483825 513957 439881 152455 693968 550390 289473
13656 289473 536229 543311 377856 851681 285654 478727 543372 392739 409753 405894 382349
13645 382349 453823 716667 233276 515583 189287 398465 387553 398430 274426 825785
13635 825785 306013 582500 444918 337720 591351 514307 453050 545895 404146 104251
13624 598140 456718 22945 341323 51320 315257 570503 402349 566144 582846 586174
13614 586174 365484 505483 404448 541229 439279 302574 502577 309738 233930 491824
13604 491824 183874 520684 434293 188765 412156 402153 617051 306784 233615 575097
13594 575097 411616 534565 127959 93 695948 260626 384499 67930 323114 311393 717943
13583 717943 329123 416914 355878 653367 465443 333216 585799 400052 475909 597430
13573 597430 188977 242545 84329 463760 247673 104075 285959 491852 394602 217244
13563 217244 252588 116578 125665 474687 -89528 436308 597180 464617 296922 206902
13553 206902 295307 373288 684359 45005 367478 292894 531493 466076 309764 382427 275754
13542 275754 192414 421034 451428 418287 -51093 365363 266751 154195 308243 -65858 649678
13530 121731 342561 202121 276921 277308 78243 602683 374746 342555 250808 353437 585276
13519 585276 399563 20788 562241 -8295 170630 289022 189749 425868 287835 151023
13509 151023 403792 558588 340245 339303 92510 61816 451242 420776 451625 146859 619092
13498 619092 89293 99878 280581 360550 346754 92987 135576 341138 138860 228093 24054
13486 92956 -55164 324922 76334 207419 167713 294365 543318 158034 532245 54145
13475 205023 -9860 200245 110617 140767 407397 357178 447068 116896 19989 183596 -7909
13463 183147 53109 367441 474273 188957 493356 248251 309698 137593 52172 578180
13453 578180 512151 333666 517172 -72055 289912 294597 386261 469245 323016 112720 452886
13442 452886 173007 606926 -29113 407720 235723 419635 139712 297280 815101 156631
13431 136673 299056 67318 20316 388952 50406 283193 646364 79755 82672 172720 431770
13420 431770 337213 -5633 303581 148654 -126046 19966 -133590 -277537 253846 269396
13410 269396 412889 327378 265244 204229 229787 5040 57600 235381 147623 357685 261310
13399 261310 348427 45901 162494 82697 153444 184829 48630 239789 -181841 62620 363842
13388 363842 424254 393806 113433 428829 270885 479515 269742 284030 145768 164365
13378 164365 165386 -26482 282001 482380 111916 282706 460092 313839 251434 449840
13368 449840 156415 226948 385546 54465 386993 265194 477540 181976 31824 55830
13358 55830 271057 660815 200127 -161395 185379 254981 302706 272236 323669 504613
13348 504613 289440 154553 188005 160610 464357 381821 319279 240658 376374 419847 260770
13337 260770 425766 148067 386538 420146 128008 38963 127939 212588 416658 -73109
13326 202323 9887 42550 -9637 -133584 366704 235956 278285 180653 -56007 506366 -276991
13314 302199 354844 367687 -36109 339154 178051 -232919 415311 299099 -89450 120548
13303 -24191 -193514 197463 651634 118266 61259 179949 -125071 250736 278617 308019
13293 308019 116898 35345 50480 10338 298040 188136 -52941 235090 346115 232193
13283 232193 96517 -50455 129063 206451 108514 -39478 27678 317634 76052 195714 33558
13271 498738 411594 88323 37654 -153646 -70584 20264 220724 117584 -101558 239018
13260 471236 466821 103128 232388 180027 382537 131329 -62581 30482 298683 113162
13249 139487 181116 60402 321961 -161938 57644 117168 -78448 36855 -173147 357876 16681
13237 141892 -38336 67594 -169461 7576 396582 155929 220496 391152 -180543 110019
13226 1686 285713 -34258 -69293 454545 138776 299688 403273 -106658 259221 294143
13216 294143 294375 342552 204883 64216 -127274 281371 117980 121766 278546 -134339 -194352
13205 -194352 502264 105593 322584 69059 152988 -88507 166747 -48242 -59083 19282 348545
13194 348545 385648 38671 -69415 61025 59174 161081 204966 75251 39479 11424 83330
13183 83330 -145251 101180 17159 186040 161979 -109514 212116 38731 572926 124225
13172 493798 45744 -58235 -14272 255407 145475 211041 67410 51531 57093 -188280 207816
13160 130595 -20546 166277 167208 73972 50708 -149495 -68628 -32052 405105 -20321 95689
13148 220194 -34128 424279 121732 454181 -222868 459879 256822 2636 184865 -188824
13137 76179 124157 108513 5526 -81439 -49056 151478 364588 156936 114832 208172 -188250
13125 139629 172080 -69652 -371911 247232 -28688 219352 197133 -239473 47974 -83204 -14695
13113 -49779 318204 307448 151510 389666 232754 -138314 365504 65775 103330 85653
13103 85653 98755 257238 278553 103630 -80336 214870 83850 -148309 269932 8750 36989
13092 36989 248834 193100 133298 159760 -4652 287397 -235029 27492 135991 -424255 132514
13080 466046 87642 -23141 -26134 130024 -249711 -279204 44456 127058 271727 11549 251590
13069 251590 241273 247735 193317 -149513 -279749 251966 49612 187651 -21697 166751 200983
13058 200983 124625 224079 -176650 -111718 -153656 -46759 -110206 455258 170918 63121 -23421
13046 478981 107577 103265 -209131 4450 147518 95937 67251 -201242 434344 51494 -5886
13034 287500 3322 220986 531419 -62062 254115 -35978 -17340 385189 160958 -54356 125209
13022 164794 345780 68658 143347 -42120 48776 -86450 125185 -153414 -15094 109880 23151
13010 500180 -68248 108618 49747 77618 142250 -54046 342844 -72258 253458 98857 -63209
12998 -89314 86434 214829 119901 344 -95959 -603966 -123401 312285 241643 -117849 73331
12986 117122 184823 -15109 45859 126774 304072 -31088 136203 393378 396204 363617 -96116
12974 -91325 5604 30370 71480 126335 198027 -126530 -14411 49899 555586 -14648 -69914
12963 -69914 62355 -78982 -93153 75751 151092 222641 -80943 193810 -90678 30914 232474
12952 232474 32535 40941 188842 223134 19791 -97406 165309 98074 -143854 -296534 94352
12940 40901 70968 131239 382872 -281316 42134 50626 13203 -189517 -53634 168383 355108
12929 355108 79991 204855 -198001 -180158 -414391 132107 153523 -182767 3169 59704 -73065
12917 -97592 367424 219999 49391 4749 -72743 22609 329980 153562 -340789 68196 -63666
12905 -49510 -8812 193337 -201780 148736 -181438 25728 -114688 37351 -86490 -224667 156930
12893 160457 209800 -78642 33974 168370 225436 140660 72526 -119668 -75733 203910 -81277
12881 -23778 176315 109363 -13154 -116705 216139 20413 29307 92539 -84607 -114471 -18723
12869 112827 90662 167132 323973 -128208 -40755 34244 -227623 -154936 -211756 -97816 -149496
12858 -149496 -167002 -109249 28673 -29988 96999 151180 -159818 4518 147754 -33855 -19106
12847 -19106 -76593 -51222 29211 56953 32411 359257 140691 -98277 -16114 90891 -98662
12835 89895 -84012 176026 25449 -76123 -19424 258610 -10303 -416753 -198912 -30453 -46080
12824 -46080 30759 -340222 -73280 47517 -41776 -102403 22084 372841 18590 31757 -4617
12812 -157736 201109 110691 -113965 203057 300536 6295 -35591 -50736 2686 -33511 -117917
12801 -117917 175270 -285605 -76680 179069 -13224 56906 -159404 6546 -69069 -165010 -337705
12790 -337705 -9086 238319 328112 438457 188713 -84283 73216 -124678 -87164 47462 -270093
12778 361572 -32104 1849 -40346 -72744 -8197 44282 -97405 195111 -117318 -294136 -324325
12767 -324325 -35051 -53346 -155634 -75213 -190446 -154211 94527 95755 -26692 119782 134897
12756 134897 -266724 -19963 -95060 -3675 4215 21357 -182587 -23262 226257 235316 214064
12745 214064 -179863 83310 68585 117034 144136 -51809 -71668 76779 -411763 -55481 325931
12733 -237431 537476 100117 347873 -117351 198167 206443 -205097 -83879 279851 -7190
12722 86440 173928 345277 167376 -234286 -19786 292087 -1328 -132312 113026 242821
12712 242821 161333 185120 -45357 -87750 175364 225076 204751 270469 91605 101014 -49313
12700 91342 -20915 67921 -118072 -10801 -7329 135333 -59440 1925 -87616 40077 -8124 39232
12687 40255 139007 -21527 353284 -228245 142129 157260 216422 226959 298524 450138 326499
12676 326499 -38553 113549 80868 119045 127644 182351 -174044 216143 331052 72476 -37118
12664 218581 164458 111155 661469 -27003 41432 38772 250950 122856 10420 -124967 54592
12652 226300 369521 26631 -107296 189025 206152 162619 152057 -96641 41613 -9689 110027
12640 250656 111819 269152 397108 4848 187772 -51735 78436 323574 -24824 151481
12629 228137 257856 110026 104047 307914 96147 166655 152344 26796 106328 247105 -87451
12617 64076 218269 16921 -97 136123 19364 109436 236255 86611 158771 249384 -53627 -125488
12605 -125488 -92083 48737 -44687 -88533 277358 330886 10433 187810 269092 204478 88958
12593 -216464 -131994 -150998 63980 278718 -112668 -58680 -191315 48186 134788 100623 -58800
12581 -201556 301444 3252 60680 26206 163407 287417 3754 -39374 75199 348746 320618
12570 320618 34360 172746 14648 -25571 249890 181475 -44151 -24465 177702 152105 135901
12559 135901 125235 -54303 232559 131125 179966 36145 138353 -120401 -211043 -3757 -240641
12548 -240641 -149895 -31436 -119329 111227 446669 -102114 117963 -88132 139725 108045
12538 108045 -262159 118815 -40251 -195744 347615 -520037 -111069 -2544 -41972 87977
12527 60921 -17436 9415 -57365 -36020 -9176 51985 264306 -181763 74897 -47211 -26965 -92036
12515 -92036 518806 -30980 140169 53229 -218015 -151502 164925 22525 226172 302935 15042
12503 39075 334345 -131593 115848 42902 178811 248405 147749 -26841 116753 -239562
12492 64968 114917 -98223 73828 -58231 -224428 -107748 48470 -95720 66841 -177289 176427
12480 359478 83798 -85221 -228735 80665 1975 59102 -69505 92588 79593 -348098 98977
12468 -54348 158408 -37248 -70952 45077 -157150 -191155 2313 -186431 -282738 145435 -9461
12456 140607 -147932 57013 196340 268994 -5455 -55710 11744 185685 -369743 171075 -134861
12444 68653 -241507 310003 -135823 -93396 -102717 171946 -19837 -20513 392531 -212546 -152901
12433 -152901 124273 111789 -154644 194131 251848 -174223 -39721 -224842 -222561 -205365 -17435
12421 -1460 -281559 304893 3779 194074 -127611 128490 215032 -95756 -175955 -1564 -54207
12410 -54207 121512 -20886 -198041 -378312 59922 -108555 -201274 -199259 -194123 -39916 -53865
12399 -53865 42238 142949 6777 119954 36477 -1055 331792 -93012 -94607 117948 17256
12387 -176587 295691 -37450 414355 104759 -240737 -75491 -138018 39041 190799 -125556
12376 -34539 -180480 -72323 -77242 113474 69475 99618 -193517 77991 14834 113789 52206
12364 -61641 225316 -289680 23543 -182352 152745 177320 -158580 3333 -109846 57577 -87739
12352 261766 49985 -365691 -66968 -205035 9737 100752 -232586 115981 30674 97975 57665
12341 57665 -210205 -122998 62738 209738 96369 -334166 243364 499455 -42860 3584 -14033
12329 47040 -84064 45279 5333 122711 54528 -9438 -109045 -223047 -68026 -34069 101643
12317 75859 -438121 -74359 4120 -289108 141319 -270929 -6331 46915 46855 -208560 401404
12305 326145 354 -231040 -28194 51561 307332 -243562 -98412 -261228 -205636 404478 49303
12293 53297 -124125 -86362 405665 -15296 129003 -75032 178593 261281 274055 89958 223165
12282 223165 -24414 150747 212770 269591 -83488 -83571 238527 331583 436206 291979 15754
12270 30286 -127832 151881 120170 81993 71912 15317 106043 43368 58892 227901 130646
12259 130646 217628 133650 -328865 88836 174370 -36321 188808 -61071 138791 -5458 -28608
12248 -28608 136903 243200 117610 24768 57209 35800 300502 93211 275488 -72166 226819
12236 -90362 -99827 -107358 -33722 -160438 -234670 171177 -36935 -15301 181633 438484 -24123
12224 267760 -32627 204916 -49532 154112 514783 169101 96720 222870 61744 117406
12214 117406 114178 -300968 -225678 186092 238584 103955 -126719 185122 537779 66359
12203 274498 238555 -61805 -118676 3346 246910 395342 -222974 280964 389550 347025 44065
12191 53811 450771 28597 145064 194941 383549 101129 302069 175668 -10085 -158122
12181 -158122 90759 -46812 -71685 -108697 -29276 364659 205524 64081 169024 293790 556870
12170 556870 91803 106585 39827 142242 80865 448914 231629 226872 -157370 301884 13024
12158 40227 130892 106399 -35676 45918 -226504 -6466 56419 372402 148437 49885 79705
12147 79705 -89250 42822 45783 532685 149664 196573 233060 12974 -86303 -26180 -86223
12136 -86223 -261112 27800 -183828 -32217 89541 -35664 -52950 -4485 18231 -113385 151199
12124 93712 55504 4238 261659 -14113 212211 -12031 24867 156987 -96332 -116475 -49305
12112 124346 136240 219423 58368 -53655 -125560 -106709 -60046 241138 -140443 -25509 23107
12100 216546 -240575 -44575 101075 144586 81697 147934 295199 -305355 -196606 315187
12089 97838 -180149 362137 -66298 -132235 21569 -96891 -1255 216138 96921 -27830 30304
12077 -83198 184731 12000 -6242 601456 849410 2179732 731803 409766 199232 80336
12066 -82292 33371 316412 337725 465874 1528 187909 97743 251305 -142659 -249493 -32140
12054 381498 101668 -164343 31334 15489 -140741 -26481 -231554 -157959 197814 -148204
12043 -144934 112656 264307 15154 72216 29204 -105395 143168 -147292 48601 56087 -6119
12031 4726 112519 42387 -53539 -28191 31172 -170307 -5015 130708 6931 -8809 -87503 89634
12018 21974 97027 -127386 164493 73455 363992 -146986 244730 30455 190891 100813
12008 100813 100654 -149865 -142841 -156597 -137663 -169751 139479 -297889 40058 7478 47565 -245466
11995 -53413 143196 -165330 -271853 -329999 12204 -24267 -212422 -7611 85437 2101 -45136
11983 30484 210275 -136050 -37555 -171647 -162989 -98228 -9816 79272 26968 46937 -160380
11971 -70311 -59514 -74199 25360 -282273 219193 -193044 134443 -177549 12538 -17419 -117360
11960 -117360 186581 -221508 -37609 -294950 -123432 76598 -72783 204131 131370 45899
11949 351866 -48203 336078 11710 96708 -365684 -14410 -41943 137920 54193 -131980 135683
11937 12134 -133697 -78957 -35539 -15735 -127362 133962 -132640 306741 43650 106066 120297
11926 120297 469422 -12482 -295632 -150031 -15715 -142000 -239946 -146697 45013 113598 -53808
11914 -249000 133594 17733 -20222 99314 210783 -225974 49744 -61330 -43694 -39642 -531460
11903 -531460 142739 -285371 -163356 -239671 -91640 -346051 -140004 -84988 -126012 84519
11892 141398 -107813 123873 36868 28611 -105215 266733 -80849 -100417 76592 -26074 -56105
11881 -56105 81540 160818 111138 44721 11540 -82004 -41083 -15232 4952 47499 -30247 -34733
11869 -34733 185992 -174856 599 367046 -41268 -73934 -76798 -112167 -195879 -330008 -175693
11858 -175693 -96222 257789 28525 -246878 -82763 106992 -17126 -5448 -179876 -41993 -158893
11847 -158893 -14571 -190072 92034 43271 -436894 -183033 112190 -238310 -120909 346017
11836 -143052 -143642 148991 -164063 210807 -140378 -39302 178055 -173485 20888 150991
11826 150991 -69510 303356 75191 23069 318100 12071 258942 -42334 77352 26544 -128944
11814 124894 -100606 1464 -7981 -374324 152901 -171419 -98726 -2196 -63853 42188 -127608
11802 -442853 -166162 262756 207915 -103032 345063 194979 -261865 -308939 77380 -260652
11791 -18648 9882 75202 -90624 271114 -35604 131444 -31559 -37204 -258280 213284 -162284
11779 -165321 -369483 -253966 20601 -191386 -161231 191516 21683 -30979 91658 240649
11769 240649 -139057 86603 -42492 182270 -71166 -378388 -40474 143585 7523 -92025 182840
11757 -70992 -384269 -3808 27946 99624 209948 -28411 -26234 -9584 -214712 -417136 -57631
11745 -189470 -33221 -19243 -207724 81951 60680 -77506 -16646 -125425 200794 19728 360005
11734 360005 157283 189922 42885 85409 -8206 133796 191707 73202 89539 18999 -16305
11722 163613 266252 51464 -99175 240193 204667 91845 -308451 57527 -78523 -50394 -47781
11711 -47781 -16799 74238 30026 -83749 -26539 179373 -172749 -107529 -97092 -61450 267628
11699 -234801 -11879 51232 -37894 -138156 38236 320136 -217208 116599 74626 48148 117868
11688 117868 -130320 -4674 224304 -88332 60294 199552 159092 157926 -60291 196474 -118108
11676 -26046 -10206 245696 -160238 -92399 -94395 -117642 -109315 370353 203720 -251956 -428684
11665 -428684 126975 -434237 -387909 144046 95004 337883 221307 67848 78681 -23578
11654 305800 206348 88266 -217794 16359 139503 147644 -214797 -2514 -144193 151851 38894
11642 -76717 221804 137747 376799 102108 82443 77039 -135019 -209967 83076 -421258 -258818
11631 -258818 -27058 -220383 74662 -166439 -51450 6258 20559 88115 -202880 415482 170880
11619 184534 -15946 -124530 193037 256666 319339 111246 156291 46710 -255648 -65752 26725
11607 -300293 164798 76641 242046 60362 47192 -56250 406795 -11628 202947 -26813 -46199
11596 -46199 197305 -237750 70919 168637 182300 -20285 120625 376302 26023 221190 106254
11584 65210 155431 -2887 23876 65851 136304 119449 -9877 62918 119432 -282047 -181226 280394
11571 338122 412630 -36161 -102501 18169 -61064 176520 168373 218034 258260 -244512 86256
11559 -281630 -160892 -5618 -355779 350047 285038 -43425 22845 307400 -178233 232583
11548 161950 -14266 147321 111398 -156236 -21737 116419 -122767 33933 125676 440171
11538 440171 223844 183897 -27387 -12029 1904 -142281 -9438 -28938 322051 427811 -131659
11526 70729 23901 128367 454455 267565 199487 -89489 -97651 371865 161011 5891 109711
11515 109711 -194771 262244 507737 30481 222954 55774 103668 137956 253205 216303
11505 216303 134047 414692 -25807 219548 338452 -227971 48643 -298249 102682 86857
11495 86857 -18627 -47645 272156 230793 182076 -96698 127895 305525 138587 -25633 156277
11483 -30056 204509 -156299 -28007 202464 47842 177073 103503 353145 84702 -44661 -103386
11472 -103386 -69961 -38854 21088 286400 55063 48786 -206252 216260 145923 195493 238511
11461 238511 287055 -35496 149369 -183712 152012 125859 -67350 -36006 -28291 17038 -116438
11449 148104 27136 246800 373632 177187 126086 323595 -125211 320761 4376 160473
11439 160473 76990 111769 342397 25993 -45576 16696 46974 -50624 223810 -143239 -40325
11427 -8547 230469 135972 -134650 167650 311855 304663 -87397 35715 93100 -61891 7333
11415 71816 173829 66704 -128696 5106 -388429 99630 -112548 -98375 230505 -165505 160245
11403 72953 99528 99236 64507 -178221 158514 -283979 61748 168679 -187228 21814 -17757
11391 -107810 17952 -223466 -32317 -279292 -144948 155412 216068 -211414 -117269 56096
11380 243932 113568 183314 -424193 163021 207534 112425 -92235 -261123 -82523 -496480
11370 -496480 34186 -34146 32240 123190 41294 -24076 59349 -183666 334271 -279586 143002
11358 -26309 404398 -176411 -116654 -82025 16310 45654 -313656 11636 12964 201254 -208962
11346 -6387 336376 -16538 -3351 113291 -140956 135266 -202793 -136605 -218344 -19062 -94051
11335 -94051 -333324 -5644 85650 -56900 -289404 -119031 163112 331443 -105184 13930 -243366
11323 7954 84660 -44884 -22030 -68733 190574 317563 31003 142019 -33299 19492 -174069
11311 21360 7987 -66654 15847 129086 1431 149986 -53160 106672 103441 85183 -47030 -285648
11299 -285648 -92917 -61279 -331574 -31524 -275844 -132715 -174663 74852 -218115 -50244 198740
11287 39348 53501 197602 70703 -143747 -283811 157694 -86804 12948 310388 -56733 70829
11275 211594 384185 -9302 34770 123749 62299 -114802 196085 219631 154248 -39192 111409
11263 -87691 99765 -75008 420051 -130081 117693 -260076 -37215 -83769 -130273 -271497 -92667
11251 164419 -47979 -49715 115786 333929 -259601 -36419 91021 -217722 -46022 17767 81338
11240 81338 69785 164959 177945 -341183 75137 -197848 -119871 92390 48747 -75897 148548
11228 161332 114610 -44868 75542 -30910 -144072 -17154 126450 -178621 12557 32684 166630
11217 166630 119610 -244154 16339 153542 -231689 258867 -87159 -94581 266670 54321 -49042
11205 80463 24972 332903 -87910 161136 37838 110147 42986 -104013 -185135 -82168 -128092
11194 -128092 347120 87047 -67567 -178258 -206745 -59225 -93233 80316 132042 -72081 -181283
11183 -181283 -371574 131825 24376 224183 139639 -21424 41322 -339602 229353 457904
11173 457904 48656 -113570 -178175 582 -207932 -119658 -335915 -131415 174687 28412 -515697
11161 -211380 -159556 -52480 -82990 -169518 -245757 -114230 294701 -81360 -65552 -377570 -226503
11150 -226503 -42636 -178564 -53360 38832 128952 141381 -27120 -215986 -516697 -44111 -78350
11139 -78350 -45289 -43458 -75694 53778 -166589 -3734 178814 1777 14820 -205162 78908 -141098
11126 -33227 -51579 -27539 -235653 114763 194582 373937 -88703 -196479 252605 16122 101192
11115 101192 57836 -293917 185565 64831 122313 55127 198189 150693 -47201 -120420 247904
11103 115677 7745 149636 -188862 276227 76415 224788 585 -164520 193749 52385 -5584
11091 263102 265063 -196786 235037 88234 -19192 -15368 113953 54193 189140 17810 103986
11080 103986 379642 397072 341123 300262 238180 160213 202935 527793 263520 320780 227883
11069 227883 452817 312840 243692 315434 488151 506337 167725 426403 467024 300265
11059 300265 384807 502468 443677 378262 533351 726773 711533 451158 553437 688871
11049 688871 500719 607923 448280 762385 443100 871766 734375 650024 864891 659425
11039 659425 701453 251984 836865 830041 688430 645386 428960 508387 464584 655999 543382
11028 543382 432023 571085 604115 669449 714802 819662 898300 670212 569216 349509
11018 349509 630588 328297 480787 468639 826640 470970 625935 791413 391330 730914
11008 730914 349821 324715 822274 466889 752374 641165 722663 587117 428706 535271
10998 535271 612489 474173 772484 492935 646636 475801 415358 650510 634625 865536
10988 865536 854647 723687 834933 840186 1153740 1165196 994771 876546 1265317 1088646
10978 1088646 1060586 1444049 1813569 2018460 2230691 2387968 2176812 2594186 2631518 2634965
10968 2634965 2242703 2451198 2006263 1707903 1768986 1871604 1555334 1668407 1481469 1815977
10958 1815977 1468577 1858975 1448457 1627762 1631957 1037514 829475 1139694 662552 530349
10948 530349 592447 458994 533586 478656 261996 601487 276534 73630 474865 247676
10938 247676 336394 262481 97389 55722 -117426 18407 -21080 68856 201944 -38394 421031
10926 -91216 -35419 181935 9436 -5966 -333268 77742 -222472 -55521 -108823 -27416 119282
10914 234583 -190320 160682 153641 -84310 -41153 125634 -5234 48763 9478 -235676 -130329
10903 -130329 -219484 49780 67963 -306487 140063 -234911 51828 -20197 31069 186658 211876
10892 211876 65275 26740 -42946 -176802 -446190 196181 50517 -116812 -59010 46212 276616
10881 276616 337475 208131 339439 190882 258327 157122 -31781 70736 29000 -25555 -172540
10870 -172540 89952 -25814 -136921 -176255 -113233 -98328 -363635 1772 91932 -250381 -27705
10858 -101007 -78268 180812 -199927 -83743 16287 43928 -198180 -186377 -58599 -306225 8950
10846 168624 19187 173546 -222646 -70184 233028 108019 -42846 172705 -135475 -147355
10836 -147355 -92890 -139095 196760 -109504 122070 -236089 149319 44636 37113 -303212
10825 9003 -11682 224485 -147655 -421541 204475 -200066 -147403 163058 -208537 77969
10814 -371584 98044 -128315 -333050 3631 -67860 -238713 -357857 -71582 112811 -54835 362997
10802 52313 160625 273718 -66030 -140974 -172584 -373639 -123673 -170181 -260155 -112334 95570
10790 -49360 67447 19969 -64197 -37323 21888 128712 -127609 209978 -190967 102238 7524
10778 -82045 40497 -269535 -182125 56501 -271594 -59555 268851 -112123 230991 -265969
10767 -353563 16632 -173523 -51114 -131091 112428 -10055 205342 53019 -72581 -233931 -25466
10755 -6434 169417 -128739 40846 267492 43293 345100 -77565 -157126 23347 250824 122672
10743 -447972 60003 -135071 162667 -57403 93807 -23963 -102375 106493 179177 -344963 384373
10731 -128923 -8798 20301 -119246 -187504 -18521 -50303 28655 -290126 -5731 56082 -238549
10719 227075 -108986 -183434 -341956 120077 -53689 100696 -598333 -217696 8331 253634
10709 253634 -476975 65073 223970 -275257 72910 80984 165114 -105056 -110741 131496 -35065
10697 -68356 -56118 -180409 -345072 13511 160926 -66481 -116157 -160483 253270 387438 180165
10685 -30025 -237045 129739 234125 -131434 -70650 -138759 -238559 63871 -13718 173482 451246
10674 451246 -81688 82344 -21807 -348300 95960 157715 -133065 56583 -289036 -189643 -395273
10663 -395273 -228922 -173590 5957 -146280 160749 19025 64121 -146063 300320 76568 -157532
10651 -53225 3012 -121990 -25154 -19887 -205158 180013 -98023 -205748 532364 97704 205175
10640 205175 -57736 2372 -295096 -152396 -360008 146057 -18034 -120991 597474 -322267
10629 -494793 -19235 -300353 -208154 26851 99888 65822 -76614 -122420 -167747 47359 -101054
10617 -130921 -180762 -336472 -184601 -236564 -80438 -90101 -130455 -211181 41179 136744 263102
10606 263102 -80392 171916 111860 -270234 157657 9057 -112268 -200508 -395248 -18008 -142570
10595 -142570 -81324 -79278 -111052 52384 -16922 -200136 -43975 -44340 -45014 208846 -119998 -84563
10583 -84563 251766 -162905 -211498 79744 295087 224247 -331060 -53670 -174635 47992 89341
10572 89341 -303502 50298 -3198 118884 7994 120640 -29508 321139 89500 -316199 28822
10560 -33871 33335 73424 142232 160501 397674 49298 155238 -27695 -142446 -140282 130347
10548 99626 -57507 -101824 216122 -66437 -159852 -217604 107801 298501 -162262 -112770 -38240
10536 -31250 151427 -14028 -108285 -114711 42876 -163533 -126312 -183984 -276369 -117858 40962
10524 344684 -71154 -183500 120654 -388933 74532 -344935 -205351 -307866 -177579 -21600
10513 134660 -102180 -397706 -168207 -237140 54764 64121 -316237 123733 60829 199440
10503 199440 -19000 -280682 -104168 -183959 257366 470770 92838 -189044 268349 30977
10492 -34090 -36570 8036 80217 132309 -421789 -152839 177266 -48070 22434 -108597 449460
10480 265467 203751 279127 337994 135576 274745 20846 -158585 -195187 -150363 263078 -266920
10468 -126407 293164 208520 -129798 64086 374527 134548 -8375 -58096 192428 -76592 4669
10456 -346050 -1568 -105628 -123642 16069 -82687 125700 46881 -4763 30953 -67650 53933
10444 71350 49645 398105 65141 143828 31415 216570 -171969 -9279 44552 115285 217699
10433 217699 -156870 -125005 9956 -420 -329352 41212 206075 77356 -124676 122001 -82706
10421 287133 276893 77548 503313 -140493 -137415 -62911 188361 -124154 200595 224321 -380744
10409 319525 -324148 -51576 -478103 211918 219214 -40869 -135715 -123265 -8409 -187191 -199349
10398 -199349 -234100 310689 -51762 311837 47465 447297 97842 443845 322479 210333
10388 210333 175968 279590 363329 320610 188471 -88187 -6586 61327 -145841 106988 46629
10376 -127624 43501 240073 226130 114984 297837 55595 123892 298218 369122 458310 630568
10365 630568 555020 642426 292802 242202 439899 340061 250160 241592 140833 106226 194740
10354 194740 66862 391615 168937 336773 398073 479935 428633 502680 132632 316597
10344 316597 238756 409132 321394 306997 104490 162726 -44908 165625 360265 26901 315140
10333 315140 49334 55898 -57600 213734 65992 -15981 -206908 -23895 36206 126387 40061
10321 -118273 367295 178089 123877 -16637 154928 132195 347870 -16455 29484 -124537
10310 46939 27553 -120903 -117255 162281 -183392 141726 77033 15215 98327 -75035 149449
10298 -171329 -111104 -39981 161336 3804 46591 314217 310732 -194156 149892 -197212 154424
10286 -112745 -314124 139553 23320 1458 -44521 -107421 -11077 98598 -442049 -139470 -313563
10275 -313563 -33475 -381779 66035 109995 -21239 -377360 -54829 -49113 -13962 189833 172746
10264 172746 138044 248092 79556 296413 366286 199884 680578 173760 254028 182584
10254 182584 -5080 299136 -179083 -77512 -60460 -60291 -301817 35157 61248 -113372 -117565
10243 -117565 -62577 -312624 1830 75201 -65593 -231184 -111393 -27372 -81598 48207 -308607
10231 269988 -109402 108016 23666 -318902 243018 -134601 -161176 78344 -220140 -328041
10221 -328041 -10956 -138750 -203219 30986 -244513 145515 -127853 -426001 -92521 -84020 -100405
10210 -100405 143189 -18008 -130414 -101016 -78860 -169460 116453 -96406 17226 137262 -48178
10198 -134278 68070 -259530 4943 32881 46677 -95005 -305501 -12267 109358 -133241 62806
10186 52844 -120438 -162149 -109972 132287 -192749 29551 120180 -282442 -18891 -238128 119897
10174 239203 -187078 -203235 -82170 70749 -258223 435928 111072 -83772 1846 64779 -143052
10162 -4734 304183 -7851 1422 125935 -60970 125678 -334089 31156 59929 -542185 -105110
10150 -165896 -203379 -287235 -414010 82697 149393 -22394 -82259 -173290 -40670 213914 4256
10138 -230607 -143440 22233 269081 -25289 -64807 255297 -157179 -136937 106600 -5689 -81222
10127 -81222 -159428 -119175 -128438 248737 119632 -7127 -237326 21052 -32700 -227073 38159
10115 5026 -7549 -271728 -126955 -303774 35475 -5679 66873 6704 84385 401625 -222760
10103 -308534 -463577 -289492 145881 -274279 337874 -386362 -188680 134273 -220590 -21100
10092 6327 108695 53725 -20673 -133240 -176757 -135380 -138760 57386 -246737 -336529 -80358
10080 132775 28734 146344 26236 -265512 -138770 182202 -16259 1263 4161 -164141 -323376
10069 -323376 -39803 108306 -206546 -74783 -69470 -1022 66499 -422782 -199419 61123 -36750
10057 -114798 -173988 122637 -85383 55412 -29908 89752 401651 -25891 171199 -104139 -61774
10046 -61774 269642 -268260 -198101 125778 46410 -96292 -144184 -347052 -49338 209504 -13346
10034 49465 -34063 8976 -473668 84865 105318 -62171 -130679 -415302 -204368 -159098 -54461
10022 72092 121274 -146987 263075 -133268 254446 202157 -319096 -204208 84507 113095
10012 113095 -52557 -53089 -108525 18326 162351 -321673 175073 273453 -74105 64479 -236315
10000 -140337 -119954 -112545 78083 76538 -292038 21210 -202631 -315157 -189774 -309675 208798
9988 -66065 -95580 -203518 7893 -65811 -22357 33489 -181860 -151032 -79871 89301 -343640
9976 -312861 200971 -57832 -347284 -88253 236107 -380305 -75208 178678 -276053 36437
9965 -7694 161566 197044 -119159 82397 -315961 155653 138808 -127427 -226229 -66478 3426
9953 -213352 424616 -148412 -15216 -97350 -177981 170828 -42895 108911 98784 -339864 74553
9941 -284857 231871 110273 -329413 -105360 -97111 -114406 284503 -111393 -87578 -220023
9931 -220023 1243 -327744 178337 231201 -127643 -353849 27911 -429069 241249 169252 -13494
9919 62738 22851 -65068 85343 18624 -10596 -177790 -360343 -157115 -340270 -155936 -94759
9908 -94759 -297413 -56426 42750 -124197 -264851 3784 -243475 -65284 -18079 -49898 184586
9896 184293 -186408 -146894 17084 -4768 13664 52360 -9691 115461 -54635 -26431 65536 -181471
9883 -165 64016 124157 -22043 -183910 32260 42959 80279 44079 -230842 -157150 -117067 77964
9870 -220458 44583 -109069 -67298 245777 -423758 137953 -304746 35708 -185207 -258688
9860 -258688 -88802 -293558 128417 -139844 -52382 -260389 -186222 43794 -174332 -289355
9850 -289355 -250801 -168283 126928 -204465 -7167 -49074 -129386 129859 -206851 -112078 66480
9838 64203 -57514 -179934 -291348 84147 24490 -105130 170677 -97125 26098 16160 13536
9827 13536 -15505 71632 -78102 301335 -46895 -285924 332658 -425144 37012 15662 -135525
9815 35809 -109931 127234 200219 -163256 -125003 -191672 -131350 89260 123703 -164472 280621
9803 -17484 -393085 -273972 -364484 -95946 370556 -222115 -253095 -111673 63766 -317344 391039
9791 84247 -192425 -193336 123878 -187450 -70145 -126055 77616 -131540 -40630 -87706 -190616
9780 -190616 -252029 -151230 -117488 -302648 -215107 191460 313465 143901 -90602 2017 -237043
9768 128886 246497 -190415 63026 -255892 -17062 -34943 166954 -99866 -212493 59562 -385219
9756 -74440 117375 -53420 96872 73091 9927 -77995 484 -271578 -257243 -21500 -438002 -65285
9743 -111174 -111724 -297668 -253155 170394 -327432 -28969 218291 168303 225305 86665 75940
9732 75940 7845 -77190 -38059 -170449 -107815 -284720 186754 -194030 280885 -334370 -29740
9720 149992 -144765 -69522 17026 125511 82707 67278 35422 -76830 -52127 -154213 80484
9708 -50492 -313508 31133 -5621 -32950 -142608 -183173 -64318 -197607 -32282 -108298 -248150
9697 -248150 246956 -152478 -26785 77599 103130 -154387 -105853 -109430 206304 -133227 267812
9685 -214447 219525 -227454 24517 -134354 -24727 -404519 -86909 -203307 -329520 -47400
9674 -116400 -124860 -130713 -131597 -93864 -86081 -111319 -395692 -127609 -116160 79898 39526 98956
9662 98956 80461 15859 -269261 125862 -298582 -110622 151577 -150959 126349 -88609
9651 -56232 -230480 -86854 31998 42737 -156410 112762 25446 -46120 -95853 -114578 -346338
9640 -346338 -365091 -235070 -68822 -34558 173452 297564 -163610 91744 -211671 27107 171157
9629 171157 -354842 -84190 49874 -260360 181192 206766 -72844 -55405 55967 -319063 313034
9617 -273900 81932 -26113 54212 -137712 222877 121281 110158 11324 16783 74355 -225999
9605 -196119 -134231 -399491 -219164 199065 -76481 -384871 -109398 -114592 -178920 -114564 -31187
9593 -81753 98154 83919 -204085 -115732 -249056 127869 -115615 -261254 93123 -265517 -150318
9582 -150318 6567 -71272 187214 111097 276141 -262575 -82350 -142120 -291251 -94734 29179
9570 160437 -208368 -17892 -537257 -208348 -117095 96942 413091 -194559 36072 -286525
9559 -162336 43037 -70638 -6738 -209235 -130739 -181807 -334862 -4648 -375870 -143223 83228
9547 76478 140270 217410 30044 159665 197503 -162880 22085 -81364 -121309 11930 -24173
9535 73386 -284357 -70791 18699 -63951 -104763 36503 -372739 59942 -11121 -70484 -63507 90882
9522 -431729 113815 69512 -37691 69532 88182 -197781 135293 48157 33100 -12708 -45792
9511 -45792 -31266 112351 -81652 -265972 -319208 -38947 16457 155488 -193109 -13786 -11476
9500 -11476 -259210 -161016 -43116 41449 -465199 -211669 268526 -307007 182703 -495826
9489 126063 215516 -152112 -42761 4332 -107147 -171265 -198093 -315478 -101722 -27794 -196756
9478 -196756 -27471 74660 -1584 -124663 68443 -274622 -37300 -182482 40920 -118434 114117
9466 -67314 -318153 58937 -47000 286795 -247347 -292421 -67097 68509 151562 -311091 -59484
9454 51396 -20408 -125750 125718 202149 -70689 165452 -438646 -108858 -118107 -125468 36196
9442 -5914 -5697 13548 -186670 112862 -117692 -59584 -6902 -188371 -165930 -42262 73516 155940
9430 155940 58864 51373 139695 227521 -284829 233179 5600 226009 -460004 -228565 22713
9418 16137 -120994 -9478 49923 -11545 -350525 43275 -43217 94851 -158011 -135505 247914
9406 -151034 -26423 -169037 96216 -76949 8679 71762 -245194 -47610 26529 27622 -315733
9394 -243673 118291 27886 230261 -91620 117669 -259 -22761 178126 59957 330788 -7863
9382 179339 -176440 -420216 37599 -31272 191234 -90044 -100488 112006 -131409 64099 -115076
9370 -79850 235015 316677 -232057 71454 -32210 24324 106645 91302 -113900 -271417 88105
9358 58873 -19576 -408451 68178 -155288 10842 28672 -338979 -100426 155374 -126545 43950
9346 -141768 -53269 7052 -118393 51031 -347213 -100642 993 68441 -189839 164780 -80781
9334 -32698 -331391 349751 111892 19282 -330420 -111953 90961 -55865 14894 -279426 85087
9322 -368863 179560 -54921 -94942 -416369 -170017 -288985 -90859 165095 -185003 -524016
9312 -524016 11948 128673 409711 62413 160123 167620 -71377 -358934 201582 116050 302791
9301 302791 -385701 95192 102907 3174 -335892 24879 -207837 -179107 -95497 -112306 -411828
9290 -411828 -36087 -57013 90777 93881 170497 -22961 -83984 -194175 25240 -70701 -108704 249574
9277 109870 -143878 -387954 -258689 -77761 -15491 -59685 134937 -63115 -31585 -100314 -41467
9265 -216908 -224059 -257865 -465400 87556 126080 -17412 -311216 -29363 -124671 -88108 134989
9253 -462761 12056 -310261 -389276 -118328 43577 63277 -38950 -167292 -61715 32283 -426784
9241 -289148 -312248 -40925 101244 -78647 -76212 36012 -265319 20080 109294 141225 -105905
9229 44776 209570 -152707 -91929 -366858 -235104 -104825 -325341 -59285 -215837 -143387
9219 -143387 -121835 -5642 133696 271973 -184285 108351 167360 86190 -210267 -66765 -53455
9208 -53455 267413 174800 -324861 -170280 -35013 54624 -67963 -314323 70022 -59386 -805865
9197 -805865 -164335 -102506 75595 -45250 170927 -184505 19386 -124847 125912 -513434
9186 -297783 -230505 -87602 -49842 226454 -85708 -300797 48406 99001 -305428 -224266 -187602
9175 -187602 -66179 -68773 14646 64160 -196794 -436795 -48669 -20704 33762 204967 62018
9163 -78303 -253839 18497 -53217 -52477 -25704 -38540 -151035 40997 -86679 -258540 -175456 154012
9150 263121 68600 48180 99873 -120465 -177196 -174303 38207 -24137 -86666 -55836 -53104 -265900
9138 -265900 56152 -343904 156569 16245 811 -289515 -112908 -219622 -35996 -47998 11512
9126 144299 -46947 -231920 417461 -27154 -56013 305210 -85070 216467 30383 130000 4972
9114 317494 80560 -185107 89062 84286 281869 98821 -41178 -62310 -82044 -142677 79160
9102 371331 -69293 -139215 124622 -279911 -204207 54120 42099 -171924 124179 -131720 116837
9090 113003 228917 84092 -154765 456320 -74580 111980 -234283 -60074 -163107 87848
9079 -232061 85437 162078 143158 -136086 -41510 -122070 335208 -60347 67086 -115337 -86906
9068 -86906 -148589 44712 -77658 42253 -153951 21339 -248995 -136027 -23372 272031 -668442
9056 -208644 -78159 -288466 -217991 71542 -132520 254822 -188417 189165 -126664 256862
9045 -530981 112318 -97810 -75394 44821 -84447 -47455 -36640 -142598 76929 -70858 210828
9033 -80680 96472 -12004 -34191 -228315 11174 34322 -89540 328004 156346 48137 -191156
9021 -55359 -244444 142185 -413541 -242634 -215036 -269698 -284603 33576 -33905 -241874 -487001
9010 -487001 -79104 -113495 -270932 226176 29012 -42810 -109042 188110 -130282 124181 -4365
8998 114034 -292707 -70551 -177929 92869 -98692 -1484 36325 -48720 -210241 208598 -150287
8986 -108413 -57388 -227726 -283867 77507 12213 -400853 192941 52946 -197072 -21244 -262613
8975 -262613 -264869 -137605 132392 -258988 -164071 -78191 -108848 48711 -70268 25561 -205785
8963 28221 307950 -123581 -252181 -323955 -169464 -89635 -94898 -101470 82939 22754 -260038
8951 -43212 -42849 -137274 -272990 -290107 -254772 -180504 16869 -373131 -96112 -135308 -30359 234283
8938 173006 -26302 -284683 11507 71361 167676 -304491 219120 226874 -168217 146461 -55964
8926 389689 133872 141819 934207 1951154 6426198 10354088 3018277 717512 660488 236749
8915 112378 70798 194464 83897 146937 66179 116247 172993 163023 18870 242446 185853
8904 185853 60459 130080 -137547 237439 -111204 -12457 158324 35983 -281913 -1176 -66865
8893 -66865 -110368 50175 -119873 -237301 -214334 -239212 -564865 -54224 147953 -40193 -194744
8882 -194744 -411011 -112630 -125444 -170061 40962 276060 219547 -214448 59929 -174013 388092
8870 15592 84306 154448 191603 -24737 -25389 -103934 -32844 -158295 -14156 -67545 -75750 -155328
8858 -155328 -75704 -94822 156767 -179957 164124 -119260 -236603 -93679 -39865 -16503 309881
8846 321117 -162806 151211 -296185 -263937 -13271 -93404 218793 -175990 8015 -342050 135864
8834 9181 -154245 181435 -10359 -67801 259612 -34522 -55683 -47549 15686 27017 -259681
8822 -68128 -82522 -199961 -264199 65498 -223 -133929 39889 -12669 -219692 136366 -261003
8810 -179956 -133077 -264959 414054 -53941 -489546 -351071 19973 -140484 -47618 126566
8799 -156099 -16899 -332596 -122171 -78068 -158128 -61765 -46348 253331 68421 -162045 -92746
8788 -92746 -21992 -262265 -29389 -158541 146649 -63813 -12597 -142678 -374548 -9620 -477670
8777 -477670 82260 -302808 152518 -68098 -221726 176229 161534 255532 78158 -121710 187971
8765 312132 -300374 -7269 -195782 185427 -263229 -434855 -37520 -7758 -13183 11871 -176285
8753 308199 -71030 -241939 -83548 281471 -46832 74912 -272938 114705 -167971 -463292
8743 -463292 -70662 243194 -112201 -102169 -10467 -137068 -64135 169660 -264093 -384372
8733 -384372 -146598 -12261 -182823 55869 -276719 -67181 -4145 -5085 -712 -73928 -281524 28212
8720 45974 51753 -107660 -32539 91944 51974 -173258 279861 84458 144259 -62652 -112532
8709 -112532 -61 -15323 211928 -41260 -321616 -62724 -158948 -19938 -449323 33077 -171978
8697 3929 -60404 85284 823 -53823 -90304 -44380 17143 -86723 109674 -144720 93617 187069
8685 187069 -72878 -216151 22979 235484 -25585 -73143 -196157 -201043 -189501 -82580 -143147
8674 -143147 34379 -387345 -262861 171151 -108419 -378669 -170184 -33247 137115 -105268
8663 -208745 -43963 195763 106484 -28415 39908 185016 -90066 -150865 -41699 162647 -54169
8651 45019 154559 -190311 -370428 93944 -166265 159035 -190621 -143027 -280322 125456
8640 -19935 -63283 -103345 145669 -89747 379961 -324475 -7084 93501 -315239 68002 -298643
8628 103833 -246389 -102853 -261321 -80598 -292680 240998 -17954 -46587 -332764 -191736
8618 -191736 292760 -190501 21780 -57435 34158 17064 111252 60185 72883 -47513 -53007
8607 -53007 -188664 58407 -23343 96939 -88372 -133447 -140760 -29151 -47471 1596 53962 -47539
8594 57176 -42006 -345644 32313 -16088 -34675 95803 306320 -16593 213472 217 16522 -45736
8581 -482780 -41383 -223189 93308 23893 42587 -67141 81218 180270 -296127 -295053 6992 22897
8569 22897 -172907 42572 -43726 -20812 -162102 59616 80052 48556 -343125 -122834 -86177
8558 -86177 77686 17159 48395 78600 -158488 -48979 -300132 -201437 122472 -172948 162719
8546 -53309 9862 65336 -73974 2052 -9518 -125046 -169666 29236 96636 193256 -204725 -205729
8534 -205729 -110729 16107 143268 306109 -51909 20659 13262 -18607 -168840 310046 87834
8522 240617 -145412 -6339 67016 -28581 -30238 -40457 236669 -107660 -412 -186680 129175
8510 57099 294548 -206644 106166 38229 -217405 -32729 -53665 -13462 143786 -250602 -96994
8498 -119074 389288 72392 -72785 18407 -41735 7416 53749 -320477 -90872 -249795 177770
8486 -334539 -30963 -67973 -285807 -151231 -215215 -114032 -456416 -262734 61433 47362 -138767
8474 -121552 -295966 -109338 358 -444663 -68314 -144812 9542 359839 -104484 -186637 204123
8462 -52924 -84612 -219492 -37866 -64765 -349897 -59716 216753 320505 154298 39689 -257393
8450 -18244 32995 -120172 42668 -100324 155184 -179901 181636 49913 -50130 -175416 11706
8438 -301823 -488615 53445 11873 100202 -224307 -384069 165722 -36113 -119413 -110505 167326
8426 -39117 -238287 -288711 401776 41464 -56733 114893 -65976 294166 5186 -187674 -280389
8415 -280389 -423895 180388 -133571 -28160 -119520 -4681 205630 -158661 -320461 -364278 -412740
8404 -412740 -73597 -25850 370259 66884 -334216 140413 83288 -114339 123555 -199346
8393 137974 -243152 -211901 230819 145659 -17945 156988 -51189 -184185 46969 87852 -54484
8381 43843 -178893 52272 63186 220636 6884 97241 -99362 -208867 -95912 307801 110514
8369 -301711 -563752 -1638 -55698 -27868 -178533 -135944 337116 51607 -42713 12500 26746
8358 26746 63324 336553 -210993 35905 22926 2443 166170 108631 -352139 -45207 52867
8346 32101 104207 141882 130145 146594 367548 109174 219498 -223862 -12865 264782 101484
8334 -85667 81664 -185385 -232598 -214390 -884 42693 297375 123770 -299794 400201 -330996
8322 234180 277556 -143881 -327045 -203143 211014 -192641 87564 -243857 -53013 -123903
8312 -123903 122473 -316405 -106557 -63139 120357 -175627 -116052 -116426 -61755 -60467 -69906
8301 -69906 63210 23090 254119 -99260 284879 -85519 -132264 -13016 8936 -264821 -120866
8289 -173265 -168774 -237601 -223879 279164 -101619 -212643 149441 -19704 24568 -177115 70274
8277 18407 -73485 154682 24877 -185880 -135661 -75999 -116372 258369 -314326 -173476 -37972
8265 -13664 171951 472992 9188 -549595 -259070 -162639 33722 115479 -21227 -163545 -12326
8253 -92522 -162760 273315 -105453 46537 -67078 -104948 221505 -44679 107609 -75175 -194707
8242 -194707 -115050 97139 -121433 145544 98339 -13389 51677 -221641 -278749 -9254 -290046
8231 -290046 -120457 -103364 86857 -148413 55514 -157710 2115 -35712 -17656 328443 309011
8220 309011 -238127 -385000 -78982 -101497 163490 -469747 -84563 -246792 -128406 147099
8209 203435 -173381 -161904 52347 -21027 -48260 -76187 -191234 -54931 -96909 -64551 -162397
8198 -162397 -43406 164146 145126 -143117 -13542 -97 96638 -8411 -109688 -101332 -71305 290218
8185 85419 -3355 -104443 -405538 -237121 47025 -307395 -215979 -217756 -104463 213105 155488
8174 155488 11355 -32075 -123474 198854 -124542 -224519 -239336 -86966 -42805 71429 -366961
8162 188179 96760 -69493 30869 58917 -288117 -162500 -106390 315650 -239636 64122 -260494
8150 -186709 -141675 219150 -4127 -59362 -88963 156669 -515557 13531 -272948 44156 -55740
8138 431644 105019 41567 -170153 31645 -18918 -190526 -129582 120202 -9366 -138889 19400
8126 -47427 -143421 144726 -61008 2520 -186650 113096 27409 -126748 -25731 -115367 340074
8114 99837 32599 -66054 -69815 -106370 -196398 -242059 6279 -42869 -46395 -283582 -123478 -140894
8102 -140894 11393 38431 108271 90798 -63561 -113302 168592 -54198 -208864 -215506 326311
8090 -125589 51128 81130 56251 -155463 80235 -11255 270783 -318259 124499 -10591 78983
8078 130569 110596 -242791 -60689 -254668 -32753 50458 -98016 117543 -297838 -88092 41056
8066 -140150 -44812 128096 12744 -262945 68360 -80710 -76586 165127 -93455 -10382 -209925
8055 -209925 -3434 -179214 -48004 109089 93104 -256405 42409 82654 -221933 -256662 -146189
8044 -146189 89331 -47543 -84753 -127160 124630 -110196 -165410 -122750 76362 113645 96284
8033 96284 -14863 -242237 169144 181639 -114221 -58432 -99400 -146125 47174 -223673 -207091
8022 -207091 -216396 -131421 -156081 4606 441916 208933 -166811 -130279 -101790 -370103 126630
8010 6987 331372 -62699 9372 29142 -72226 -72499 -97153 -62283 -11349 29505 295472 -72754
7997 96479 -29760 -232388 196837 -118029 291802 -271690 154345 -313828 -120388 -5219
7986 -303836 -187431 -120842 -105969 -107717 -211751 372207 23844 190336 -109778 -262405 -310284
7975 -310284 -189928 126637 -92018 -94304 -65679 26861 250961 -18210 -277072 65309 139967
7964 139967 145342 14509 79118 -46506 -87380 12408 -39433 -1781 -51600 -338821 8393 123302
7952 123302 -38809 -130268 65223 -167643 259896 -171342 -14276 -340243 92122 -90333 -228423
7941 -228423 -21037 -184085 366185 17545 145167 32008 149123 173187 -124267 -291551
7931 -291551 149075 -246382 -93793 285284 -186029 -145739 -317454 183976 190567 228632 -18884
7919 67325 761 54004 -44945 -115217 376732 97178 430829 27540 314575 74740 -193896
7907 -241539 7821 16876 -26880 26984 79633 -7250 -279644 -128252 -68724 -98083 -133194 -73333
7895 -73333 27230 -371350 -315108 -157121 13786 -124098 217831 -39440 75440 148844 -197807
7883 -25784 -241156 167942 -211031 -237816 -107358 5235 -252158 -245787 41933 159583 -116227
7871 -228025 90991 59668 178144 -246224 140092 -96473 47486 11633 -96853 271764 -172424
7859 43265 -33530 -97311 293834 -304378 -276416 -24085 -416770 -7575 30301 -123682 266881
7847 -119362 217730 10082 -6001 -105247 -70444 -286418 -15306 84686 -226675 14793 -34709
7835 -6613 -279010 252726 60684 -156447 272335 -131835 327063 -351535 41424 -78 98113
7823 -189732 -236706 -247066 182585 -101662 -210097 -59516 -65108 -73524 -210418 71446 212747
7812 212747 -280028 -310672 -86811 171200 -151893 173485 72974 55638 -16731 -536822 -44528
7800 104958 -113717 -27137 -17503 -132359 -357030 35543 -183741 -20644 -120085 117436 -49113
7788 54059 76477 310157 -57590 -80361 7954 240646 -107034 -271463 -134584 237733 295360
7777 295360 -124945 414676 40052 -146047 9534 200073 167281 -60212 25485 40048 -148430
7765 -163985 -287866 -153601 -36530 -33073 -165572 -198053 -19231 -347716 -54259 -48703 176448
7753 -130209 -112324 276326 -38077 -642 87793 -26144 -58523 49255 18336 -130904 -105876 -51187
7740 -122264 -309615 94434 -229813 -149457 -45081 295699 70524 -93140 -48888 -117639 58497
7728 -115613 -123417 -171596 164864 338442 63794 363255 165658 182150 21928 -47821 312602
7716 65320 -199313 93223 -369325 25688 80028 297619 -157451 6652 37133 95750 -165755
7704 236061 -16065 -278632 -24300 -109750 -109204 -411089 -412607 -185679 -146025 -23563 67127 -255656
7691 6371 3768 33053 -211911 -75230 137675 -145586 -194976 78528 -28527 -103637 -64872 -180006
7679 -180006 335371 53939 147937 63225 311921 29964 92891 -40379 -19360 -133475 -260474
7668 -260474 -279891 -75181 3424 48021 -58689 178007 88487 194863 35076 -215057 419876
7656 -211048 -456240 -162071 -303504 156464 -320164 224171 -393088 -339272 -133710 42810
7645 119315 -21244 -143265 -86445 -135869 48248 59880 -1029 -116185 57376 -156088 -179713
7634 -179713 187250 122225 -31014 -83866 -78851 -98243 202835 -136018 -24510 41350 -181649
7622 203967 -36287 -268234 367172 13322 -14681 -175042 -128174 102821 -125 -226787 83922
7610 282495 124687 28981 33922 92385 -206086 61880 -131683 36224 268575 75199 -51783
7598 -99650 24666 -142440 23372 -18399 34522 -196465 -203275 -115521 -118399 287587 -487234
7586 89384 132871 189866 -96996 -108284 218404 -32958 39915 8796 -90535 -305381 -177046
7575 -177046 -70406 219556 255255 -137173 -308972 356700 -37144 -659333 116643 179122
7565 179122 90271 -313344 11132 162676 276631 172516 260419 -52400 -99422 115457 115057
7554 115057 -292663 -93587 -290474 -204302 27694 -68241 -127967 -4332 218722 -46883 70182
7542 -56497 -81165 83024 -48322 -117742 -125511 300329 -107520 19252 84242 -179903 184853
7530 146827 12980 152811 -188538 -304402 -216299 -59616 -221225 -61968 -100304 -201579 -5993
7518 26046 53983 97796 -140965 -75217 -132583 -301810 -280980 -202854 -435972 -176757 133487
7506 -87100 79798 13709 -54318 -147196 -125364 -20008 27824 -234837 7147 -32029 -27005 246693
7493 -97052 65679 36074 -314434 -130977 -207977 -206625 94159 54914 142829 31337 -199110
7481 -217569 -109774 210739 73416 331951 97516 167752 -66011 15404 -41283 -6513 -42274
7470 -42274 156461 -190737 202631 167933 -114423 17297 202357 -55764 -268222 67525 -249251
7458 -305423 12891 -67645 256574 -2422 -150577 -271897 -21263 -126309 226310 42724 121283
7447 121283 32457 -13323 12317 -51966 -160562 32296 92075 -177942 -288411 -13079 -225321
7436 -225321 -413043 -369921 -105714 -24158 96172 -162588 -148340 86109 -314726 -407596 -58562
7424 46741 73230 -548399 -180100 -81072 -176048 307400 -106576 -100320 -87007 -73653 -84172
7413 -84172 95112 -185805 212233 -28771 196607 320531 262979 -246325 112427 -555 204364
7401 92465 -111975 86157 -8324 -104873 167494 -169889 326225 341836 165805 -372906 -159967
7389 85709 -3077 400772 44176 106100 96544 -219292 -112681 -284208 16564 23624 111531 -170065
7376 70206 -101795 -34250 -22341 146771 -119312 -67570 -110557 -24817 -390129 -145879 -98338
7365 -98338 28467 -82588 5892 202073 270614 -219354 292083 -72571 -125420 -101323 386795
7353 3527 150555 -119113 295616 162205 -197292 307624 4157 183601 -91303 -112553 -216713
7342 -216713 -308882 158941 11498 -186196 204124 93247 126073 -45902 140654 -345748 -420693
7331 -420693 195501 27927 -107756 104788 138626 27691 -133887 36158 -128912 -186742 -213776
7320 -213776 -41669 -55631 157155 -18528 -170492 -176718 46354 207253 -51504 10618 120415
7309 120415 190001 -190668 121311 -135149 53486 43764 -320277 34377 150 -583 59651 86771
7297 86771 15486 277663 118958 -103399 64346 -144728 -320082 66643 61915 -227951 -172207
7286 -172207 -75369 30670 -71272 -106077 -122275 -8132 -7054 -228239 89453 -113779 78815 -185773
7273 20298 3160 -364894 147098 -10189 -208929 34685 79558 156469 107914 -94256 -368278
7262 -368278 -130537 11341 -369714 -43424 -392250 -169674 68970 78845 31312 303933 -160462
7250 -242666 144386 -130158 -128435 183044 680 -57693 37373 22604 -256138 75586 -80157
7238 -27010 122220 -159706 -393536 39504 -114317 -62566 33178 -80349 85651 -191117 117971
7226 -101803 153783 -326072 -67681 -304656 -129745 201504 205 -73901 -103646 332131 -360632
7214 448227 -157500 114020 -171474 -62279 124272 -183681 -39216 -305892 -61017 -354683
7204 -354683 1053 -253766 235817 114323 118445 72209 -224758 -96942 26825 -280442 -315322
7193 -315322 -139254 -51522 768 -76156 28475 67833 216761 -87223 -290979 -465618 -374275
7182 -374275 -281168 -171092 60994 -57203 -84420 -189999 -281585 -153808 -334158 92995 -19185
7170 -39256 106625 -205597 -133318 -289173 -41191 112953 111725 430740 -275398 -145647 74363
7158 -100957 125863 -225318 -51912 -13302 128793 195918 257747 -461734 11607 -113268 253369
7146 -96855 -200209 -131166 -42641 -308395 245276 -363608 112013 268716 20651 -206033
7135 130400 -30039 -282876 1646 -445119 -67936 330096 -214376 -37042 96959 -11850 223295
7123 -1674 341397 -150890 305625 170535 -83476 -39184 34588 19935 315871 131846 8494
7111 -210134 483 228956 -131171 206488 163790 -121121 -214404 -333589 -124225 30999 199245
7100 199245 -243017 -137601 -157150 -140677 249798 -23206 -25334 -189460 28369 175911 39895
7088 139379 11873 77603 -243238 36689 -3671 99023 -78262 -52469 -303454 294145 -408299
7076 25239 -51247 175124 191356 353126 -5417 29400 -53565 43847 -65030 -170872 176801
7064 -2079 76793 -15152 25002 -240868 57362 -25189 -336493 -302836 143354 96098 -257061
7052 -12491 -104994 71822 195129 154743 -238158 21995 191677 59451 144145 -32172 -50836
7041 -50836 176785 -146624 -65280 22804 -80971 -74625 -199240 -118853 -104802 -338006 -125143
7029 -48410 -99547 -246994 88862 86886 -46278 -279655 -78776 -129537 -544760 -285464 32485
7017 -282837 -144655 58012 -163205 -5343 -137924 -205795 245564 -15817 124148 -27106 149367
7005 48703 78255 171772 -93632 133240 -121751 218289 229524 88302 113998 13173 -203417
6993 74318 -194434 -4621 9305 -423573 -16282 -246695 -96356 7543 229744 107214 -156875
6981 -258607 -145829 89668 -34450 144419 -42523 -2140 -243961 -278945 -14839 45974 -114212
6969 -298267 6928 -114902 95042 11177 -98837 62617 -134699 212098 -126366 -101119 108462
6957 34875 -12672 -179689 354238 117976 -170976 261236 -223269 64288 129954 34316 186052
6946 186052 152997 -131399 -50247 233447 82810 337148 -93920 -5828 105817 -177578 278602
6934 -465834 -90520 -231481 -188705 -69507 -381826 215060 94216 44563 137722 122219 -208888
6922 443444 167104 -164161 -241250 228478 -34885 -49265 134656 -38407 -164760 -247336 -293903
6911 -293903 264705 174931 24654 169433 -251664 -49418 3413 -423291 -73565 13260 -19981
6899 252854 -46939 -202199 -137145 16265 257774 135718 -62546 -100395 -242647 290540 -42247
6887 17901 42050 -190568 -222773 13874 -38548 -63278 -201691 -264019 -41943 48583 76122
6876 76122 -253666 122213 205315 -88398 -177082 196875 -62968 310111 -109122 -31622 -194799
6865 -194799 222808 -18080 -141075 144614 21975 248875 -134836 -114667 -9475 129976 73639
6854 73639 -210506 6294 18050 -146156 -359683 -323956 184556 -125785 184908 -200710 27021
6842 -40505 53668 35196 289152 110041 137298 29490 138169 -246029 -357005 154913 -327227
6830 12479 -116021 279857 471707 -129742 13364 -63545 107665 276071 -85700 151724
6819 129540 -244070 -118105 -120407 -124739 -77176 -176952 170957 -355292 132991 -198170 94118
6807 133620 -90168 -249563 -337443 93811 -186397 -135860 -36900 -38138 242414 -430942 121696
6795 174361 -234791 -62712 -253658 4196 -258938 -28175 147278 86717 -127074 12901 176289
6784 176289 56328 15694 -5946 22036 91602 224254 57875 301414 84997 206409 49796
6772 192820 219942 36305 -230583 236184 163680 15333 -126909 -133981 -50786 -56688 97214
6760 -128272 -63875 -117551 -100105 -18639 -88928 9243 -91616 60546 188385 -314488 -58443
6748 -143414 58213 293751 -237858 -84001 -205579 128274 -348586 -25710 -328711 -104463
6737 90278 -107472 -17458 45168 -101770 -60442 -178390 -218385 -148022 -293358 187155 121466
6726 121466 185777 -111707 -283586 254995 53113 189438 -223341 -60457 100849 -164797
6715 99261 -250313 70915 275423 36339 -257387 4629 -14566 -50648 71055 -192772 -196756
6704 -196756 -115728 -7298 35444 64019 221350 153933 319344 211812 -344999 -266447 -47509
6692 -34323 -287140 76879 -172437 127660 -41800 -266587 -23168 -287668 -60895 -121201 -27705
6680 290854 90262 -12614 -17894 -32433 -55432 169342 -279728 -68773 -162 -195523 54004 351702
6668 351702 -6377 265786 238571 33105 -3128 -227886 250061 -108446 197411 61939 -299757
6656 127298 152138 281019 -73240 -107842 -193417 -287671 -195762 265228 142762 128055 -308532
6644 100132 -34284 -126257 -131413 216472 200028 -331431 -178718 -91082 253537 96468 -125960
6632 -109517 -116597 -212421 -29790 -231593 -141912 2911 -318037 -208998 79515 112111 27372
6620 42620 -17287 -35151 -215834 -19899 6129 132909 -9599 -163061 -61598 25320 295439
6609 295439 116446 77172 -5189 -49437 -99692 114377 284367 142729 -218713 -30955 47788
6597 156121 -34800 248509 -24962 10002 -47739 41967 -6038 68784 -282974 366540 120660
6585 112718 10939 -299603 -123768 -279538 -78590 -23328 154712 70310 11803 103584 -77161
6573 77540 -76324 -45767 96571 -152936 57469 -154504 241642 -296243 169811 195693 -61276
6561 7375 19389 276884 -130324 -87861 -121343 222777 238490 45468 239853 199193 2135
6549 -62670 -120503 88280 65603 -5417 -143760 43467 -98441 339308 -113309 83874 -106977
6537 -166806 78766 72584 -179978 126942 -301308 -33955 -98554 -173406 -165579 -271958 -153064
6526 -153064 19902 153651 -12530 -115149 -254006 147197 -79788 -8189 -111846 -79520 -28598
6514 149695 -82527 94653 -186926 73685 324542 -164962 -41839 -90103 258821 -173738 -308231
6503 -308231 87588 27939 69902 168847 68016 -65521 -508469 -146564 127088 55718 -156089
6491 47282 -7328 141853 253286 -195604 -11829 -391454 -326105 227971 249151 -151878 174020
6479 -235477 175831 -8926 -40516 -111380 27205 181868 -234698 68458 -307113 -113529 -116413
6468 -116413 -370 330759 279927 107724 -57946 -258145 -243758 -16907 -89546 55277 95769
6457 95769 -33813 -80794 -267909 -160038 -55032 -62476 216591 -142292 72890 134731 63056
6445 -39251 -186538 174296 -63359 -83434 218957 -46730 110436 -220380 -15150 13177 -4658
6433 62615 -380592 -382122 -112891 -282098 -135252 -111125 -57267 265498 169263 -116637 111788
6421 164393 -77833 132509 197732 -12846 57705 24754 -85172 373056 184095 -53407 -46420
6410 -46420 13704 29851 -165573 67479 1794 -54835 177523 -76492 -203082 235361 195192
6399 195192 -197862 174212 -262032 89210 -116731 -103808 118580 151125 110115 -176856
6388 -274392 -297996 20646 -22540 192071 -59980 118795 -239199 43579 102243 -111518 47587
6376 -322705 -444502 -133321 196796 34879 -382440 15411 80470 56432 -174451 222644
6365 -103158 233703 -105798 16998 198862 9612 -27870 -214493 -41945 -248498 -52710 -237216
6354 -237216 26142 -34893 318632 -140183 27561 110668 -190617 -90688 124518 75526 -277427
6342 91979 -160323 332114 -39125 99295 158074 299955 45376 149479 132447 -177424 97214
6330 354305 -158597 -75241 283287 12713 -49810 -585596 -85863 -82328 30433 160493 96107
6319 96107 134566 158911 39936 39247 -105880 -193783 33068 181363 162728 83022 19477 -191683
6306 -173899 -33773 71034 111567 -64027 -147943 -91207 -107370 112082 -8225 290922 195104
6295 195104 -387354 200143 -172220 -146736 -77851 71558 141938 -113899 20881 164794 234362
6284 234362 54093 -17379 -107566 -73286 -149166 96270 -222027 181746 125091 -67499 -26928
6272 -70221 -163135 -73403 -17980 110615 18855 -308384 -81681 -275151 303617 22306 17095
6261 17095 -767 96594 -146218 -18712 -418341 19014 58422 14171 -368992 -20347 262214
6249 64353 -96136 -34625 -41284 95641 -317265 9406 241647 84679 327247 -233942 185951
6237 74675 203454 -92052 130978 -96672 -242145 40326 -83749 61438 -412948 -19936 -284013
6226 -284013 145411 72514 -72810 105005 -77792 -180969 -267914 -295305 122445 -566 -411044
6215 -411044 -247762 362066 162939 -111576 -68357 7658 39113 67491 -268514 99040 -39237
6203 -162814 17869 -14209 79811 21200 69750 -205634 -52721 303530 -22670 430496 -259969
6191 -145310 28229 63689 27725 -106776 126861 -52315 93086 117723 149500 -213273 -246542
6180 -246542 158973 -26088 -59333 -347195 -45029 361727 74010 130820 -91273 -243189 77918
6168 -18220 -130801 10453 -407157 -63152 -337074 77591 341341 127361 31368 79118 18601
6156 -206402 38220 -428976 -163355 -12341 412766 -315947 -72688 -165759 -89044 46526 112493
6145 112493 139152 -168497 -165215 20927 -116355 26323 -113085 155095 -21348 -12871 70459
6133 336282 -188835 -198793 -336753 -30538 55163 -270783 -132748 -252865 61704 73333 -331510
6121 -60689 23257 -23493 260286 -204081 -100937 150898 -115811 -96098 182437 -52320 -16385
6109 -18610 -111145 -108875 247216 -56516 -188497 -61894 -260335 -70264 -57814 -197919 -192451
6098 -192451 -200973 -119292 117428 97260 255459 -163293 -23004 -351748 -77839 -129119 -34673
6086 201041 86131 -64337 -13924 -104714 -164034 -278441 89085 212610 233291 23368 -75954
6074 -291746 -37091 -85243 -163613 -131694 335874 -124386 -71673 154152 -53226 -240425 -129046
6063 -129046 -150732 -164191 169763 -85206 -90698 297083 136340 169474 -91452 -44013 162302
6051 68057 50365 -50217 138803 -337290 229113 178500 181591 -140834 146198 -129586 117884
6039 -39550 -4187 299507 -275276 -228891 -573776 9645 2761 -7194 -7865 -166909 187502 121542
6027 121542 -148847 -277929 -109094 224097 -179612 -234890 151241 78544 154921 300865
6017 300865 201215 82794 124765 28713 87243 -1668 37651 -213278 -63576 -67191 -52487 -127691
6005 -127691 129001 135042 -188719 46549 77513 298806 360524 -207 -98446 86193 157043 200658
5993 200658 -2815 -241175 166305 143472 244453 353059 -195599 80885 77817 -122012 27548
5981 133194 -15826 -108812 -805 -216021 163706 28581 -46791 114478 163857 110723 -74091
5969 -21535 -186013 19783 -162002 305531 193088 -240402 368430 14252 -204166 -97597
5958 66649 85789 -76839 -127738 17031 -63737 -81506 -194204 -98365 24871 110138 -104622
5946 -333916 284027 22990 -126317 138494 238675 19097 -152754 -11304 -204301 48543
5935 3251 -38876 -70404 45985 -225014 310584 -133621 3093 -209152 109962 -248386 -153728
5924 -153728 201440 -209650 237447 25762 -121430 -95344 -123629 46266 748 14763 -22902
5912 4580 -376173 183605 143697 -280986 40507 -24129 179506 135638 -13559 -71853 -108368
5901 -108368 50297 -47473 69122 -129803 21120 -241214 -134064 -151312 -123990 421260 207833
5889 -37148 -263159 -5012 -230168 -3307 -178246 -289139 -316451 55972 -18590 210608 -91473
5877 70028 -98390 -52083 -156216 -73557 -124299 -85452 -277553 3495 -207585 66220 350149
5866 350149 -420353 -163631 -129220 -178090 53029 -25163 289996 117113 16502 -24404 111310
5854 46483 59266 9886 -186394 164831 -243021 169696 -391726 -147680 28 46978 127912
5843 127912 39155 100296 113516 -456483 -24387 246590 128788 437523 47440 -1274 101552
5831 -20769 -122186 -145485 394802 -186881 47733 178249 55467 8363 -268074 5306 -133435
5819 121942 -36250 -245642 -86654 74108 23951 -187822 61660 42087 -236423 102816 -128535
5807 -128820 54362 -136120 14289 36389 27628 -57959 191363 -173518 21785 -32565 -325064
5796 -325064 -238887 68128 46241 97050 262224 78074 237889 -87465 63809 -255356 -38179
5784 64453 115409 -68827 80868 -199052 141509 53202 5404 -105458 -206473 53256 18630
5772 -180713 -16389 295549 913 -225565 370267 129938 105462 -459712 182014 -122909 -23286
5760 373160 247617 -446 -122439 -221955 -244545 -250707 19918 -218838 148747 106163 -164810
5748 -65272 -184154 65049 -172953 -268271 -53270 175672 -26218 160125 -129462 168212 -67956
5736 45028 -57817 -130112 109754 152666 22412 -97291 3007 -227248 44176 -252652 -104938
5724 43624 -107387 186421 -178722 17467 -10273 -308343 -142100 -132703 30054 143785 -213764
5712 235393 -12597 -191085 11584 -37253 -94935 1650 60297 -266191 318824 -209980 -239938
5701 -239938 19367 -263788 63836 -282508 131637 -339789 -31417 -38809 159896 299835 248154
5690 248154 -133878 -164814 219716 322716 -75901 238178 -94213 -31734 36471 55608 -219603
5678 13701 -133391 11092 159929 28612 76984 -172132 105295 -45106 256483 -73655 16586
5666 56542 -358934 187308 -52251 -147254 89847 -34454 13520 202867 162780 -298856 -63682
5654 -5568 185862 -84692 56394 -48013 100619 -197219 -379548 -9166 -179618 193150 -299110
5642 -140924 137878 46083 -50132 75518 88620 -123640 -47474 -337193 215916 -379259 100337
5630 -194902 -137542 224653 -489753 320036 -9079 54628 -192208 -166101 137375 323 -236962
5618 -50262 130618 -217310 -174951 206710 3497 -59501 224958 -317914 -212635 -206369 -247840
5607 -247840 -210377 285452 58613 196534 -98183 23828 -34210 31690 186595 -176433 328727
5595 -24111 95538 69512 -91886 -143848 -105116 81431 -99628 84944 34059 181706 -204795
5583 -298060 152696 148003 -69108 140 206190 412166 -147175 -214616 11041 111036 298732
5572 298732 -137892 15967 72331 -68563 117055 450691 74641 229731 -289773 63944 7340
5560 132048 -291376 -162454 63685 -157147 93754 185186 33036 -132451 -225539 -120642 55180
5548 -70826 -53722 55898 -79501 44474 251659 18776 -199574 5774 201472 -28183 -7041 -122868
5536 -122868 -134613 -160294 77831 -33351 159815 98821 -120866 268729 -115844 -158900 72259
5524 97304 380411 228737 75164 -227203 255956 126031 182205 155173 -309889 -163168
5514 -163168 -110688 -280672 168772 301115 -130154 153748 -22916 -50348 -190953 -318816
5504 -318816 -305802 -10457 151492 14391 -78669 -35876 173642 26111 -273276 -311181 104334
5492 -162415 -153064 302605 177663 -264987 87291 100618 -250117 17462 97328 -109419 187664
5480 -41492 -9664 -315419 -114432 -156748 -142956 -54750 -234620 298878 -381194 -111549 20772
5468 -143090 341977 -73035 -50111 90368 37490 129495 40368 -302869 -109797 191056 1214
5456 -105229 83277 -219218 -67366 -130658 -17787 106830 208299 -64558 -47318 158449 -215616
5444 -268 16917 22679 -218903 -125784 236338 -82102 -81070 -187890 123409 -185787 109715
5432 328864 117780 -125777 -97187 124628 187877 -35423 68303 89720 -276997 143428 245222
5421 245222 112498 -155752 8900 -117289 55243 61570 -109317 -175077 -37834 64577 -180658
5409 138327 -156885 25831 -76728 31002 242688 276383 -94503 138480 -172595 832 -110624
5397 125216 -187956 95431 106965 -8021 41725 -249962 -92583 -64793 283529 -107053 -255761
5386 -255761 396329 13225 130559 -128397 187030 -153578 112933 -270421 -132525 93688
5375 -67232 140502 -203515 -34888 67670 -164733 -19644 276642 307180 156457 230868 -73958
5363 -47409 -106920 137495 160118 228995 288999 5842 86407 366214 386345 139340 10908
5351 -209581 71199 -145360 34820 122017 -324596 339717 -112729 226391 -103172 317039
5340 385479 87630 -68384 -225050 49068 -108606 133472 -99939 167767 93477 -9626 -93604
5329 -93604 71222 -103701 -208280 -14680 -279743 15177 111723 87020 -69740 -132717 81098
5317 92615 -13749 -180421 -53959 53599 -58493 85383 197441 288681 237406 -12913 159314
5305 -151221 53256 18377 220496 -49913 73471 -187619 18192 -141987 -238849 100730 330067
5294 330067 -206139 -342272 -206263 -15984 13360 -234812 52212 -6226 7299 271746 270397
5283 270397 -80576 26260 304961 18149 -71131 220754 -132098 220270 232245 308495 49239
5271 -21303 243236 91381 -209944 64375 -176511 -325713 -71426 283192 -316572 210204
5260 128827 71353 285094 -7627 -228106 -251497 158455 153416 147200 -355408 -178484 4507
5248 -100794 157464 -159305 -56058 -168237 -2136 283753 -50450 4858 -185550 211151 72108
5236 73687 -212151 134737 -29168 77813 174094 -331530 207708 -11741 -77122 -476044 161579
5224 171967 -39367 191839 125894 -332026 -150890 34437 291258 -82955 -71567 -16973 277052
5212 -215793 135922 -77729 -235139 11595 337407 10336 -283732 -158214 -107130 -310005
5202 -310005 18429 198498 363271 243729 -30546 158940 171020 -158581 92851 -348617
5191 37233 250277 -110869 -198143 157592 56829 127899 -292610 -42260 -101829 -50908 277477
5179 232766 151512 10187 177533 41132 43223 4181 -5185 -66531 395111 -11383 22699 -29953
5166 -303155 13877 -102661 -104376 -98922 -330254 -23416 -53301 250966 -134785 -103209 -201763
5155 -201763 -152415 -11047 -52360 77080 32999 -77980 87881 -131899 -83984 -40530 13951
5143 -93394 279025 100909 -86162 -9812 -452701 9049 -25306 101602 51940 59272 -108813
5131 -44715 -41177 -120923 -51605 276584 -213709 29384 312 -38078 108003 -2931 -107296 -146353
5119 -146353 -144269 98528 -49594 61325 22041 107108 58313 106928 -254727 12724 -146649
5107 -243638 285033 140161 153085 -390963 -458253 459414 -50606 178941 68826 123149 -70707
5095 -5880 226021 50188 93131 59064 48727 183600 87557 -174925 -94270 3889 -67258 389883
5082 160517 -4054 -33616 -11870 -228237 440386 41244 314353 -95205 -49760 168532 75670
5070 -68465 -5338 9922 221033 -2606 -28991 119905 74178 198973 183921 -213990 -10299 122489
5057 119551 4765 81650 -139953 27600 -278281 -32145 -59138 177614 -233541 -40051 6407
5045 214082 226882 171080 148824 -269150 -83395 -574413 -25501 146790 146934 -422354 175257
5033 157473 -68052 155145 30451 60616 -64156 -44569 69750 240120 -171033 283575 76510
5021 135550 68479 177413 -100258 -29931 -83007 116503 -228710 79246 -93350 175459 -299095
5009 -5104 181646 99186 273082 185820 -64695 -61506 206315 -169374 -1232 309894 251767
4998 251767 -296980 104334 110353 398100 -121966 87876 -51093 -467676 205180 -36561 -260273
4987 -260273 506 262244 -230958 -354174 62908 54831 139860 -21792 -262921 -3057 -202833
4976 -202833 166908 -73257 288422 65868 -67716 3676 74743 -80433 -355097 -178831 232198
4964 229198 122044 -5563 -51992 259847 -160847 80600 194226 176726 142249 176741 88690
4953 88690 -103983 39385 -466000 58303 220821 -96711 -66309 90828 -15176 252287 -297296
4941 -173825 -69646 251366 -145473 -21490 52183 245033 -143515 180356 77953 -134951
4930 -370940 -97769 283345 -29961 -102923 -173026 -130126 -244064 228235 41928 175936 96043
4919 96043 -158743 -292572 -247373 -53017 -64741 36592 -547 -2006 200378 -86270 -163204 -116425
4907 -116425 58216 -189046 53923 101589 -89529 -227120 -119872 -72946 -91461 -100571 104327
4895 417 -62510 -194353 -163811 -266644 230385 63861 211151 -517 -23702 -276436 -16507 -150485
4883 -150485 73716 325847 -131368 69061 -47135 25809 -11334 -48561 -86687 59695 -285510
4871 -135970 -89588 -316488 58216 309396 91942 224052 -199631 -273966 295185 -104652
4860 -173964 -43847 -165483 8119 253217 70756 92252 -149938 -217656 -13605 -76642 41825
4848 6302 -228105 175939 -246351 -202139 -225607 -253799 -93665 17438 60766 95232 -90036
4836 -118816 43275 137262 226235 -290436 228652 43400 65001 -248393 -125986 -110338 -46129
4824 -46685 91107 -319750 -315541 98902 -106738 140429 205745 -251648 34889 142303 14323
4812 199275 -59995 93482 29469 -110300 -163263 228129 -486333 210667 188277 203748 126897
4801 126897 253222 153134 -156777 32489 46617 138725 -116129 299165 -262197 20955
4790 -139254 57030 143840 119061 101688 10764 138251 121508 -20951 -89743 204082 83490
4778 -23132 -88029 403847 -162 29756 25588 188622 -14108 70520 -63070 61272 -316006 190900
4765 182324 -192323 99866 38711 116999 -7176 68670 21035 146193 11413 -111826 -191930
4754 -191930 304277 83139 -66117 -49173 -2478 -341883 -6501 -239159 82258 -85385 450000
4742 -307853 104162 -86058 -192396 -118207 -60731 -40844 191791 343370 3638 13329 -18323
4730 -141347 42860 180232 5982 11603 123610 -2010 -250308 246463 -32357 129421 228775
4719 228775 164484 -305227 253618 22047 227282 90094 -150666 90106 112567 117747 -69735
4707 -191968 10376 121144 -88768 166021 -36710 -117690 88118 -8851 83442 21298 104841
4696 104841 43026 189518 -245388 81957 132715 186084 366644 205177 -264542 15021 -24854
4684 -19553 358794 500596 54107 204020 -4816 9650 -69794 -88007 -79219 -217058 -89911 119566
4671 436396 -147612 -332490 108969 216749 141028 217551 -149664 77838 120458 -176786
4660 18409 -215514 285923 -119084 -69983 7318 -192068 261914 -100617 -135531 75138 147526
4649 147526 -58603 -246170 129211 -165566 -21596 -12335 123021 -93891 143459 204821 -281151
4637 -72592 -88060 -11461 -225519 70897 -16908 286443 -126513 -138941 222973 -316202 -47652
4625 -33173 150600 17279 -228689 142697 -14545 -38976 -83710 -151612 -53293 -67005 -146673
4614 -146673 53360 192878 142209 84218 -54435 55894 -251198 299429 -300251 -126109 59973
4602 -31576 51408 136596 210668 120265 310604 -263324 -47067 166503 242663 97046 3763
4590 -6151 67560 -62378 299072 -100073 -36116 277428 139578 190545 106773 32845 -170023
4578 14800 -140554 272132 -85253 98917 -75540 -462471 77004 321948 296914 326459 183599
4567 183599 -41484 365082 -27860 -76041 -192702 -23545 173303 -269716 -52114 -87424 148309
4555 -34404 68029 -216352 50967 -20609 352957 -34012 200346 -153275 -272462 173111 -41610
4543 104832 -140255 296516 -315324 -105922 274603 -296594 -172936 -20872 82581 -158241
4532 161478 -40648 -173895 -136356 107258 -216430 29197 153154 126463 197500 -82249 -133958
4521 -133958 -327592 251451 225912 -35188 -22205 -31469 -315989 99478 88260 -382820 -96113
4509 -37571 -259038 -142182 -182223 -79295 -183588 39781 272876 84587 -175191 -4321 -255489
4498 -255489 342912 25398 -326495 -41810 100803 -154628 144426 -13383 151497 -115283
4487 182351 27158 -194574 -180571 58224 -101427 35432 -179791 149455 -26851 -66215 -231855
4476 -231855 214463 210451 118486 125586 65448 247486 -211175 373726 -143004 74233 -93997
$$ [...]
##END NTUPLES=NMR SPECTRUM
##END=
