##TITLE=AC1430_MEXAH13241_7764312_et2x0JPw3M
##JCAMPDX= 6.0         $$ Bruker NMR JCAMP-DX V2.0
##DATA TYPE= NMR SPECTRUM
##DATA CLASS= NTUPLES
##ORIGIN= BRUKER
##OWNER= Administrator
$$ 1.72 TOPSPIN		Version 2.1
$$ 2013-04-11 23:58:28.391 -0700  Administrator@X
$$ Compression mode = diff/dup
##.OBSERVE FREQUENCY= 400.02188249412
##.OBSERVE NUCLEUS= ^1H
##.ACQUISITION MODE= SIMULTANEOUS (DQD)
##.ACQUISITION SCHEME= undefined
##.AVERAGES= 64
##.DIGITISER RES= 22
##SPECTROMETER/DATA SYSTEM= spect
##.PULSE SEQUENCE= noesygpps1d.comp
##.SOLVENT NAME= COFFEE_meoh
##.SHIFT REFERENCE= INTERNAL, COFFEE_meoh, 1, 14.96099
##AUDIT TRAIL= $$ (NUMBER, WHEN, WHO, WHERE, PROCESS, VERSION, WHAT)
$$ ##TITLE= Audit trail, TOPSPIN		Version 2.1
$$ ##JCAMPDX= 5.01
$$ ##ORIGIN= Bruker BioSpin GmbH
$$ ##OWNER= Administrator
$$ $$ E:\/data/COFFEE/nmr/AC1430_MEXAH13241_7764312_et2x0JPw3M/12/pdata/1/auditp.txt
$$ ##AUDIT TRAIL=  $$ (NUMBER, WHEN, WHO, WHERE, PROCESS, VERSION, WHAT)
(   1,<2013-04-11 23:58:22.485 -0700>,<Administrator>,<X>,<go>,<TOPSPIN 2.1>,
      <created by zg
	started at 2013-04-11 23:46:53.138 -0700,
	POWCHK enabled, PULCHK disabled,
       configuration hash MD5:
       33 CF 6A 21 5C D3 B9 40 6C 15 AA 8D 27 A2 4F 13
       data hash MD5: 64K
       11 B4 8D F9 85 9A F1 AF E5 F5 D4 8F 02 22 F4 D9>)
(   2,<2013-04-11 23:58:25.595 -0700>,<Administrator>,<X>,<proc1d>,<TOPSPIN 2.1>,
      <Start of raw data processing
       efp LB = 0.3 FT_mod = 6 PKNL = 1 PHC0 = 0 PHC1 = 0 SI = 128K 
       data hash MD5: 128K
       C7 AC 6C A0 E7 13 54 05 D8 7D CC 94 10 17 51 E9>)
(   3,<2013-04-11 23:58:26.626 -0700>,<Administrator>,<X>,<proc1d>,<TOPSPIN 2.1>,
      <pk PHC0 = -77.73376 PHC1 = 0 
       data hash MD5: 128K
       B6 ED 43 24 CE B3 4F E9 60 8F 79 D4 2C 08 65 72>)
(   4,<2013-04-11 23:58:27.313 -0700>,<Administrator>,<X>,<proc1d>,<TOPSPIN 2.1>,
      <abs ABSG = 1 
       data hash MD5: 128K
       9C EA A9 E2 C8 9D C7 6F 5C B5 B3 3A 23 C3 4B CB>)
(   5,<2013-04-11 23:58:27.485 -0700>,<Administrator>,<X>,<proc1d>,<TOPSPIN 2.1>,
      <abs ABSG = 2 
       data hash MD5: 128K
       90 71 A5 86 42 01 51 B1 C1 1E 83 69 CC 4C BF 94>)
(   6,<2013-04-11 23:58:27.673 -0700>,<Administrator>,<X>,<proc1d>,<TOPSPIN 2.1>,
      <abs ABSG = 3 
       data hash MD5: 128K
       DF 6D 9C 8C E4 C0 EA 4C 66 90 1E 91 C3 FC D9 37>)
(   7,<2013-04-11 23:58:27.860 -0700>,<Administrator>,<X>,<proc1d>,<TOPSPIN 2.1>,
      <abs ABSG = 4 
       data hash MD5: 128K
       81 AC 8C FB 80 B0 A4 6A 41 48 7B C8 B4 6C E0 CA>)
(   8,<2013-04-11 23:58:28.032 -0700>,<Administrator>,<X>,<proc1d>,<TOPSPIN 2.1>,
      <abs ABSG = 5 
       data hash MD5: 128K
       5C 79 86 34 7A 8B A8 C4 B5 92 6E 07 0E 1D 7D E4>)
$$ ##END=
$$ 
$$ $$ hash MD5
$$ $$ D9 74 E5 7F B1 96 A9 1B AB 80 28 DB C9 46 B3 F7
##$RELAX= 
##$RELAX= 
##$RELAX= 
##$RELAX= 
##$RELAX= 
##$RELAX= 
##$RELAX= 
##$RELAX= 
$$ Bruker specific parameters
$$ --------------------------
##$DU= <E:\>
##$EXPNO= 12
$$ [...]
##$TP07= 0
##$TPNAME0= <>
##$TPNAME1= <>
##$TPNAME2= <>
##$TPNAME3= <>
##$TPNAME4= <>
##$TPNAME5= <>
##$TPNAME6= <>
##$TPNAME7= <>
##$TPOAL= (0..7)
0.5 0.5 0.5 0.5 0.5 0.5 0.5 0.5
##$TPOFFS= (0..7)
0 0 0 0 0 0 0 0
##$TUNHIN= 0
##$TUNHOUT= 0
##$TUNXOUT= 0
##$USERA1= <user>
##$USERA2= <user>
##$USERA3= <user>
##$USERA4= <user>
##$USERA5= <user>
##$V9= 5
##$VALIST= <valist>
##$VCLIST= <CCCCCCCCCCCCCCC>
##$VD= 0
##$VDLIST= <DDDDDDDDDDDDDDD>
##$VPLIST= <PPPPPPPPPPPPPPP>
##$VTLIST= <TTTTTTTTTTTTTTT>
##$WBST= 2048
##$WBSW= 25
##$XGAIN= (0..3)
0 0 0 0
##$XL= 0
##$YL= 0
##$YMAX_a= 5736091
##$YMIN_a= -12949456
##$ZGOPTNS= <>
##$ZL1= 120
##$ZL2= 120
##$ZL3= 120
##$ZL4= 120
##$ABSF1= 14.96099
##$ABSF2= -5.597192
##$ABSG= 5
##$ABSL= 3
##$ALPHA= 0
##$AQORDER= 0
##$ASSFAC= 0
##$ASSFACI= 0
##$ASSFACX= 0
##$ASSWID= 0
##$AUNMP= <proc_prof1d_extract.lims>
##$AXLEFT= 0
##$AXNAME= <>
##$AXNUC= <1H>
##$AXRIGHT= 0
##$AXTYPE= 0
##$AXUNIT= <>
##$AZFE= 0.1
##$AZFW= 0.1
##$BCFW= 0
##$BC_mod= 0
##$BYTORDP= 0
##$COROFFS= 0
##$CY= 15
##$DATMOD= 1
##$DC= 0
##$DFILT= <>
##$DTYPP= 0
##$F1P= 0
##$F2P= 0
##$FCOR= 0.5
##$FTSIZE= 131072
##$FT_mod= 6
##$GAMMA= 0
##$GB= 0
##$INTBC= 1
##$INTSCL= 1
##$ISEN= 128
##$LB= 0.3
##$LEV0= 0
##$LPBIN= 0
##$MAXI= 10000
##$MC2= 0
##$MEAN= 0
##$ME_mod= 0
##$MI= 0
##$NCOEF= 0
##$NC_proc= -2
##$NLEV= 6
##$NOISF1= 0
##$NOISF2= 0
##$NSP= 0
##$NTH_PI= 0
##$NZP= 0
##$OFFSET= 14.96099
##$PC= 1
##$PHC0= -77.73376
##$PHC1= 0
##$PH_mod= 1
##$PKNL= yes
##$PPARMOD= 0
##$PPDIAG= 0
##$PPIPTYP= 0
##$PPMPNUM= 2147483647
##$PPRESOL= 1
##$PSCAL= 4
##$PSIGN= 0
##$PYNMP= <proc.py>
##$REVERSE= no
##$SF= 400.020009640655
##$SI= 131072
##$SIGF1= 0
##$SIGF2= 0
##$SINO= 400
##$SIOLD= 131072
##$SPECTYP= <>
##$SREGLST= <1H.CDCl3>
##$SSB= 0
##$STSI= 131072
##$STSR= 0
##$SW_p= 8223.68421052631
##$SYMM= 0
##$S_DEV= 0
##$TDeff= 65536
##$TDoff= 0
##$TI= <>
##$TILT= no
##$TM1= 0
##$TM2= 0
##$TOPLEV= 0
##$USERP1= <user>
##$USERP2= <user>
##$USERP3= <user>
##$USERP4= <user>
##$USERP5= <user>
##$WDW= 1
##$XDIM= 131072
##$YMAX_p= 412126492
##$YMIN_p= -10460
##$CURPLOT= <Network HP LaserJet P1505>
##$CURPRIN= <$Network HP LaserJet P1505>
##$DFORMAT= <normdp>
##$LAYOUT= <+/1D_H.xwp>
##$LFORMAT= <normlp>
##$PFORMAT= <normpl>
##$SURQMSG= 1
$$ End of Bruker specific parameters
$$ ---------------------------------
##NTUPLES= NMR SPECTRUM
##VAR_NAME=  FREQUENCY,     SPECTRUM/REAL,   SPECTRUM/IMAG
##SYMBOL=    X,             R,               I
##VAR_TYPE=  INDEPENDENT,   DEPENDENT,       DEPENDENT
##VAR_FORM=  AFFN,          ASDF,            ASDF
##VAR_DIM=   131072,        131072,          131072
##UNITS=     HZ,            ARBITRARY UNITS, ARBITRARY UNITS
##FACTOR=    0.0627417313425164, 1,          1
##FIRST=     8223.62146879497, 1401,         -61019
##LAST=      0,             3492,            -61441
##MIN=       0,             -10460,          0
##MAX=       8223.62146879497, 412126492,    0
$$ Real data points
##PAGE= N=1
##DATA TABLE= (X++(R..R)), XYDATA
$$ [...]
$$ plain form
61658 398143 399699 401709 404344 407082 409461 411460 413098 414365 415708 417794 420502 422846 424247 425267
61644 425267 426686 428353 429477 429726 429612 429947 431199 433193 435267 436891 438205 439685 441242 442103 441799
61629 441799 440822 439908 438978 437244 434251 430363 426207 422005 417629 413147 408976 405459 402488 399785 397508
61614 397508 396281 396458 397554 398506 398322 396470 393031 388710 384350 380106 375436 370148 364996 360759 357206
61599 357206 353711 350490 348348 347251 346056 343787 340425 336358 331924 327784 324943 323790 323579 323310 322703
61584 322703 321943 320971 319561 317823 316105 314563 313204 312142 311449 310914 310311 309802 309705 309864 309634 308624 307297
61567 307297 306635 307155 308352 309247 309493 309714 310604 312045 313491 314886 316600 318565 320166 321130 321941 323147
61551 323147 324753 326531 328399 330202 331548 332248 332548 332660 332482 332155 332447 334042 336628 339178 341048 342476
$$ packed form
61658C98143J556K010K635K738K379J999J638J267J343K086K708K344J401J020
61644D25267J419J667J124K49j14L35J252J994K074J624J314J480J557Q61l04
61629D41799r77r14r30j734k993l888m156m202m376m482m171l517k971k703k277
61614C97508j227J77J096R52j84j852l439m321m360m244m670n288n152m237l553
61599C57206l495l221k142j097j195k269l362m067m434m140k841j153k11k69o07
61584C22703p60r72j410j738j718j542j359j062o93n35o03n09r7J59k30j010j327
61567C07297o62N20J197Q95K46K21Q90J441J446J395J714J965J601R64Q11J206
61551C23147J606J778J868J803J346P00L00J12j78l27K92J595K586K550J870J428
$$ plain form
61535 342476 344115 346449 349526 352865 355605 357053 357187 356533 355607 354649 353754 352956 352139 351038 349429 347350
61519 347350 345131 343182 341650 340311 338907 337521 336462 335893 335807 336213 337006 337720 337865 337574 337431 337537 337240
61502 337240 336017 334212 332608 331686 331679 332945 335662 339244 342535 344702 345786 346418 347250 348640 350625 353026
61486 353026 355514 357642 358972 359389 359205 358847 358513 358382 358881 360296 362192 363758 364816 365974 367672 369595
61470 369595 371183 372158 372264 371134 368902 366524 364958 364228 363682 362911 362028 361235 360594 360129 359803 359471 359074
61453 359074 358778 358776 359131 359887 361031 362195 362834 362986 363433 364802 366851 369047 371364 374017 376743 379012
61437 379012 380743 382269 383729 385086 386651 388924 391869 394805 397171 399037 400719 402280 403568 404532
61423 404532 405380 406469 408022 409880 411666 413295 415131 417441 419915 421932 423122 423460 423105 422378 421573
$$ packed form
61535C42476J639K334L077L339K740J448J34o54r26r58q95p98q17j101j609k079
61519C47350k219j949j532j339j404j386j059n69q6M06P93P14J45k91j43J06k97
61502C37240j223j805j604r22pJ266K717L582L291K167J084O32Q32J390J985K401
61486C53026K488K128J330M17j84l58l34j31M99J415J896J566J058J158J698J923
61470C69595J588R75J06j130k232k378j566p30n46p71q83p93o41m65l26l32l97
61453C59074k96kL55P56J144J164O39J52M47J369K049K196K317K653K726K269
61437C79012J731J526J460J357J565K273K945K936K366J866J682J561J288R64
61423D04532Q48J089J553J858J786J629J836K310K474K017J190L38l55p27q05
$$ plain form
61408 421573 420425 418114 414275 409763 405879 403069 400866 398852 396968 395028 392733 390306 388411 387206
61394 387206 386078 384574 383082 382195 381856 381571 381184 380974 381125 381550 382231 383408 385255 387536 389794 391874
61378 391874 394085 396671 399264 401262 402820 405039 408780 413579 418167 421858 424922 427685 429909 431298
61364 431298 432196 433420 435531 438367 441137 442976 443673 444014 445206 447896 451852 456535 461701 467395 473707
61349 473707 480730 488550 497013 505552 513332 519609 524029 526809 528609 530043 531237 531967 532260 532665 533845
61334 533845 536040 538953 542006 544595 546263 546850 546541 545708 544638 543365 541828 540167 538742 537695 536656
61319 536656 535242 533816 533289 534041 535525 537269 539819 544153 550442 557910 565775 573722 581633 589532 597953
61304 597953 607707 618959 630840 642138 652006 659831 664923 666802 665610 661961 656502 649782 642278
$$ packed form
61408D21573j148k311l839m512l884k810k203k014j884j940k295k427j895j205
61394C87206j128j504j492q87l39k85l87k10J51M25O81J177J847K281K258K080
61378C91874K211K586K593J998J558K219L741M799M588L691L064K763K224J389
61364D31298Q98J224K111K836K770J839O97L41J192K690L956M683N166N694O312
61349D73707P023P820Q463Q539P780O277M420K780J800J434J194P30K93M05J180
61334E33845K195K913L053K589J668N87l09q33j070j273j537j661j425j047j039
61319E36656j414j426n27P52J484J744K550M334O289P468P865P947P911P899Q421
61304E97953R754J1252J1881J1298R868P825N092J879j192l649n459o720p504
$$ plain form
61291 642278 634220 625564 616430 607449 599307 592015 585014 578132 572098 567781 565101 563041 560778 558497
61277 558497 556953 556545 557125 558548 560902 564125 567811 571691 576057 581381 587607 594015 599770 604533 608734
61262 608734 613402 619568 627546 636807 646512 655990 664718 672318 678890 684948 690648 695319 698224 699504
61248 699504 699861 699513 698131 695789 693258 691128 689138 686740 683884 680940 678115 675320 672473 669619 666737
61233 666737 663683 660354 656815 653299 650189 648026 647365 648433 650873 654044 657678 662115 667577 673379
61219 673379 678325 681904 684630 687134 689559 692138 695625 700467 705922 710665 713992 715838 716014 714354
61205 714354 711569 709064 707710 707398 707875 709327 711973 715815 721141 728706 739071 752146 767545 784843
61191 784843 803165 821114 837492 851703 863217 871319 875887 877930 878694 878502 877052 874564 871893
$$ packed form
61291F42278q058q656r134q981q142p292p001o882o034m317k680k060k263k281
61277E58497j544m08N80J423K354L223L686L880M366N324O226O408N755M763M201
61262F08734M668O166P978R261R705R478Q728P600O572O058N700M671K905J280
61248F99504L57l48j382k342k531k130j990k398k856k944k825k795k847k854k882
61233F66737l054l329l539l516l110k163o61J068K440L171L634M437N462N802
61219F73379M946L579K726K504K425K579L487M842N455M743L327J846J76j660
61205G14354k785k505j354l12M77J452K646L842N326P565J0365J3075J5399J7298
61191G84843J8322J7949J6378J4211J1514Q102M568K043P64j92j450k488k671
$$ plain form
61178 871893 869531 867094 863895 859589 854099 847331 839236 830049 820327 810708 801576 792829 784015 774773
61164 774773 765097 755140 744981 734671 724364 714210 704243 694498 685174 676613 669235 663525 659855
61151 659855 658191 658157 659504 662256 666242 670706 674598 677027 677218 674422 668354 659687 649685 639281
61137 639281 628746 618255 608426 600161 594052 590036 587531 585929 585070 585330 587275 591246 597232 604913
61123 604913 613703 622958 632388 642270 653260 666048 681264 699349 720117 742550 765381 788035
61111 788035 810818 834145 857819 881178 903750 925492 946417 966168 984131 999920 1013613
61100 1013613 1025344 1034669 1040488 1041686 1037877 1029564 1017729 1003293 986815 968491 948402 926827
61088 926827 904369 881771 859609 838045 816856 795836 775336 756296 739468 724655 710939
$$ packed form
61178H71893k362k437l199m306n490o768q095r187r722r619r132q747q814r242
61164G74773r676r957j0159j0310j0307j0154r967r745r324q561p378n710l670
61151F59855j664l4J347K752L986M464L892K429J91k796o068q667j0002j0404
61137F39281j0535j0491r829q265o109m016k505j602q59K60J945L971N986P681
61123F04913Q790R255R430R882J0990J2788J5216J8085K0768K2433K2831K2654
61111G88035K2783K3327K3674K3359K2572K1742K0925J9751J7963J5789J3693
61100A013613J1731R325N819J198l809q313j1835j4436j6478j8324k0089k1575
61088I26827k2458k2598k2162k1564k1189k1020k0500j9040j6828j4813j3716
$$ plain form
61077 710939 697695 685115 673745 663873 655459 648322 642193 636881 632620 629924 628864 628804 629165 630110
61063 630110 631999 634510 636889 638981 641401 644731 649127 654741 661803 670097 678992 688374 698974 711352
61049 711352 725082 739544 755026 772377 791769 812564 834335 857327 881847 907813 935084
61038 935084 963746 993909 1025541 1058518 1092455 1126626 1160740 1195813 1233479 1274199 1316899
61027 1316899 1360735 1406276 1454279 1504030 1553879 1603164 1652827 1704419 1759234 1818405 1883204
61016 1883204 1955234 2036546 2129226 2234408 2352155 2482979 2629427 2796255 2990186 3220277
61006 3220277 3497485 3832694 4236119 4719957 5300536 5996505 6827186 7816136 8994377
60997 8994377 10393076 12027926 13887282 15923846 18036542 20049453 21729185 22869464
$$ packed form
61077G10939j3244j2580j1370r872q414p137o129n312m261k696j060o0L61R45
61063F30110J889K511K379K092K420L330M396N614P062Q294Q895R382J0600J2378
61049G11352J3730J4462J5482J7351J9392K0795K1771K2992K4520K5966K7271
61038I35084K8662L0163L1632L2977L3937L4171L4114L5073L7666M0720M2700
61027A316899M3836M5541M8003M9751M9849M9285M9663N1592N4815N9171O4799
61016A883204P2030Q1312R2680J05182J17747J30824J46448J66828J93931K30091
61006C220277K77208L35209M03425M83838N80579O95969Q30681R88950J178241
60997H994377J398699J634850J859356K036564K112696K012911J679732J140279
$$ plain form
60989 22869464 23401570 23440503 23222139 22984712 22885800 22984833 23247987 23540502 23635859 23288311
60979 23288311 22349684 20845983 18952940 16898402 14872287 12993374 11319987 9869680
60971 9869680 8633580 7589034 6710758 5975524 5361558 4848694 4420150 4062187 3761893
60962 3761893 3506975 3287547 3096395 2927520 2776054 2639356 2516269 2404935 2302766
60953 2302766 2208526 2122696 2045386 1975295 1910915 1851124 1794170 1737723 1680704 1623928 1568426
60942 1568426 1514295 1461605 1411026 1362847 1316543 1271929 1229623 1189759 1151488 1114444 1079437
60931 1079437 1046841 1015538 984478 954308 926354 900875 877327 855535 835483 816703 798904
60920 798904 782673 768533 755866 743703 732057 721500 711994 703153 695226 688836 684017 680347 677665
$$ packed form
60989B2869464N32106L8933k18364k37427r8912R9033K63154K92515R5357l47548
60979B3288311r38627j503701j893043k054538k026115j878913j673387j450307
60971I869680j236100j044546q78276p35234o13966n12864m28544l57963l00294
60962C761893k54918k19428j91152j68875j51466j36698j23087j11334j02169
60953B302766r4240q5830p7310p0091o4380n9791n6954n6447n7019n6776n5502
60942A568426n4131n2690n0579m8179m6304m4614m2306l9864l8271l7044l5007
60931A079437l2596l1303l1060l0170k7954k5479k3548k1792k0052j8780j7799
60920G98904j6231j4140j2667j2163j1646j0557r506q841p927o390m819l670k682
$$ plain form
60907 677665 675838 674271 672489 670778 669457 668015 665918 663747 662401 661589 660279 658377 656754 655683
60893 655683 654477 652734 650762 648580 645575 641498 636981 632692 628689 624874 621358 617986 614073 609023
60879 609023 602849 595843 588144 579848 571257 562828 555042 548256 542443 537138 531971 527095 522740 518580
60865 518580 514080 509374 505285 502492 501096 500931 501745 503103 504502 505639 506274 506046 504900 503520 502756
60850 502756 502624 502396 501704 501026 501047 501918 503213 504258 504508 503970 503249 502890 502749 502242 501077 499383 497364
60833 497364 495196 493099 491135 489160 487336 486297 486331 486768 486815 486668 487018 487842 488569 489206 490188 491092 490710
60816 490710 488763 486551 485275 484493 482920 480226 477296 474896 472756 470035 466323 462015 457862 454307
60802 454307 451341 448845 446736 444587 441607 437485 433032 429471 427142 425338 423242 420542 417281 413723
$$ packed form
60907F77665j827j567j782j711j321j442k097k171j346q12j310j902j623j071
60893F55683j206j743j972k182l005m077m517m289m003l815l516l372l913n050
60879F09023o174p006p699q296q591q429p786o786n813n305n167m876m355m160
60865E18580m500m706m089k793j396j65Q14J358J399J137O35k28j146j380p64
60850E02756j32k28o92o78K1Q71J295J045K50n38p21l59j41n07j165j694k019
60833D97364k168k097j964j975j824j039L4M37M7j47L50Q24P27O37R82R04l82
60816D90710j947k212j276p82j573k694k930k400k140k721l712m308m153l555
60802D54307k966k496k109k149k980m122m453l561k329j804k096k700l261l558
$$ plain form
60788 413723 410412 407874 406114 404745 403474 402049 399985 397045 393901 391586 390187 388776 386812 384934
60774 384934 384089 384474 385649 387183 388775 390188 391462 392984 395071 397735 401040 405283 410428 415563 419415
60759 419415 421510 422733 424548 427601 431103 433728 435088 435988 437182 438367 438747 438121 436953 435725 434738
60744 434738 434194 433846 432877 430844 428487 426806 425513 423219 419148 413785 407857 401615 395328 389604 384794
60729 384794 380700 377195 374499 372554 370721 368501 366089 363982 362492 361833 362072 362709 362879 362295 361518 361059
60713 361059 360705 360081 359378 359115 359511 360374 361321 361908 361979 362012 362751 364354 366373 368541 370894 373032 374201
60696 374201 374533 375368 377700 380901 383693 385852 388224 391350 394844 398013 400544 402617 404735 407361 410419
60681 410419 413308 415648 417761 420123 422661 424945 426774 428199 429212 429833 430279 430700 430962 431025 431217 431663
$$ packed form
60788D13723l311k538j760j369j271j425k064k940l144k315j399j411j964j878
60774C84934q45L85J175J534J592J413J274J522K087K664L305M243N145N135L852
60759D19415K095J223J815L053L502K625J360R00J194J185L80o26j168j228r87
60744D34738n44l48r69k033k357j681j293k294m071n363n928o242o287n724m810
60729C84794m094l505k696j945j833k220k412k107j490o59K39O37J70n84p77m59
60713C61059l54o24p03k63L96Q63R47N87P1L3P39J603K019K168K353K138J169
60696C74201L32Q35K332L201K792K159K372L126L494L169K531K073K118K626L058
60681D10419K889K340K113K362K538K284J829J425J013O21M46M21K62O3J92M46
$$ plain form
60665 431663 431631 430028 426509 421756 416675 411718 407000 402669 398963 396040 393886 392389 391472 391105 391121 391169
60649 391169 391080 391219 392156 393985 396311 398844 401551 404120 405823 406174 405331 403657 401272 398306 395116 391890
60633 391890 388435 384771 381554 379411 378032 376514 374524 372757 372210 373281 375496 377894 379653 380607 381128
60618 381128 381505 381601 381227 380587 380033 379537 378708 377379 375985 375279 375674 376905 378365 379768 381239 382659 383349
60601 383349 382893 382069 382287 384041 386424 388252 389116 389202 388779 388283 388484 390007 392796 396220 399541 402170
60585 402170 403850 404832 405626 406403 406865 406800 406391 405862 405269 404829 405042 406187 408002 410101 412477 415444 419405
60568 419405 424782 431795 440104 449034 458297 468161 478778 489755 500474 510318 518452 523979 526675
60555 526675 527087 525716 522625 518131 513262 509023 505665 503107 501569 501289 502016 503399 505624 509234 514482
$$ packed form
60665D31663l2j603l519m753n081m957m718m331l706k923k154j497r17l67J6M8
60649C91169q9J39R37J829K326K533K707K569J703L51q43j674k385k966l190l226
60633C91890l455l664l217k143j379j518j990j767n47J071K215K398J759R54N21
60618C81128L77R6l74o40n54m96q29j329j394p06L95J231J460J403J471J420O90
60601C83349m56q24K18J754K383J828Q64Q6m23m96K01J523K789L424L321K629
60585D02170J680R82P94P77M62o5m09n29n93m40K13J145J815K099K376K967L961
60568D19405N377P013Q309Q930R263R864J0617J0977J0719R844Q134N527K696
60555E26675M12j371l091m494m869m239l358k558j538k80P27J383K225L610N248
$$ plain form
60540 514482 521267 529504 539264 550682 563936 579007 595351 612255 629663 648065 667266 685815
60528 685815 702052 715184 724941 730808 732241 729224 722175 711772 699334 686757 675268 664562
60516 664562 653768 642997 633327 625606 619921 615944 613164 611038 609563 609493 611365 614603 618308 622724
60502 622724 629209 638832 651705 667629 686691 709099 735018 764668 798060 834498 872695 911477
60490 911477 950091 987766 1023264 1054996 1081612 1102802 1119595 1133435 1144624 1152044 1154660 1152658
60478 1152658 1146518 1135485 1117891 1092805 1060719 1022842 980558 935618 890086 845736 803738
60467 803738 764820 729308 697053 667749 641350 617896 597117 578570 562020 547341 534281
60456 534281 522688 512682 504177 496539 489203 482323 476310 471088 466396 462466 459642 457596 455712 454014
$$ packed form
60540E14482O785Q237R760J1418J3254J5071J6344J6904J7408J8402J9201J8549
60528F85815J6237J3132R757N867J433l017p049j0403j2438j2577j1489j0706
60516F64562j0794j0771r670p721n685l977k780k126j475p0J872L238L705M416
60502F22724O485R623J2873J5924J9062K2408K5919K9650L3392L6438L8197L8782
60490I11477L8614L7675L5498L1732K6616K1190J6793J3840J1189P420K616k002
60478A152658o140j1033j7594k5086l2086l7877m2284m4940m5532m4350m1998
60467H03738l8918l5512l2255k9304k6399k3454k0779j8547j6550j4679j3060
60456E34281j1593j0006q505p638p336o880o013n222m692l930k824k046j884j698
$$ plain form
60442 454014 452904 452093 450719 448596 446515 445138 444312 443676 443227 442990 442631 441749 440269 438443 436732 435654
60426 435654 435335 435302 435068 434756 434617 434177 432678 430354 428447 427764 427944 428382 429163 430569 432247 433470 434083
60409 434083 434717 436033 437972 439809 440913 441427 442094 443406 445155 446918 448641 450520 452659 455174 458277
60394 458277 461863 465356 468399 471348 474638 478043 481065 483685 486125 488301 490177 492254 494906 497570
60380 497570 499489 500989 503063 505855 508533 510623 512479 514429 516404 518509 521036 523786 526232 528468
60366 528468 531119 534175 536916 539130 541348 543545 544721 544444 543918 544816 547559 551279 554971 558254 561489
60351 561489 565556 571006 577182 582735 587279 591792 597018 602275 606370 609017 610659 611475 611304 610209 608402
60336 608402 605772 602042 597316 592171 587357 583524 580843 578606 575693 571768 567641 564111 560939 557378
$$ packed form
60442D54014j110q11j374k123k081j377q26o36m49k37l59q82j480j826j711j078
60426D35654l19l3k34l12j39m40j499k324j907o83J80M38P81J406J678J223O13
60409D34083O34J316J939J837J104N14O67J312J749J763J723J879K139K515L103
60394D58277L586L493L043K949L290L405L022K620K440K176J876K077K652K664
60380D97570J919J500K074K792K678K090J856J950J975K105K527K750K446K236
60366E28468K651L056K741K214K218K197J176k77n26Q98K743L720L692L283L235
60351E61489M067N450O176N553M544M513N226N257M095K647J642Q16j71j095j807
60336F08402k630l730m726n145m814l833k681k237k913l925m127l530l172l561
$$ plain form
60322 557378 553241 548918 544697 540666 537083 534249 532109 530369 528982 528169 528074 528697 530170 532935 537634
60307 537634 544830 554635 566590 580162 595409 612809 632369 653220 674130 693917 711244 724530
60295 724530 732512 734691 731055 721746 707284 688860 668174 647092 627429 610516 596645 585182
60283 585182 575464 567408 561220 556833 553757 551216 548399 544941 541203 537710 534348 530545 526219 521931
60269 521931 518079 514573 511457 509094 507416 505634 503138 500192 497389 494877 492506 490283 488328 486666
60255 486666 485352 484443 483727 482914 482249 482333 483139 483866 484141 484655 486084 487972 489274 489596 489285 488663 487788 486824
60237 486824 486121 485921 486182 486568 486629 486303 486266 487309 489283 491307 493129 495560 499270 503927 508887 513970
60221 513970 519029 523555 527427 531421 536274 541769 547380 553232 559629 566207 572464 578818 586203 594811
$$ packed form
60322E57378m137m323m221m031l583k834k140j740j387q13r5O23J473K765M699
60307E37634P196R805J1955J3572J5247J7400J9560K0851K0910J9787J7327J3286
60295G24530P982K179l636r309j4462j8424k0686k1082j9663j6913j3871j1463
60283E85182r718q056o188m387l076k541k817l458l738l493l362l803m326m288
60269E21931l852l506l116k363j678j782k496k946k803k512k371k223j955j662
60255D86666j314r09p16q13o65Q4Q06P27K75N14J429J888J302L22l11o22q75r64
60237D86824p03k00K61L86O1l26l7J043J974K024J822K431L710M657M960N083
60221E13970N059M526L872L994M853N495N611N852O397O578O257O354P385Q608
$$ plain form
60207 594811 604031 613377 622723 631762 640113 647915 655625 663166 669959 675818 681147 686247 690925 694919
60193 694919 698164 700616 702226 703124 703436 702892 701042 697887 694015 690075 686329 682567 678216 672718 666176
60178 666176 659443 653288 647695 642320 637281 632960 629276 625741 622163 618800 615897 613606 612226 611936
60164 611936 612227 612087 610867 608645 605842 602939 600544 599176 598749 598598 598196 597629 597289 597384 597898 598835 600280
60147 600280 602264 604704 607548 610843 614467 617771 619906 620866 621883 624182 627581 631097 634813 640084
60133 640084 647561 656077 664144 671674 679386 687170 694107 699714 704145 707343 708924 709012 708436 708012 708125
60118 708125 708980 710602 712516 714031 715053 716255 718324 721297 724648 727718 730033 731423 731906 731416 729868
60103 729868 727477 724673 721531 717733 713319 708869 704605 699989 694840 690213 687298 685835 684530 682843
$$ packed form
60207E94811R220R346R346R039Q351P802P710P541O793N859N329N100M678L994
60193F94919L245K452J610Q98L12n44j850l155l872l940l746l762m351n498o542
60178F66176o733o155n593n375n039m321l684l535l578l363k903k291j380k90
60164F11936K91j40j220k222k803k903k395j368m27j51m02n67l40R5N14R37J445
60147F00280J984K440K844L295L624L304K135R60J017K299L399L516L716N271
60133F40084P477Q516Q067P530P712P784O937N607M431L198J581Q8n76m24J13
60118G08125Q55J622J914J515J022J202K069K973L351L070K315J390M83m90j548
60103G29868k391k804l142l798m414m450m264m616n149m627k915j463j305j687
$$ plain form
60089 682843 681479 681144 681613 682153 682249 681859 681389 681413 681964 682265 681657 680543 679785 679385 678529 676810 674584 672026
60071 672026 668587 663586 656790 648336 638672 628738 619578 611532 604168 597087 590345 584026 577972 572122
60057 572122 566731 562072 558175 554878 551906 548974 546185 544132 543218 543090 543260 544022 546025 549137 552614
60042 552614 556436 561496 568172 575501 582244 588076 593268 597749 601135 603384 604806 605541 605404 604234 602101
60027 602101 599173 595623 591695 587715 583916 580177 575994 570914 565069 559110 553511 548216 543055 538042
60013 538042 533026 527513 521380 515369 510276 505905 501507 497060 493393 491045 489691 488761 487997 487224 486200
59998 486200 485024 484293 484550 485721 487197 488299 488725 488833 489490 491415 494694 499035 504200 509896 515540
59983 515540 520613 525120 529312 533136 536334 538840 540673 541698 541843 541228 539707 536810 532766 528997 526702
$$ packed form
60089F82843j364l35M69N40R6l90m70K4N51L01o08j114p58m00q56j719k226k558
60071F72026l439n001o796q454r664r934r160q046p364p081o742o319o054n850
60057E72122n391m659l897l297k972k932k789k053r14j28J70P62K003L112L477
60042E52614L822N060O676P329O743N832N192M481L386K249J422P35j37j170k133
60027F02101k928l550l928l980l799l739m183n080n845n959n599n295n161n013
60013E38042n016n513o133o011n093m371m398m447l667k348j354r30p64p73j024
59998D86200j176p31K57J171J476J102M26J08O57J925L279M341N165N696N644
59983E15540N073M507M192L824L198K506J833J025J45o15j521k897m044l769k295
$$ plain form
59968 526702 525374 523621 521169 519008 517804 517327 517492 518780 521457 525249 529947 535346 540458 543877 545296
59953 545296 545765 546142 546209 545622 544684 543680 542399 540941 540120 540357 540893 540847 540448 540490 541025 541369 541001 539831
59935 539831 537912 535565 533519 532389 532140 532492 533584 535776 539011 542806 546760 550755 554907 559644 565639
59920 565639 573296 582397 592396 602818 613230 623184 632502 641371 649881 657668 664160 668977 672016 673466
59906 673466 673933 674200 674655 675147 675378 675035 673563 670495 666255 662126 659053 656816 654652 652213 649632 647081
59890 647081 644756 643009 642204 642538 644151 647041 650738 654464 657873 661298 665143 669460 674324 680023 686494
59875 686494 692972 698706 703761 708768 714014 719043 723002 725244 725838 725564 725131 724387 722670 719969 717120
59860 717120 714676 712236 709226 705788 702400 699074 695474 691608 688019 685353 683992 683903 684734 686274 688899
$$ packed form
59968E26702j328j753k452k161j204m77J65J288K677L792M698N399N112L419J419
59953E45296M69L77O7n87r38j004j281j458q21K37N36m6l99M2N35L44l68j170
59935E39831j919k347k046j130k49L52J092K192L235L795L954L995M152M737N995
59920E65639P657R101R999J0422J0412R954R318Q869Q510P787O492M817L039J450
59906F73466M67K67M55M92K31l43j472l068m240m129l073k237k164k439k581k551
59890F47081k325j747q05L34J613K890L697L726L409L425L845M317M864N699O471
59875F86494O478N734N055N007N246N029L959K242N94k74m33p44j717k701k849
59860G17120k444k440l010l438l388l326l600l866l589k666j361q9Q31J540K625
$$ plain form
59845 688899 693199 699053 705467 711387 716194 719269 719813 717643 713837 710123 707709 706796 706876 707252 707446 707177
59829 707177 705811 702227 695977 688460 681984 677502 674083 670776 667924 666104 664887 663588 662566 662812
59815 662812 664598 667283 670118 672589 674265 674995 675038 674461 672718 669341 664759 659852 655001 650151 645500
59800 645500 641458 638053 634954 631980 629115 626144 622778 619079 615424 612087 609088 606270 603349 600174
59786 600174 597122 594808 593183 591477 589341 587401 586199 585282 584048 582910 582714 583388 584072 584383 584707 585391
59770 585391 586488 588314 591395 595717 600652 605754 611114 616824 622627 628272 633771 639178 644474 649732
59756 649732 655079 660467 665843 671573 678310 686283 694955 703482 711405 718866 726232 733479 739974 745098
59742 745098 749092 752866 756788 760117 761975 762419 762145 761496 760345 758678 756718 754533 751979 748991 745619
$$ packed form
59845F88899M300N854O414N920M807L075N44k170l806l714k414r13Q0L76J94k69
59829G07177j366l584o250p517o476m482l419l307k852j820j217j299j022K46
59815F62812J786K685K835K471J676P30M3n77j743l377m582m907m851m850m651
59800F45500m042l405l099k974k865k971l366l699l655l337k999k818k921l175
59786F00174l052k314j625j706k136j940j202r17j234j138j96O74O84L11L24O84
59770E85391J097J826L081M322M935N102N360N710N803N645N499N407N296N258
59756F49732N347N388N376N730O737P973Q672Q527P923P461P366P247O495N124
59742G45098L994L774L922L329J858M44k74o49j151j667j960k185k554k988l372
$$ plain form
59727 745619 742002 738634 736383 735726 736109 736497 736486 736449 736708 736984 736653 735239 732745 729754 727094 725125 723474
59710 723474 721667 719718 717902 716357 715388 715764 718138 722314 727547 733334 739537 746044 752948 760836 770277
59695 770277 781079 792595 804637 817500 831033 844186 855488 863586 867489 867005 863178 857874 852615
59682 852615 847883 843357 838428 832607 825914 819019 812640 806667 800177 792345 783135 773120 762967 753192
59668 753192 744168 736165 729400 723994 719804 716392 713361 710673 708623 707626 708091 710236 713819 718186 722787
59653 722787 727619 733084 739573 747091 754987 762046 767229 770437 772178 772451 770430 765435 757745 748234
59639 748234 737666 726607 715566 704917 694989 686355 679522 674163 669282 664464 660393 657747 656154
59626 656154 654623 652440 649219 644690 639050 633055 627254 621511 615656 610008 604724 599217 592823 585683
$$ packed form
59727G45619l617l368k251o57L83L88j1l7K59K76l31j414k494k991k660j969j651
59710G23474j807j949j816j545r69L76K374M176N233N787O203O507O904P888R441
59695G70277J0802J1516J2042J2863J3533J3153J1302Q098L903m84l827n304n259
59682H52615m732m526m929n821o693o895o379n973o490p832r210j0015j0153r775
59668G53192r024q003o765n406m190l412l031k688k050r97M65K145L583M367M601
59653G22787M832N465O489P518P896P059N183L208J741K73k021m995p690r511
59639G48234j0568j1059j1041j0649r928q634o833n359m881m818m071k646j593
59626F56154j531k183l221m529n640n995n801n743n855n648n284n507o394p140
$$ plain form
59612 585683 578481 571854 566510 563178 561795 561304 560917 560979 561900 562989 563265 562875 562693 562967 563381 564161 566013
59595 566013 568982 572205 574812 576559 577750 579096 581308 584244 586779 588063 588412 588428 587954 586669 584978
59580 584978 583253 580795 576715 571433 566163 561236 556069 550518 545150 540402 536488 533856 532602 531705
59566 531705 530017 527759 525909 524430 522493 520311 519202 519726 521067 522410 523586 524219 523728 522661 522729
59551 522729 524883 528251 531454 534091 536546 539269 542689 547059 552000 556872 561865 568102 576482 587100
59537 587100 599829 614714 631722 650710 671227 691308 706882 714075 712549 705515 696435 686980
59525 686980 678098 671121 666871 664975 664889 666578 669590 672561 674417 675149 674818 672882 669197 664620 659740
59510 659740 653891 646271 637312 628180 619576 611705 604672 598281 592107 586370 581989 579246 577239 575277
$$ packed form
59612E85683p202o627n344l332j383m91l87O2R21J089K76l90j82K74M14P80J852
59595E66013K969L223K607J747J191J346K212K936K535J284L49J6m74j285j691
59580E84978j725k458m080n282n270m927n167n551n368m748l914k632j254q97
59566E31705j688k258j850j479j937k182j109N24J341J343J176O33m91j067O8
59551E22729K154L368L203K637K455K723L420M370M941M872M993O237Q380J0618
59537E87100J2729J4885J7008J8988K0517K0081J5574P193j526p034r080r455
59525F86980q882o977m250j896q6J689L012K971J856P32l31j936l685m577m880
59510F59740n849p620q959r132q604p871p033o391o174n737m381k743k007j962
$$ plain form
59496 575277 573908 573813 574608 575682 577421 580492 584423 587915 590311 591996 593678 595948 599240 603572 608572
59481 608572 614181 620979 629495 639726 651646 665461 680813 696489 711549 726141 740472 753513
59469 753513 763411 768765 769115 764889 757581 749305 741377 733729 726270 720170 716992 717124 719930 724988 732282
59454 732282 741512 752119 763901 776914 790922 805535 820692 836413 852275 867566 881701 893965
59442 893965 903120 907827 907380 901760 891406 877451 861877 846850 833828 823296 814870 807329 798985
59429 798985 788567 775815 761428 746917 734271 724863 718511 714335 712495 714057 719222 727089 737436
59416 737436 751240 768851 789265 812001 838081 868070 900687 934477 968768 1000852 1023895
59405 1023895 1030913 1021029 1000076 975423 952228 934033 923664 922163 928566 941633 960066 979874
$$ packed form
59496E75277j369r5P95J074J739L071L931L492K396J685J682K270L292M332N000
59481F08572N609O798Q516J0231J1920J3815J5352J5676J5060J4592J4331J3041
59469G53513R898N354L50m226p308q276p928p648p459o100l178J32K806N058P294
59454G32282R230J0607J1782J3013J4008J4613J5157J5721J5862J5291J4135J2264
59442H93965R155M707m47n620j0354j3955j5574j5027j3022j0532q426p541q344
59429G98985j0418j2752j4387j4511j2646r408o352m176j840J562N165P867J0347
59416G37436J3804J7611K0414K2736K6080K9989L2617L3790L4291L2084K3043
59405A023895P018r884k0953k4653k3195j8195j0369j501O403J3067J8433J9808
$$ plain form
59393 979874 993371 993082 977013 949527 917542 886381 858386 833885 812714 795048 781234 771196
59381 771196 764267 759536 756201 753825 752537 752770 754457 756724 758711 760327 761766 762772 763088 763198 763767
59366 763767 764543 764706 764163 763637 763548 763731 764271 765681 768058 770954 774328 778830 784833 791952 799908 809169
59350 809169 820246 832904 846589 861280 877446 895424 915199 936546 958975 981552 1003073
59339 1003073 1022549 1039533 1054017 1065938 1074767 1079750 1080635 1077831 1071723 1062318 1049983 1036031 1021859
59326 1021859 1007635 992538 976203 959267 942466 925968 909827 894478 880349 867324 854895
59315 854895 842725 830850 819491 808794 798650 788744 778890 769307 760437 752593 745905 740498 736486
59302 736486 733913 732921 733898 737265 743160 751431 761748 773446 785233 795087 800538 799447 791184 777238
$$ packed form
59393I79874J3497k89j6069k7486l1985l1161k7995k4501k1171j7666j3814j0038
59381G71196o929m731l335k376j288K33J687K267J987J616J439J006L16J10N69
59366G63767P76J63n43n26q9J83N40J410K377K896L374M502O003P119P956R261
59350H09169J1077J2658J3685J4691J6166J7978J9775K1347K2429K2577K1521
59339A003073J9476J6984J4484J1921Q829M983Q85k804o108r405j2335j3952j4172
59326A021859j4224j5097j6335j6936j6801j6498j6141j5349j4129j3025j2429
59315H54895j2170j1875j1359j0697j0144r906r854r583q870p844o688n407m012
59302G36486k573r92R77L367N895Q271J0317J1698J1787R854N451j091q263j3946
$$ plain form
59288 777238 760336 742810 726012 710923 698370 688452 680616 674729 671339 670497 671214 672751 675662
59275 675662 680798 688049 696934 707732 720903 735767 750988 766172 781894 798132 813697 827409
59263 827409 838995 848590 856039 861027 863399 863161 860425 855413 848296 839192 828647 817829 807844 799057
59249 799057 791455 785265 780642 777168 774281 771961 770317 768912 767334 766222 766816 769454 773279 777377
59235 777377 781500 785616 789530 793157 796673 800255 803985 807895 811656 814416 815469 814924 813201 810135
59221 810135 805235 798690 791381 783968 776622 769488 762693 755826 748149 739468 730386 721719 714103 707984
59207 707984 703348 699469 695456 691083 686754 682917 679927 678123 677407 677080 676717 676844 678025 679742 681074
59192 681074 682167 683973 686752 689956 693546 698243 704292 711005 717813 724861 732261 739519 746135 752148
$$ packed form
59288G77238j6902j7526j6798j5089j2553r918p836n887l390q42P17J537K911
59275F75662N136P251Q885J0798J3171J4864J5221J5184J5722J6238J5565J3712
59263H27409J1586R595P449M988K372k38k736n012p117r104j0545j0818r985q787
59249G99057p602o190m623l474k887k320j644j405j578j112N94K638L825M098
59235G77377M123M116L914L627L516L582L730L910L761K760J053n45j723l066
59221H10135m900o545p309p413p346p134o795o867p677q681r082q667p616o119
59207G07984m636l879m013m373m329l837k990j804p16l27l63J27J181J717J332
59192F81074J093J806K779L204L590M697O049O713O808P048P400P258O616O013
$$ plain form
59178 752148 757808 763193 768290 772950 776707 779196 780772 782145 783479 784514 785482 787075 789413 791844
59164 791844 793930 795941 798214 800676 803101 805193 806290 805643 803185 799495 794928 789278 782185 773332
59150 773332 762403 749641 736297 723696 711903 700166 688518 677930 668813 660482 652323 644474
59138 644474 637095 629985 623385 618154 614566 611668 608453 605077 602458 601182 601245 602371 604120 606098 608418
59123 608418 611657 616172 621785 628274 635680 644048 653310 663531 674791 686802 699101 711603 724408
59110 724408 737098 748891 759538 769388 778558 786722 793766 799966 805393 809777 813026 815230 816161 815485
59096 815485 813512 811028 808327 805122 801400 797614 794054 790826 788420 787347 787160 786752 785742 784597 783280
59081 783280 780863 776783 771494 765484 758501 750190 740813 731046 721703 713740 707686 702852 697899 692314
$$ packed form
59178G52148N660N385N097M660L757K489J576J373J334J035R68J593K338K431
59164G91844K086K011K273K462K425K092J097o47k458l690m567n650p093q853
59150G73332j0929j2762j3344j2601j1793j1737j1648j0588r117q331q159p849
59138F44474p379p110o600n231l588k898l215l376k619j276O3J126J749J978K320
59123F08418L239M515N613O489P406Q368R262J0221J1260J2011J2299J2502J2805
59110G24408J2690J1793J0647R850R170Q164P044O200N427M384L249K204R31o76
59096H15485j973k484k701l205l722l786l560l228k406j073j87m08j010j145j317
59081G83280k417m080n289o010o983q311r377r767r343p963o054m834m953n585
$$ plain form
59067 692314 686555 680831 674878 669064 664435 661254 658551 655533 652398 649390 646195 642893 640406 639291
59053 639291 638866 638196 637156 636042 634929 633977 633542 633432 632726 630919 628581 626418 624339 621899 619086 616334
59037 616334 614291 613654 614508 615831 616607 617472 620103 624843 630255 635355 640887 647855 656222 665762 676864
59022 676864 689566 703006 716710 731393 747518 764043 779468 793204 805060 814414 820956 825386
59010 825386 828316 829161 826969 821725 814175 805237 796284 788979 783930 780355 777885 777599 780265 784652 788820
58995 788820 792218 795328 798087 800030 801346 802430 802829 801829 799658 797084 794232 790809 786977 783019
58981 783019 778710 774002 769814 767096 765714 765311 766605 770604 777011 784675 793161 802706 813070 823760
58967 823760 835035 847367 860056 871679 881867 891454 900884 909528 916638 921935 925149 925845 923863
$$ packed form
59067F92314n759n724n953n814m629l181k703l018l135l008l195l302k487j115
59053F39291m25o70j040j114j113r52m35j10p06j807k338k163k079k440k813k752
59037F16334k043o37Q54J323P76Q65K631M740N412N100N532O968Q367R540J1102
59022F76864J2702J3440J3704J4683J6125J6525J5425J3736J1856R354O542M430
59010H25386K930Q45k192n244p550q938q953p305n049l575k470k86K666M387M168
58995G88820L398L110K759J943J316J084L99j000k171k574k852l423l832l958
58981G83019m309m708m188k718j382m03J294L999O407P664Q486R545J0364J0690
58967H23760J1275J2332J2689J1623J0188R587R430Q644P110N297L214O96j982
$$ plain form
58954 923863 919300 912098 902302 890506 877323 862633 846148 828511 811092 794794 779719 765804
58942 765804 753078 741491 731190 722766 716625 712378 709405 707642 707119 707137 706711 705555 703972 702157
58928 702157 700251 698662 697558 696422 694817 693187 692102 691151 689404 686663 683527 680589 678253 676884
58914 676884 676413 676242 676173 676894 678892 681700 685004 689643 696474 705028 714442 724991 737440 751527 766469
58899 766469 782362 799571 817165 833532 848331 862344 875502 886608 895206 902479 910103 919256
58887 919256 930656 944393 959551 974979 990444 1006184 1021574 1035329 1046794 1055885 1061991 1064258
58875 1064258 1062939 1059109 1053017 1044007 1032228 1019068 1005597 991795 977698 964148 951835 940485
58863 940485 929499 918773 908574 899177 890748 882989 874942 865851 856187 847086 838884 831016 823221
$$ packed form
58954I23863m563p202r796j1796j3183j4690j6485j7637j7419j6298j5075j3915
58942G65804j2726j1587j0301q424o141m247k973j763n23J8m26j156j583j815
58928G02157j906j589j104j136j605j630j085r51j747k741l136k938k336j369
58914F76884m71j71o9P21J998K808L304M639O831Q554R414J0549J2449J4087J4942
58899G66469J5893J7209J7594J6367J4799J4013J3158J1106Q598P273P624R153
58887I19256J1400J3737J5158J5428J5465J5740J5390J3755J1465R091O106K267
58875A064258j319l830o092r010j1779j3160j3471j3802j4097j3550j2313j1350
58863I40485j0986j0726j0199r397q429p759q047r091r664r101q202p868p795
$$ plain form
58850 823221 815789 808658 801250 793405 785622 778256 771165 764165 757039 749193 740122 730215 720284 710435
58836 710435 700248 689974 680556 672447 665313 658886 653242 648238 643531 639183 635489 632378 629780 628274
58822 628274 628423 629701 631192 633038 635994 639718 642923 645293 647890 651424 655325 658816 661793 664289
58808 664289 666115 667369 668455 669316 669458 668817 667740 666075 663252 659426 655521 651980 648351 644245 639857
58793 639857 635486 631369 627921 625282 622831 620227 618666 619732 623115 626921 630366 634589 640489 647376
58779 647376 654398 661827 670034 678282 685559 691906 698090 704360 710026 713848 714661 712173 707339 701489
58765 701489 695115 688116 680909 674296 668329 662421 656640 651792 648096 644863 641633 638570 635561 632127
58751 632127 628526 625885 624818 624825 625262 625994 626878 627625 628421 629841 631981 634648 638362 644042 651515 659472
$$ packed form
58850H23221p432p131p408p845p783p366p091p000p126p846r071r907r931r849
58836G10435j0187j0274r418q109p134o427n644n004m707m348l694l111k598j506
58822F28274J49J278J491J846K956L724L205K370K597L534L901L491K977K496
58808F64289J826J254J086Q61J42o41j077j665k823l826l905l541l629m106m388
58793F39857m371m117l448k639k451k604j561J066L383L806L445M223N900O887
58779F47376P022P429Q207Q248P277O347O184O270N666L822Q13k488m834n850
58765G01489o374o999p207o613n967n908n781m848l696l233l230l063l009l434
58751F32127l601k641j067PM37P32Q84P47P96J420K140K667L714N680P473P957
$$ plain form
58735 659472 667062 674406 681436 687526 692565 697233 701878 706250 710564 715485 720683 724694 726751 727647
58721 727647 728276 728500 727977 727081 726333 725812 725658 726428 728489 731661 735571 739679 743077 745190 746524 747611
58705 747611 747468 744488 738749 731817 724249 714982 703455 690557 677034 662744 648113 634566 622629
58692 622629 611097 599072 587521 577875 570230 563781 558002 552636 547408 542359 537632 532715 527038
58679 527038 521481 517802 516220 515110 513574 512620 513132 514427 515775 517741 520945 524853 528955 533897 540426
58664 540426 548290 557125 567276 578781 590454 600690 608252 611883 610622 605257 598138 590775 582889
58651 582889 574313 566066 558752 551635 544391 538117 533445 529275 524660 520364 517226 514533 511495 508831
58637 508831 507285 505929 503705 501494 500864 501702 502797 504017 506191 509361 512613 515237 516948 517545 517374
$$ packed form
58735F59472P590P344P030O090N039M668M645M372M314M921N198M011K057Q96
58721G27647O29K24n23q96p48n21j54P70K061L172L910M108L398K113J334J087
58705G47611j43k980n739o932p568r267j1527j2898j3523j4290j4631j3547j1937
58692F22629j1532j2025j1551r646p645o449n779n366n228n049m727m917n677
58679E27038n557l679j582j110j536r54N12J295J348J966L204L908M102M942O529
58664E40426P864Q835J0151J1505J1673J0236P562L631j261n365p119p363p886
58651E82889q576q247p314p117p244o274m672m170m615m296l138k693l038k664
58637E08831j546j356k224k211o30Q38J095J220K174L170L252K624J711N97j71
$$ plain form
58622 517374 517433 518027 518183 517335 516674 517757 520771 525193 530982 537854 544479 549886 554893 560852 567690 574329
58606 574329 580055 584390 586700 587331 588224 590906 594583 597410 598871 599636 599995 599812 599370 598934 598135 596846
58590 596846 595943 596184 597273 599063 602560 608524 616165 624550 634195 645803 658458 670631 682053 693053
58576 693053 702933 710687 716652 721941 726846 731192 735596 740968 747489 755315 765504 778886 794772
58563 794772 812128 831130 852281 874983 898454 923058 949104 975133 998970 1019641 1036781
58552 1036781 1049184 1055783 1057412 1055888 1051953 1045633 1037873 1030081 1022632 1015259 1008216 1001439 993326 981949
58538 981949 966970 949028 928214 904749 880230 856406 833414 810845 789646 771222 755524
58527 755524 741847 730606 722345 715816 709199 702586 697275 693263 689524 686181 684172 683103 681553 679273
$$ packed form
58622E17374N9N94J56q48o61J083L014M422N789O872O625N407N007N959O838O639
58606E74329N726M335K310O31Q93K682L677K827J461P65L59j83m42m36p99j289
58590E96846r03K41J089J790L497N964P641Q385R645J1608J2655J2173J1422J1000
58576F93053R880P754N965N289M905M346M404N372O521P826J0189J3382J5886
58563G94772J7356J9002K1151K2702K3471K4604K6046K6029K3837K0671J7140
58552A036781J2403O599J629j524l935o320p760p792p449p373p043o777q113j1377
58538I81949j4979j7942k0814k3465k4519k3824k2992k2569k1199j8424j5698
58527G55524j3677j1241q261o529o617o613n311m012l739l343k009j069j550k280
$$ plain form
58513 679273 677175 675363 673138 670704 669022 668103 667136 666057 665411 665035 664487 664291 665129 666340 666934 667413
58497 667413 668759 670306 670603 669787 669138 668867 668458 668647 670778 674558 678599 682928 688809 696391 704684 713683
58481 713683 724438 737141 751123 766493 783762 802095 819967 837249 854522 870548 882655
58470 882655 889627 892266 891267 886571 878731 868917 857601 845042 832817 822900 815544 809899 806309 805941
58456 805941 808640 813399 820489 830805 843374 855895 867560 878998 889614 897362 901164 901298 897584
58443 897584 889503 878074 865305 851855 837379 822914 810543 800816 792825 786634 783297 782621 783359
58430 783359 785467 789768 795663 801668 808007 816123 825893 835928 846324 858225 870810 881607 889779
58417 889779 896199 900406 900584 896768 891068 884425 875998 865940 855806 845939 835387 824658 815599
$$ packed form
58513F79273k098j812k225k434j682r19r67j079o46l76n48j96Q38J211N94M79
58497F67413J346J547K97q16o49k71m09J89K131L780M041M329N881P582Q293Q999
58481G13683J0755J2703J3982J5370J7269J8333J7872J7282J7273J6026J2107
58470H82655O972K639r99m696p840r814j1316j2559j2225r917p356n645l590l68
58456H05941K699M759P090J0316J2569J2521J1665J1438J0616P748L802J34l714
58443H97584q081j1429j2769j3450j4476j4465j2371r727p991o191l337o76P38
58430G83359K108M301N895O005O339Q116R770J0035J0396J1901J2585J0797Q172
58417H89779O420M207J78l816n700o643q427j0058j0134r867j0552j0729r059
$$ plain form
58404 815599 808219 800677 792771 786435 782367 779202 776413 775007 775014 775372 776682 780762 786902 791925 794680
58389 794680 797297 801291 805681 809731 814204 818871 821915 822920 823636 825012 826320 827781 830826 835094
58375 835094 838430 840632 843913 848905 853695 857670 862762 869783 877033 883697 891214 900120 908968 917581
58361 917581 927933 940549 953423 965702 978955 993545 1007216 1018563 1028424 1036677 1041423 1042767
58349 1042767 1043674 1045517 1046452 1045699 1045645 1048043 1051796 1056196 1062617 1071272 1080024 1088210 1097959 1110093 1122526
58334 1122526 1134431 1147992 1164142 1180612 1196158 1212658 1230921 1248460 1263577 1277553 1290655
58323 1290655 1300195 1305004 1307743 1310422 1311748 1311275 1311769 1314801 1318229 1320790 1324858 1331890 1339534 1346243
58309 1346243 1354357 1365472 1377121 1387379 1398468 1412403 1427210 1440935 1455290 1471855 1488723
$$ packed form
58404H15599p380p542p906o336m068l165k789j406PL58J310M080O140N023K755
58389G94680K617L994M390M050M473M667L044J005P16J376J308J461L045M268
58375H35094L336K202L281M992M790L975N092P021P250O664P517Q906Q848Q613
58361I17581J0352J2616J2874J2279J3253J4590J3671J1347R861Q253M746J344
58349A042767R07J843R35p53n4K398L753M400O421Q655Q752Q186R749J2134J2433
58334A122526J1905J3561J6150J6470J5546J6500J8263J7539J5117J3976J3102
58323A290655R540M809K739K679J326m73M94L032L428K561M068P032P644O709
58309A346243Q114J1115J1649J0258J1089J3935J4807J3725J4355J6565J6868
$$ plain form
58298 1488723 1504395 1520985 1539986 1558886 1575424 1591264 1608116 1624424 1639342 1655730 1675686
58287 1675686 1697251 1718848 1742386 1768588 1794198 1817628 1842459 1871365 1901515 1930040 1959022
58276 1959022 1990800 2023477 2055511 2089506 2126905 2164291 2199725 2237298 2280403 2326028 2371019
58265 2371019 2418313 2471296 2527495 2583819 2642627 2706567 2772717 2837939 2904667 2975228 3045926
58254 3045926 3113202 3180186 3250677 3322221 3391776 3462536 3538424 3617646 3698501 3785390 3881887
58243 3881887 3984152 4088567 4199252 4320507 4448857 4580773 4720943 4874239 5036879
58234 5036879 5204704 5382554 5575872 5780956 5993888 6221059 6469855 6736930 7017233
58225 7017233 7316508 7642736 7993405 8364057 8761353 9194744 9663747 10166991 10714735
$$ packed form
58298A488723J5672J6590J9001J8900J6538J5840J6852J6308J4918J6388J9956
58287A675686K1565K1597K3538K6202K5610K3430K4831K8906L0150K8525K8982
58276A959022L1778L2677L2034L3995L7399L7386L5434L7573M3105M5625M4991
58265B371019M7294N2983N6199N6324N8808O3940O6150O5222O6728P0561P0698
58254C045926O7276O6984P0491P1544O9555P0760P5888P9222Q0855Q6889R6497
58243C881887J02265J04415J10685J21255J28350J31916J40170J53296J62640
58234E036879J67825J77850J93318K05084K12932K27171K48796K67075K80303
58225G017233K99275L26228L50669L70652L97296M33391M69003N03244N47744
$$ plain form
58216 10714735 11318304 11976902 12690088 13473057 14343623 15305567 16362759 17538228 18860516
58207 18860516 20344515 22007662 23892781 26053302 28532129 31382990 34700438 38604194
58199 38604194 43214248 48675715 55191312 62994543 72313698 83407150 96615190 112335774
58191 112335774 130985868 153039963 179020763 209259657 243545020 280925023 319588855
58184 319588855 356551821 387433961 407204051 412126492 401683242 378825262 348311106
58177 348311106 314551706 280468203 247604814 216750424 188399413 162909956 140486271
58170 140486271 121120152 104596361 90589210 78764841 68808524 60414426 53306645
58163 53306645 47269026 42130945 37735898 33946552 30665248 27821202 25343393 23164790
$$ packed form
58216A0714735O03569O58598P13186P82969Q70566R61944J057192J175469J322288
58207A8860516J483999J663147J885119K160521K478827K850861L317448L903756
58199C8604194M610054N461467O515597P803231R319155J1093452J3208040J5720584
58191A12335774J8650094K2054095K5980800L0238894L4285363L7380003L8663832
58184C19588855L6962966L0882140J9770090M922441j0443250k2857980l0514156
58177C48311106l3759400l4083503l2863389l0854390k8351011k5489457k2423685
58170A40486271j9366119j6523791j4007151j1824369r956317q394098p107781
58163E3306645o037619n138081m395047l789346l281304k844046k477809k178603
$$ plain form
58155 23164790 21241213 19542510 18031501 16670275 15438996 14328846 13322437 12398718
58147 12398718 11550739 10780733 10082262 9442982 8859847 8335477 7863261 7430808 7034602
58138 7034602 6677293 6353803 6053361 5772158 5511313 5265511 5026398 4794942 4578534
58129 4578534 4377823 4187374 4006880 3840516 3686931 3540513 3401122 3272706 3153838
58120 3153838 3039297 2929504 2829011 2737005 2648248 2562155 2482179 2407518 2334041 2262363 2196662
58109 2196662 2136491 2077707 2020411 1968083 1919879 1871575 1823282 1778616 1737038 1694535 1651266
58098 1651266 1611247 1574900 1538981 1503355 1470960 1441412 1411401 1381050 1353372 1327876 1301327
58087 1301327 1274464 1251378 1232307 1213401 1193557 1175190 1158235 1139624 1119088 1099536 1081308
$$ packed form
58155B3164790j923577j698703j511009j361226j231279j110150j006409r23719
58147A2398718q47979p70006o98471o39280n83135n24370m72216m32453l96206
58138G034602l57309l23490l00442k81203k60845k45802k39113k31456k16408
58129D578534k00711j90449j80494j66364j53585j46418j39391j28416j18868
58120C153838j14541j09793j00493r2006q8757q6093p9976p4661p3477p1678o5701
58109B196662o0171n8784n7296n2328m8204m8304m8293m4666m1578m2503m3269
58098A651266m0019l6347l5919l5626l2395k9548l0011l0351k7678k5496k6549
58087A301327k6863k3086j9071j8906j9844j8367j6955j8611k0536j9552j8228
$$ plain form
58076 1081308 1061669 1040341 1019958 1000741 980201 958534 938960 922206 905731 888909 873982
58065 873982 861389 848948 836144 824701 814630 804182 793796 785516 778540 769918 759640 750285
58053 750285 741730 731208 718760 707590 698582 689419 679635 671520 665308 658337 650032 643077 638529
58040 638529 634143 628626 623339 618716 613128 606380 600391 595413 589454 582382 576637 572808 568361 561830
58026 561830 554562 547288 538704 528681 519333 511702 504626 497775 492413 488302 483290 476943 471219 466790
58012 466790 462137 457080 453524 451739 449484 445990 443281 442427 441939 441045 440979 441798 441502 439744 438918 439974
57996 439974 440549 438982 436946 436221 435949 435039 434480 435241 436307 436564 436391 435906 434017 430649 427504 425257
57980 425257 422418 418295 414535 412270 410247 407287 404273 402148 400256 398225 397293 398219 399860 401129 402330
$$ packed form
58076A081308j9639k1328k0383j9217k0540k1667j9574j6754j6475j6822j4927
58065H73982j2593j2441j2804j1443j0071j0448j0386q280o976q622j0278r355
58053G50285q555j0522j2448j1170r008r163r784q115o212o971q305o955m548
58040F38529m386n517n287m623n588o748n989m978n959p072n745l829m447o531
58026E61830p268p274q584j0023r348p631p076o851n362m111n012o347n724m429
58012D66790m653n057l556j785k255l494k709q54m88q94o6Q19k96j758q26J056
57996D39974N75j567k036p25k72r10n59P61J066K57j73m85j889l368l145k247
57980D25257k839m123l760k265k023k960l014k125j892k031r32R26J641J269J201
$$ plain form
57965 402330 403411 403185 401566 400358 400502 400712 400063 399631 400210 400689 400139 399287 398506 396596 393104 389689 387563
57948 387563 385598 382593 379460 377638 377241 378274 381637 387327 393538 399172 405492 413778 423201 432573
57934 432573 442338 453130 464073 474238 484195 494458 503816 510768 515175 517166 516031 511680 505658
57921 505658 499143 491400 481706 471284 461817 453438 445704 439148 434318 430542 427109 424554 423500 423523
57907 423523 424287 426375 429707 432576 433634 433520 433301 432765 431526 430271 429365 427649 424108 419610 415665
57892 415665 412707 410740 410178 410674 410581 409095 407616 407648 408674 409481 410057 410671 410489 408772 406236 403728 400789
57875 400789 396981 393241 390367 387520 383901 380584 378890 378174 377067 375844 375719 376744 378248 380492 384205
57860 384205 389171 394831 401417 408996 416399 422766 429167 436940 445253 452111 457087 461228 464885 467388
$$ packed form
57965D02330J081k26j619j208J44K10o49m32N79M79n50q52p81j910l492l415k126
57948C87563j965l005l133j822l97J033L363N690O211N634O320Q286R423R372
57934D32573R765J0792J0943J0165R957J0263R358O952M407J991j135m351o022
57921E05658o515p743r694j0422r467q379p734o556m830l776l433k555j054K3
57907D23523P64K088L332K869J058j14k19n36j239j255r06j716l541m498l945
57892D15665k958j967n62M96r3j486j479L2J026Q07N76O14j82j717k536k508k939
57875D00789l808l740k874k847l619l317j694p16j107j223j25J025J504K244L713
57860C84205M966N660O586P579P403O367O401P773Q313O858M976M141L657K503
$$ plain form
57846 467388 468415 468047 465866 461526 455845 449940 443723 436577 428925 421706 414861 407784 400875 395182
57832 395182 390795 386924 383308 380406 378403 377029 376094 375420 374767 374481 375444 377619 379589 380415 380876 381870
57816 381870 382808 382843 382508 382601 382471 380940 378091 374581 370035 363733 356245 348836 341846 335105 329240 325004
57800 325004 321838 318628 315389 312841 310909 309090 307731 307517 308205 309279 311281 315088 320341 325942 331459
57785 331459 336780 341211 344550 348356 354410 362396 370687 378874 387757 397221 405913 412952 418434 422448
57771 422448 424974 426511 427411 426922 424233 420036 415632 410966 405094 398146 391188 384397 377075 369301 362064
57756 362064 355845 350437 345959 342682 340185 338067 337058 337944 339820 341089 341829 343422 346134 348894 351305
57741 351305 353997 356952 359345 361250 363788 367337 371079 374555 378185 382065 385620 388607 391156 392822
$$ packed form
57846D67388J027l68k181m340n681n905o217p146p652p219o845p077o909n693
57832C95182m387l871l616k902k003j374r35o74o53k86R63K175J970Q26M61R94
57816C81870R38L5l35R3j30j531k849l510m546o302p488p409o990o741n865m236
57800C25004l166l210l239k548j932j819j359k14O88J074K002L807N253N601N517
57785C31459N321M431L339L806O054P986Q291Q187Q883R464Q692P039N482M014
57771D22448K526J537R00m89k689m197m404m666n872o948o958o791p322p774p237
57756C62064o219n408m478l277k497k118j009Q86J876J269P40J593K712K760K411
57741C51305K692K955K393J905K538L549L742L476L630L880L555K987K549J666
$$ plain form
57727 392822 393016 392363 392209 392738 393051 393062 393721 395210 396490 396873 396673 396169 395310 394506 394266 393932 392296 389552
57709 389552 387104 385313 383054 379695 375918 372287 368658 365427 363791 364231 366106 369100 373716 380054
57695 380054 387465 395647 404495 412538 417206 417289 413709 407516 398735 387722 375963 364620 353668 343226
57681 343226 334428 328147 324168 322371 323557 328380 336663 348536 365072 387016 414044 446091 484354
57668 484354 530127 583556 644151 711193 782167 850979 908338 944153 950810 926603 877274 813212
57656 813212 744085 676049 612994 557876 511833 473750 442102 416272 395378 377379 360750
57645 360750 346060 334598 326199 319502 313613 308380 303682 299513 296315 294312 292902 291429 290110 289524
57631 289524 289686 290144 290468 290176 288855 286881 285278 284340 283102 280719 277552 274307 270955 267252 263574
$$ packed form
57727C92822J94o53j54N29L13J1O59J489J280L83k00n04q59q04k40l34j636k744
57709C89552k448j791k259l359l777l631l629l231j636M40J875K994M616O338
57695C80054P411Q182Q848Q043M668Q3l580o193q781j1013j1759j1343j0952j0442
57681C43226q798o281l979j797J186M823Q283J1873J6536K1944K7028L2047L8263
57668D84354M5773N3429O0595O7042P0974O8812N7359L5815O657k4207m9329o4062
57656H13212o9127o8036o3055n5118m6043l8083l1648k5830k0894j7999j6629
57645C60750j4690j1462q399o697n889n233m698m169l198k003j410j473j319n86
57631B89524J62M58L24k92j321j974j603r38j238k383l167l245l352l703l678
$$ plain form
57616 263574 260464 257931 255758 253869 251892 249204 245945 243165 241298 239450 236893 234364 232945 232540
57602 232540 232465 232812 234058 235852 237275 238006 238283 238030 236908 235070 233046 231002 228763 226392 224203 222338
57586 222338 220790 219644 218878 218158 217218 216255 215676 215669 216146 216650 216292 214337 211125 207809 204996 202237 199042
57569 199042 195670 192646 190151 188172 186513 184523 181647 178487 176350 175437 174492 172710 170906 170149 170230
57554 170230 170270 170044 169882 169888 169990 170189 170271 169915 169529 170201 172254 174653 176359 177497 178616 179687 180507 181314
57536 181314 182323 183393 184702 186847 189620 191598 191705 190366 188502 186365 184146 182690 182548 183137 183805
57521 183805 184886 186685 188301 188748 188682 189793 192825 197183 202066 207011 211681 216045 220579 225583 230651
57506 230651 235318 239704 243918 247501 250224 252719 255533 258146 259711 260109 259485 257561 254319 250729 247779
$$ packed form
57616B63574l110k533k173j889j977k688l259k780j867j848k557k529j419m05
57602B32540p5L47J246J794J423P31K77k53j122j838k024k044k239k371k189j865
57586B22338j548j146p66p20r40r63n79pM77N04l58j955l212l316k813k759l195
57569A99042l372l024k495j979j659j990k876l160k137r13r45j782j804p57Q1
57554A70230M0k26j62OJ02J99Q2l56l86O72K053K399J706J138J119J071Q20Q07
57536A81314J009J070J309K145K773J978J07j339j864k137k219j456j42N89O68
57521A83805J081J799J616M47o6J111L032M358M883M945M670M364M534N004N068
57506B30651M667M386M214L583K723K495K814K613J565L98o24j924l242l590k950
$$ plain form
57491 247779 245347 242855 240382 238221 236003 233302 230480 228008 225559 222739 219992 217807 215718 213167
57477 213167 210649 208853 207371 205453 203334 201563 199680 196958 193913 191649 190191 188888 188056 188642 190446
57462 190446 192149 193043 193495 193865 194314 195507 198093 201422 204012 205325 205969 206263 205899 205099 204827 205513 206484
57445 206484 206829 206101 204285 202001 200598 201050 202797 204476 205600 206662 207969 209420 211128 213111 214662
57430 214662 215168 215257 215901 216755 216792 216299 216613 217979 219299 220177 221544 223780 225669 225830 224156 221398 218388
57413 218388 216072 215242 215701 216441 216893 217322 217963 218707 219663 221075 222530 223242 223132 222676 221835 220261 218577
57396 218577 218108 219134 220580 221635 222498 223440 224414 225758 227939 230263 231275 230909 230961 232836 235968 238982
57380 238982 241276 242869 243824 244557 245845 247908 250224 252453 254595 256041 255766 253914 251912 250497 248972
$$ packed form
57491B47779k432k492k473k161k218k701k822k472k449k820k747k185k089k551
57477B13167k518j796j482j918k119j771j883k722l045k264j458j303q32N86J804
57462A90446J703Q94M52L70M49J193K586L329K590J313O44K94l64q00k72O86R71
57445B06484L45p28j816k284j403M52J747J679J124J062J307J451J708J983J551
57430B14662N06Q9O44Q54L7m93L14J366J320Q78J367K236J889J61j674k758l010
57413B18388k316q30M59P40M52M29O41P44R56J412J455P12j10m56q41j574j684
57396B18577m69J026J446J055Q63R42R74J344K181K324J012l66N2J875L132L014
57380B38982K294J593R55P33J288K063K316K229K142J446k75j852k002j415j525
$$ plain form
57365 248972 247044 245972 246765 248384 249003 248303 247430 247265 247727 248414 249014 249329 249523 250139 251428 253020 254500
57348 254500 255880 257269 258667 260251 262228 264256 265782 267090 269034 271497 273233 273672 273761 274447 275310
57333 275310 275449 274775 273735 272579 271688 271820 273235 275156 276757 278038 279180 279794 279528 278730 277917 277187
57317 277187 276729 277137 278542 280117 281124 281852 282931 284411 286114 288158 290472 292480 293922 295273 296741
57302 296741 297736 298078 298772 300645 302980 304602 305665 307192 309344 311372 313025 314920 317529 320692 324115
57287 324115 327635 331050 334294 337693 341535 345487 348890 351495 353495 355072 356293 357257 357996 358439 358623
57272 358623 358581 357914 356052 353119 349958 347173 344801 343067 342524 343154 344296 345811 348208 351183 353337
57257 353337 354222 355458 358724 363577 368370 372413 375989 379110 381721 384637 388769 393645 397894 401006
$$ packed form
57365B48972j928j072P93J619O19p00q73j65M62O87O00L15J94O16J289J592J480
57348B54500J380J389J398J584J977K028J526J308J944K463J736M39Q9O86Q63
57333B75310J39o74j040j156q91J32J415J921J601J281J142O14k66p98q13p30
57317B77187m58M08J405J575J007P28J079J480J703K044K314K008J442J351J468
57302B96741R95L42O94J873K335J622J063J527K152K028J653J895K609L163L423
57287C24115L520L415L244L399L842L952L403K605K000J577J221R64P39M43J84
57272C58623m2o67j862k933l161k785k372j734n43O30J142J515K397K975K154
57257C53337Q85J236L266M853M793M043L576L121K611K916M132M876M249L112
$$ plain form
57243 401006 403563 406013 408447 411398 415570 420720 425841 430604 435636 441252 446861 451822 456153 460117
57229 460117 463823 467551 471949 477540 484187 491139 497549 503126 508436 514332 520905 527441 533556 539840
57215 539840 546971 554836 563015 571620 581056 591413 602552 614302 626103 637099 647195 657461
57203 657461 668815 680861 692596 703665 714313 724713 735035 745582 756199 766245 775862 786458
57191 786458 799041 812851 826629 840467 855319 871398 888315 906223 925546 945937 966766
57180 966766 988328 1011384 1035778 1060595 1085352 1109875 1133357 1154840 1174469 1193102 1210913
57169 1210913 1227593 1243723 1260630 1278833 1297744 1316859 1336161 1355433 1374340 1393298 1413226
57158 1413226 1434401 1456417 1479119 1502691 1527039 1552101 1578511 1606857 1636575 1666681 1697328
$$ packed form
57243D01006K557K450K434K951M172N150N121M763N032N616N609M961M331L964
57229D60117L706L728M398N591O647O952O410N577N310N896O573O536O115O284
57215E39840P131P865Q179Q605R436J0357J1139J1750J1801J0996J0096J0266
57203F57461J1354J2046J1735J1069J0648J0400J0322J0547J0617J0046R617J0596
57191G86458J2583J3810J3778J3838J4852J6079J6917J7908J9323K0391K0829
57180I66766K1562K3056K4394K4817K4757K4523K3482K1483J9629J8633J7811
57169A210913J6680J6130J6907J8203J8911J9115J9302J9272J8907J8958J9928
57158A413226K1175K2016K2702K3572K4348K5062K6410K8346K9718L0106L0647
$$ plain form
57147 1697328 1729392 1762842 1796933 1831684 1867653 1904349 1940536 1976179 2012557 2050302 2088862
57136 2088862 2128079 2168665 2210743 2253481 2296727 2341627 2389137 2439183 2491680 2546894 2604209
57125 2604209 2661910 2718990 2776248 2835153 2896768 2962225 3033151 3111077 3197307 3293478 3401102
57114 3401102 3520540 3651871 3796929 3958954 4140145 4341421 4565046 4815716 5098740
57105 5098740 5419408 5785108 6206351 6695227 7265224 7933821 8723437 9659120 10767741
57096 10767741 12080479 13633140 15461985 17601088 20084408 22946282 26216553 29916352
57088 29916352 34057279 38635739 43620262 48945060 54513140 60184266 65733237 70820961
57080 70820961 75045599 78073450 79756792 80146383 79405768 77714967 75229768 72088606
$$ packed form
57147A697328L2064L3450L4091L4751L5969L6696L6187L5643L6378L7745L8560
57136B088862L9217M0586M2078M2738M3246M4900M7510N0046N2497N5214N7315
57125B604209N7701N7080N7258N8905O1615O5457P0926P7926Q6230R6171J07624
57114C401102J19438J31331J45058J62025J81191K01276K23625K50670K83024
57105E098740L20668L65700M21243M88876N69997O68597P89616R35683J108621
57096A0767741J312738J552661J828845K139103K483320K861874L270271L699799
57088B9916352M140927M578460M984523N324798N568080N671126N548971N087724
57080G0820961M224638L027851J683342L89591p40615j690801k485199l141162
$$ plain form
57072 72088606 68425504 64370361 60044612 55560195 51020203 46519077 42142632 37966511
57064 37966511 34051737 30440503 27156142 24206194 21585021 19275887 17254631 15493985
57056 15493985 13965662 12640313 11488017 10479883 9589346 8793281 8074045 7420965 6828560
57047 6828560 6292542 5807741 5369117 4972706 4614585 4289998 3994455 3724934 3479227
57038 3479227 3254829 3049435 2861998 2692225 2539295 2401973 2279789 2173097 2081877 2005373
57028 2005373 1943198 1895997 1864502 1848471 1847076 1859648 1884315 1914593 1937581 1937491 1903302 1834474
57016 1834474 1739804 1631257 1518864 1409648 1308245 1216784 1135056 1062227 998264 943151
57006 943151 895535 853383 815750 782851 754549 729854 707937 688639 671697 656292 641693
$$ packed form
57072G2088606l663102m055143m325749m484417m539992m501126m376445m176121
57064C7966511l914774l611234l284361k949948k621173k309134k021256j760646
57056A5493985j528323j325349j152296j008134q90537p96065p19236o53080n92405
57047F828560n36018m84801m38624l96411l58121l24587k95543k69521k45707
57038C479227k24398k05394j87437j69773j52930j37322j22184j06692r1220p6504
57028B005373o2175m7201l1495j6031j395J2572K4667L0278K2988r0l4189o8828
57016A834474r4670j08547j12393j09216j01403r1461q1728p2829o3963n5113
57006I43151m7616m2152l7633l2899k8302k4695k1917j9298j6942j5405j4599
$$ plain form
56995 641693 627794 614730 602355 590384 578776 567906 558600 551847 548132 547136 548350 551668 556971
56982 556971 563439 569758 574572 576188 572469 562189 546480 528040 508873 489484 470078 451420
56970 451420 434312 419139 406268 396257 389342 385271 383824 385010 388744 394904 403708 415443 429867
56957 429867 446550 465557 486700 507804 524682 533367 532105 521364 502958 479546 454086 429000
56945 429000 405895 385912 369660 356744 346245 338028 333024 332005 334815 341078 351046 365375 384498
56932 384498 408403 436471 467207 498349 527147 550156 563361 563823 551619 529599 501222 469261
56920 469261 436183 404221 374578 347449 323164 302393 285029 270007 256712 245559 236743 229445
56908 229445 222885 217216 212740 209113 205974 203560 202074 201185 200720 201052 202309 204061 206331 209974 215372
$$ packed form
56995F41693j3899j3064j2375j1971j1608j0870r306o753l715r96J214L318N303
56982E56971O468O319M814J616l719j0280j5709j8440j9167j9389j9406j8658
56970D51420j7108j5173j2871j0011o915m071j447J186L734O160Q804J1735J4424
56957D29867J6683J9007K1143K1104J6878Q685j262j0741j8406k3412k5460k5086
56945D29000k3105j9983j6252j2916j0499q217n004j019K810O263R968J4329J9123
56932C84498K3905K8068L0736L1142K8798K3009J3205M62j2204k2020k8377l1961
56920D69261l3078l1962k9643k7129k4285k0771j7364j5022j3295j1153q816p298
56908B29445o560n669m476l627l139k414j486q89m65L32J257J752K270L643N398
$$ plain form
56893 215372 221794 228828 237405 248435 261411 275552 291528 310615 332513 355116 376085 393475
56881 393475 405188 409259 405193 394372 379089 361672 344230 328334 314745 303884 296492 293348
56869 293348 294495 299339 307528 319379 335612 357087 384691 419045 460226 507860 561054 617784
56857 617784 674258 724999 763648 784526 784796 765862 732426 690051 643909 599099 560259 529802
56845 529802 507355 491745 482944 481653 488079 502202 524653 556437 598214 650531 714082 788786
56833 788786 872860 963109 1054945 1140772 1209246 1248502 1251618 1219487 1159326 1081276 995557 910533
56821 910533 831714 761999 702622 653743 614800 585247 565136 554818 554273 563185 581494 609508
56809 609508 647478 695214 751734 814861 880909 944269 996934 1029394 1034214 1010098 962273 898853
$$ packed form
56893B15372O422P034Q577J1030J2976J4141J5976J9087K1898K2603K0969J7390
56881C93475J1713M071m066j0821j5283j7417j7442j5896j3589j0861p392l144
56869B93348J147M844Q189J1851J6233K1475K7604L4354M1181M7634N3194N6730
56857F17784N6474N0741L8649K0878K70j8934l3436m2375m6142m4810l8840l0457
56845E29802k2447j5610q801j291O426J4123K2451L1784M1777N2317O3551P4704
56833G88786Q4074R0249R1836Q5827O8474L9256L116l2131o0161p8050q5719q5024
56821I10533p8819o9715n9377m8879l8943k9553k0111j0318n45Q912J8309K8014
56809F09508L7970M7736N6520O3127O6048O3360N2665L2460M820k4116m7825o3420
$$ plain form
56797 898853 827469 754742 686379 625872 573860 529917 494289 467122 447176 432860 424014 421441
56785 421441 425275 435083 451056 473689 502380 535362 570610 605486 635607 655457 660709 649905
56773 649905 624600 588872 548167 507124 467964 431177 397167 366444 338808 313590 290624
56762 290624 270143 252043 236084 222500 211417 201966 192970 184250 176307 169094 162205 155998 151347
56749 151347 148336 146206 144533 143423 142633 141538 140021 138454 136840 134844 132640 130819 129514 128433
56735 128433 127601 127172 126725 125778 124917 125319 127087 129086 130555 131926 133835 136180 138391 140014 140902 141401
56719 141401 142284 143949 145836 147230 148351 149910 151900 153709 155198 156819 158824 161173 163943 166986
56705 166986 169486 170784 171399 172346 173778 175212 176645 178268 179431 179188 177744 176201 175086 174264 173992
$$ packed form
56797H98853p1384p2727o8363o0507n2012m3943l5628k7167j9946j4316q846k573
56785D21441L834R808J5973K2633K8691L2982L5248L4876L0121J9850N252j0804
56773F49905k5305l5728m0705m1043l9160l6787l4010l0723k7636k5218k2966
56762B90624k0481j8100j5959j3584j1083r451q996q720p943p213o889o207m651
56749A51347l011k130j673j110p90j095j517j567j614j996k204j821j305j081
56735A28433q32m29m47r47q61M02J768J999J469J371J909K345K211J623Q88M99
56719A41401Q83J665J887J394J121J559J990J809J489J621K005K349K770L043
56705A66986K500J298O15R47J432J434J433J623J163k43j444j543j115q22k72
$$ plain form
56690 173992 174650 175574 175661 175152 175375 176575 177500 177428 177176 177666 178723 179850 181096 182579 183979 184972 185492
56673 185492 185362 184451 183250 182510 182272 182156 182465 183894 186211 188382 190102 191991 194201 196136 197771 199959
56657 199959 202993 206001 208184 209593 210349 210189 209225 208233 207773 207799 208256 209136 209793 209290 207615 205621 203754
56640 203754 201931 200594 200449 200947 200499 198610 196483 195113 194106 192894 191709 190730 189492 187893 186685
56625 186685 186257 185909 184889 183182 180807 177454 173481 170217 168603 168355 168917 170177 171772 172753 172600 171677
56609 171677 170223 167918 164872 161907 159393 156916 154580 153296 153123 152692 151137 149431 148895 149497 150548
56594 150548 152037 154228 156851 159615 162716 165954 168250 168945 168771 168666 168496 167945 167812 169233 172066 175023
56578 175023 177047 177863 177675 177051 176726 176923 177232 177471 178033 179109 180353 181737 183841 186863 190295 194047
$$ packed form
56690A73992O58R24Q7n09K23J200R25p2k52M90J057J127J246J483J400R93N20
56673A85492j30r11j201p40k38j16L09J429K317K171J720J889K210J935J635K188
56657A99959L034L008K183J409P56j60r64r92m60K6M57Q80O57n03j675j994j867
56640B03754j823j337j45M98m48j889k127j370j007j212j185r79j238j599j208
56625A86685m28l48j020j707k375l353l973l264j614k48N62J260J595R81j53r23
56609A71677j454k305l046k965k514k477k336j284j73m31j555j706n36O02J051
56594A50548J489K191K623K764L101L238K296O95j74j05j70n51j33J421K833K957
56578A75023K024Q16j88o24l25J97L09K39N62J076J244J384K104L022L432L752
$$ plain form
56562 194047 198859 205030 211836 218934 227199 237260 248114 258063 266149 271875 274518 273864 270929 267007
56548 267007 262627 258188 254664 252660 251483 250183 248898 248187 247679 246453 244371 242060 239949 238100 236531
56533 236531 234956 232622 229263 225865 223717 223008 222955 222963 223040 223334 223804 224185 224016 223108 222092 221897 222507 222843
56515 222843 222026 220060 217222 213830 210710 208797 207858 206683 204860 203189 202061 200832 199268 198159 197752
56500 197752 196999 195198 193085 191416 189787 187817 186200 185499 185098 184476 184305 185107 185952 185811 185204 185180 185553
56483 185553 185454 184918 184676 184954 185569 186516 187524 187742 186821 185647 185209 185564 186591 188588 191235 193194 193815
56466 193815 194137 195091 195936 195672 194794 194300 194142 194081 194819 196652 198093 197677 196330 196159 197595 199458 201181
56449 201181 203118 205011 205955 205880 205658 205839 206387 207398 208980 210724 212200 213566 214887 215623 215669 215982 217092
$$ packed form
56562A94047M812O171O806P098Q265J0061J0854R949Q086N726K643o54k935l922
56548B67007m380m439l524k004j177j300j285p11n08j226k082k311k111j849j569
56533B36531j575k334l359l398k148p09n3QP7K94M70L81j69r08j016j95O10L36
56515B22843q17j966k838l392l120j913r39j175j823j671j128j229j564j109m07
56500A97752p53j801k113j669j629j970j617p01m01o22j71Q02Q45j41o07k4L73
56483A85553r9n36k42K78O15R47J008K18r21j174m38L55J027J997K647J959O21
56466A93815L22R54Q45k64q78m94j58o1P38J833J441m16j347j71J436J863J723
56449B01181J937J893R44p5k22J81N48J011J582J744J476J366J321P36M6L13J110
$$ plain form
56432 217092 217974 217653 216897 216896 217224 216662 215242 213954 213141 212685 213049 214520 216107 216671 216506 216366 215811 214176
56414 214176 212335 211686 212029 212255 212433 213358 214600 215087 215217 216367 218452 219903 220034 219701 219607 219662 220029 221250
56396 221250 223169 225040 226654 228203 229320 229529 229291 229326 229358 228858 228447 229038 230105 230439 230142 230185 230475 230171
56378 230171 229589 229870 230924 231543 231528 231943 233209 234551 235466 236278 237131 237803 238514 239741 241328 242908 244818
56361 244818 247380 249828 251295 252314 253828 255309 255582 255044 255336 257110 259690 262562 265503 267705 268517
56346 268517 268778 269752 271104 271536 270976 270439 270231 270073 270410 271702 272935 272877 272374 273334 275796 278073 279504
56329 279504 280938 282736 284431 286151 288364 290420 291413 292208 294471 298022 301308 304143 307595 311419 314171
56314 314171 315854 317926 320568 322384 322991 323603 324820 326144 327811 330840 335067 339438 344332 351268 360170
$$ packed form
56432B17092Q82l21p56jL28n62j420j288q13m56L64J471J587N64j65j40n55j635
56414B14176j841o49L43K26J78R25J242M87J30J150K085J451J31l33r4N5L67J221
56396B21250J919J871J614J549J117K09k38L5L2n00m11N91J067L34k97M3K90l04
56378B30171n82K81J054O19j5M15J266J342R15Q12Q53O72P11J227J587J580J910
56361B44818K562K448J467J019J514J481K73n38K92J774K580K872K941K202Q12
56346B68517K61R74J352M32n60n37k08j58L37J292J233n8n03R60K462K277J431
56329B79504J434J798J695J720K213K056R93P95K263L551L286K835L452L824K752
56314C14171J683K072K642J816O07O12J217J324J667L029M227M371M894O936Q902
$$ plain form
56299 360170 369381 378551 388868 399989 409310 414986 417512 417919 416714 415035 414470 415055 415484 415653 416849
56284 416849 419264 421768 424471 428982 435620 442795 449677 457073 465204 473061 480538 488750 497770 506562
56270 506562 515601 526909 540850 555556 570185 586011 603620 621924 640926 662599 687814 715117
56258 715117 743807 775674 812321 853289 898203 948454 1005297 1068432 1137773 1214455 1298827
56247 1298827 1389490 1485533 1587660 1695955 1808617 1923878 2040930 2157739 2270110 2374211
56237 2374211 2468125 2549997 2616891 2666651 2698886 2713036 2707622 2682566 2640379 2584094 2515884
56226 2515884 2438212 2353996 2264815 2171205 2075290 1980592 1888528 1797846 1708379 1622537 1542067
56215 1542067 1466250 1394438 1327488 1265380 1206315 1149602 1096765 1048489 1003201 960037 920337
$$ packed form
56299C60170R211R170J0317J1121R321N676K526M07j205j679n65N85M29J69J196
56284D16849K415K504K703M511O638P175O882P396Q131P857P477Q212R020Q792
56270E06562R039J1308J3941J4706J4629J5826J7609J8304J9002K1673K5215K7303
56258G15117K8690L1867L6647M0968M4914N0251N6843O3135O9341P6682Q4372
56247A298827R0663R6043J02127J08295J12662J15261J17052J16809J12371J04101
56237B374211R3914Q1872O6894M9760L2235J4150n414k5056m2187n6285o8210
56226B515884p7672q4216q9181r3610r5915r4698r2064r0682q9467q5842q0470
56215A542067p5817p1812o6950o2108n9065n6713n2837m8276m5288m3164l9700
$$ plain form
56204 920337 884756 851790 820682 792892 769073 747426 726680 707883 691680 676777 662789
56193 662789 651522 643553 636499 628619 621202 615508 610417 605116 601013 598790 596576 593381 591272 591744
56179 591744 592895 592780 592630 594064 595862 596387 596746 598782 602155 605881 610443 616036 621221 625590 631213
56164 631213 639128 647190 653793 660829 670302 680973 691244 702518 716644 732702 749406 768168
56152 768168 790640 815663 841739 870168 902804 939217 979227 1025798 1082149 1148277 1223432
56141 1223432 1309707 1409905 1523903 1649963 1787158 1933105 2081482 2225015 2359201 2480796
56131 2480796 2585855 2673004 2746388 2811919 2872412 2928822 2982802 3033933 3076919 3105721 3119017
56120 3119017 3118649 3105317 3079398 3043324 2998611 2941861 2867328 2772276 2657430 2524760 2378418
$$ packed form
56204I20337l5581l2966l1108k7790k3819k1647k0746j8797j6203j4903j3988
56193F62789j1267p969p054p880p417n694n091n301m103k223k214l195k109M72
56179E91744J151j15j50J434J798N25L59K036L373L726M562N593N185M369N623
56164F31213P915Q062O603P036R473J0671J0271J1274J4126J6058J6704J8762
56152G68168K2472K5023K6076K8429L2636L6413M0010M6571N6351O6128P5155
56141A223432Q6275J00198J13998J26060J37195J45947J48377J43533J34186J21595
56131B480796J05059Q7149P3384O5531O0493N6410N3980N1131M2986K8802J3296
56120C119017l68j3332k5919l6074m4713n6750p4533r5052j14846j32670j46342
$$ plain form
56109 2378418 2225791 2074230 1928226 1791793 1670196 1565931 1476089 1397326 1330462 1276694
56099 1276694 1232763 1194315 1161065 1134302 1112237 1092420 1076061 1065259 1058329 1052321 1047652 1045809
56087 1045809 1045087 1043247 1041853 1043329 1046250 1048171 1050399 1055216 1061057 1065415 1069845 1077027 1085569 1092899
56073 1092899 1100627 1111704 1124802 1136924 1148982 1163318 1178287 1191066 1203405 1218799 1236225
56062 1236225 1252447 1268175 1286087 1305003 1321948 1337786 1354940 1371823 1385449 1397356 1411003
56051 1411003 1425671 1438865 1452175 1468613 1486736 1503642 1521065 1542088 1564709 1585326 1605716
56040 1605716 1629717 1655934 1680835 1705987 1734825 1765320 1793590 1821813 1854656 1890802 1926096
56029 1926096 1962057 2002816 2046629 2089151 2132178 2180192 2231115 2279776 2327682 2379807 2434574
$$ packed form
56109B378418j52627j51561j46004j36433j21597j04265q9842p8763o6864n3768
56099A276694m3931l8448l3250k6763k2065j9817j6359j0802o930o008m669j843
56087A045809p22j840j394J476K921J921K228M817N841M358M430P182Q542P330
56073A092899P728J1077J3098J2122J2058J4336J4969J2779J2339J5394J7426
56062A236225J6222J5728J7912J8916J6945J5838J7154J6883J3626J1907J3647
56051A411003J4668J3194J3310J6438J8123J6906J7423K1023K2621K0617K0390
56040A605716K4001K6217K4901K5152K8838L0495K8270K8223L2843L6146L5294
56029A926096L5961M0759M3813M2522M3027M8014N0923M8661M7906N2125N4767
$$ plain form
56018 2434574 2487029 2539257 2597415 2660866 2724503 2789297 2859919 2934532 3008001 3082771 3165345
56007 3165345 3254413 3343917 3435312 3534808 3641052 3748078 3858103 3978532 4108623 4242269
55997 4242269 4381515 4533554 4696702 4863727 5036759 5224136 5424895 5631952 5848356
55988 5848356 6084115 6339066 6605834 6887664 7195634 7530161 7883794 8260532 8673179
55979 8673179 9123391 9604548 10122564 10692776 11318244 11993668 12728905 13545005 14449381
55970 14449381 15440776 16536976 17770515 19159719 20714574 22470085 24482768 26798143
55962 26798143 29459778 32551864 36197558 40520693 45655262 51792130 59167801 68009875
55954 68009875 78552754 91111183 106081882 123885644 144987007 169930226 199152631
$$ packed form
56018B434574N2455N2228N8158O3451O3637O4794P0622P4613P3469P4770Q2574
56007C165345Q9068Q9504R1395R9496J06244J07026J10025J20429J30091J33646
55997D242269J39246J52039J63148J67025J73032J87377K00759K07057K16404
55988E848356K35759K54951K66768K81830L07970L34527L53633L76738M12647
55979H673179M50212M81157N18016N70212O25468O75424P35237Q16100R04376
55970A4449381R91395J096200J233539J389204J554855J755511K012683K315375
55962B6798143K661635L092086L645694M323135N134569O136868P375671Q842074
55954F8009875J0542879J2558429J4970699J7803762K1101363K4943219K9222405
$$ plain form
55947 199152631 232598882 269454266 308041853 345549874 377686346 399156609 405519294
55940 405519294 395403729 371239697 337881799 300408489 262716105 227276205 195408256
55933 195408256 167570208 143660261 123335987 106196481 91805576 79713915 69533386
55926 69533386 60960848 53728783 47586143 42335820 37841419 33982673 30639088 27720926
55918 27720926 25175578 22952020 20988916 19242451 17693470 16319014 15083827 13965407
55910 13965407 12960382 12059340 11239324 10486661 9803829 9187609 8621831 8097270 7618285
55901 7618285 7184058 6782248 6406475 6062074 5749369 5458192 5183769 4931707 4702648
55892 4702648 4487566 4282710 4094224 3923596 3763000 3609254 3468316 3341709 3222025
$$ packed form
55947A99152631L3446251L6855384L8587587L7508021L2136472K1470263O362685
55940D05519294j0115565k4164032l3357898l7473310l7692384l5439900l1867949
55933A95408256k7838048k3909947k0324274j7139506j4390905j2091661j0180529
55926F9533386q572538p232065o142640n250323m494401l858746l343585k918162
55918B7720926k545348k223558j963104j746465j548981j374456j235187j118420
55910A3965407j005025r01042q20016p52663o82832o16220n65778n24561m78985
55901G618285m34227m01810l75773l44401l12705k91177k74423k52062k29059
55892D702648k15082k04856j88486j70628j60596j53746j40938j26607j19684
$$ plain form
55883 3222025 3106202 3000294 2906833 2819852 2736287 2659945 2590015 2517740 2439057 2359571 2283072
55872 2283072 2206077 2127610 2053360 1985653 1919472 1852677 1790478 1735797 1684672 1635079 1591034
55861 1591034 1554031 1519322 1484394 1452408 1423751 1392977 1357894 1323218 1291660 1259784 1226211
55850 1226211 1195352 1169043 1142583 1113165 1084466 1058934 1033149 1004947 977863 954357 931559
55839 931559 907642 885675 867286 849110 829385 811638 797970 784961 770000 755566 743562
55828 743562 731479 717953 706234 698301 691126 682366 674195 667912 660320 649280 637628 627892 618197
55815 618197 606934 596416 588333 580402 571085 562938 557885 553740 548670 544541 542704 541108 538747 538369
55801 538369 541561 545714 549019 553832 561776 569976 575529 579335 582261 581985 577119 570244 563486 555269
$$ packed form
55883C222025j15823j05908r3461q6981q3565p6342o9930p2275p8683p9486p6499
55872B283072p6995p8467p4250o7707o6181o6795o2199n4681n1125m9593m4045
55861A591034l7003l4709l4928l1986k8657l0774l5083l4676l1558l1876l3573
55850A226211l0859k6309k6460k9418k8699k5532k5785k8202k7084k3506k2798
55839I31559k3917k1967j8389j8176j9725j7747j3668j3009j4961j4434j2004
55828G43562j2083j3526j1719p933p175q760q171o283p592j1040j1652r736r695
55815F18197j1263j0518q083p931r317q147n053m145n070m129j837j596k361l78
55801E38369L192M153L305M813P944Q200N553L806K926k76m866o875o758q217
$$ plain form
55787 555269 544762 535196 529124 524514 519189 515119 514386 514752 513217 510659 509179 508240 507315 509300 517504
55772 517504 531912 551709 578459 613037 651723 688374 717963 735567 735671 716650 683863 645086
55760 645086 604809 565115 528701 497445 470387 446341 426403 411273 398663 386210 374482
55749 374482 364470 354754 344038 333862 325919 319176 312523 307641 306212 306727 307165 308457 312069 316274
55735 316274 318051 316984 314461 310737 305513 299671 293930 287444 279947 273237 268335 263409 256902 250439
55721 250439 246101 243095 239791 236922 236066 236939 238760 242319 248250 255295 262714 272201 284823 298154
55707 298154 308975 316650 321325 321354 315700 306849 298179 290078 281318 272299 263937 255211 244949 234575
55693 234575 226179 219316 212541 206554 202949 201211 199732 198553 198547 199279 200183 202415 206974 212384 216732
$$ packed form
55787E55269j0507r566o072m610n325m070p33L66j535k558j480r39r25J985Q204
55772E17504J4408J9797K6750L4578L8686L6651K9589J7604J04j9021l2787l8777
55760F45086m0277l9694l6414l1256k7058k4046j9938j5130j2610j2453j1728
55749C74482j0012r716j0716j0176p943o743o653m882j429N15M38J292L612M205
55735C16274J777j067k523l724n224n842n741o486p497o710m902m926o507o463
55721B50439m338l006l304k869q56Q73J821L559N931P045P419R487J2622J3331
55707B98154J0821P675M675K9n654q851q670q101q760r019q362q726j0262j0374
55693B34575q396o863o775n987l605j738j479j179oP32R04K232M559N410M348
$$ plain form
55678 216732 220510 225030 229677 233268 236374 239642 241576 240842 239048 238270 237525 234820 231122 228915 228127
55663 228127 226908 225388 225243 226255 226649 226321 226710 227921 228868 229859 232201 235520 238073 239425 240462 241196
55647 241196 240928 240069 239487 238596 236318 233351 231265 229947 228057 225236 221720 216715 209525 201468 194410
55632 194410 188252 182086 176700 173309 170859 167458 163710 161752 161583 161221 160105 159532 159925 160340 160581 161300
55616 161300 162085 161757 160391 158924 157193 154546 151846 150448 149682 147879 145435 144198 144141 143389 141452 139767
55600 139767 138928 137973 136624 135853 135944 136171 136476 137357 138088 137318 135527 134659 135195 135791 135900 136518 138072 139782
55582 139782 141468 143946 147278 150586 153919 158491 164787 172221 180837 191522 204403 218801 234833
55569 234833 253235 273442 293696 313092 331655 348337 360965 368438 371194 369357 362421 351041
$$ packed form
55678B16732L778M520M647L591L106L268J934p34j794p78p45k705l698k207p88
55663B28127j219j520j45J012L94l28L89J211R47R91K342L319K553J352J037P34
55647B41196k68q59n82q91k278k967k086j318j890k821l516n005p190q057p058
55632A94410o158o166n386l391k450l401l748j958j69l62j116n73L93M15K41P19
55616A61300P85l28j366j467j731k647k700j398p66j803k444j237n7p52j937j685
55600A39767q39r55j349p71R1K27L05Q81P31p70j791q68N36N96J09O18J554J710
55582A39782J686K478L332L308L333M572O296P434Q616J0685J2881J4398J6032
55569B34833J8402K0207K0254J9396J8563J6682J2628P473K756j837o936j1380
$$ plain form
55557 351041 337208 322193 306026 289263 273442 259290 246127 233450 221603 210535 199550
55546 199550 188736 179252 171787 165920 161120 157125 153323 149194 145457 143389 143039 143406 144158 145625 147288
55531 147288 147995 147690 147287 146898 145785 143991 142251 140355 137409 133771 130875 128937 126609 123163 119392
55516 119392 116126 113518 111947 111946 112980 113891 114697 116370 118729 120264 120312 119772 119388 118902 118134 117343 116304
55499 116304 114520 112495 111320 110973 110567 110198 110779 112110 112957 113105 113406 113670 112568 109986 107525 106186
55483 106186 105381 104654 104547 105259 106227 107479 109655 112261 113698 113476 112591 111325 108647 104419 100220 97136
55467 97136 94522 91791 89681 88764 88270 87373 86328 85538 84847 84412 84892 86113 86901 86844 86849 87434 87932 87893 87713
55448 87713 87389 86314 84918 84745 86110 87407 87573 87503 88084 88641 88532 88618 89725 91014 91305 90925 90941 91511
$$ packed form
55557C51041j3833j5015j6167j6763j5821j4152j3163j2677j1847j1068j0985
55546A99550j0814r484p465n867m800l995l802m129l737k068l50L67P52J467J663
55531A47288P07l05m03l89j113j794j740j896k946l638k896j938k328l446l771
55516A19392l266k608j571jJ034R11Q06J673K359J535M8n40l84m86p68p91j039
55499A16304j784k025j175l47m06l69N81J331Q47J48L01K64j102k582k461j339
55483A06186q05p27j07P12R68J252K176K606J437k22q85j266k678m228m199l084
55467I7136k614k731k110r17m94q97j045p90o91m35M80J221P88n7NN85M98l9j80
55448H7713l24j075j396j73J365J297J66p0N81N57j09Q6J107J289K91l80J6N70
$$ plain form
55430 91511 92177 92938 93909 94699 95077 95519 96315 96924 96970 97053 97861 99237 100729 102237 103660 104838 106271 108853
55412 108853 112392 115484 117318 118412 119113 118752 117003 114769 112875 110990 108696 106527 105041 103826 102301
55397 102301 100682 99407 98403 97509 96863 96399 95788 95228 95306 95842 95933 95459 95297 95760 96142 96134 96231 96342 95580
55378 95580 93986 92809 92405 91511 89398 87090 85500 84027 82082 80424 79733 79259 78208 77128 76689 76324
55362 76324 75392 74544 74622 75257 75845 76810 78646 80698 82138 83169 84105 84319 83473 82758 83431 84907 85702 85619
55344 85619 85649 86327 87427 88744 90000 90448 89645 88173 86826 85698 84796 84594 85070 85170 84338 83603 83979
55327 83979 84718 84554 83824 83834 84707 85395 85482 85586 86112 86823 87565 88413 89164 89475 89370 89020 88377 87560 87141 87431
55307 87431 87994 88405 88843 89412 89654 89409 89306 89711 90096 90155 90574 91839 93244 94016 94487 95164 95650 95562 95544
$$ packed form
55430I1511O66P61R71P90L78M42P96O09M6Q3Q08J376J492J508J423J178J433K582
55412A08853L539L092J834J094P01l61j749k234j894j885k294k169j486j215j525
55397A02301j619j275j004q94o46m64o11n60P8N36R1m74j62M63L82qR7J11p62
55378I5580j594j177m04q94k113k308j590j473j945j658o91m74j051j080m39l65
55362G6324r32q48P8O35N88R65J836K052J440J031R36K14q46p15O73J476P95q3
55344H5619L0O78J100J317J256M48q03j472j347j128r02k02M76J00q32p35L76
55327H3979P39j64p30J0Q73O88Q7J04N26P11P42Q48P51L11j05l50o43q17m19K90
55307H7431N63M11M38N69K42k45j03M05L85N9M19J265J405P72M71O77M86q8j8
$$ plain form
55288 95544 96213 96999 97251 97540 98572 99641 99614 98715 97891 97120 95809 94322 93504 93074 92009 90253 88713
55271 88713 87824 87423 87735 89113 90919 91978 92127 92184 92500 92619 92319 91879 91400 90844 90654 91414 92903 94316
55253 94316 95308 96043 96478 96410 96046 95698 95162 94117 92845 91863 91202 90795 91050 92189 93505 94142 94143 93928 93338
55234 93338 92196 91179 90982 91079 90509 89513 89188 89796 90583 91037 91224 91062 90369 89484 88873 88271 87162 85903
55216 85903 85376 85680 86044 85892 85216 84218 83372 83476 84689 85946 86234 86064 86706 88370 90188 91616 92744
55199 92744 93603 94212 94996 96079 96574 95709 94282 93757 94209 94433 93849 93039 92555 92413 92644 93181 93351 92622
55181 92622 91697 91695 92503 93131 93454 94152 95047 95072 94075 93257 93400 93803 93373 91858 89769 87925 87146 87557 88148
55162 88148 87844 86907 86372 86361 86081 85367 84975 85404 86565 88558 91528 94703 96850 97815 98431 98888 98504 97239
$$ packed form
55288I5544O69P86K52K89J032J069k7q99q24p71j311j487q18m30j065j756j540
55271H8713q89m01L12J378J806J059J49N7L16J19l00m40m79n56j90P60J489J413
55253I4316R92P35M35o8l64l48n36j045j272r82o61m07K55J139J316O37Jk15n90
55234I3338j142j017j97R7n70r96l25O08P87M54J87j62o93q85o11o02j109j259
55216H5903n27L04L64j52o76r98q46J04J213J257K88j70O42J664J818J428J128
55199I2744Q59O09P84J083M95q65j427n25M52K24n84q10m84j42K31N37J70p29
55181I2622r25kQ08O28L23O98Q95K5r97q18J43M03m30j515k089j844p79M11N91
55162H8148l04r37n35j1k80p14l92M29J161J993K970L175K147R65O16M57l84j265
$$ plain form
55144 97239 96014 95206 94133 92509 91140 90633 90507 90149 89751 89777 90273 91041 91763 91812 90889 89999 90687 92952
55126 92952 94988 95398 94640 93855 93388 93082 93109 93628 94285 94689 94916 95085 94989 94568 94246 94363 94711 94957 95116
55107 95116 95357 95740 96347 97338 98752 100538 102641 104675 105831 105761 105311 105613 106653 107535 107888 108061 108140 107872
55089 107872 107528 107732 108314 108431 107980 107863 108603 109632 110193 110072 109246 107751 106154 105320 105471 106113 106890 107730
55071 107730 108260 108097 107652 107627 107755 107204 106141 105609 105775 105684 104981 104446 104441 104240 103424 102663 102527 102670 102777 103104
55051 103104 103538 103305 102286 101498 101609 102071 102359 102860 103779 104325 103890 103049 102501 102040 101431 101287 102005 102785
55033 102785 102822 102693 103432 104883 106090 106774 107302 107642 107431 106795 106149 105381 104101 102535 101402 101008 101076 101330
55015 101330 101703 102162 102713 103348 103678 103116 101779 100761 100982 102191 103477 104271 104442 104016 103359 103148 103601
$$ packed form
55144I7239j225q08j073j624j369n07j26l58l98K6M96P68P22M9r23q90O88K265
55126I2952K036M10p58p85m67l06K7N19O57M04K27J69r6m21l22J17L48K46J59
55107I5116K41L83O07R91J414J786K103K034J156p0m50L02J040Q82L53J73P9k68
55089A07872l44K04N82J17m51j17P40J029N61j21q26j495j597q34J51O42P77Q40
55071A07730N30j63m45k5J28n51j063n32J66r1p03n35nk01q16p61j36J43J07L27
55051A03104M34k33j019p88J11M62K88N01R19N46m35q41n48m61o09j44P18P80
55033A02785L7j29P39J451J207O84N28L40k11o36o46p68j280j566j133l94O8K54
55015A01330L73M59N51O35L30n62j337j018K21J209J286P94J71m26o57k11M53
$$ plain form
54998 103601 104171 104410 104640 105338 106437 107753 109515 111823 114083 115548 116052 115799 114965 113972 113493 113616 113581
54981 113581 112943 112321 112332 112491 112027 111242 111078 111692 112375 112671 112734 112728 112716 113082 114329 116356 118444 120016 121022
54962 121022 121634 121968 122099 122098 122053 122158 122608 123331 124105 124951 125980 126830 126824 125882 124629 123431 122007 120274 118736
54943 118736 117630 116428 114765 113192 112459 112668 113606 115168 116835 117538 116910 116104 116540 118296 120431 122344
54927 122344 123993 125305 126373 127905 130580 134204 138324 143371 150202 158648 167460 175732 183525 190944
54913 190944 197352 201800 203741 203059 199781 194070 186473 178063 170188 163752 158627 154094 149875 146274
54899 146274 143255 140168 136735 133611 131432 129965 128776 128120 128428 129344 130031 130155 129966 129733 129724 130402 132040
54882 132040 134414 137352 141146 145839 150659 154935 159165 164387 170776 177621 184384 190901 196724 201117
$$ packed form
54998A03601N70K39K30O98J099J316J762K308K260J465N04k53q34r93m79J23l5
54981A13581o38o22J1J59m64p85j64O14O83K96O3oj2L66J247K027K088J572J006
54962A21022O12L34J31jm5J05M50P23P74Q46J029Q50or42j253j198j424j733j538
54943A18736j106j202j663j573p33K09R38J562J667P03o28q06M36J756K135J913
54927A22344J649J312J068J532K675L624M120N047O831Q446Q812Q272P793P419
54913A90944O408M448J941o82l278n711p597q410p875o436n125m533m219l601
54899A46274l019l087l433l124k179j467j189o56L08R16O87J24j89k33rO78J638
54882A32040K374K938L794M693M820M276M230N222O389O845O763O517N823M393
$$ plain form
54868 201117 203677 204318 202836 199193 194100 188541 182762 176474 170037 164709 161425 159837 158691 156844
54854 156844 153953 150567 147557 145172 142821 140009 137095 134688 132673 130475 127965 125481 123138 120824
54840 120824 118713 117150 116105 115387 115231 116001 117318 118194 118165 117750 117706 118194 118770 118832 118126 117100 116626 117022
54822 117022 117563 117348 116398 115399 114712 114242 114091 114584 115670 116928 118221 119763 121532 123154 124466 125700
54806 125700 127010 128252 129280 130107 130730 131164 131656 132489 133526 134278 134451 134157 133613 132939 132258 131760 131573
54789 131573 131631 131607 131041 129818 128534 127969 128131 128377 128613 129657 131934 134498 136046 136496 136910 138213 140569
54772 140569 143675 147007 150039 152798 156045 160426 165806 171916 179168 188081 198271 208758 219013
54759 219013 228922 237946 245093 249620 251126 249216 243833 235784 226247 215864 204959 194334 184975
$$ packed form
54868B01117K560O41j482l643n093n559n779o288o437n328l284j588j146j847
54854A56844k891l386l010k385k351k812k914k407k015k198k510k484k343k314
54840A20824k111j563j045p18j56P70J317Q76k9m15m4M88N76O2p06j026m74L96
54822A17022N41k15r50r99o87m70j51M93J086J258J293J542J769J622J312J234
54806A25700J310J242J028Q27O23M34M92Q33J037P52J73k94n44o74o81m98j87
54789A31573N8k4n66j223j284n65J62K46K36J044K277K564J548M50M14J303K356
54772A40569L106L332L032K759L247M381N380O110P252Q913J0190J0487J0255
54759B19013R909R024P147M527J506j910n383q049r537j0383j0905j0625r359
$$ plain form
54746 184975 177090 170197 164082 158947 154779 151402 149047 147981 147629 146972 145881 145173 145207 145321 144889 144155
54730 144155 143766 144098 145291 147288 149684 152139 155090 159402 165136 171331 177205 182899 188740 194391 199175
54715 199175 202688 204761 205178 203809 200749 196171 190347 183946 177872 172581 167777 162940 157877 152767
54701 152767 148012 144128 141447 139779 138588 137461 136231 134775 133065 131316 129769 128414 127215 126378
54687 126378 126006 125774 125330 124789 124322 123603 122285 120757 119806 119707 120182 120930 121488 120997 119060 116647 115224
54670 115224 115053 115258 115380 115805 116698 117709 118867 120589 122506 123494 123321 123124 123644 124050 123358 122132 121725
54653 121725 122365 123001 122809 122044 121417 121317 121701 122292 122716 122675 122147 121464 121202 121780 122903 123622 123369 122765 122854
54634 122854 123643 124095 123582 122577 121768 121264 121034 121421 122644 124199 125301 125671 125574 125317 124991 124574 124045 123501
$$ packed form
54746A84975p885o893o115n135m168l377k355j066l52o57j091p08L4J14m32p34
54730A44155l89L32J193J997K396K455K951M312N734O195N874N694N841N651M784
54715A99175L513K073M17j369l060m578n824o401o074n291m804m837n063n110
54701A52767m755l884k681j668j191j127j230j456j710j749j547j355j199q37
54687A26378l72k32m44n41m67p19j318j528r51r9M75P48N58m91j937k413j423
54670A15224j71K05J22M25Q93J011J158J722J917R88j73j97N20M06o92j226m07
54653A21725O40O36j92p65o27j00L84N91M24m1n28o83k62N78J123P19k53o04Q9
54634A22854P89M52n13j005q09n04k30L87J223J555J102L70r7k57l26m17n29n44
$$ plain form
54616 123501 123188 123208 123243 122866 122143 121603 121639 122196 122931 123331 122877 121618 120426 120129 120538 120868 120918 121116 121547
54597 121547 121839 122043 122716 123934 125026 125579 125992 126683 127435 127833 127814 127531 127169 127082 127572 128385 128932 129084 129127
54578 129127 128977 128218 126984 125910 125086 123981 122624 121868 122111 122714 123128 123657 124513 124998 124401 123087 122018
54561 122018 121710 122172 123298 124756 125998 126849 127612 128314 128525 128271 128296 128903 129415 129407 129577 130590 131850 132392
54543 132392 132357 132621 133425 134321 135115 135946 136742 137444 138458 140064 141640 142290 142022 141546 141151 140654 140238 140372
54525 140372 140881 140940 140134 138899 137808 137020 136469 136105 135862 135817 136314 137445 138465 138252 136426 133668 130968
54508 130968 128906 127569 126706 125992 125433 125383 125935 126597 126957 127327 128188 129279 129859 129729 129364 129174 129250 129694
54490 129694 130486 131006 130481 129108 128107 128318 129235 129742 129441 128933 129028 129999 131451 132696 133344 133678 134447 136194
$$ packed form
54616A23501l13K0L5l77p23n40L6N57P35M00m54j259j192k97M09L30N0J98M31
54597A21547K92K04O73J218J092N53M13O91P52L98j9k83l62q7M90Q13N47J52M3
54578A29127j50p59j234j074q24j105j357p56K43O03M14N29Q56M85n97j314j069
54561A22018l08M62J126J458J242Q51P63P02K11k54K5O07N12qJ70J013J260N42
54543A32392l5K64Q04Q96P94Q31P96P02J014J606J576O50k68m76l95m97m16J34
54525A40372N09N9q06j235j091p88n51l64k43m5M97J131J020k13j826k758k700
54508A30968k062j337q63p14n59n0N52O62L60L70Q61J091N80j30l65j90P6M44
54490A29694P92N20n25j373j001K11R17N07l01n08R5R71J452J245O48L34P69J747
$$ plain form
54472 136194 138816 141714 144277 146186 147368 147778 147406 146549 145932 146243 147459 148836 149595 149520 148922 148376 148435
54455 148435 149245 150310 150946 150989 150744 150275 149317 147903 146477 145172 143615 141727 140049 138868 137656 135961
54439 135961 134337 133698 134115 134841 135310 135516 135603 135666 135896 136508 137545 138998 140845 142687 143741 143652 143091 143109
54421 143109 144128 145814 147572 148760 148873 148128 147538 147815 148441 148434 147735 147147 147076 147063 146639 145953 145418 145194 145199
54402 145199 145332 145637 146423 148101 150603 153161 155048 156405 157926 159849 161619 162532 162392 161662 161196 161619
54386 161619 162696 163538 163690 163600 163707 163537 162347 160302 158381 157269 156993 157436 158538 160015 161442 162528
54370 162528 162930 162121 160191 158523 158780 161138 164186 166585 168072 168885 169183 169479 170767 173511 176882 179553
54354 179553 181065 181998 183037 184220 185065 185074 184046 182026 179115 175483 171653 168537 166869 166541 166670 166331
$$ packed form
54472A36194K622K898K563J909J182M10l72q57o17L11J216J377P59p5n98n46N9
54455A48435Q10J065O36M3k45m69r58j414j426j305j557j888j678j181j212j695
54439A35961j624o39M17P26M69K06Q7O3K30O12J037J453J847J842J054q9n61J8
54421A43109J019J686J758J188J13p45n90K77O26po99n88p1j3m24o86n35k24N
54402A45199J33L05P86J678K502K558J887J357J521J923J770R13j40p30m66M23
54386A61619J077Q42J52r0J07j70j190k045j921j112k76M43J102J477J427J086
54370A62528M02q09j930j668K57K358L048K399J487Q13K98K96J288K744L371K671
54354A79553J512R33J039J183Q45Rj028k020k911l632l830l116j668l28J29l39
$$ plain form
54338 166331 165153 163379 161596 160306 159537 158869 157972 156946 156038 155247 154484 153914 153807 154188 154804 155287 155226
54321 155226 154405 153224 152521 152657 153152 153538 154125 155408 157076 158306 158761 158700 158322 157698 157212 157234 157289 156235
54303 156235 153590 150235 147591 146397 146339 146587 146602 146608 147281 148825 150597 151850 152606 153354 154228 154920 155260 155364
54285 155364 155354 155422 155985 157234 158609 159233 158809 157703 156333 154982 154037 153815 154170 154774 155620 156764 157791
54268 157791 158202 158236 158641 159633 160702 161459 162056 162754 163652 164853 166327 167648 168363 168586 168690 168640 168318 168281
54250 168281 169236 170727 171333 170405 168801 167660 167195 166921 166371 165264 163695 162464 162530 163779 164945 165037 164258
54233 164258 163274 162358 161646 161489 161920 162354 162355 162307 162815 163843 164859 165454 165479 164998 164476 164528 165067 165193 164363 163192
54213 163192 162625 162817 163370 164090 164788 164770 163442 161289 159462 158396 157507 156234 154674 153067 151386 149765
$$ packed form
54338A66331j178j774j783j290p69o68q97j026r08p91p63n70j07L81O16M83o1
54321A55226q21j181p03J36M95L86N87J283J668J230M55o1l78o24m86K2N5j054
54303A56235k645l355k644j194n8K48J5OO73J544J772J253P56P48Q74O92L40J04
54285A55364j0O8N63J249J375O24m24j106j370j351r45k22L55O04Q46J144J027
54268A57791M11L4M05R92J069P57N97O98Q98J201J474J321P15K23J04n0l22l7
54250A68281R55J491O06r28j604j141m65k74n50j107j569j231O6J249J166R2p79
54233A64258r84r16p12j57M31M34Jm8N08J028J016N95K5m81n22N2N39J26q30j171
54213A63192n67J92N53P20O98j8j328k153j827j066q89j273j560j607j681j621
$$ plain form
54197 149765 148773 148782 149375 149842 150114 150722 151871 152989 153438 153349 153425 154054 154984 155898 156855 157955 158911 159308 159118
54178 159118 158688 158360 158338 158749 159482 160141 160434 160434 160213 159547 158451 157675 157913 158653 158573 157194 155456 154479 154377
54159 154377 154609 154915 155432 156257 157299 158376 159220 159546 159365 159042 158898 158931 159049 159404 160244 161487 162540 162675
54141 162675 161790 160789 160856 162138 163544 164108 164043 164002 163851 162994 161576 160411 159825 159480 159324 159756 160746 161660
54123 161660 162214 162784 163525 164008 164063 164174 164661 165206 165654 166485 167885 169021 168990 168118 167671 168506 170437 172670
54105 172670 174423 175339 175642 175726 175534 174676 173271 172087 171602 171480 171307 171293 171833 172879 174192 175803 177781
54088 177781 179934 182160 184735 187828 191057 193948 196607 199618 203524 208538 214353 220011 224391 227058
54074 227058 228253 228035 226126 222837 219272 216162 213251 210325 208020 206849 206131 204784 202674 200386 198163
$$ packed form
54197A49765r92RN93M67K72O08J149J118M49q9P6O29R30R14R57J100R56L97j90
54178A59118m30l28k2M11P33O59K93%k21o66j096p76K38P40q0j379j738r77j02
54159A54377K32L06N17Q25J042J077Q44L26j81l23j44L3J18L55Q40J243J053J35
54141A62675q85j001O7J282J406N64o5m1j51q57j418j165n86l45j56M32R90R14
54123A61660N54N70P41M83N5J11M87N45M48Q31J400J136l1q72m47Q35J931K233
54105A72670J753R16L03Q4j92q58j405j184m85j22j73j4N40J046J313J611J978
54088A77781K153K226K575L093L229K891K659L011L906N014N815N658M380K667
54074B27058J195k18j909l289l565l110k911k926k305j171p18j347k110k288k223
$$ plain form
54059 198163 196027 194483 194080 194421 194613 194633 195292 196856 198601 199880 200882 202073 203646 205735 208528 211803
54043 211803 214889 217483 220160 223668 227951 232234 235938 239255 242772 246771 251054 255415 260021 265140
54029 265140 270643 276167 281754 287859 294569 301218 306972 311462 314661 316626 317632 318116 318115 317190 315252
54014 315252 312976 310897 308531 305003 300295 295174 290094 284816 279097 273201 267599 262574 258179 254326
54000 254326 250789 247296 243678 239986 236665 234480 233748 233535 232231 229272 225780 223163 221656 220693 220010
53985 220010 219578 218956 217644 215925 214564 213791 213298 213086 213477 214218 214379 213387 211596 209662 207859 206224
53969 206224 204941 204286 204434 205424 207107 209034 210675 211857 212874 214169 215995 218288 220714 222980 225166
53954 225166 227566 230108 232317 234040 235812 238139 240828 243433 246017 249062 252955 257980 264407 272017
$$ packed form
54059A98163k136j544m03L41J92K0O59J564J745J279J002J191J573K089K793L275
54043B11803L086K594K677L508M283M283L704L317L517L999M283M361M606N119
54029B65140N503N524N587O105O710O649N754M490L199J965J006M84jr25j938
54014C15252k276k079k366l528m708n121n080n278n719n896n602n025m395l853
54000B54326l537l493l618l692l321k185p32k13j304k959l492k617j507r63o83
53985B20010m32o22j312j719j361p73m93k12L91P41J61r92j791j934j803j635
53969B06224j283o55J48R90J683J927J641J182J017J295J826K293K426K266K186
53954B25166K400K542K209J723J772K327K689K605K584L045L893N025O427P610
$$ plain form
53940 272017 279889 287339 294884 303646 313970 325208 336694 348205 359415 369489 377328 381867 382348
53927 382348 378855 372629 365407 358449 352414 347804 344905 343420 342815 343030 344396 346964 350398 354394 358728
53912 358728 363053 367235 371733 377058 382934 388524 393352 397400 400480 402222 402639 401998 400251 397298 393796
53897 393796 390846 388759 386847 384531 381887 378938 375264 370666 365511 360012 353733 346256 337922 329500
53883 329500 321495 314048 307168 300750 294676 289126 284546 281124 278499 276083 273420 270244 266544 262601
53869 262601 258623 254382 249610 244704 240566 237692 235837 234532 233444 232222 230532 228376 225986 223433
53855 223433 220786 218502 217013 215981 214650 212942 211481 210523 209693 208940 208853 209613 210414 210396 209548 208317 206879
53838 206879 205308 203980 203341 203548 204558 206084 207343 207480 206602 205812 205889 206592 207484 208644 209973 210671 210264
$$ packed form
53940B72017P872P450P545Q762J0324J1238J1486J1511J1210J0074P839M539M81
53927C82348l493o226p222o958o035m610k899j485o05K15J366K568L434L996M334
53912C58728M325M182M498N325N876N590M828M048L080J742M17o41j747k953l502
53897C93796k950k087j912k316k644k949l674m598n155n499o279p477q334q422
53883C29500q005p447o880o418o074n550m580l422k625k416k663l176l700l943
53869B62601l978m241m772m906m138k874j855j305j088j222j690k156k390k553
53855B23433k647k284j489j032j331j708j461r58q30p53q7P60Q01j8q48j231j438
53838B06879j571j328o39K07J010J526J259J37q78p90P7P03Q92J160J329O98m07
$$ plain form
53821 210264 209585 209868 211195 212654 213703 214516 215167 215429 215462 215908 217032 218373 219549 220967 223381 226916
53805 226916 230842 234339 237408 240898 245579 251278 257192 262914 268671 274481 279704 283805 287073 290095
53791 290095 292980 295656 298572 302331 306682 310640 313667 316123 318330 319753 319566 317716 315009 312276
53777 312276 309735 307194 304519 301755 298882 295671 291818 287166 281750 275790 269739 264199 259556 255705
53763 255705 252305 249231 246585 244330 242198 239983 237643 235056 232008 228561 225229 222561 220675 219222
53749 219222 217713 215865 213856 212306 211802 212329 213304 214133 214626 214934 215334 216064 217026 217618 217181 215780 214350
53732 214350 213913 214721 216151 217300 217754 217972 218839 220705 222985 224891 226233 227145 227445 226955 226282 226502 227922
53715 227922 229816 231488 232983 234528 235970 237105 238094 239221 240637 242539 245160 248301 251323 253881
$$ packed form
53821B10264o79K83J327J459J049Q13O51K62L3M46J124J341J176J418K414L535
53805B26916L926L497L069L490M681N699N914N722N757N810N223M101L268L022
53791B90095K885K676K916L759M351L958L027K456K207J423j87j850k707k733
53777C12276k541k541k675k764k873l211l853m652n416n960o051n540m643l851
53763B55705l400l074k646k255k132k215k340k587l048l447l332k668j886j453
53749B19222j509j848k009j550n04N27R75Q29M93L08M00P30R62N92m37j401j430
53732B14350m37Q08J430J149M54K18Q67J866K280J906J342R12L00m90o73K20J420
53715B27922J894J672J495J545J442J135R89J127J416J902K621L141L022K558
$$ plain form
53701 253881 256289 258928 261758 264654 267765 271175 274610 277787 280695 283320 285564 287685 290273 293348
53687 293348 295944 297063 296696 295547 294168 292800 291633 290656 289510 287992 286477 285400 284632 283772 282800
53672 282800 281954 281238 280540 280035 279933 280013 279877 279497 279044 278447 277632 277027 277200 277996 278632 278691 278473 278268 277891
53653 277891 277150 276359 275951 275899 275924 276133 276964 278374 279504 279584 279059 279294 280980 283296 285012 285977 286941 288264
53635 288264 289646 291030 292810 294888 296379 296737 296516 296596 297273 298581 300791 303896 307155 309911 312479
53620 312479 315503 318784 321587 323928 326722 330627 335436 340647 345984 351208 356007 360375 364689 369182
53606 369182 373607 377596 381191 384809 388696 392507 395490 397238 398167 398991 399727 399732 398822 397767 397295 397142
53590 397142 396607 395661 394849 394394 394106 393983 394218 394537 394183 392771 390768 388924 387489 386152 384594 382953
$$ packed form
53701B53881K408K639K830K896L111L410L435L177K908K625K244K121K588L075
53687B93348K596J119l67j149j379j368j167r77j146j518j515j077p68q60r72
53672B82800q46p16o98n05j02Q0j36l80m53n97q15o05J73P96O36N9k18k05l77
53653B77891p41p91m08n2K5K09Q31J410J130Q0n25K35J686K316J716R65R64J323
53635B88264J382J384J780K078J491L58k21Q0O77J308K210L105L259K756K568
53620C12479L024L281K803K341K794L905M809N211N337N224M799M368M314M493
53606C69182M425L989L595L618L887L811K983J748R29Q24P36Nr10j055m72j53
53590C97142n35r46q12m55k88j23K35L19l54j412k003j844j435j337j558j641
$$ plain form
53574 382953 381739 381204 380848 379784 377630 374760 371717 368854 366675 365800 366201 366987 367460 367870 368657 369525
53558 369525 369959 370157 370630 371239 371537 371809 372830 374620 376354 377571 378701 380298 382491 385315 388751 392225
53542 392225 394809 396292 397490 399164 401215 403301 405742 409307 414351 420490 427001 433338 439431 445656
53528 445656 452412 459754 467592 476136 485787 496586 508119 519981 532009 544130 556350 568962
53516 568962 582387 596789 612161 628668 646474 665273 684535 704340 725420 748205 772203
53505 772203 796457 820232 843253 865707 888203 911231 934444 956787 977486 996605 1014581
53494 1014581 1031685 1048105 1064163 1080187 1096479 1113460 1131437 1150044 1168349 1185744 1202391
53483 1202391 1218656 1234612 1250404 1266629 1283769 1301467 1318712 1334608 1348652 1360505 1369963
$$ packed form
53574C82953j214n35l56j064k154k870l043k863k179q75M01P86M73M10P87Q68
53558C69525M34J98M73O09K98K72J021J790J734J217J130J597K193K824L436L474
53542C92225K584J483J198J674K051K086K441L565N044O139O511O337O093O225
53528D45656O756P342P838Q544R651J0799J1533J1862J2028J2121J2220J2612
53516E68962J3425J4402J5372J6507J7806J8799J9262J9805K1080K2785K3998
53505G72203K4254K3775K3021K2454K2496K3028K3213K2343K0699J9119J7976
53494A014581J7104J6420J6058J6024J6292J6981J7977J8607J8305J7395J6647
53483A202391J6265J5956J5792J6225J7140J7698J7245J5896J4044J1853R458
$$ plain form
53472 1369963 1377156 1382450 1386052 1387867 1387710 1385487 1381186 1374854 1366623 1356696 1345291 1332628 1319026
53459 1319026 1304991 1291120 1277715 1264385 1250242 1234669 1217790 1200116 1181968 1163476 1144833
53448 1144833 1126224 1107614 1088985 1070620 1052805 1035452 1018492 1002530 988544 976889 967116
53437 967116 958839 952237 947489 944166 941505 939036 936782 935095 934432 935074 936971 940049 944595 950902 958621
53422 958621 966958 975648 985238 996209 1008354 1021360 1035537 1051514 1069445 1088979 1109870 1132223
53410 1132223 1156135 1181391 1207623 1234688 1262842 1292537 1323988 1356990 1391284 1426989 1464438
53399 1464438 1503674 1544417 1586509 1630081 1675178 1721552 1768922 1817171 1866209 1915963 1966595
53388 1966595 2018384 2071092 2123637 2174687 2223568 2270491 2315913 2359765 2401343 2439953 2475618
$$ packed form
53472A369963P193N294L602J815j57k223m301o332q231r927j1405j2663j3602
53459A319026j4035j3871j3405j3330j4143j5573j6879j7674j8148j8492j8643
53448A144833j8609j8610j8629j8365j7815j7353j6960j5962j3986j1655r773
53437I67116q277o602m748l323k661k469k254j687o63O42J897L078M546O307P719
53422I58621Q337Q690R590J0971J2145J3006J4177J5977J7931J9534K0891K2353
53410A132223K3912K5256K6232K7065K8154K9695L1451L3002L4294L5705L7449
53399A464438L9236M0743M2092M3572M5097M6374M7370M8249M9038M9754N0632
53388A966595N1789N2708N2545N1050M8881M6923M5422M3852M1578L8610L5665
$$ plain form
53377 2475618 2508928 2540112 2568448 2592733 2612113 2626331 2635591 2640497 2641759 2639362 2632254 2619304
53365 2619304 2600370 2575904 2545886 2510073 2469235 2425166 2379272 2331874 2283208 2234226 2185885
53354 2185885 2138230 2090780 2043519 1997068 1952145 1909197 1868240 1828707 1789711 1750772 1712107
53343 1712107 1674072 1636627 1599621 1563267 1528066 1494458 1462764 1433180 1405649 1380002 1356402
53332 1356402 1335373 1317193 1301565 1287965 1275925 1264830 1253917 1242720 1231128 1218815 1205195
53321 1205195 1190386 1175700 1162572 1151186 1140665 1130374 1120549 1111772 1104350 1098258 1093341 1089505
53309 1089505 1086901 1085876 1086560 1088594 1091443 1094937 1099301 1104730 1111167 1118530 1127063 1137383 1150019 1164855
53295 1164855 1181172 1198483 1217172 1237957 1260862 1285151 1310142 1335528 1360887 1385525 1408980
$$ packed form
53377B475618L3310L1184K8336K4285J9380J4218R260M906J262k397p108j2950
53365B619304j8934k4466l0018l5813m0838m4069m5894m7398m8666m8982m8341
53354B185885m7655m7450m7261m6451m4923m2948m0957l9533l8996l8939l8665
53343A712107l8035l7445l7006l6354l5201l3608l1694k9584k7531k5647k3600
53332A356402k1029j8180j5628j3600j2040j1095j0913j1197j1592j2313j3620
53321A205195j4809j4686j3128j1386j0521j0291r825q777p422o092m917l836
53309A089505k604j025O84K034K849L494M364N429O437P363Q533J0320J2636J4836
53295A164855J6317J7311J8689K0785K2905K4289K4991K5386K5359K4638K3455
$$ plain form
53284 1408980 1431169 1451857 1470588 1487340 1502646 1516736 1529116 1539348 1547626 1554079 1557970 1558246
53272 1558246 1554618 1547680 1538262 1527110 1514826 1501512 1486538 1469111 1449042 1426788 1403011 1378352
53260 1378352 1353300 1327887 1301745 1274763 1247470 1220500 1193928 1167381 1140484 1113025 1085163
53249 1085163 1057781 1032074 1008334 985604 962949 940500 918681 897046 874792 852133 830230
53238 830230 809872 790938 773038 755944 739419 723347 708140 694385 682088 670784 660394
53227 660394 651316 643606 636664 629888 623034 615764 607345 597217 585606 573386 561440 550075 538794
53214 538794 526747 513750 500743 488814 477962 467371 456790 446892 438193 430376 422974 416070
53202 416070 409837 403912 397772 391466 385460 379851 374126 367677 360318 352402 344667 337909 332515 328185
$$ packed form
53284A408980K2189K0688J8731J6752J5306J4090J2380J0232Q278O453L891K76
53272A558246l628o938r418j1152j2284j3314j4974j7427k0069k2254k3777k4659
53260A378352k5052k5413k6142k6982k7293k6970k6572k6547k6897k7459k7862
53249A085163k7382k5707k3740k2730k2655k2449k1819k1635k2254k2659k1903
53238H30230k0358j8934j7900j7094j6525j6072j5207j3755j2297j1304j0390
53227F60394r078p710o942o776o854p270q419j0128j1611j2220j1946j1365j1281
53214E38794j2047j2997j3007j1929j0852j0591j0581r898q699p817p402o904
53202D16070o233n925o140o306o006n609n725o449p359p916p735o758n394m330
$$ plain form
53188 328185 324187 319935 315312 310568 306036 301974 298558 295848 293668 291615 289366 287014 284964 283462
53174 283462 282362 281382 280359 279181 277700 275914 274094 272598 271655 271301 271300 271088 270156 268659 267270 266238
53158 266238 265008 263066 260743 258747 257238 255873 254494 253281 252324 251542 250923 250443 249849 248899 247727 246611
53142 246611 245540 244385 243321 242590 242086 241675 241815 243165 245544 247822 249014 249054 248479 247874 247721 248295 249402
53125 249402 250533 251450 252364 253517 254906 256485 258247 259968 261225 261893 262367 263129 264241 265368 266148 266445
53109 266445 266400 266250 265960 265149 263560 261524 259651 258102 256464 254327 251755 249213 247318 246537 246823 247499
53093 247499 247785 247397 246471 245098 243314 241448 240015 239213 238805 238491 238134 237764 237617 238043 239022 240001 240575
53076 240575 241007 241610 241954 241451 240505 240197 240780 241342 241119 240350 239637 239190 239032 239203 239326 238645 236986 235176
$$ packed form
53188C28185l998m252m623m744m532m062l416k710k180k053k249k352k050j502
53174B83462j100r80j023j178j481j786j820j496r43l54jk12r32j497j389j032
53158B66238j230j942k323j996j509j365j379j213r57p82o19m80n94r50j172j116
53142B46611j071j155j064p31n04m11J40J350K379K278J192M0n75o05j53N74J107
53125B49402J131R17R14J153J389J579J762J721J257O68M74P62J112J127P80K97
53109B66445m5j50k90q11j589k036j873j549j638k137k572k542j895p81K86O76
53093B47499K86l88r26j373j784j866j433q02m08l14l57l70j47M26R79R79N74
53076B40575M32O03L44n03r46l08N83N62k23p69p13m47j58J71J23o81j659j810
$$ plain form
53058 235176 234063 233619 233429 233484 233927 234459 234763 235214 236512 238692 241054 243049 244698 246145 247260 247818
53042 247818 247749 247061 245756 243940 241985 240466 239855 240115 240607 240584 239856 238790 237693 236541 235415 234807 235143
53025 235143 236222 237438 238441 239329 240308 241404 242500 243451 244210 244894 245659 246418 246828 246647 246120 245916 246654
53008 246654 248337 250130 250962 250607 250019 250253 251232 252062 252396 252756 253454 253999 253947 253669 253767 254276 254936 255794 256847
52989 256847 257487 257124 256309 256421 258056 260315 261984 262987 264259 266413 268947 270827 271578 271611 271612 271867 272302
52972 272302 272854 273484 273934 273920 273616 273575 274012 274537 274820 275173 276201 278107 280579 283108 285120 286101 285989 285335
52954 285335 284736 284167 283176 281603 279780 278058 276470 274893 273265 271601 269982 268592 267583 266847 266103
52939 266103 265278 264730 265019 266395 268389 269883 269785 267884 265047 262454 260613 259156 257526 255753 254553
$$ packed form
53058B35176j113m44j90N5M43N32L04M51J298K180K362J995J649J447J115N58
53042B47818o9o88j305j816j955j519o11K60M92k3p28j066j097j152j126o08L36
53025B35143J079J216J003Q88R79J096J096R51P59O84P65P59M10j81n27k04P38
53008B46654J683J793Q32l55n88K34R79Q30L34L60O98N45n2k78R8N09O60Q58J053
52989B56847O40l63q15J12J635K259J669J003J272K154K534J880P51L3JK55M35
52972B72302N52O30M50j4l04m1M37N25K83L53J028J906K472K529K012R81j12o54
52954B85335n99n69r91j573j823j722j588j577j628j664j619j390j009p36p44
52939B66103q25n48K89J376J994J494r8j901k837k593j841j457j630j773j200
$$ plain form
52924 254553 254651 255989 257656 258707 259014 259146 259544 260075 260379 260290 259800 258987 258152 257755 257951 258438 258956 259580
52906 259580 260243 260313 259217 257340 255748 254978 254544 253762 252595 251430 250482 249828 249802 250772 252424 253727 253912
52889 253912 253289 252816 253039 253762 254634 255540 256318 256575 256188 255677 255701 256324 257102 257677 257869 257440 256373 255312
52871 255312 255102 255797 256704 257575 259084 261721 264814 267237 268809 270299 272215 274145 275457 276093 276383 276333
52855 276333 275504 273597 270896 267929 264812 261233 257149 253179 250028 247784 246135 245067 244778 244878 244356
52840 244356 242637 240339 238614 237998 238122 238267 237894 236824 235258 233635 232325 231473 231204 231731 233138 235189
52824 235189 237406 239205 239969 239362 237752 236105 235223 235223 235807 236710 237732 238694 239636 240819 242267 243567 244398
52807 244398 244998 245760 246533 246736 246116 245045 243997 243016 241772 240007 237830 235633 233778 232331 231134 230057
$$ packed form
52924B54553R8J338J667J051L07J32L98N31L04q9m90q13q35l97J96M87N18O24
52906B59580O63P0j096j877j592p70m34p82j167j165r48o54k6R70J652J303J85
52889B53912o23m73K23P23Q72R06P78K57l87n11K4O23P78N75J92m29j067j061
52871B55312k10O95R07Q71J509K637L093K423J572J490J916J930J312O36K90n0
52855B76333q29j907k701k967l117l579m084l970l151k244j649j068k89J00n22
52840B44356j719k298j725o16J24J45l73j070j566j623j310q52k69N27J407K051
52824B35189K217J799P64o07j610j647q82%N84R03J022R62R42J183J448J300Q31
52807B44398O00P62P73K03o20j071j048r81j244j765k177k197j855j447j197j077
$$ plain form
52791 230057 229113 228377 227925 227815 227995 228262 228512 228930 229712 230727 231736 232825 234183 235484 236006 235514 234674
52774 234674 234373 234926 235961 236719 236410 234762 232427 230529 229647 229522 229703 229948 229950 229357 228372 227773 227997 228717
52756 228717 229566 230699 232240 233781 234951 235957 236991 237616 237405 236883 237112 238524 240715 243207 245822
52741 245822 248456 251026 253587 256080 258103 259401 260396 261778 263664 265610 267342 268994 270692 272343
52727 272343 273813 274934 275361 274819 273518 272102 271142 270804 270800 270524 269478 267814 266178 264893 263714 262560
52711 262560 261901 261973 262177 261844 261156 260684 260491 260399 260705 261765 263107 263888 264071 264273 264527 264163 263105 262320
52693 262320 262613 263635 264500 264921 265359 266325 267804 269224 269959 269979 269818 269718 269211 267967 266577 265763 265165
52676 265165 263835 261748 259881 258753 257878 256847 256018 255770 255885 256070 256480 257294 258332 259416 260626 261920
$$ packed form
52791B30057r44p36m52j10J80K67K50M18P82J015J009J089J358J301N22m92q40
52774B34674l01N53J035P58l09j648k335j898q82j25J81K45Kn93r85n99K24P20
52756B28717Q49J133J541J541J170J006J034O25k11n22K29J412K191K492K615
52741B45822K634K570K561K493K023J298R95J382J886J946J732J652J698J651
52727B72343J470J121M27n42j301j416r60l38mk76j046j664j636j285j179j154
52711B62560o59P2K04l33o88m72j93r2L06J060J342P81J83K02K54l64j058p85
52693B62320K93J022Q65M21M38R66J479J420P35K0j61j00n07j244j390q14n98
52676B65165j330k087j867j128q75j031q29k48J15J85M10Q14J038J084J210J294
$$ plain form
52660 261920 263001 263789 264488 264993 264930 264593 265136 267390 271021 275275 279892 284717 288880 291155 290983 288831
52644 288831 285731 282711 280298 278238 276006 273768 272356 272043 272025 271519 270695 269961 269037 267586 266216 265868
52628 265868 266476 267243 268060 269593 271879 273880 274742 274630 273941 272540 270403 268298 267067 266569 266134 265805
52612 265805 266294 267762 269466 270787 271835 272675 272728 271641 270237 269722 270120 270334 269815 269325 269784 271090 272497
52595 272497 273579 274296 274597 274534 274408 274295 273729 272403 270886 270091 270285 271146 272459 274087 275566 276516 277291
52578 277291 278401 279439 279507 278655 277892 277617 277120 276027 275208 275599 276855 277940 278478 278795 279026 278914 278383
52561 278383 277702 277079 276460 275701 274684 273401 272054 270926 270044 269243 268557 268143 267749 266832 265479 264595 264744
52544 264744 265263 265046 263877 262524 261803 261989 262902 264008 264608 264379 263708 263193 262976 262822 262659 262630 262771 262989
$$ packed form
52660B61920J081P88O99N05o3l37N43K254L631M254M617M825M163K275j72k152
52644B88831l100l020k413k060k232k238j412l13j8n06q24p34r24j451j370l48
52628B65868O08P67Q17J533K286K001Q62j12o89j401k137k105j231m98m35l29
52612B65805M89J468J704J321J048Q40N3j087j404n15L98K14n19m90M59J306J407
52595B72497J082P17L01o3j26j13n66j326j517p95J94Q61J313J628J479R50P75
52578B77291J110J038O8q52p63k75m97j093q19L91J256J085N38L17K31j12n31
52561B78383o81o23o19p59j017j283j347j128q82q01o86m14l94r17j353q84J49
52544B64744N19k17j169j353p21J86R13J106O00k29o71n15k17j54j63k9J41K18
$$ plain form
52526 262989 263307 263835 264571 265445 266472 267660 268930 270256 271693 273070 273933 274098 274070 274656 276265 278752
52510 278752 281761 285000 288362 291932 295750 299476 302511 304496 305373 304994 303186 300346 297336 294486 291233
52495 291233 287138 282714 278746 275364 272401 270189 269242 269365 269808 270166 270541 270934 271130 271166 271334 271699 272083
52478 272083 272511 273195 274111 275044 275979 277047 278167 279209 280415 282136 284197 286103 287853 289964 292613
52463 292613 295349 297837 300310 303013 305677 307851 309305 309814 309013 306913 304296 302034 300100 297730 294627
52448 294627 291572 289582 288710 288032 286769 284995 283081 280842 277802 274215 271214 269637 269120 268744 268196
52433 268196 267820 267727 267508 266948 266516 266790 267630 268282 268307 268169 268727 270283 272368 274466 276505 278363 279356 278898
52415 278898 277597 276936 277673 279225 280905 283048 286344 290648 295159 299577 304416 310281 317313 325190 333202
$$ packed form
52526B62989L18N28P36Q74J027J188J270J326J437J377Q63J65k8N86J609K487
52510B78752L009L239L362L570L818L726L035J985Q77l79j808k840l010k850l253
52495B91233m095m424l968l382k963k212r47J23M43L58L75L93J96L6J68L65L84
52478B72083M28O84R16R33R35J068J120J042J206J721K061J906J750K111K649
52463B92613K736K488K473K703K664K174J454N09q01k100k617k262j934k370l103
52448B94627l055j990q72o78j263j774j914k239l040l587l001j577n17l76n48
52433B68196l76r3k19n60m32K74Q40O52K5j38N58J556K085K098K039J858R93m58
52415B78898j301o61P37J552J680K143L296M304M511M418M839N865P032P877Q012
$$ plain form
52400 333202 340338 345734 349013 350046 348681 345065 339922 334017 327600 320865 314622 309846 306688 304581
52386 304581 303189 302570 302436 302093 301372 300993 301659 303228 305026 306598 307889 309096 310612 312905 316214 320436
52370 320436 325322 330543 335622 340180 344258 348071 351346 353318 353613 352819 351953 351495 351127 350329 349087 347983
52354 347983 347549 347587 347433 346970 346976 348113 349946 351504 352559 353685 355182 356673 357868 359088 360796 363159
52338 363159 366246 370173 374814 379837 385287 391753 399641 408620 418044 427657 437623 448162 459443 471612
52324 471612 484674 498515 513234 529234 546691 565020 583070 599886 615358 630263 645662
52313 645662 662073 679216 696644 714361 732507 750677 768182 784949 801538 818091 833952
52302 833952 848699 862987 877799 893145 908043 921660 933974 945297 955555 964187 970568 974398
$$ packed form
52400C33202P136N396L279J033j365l616n143n905o417o735o243m776l158k107
52386C04581j392o19j34l43p21l79O66J569J798J572J291J207J516K293L309M222
52370C20436M886N221N079M558M078L813L275J972K95p94q66m58l68p98j242j104
52354C47983m34L8j54m63OJ137J833J558J055J126J497J491J195J220J708K363
52338C63159L087L927M641N023N450O466P888Q979R424R613R966J0539J1281J2169
52324D71612J3062J3841J4719J6000J7457J8329J8050J6816J5472J4905J5399
52313F45662J6411J7143J7428J7717J8146J8170J7505J6767J6589J6553J5861
52302H33952J4747J4288J4812J5346J4898J3617J2314J1323J0258Q632O381L830
$$ plain form
52290 974398 975756 974842 971729 966394 959014 950142 940593 931116 922106 913585 905577 898538 893169 889637
52276 889637 887321 885640 884864 885653 888036 891378 895294 900027 905886 912931 921237 930945 941823 953315
52262 953315 965210 977810 991193 1004786 1017989 1030839 1043808 1057224 1071132 1085361 1099509
52251 1099509 1113096 1125938 1138033 1148964 1157857 1164138 1167891 1169279 1168089 1164214 1158069 1150147 1140549
52238 1140549 1129464 1117680 1106045 1094646 1083015 1070946 1058595 1045979 1032961 1019683 1006556
52227 1006556 993802 981434 969680 958996 949606 941360 934093 927774 922296 917491 913501 910826 909810
52214 909810 910249 911595 913447 915740 918615 922160 926236 930512 934773 939105 943584 947851 951286 953739
52200 953739 955865 958506 961778 965055 967941 970938 974874 979794 984857 989414 993747 998483 1003680 1008898
$$ packed form
52290I74398J358r14l113n335p380q872r549r477r010q521q008p039n369l532
52276H89637k316j681p76P89K383L342L916M733N859P045Q306R708J0878J1492
52262I53315J1895J2600J3383J3593J3203J2850J2969J3416J3908J4229J4148
52251A099509J3587J2842J2095J0931Q893O281L753J388j190l875o145p922r598
52238A140549j1085j1784j1635j1399j1631j2069j2351j2616j3018j3278j3127
52227A006556j2754j2368j1754j0684r390q246p267o319n478m805l990k675j016
52214I09810M39J346J852K293K875L545M076M276M261M332M479M267L435K453
52200I53739K126K641L272L277K886K997L936M920N063M557M333M736N197N218
$$ plain form
52186 1008898 1013831 1018336 1021950 1024016 1024271 1022780 1019279 1013259 1004876 995219 985356 975571 965850 956592
52172 956592 948393 941454 935644 930942 927421 924958 923286 922172 921397 920844 920903 922401 925682 929988 934201
52157 934201 938020 941922 946049 949637 951704 952028 951303 950480 949985 949561 948902 948351 948707 950371 953094 956609
52141 956609 960925 965648 969608 971830 972619 973104 973869 974707 975604 977291 980626 985910 993017 1001847 1012475
52126 1012475 1025156 1040280 1058092 1078332 1100338 1123625 1148196 1174322 1202165 1231498 1261471
52115 1261471 1290703 1318030 1343303 1367171 1389957 1411107 1429927 1446472 1461298 1474538 1485708
52104 1485708 1494493 1501404 1507469 1513511 1519885 1526638 1533481 1539591 1543886 1545727 1545213 1542610 1537832 1530663
52090 1530663 1521191 1509544 1495457 1478612 1459436 1439115 1418791 1399178 1380805 1364102 1349128
$$ packed form
52186A008898M933M505L614K066K55j491l501o020q383r657r863r785r721r258
52172I56592q199o939n810m702l521k463j672j114p75n53N9J498L281M306M213
52157I34201L819L902M127L588K067L24p25q23m95m24o59n51L56J664K723L515
52141I56609M316M723L960K222P89M85P65Q38Q97J687L335N284P107Q830J0628
52126A012475J2681J5124J7812K0240K2006K3287K4571K6126K7843K9333K9973
52115A261471K9232K7327K5273K3868K2786K1150J8820J6545J4826J3240J1170
52104A485708Q785O911O065O042O374O753O843O110M295J841n14k603m778p169
52090A530663r472j1647j4087j6845j9176k0321k0324j9613j8373j6703j4974
$$ plain form
52079 1349128 1335755 1324187 1314773 1307255 1300927 1295739 1292547 1291909 1293370 1296335 1300866 1307080 1314504 1322836
52065 1322836 1332680 1344556 1357645 1370530 1382927 1395666 1409142 1422828 1436345 1449974 1463766
52054 1463766 1477002 1488930 1499433 1508668 1516571 1522986 1527745 1530332 1529964 1526271 1519453 1509608 1496523
52041 1496523 1480456 1462586 1444148 1425469 1406332 1386955 1368005 1349766 1331872 1314075 1296960
52030 1296960 1281569 1268330 1256555 1245134 1233629 1222400 1211708 1201192 1190532 1180139 1170611
52019 1170611 1161734 1152742 1143518 1134870 1127497 1121254 1115603 1110247 1105069 1099883 1094536 1088839 1082163 1073510
52005 1073510 1062308 1048865 1033859 1017661 1000332 981925 962534 942367 921969 902125 883303
51994 883303 865525 848863 833674 820099 807721 795939 784352 772618 760428 747925 735627
$$ packed form
52079A349128j3373j1568r414p518o328n188l192o38J461K965M531O214P424Q332
52065A322836R844J1876J3089J2885J2397J2739J3476J3686J3517J3629J3792
52054A463766J3236J1928J0503R235P903O415M759K587l68l693o818r845j3085
52041A496523j6067j7870j8438j8679j9137j9377j8950j8239j7894j7797j7115
52030A296960j5391j3239j1775j1421j1505j1229j0692j0516j0660j0393r528
52019A170611q877q992r224q648p373o243n651n356n178n186n347n697o676q653
52005A073510j1202j3443j5006j6198j7329j8407j9391k0167k0398j9844j8822
51994H83303j7778j6662j5189j3575j2378j1782j1587j1734j2190j2503j2298
$$ plain form
51983 735627 723560 710936 697164 682714 668400 654254 639781 625063 610832 597596 585420
51972 585420 574529 565322 557680 551035 545390 541648 540556 541836 544728 548945 554623 561677 569671 578114
51958 578114 586401 593606 598788 601517 601788 599572 594973 588805 582435 576714 571434 566205 561569 558735
51944 558735 558343 560031 563308 568339 575533 584706 595135 606349 618463 631698 645833 660272 674352
51931 674352 687439 698819 707676 713215 714840 712349 706066 696811 685707 673934 662478 651936 642616
51918 642616 634916 629508 627014 627600 631028 636833 644049 650819 654793 654250 648794 639087 626322 611984
51904 611984 597611 584318 572647 563071 556281 552552 550968 549763 547552 543990 539213 533030 524918
51891 524918 514633 502552 489404 475850 462469 450035 439565 431929 427400 425655 426123 428207 431267
$$ packed form
51983G35627j2067j2624j3772j4450j4314j4146j4473j4718j4231j3236j2176
51972E85420j0891r207p642o645n645l742j092J280K892M217N678P054P994Q443
51958E78114Q287P205N182K729K71k216m599o168o370n721n280n229m636k834
51944E58735l92J688L277N031P194R173J0429J1214J2114J3235J4135J4439J4080
51931F74352J3087J1380Q857N539J625k491o283r255j1104j1773j1456j0542r320
51918F42616p700n408k494N86L428N805P216O770L974n43n456r707j2765j4338
51904F11984j4373j3293j1671r576o790l729j584j205k211l562m777o183q112
51891E24918j0285j2081j3148j3554j3381j2434j0470p636m529j745M68K084L060
$$ plain form
51878 431267 434763 438576 443045 448560 455207 462877 471479 480777 490054 498208 504303 507954 509251 508499
51864 508499 506101 502519 498143 493167 487742 482282 477570 474427 473234 473780 475482 477657 479661 481065
51850 481065 481856 482321 482537 482021 480011 476074 470408 463684 456705 450035 443723 437444 431096 425133 420104
51835 420104 416007 412474 409532 407747 407514 408540 410203 412139 414270 416445 418270 419256 419085 417848 415986
51820 415986 413823 411243 408103 404891 402529 401466 401395 402023 403582 406223 409396 412288 414625 416535 417920
51805 417920 418564 418751 419180 420161 421336 422206 422516 422044 420630 418691 417279 417190 418196 419390 420023 419722 418209
51788 418209 415408 411856 408528 406098 404561 403639 403214 403189 403262 403147 402889 402668 402423 402017 401705 401997 403041
51771 403041 404560 406641 410176 416136 424563 434651 445614 457090 468765 480113 490601 499782 507050
$$ packed form
51878D31267L496L813M469N515O647P670Q602R298R277Q154O095L651J297p52
51864E08499k398l582m376m976n425n460m712l143j193N46J702K175K004J404
51850D81065P91M65K16n16k010l937n666o724o979o670o312o279o348n963n029
51835D20104m097l533k942j785k33J026J663J936K131K175J825R86j71j237j862
51820D15986k163k580l140l212k362j063p1O28J559K641L173K892K337J910J385
51805D17920O44J87M29R81J175Q70L10m72j414j939j412q9J006J194O33l01j513
51788D18209k801l552l328k430j537r22m25k5P3j15k58k21k45m06l12K92J044
51771D03041J519K081L535N960Q427J0088J0963J1476J1675J1348J0488R181P268
$$ plain form
51758 507050 511600 512837 510710 505661 498550 490576 482705 474957 466644 457623 448916 441640 435679 430024
51744 430024 424268 419169 415671 413950 413588 414180 415494 417457 420387 424995 431767 440434 450290 460760
51730 460760 471292 480852 488117 492425 494258 494810 495353 497049 500696 506111 511840 515927 517030 514776
51716 514776 509410 501647 492805 484467 477723 472898 469936 468496 467530 465368 460911 454702 448448 443639
51702 443639 440849 440104 441196 443478 445812 447165 447248 446489 445474 444520 443681 443027 442808 443260 444217 445060 445109
51685 445109 443980 441472 437471 432251 426718 421913 418214 415334 413095 411822 411817 412791 414139 415690 417937
51670 417937 421529 426665 433060 440403 448745 458441 469806 482926 497547 512773 526806 537427 543096
51657 543096 543514 539188 530970 520305 509352 500062 493159 488416 485754 485424 487116 489461 490666 489407
$$ packed form
51758E07050M550J237k127n049p111p974p871p748q313r021q707p276n961n655
51744D30024n756n099l498j721l62N92J314J963K930M608O772Q667R856J0470
51730D60760J0532R560P265M308J833N52N43J696L647N415N729M087J103k254
51716E14776n366p763q842q338o744m825k962j440r66k162m457o209o254m809
51702D43639k790p45J092K282K334J353Q3p59j015r54q39o54k19M52R57Q43M9
51685D45109j129k508m001n220n533m805l699k880k239j273nR74J348J551K247
51670D17937L592N136O395P343Q342R696J1365J3120J4621J5226J4033J0621N669
51657E43096M18m326q218j0665j0953r290o903m743k662l30J692K345J205j259
$$ plain form
51643 489407 485174 478279 469608 459986 449706 438992 428775 420348 414076 409009 404025 398941 394342
51630 394342 390903 389172 389493 391592 394480 397149 399257 400962 402405 403578 404442 404937 405047 405004 405080 405112 404618
51613 404618 403584 402598 401872 400637 398045 394391 390900 388459 386993 385917 384783 383505 382342 381750 382124
51598 382124 383664 386463 390490 395463 401169 408048 416984 428097 439969 450310 457161 459478 457304
51585 457304 451974 445662 440009 435269 431149 428047 426837 427768 430362 434360 440130 448089 458323 470765
51571 470765 485141 500623 516083 531030 545978 561705 578362 595420 612204 628370 644124
51560 644124 660224 677838 698334 722911 751956 784541 818861 853254 886300 915745 938192
51549 938192 950841 953340 947302 934269 914906 889985 861004 829487 796307 762042 727472 693470
$$ packed form
51643D89407m233o895q671r622j0280j0714j0217q427o272n067m984n084m599
51630C94342l439j731L21K099K888K669K108J705J443J173Q64M95J10m3P6L2m94
51613D04618j034r86p26j235k592l654l491k441j466j076j134j278j163n92L74
51598C82124J540K799M027M973N706O879Q936J1113J1872J0341O851K317k174
51585D57304n330o312n653m740m120l102j210R31K594L998N770P959J0234J2442
51571D70765J4376J5482J5460J4947J4948J5727J6657J7058J6784J6166J5754
51560F44124J6100J7614K0496K4577K9045L2585L4320L4393L3046K9445K2447
51549I38192J2649K499o038j3033j9363k4921k8981l1517l3180l4265l4570l4002
$$ plain form
51537 693470 660786 630134 602156 577211 555553 537655 523739 512906 503403 494141 485506 478451
51525 478451 473244 469420 466453 464003 461796 459729 458031 457068 457094 458193 460169 462365 463981 464777 465123
51510 465123 465074 463812 460442 455137 449070 443321 438140 433224 428367 423759 419839 416885 414727 412880 410989
51495 410989 409028 407102 405260 403596 402327 401635 401498 401693 401882 401703 400999 399962 398889 397837 396728 395651
51479 395651 394704 393551 391587 388688 385426 382393 379632 376897 374127 371488 369162 367224 365510 363566
51465 363566 361104 358512 356497 355125 353795 352367 351581 351930 352748 353122 353319 354492 357089 360302 363108
51450 363108 365241 367074 369154 372067 376265 381666 387720 394154 401448 410414 421396 433954 446986
51437 446986 458941 468266 474118 476747 477054 475805 473411 470351 467328 464726 462018 458049 452021 444169
$$ packed form
51537F93470l2684l0652k7978k4945k1658j7898j3916j0833r503r262q635p055
51525D78451n207l824k967k450k207k067j698r63K6J099J976K196J616P96L46
51510D65123m9j262l370n305o067n749n181m916m857m608l920k954k158j847j891
51495D10989j961j926j842j664j269o92j37J95J89j79p04j037j073j052j109j077
51479C95651r47j153j964k899l262l033k761k735k770k639k326j938j714j944
51465C63566k462k592k015j372j330j428p86L49Q18L74J97J173K597L213K806
51450C63108K133J833K080K913M198N401O054O434P294Q966J0982J2558J3032
51437D46986J1955R325N852K629L07j249k394l060l023k602k708l969o028p852
$$ plain form
51423 444169 435529 427263 420280 415203 412250 411037 410669 410242 409386 408452 408211 409231 411340 413693 415517
51408 415517 416765 417925 419303 420712 421858 422650 423048 422929 422359 421829 421895 422550 423183 423275 423043 423301 424735
51391 424735 427443 431211 436013 442064 449528 458456 469010 481456 495991 512982 533460 558754 589277
51378 589277 624065 661960 702885 747383 795269 845369 896219 945938 991293 1027952 1052511
51367 1052511 1064175 1064324 1054856 1037120 1011889 979795 941829 899617 855077 809719 764432 719949
51355 719949 677136 636794 599616 566483 538309 515288 496576 480945 467510 455792 445542
51344 445542 436713 429163 422146 414555 406013 397308 389425 382594 376645 371761 368206 365621 363232 360678
51330 360678 358155 355846 353731 351905 350575 349683 348871 347892 346815 345868 345347 345569 346622 348176 349832 351636
$$ packed form
51423D44169q640q266o983n077k953j213l68m27q56r34k41J020K109K353J824
51408D15517J248J160J378J409J146P92L98j19n70n30O6O55O33R2k32K58J434
51391D24735K708L768M802O051P464Q928J0554J2446J4535J6991K0478K5294L0523
51378E89277L4788L7895M0925M4498M7886N0100N0850M9719M5355L6659K4559
51367A052511J1664J49r468j7736k5231l2094l7966m2212m4540m5358m5287m4483
51355G19949m2813m0342l7178l3133k8174k3021j8712j5631j3435j1718j0250
51344D45542q829p550p017p591q542q705p883o831n949m884l555k585k389k554
51330C60678k523k309k115j826j330q92q12r79j077r47n21K22J053J554J656J804
$$ plain form
51314 351636 353957 356877 359945 362584 364620 366464 368822 372050 375577 378141 378828 377818 375985 373980
51300 373980 371884 369522 366796 363812 360896 358388 356263 354140 351829 349606 347747 346079 344317 342571
51286 342571 341225 340548 340759 342177 344857 348275 351814 355433 359488 364074 368915 373686 378007 381323 383277
51271 383277 384168 384614 384932 385221 385821 387098 388915 390875 393026 395744 398948 402011 404473 406265 407186 406825
51255 406825 405151 402654 399756 396564 393324 390483 388071 385591 382826 380173 377859 375393 372328 369145
51241 369145 366742 365277 364019 362238 359811 357025 354262 351936 350318 349268 348315 347150 345955 345176 345011
51226 345011 345115 344876 344012 342917 342388 343007 344817 347453 350434 353423 356428 359704 363306 366818 369741
51211 369741 372032 374014 375874 377629 379494 381861 384880 388432 392421 396648 400374 402668 403388 403352 403231
$$ packed form
51314C51636K321K920L068K639K036J844K358L228L527K564O87j010j833k005
51300C73980k096k362k726k984k916k508k125k123k311k223j859j668j762j746
51286C42571j346o77K11J418K680L418L539L619M055M586M841M771M321L316J954
51271C83277Q91M46L18K89O00J277J817J960K151K718L204L063K462J792R21l61
51255D06825j674k497k898l192l240k841k412k480k765k653k314k466l065l183
51241C69145k403j465j258j781k427k786k763k326j618j050r53j165j195p79j65
51226C45011J04k39q64j095n29O19J810K636K981K989L005L276L602L512K923
51211C69741K291J982J860J755J865K367L019L552L989M227L726K294P20l6j21
$$ plain form
51196 403231 402781 401484 399469 397323 395290 393183 390905 388608 386378 384142 381906 379835 378151 377074
51182 377074 376730 376944 377311 377631 378027 378433 378371 377634 376836 376724 377060 376863 375803 374704 374457 374937 375405 375605
51164 375605 375996 377008 378500 380084 381690 383625 386132 389072 392147 395350 398955 402919 406468 408627
51150 408627 409171 408759 408007 406733 404392 401069 397647 394929 392916 391079 389081 386987 384895 382704 380343
51135 380343 378019 376097 374772 373939 373319 372716 372177 371976 372358 373310 374636 376239 378235 380823 384174 388327
51119 388327 392906 396973 399570 400709 401558 403363 406363 409970 413735 417650 421697 425604 429116 432103
51105 432103 434302 435424 435699 435935 436680 437557 437764 437147 436409 436192 436300 436040 435178 434192 433535 432972 432018 430849
51087 430849 430269 430648 431412 431877 432153 432776 433741 434522 434923 435286 435842 436457 437140 438217 439689 440888 441199 440826
$$ packed form
51196D03231m50j297k015k146k033k107k278k297k230k236k236k071j684j077
51182C77074l44K14L67L20L96M06o2p37p98j12L36j97j060j099k47M80M68K00
51164C75605L91J012J492J584J606J935K507K940L075L203L605L964L549K159
51150D08627N44m12p52j274k341l323l422k718k013j837j998k094k092k191k361
51135C80343k324j922j325q33o20o03n39k01L82R52J326J603J996K588L351M153
51119C88327M579M067K597J139Q49J805L000L607L765L915M047L907L512K987
51105D32103K199J122K75K36P45Q77K07o17p38k17J08k60q62r86o57n63r54j169
51087D30849n80L79P64M65K76O23R65P81M01L63N56O15O83J077J472J199L11l73
$$ plain form
51069 440826 440481 440584 441163 442403 444789 448652 453899 460339 468053 477258 487899 499677 512575 527137
51055 527137 543689 561171 577153 589588 598600 606300 614947 625609 638331 652672 667608 681393
51043 681393 692333 699848 704463 706639 705825 700875 691455 678939 665840 654322 645217 638143 631982
51030 631982 625099 615839 603659 589775 576197 564102 553519 544387 537188 532420 530071 529857 531524
51017 531524 534701 538978 544339 551067 558918 566929 574355 581350 588357 595288 601776 607836 613799 619885
51003 619885 626382 633924 642965 653042 663043 672234 680722 688999 697368 705689 713388 719799 724790 728873
50989 728873 732499 735531 737762 739555 741432 743389 745325 748068 753208 761695 773155 786661 801573
50976 801573 817364 833184 848211 862376 876541 892041 910153 931792 957477 987548 1022402
$$ packed form
51069D40826l45J03N79J240K386L863N247O440P714R205J0641J1778J2898J4562
51055E27137J6552J7482J5982J2435R012P700Q647J0662J2722J4341J4936J3785
51043F81393J0940P515M615K176q14m950r420j2516j3099j1518r105p074o161
51030F31982o883r260j2180j3884j3578j2095j0583r132p199m768k349k14J667
51017E31524L177M277N361O728P851Q011P426O995P007O931O488O060N963O086
51003F19885O497P542R041J0077J0001R191Q488Q277Q369Q321P699O411M991M083
50989G28873L626L032K231J793J877J957J936K743N140Q487J1460J3506J4912
50976H01573J5791J5820J5027J4165J4165J5500J8112K1639K5685L0071L4854
$$ plain form
50965 1022402 1062388 1107545 1157585 1212096 1270506 1331940 1395475 1460645 1527387 1595283 1662997
50954 1662997 1728625 1790518 1847598 1899040 1943880 1981198 2010667 2032854 2048771 2059148 2064327
50943 2064327 2064864 2061949 2057055 2051349 2045568 2040025 2034306 2027161 2017229 2004079 1988404 1971234 1953137
50930 1953137 1934028 1913397 1890641 1865365 1837376 1806415 1772145 1734580 1694207 1651389 1605960
50919 1605960 1557903 1508178 1458369 1409626 1362457 1317395 1275143 1236007 1199859 1166806 1137277
50908 1137277 1111228 1087845 1066397 1046870 1029412 1013591 998695 984478 971180 959032 948088
50897 948088 938397 929979 922727 916497 911197 906618 902499 898936 896459 895402 895450 896131 897472 899794 903002
50882 903002 906435 909363 911387 912581 913643 915809 920187 927027 935672 945040 954081 962213 969822 978135
$$ packed form
50965A022402L9986M5157N0040N4511N8410O1434O3535O5170O6742O7896O7714
50954A662997O5628O1893N7080N1442M4840L7318K9469K2187J5917J0377N179
50943B064327N37k915m894n706n781n543n719p145r932j3150j5675j7170j8097
50930A953137j9109k0631k2756k5276k7989l0961l4270l7565m0373m2818m5429
50919A605960m8057m9725m9809m8743m7169m5062m2252l9136l6148l3053k9529
50908A137277k6049k3383k1448j9527j7458j5821j4896j4217j3298j2148j0944
50897I48088r691q418p252o230n300m579m119l563k477j057M8O81J341K322L208
50882I03002L433K928K024J194J062K166M378O840Q645R368R041Q132P609Q313
$$ plain form
50868 978135 988176 999946 1013008 1027567 1044288 1063227 1083801 1106007 1130955 1159822 1192847
50857 1192847 1229695 1270366 1315377 1365531 1421927 1485813 1557892 1638015 1725938 1822024 1926744
50846 1926744 2039907 2161028 2290097 2427096 2570863 2719240 2870392 3023025 3175080
50837 3175080 3323028 3462872 3591111 3704357 3799026 3872475 3924132 3954780 3965170 3956245 3930456
50826 3930456 3891718 3843894 3790164 3734003 3679699 3631118 3590329 3557835 3533545 3516819 3505731
50815 3505731 3496958 3486590 3471042 3447472 3413818 3368648 3311045 3240723 3158226 3064626 2960945
50804 2960945 2848228 2728420 2604832 2481349 2361239 2246737 2139363 2040158 1949746 1868446
50794 1868446 1796293 1732908 1677602 1629849 1589436 1556099 1529384 1509077 1495172 1486913 1482288 1479147
$$ packed form
50868I78135J0041J1770J3062J4559J6721J8939K0574K2206K4948K8867L3025
50857A192847L6848M0671M5011N0154N6396O3886P2079Q0123Q7923R6086J04720
50846A926744J13163J21121J29069J36999J43767J48377J51152J52633J52055
50837C175080J47948J39844J28239J13246R4669P3449N1657L0648J0390q925k5789
50826C930456l8738m7824n3730n6161n4304m8581m0789l2494k4290j6726j1088
50815C505731q773j0368j5548k3570l3654m5170n7603p0322q2497r3600j03681
50804B960945j12717j19808j23588j23483j20110j14502j07374r9205r0412q1300
50794A868446p2153o3385n5306m7753m0413l3337k6715k0307j3905q259m625l141
$$ plain form
50782 1479147 1476717 1475468 1475628 1476424 1476718 1475835 1473660 1470389 1466332 1461618 1456070 1449557 1442319 1434508 1425558
50767 1425558 1414548 1401185 1385892 1368963 1350218 1329618 1307678 1285127 1262658 1241187 1221695
50756 1221695 1204419 1188641 1173690 1159841 1147867 1138059 1130115 1123792 1119259 1116872 1116966 1119827 1125729
50743 1125729 1134993 1148119 1165699 1188116 1215365 1247246 1283593 1324400 1370056 1421358 1478822
50732 1478822 1541828 1608858 1678760 1751334 1826462 1903250 1980524 2057722 2134644 2210505 2283879
50721 2283879 2353625 2419330 2480624 2536219 2583696 2620097 2642838 2650446 2642795 2620845 2586433 2542293
50709 2542293 2491931 2439065 2387048 2338684 2296115 2260577 2232372 2211322 2197043 2188635 2184469 2182668
50697 2182668 2181583 2179478 2173996 2162474 2142832 2113895 2075140 2026757 1970048 1907220 1840611 1772328
$$ packed form
50782A479147k430j249J60P96K94q83k175l271m057m714n548o513p238p811q950
50767A425558j1010j3363j5293j6929j8745k0600k1940k2551k2469k1471j9492
50756A221695j7276j5778j4951j3849j1974r808p944o323m533k387R4K861N902
50743A125729R264J3126J7580K2417K7249L1881L6347M0807M5656N1302N7464
50732A478822O3006O7030O9902P2574P5128P6788P7274P7198P6922P5861P3374
50721B283879O9746O5705O1294N5595M7477L6401K2741P608p651k1950l4412m4140
50709B542293n0362n2866n2017m8364m2569l5538k8205k1050j4279q408m166j801
50697B182668j085k105n482j1522j9642k8937l8755m8383n6709o2828o6609o8283
$$ plain form
50685 1772328 1704552 1639557 1579042 1523730 1473935 1430294 1393709 1364722 1343246 1328822 1320937
50674 1320937 1319107 1322870 1331770 1345307 1362943 1384201 1408687 1435854 1464657 1493490 1520690 1545293
50662 1545293 1567321 1587192 1604902 1620069 1632806 1644143 1655218 1666297 1677032 1687539 1698706
50651 1698706 1711309 1725257 1739893 1754796 1770120 1786472 1804681 1825502 1849249 1875755 1904857
50640 1904857 1936765 1971826 2010010 2050790 2093363 2136774 2179931 2221764 2261360 2297829 2330291
50629 2330291 2358497 2383488 2407153 2430837 2454523 2477342 2498046 2514216 2521409 2514548 2491231 2453815
50617 2453815 2408134 2360421 2315423 2276365 2245263 2222753 2208177 2200360 2198229 2200628 2205921 2212088
50605 2212088 2217115 2219156 2216481 2207459 2190517 2164166 2127441 2080556 2025026 1963009 1896666 1828051
$$ packed form
50685A772328o7776o4995o0515n5312m9795m3641l6585k8987k1476j4424p885
50674A320937j830L763Q900J3537J7636K1258K4486K7167K8803K8833K7200K4603
50662A545293K2028J9871J7710J5167J2737J1337J1075J1079J0735J0507J1167
50651A698706J2603J3948J4636J4903J5324J6352J8209K0821K3747K6506K9102
50640A904857L1908L5061L8184M0780M2573M3411M3157M1833L9596L6469L2462
50629B330291K8206K4991K3665K3684K3686K2819K0704J6170P193o861k3317l7416
50617B453815m5681m7713m4998l9058l1102k2510j4576p817k131K399N293O167
50605B212088N027K041k675r022j6942k6351l6725m6885n5530o2017o6343o8615
$$ plain form
50593 1828051 1759088 1691246 1625431 1562440 1503306 1448910 1399507 1354931 1315024 1279454 1247370
50582 1247370 1217784 1190223 1164612 1140615 1117723 1096047 1076443 1059624 1045625 1034326 1026007
50571 1026007 1020953 1018789 1018680 1020064 1022909 1027458 1034079 1043182 1054801 1068252 1082654 1097986 1115325
50558 1115325 1135759 1159289 1185018 1212197 1240729 1270615 1301381 1332295 1362928 1393203 1422959
50547 1422959 1451788 1479355 1505667 1531034 1555935 1580986 1606799 1633863 1662868 1695139 1732283
50536 1732283 1775067 1823024 1875592 1933334 1997476 2068405 2145277 2227170 2313961 2405816 2502463
50525 2502463 2603494 2709007 2819231 2933405 3049421 3164687 3277051 3384764 3485743
50516 3485743 3577245 3656395 3720973 3769560 3800965 3813845 3807260 3781505 3738053 3678606 3604595
$$ packed form
50593A828051o8963o7842o5815o2991n9134n4396m9403m4576l9907l5570l2084
50582A247370k9586k7561k5611k3997k2892k1676j9604j6819j3999j1299q319
50571A026007n054k164j09J384K845M549O621R103J1619J3451J4402J5332J7339
50558A115325K0434K3530K5729K7179K8532K9886L0766L0914L0633L0275K9756
50547A422959K8829K7567K6312K5367K4901K5051K5813K7064K9005L2271L7144
50536A732283M2784M7957N2568N7742O4142P0929P6872Q1893Q6791R1855R6647
50525B502463J01031J05513J10224J14174J16016J15266J12364J07713J00979
50516C485743R1502P9150O4578M8587L1405J2880o585k5755m3452n9447p4011
$$ plain form
50505 3604595 3517853 3421417 3319249 3215222 3112725 3015153 2926227 2849468 2787390 2741330 2711844
50494 2711844 2699018 2702353 2720564 2751562 2792542 2839942 2889246 2935002 2971344 2992869 2995405 2976334
50482 2976334 2934584 2870679 2786875 2687024 2575870 2458049 2337427 2217120 2099876 1988165
50472 1988165 1883768 1787340 1698575 1616923 1542255 1474924 1415295 1363248 1318064 1278698 1244209
50461 1244209 1214079 1188244 1166760 1149307 1135026 1123021 1113045 1105409 1100058 1096043 1092309 1088968
50449 1088968 1087348 1088655 1092882 1099192 1106954 1116218 1127487 1141403 1158403 1178127 1199112 1219327
50437 1219327 1237133 1251694 1262786 1270689 1276238 1280558 1284542 1288721 1293599 1299807 1307909 1318282 1331095
50424 1331095 1346020 1362031 1378021 1393862 1410472 1428712 1448660 1470243 1494078 1521164 1552059
$$ packed form
50505C604595q6742r6436j02168j04027j02497r7572q8926p6759o2078m6060k9486
50494B711844j2826L335J8211L0998M0980M7400M9304M5756L6342K1525K536j9071
50482B976334m1750o3905q3804r9851j11154j17821j20622j20307j17244j11711
50472A988165j04397r6428q8765q1652p4668o7331n9629n2047m5184l9366l4489
50461A244209l0130k5835k1484j7453j4281j2005r976p636n351m015l734l341
50449A088968j620J307M227O310P762R264J1269J3916J7000J9724K0985K0215
50437A219327J7806J4561J1092P903N549M320L984M179M878O208Q102J0373J2813
50424A331095J4925J6011J5990J5841J6610J8240J9948K1583K3835K7086L0895
$$ plain form
50413 1552059 1586930 1626174 1670326 1719233 1771845 1827007 1884083 1942625 2001800 2060387 2117154
50402 2117154 2170958 2220665 2265207 2303739 2335591 2360085 2376470 2383868 2381204 2367296 2341321 2303313
50390 2303313 2254276 2195886 2130208 2059583 1986644 1914248 1845188 1781762 1725482 1677276 1637962
50379 1637962 1608336 1588673 1578328 1576129 1581166 1592883 1610292 1631288 1652926 1672295 1687038 1695225
50367 1695225 1695111 1685228 1664842 1634390 1595488 1550333 1500926 1448794 1395423 1342616 1292106 1244763
50355 1244763 1200408 1158446 1118551 1080813 1045533 1013075 983750 957700 934994 915836 900529
50344 900529 889167 881621 877967 878560 883334 891297 901145 912228 924314 936254 945470 949264 946615
50331 946615 938595 927350 914929 902764 891609 881711 873199 866434 861828 859368 858575 859090 861041 864661
$$ packed form
50413A552059L4871L9244M4152M8907N2612N5162N7076N8542N9175N8587N6767
50402B117154N3804M9707M4542L8532L1852K4494J6385P398k664j3908k5975l8008
50390B303313m9037n8390o5678p0625p2939p2396o9060o3426n6280m8206l9314
50379A637962k9626j9663j0345k199N037J1717J7409K0996K1638J9369J4743Q187
50367A695225j14r883k0386l0452l8902m5155m9407n2132n3371n2807n0510m7343
50355A244763m4355m1962l9895l7738l5280l2458k9325k6050k2706j9158j5307
50344I00529j1362p546l654N93M774P963R848J1083J2086J1940R216L794k649
50331I46615q020j1245j2421j2165j1155r898q512o765m606k460p93N15J951L620
$$ plain form
50317 864661 869688 875475 881619 888132 894876 901089 905838 908923 911172 913741 917200 921267 925316 929121
50303 929121 933145 938133 944391 951467 958537 965038 970896 976349 981849 988033 995424 1003942 1012872 1021398
50289 1021398 1029003 1035358 1040244 1043844 1046715 1048926 1049363 1046407 1039548 1029988 1019607 1009682 1000753 993281
50275 993281 987887 984968 984370 985490 987540 989822 992052 994493 997488 1000740 1003169 1003661 1001880 998291 993651
50260 993651 988765 984590 982085 981699 983210 986244 990743 996722 1003855 1011758 1020692 1031581 1045239 1061765
50246 1061765 1080677 1101226 1122584 1144178 1166024 1188334 1210535 1231271 1249854 1267291 1285139
50235 1285139 1303469 1320644 1335050 1346310 1354504 1358902 1358057 1350860 1337158 1317561 1293197 1265588
50223 1265588 1236377 1206962 1178505 1152182 1129081 1109745 1093901 1080657 1068792 1056723 1042494
$$ packed form
50317H64661N027N787O144O513O744O213M749L085K249K569L459M067M049L805
50303I29121M024M988O258P076P070O501N858N453N500O184P391Q518Q930Q526
50289A021398P605O355M886L600K871K211M37k956o859r560j0381r925q929p472
50275I93281n394k919n98J120K050K282K230K441K995L252K429M92j781l589m640
50260I93651m886m175k505l86J511L034M499N979P133P903Q934J0889J3658J6526
50246A061765J8912K0549K1358K1594K1846K2310K2201K0736J8583J7437J7848
50235A285139J8330J7175J4406J1260Q194M398q45p197j3702j9597k4364k7609
50223A265588k9211k9415k8457k6323k3101j9336j5844j3244j1865j2069j4229
$$ plain form
50212 1042494 1024290 1001403 974785 946531 918597 892003 867128 844465 824724 808213 794483
50201 794483 782805 772890 764865 758569 753104 747325 740773 734039 728080 723245 719044 714789 710270 705719
50187 705719 701349 697112 692787 688134 683037 677605 672108 666697 661338 656185 651822 648816 646995 645414
50173 645414 643162 640157 637184 635208 634509 634368 633772 632575 631764 632304 634005 635942 637762 640013 643169
50158 643169 647007 651228 656142 662321 669826 678169 686904 695932 705318 715067 725059 735015 744470 752852
50144 752852 759677 764821 768787 772617 777292 783191 790333 799102 810388 825002 843360 865846 893051
50131 893051 925336 962398 1003457 1047605 1093702 1140238 1185705 1229172 1270409 1309660 1347444
50120 1347444 1384398 1420987 1457332 1493211 1527915 1559867 1586615 1605438 1614072 1611142 1596595 1571955
$$ packed form
50212A042494j8204k2887k6618k8254k7934k6594k4875k2663j9741j6511j3730
50201G94483j1678r915q025o296n465n779o552o734n959m835m201m255m519m551
50187G05719m370m237m325m653n097n432n497n411n359n153m363l006j821j581
50173F45414k252l005k973j976o99j41n96j197q11N40J701J937J820K251L156
50158F43169L838M221M914O179P505Q343Q735R028R386R749R992R956R455Q382
50144G52852O825N144L966L830M675N899P142Q769J1286J4614J8358K2486K7205
50131H93051L2285L7062M1059M4148M6097M6536M5467M3467M1237L9251L7784
50120A347444L6954L6589L6345L5879L4704L1952K6748J8823Q634k930j4547k4640
$$ plain form
50108 1571955 1539668 1501736 1459253 1413353 1366002 1319218 1273921 1230247 1188806 1150924 1117570
50097 1117570 1088562 1062822 1038923 1015520 991950 968791 947466 929020 913451 900168 888698
50086 888698 878853 870654 864271 859746 856629 854223 852355 851616 852643 855407 859309 863625 867621 870598
50072 870598 872261 873002 873546 874290 875057 875391 874973 873835 872236 870206 867214 862598 856496 850097 844641 840265
50056 840265 836087 831360 826221 821344 817160 813591 810395 807531 805207 803732 803348 804097 805699 807671 809840
50041 809840 812890 818197 826780 838285 851128 863669 875303 886473 897864 909629 921314 932423
50029 932423 942944 953226 963363 972948 981560 989184 995899 1001398 1005316 1008006 1010502 1013578 1017225
50016 1017225 1021252 1025997 1032155 1040073 1049494 1059867 1070726 1081961 1093953 1107307 1122148 1137676
$$ packed form
50108A571955l2287l7932m2483m5900m7351m6784m5297m3674m1441l7882l3354
50097A117570k9008k5740k3899k3403k3570k3159k1325j8446j5569j3283j1470
50086H88698r845q199o383m525l117k406j868p39J027K764L902M316L996K977
50072H70598J663P41N44P44P67L34m18j138j599k030k992m616o102o399n456m376
50056H40265m178m727n139m877m184l569l196k864k324j475l84P49J602J972K169
50041H09840L050N307Q583J1505J2843J2541J1634J1170J1391J1765J1685J1109
50029I32423J0521J0282J0137R585Q612P624O715N499L918K690K496L076L647
50016A017225M027M745O158P918R421J0373J0859J1235J1992J3354J4841J5528
$$ plain form
50004 1137676 1152581 1165968 1177876 1189157 1201055 1214763 1230941 1249418 1269300 1289237 1307454
49993 1307454 1321607 1329031 1327450 1315749 1294327 1264885 1229833 1191597 1152179 1112985 1074685 1037160
49981 1037160 999941 963103 927675 894971 865595 839351 815944 795306 777165 760837 745799
49970 745799 732213 720505 710590 701873 693972 687048 681303 676464 671940 667396 663008 659315 656902 656109
49956 656109 656778 658283 659969 661722 664156 668293 674912 683984 694592 705537 716127 726284 735847
49943 735847 744082 750135 753868 755905 756917 757121 756459 754836 752081 747910 742099 734428 724450 711707
49929 711707 696503 680203 664425 650025 637036 625404 615404 607362 601306 596963 593912 591772
49917 591772 590428 590150 591221 593365 595722 597601 599254 601731 605838 611270 616949 622295 627984 635198
$$ packed form
50004A137676J4905J3387J1908J1281J1898J3708J6178J8477J9882J9937J8217
49993A307454J4153P424j581j1701k1422k9442l5052l8236l9418l9194l8300l7525
49981A037160l7219l6838l5428l2704k9376k6244k3407k0638j8141j6328j5038
49970G45799j3586j1708r915q717p901o924n745m839m524m544m388l693k413p93
49956F56109O69J505J686J753K434M137O619R072J0608J0945J0590J0157R563
49943G35847Q235O053L733K037J012K04o62j623k755m171n811p671r978j2743
49929G11707j5204j6300j5778j4400j2989j1632j0000q042o056m343l051k140
49917E91772j344k78J071K144K357J879J653K477M107N432N679N346N689P214
$$ plain form
49903 635198 644290 654531 665145 676113 687741 699870 711872 723215 733689 743243 751827 759238
49891 759238 764884 767933 767951 765154 759826 751909 741617 729991 718220 706594 694809 683050 672007
49878 672007 661776 651617 641036 630400 620260 610806 602373 595710 591154 587994 585314 583126 582092
$$ packed form
49903F35198R092J0241J0614J0968J1628J2129J2002J1343J0474R554Q584P411
49891G59238N646L049J8k797n328p917j0292j1626j1771j1626j1785j1759j1043
49878F72007j0231j0159j0581j0636j0140r454q433o663m556l160k680k188j034
$$ [...]
##END NTUPLES=NMR SPECTRUM
##END=
