##TITLE=AC1431_GUAAH13235_7764268_Js82BZObB1
##JCAMPDX= 6.0         $$ Bruker NMR JCAMP-DX V2.0
##DATA TYPE= NMR SPECTRUM
##DATA CLASS= NTUPLES
##ORIGIN= BRUKER
##OWNER= Administrator
$$ 1.72 TOPSPIN		Version 2.1
$$ 2013-04-16 18:07:36.990 -0700  Administrator@X
$$ Compression mode = diff/dup
##.OBSERVE FREQUENCY= 400.02188249412
##.OBSERVE NUCLEUS= ^1H
##.ACQUISITION MODE= SIMULTANEOUS (DQD)
##.ACQUISITION SCHEME= undefined
##.AVERAGES= 16
##.DIGITISER RES= 22
##SPECTROMETER/DATA SYSTEM= spect
##.PULSE SEQUENCE= noesygpps1d.comp
##.SOLVENT NAME= COFFEE_meoh
##.SHIFT REFERENCE= INTERNAL, COFFEE_meoh, 1, 14.9611
##AUDIT TRAIL= $$ (NUMBER, WHEN, WHO, WHERE, PROCESS, VERSION, WHAT)
$$ ##TITLE= Audit trail, TOPSPIN		Version 2.1
$$ ##JCAMPDX= 5.01
$$ ##ORIGIN= Bruker BioSpin GmbH
$$ ##OWNER= Administrator
$$ $$ E:\/data/COFFEE/nmr/AC1431_GUAAH13235_7764268_Js82BZObB1/12/pdata/1/auditp.txt
$$ ##AUDIT TRAIL=  $$ (NUMBER, WHEN, WHO, WHERE, PROCESS, VERSION, WHAT)
(   1,<2013-04-16 18:07:31.293 -0700>,<Administrator>,<X>,<go>,<TOPSPIN 2.1>,
      <created by zg
	started at 2013-04-16 18:02:54.224 -0700,
	POWCHK enabled, PULCHK disabled,
       terminated by command 'stop'
       configuration hash MD5:
       33 CF 6A 21 5C D3 B9 40 6C 15 AA 8D 27 A2 4F 13
       data hash MD5: 64K
       CF C3 40 CF CC 70 8D 18 E3 73 32 E8 98 12 E8 AA>)
(   2,<2013-04-16 18:07:34.387 -0700>,<Administrator>,<X>,<proc1d>,<TOPSPIN 2.1>,
      <Start of raw data processing
       efp LB = 0.3 FT_mod = 6 PKNL = 1 PHC0 = 0 PHC1 = 25.00583 SI = 128K 
       data hash MD5: 128K
       DE A3 45 1D 16 BE F0 C6 97 2B 55 4D 45 7B 23 4C>)
(   3,<2013-04-16 18:07:36.010 -0700>,<Administrator>,<X>,<proc1d>,<TOPSPIN 2.1>,
      <pk PHC0 = 266.2372 PHC1 = 0 
       data hash MD5: 128K
       81 2F CE 1C 65 0D DC 20 02 1A 99 94 74 70 62 D0>)
(   4,<2013-04-16 18:07:36.485 -0700>,<Administrator>,<X>,<proc1d>,<TOPSPIN 2.1>,
      <abs ABSG = 1 
       data hash MD5: 128K
       3B 2F 27 6C 2B 09 25 2B 86 B7 43 E1 6E 53 E9 F0>)
(   5,<2013-04-16 18:07:36.607 -0700>,<Administrator>,<X>,<proc1d>,<TOPSPIN 2.1>,
      <abs ABSG = 2 
       data hash MD5: 128K
       6B B5 ED 61 6B 79 34 9A 13 62 F0 A3 10 AC EE 29>)
(   6,<2013-04-16 18:07:36.684 -0700>,<Administrator>,<X>,<proc1d>,<TOPSPIN 2.1>,
      <abs ABSG = 3 
       data hash MD5: 128K
       E5 61 74 3F E8 E9 44 65 CB EA 77 ED 8B CB FF C0>)
(   7,<2013-04-16 18:07:36.760 -0700>,<Administrator>,<X>,<proc1d>,<TOPSPIN 2.1>,
      <abs ABSG = 4 
       data hash MD5: 128K
       DB 0A B2 5E F5 05 82 E8 E6 61 36 B6 06 95 B2 24>)
(   8,<2013-04-16 18:07:36.837 -0700>,<Administrator>,<X>,<proc1d>,<TOPSPIN 2.1>,
      <abs ABSG = 5 
       data hash MD5: 128K
       22 C3 FE 62 0B 26 66 60 3E 3A E6 BD 21 99 3D 22>)
$$ ##END=
$$ 
$$ $$ hash MD5
$$ $$ 37 6E 41 28 79 6D C1 19 81 53 80 35 9B 9A BF 4B
##$RELAX= 
##$RELAX= 
##$RELAX= 
##$RELAX= 
##$RELAX= 
##$RELAX= 
##$RELAX= 
##$RELAX= 
$$ Bruker specific parameters
$$ --------------------------
$$ [...]
##$TP07= 0
##$TPNAME0= <>
##$TPNAME1= <>
##$TPNAME2= <>
##$TPNAME3= <>
##$TPNAME4= <>
##$TPNAME5= <>
##$TPNAME6= <>
##$TPNAME7= <>
##$TPOAL= (0..7)
0.5 0.5 0.5 0.5 0.5 0.5 0.5 0.5
##$TPOFFS= (0..7)
0 0 0 0 0 0 0 0
##$TUNHIN= 0
##$TUNHOUT= 0
##$TUNXOUT= 0
##$USERA1= <user>
##$USERA2= <user>
##$USERA3= <user>
##$USERA4= <user>
##$USERA5= <user>
##$V9= 5
##$VALIST= <valist>
##$VCLIST= <CCCCCCCCCCCCCCC>
##$VD= 0
##$VDLIST= <DDDDDDDDDDDDDDD>
##$VPLIST= <PPPPPPPPPPPPPPP>
##$VTLIST= <TTTTTTTTTTTTTTT>
##$WBST= 2048
##$WBSW= 25
##$XGAIN= (0..3)
0 0 0 0
##$XL= 0
##$YL= 0
##$YMAX_a= 1639467
##$YMIN_a= -3523835
##$ZGOPTNS= <>
##$ZL1= 120
##$ZL2= 120
##$ZL3= 120
##$ZL4= 120
##$ABSF1= 14.9611
##$ABSF2= -5.597082
##$ABSG= 5
##$ABSL= 3
##$ALPHA= 0
##$AQORDER= 0
##$ASSFAC= 0
##$ASSFACI= 0
##$ASSFACX= 0
##$ASSWID= 0
##$AUNMP= <proc_prof1d_extract.lims>
##$AXLEFT= 0
##$AXNAME= <>
##$AXNUC= <1H>
##$AXRIGHT= 0
##$AXTYPE= 0
##$AXUNIT= <>
##$AZFE= 0.1
##$AZFW= 0.1
##$BCFW= 0
##$BC_mod= 0
##$BYTORDP= 0
##$COROFFS= 0
##$CY= 15
##$DATMOD= 1
##$DC= 0
##$DFILT= <>
##$DTYPP= 0
##$F1P= 0
##$F2P= 0
##$FCOR= 0.5
##$FTSIZE= 131072
##$FT_mod= 6
##$GAMMA= 0
##$GB= 0
##$INTBC= 1
##$INTSCL= 1
##$ISEN= 128
##$LB= 0.3
##$LEV0= 0
##$LPBIN= 0
##$MAXI= 10000
##$MC2= 0
##$MEAN= 0
##$ME_mod= 0
##$MI= 0
##$NCOEF= 0
##$NC_proc= -4
##$NLEV= 6
##$NOISF1= 0
##$NOISF2= 0
##$NSP= 0
##$NTH_PI= 0
##$NZP= 0
##$OFFSET= 14.9611
##$PC= 1
##$PHC0= 266.2372
##$PHC1= 25.00583
##$PH_mod= 1
##$PKNL= yes
##$PPARMOD= 0
##$PPDIAG= 0
##$PPIPTYP= 0
##$PPMPNUM= 2147483647
##$PPRESOL= 1
##$PSCAL= 4
##$PSIGN= 0
##$PYNMP= <proc.py>
##$REVERSE= no
##$SF= 400.02000959605
##$SI= 131072
##$SIGF1= 0
##$SIGF2= 0
##$SINO= 400
##$SIOLD= 131072
##$SPECTYP= <>
##$SREGLST= <1H.CDCl3>
##$SSB= 0
##$STSI= 131072
##$STSR= 0
##$SW_p= 8223.68421052631
##$SYMM= 0
##$S_DEV= 0
##$TDeff= 65536
##$TDoff= 0
##$TI= <>
##$TILT= no
##$TM1= 0
##$TM2= 0
##$TOPLEV= 0
##$USERP1= <user>
##$USERP2= <user>
##$USERP3= <user>
##$USERP4= <user>
##$USERP5= <user>
##$WDW= 1
##$XDIM= 131072
##$YMAX_p= 450048586
##$YMIN_p= -87742
##$CURPLOT= <Network HP LaserJet P1505>
##$CURPRIN= <$Network HP LaserJet P1505>
##$DFORMAT= <normdp>
##$LAYOUT= <+/1D_H.xwp>
##$LFORMAT= <normlp>
##$PFORMAT= <normpl>
##$SURQMSG= 1
$$ End of Bruker specific parameters
$$ ---------------------------------
##NTUPLES= NMR SPECTRUM
##VAR_NAME=  FREQUENCY,     SPECTRUM/REAL,   SPECTRUM/IMAG
##SYMBOL=    X,             R,               I
##VAR_TYPE=  INDEPENDENT,   DEPENDENT,       DEPENDENT
##VAR_FORM=  AFFN,          ASDF,            ASDF
##VAR_DIM=   131072,        131072,          131072
##UNITS=     HZ,            ARBITRARY UNITS, ARBITRARY UNITS
##FACTOR=    0.0627417313425164, 1,          1
##FIRST=     8223.62146879497, -85780,       -60441
##LAST=      0,             -54371,          -61962
##MIN=       0,             -87742,          0
##MAX=       8223.62146879497, 450048586,    0
$$ Real data points
##PAGE= N=1
##DATA TABLE= (X++(R..R)), XYDATA
$$ [...]
63895A091944m1610l4227l0158k8994k9245k9493k9144k8422k7564k6212k3982
$$ 1091944 1050334 1016107 985949 956955 927710 898217 869073 840651 813087 786875 762893
63884G62893k1486j9887j9249j8236j5816j2561r697p576n638l322n35K400M810
$$ 762893 741407 721520 702271 684035 668219 655658 645961 638385 632747 629425 628890 631290 636100
63871F36100O198P132R066J2778J7293K0832K2446K2445K1701K0997K0767K1013
$$ 636100 642298 649430 658496 671274 688567 709399 731845 754290 775991 796988 817755 838768
63859H38768K1459K1743K1229J9057J5171J1120Q697P655N878K120k542o433r223
$$ 838768 860227 881970 903199 922256 937427 948547 957244 964899 970777 972897 970355 963922 954699
63846I54699j1440j3210j4595j6262j8713k1376k3422k4977k6661k8372k9492
$$ 954699 943259 930049 915454 899192 880479 859103 835681 810704 784043 755671 726179
63835G26179k9860k9766k9319k8587k7845k7003k5228k2129j8788j6640j5649
$$ 726179 696319 666553 637234 608647 580802 553799 528571 506442 487654 471014 455365
63824D55365j4652j3275j2454j2920j4063j4475j3174j0402p674o652p359p841
$$ 455365 440713 427438 414984 402064 388001 373526 360352 349950 342276 335624 328265 320424
63812C20424o363l512j303n96m89q5M21N82M25n8j274l205m779m786l243j492
$$ 320424 314061 310549 309246 308650 308161 308076 308497 309079 309504 309446 308172 304967 300188 295402 292159 290667
63796B90667r68j971l547m448m278l582k918k263j502j062j507k694l832m199
$$ 290667 289699 287728 284181 279733 275455 271873 268955 266692 265190 264128 262621 259927 256095 251896
63782B51896l536k027l16Q04J129J214J395J104k14j924k734k262j355r40j200
$$ 251896 248360 246333 246017 246821 247950 249164 250559 251663 251449 249525 246791 244529 243174 242234 241034
63767B41034j768k101j706o49K00P1n95o08K92J004N92l62m41Q13K307K643J689
$$ 241034 239266 237165 235459 234810 235010 235081 234486 233878 234170 235174 235766 235404 234963 235776 238083 240726 242415
63750B42415O24M43Q08Q31N76J032K481L869M198L772L474L547L703L830L835
$$ 242415 243039 243482 244290 245121 245697 246729 249210 253079 257277 261049 264523 268070 271773 275603 279438
63735B79438L393K590K239K753L261K765J663J101J336J859K699M194N713N990
$$ 279438 282831 285421 287660 290413 293674 296439 298102 299203 300539 302398 305097 309291 315004 320994
63721C20994M984M047M064M561M842M847M557L667K336J218L90p13j931k200j444
$$ 320994 325978 330025 334089 338650 343492 348339 352896 356563 358899 360117 360507 359794 357863 355663 354219
63706C54219j295k898m964n315l683j663l36O13J518J999J974K236L255M186L852
$$ 354219 352924 350026 345062 339747 336064 334401 334065 334678 336196 338195 340169 342405 345660 349846 353698
63691C53698K309P04o7Q1R11K004K414J304o80j611o46O81N89l16m0J501K154
$$ 353698 356007 356711 356644 356725 357636 359640 362054 363358 362678 361067 360421 361102 361691 361375 361335 362836 364990
63674C64990Q75n43j05J592K651K705K773L079K811J715L62r84k327l020k572
$$ 364990 365865 365322 365217 366809 369460 372165 374938 378017 380828 382543 382905 381921 379594 376574 374002
63659C74002k106l242n327n756l643j318j201k703l531k811j542p79q03j671l260
$$ 374002 371896 368654 363327 357571 353928 352610 351409 348706 345175 342364 340822 340043 339240 337569 334309
63644C34309m803n241m178j997O33K983M419M946N276N845O198N884N325N142
$$ 334309 329506 324265 320087 318090 318723 321706 326125 331071 336347 342192 348390 354274 359599 364741
63630C64741N110M738M444N171O880Q421Q979Q821Q573Q514Q804R675J1008J2300
$$ 364741 369851 374589 379033 384204 391084 399505 408484 417305 425878 434392 443196 452871 463879 476179
63616D76179J3384J4782J6919J9325K1075K1918K2607K4098K6602K9468L1849
$$ 476179 489563 504345 521264 540589 561664 583582 606189 630287 656889 686357 718206
63605G18206L3325L3837L3141L0744K6481K0899J4707Q103J138n325r711j1171
$$ 718206 751531 785368 818509 849253 875734 896633 911340 919443 920581 915256 905545 894374
63593H94374j0510r279q282p435o935p715j0462j4611j8735k1676k3077k3277
$$ 894374 883864 874585 866303 858868 851933 844218 833756 819145 800410 778734 755657 732380
63581G32380k3075k3264k3706k3105k0440j6581j3645j2550j2035j0418p450l980
$$ 732380 709305 686041 662335 639230 618790 602209 588564 576014 563979 553561 546111 542131
63569E42131p24J781K841K433J966K942M894N857N026L825L984N514P259Q600
$$ 542131 541407 543188 546029 548462 550428 553370 558264 564121 569147 572972 576956 582470 589729 598329
63555E98329R828J1245J2795J4485J6679J9753K3629K7626L0923L3502L6455M0679
$$ 598329 608157 619402 632197 646682 663361 683114 706743 734369 765292 798794 835249 875928
63543H75928M5040M6592M3100L4937K4117J2294N74r352j5445j7124j5935j3949
$$ 875928 920968 967560 1010660 1045597 1069714 1082008 1082582 1073230 1057785 1040661 1024726 1010777
63531A010777j2055j0266q901q667r812j2013j5016j8773k2965k6955l0339l2972
$$ 1010777 998722 988456 979555 970888 961076 949063 934047 915274 892309 865354 835015 802043
63519H02043l4543l4762l4042l3135l1809k8886k4183j9438j6404j4861j3632
$$ 802043 767500 732738 698696 665561 633752 604866 580683 561245 544841 529980 516348
63508E16348j2763j3122j4155j3827j1124p271m128k534k567l944n574n870m456
$$ 516348 503585 490463 476308 462481 451357 444086 439958 437424 434857 430913 425339 419469 415013
63495D15013k644j680j350r46m89k61n8K59M30N75J282K230K078O18l66M21J894
$$ 415013 412369 410689 409339 408393 407904 407643 407585 407844 408274 408849 410131 412361 414439 415057 414691 415112 417006
63478D17006K532K778L672M493L965K844K817L374K416k18k326k749k690l155
$$ 417006 419538 422316 425988 430481 434446 437290 440107 443481 445897 445679 443353 440604 437914 434759
63464D34759l359k679k150k713l492l062j408L69J462J670J162N51N30J033J457
$$ 434759 431400 428721 426571 423858 420366 417304 415896 416265 417727 419397 420559 421110 421640 422673 424130
63449D24130J831K789M276N505O424P851R728J0730J0214R349R520J0764J2446
$$ 424130 425961 428750 433026 438531 444955 452806 462534 473264 483478 492827 502347 513111 525557
63436E25557J4369J6552J8950K2085K6753L2271L6001L5562L0890K3712J6047
$$ 525557 539926 556478 575428 597513 624266 656537 692538 728100 758990 782702 798749
63425G98749R733O116N208N855P341J0002J3903J8128K2094K6311L1096L5597
$$ 798749 808482 814598 819806 825661 833002 843004 856907 875035 897129 923440 954536 990133
63413I90133L8819M0328L9347L4606K6176J6208O861j246p785j1737j3003j3341
$$ 990133 1028952 1069280 1108627 1143233 1169409 1185617 1192478 1191232 1183447 1171710 1158707 1145366
63401A145366j4030j4132j2877j2130j4133j8005k1235k3790k7822l3403l7537
$$ 1145366 1131336 1117204 1104327 1092197 1078064 1060059 1038824 1015034 987212 953809 916272
63390I16272l8132l6488l4825l3331l0989k7871k5116k3315k1921j9940j6682
$$ 916272 878140 841652 806827 773496 742507 714636 689520 666205 644284 624344 607662
63379F07662j2316q043n223l973l053j309J214L730N749P374Q877J0293J1505
$$ 607662 595346 587303 582080 578107 575054 573745 574959 578689 584438 591812 600689 610982 622487
63366F22487J2751J4665J7315J9398J9543J8586J9203K2590K6832K9634L1322
$$ 622487 635238 649903 667218 686616 706159 724745 743948 766538 793370 823004 854326
63355H54326L3630L6567L8456L8501L7242L4680K9917K2883J4799O696j015p389
$$ 854326 887956 924523 962979 1001480 1038722 1073402 1103319 1126202 1141001 1147697 1146682 1139293
63343A139293j1134j2459j3074j3774j3596j2193j1373j3066j6839k0876k4533
$$ 1139293 1128159 1115700 1102626 1088852 1075256 1063063 1051690 1038624 1021785 1000909 976376
63332I76376k8538l3036l6851l8694l8175l5549l1315k6308k1612j7895j4976
$$ 976376 947838 914802 877951 839257 801082 765533 734218 707910 686298 668403 653427
63321F53427j2156q870n045j207J565J920r64o452j2564j7348k0246k1764k2103
$$ 653427 641271 632401 627356 626149 627714 629634 628670 622218 609654 592306 572060 550296 528193
63308E28193k0860j8131j4934j2064r240n985k750n21K78J9m87k72J038K315J680
$$ 528193 507333 489202 474268 462204 452964 446979 444229 443708 443986 444005 443518 443246 444284 446599 448279
63293D48279j131m181n836o595p269o880m321j116n5j385k592k140j156r59j117
$$ 448279 447148 442967 437131 430536 423267 416387 412066 410950 410895 409510 406918 404778 403622 402663 401546
63278D01546r70j187k414l608l246j449K60Q68O44L81O38J503K471K737K028J002
$$ 401546 400576 399389 396975 393367 390121 388672 388932 389800 390444 390825 391463 392966 395437 398174 400202 401204
63262D01204O33J316K634L683L779L154K755K964L000K299J881L124N574P369
$$ 401204 401837 403153 405787 409470 413249 416403 419158 422122 425122 427421 429302 432426 438000 445369
63248D45369P704P412P138O698O543P916J0685J2658J2263J0661R984J0691J1941
$$ 445369 453073 460485 467623 474321 480864 488780 499465 512123 524386 535047 545031 555722 567663
63235E67663J3543J5885J8654K1135K3482K6157K8402K8732K7080K5100K4114
$$ 567663 581206 597091 615745 636880 660362 686519 714921 743653 770733 795833 819947
63224H19947K3951K4191K5210K7137K8701K8327K6133K3901K3037K3373K4072
$$ 819947 843898 868089 893299 920436 949137 977464 1003597 1027498 1050535 1073908 1097980
63213A097980K4819K5533K5554K4094K1332J8156J4730J0157L864l529j1139j8678
$$ 1097980 1122799 1148332 1173886 1197980 1219312 1237468 1252198 1262355 1266219 1262690 1251551 1232873
63201A232873k5680l0808l3063l3229l3062l3165l2622l0522k7038k3073j9552
$$ 1232873 1207193 1176385 1143322 1110093 1077031 1043866 1011244 980722 953684 930611 911059
63190I11059j6833j4236j0602o026k205o6J941N606R954J2580J3507J5190J8579
$$ 911059 894226 879990 869388 863362 861157 861091 863032 868638 878592 891172 904679 919869 938448
63177I38448K1766K3208K3745K4314K4088K2581K1476K2152K2987K1536J8441
$$ 938448 960214 983422 1007167 1031481 1055569 1078150 1099626 1121778 1144765 1166301 1184742
63166A184742J6679J7237J7809J5931J1540O016L10n278j0648j6039k1868k7849
$$ 1184742 1201421 1218658 1236467 1252398 1263938 1269954 1270264 1264986 1254338 1238299 1216431 1188582
63154A188582l2755l5577l6681l7435l8797m0307m0450l8080l3599k8637k4652
$$ 1188582 1155827 1120250 1083569 1046134 1007337 967030 926580 888500 854901 826264 801612
63143H01612k2060k0578j9709j8705j6870j4357j2155j0738r310o913l862j405
$$ 801612 779552 758974 739265 720560 703690 689333 677178 666440 657130 650217 646355 644950
63131F44950k33J56P32J947L362M153M160M359N728P809R175R343R127Q976Q258
$$ 644950 644717 644873 645605 647552 650914 655067 659227 663586 669314 677123 686298 695641 704768 713744 722002
63116G22002O782N627N413M848K419j165l599l750k614j647j245r67m22K75N26
$$ 722002 728784 734411 739824 744672 747091 745926 742327 738577 735963 734316 733071 732104 731682 731957 732483
63101G32483j92j490k185j648o23j75l29l66K9N72R60R08Q8j290k171j647p4J366
$$ 732483 732291 730801 728616 726968 726345 726170 725841 725475 725504 726076 727036 727944 728032 726742 724571 722924 722850 724216
63083G24216J868J394L68m09j87Q57J758K311L600O248R092J0696J1221J1505
$$ 724216 726084 727478 727846 727437 727250 728107 729865 732176 735776 742024 751116 761812 773033 784538
63069G84538J1210R508P217O475Q258J1530J4718J6880J7691J7685J8373K0697
$$ 784538 795748 805256 812473 818948 827206 838736 853454 870334 888025 905710 924083 944780
63057I44780K3573K5490K7233L1012L6773M1699M4151M5963M9489N4126N7455
$$ 944780 968353 993843 1021076 1052088 1088861 1130560 1174711 1220674 1270163 1324289 1381744
63046A381744N8720N9312O0422O1826O2873O3263O2743O1131N8839N6693N5036
$$ 1381744 1440464 1499776 1560198 1622024 1684897 1748160 1810903 1872034 1930873 1987566 2042602
63035B042602N3618N2467N2093N2573N2948N1985M9349M5533M0676L3984K4739
$$ 2042602 2096220 2148687 2200780 2253353 2306301 2358286 2407635 2453168 2493844 2527828 2552567
63024B552567J3513J750r899k2013l4917m7501n8214o6635p3276p8253q1122q1713
$$ 2552567 2566080 2567830 2557931 2535918 2501001 2453500 2395286 2328651 2255375 2177122 2096000 2014287
63012B014287q0176p6368p0260o2807n5222m7433l8456k8440j8996j1051l823
$$ 2014287 1934111 1857743 1787483 1724676 1669454 1622021 1583565 1555125 1536129 1525078 1521255
63001A521255L407R909J4929J9315K4312K9515L3383L5365L6218L6594L6800L7712
$$ 1521255 1524662 1534571 1549500 1568815 1593127 1622642 1656025 1691390 1727608 1764202 1801002 1838714
62989A838714M0207M3267M4260M2034L8633L6879L6976L6552L3520K7628J9586
$$ 1838714 1878921 1922188 1966448 2008482 2047115 2083994 2120970 2157522 2191042 2218670 2238256
62978B238256J0084n9j0092k0236l1428m3529n4689o3211o9122p3061p4731p3980
$$ 2238256 2248340 2248281 2238189 2217953 2186525 2142996 2088307 2025096 1955974 1882913 1808182 1734202
62966A734202p2423p1955p1805o9377o4242n8995n5379n2059m7653m3596m1647
$$ 1734202 1661779 1589824 1518019 1448642 1384400 1325405 1270026 1217967 1170314 1126718 1085071
62955A085071m0360l6966l1879k8285k7443k7273k6010k4512k4030k4007k3420
$$ 1085071 1044711 1007745 975866 947581 920138 892865 866855 842343 818313 794306 770886
62944G70886k2433k1322j9387j6412j3831j2924j2793j1681r479p485o390n885
$$ 770886 748453 727131 707744 691332 677501 664577 651784 640103 630624 623139 616749 610864
62932F10864n749n928n815m768l182k070j740j773k006k442k548j820q49p32j482
$$ 610864 605115 599187 593372 588604 585422 583352 581612 579839 577833 575391 572843 571023 570174 569442 567960
62917E67960k060j941j577j303j007r30j660l032m066m316m312m379m003k896
$$ 567960 565900 563959 562382 561079 560072 559142 557482 554450 550384 546068 541756 537377 533374 530478
62903E30478j779j507k083k931l525l426k432j070k03K26J062K206K169J46k561
$$ 530478 528699 527192 525109 522178 518653 515227 512795 511725 511522 511748 512810 515016 517185 517331 514770
62888E14770m156m393l851k283O01L354L771J718o62j686j490m97J412L429L510
$$ 514770 510614 506221 502370 500087 500688 504042 507813 509531 508869 507183 505693 505196 506608 510037 513547
62873E13547J052j475j330Q93K185J183n15j054n42j37l33r56j780k364j943k96
$$ 513547 514599 513124 511794 512687 514872 516055 515540 514486 513944 513807 513474 512518 510738 508374 506431 506135
62857E06135J674K804K756J847M14r86j394m22Q07O70q69k004j237R03K693L161
$$ 506135 507809 510613 513369 515216 515630 514644 513250 512828 513635 514305 513436 511432 510195 511098 513791 516952
62841E16952K562J359l44k257l631m012l765l389k712j364K08R82O28p2j94N32
$$ 516952 519514 520873 520529 518272 514641 510629 506864 503475 500763 499399 499607 500589 501217 501145 500951 501483
62825E01483J866L233L709K677R61L91J730L753M947N166M949M253L175K952M644
$$ 501483 503349 506582 510291 512968 513929 514320 516050 519803 524750 529916 534865 539118 542293 545245 549889
62810E49889P177Q290P420O168N961O643P405P654O855N093L997N368Q456J0413
$$ 549889 557066 565356 572776 578944 584905 591548 598953 606607 613462 618555 622552 627920 636376 646789
62796F46789J0101R553J0675J2462J3093J3122J4519J7553K0804K3695K7064L1253
$$ 646789 656890 666443 677118 689580 702673 715795 730314 747867 768671 792366 819430 850683
62784H50683L5385L8776M1849M5411M9902N5347O1299O7073P2735P9245Q6639
$$ 850683 886068 924844 966693 1012104 1062006 1117353 1178652 1245725 1318460 1397705 1484344
62773A484344R2813R5588R5554R5156R5037R3078Q7375P8538O8148N6349M2080
$$ 1484344 1577157 1672745 1768299 1863455 1958492 2051570 2138945 2217483 2285631 2341980 2384060
62762B384060K5130O903j0790k7221m2889n8182p2027q2437q8681r2256r4932
$$ 2384060 2409190 2416093 2405303 2378082 2335193 2277011 2204984 2122547 2033866 1941610 1846678
62751A846678r6555r5880r3029q9650q6696q3416p8743p2582o5489n8205n1748
$$ 1846678 1750123 1654243 1561214 1471564 1384868 1301452 1222709 1150127 1084638 1026433 974685
62740I74685m6862m2986l8702l3612k8923k5766k3821k1963j9511j6537j3600
$$ 974685 927823 884837 846135 812523 783600 757834 734013 712050 692539 676002 662402
62729F62402j1440j0294r367p691n503l854k938j927o31O5j22pJ487L861N821
$$ 662402 650962 640668 631301 623610 618107 614253 611315 609388 608757 608822 608700 608693 610180 614041 619862
62714F19862O740O767O447O852R178J3395J7938K1454K4237K7329L0961L4592
$$ 619862 626602 633369 639816 646668 655846 669241 687179 708633 732870 760199 791160 825752
62702H25752L7928M1123M4445M8177N2406N6571N9994O3200O7757P4073Q0375
$$ 825752 863680 904803 949248 997425 1049831 1106402 1166396 1229596 1297353 1371426 1451801
62691A451801Q4709Q7084Q8601Q9230Q7643Q2810P4686O3625N0087L4787J8383
$$ 1451801 1536510 1623594 1712195 1801425 1889068 1971878 2046564 2110189 2160276 2195063 2213446
62680B213446J149j6453l3320m8503o1959p3787q3261q9562r2989r4392r3744
$$ 2213446 2214595 2198142 2164822 2116319 2054360 1980573 1897312 1807750 1714761 1620369 1526625
62669A526625r0488q5101p9145p3647o8462o3442n9075n5532n1932m7254m1598
$$ 1526625 1436137 1351036 1271891 1198244 1129782 1066340 1007265 951733 899801 852547 810949
62658H10949l6070l1646k8458k5963k3481k0621j7388j4060j1212r693j0036j1621
$$ 810949 774879 743233 714775 688812 665331 644710 627322 613262 602050 592357 582321 570700
62646E70700j2850j2604j1232r737q412o877n070l496k418j476k75R81J640J243
$$ 570700 557850 545246 534014 524277 515865 508988 503918 500422 498004 496528 496253 497234 498874 500117
62632E00117mj364k278k855l461l928l739k989k413k317k174j554o59M23J894
$$ 500117 500113 498749 496471 493616 490155 486227 482488 479499 477086 474769 472595 471041 470382 470805 472699
62617D72699L209L006J219J50J947N523P592O634M342L070L315M226N364O932
$$ 472699 475908 478914 480133 480283 482230 487753 495345 501979 506321 509391 512706 516932 522296 529228
62603E29228Q923J0878J2473J3928J5718J7972K0204K1896K3326K5401K8436L1822
$$ 529228 538151 549029 561502 575430 591148 609120 629324 651220 674546 699947 728383 760205
62591G60205L5260L9398M4404M8719N0520M9961M8614M6915M3618L7885L0553
$$ 760205 795465 834863 879267 927986 978506 1028467 1077081 1123996 1167614 1205499 1236052
62580A236052K2961J5536Q064L36p746j5987k3599k9878l5221m0441m5035m7446
$$ 1236052 1259013 1274549 1282613 1282949 1275203 1259216 1235617 1205739 1170518 1130077 1085042 1037596
62568A037596m7354m6300m5452m4134m1366l7610l3926l0500k7110k4105k1657
$$ 1037596 990242 943942 898490 854356 812990 775380 741454 710954 683844 659739 638082
62557F38082j8955j5478j2320j0754j0088q574o117m343l971l914l368l079l706
$$ 638082 619127 603649 591329 580575 570487 561913 555796 551453 547482 543568 540200 537121 533415
62544E33415m327l658j875o9J423L095M886N757M826K477J59p62q0J164J876K105
$$ 533415 529088 525430 523555 523486 524909 528004 532890 538647 543473 545950 546109 545347 545267 546431 548307 550412
62528E50412K738M031N225N822O388P587R121J0403J1723J3898J7053K0636K4350
$$ 550412 553150 557181 562406 568228 574616 582203 591324 601727 613450 627348 644401 665037 689387
62515F89387K8246L2002L5125L7838M0862M4208M7089M9290N1662N4756N7694
$$ 689387 717633 749635 784760 822598 863460 907668 954757 1004047 1055709 1110465 1168159
62504A168159N8963N7841N4572M9740M3940L7592L0590K2574J3955O167M33l155
$$ 1168159 1227122 1284963 1339535 1389275 1433215 1470807 1501397 1523971 1537926 1544093 1544526 1541371
62492A541371m866m409j543L072Q551J4880K2249K9729L5937M0976M6473N3238
$$ 1541371 1536505 1532096 1530553 1533625 1542176 1557056 1579305 1609034 1644971 1685947 1732420 1785658
62480A785658N9804O3507O2304N5394M3426K8820J4998L928n671j7075l2233m9761
$$ 1785658 1845462 1908969 1971273 2026667 2070093 2098913 2113911 2117839 2112168 2095093 2062860 2013099
62468B013099o6115p8645q7439r4192r9505j02018j00450r5575q9290q2424p4752
$$ 2013099 1946984 1868339 1780900 1686708 1587203 1485185 1384735 1289160 1199870 1117446 1042694
62457A042694o6723n9464n2980m6020l8389l1818k7623k4762k1304j6775j1983
$$ 1042694 975971 916507 863527 817507 779118 747300 719677 694915 673611 656836 644853
62446F44853p525l737j243o4J243L909O847P860O849O005O600P395O971N955N549
$$ 644853 637328 633591 632348 632284 633527 637436 644283 652143 658992 664997 671597 678992 685963 691918 697467
62431F97467N126K991q06m130n483n807o895q920j0357j0121q861q067q513r817
$$ 697467 702593 705584 704778 700648 695165 689358 682463 673543 663186 653065 644204 636137 627624 617807
62417F17807j1027j1276j0243q567p492p558p768o753m713l386l853n202n738
$$ 617807 606780 595504 585261 576694 569202 561644 553876 547123 542410 539024 535171 529969 524231
62404E24231m849l071j074N84J160K78j156j475J6K314M004M742N189N822O354
$$ 524231 519382 516311 515237 515821 516981 517259 516103 514628 514644 516958 520962 525704 530893 536715 543069
62389E43069O276N658N062M855M848M788M934N765P209Q536R078Q843Q347Q084
$$ 543069 549345 555003 560065 564920 569768 574556 579490 585255 592464 601000 610078 618921 627268 635352
62375F35352Q170Q316Q325Q727J0477J3407J5504J4901J2480J1282J2884J5718
$$ 635352 643522 651838 660163 668890 679367 692774 708278 723179 735659 746941 759825 775543
62363G75543J7596J8709K0941K5048K9988L4646L8937M3150M7320N1503N5718
$$ 775543 793139 811848 832789 857837 887825 922471 961408 1004558 1051878 1103381 1159099
62352A159099N9300O0986O0013N6656N1458M4463L5606K5597J5889P659R13n313
$$ 1159099 1218399 1279385 1339398 1396054 1447512 1491975 1527581 1553178 1569067 1576726 1577639 1572326
62340A572326j1826j8432k4339k9213l3382l7074m0015m1919m2745m2146l9471
$$ 1572326 1560500 1542068 1517729 1488516 1455134 1418060 1378045 1336126 1293381 1251235 1211764
62329A211764l5022l0707k8447k8005k7279k4887k1712j9595j9186j9656k0210
$$ 1211764 1176742 1146035 1117588 1089583 1062304 1037417 1015705 996110 976924 957268 937058
62318I37058k0934k1959k2518k1785k0291j9338j8817j6970j3124r235p287o304
$$ 937058 916124 894165 871647 849862 829571 810233 791416 774446 761322 752087 744800 738496
62306G38496m075j080Q7p01k25L211O785P061M768L161L200L169K326J965K652
$$ 738496 734421 733341 733428 732727 732502 735713 742498 749559 754327 757488 760688 763857 766183 768148 770800
62291G70800K905J456r40k790l592l640l174k457j902j591j100k05Q14J565J868
$$ 770800 773705 775161 774221 771431 767839 764199 761025 758568 756666 755075 753975 753770 754584 756149 758017
62276G58017J663J159R44J395K147K741L449M784O476P757Q423Q934R713J1122
$$ 758017 759680 760839 761783 763178 765325 768066 771515 776299 782775 790532 798955 807889 817602 828724
62262H28724J3617J7164K0962K4602K8946L4769M1215M6903N1915N7055O1646
$$ 828724 842341 859505 880467 905069 934015 968784 1009999 1056902 1108817 1165872 1227518
62251A227518O3997O3910O2765O0822N6404M8412L8064K7404J7426Q346L40o980
$$ 1227518 1291515 1355425 1418190 1479012 1535416 1583828 1621892 1649296 1666722 1675068 1675408 1668428
62239A668428j4807k3898l3630m2750n0354n5862n8943n9909n9459n7744n4493
$$ 1668428 1653621 1629723 1596093 1553343 1502989 1447127 1388184 1328275 1268816 1211072 1156579
62228A156579n0100m5577m1278l6796l2260k8427k5307k2113j8931j6866j6024
$$ 1156579 1106479 1060902 1019624 982828 950568 922141 896834 874721 855790 838924 822900
62217H22900j4916j2671j0340q987p963o263m387l436l311l042k293j388m67L94
$$ 822900 807984 795313 784973 775986 768023 761760 757373 753937 750626 747584 745291 743903 743436 743830
62203G43830Q57R38J353K430L450L883M387N620O899P169O617O095N686M948M132
$$ 743830 744687 745625 746978 749408 752858 756741 761128 766748 773647 780816 787433 793528 799214 804162 808294
62188H08294L936M479N492P083R216J0950J1392J1067J1232J2124J2946J3234
$$ 808294 812230 816709 822201 829284 838500 849450 860842 871909 883141 895265 908211 921445
62176I21445J3091J2289J0464Q213O889P071Q152R539J1500J4634J9060K4142
$$ 921445 934536 946825 957289 965502 972391 979462 987614 997153 1008653 1023287 1042347 1066489
62164A066489K8715L1891L4154L7072M1113M4309M4153M0455L5115K9330K2493
$$ 1066489 1095204 1127095 1161249 1198321 1239434 1283743 1327896 1368351 1403466 1432796 1455289
62153A455289J4023M899l249r699j4748j8975k2925k7077l1549l5916l9444m1363
$$ 1455289 1469312 1474211 1470962 1461263 1446515 1427540 1404615 1377538 1345989 1310073 1270629 1229266
62141A229266m1162l9107l6224l3289l0055k6182k2473k0148j8927j7060j3642
$$ 1229266 1188104 1148997 1112773 1079484 1049429 1023247 1000774 980626 961699 944639 930997
62130I30997r896p726p720r120j0855j1941j1637j0171q937r000r515q500n302
$$ 930997 921101 913375 905655 896535 885680 873739 862102 851931 842994 833994 824479 815979 810677
62117H10677j481R83J780K146L236N184P408R119R532Q183N306J622k304o022
$$ 810677 809196 810179 811959 814105 817341 822525 829933 839052 848584 856767 862073 863695 861391 855369
62103H55369q602q869o651l284k91J856L173L142J246j845m688o499p274o741
$$ 855369 846767 837898 831247 827963 827672 829528 832701 835843 837089 835244 830556 824057 816783 810042
62089H10042m525j417Q60J611J873K688L769M411M797N581O872Q353R892J1524
$$ 810042 805517 804100 804960 806571 808444 811132 814901 819312 824109 829690 836562 844915 854807 866331
62075H66331J3293J5373J7753J9610J9950J9194J9090K0415K1849K1862K0790
$$ 866331 879624 894997 912750 932360 952310 971504 990594 1011009 1032858 1054720 1075510
62064A075510K0191K1017K3259K6471K9625L1173L0245K7254K2743J6662R626
$$ 1075510 1095701 1116718 1139977 1166448 1196073 1227246 1257491 1284745 1307488 1324150 1333776
62053A333776L489p27m367q981j3723j6807j8771k1931k6899l1947l5850l9005
$$ 1333776 1337265 1336538 1332171 1323190 1309467 1292660 1273889 1251958 1225059 1193112 1157262 1118257
62041A118257m1335m1535l9454l7148l6170l5472l3493l0903k9405k8733k6904
$$ 1118257 1076922 1035387 995933 958785 922615 887143 853650 822747 793342 764609 737705
62030G37705k3190j9096j6173j4379j2995j1881j1050j0019q574p636q212r577
$$ 737705 714515 695419 679246 664867 651872 639991 628941 618922 610348 602712 594500 584923
62018E84923r689p830n847n797p075p169n160l035k973m562n667n229m024k943
$$ 584923 575234 567404 561557 555760 548685 541516 536356 533321 530348 525786 520119 514890 510866 507923
62004E07923j812q9K055L814M581M546M497M952N447N088L883K840K525K271J405
$$ 507923 506111 506022 508077 511891 516472 521018 525515 530467 535914 541002 544885 547725 550250 552521 553926
61989E53926L31m98j837m674q315j0824j1291j0574r804r218q663q208p892p533
$$ 553926 554257 553759 551922 547248 538933 528109 516818 506244 496440 487222 478559 470351 462459 454926
61975D54926p044o398n299l566j842j105j472k218k895l476l427j880P90K677
$$ 454926 447882 441484 436185 432619 430777 429672 428200 425982 423087 419611 416184 414304 415094 417771
61961D17771K317K51j819k759k392j017N61J239Q24P09K302M863N964M478K342
$$ 417771 420088 420339 418520 415761 413369 412352 412913 414152 414976 415685 417987 422850 428814 433292 435634
61946D35634K578N887R917J1912J1423J0147R772J0731J2630J4752J5900J4915
$$ 435634 438212 444099 454016 465928 477351 487498 497270 508001 520631 535383 551283 566198
61934E66198J2052R306Q498R431J0505J0710J0207R299P862N881L804K004M09
$$ 566198 578250 587556 596054 605485 615990 626700 636907 646206 654068 659949 663753 665757 666166
61921F66166j151k550l556m224m946o013o983o693m413j043J490K376K786M217
$$ 666166 665015 662465 658909 654685 649739 643726 636743 630050 625637 624594 626084 628460 631246 635463
61907F35463O668Q989J0353J0704J0337R763R481R206P911N321K651J068J07j296
$$ 635463 642131 651120 661473 672177 682514 692277 701758 710964 718875 724196 726847 727915 728022 726726
61893G26726l029m239m925n680o242n771m352k922j814o89J92kj432l524n978
$$ 726726 723697 719458 714533 708853 702611 696840 692488 689566 687752 687063 687255 687253 685821 682297 676319
61878F76319q577j0275j0108q926q614r421r776q894p772p197o558n361m237l531
$$ 676319 667742 657467 647359 638433 629819 620398 610622 601728 593956 586759 580201 574840 570603 567072
61864E67072k497q14N35R80J654L700O385Q150Q731R053R770J0986J2784J4984
$$ 567072 564575 563761 564296 565276 566930 570630 577015 585165 593896 602949 612719 623705 636489 651473
61850F51473J6855J7923J8607J9398K0030K0186K0272K0605K0554J9236J6614
$$ 651473 668328 686251 704858 724256 744286 764472 784744 805349 825903 845139 861753
61839H61753J3133R001M544N11k673n280p214p633o539n555n794n923l940j51
$$ 861753 874886 883887 888431 888942 886269 880989 873775 866142 859603 854048 848254 842331 838391 838240
61825H38240L317N469P158Q957J0189J0344R893R101P380M376Q00k412n020p299
$$ 838240 841557 847026 854184 863141 873330 883674 893567 902668 910048 914424 915224 912812 907792 900493
61811I00493r570j2208j5305j8099j9488j9332j8432j7162j5170j2705j1001j0690
$$ 900493 890923 878715 863410 845311 825823 806491 788059 770897 755727 743022 732021 721331
61799G21331j0808j0282r524r511j0038j0031r243q413p949p523p003o598n977
$$ 721331 710523 700241 690717 681206 671168 661137 651894 643481 635532 628009 621006 614408 608431
61786F08431m456k475j731k955m596m683l397k522k788l070k343j122m33l62k31
$$ 608431 603975 601500 599769 596814 592218 587535 584138 581616 578828 575758 573415 572293 571860 571498 571267
61771E71267L09J001J404J180L09n80m83R89L142M950N870N914N446N191N704
$$ 571267 571576 572577 573981 575161 575470 574890 574407 575396 578538 583488 589358 595272 600718 605909 611613
61756F11613O573O929O922P637Q926Q641N179q6m236o083o663p064p302p310p590
$$ 611613 618186 625115 632037 639674 648600 657241 662420 662334 658098 652015 645352 638288 630986 623676 616086
61741F16086q446r505j0095r552p419m234j766j395k446l159l023k917l275l448
$$ 616086 607640 598135 588040 578488 571069 566835 565069 563674 561228 558069 555046 552129 548854 545406
61727E45406k929j874m92Q96J331K21j312j593p93m40o63n6J506K203J208O2N4
$$ 545406 542477 540603 540111 541007 542338 542559 541247 539654 538861 538421 537758 537702 539208 541411 542619 542681 542735
61710E42735J64r81k811l913m077l798l049j905j315j859k741l181l723m804n355
$$ 542735 542899 541918 539107 535194 531117 527319 524270 522365 521050 519191 516450 513269 509546 504742 499387
61695D99387m391k957k778l776m553m585m308l766k843k281k731l273k677j652
$$ 499387 494996 492039 489261 485485 480932 476347 472039 468273 465430 463149 460418 457145 454468 452816
61681D52816j940l424m029k777j056m91j010j534j441q53l25m49j103j234j83
$$ 452816 450876 447452 443423 440646 439590 439099 438089 436555 435114 434261 433936 433487 432384 431150 430967
61666D30967J100J271N88L47O81N50r8j0J273K662L385M020M983N415M494K665
$$ 430967 432067 433338 433926 434273 434954 435504 435406 435396 436669 439331 442716 446736 451719 457134 461628 464293
61650D64293P66r92k301k195m33J426J655O07K56J624L718M792L962J634q44k004
$$ 464293 465059 464067 461766 459571 459138 460564 462219 462826 463082 464706 468424 473216 477178 478812 477968 475964
61634D75964j371O8R65J036J056J535K050J882P56j208l596n518n928m783l484
$$ 475964 474593 474661 475626 476662 477718 479253 481303 483185 483941 482733 479137 473619 467691 462908 459424
61619D59424l452m355m537l238j461l65J84O08J86j969m910o464n978n013m920
$$ 459424 455972 451617 447080 443842 442381 442016 442200 442808 442994 441025 436115 429651 423673 418660 413740
61604D13740n126m533l324k354j781j419j525k061j898j97J850K041j26k966m700
$$ 413740 408614 404081 400757 398403 396622 395203 393678 391617 389719 389522 391372 393413 393287 390321 385621
61589C85621m928m035k413o49M47N07j94j260k337k844k346j323p72r29j064p06
$$ 385621 380693 376658 374245 373596 374043 374550 374356 373096 370759 367915 365569 364246 363474 362545 361481 360775
61573C60775k29nK68R40J626J654R44J25j37K80R61J415J509J446J344J128Q62
$$ 360775 360546 360541 360809 361749 363375 365029 365973 366098 365961 366241 367202 368617 370126 371572 372916 374044 374906
61556C74906P50O90M00J87P87J963K273J066j37N10K472L358K025k34j560j369
$$ 374906 375656 376346 376746 376933 377720 379683 381956 383022 382885 383395 385867 389225 391250 391016 389456 388087
61540C88087j50J304K057J486J21o38j9J467K865L512K974J390k2M2J106J258
$$ 388087 387937 389241 391298 392784 392905 392267 392248 393715 396580 400092 403066 404456 404434 404476 405582 406840
61524D06840j15j289o81Q22J211R3j278k085k549k582j449Q54K975L582K755J549
$$ 406840 406725 405436 404755 405577 406788 406881 405603 403518 400969 398387 396938 397792 400767 404349 407104 408653
61508D08653O75P7o35j680k815l198j919Q04L208L416J504l46q9K025L902M043
$$ 408653 409328 409405 408770 407090 404275 401077 399158 399962 403170 406586 408090 407744 407655 409680 413582 417625
61492D17625L008K299K359K244J272K48N29K085L266K805J465J029J992L235L915
$$ 417625 420633 422932 425291 427535 428807 429055 429584 431669 434935 437740 439205 440234 442226 445461 449376
61477D49376M510N441N808M593K376O37k30r68j720j728q73r1P8J37K99k39j925
$$ 449376 453886 459327 465135 469728 472104 472741 472511 471543 469823 468095 467222 467131 467209 467346 467645 467406 465481
61460D65481l789m606m320l639k949k411k398k985l486l188k066l77J675L338
$$ 465481 461692 457086 452766 449127 446178 443767 441369 438384 434898 431710 429644 429267 430942 434280
61446D34280L336J440o90j115L13K152K996K376Q55LJ282M108N856M863K536J338
$$ 434280 437616 439056 438366 437251 437564 439716 442712 445088 445943 445946 447228 451336 457192 462055 464591 465929
61430D65929J567J544L11j290k021j443N0J425J681J044R80K066K842J933K81
$$ 465929 467496 469040 469351 468061 466040 464597 464647 466072 467753 468797 469777 471843 474685 476618 476899
61415D76899k84K65O51O93J098J394L91j406k027j005j0j47m89L3J021J503J109
$$ 476899 476615 476880 477531 478224 479322 480716 481107 479701 477674 476669 476659 476512 476023 476056 477077 478580 479689
61398D79689j78k029l139k068O55K713K839K170K171K574K266J107p0m11M96K359
$$ 479689 479511 477482 474343 472275 472930 475643 478482 480652 482823 485397 487663 488770 488700 488289 488785 491144
61382D91144M027M424L835L340L156K781K679L908N848O339M824L422L806M849
$$ 491144 495171 499595 503430 506770 509926 512707 515386 519294 525142 531481 536305 539727 543533 548382
61368E48382M743L802L452L607L048J699P28N42K98m72r06RJ891L063K298M80
$$ 548382 553125 556927 560379 563986 567034 568733 569461 570003 570301 569829 568923 568932 570823 573886 576184 576664
61352E76664N3K195N027N690L961K326K423L160K881J717P51K40j35l24k68m17
$$ 576664 576717 578912 583939 589629 593590 595916 598339 601499 604380 606097 606848 607088 606953 606629 606361 605944
61336F05944r44j225q35k30J33K99q1j692l906m798l850k912l095k655R9L443
$$ 605944 605000 603775 602940 602710 602843 603142 603061 601369 597463 592665 588815 585903 582808 580153 580252 583695
61320E83695M405L172K558L665M922N430O263P747Q170O645N291O735J0640J4354
$$ 583695 588100 591272 593830 597495 602417 607847 614110 621857 630027 636672 641963 648698 659338 673692
61306F73692J6354J7628J9696K2322K3545K1685J7228J2478R119O367K336l048
$$ 673692 690046 707674 727370 749692 773237 794922 812150 824628 833747 840114 842450 839402
61294H39402p549r354r205r158j0088j1257j1825j1760j1378j0830j0204r600
$$ 839402 831853 822499 813294 804136 794048 782791 770966 759206 747828 736998 726794 717194
61282G17194r002q324p705p311o806n468l119o47Q26J168J346K225L588M422M033
$$ 717194 708192 699868 692163 684852 678046 672578 669459 668812 669638 670806 672152 674377 677965 682387 686420
61267F86420K827K079K788M546N756N360M137L701M498N683O852Q446J0032R716
$$ 686420 689247 691326 694114 698660 704416 709776 713913 717614 722112 727795 734647 743093 753125 762841
61253G62841O432J732j935l920n005n322m456l099k625k913k479r65J20l41j621
$$ 762841 769273 771005 769070 765150 760145 754823 750367 747268 744643 741730 739251 738286 738406 738065 736444
61238G36444k382k131r31Q54K137J789L59k75M75J162Q80Q10K141M114N556O979
$$ 736444 734062 731931 731000 731854 733991 735780 736139 735864 736339 737501 738381 739191 741332 745446 751002 757981
61222G57981R334J1708J2187J0564Q535P323O549N515M387L888M482N961P327
$$ 757981 767315 779023 791210 801774 810309 817632 824181 829696 834083 837971 842453 848414 855741
61209H55741P495O467N374M782L846J989N88J594M757P621Q416P955Q416J1018
$$ 855741 863236 869703 875077 879859 883705 885694 886282 887876 892633 900254 908670 916625 925041 936059
61195I36059J5079J8731K0371J9777J8033J6268J4584J2376R306N705K289k04
$$ 936059 951138 969869 990240 1010017 1028050 1044318 1058902 1071278 1080584 1086289 1088578 1088374
61183A088374j472j979k560l586m876o475q654j0992j2344j2242j1612j1598j2408
$$ 1088374 1086902 1084923 1082363 1078777 1073901 1067426 1058772 1047780 1035436 1023194 1011582 999984 987576
61170I87576j3735j5415j6956j7325j6177j4730j4442j5197j5688j5189j4121
$$ 987576 973841 958426 941470 924145 907968 893238 878796 863599 847911 832722 818601
61159H18601j3011j1795j0219q378o662n337m098k172P88L961O106P038P535P745
$$ 818601 805590 793795 783576 775198 768536 763199 759101 756929 757717 761678 767784 774822 782357 790102
61145G90102O744M023M58k749n188o793p188o267m744l477k697k170j472M3K622
$$ 790102 796846 800869 801327 798578 793390 786597 779409 773142 768398 764921 762224 760054 758582 758625 761247
61130G61247N284O674P057Q042J0096J1882J2732J3940J6494J9332K1317K3248
$$ 761247 766531 773205 780262 788304 798400 810282 823014 836954 853448 872780 894097 917345
61118I17345K6048K8333K8146K6403K6191K8721L1944L3443L2964L1675L0328
$$ 917345 943393 971726 999872 1026275 1052466 1081187 1113131 1146574 1179538 1211213 1241541
61107A241541K8939K7352K5354K2684J9421J6209J3832J2347J0563O785O24o071
$$ 1241541 1270480 1297832 1323186 1345870 1365291 1381500 1395332 1407679 1418242 1425027 1425651 1419580
61095A419580j0901j3462j5288j7490j9684k1212k1821k0902j7859j3823j1192
$$ 1419580 1408679 1395217 1379929 1362439 1342755 1321543 1299722 1278820 1260961 1247138 1235946
61084A235946j0537r760p297m339k611j690k02J861L847O077R029J1955J4100
$$ 1235946 1225409 1215649 1208352 1204013 1201402 1199712 1199510 1201371 1205218 1211295 1220324 1232279 1246379
61071A246379J6189J8928K1145K1381K0421K0234K1113K1737K1497K0836J9772
$$ 1246379 1262568 1281496 1302641 1324022 1344443 1364677 1385790 1407527 1429024 1449860 1469632
61060A469632J7949J5878J4542J4045J3943J4276J4903J4612J2573R911Q145O800
$$ 1469632 1487581 1503459 1518001 1532046 1545989 1560265 1575168 1589780 1602353 1612264 1620409 1627209
61048A627209M486J750O68J766L302L740L482L846N431P568Q818Q406P557Q333
$$ 1627209 1631695 1633445 1634113 1635879 1639181 1642921 1646403 1650249 1655680 1663248 1672066 1680472 1688029 1696362
61034A696362J0713J2368J2212J2043J3334J4693J4622J4624J6874K0562K3510
$$ 1696362 1707075 1719443 1731655 1743698 1757032 1771725 1786347 1800971 1817845 1838407 1861917
61023A861917K6008K9891L4820L8621M0652M2016M3109M3880M5842N0952N8865
$$ 1861917 1887925 1917816 1952636 1991257 2031909 2073925 2117034 2160914 2206756 2257708 2316573
61012B316573O7902P7999Q9964J02849J15039J27167J40987J56603J74080J96598
$$ 2316573 2384475 2462474 2552438 2655287 2770326 2897493 3038480 3195083 3369163 3565761
61002C565761K28427K71076L24845L92037M74312N69934O79954Q14695R87348
$$ 3565761 3794188 4065264 4390109 4782146 5256458 5826392 6506346 7321041 8308389
60993H308389J205757J480881J833028K255847K654204K841856K648277K055967
$$ 8308389 9514146 10995027 12828055 15083902 17738106 20579962 23228239 25284206
60985B5284206J232323M23556j79044m84733m71715j73610K83366O69969P43979
$$ 25284206 26516529 26940085 26761041 26276308 25804593 25630983 25914349 26584318 27328297
60976B7328297L93483k94494j101501j810816k294396k518646k513314k344375
$$ 27328297 27721780 27427286 26325785 24514969 22220573 19701927 17188613 14844238
60968A4844238k089977j813346j548153j306691j094588r13967p60810o29157
$$ 14844238 12754261 10940915 9392762 8086071 6991483 6077516 5316706 4687549
60960D687549n17476m26706l54499k96234k49804k14804j88437j66361j46710
$$ 4687549 4170073 3743367 3388868 3092634 2842830 2628026 2439589 2273228 2126518
60951B126518j29790j15077j01718r0464q1655p2761o1646n0902m4950m3845m3818
$$ 2126518 1996728 1881651 1779933 1689469 1607814 1535053 1473407 1422505 1377555 1333710 1289892
60940A289892m3202m3538m5014m5181m2938m0161l8333l6542l3886l1194k9183
$$ 1289892 1246690 1203152 1158138 1112957 1070019 1029858 991525 954983 921097 889903 860720
60929H60720k7012k3912k0634j8244j6717j5354j3732j1865j0103q870q065p217
$$ 860720 833708 809796 789162 770918 754201 738847 725115 713250 703147 694277 686212 678995
60917F78995o620p123q106p459m822k847l367m344l097o62J27o65p73j55q55k793
$$ 678995 672375 665252 657146 649687 644865 642018 638651 634307 631210 630548 630675 630010 629237 629082 628227 625434
60901F25434l549k580k172l371m332l748l071l981o039q073r731j0624r996q369
$$ 625434 621885 619305 617133 613762 609430 605682 602611 598630 592591 584518 574787 564163 554167 545798
60887E45798p574q019p847n988m116m108n284n743n185m707m718m650m236l814
$$ 545798 538224 530205 522358 516370 512254 508146 502862 497119 491934 487227 482509 477859 473623 469809
60873D69809l521l113k456j607n52P66K274L662M305L704K351J664K342L322L456
$$ 469809 466288 463175 460719 459112 458560 459326 461600 465262 469567 473271 475622 477286 479628 482950 486406
60858D86406L534N271Q595J1410J2047J0628Q088N311L292K630K582J929R42J159
$$ 486406 489940 495211 503806 515216 527263 537891 545979 551290 554582 557212 559794 561723 562665 563824
60844E63824K960M742M833L076J51l291o350p971q046p670p853q643r555j0024
$$ 563824 566784 571526 576359 579435 579586 576295 569945 561974 553928 546258 538405 529762 520207 510183
60830E10183r490q009o700o484o524n290l112k053l030m649n351n162m717m040
$$ 510183 500693 492684 485984 479500 472976 467686 464574 462521 459491 454842 449491 444329 439612 435572
60816D35572l204k892l361l778l441k811k623k787k859k790k582j967j116q84
$$ 435572 432368 429476 426115 422337 418896 416085 413462 410675 407816 405026 402444 400477 399361 398477
60802C98477j613k359k043q59J14L35K54O06J552K295J621n78k490k054L95K312
$$ 398477 396864 394505 392462 391603 391717 392052 392306 392912 394464 396759 398380 397802 395312 393258 393653 395965
60786C95965K098J007J188K903M649N256M727L447J726J72m36M8Q79J140M59r88
$$ 395965 398063 399070 400258 403161 407810 413066 417793 421240 422966 423138 422702 422750 423629 424769 425228 424240
60770D24240k826m519n324m623k620n51K69k10p84m94L15Q18J021J528K269K279
$$ 424240 421414 416895 411571 406948 404328 403777 404046 403836 403052 402558 402873 403691 404712 406240 408509 410788
60754D10788R36j065k316k100j079o07j267k161j900k18J778K875K615J085j251
$$ 410788 411724 410659 408343 406243 405164 404557 403290 401129 399229 399011 400789 403664 406279 407364 406113
60739D06113l297l917l265k705l039l657l781l471k934k035j113r91j430r08J113
$$ 406113 402816 398899 395634 392929 389890 386233 382452 378981 376047 374012 372899 371908 370478 369570 370683
60724C70683L076L617L414L508L356K323J579K309L351K931J745J741K617K396
$$ 370683 373759 377376 380790 384298 387654 389977 391556 393865 397216 400147 401892 403633 406250 408646
60710D08646J143J091K764L888K903J075J71J30J60K29L54J6o25l99R66J948J277
$$ 408646 409789 410880 413644 417532 420435 421510 421681 421811 421971 422200 422554 422570 421945 421546 422512 424460 425737
60693D25737l20j483k141k950l683l525k449j369j108j787k874l440k796j203
$$ 425737 425417 423934 421793 418843 415160 411635 409186 407817 406709 404922 402048 398608 395812 394609
60679C94609L69J329J889K425L016L627M157M355M173L996L856K978R25j225k026
$$ 394609 394978 396307 398196 400621 403637 407264 411421 415776 419949 423945 427801 430779 431704 430479 428453
60664D28453j602j276j650k336l205m310m765l416p67J340K036J959J457J44j553
$$ 428453 426851 425575 423925 421589 418384 414074 409309 405893 405126 406466 408502 410461 411918 412062 410509
60649D10509k133j088L01R02J133J760K551K771K093N59j415k717k440j313j054
$$ 410509 408376 407288 407589 408491 409624 411384 413935 416706 418799 419358 417943 415226 412786 411473 410419
60634D10419j986k578j665J70J728K372J761p7j866j748L74K333K167J64k007
$$ 410419 408433 405855 404190 404360 406088 408460 410221 410144 408278 406530 406904 409237 411404 411568 409561
60619D09561l054k542q02J129K207K416K260J608K00r44m30J192J870R54j04l18
$$ 409561 406507 403965 403163 404292 406499 408915 411175 412783 412983 412039 411609 412801 414671 415625 415521 415203
60603D15203l58p25o76K34J248J829K259K351J327k86n79J141L473N234O588P188
$$ 415203 414845 414120 413444 413678 414926 416755 419014 421365 422692 422406 421827 422968 426441 431675 438263 445451
60587D45451N774K798J018J765K826J870j19r38o72p13q10K22J843K326J498P97
$$ 445451 451225 454023 455041 456806 459632 461502 461383 460445 459773 459060 458250 458472 460315 462641 464139 464936
60571D64936R59J484K105L156M650O220P809R370J0501J1281J2682J5066J7080
$$ 464936 465895 467379 469484 472640 477290 483510 491319 500689 511190 522471 535153 550219 567299
60558E67299J7110J4968J1222O137N19l722n525o130o980p362n940l548k166j828
$$ 567299 584409 599377 610599 616736 617255 613533 608008 601878 594898 587536 581596 578048 575882 574054
60544E74054q52J111K514K634K779M235O507Q368R632J1094J3230J5437J6674
$$ 574054 573202 574313 576827 579461 582240 586475 592982 601350 610982 622076 635306 650743 667417
60531F67417J6997J8099K1337K5315K6847K4824K1388J8464J5099R727L179k626
$$ 667417 684414 702513 723850 749165 776012 800836 822224 840688 855787 865514 868693 866067
60519H66067p531j2348j6303j7874j7515j7004j6461j4546j1472r222q354p135
$$ 866067 858536 846188 829885 812011 794496 777492 761031 746485 735013 725791 717437 710302
60507G10302m661k497k023j977k46L160O439Q669J0691J3521J6964K0209K3248
$$ 710302 705641 703144 701121 699144 698898 702058 708497 717166 727857 741378 758342 778551 801799
60494H01799K7136L2630L8911M4131M7212M8368M7801M4974L9757L3371K7183
$$ 801799 828935 861565 900476 944607 991819 1040187 1087988 1132962 1172719 1206090 1233273
60483A233273K1409J5974J1903J0573J1726J3246J2798R135K343o396j5604k4800
$$ 1233273 1254682 1270656 1282559 1293132 1304858 1318104 1330902 1340037 1342380 1335984 1320380 1295580
60471A295580l4483m4346n2400n6847n8073n7706n6415n3776m9653m4462l8556
$$ 1295580 1261097 1216751 1164351 1107504 1049431 991725 935310 881534 831881 787419 748863
60460G48863l2462k7296k3713k0938j7948j5140j3648j3440j3322j2472j0861
$$ 748863 716401 689105 665392 644454 626506 611366 597718 584278 570956 558484 547623
60449E47623q568n965m154l960m716n138n009m924m816m036k613j186p9O04M34
$$ 547623 539055 533090 528936 524976 520260 515122 510113 505189 500373 496337 493724 492538 492459 493063 493497
60434D93497n77j257o85K87L49j00K58J254J546J024R05J424J430N59j23k10q30
$$ 493497 492920 491663 490978 491265 491614 491514 491772 493026 494572 495596 496501 497925 499355 499914 499791 499581 498751
60417D98751k526l792k829O7K880M020L475K226J125L40l19o61k31O86J087Q37
$$ 498751 496225 492433 489604 489671 492551 496571 500046 502272 503397 503737 503418 502757 502526 503212 504299 505136
60401E05136J206K829M205L713K203J801K682L159K803L153M851O103N212L137
$$ 505136 506342 509171 513376 517089 519292 521093 523775 526934 529737 532890 537741 543844 549056 552193
60387E52193K186K969L927L658K664K450L312L757K568Q92R89K840L718J998l07
$$ 552193 554379 557348 561275 564933 567597 570047 573359 577116 579684 580576 581565 584405 588123 590121 589814
60372E89814l22J625K836K247J473K019L469M589M607L173N80j709k007k17K153
$$ 589814 589492 591117 593953 596200 597673 599692 603161 607750 612357 615530 616110 614401 612394 612177 614330
60357F14330L783M456M533M551N074N923O112N534N812Q086J0862J1925J1439
$$ 614330 618113 622569 627102 631653 636727 642650 648762 654296 660108 668194 679056 690981 702420
60344G02420J1055J0544Q056L613l13k262l463n346p384q326p990p037o195o184
$$ 702420 713475 724019 732075 735688 735375 733113 729650 724304 716920 708594 700604 693567 687372 681188
60330F81188p199q276q413q135q447q639p214m817l724m243m182k585j262j551
$$ 681188 673989 665713 657300 649165 640718 632079 624865 620048 616324 612081 607899 605314 604052 602501
60316F02501k005q18J435L074L691L936M429O020R417J3414J5211J3955J2247
$$ 602501 600496 599678 601113 604187 607878 611814 616243 622263 631680 645094 660305 674260 686507
60303F86507J2594J4031J4104J2691J1610J1411J0800Q949O479M002J053l201
$$ 686507 699101 713132 727236 739927 751537 762948 773748 782697 789176 793178 794231 791030
60291G91030q801j4465j8080j8428j6687j5263j4868j3936j1425q518o601n313
$$ 791030 782229 767764 749684 731256 714569 699306 684438 670502 659077 650559 643958 638645
60279F38645m008l546m754o271o014m236l173l855n066n445n026m332l362k007
$$ 638645 634637 631091 626337 620066 614052 609816 606643 602788 597722 592277 587251 582919 579557 577550
60265E77550o64N7j58j254k842m210m651l957k607j566j639k549k841j462P25
$$ 577550 576886 576943 576785 575531 572689 568479 563828 559871 557264 555698 554059 551510 548669 547207 547932
60250E47932J902J736J677K670L933M401M027L062J406n43j680j804k144l306
$$ 547932 549834 551570 553247 555917 559850 564251 568278 571340 572746 572203 570523 568719 566575 563269
60236E63269l892k395N78L249M829N409M790L103J826K352L879M299L130K023
$$ 563269 559377 556982 557560 560809 565638 571047 575837 578940 580766 583118 586997 591296 594426 596449
60222E96449K393L941N661O988P696P749P665Q172R131R573R018Q193Q163R212
$$ 596449 598842 602783 608444 615432 623128 630877 638542 646714 655845 665418 674436 682629 690792 700004
60208G00004J0806J2197J2902J2885J2400J1620J0603R690R490R927R839Q182
$$ 700004 710810 723007 735909 748794 761194 772814 783417 793107 802597 812524 822363 830545
60196H30545N485L368K551K085P80j198k634k991l219m560o854q662r082q827
$$ 830545 836030 839398 841949 844034 844814 843616 840982 837991 834772 830212 823358 814696 805614 796787
60182G96787q950r191q479o741n123m436m344m348m543m995n185m645l610k615
$$ 796787 787837 778646 770167 763426 758303 753867 749523 745175 740632 735637 730452 725807 722197 719582
60168G19582j871j312p65N9J109J465N9k719m904m922l115r50O38J563J860J369
$$ 719582 717711 716399 715634 715693 716802 718267 718326 715607 710703 705781 702666 701716 702354 703917 705777 707146
60152G07146J67j109j524n84J189K661L300L508L571L130K342K531M447O665P311
$$ 707146 707313 706204 704680 704096 705285 707946 711246 714754 718325 721455 723797 726328 730775 737440 744751
60137G44751O814P211Q964J0536J1071J1484J2400J2950J2328J0952R344P310
$$ 744751 751565 758776 767740 778276 789347 800831 813231 826181 838509 849461 858805 866115
60125H66115M898K703O45k029m854n873m172j341M94Q07K46m83n04Q85K878L602
$$ 866115 871013 873716 874361 872332 867478 861605 857433 856092 856586 857393 857639 857156 856652 857537 860415 864017
60109H64017K651J594J193O3k654n310o146n952o515p746q264p711o713n455l985
$$ 864017 866668 868262 869455 869518 866864 861554 855408 849456 842941 835195 826931 819220 812507 807052 803067
60094H03067l002k755k205p97J26n51j427o13J018J112k56o04J123L174L848L613
$$ 803067 800065 797310 795105 794308 794434 793883 792456 791843 792861 793973 793717 793113 794236 797410 801258 804871
60078H04871L738M413M862M209J870j938n940q959j1171j3294j4866j4799j3386
$$ 804871 808609 813022 817884 822093 823963 822025 816085 807126 795955 782661 767795 752996 739610
60065G39610j2250j2080j1854j0638q947p815p468p383o992o002m488k858j391
$$ 739610 727360 715280 703426 692788 683841 676026 668558 661175 654183 648181 643693 640835 639444
60052F39444pJ186J645J306J143J923K949L092K629K976M702O934Q584R207Q694
$$ 639444 639437 640623 642268 643574 644717 646640 649589 652681 655310 658286 662988 669922 678506 687713 696407
60037F96407P163N264L812L018K498J902J037k21j585k346k319k248k797l884
$$ 696407 703570 708834 712646 715664 718162 720064 721101 720880 719295 716949 714630 712382 709585 705701
60023G05701n562q383j1781j3427j1913r236q635j0341j1497j0271p990o755o696
$$ 705701 700139 691756 679975 666548 654635 645399 636764 626423 614926 604655 596665 589910 583214
60010E83214o533n521l869k112q52n45q69q04J68J338J745J460J342J682J656
$$ 583214 576681 571160 567291 565179 564327 563782 562913 562109 562277 563615 565360 566820 568162 569844 571500
59995E71500M62j312k022p66J636L856N528O825P347O714N850O031O802O499M954
$$ 571500 571962 570650 568628 567862 569498 573354 578882 585707 593054 599768 605618 611649 618451 624950 629904
59980F29904L622K667L62l615o600o313l920j983j120o56q84k175l123k138j56
$$ 629904 633526 636193 636555 632940 626340 620027 616107 614124 613004 612348 611464 609289 606166 604028 603872
59965F03872O35K41O77K694N025O842Q695J0795J2222J2149J0394O913K252j698
$$ 603872 604507 604748 605425 608119 613144 619986 628681 639476 651698 663847 674241 681154 683406 681708
59951F81708l154k594k021k311k909l714n190o698o786n382l960l306k899k536
$$ 681708 678554 675960 673939 671628 668719 665005 659815 653117 646331 640949 636989 633683 630784 628248
59937F28248k755l353l308k443j552p04P69K427K898K265K296L717N246N992O821
$$ 628248 625493 622140 618832 616389 614837 614133 614902 617329 620227 622492 624788 628505 633751 639743 646564
59922F46564Q250Q871P218L928P60j336k196j645M1J798K967M151N986P861Q736
$$ 646564 654814 663685 670903 674831 675591 674255 672059 670414 670455 672253 675220 679371 685357 693218 701954
59907G01954Q692Q741R436J0296J0322Q732N567J927q10k140k576k787l150l824
$$ 701954 710646 719387 728823 739119 749441 758173 763740 765667 764857 762717 760141 757354 754204 750380
59893G50380m424l844j476J521L292L580L812M868O144O995P746Q729R496R664
$$ 750380 745956 742112 740636 742157 745449 749029 752841 757709 763853 770848 778594 787323 796819 806483
59879H06483R672J0088J0804J1314J1279J0679R880R476R444Q764O717M184K486
$$ 806483 816155 826243 837047 848361 859640 870319 880199 889675 899119 907883 914600 918784 921270
59866I21270J363n02l084m781m874m663n678p933j0405j2112j2388j1169r514
$$ 921270 922633 922131 919047 914266 909392 904729 899051 891118 880713 868601 856213 845044 835530
59853H35530q876r462j0058r627q199o219m083k424j714j351o2K562N771Q710
$$ 835530 826654 817192 807134 797507 789308 783089 779006 776582 774868 773517 773455 776017 781788 790498
59839G90498J0866J1608J0556Q315N857L430J175J86J421L962O068P442Q612Q592
$$ 790498 801364 812972 823528 831843 837700 841130 842305 842491 843912 847874 853942 861384 869996 878588
59825H78588N696O65l608n875p665j0036j1807j1947j1324j0761r567p449n996
$$ 878588 884284 884949 881341 875466 867801 857765 845958 834011 822687 811926 802359 794910 788914
59812G88914o558q163r029q872q348p538o398n557n308m742l136j332o31j151
$$ 788914 782356 774193 765164 756292 747944 740406 734008 728451 723143 718401 715265 713933 713302 712151
59798G12151k175l188l825l796l696m639o329o738m682j530N76J015L60q38j831
$$ 712151 709976 706788 702963 699167 695471 690832 684503 677765 673083 671553 672129 673144 673504 672666 670835
59783F70835j568m5J344J698J694J873J403j61j397q66Q18K374M049O619R141
$$ 670835 669267 669222 670566 672264 673958 675831 677234 677073 675676 674810 675628 678002 682051 688670 697811
59768F97811R763Q331O459N310M805M745N286O267P131P651Q063Q701R893J1716
$$ 697811 707574 715905 722364 727674 732479 737224 742510 748777 755908 763559 771622 780323 790216 801932
59754H01932J3420J3924J3369J3199J4066J4843J4499J3676J3333J3074J2076
$$ 801932 815352 829276 842645 855844 869910 884753 899252 912928 926261 939335 951411
59743I51411J0669R673R066Q380P427N699K418j629l838l183k238l736o502p336
$$ 951411 962080 971753 980819 989199 996626 1002325 1004743 1003114 999276 996093 993855 990119 983617 976281
59729I76281n881m658m681m343k929k134k987l809k840j062o92k092l760m627
$$ 976281 970400 965742 961061 956718 953789 951655 948668 944859 942019 940957 940265 938173 934413 929786
59715I29786m919n125n256n144m722m068l550l598l903l314j177J464K831K557
$$ 929786 924867 919742 914486 909342 904620 900552 897002 893404 889501 886187 885010 886474 889305 891862
59701H91862K084K584L299K735J099L43J608L695M771M613M246M000L239J687
$$ 891862 893946 896530 899829 902564 903663 904006 905614 909309 914080 918693 922939 926939 930178 931865
59687I31865j55j882l384m270m202l838m292n671p147q418r750j0670j0210q695
$$ 931865 931710 929828 926444 922174 917972 914134 909842 904171 897024 888606 878856 868186 857976 849281
59673H49281p684p808q163q088p896p462o071m326m054n282n388k748P13K264
$$ 849281 841597 833789 825626 817538 809642 802180 796109 791783 787729 782447 777059 774311 775024 777288
59659G77288K043K007K646K982K911L413M716O032O871P209O805N580M241L303
$$ 777288 779331 781338 783984 786966 789877 793290 798006 804038 810909 818118 824923 830503 834744 838047
59645H38047K121N7k162l656n122p760j1041j3243j3847j3736j3270j1817r357
$$ 838047 840168 840225 838063 834407 829285 821525 810484 797241 783394 769658 756388 744571 735214
59632G35214o952n455m787m609m694m695m449m483n306o467p126p239p189o657
$$ 735214 728262 722807 718020 713411 708717 704022 699573 695090 689784 683317 676191 668952 661763 655106
59618F55106n126l272k601l562m946n326m399k928j880j554j103O50L498N599
$$ 655106 649980 646708 644107 640545 635599 630273 625874 622946 621066 619512 618409 619059 622557 628156
59604F28156N543M029K748K375K479K541K071N49j551k444j073J155J927Q15p50
$$ 628156 633699 637728 640476 642851 645330 647871 649942 650491 648940 646496 645423 646578 648505 649320 648570
59589F48570j610j594p44M98P85p55k834l427k675k567l698m315l100j081J18
$$ 648570 646960 645366 644622 645120 645905 645150 642316 638889 636214 633647 629949 625634 622534 621453 621571
59574F21571L67L64N3r47k107k376j634p92m96m80k96j17l53p69o05L33J157R85
$$ 621571 621938 622302 622355 621408 619301 616925 615291 614499 614003 613523 613227 613110 612757 611988 611383 611716 612873 613858
59556F13858J29m08l31j00L19J564L436M432L380R57q81o17J745M600N889N250
$$ 613858 613987 613579 613248 613148 613467 615031 618467 622899 626279 627236 626355 625738 627483 632083 637972 643222
59540F43222M884P125J1323J4884J7278K0548K5063K7289K3618J4716M408m255
$$ 643222 648106 655231 666554 681438 698716 719264 744327 771616 795234 809950 814358 810103
59528H10103j0057j2398j1428q777o154l647q48J279J491M98O2K83k68j996l809
$$ 810103 800046 787648 776220 767443 761289 757642 756794 758073 759564 760062 760124 760407 760139 758143 754334
59513G54334n170o600p996q176o828n456n548o741p495p134o563p001q269q706
$$ 754334 749164 742564 734568 726392 719564 714108 708560 701819 694324 687190 680627 673626 665357 656651
59499F56651p170m682l224l055k556p97J184K222K459K333J729J040J415K881
$$ 656651 649481 644799 641575 638520 635964 635167 636351 638573 641032 643365 645094 646134 647549 650430
59485F50430L859L696L835N174O174N348L815L381L699L493L116L565M301M325
$$ 650430 654289 657985 661820 666994 673168 678516 682331 685712 689411 692904 696020 699585 703886 708211
59471G08211M262M964N266L725J494P61J189P93l60l19J179K230J956J553K041
$$ 708211 712473 717437 722703 726428 727922 728683 729872 730665 730305 729986 731165 733395 735351 736904 738945
59456G38945L280N193P741R697R748Q759Q687R475R365Q133P249O842N381K689
$$ 738945 742225 747418 755159 764856 774604 783363 792050 801525 810890 819023 826272 833114 838495 841184
59442H41184N11o36k416n500p957q112o934o204n955n167l695k209r80K87J797
$$ 841184 841695 841059 838643 833143 825186 817074 810140 803936 797981 792814 789119 786910 785930 786217 788014
59427G88014L240L873L310K640L933P749J2131J5157J7264J9676K2095K3862K5800
$$ 788014 791254 795127 798437 801077 805010 812759 824890 840047 857311 876987 899082 922944 948744
59414I48744K8424L0102K9956L0875L5630M0831L9363K8990J4532J224r652j7714
$$ 948744 977168 1007270 1037226 1068101 1103731 1144562 1183925 1212915 1227447 1228671 1219019 1201305
59402A201305k0977j8797j3748p935m61Q915J6211J6427Q897k684j4251k3618
$$ 1201305 1180328 1161531 1147783 1139848 1139387 1148302 1164513 1180940 1189837 1187153 1172902 1149284
59390A149284l0095l3878l5306l3865k9041k2478j7412j5077j3611j1398r346
$$ 1149284 1119189 1085311 1050005 1016140 987099 964621 947209 932132 918521 907123 897777
59379H97777q586q143o679m772l678l221k427j148K58J662K596K343J521K017
$$ 897777 889191 881048 874369 869597 865919 862698 860271 859123 859381 861043 863639 865982 867503 869520
59365H69520M190N944N732M794N026O327P624Q893J0468J1723J2176J2743J4282
$$ 869520 873710 879654 885386 890180 895206 901533 909157 918050 928518 940241 952417 965160 979442
59352I79442J6004J6853J7335J8349J9213J8636J6864J5339J4709J4565J4598
$$ 979442 995446 1012299 1029634 1047983 1067196 1085832 1102696 1118035 1132744 1147309 1161907
59341A161907J4637J3948J1725Q070L728p31m875q128j0376j2354j4807j7669
$$ 1161907 1176544 1190492 1202217 1210287 1214015 1213284 1208409 1200281 1189905 1177551 1162744 1145075
59329A145075k0377k2414k3305k2847k1581k0340j9243j7933j6642j5859j5117
$$ 1145075 1124698 1102284 1078979 1056132 1034551 1014211 994968 977035 960393 944534 929417
59318I29417j3564j1637j0663j0699j0541r839r363r037p797n740m306l823l056
$$ 929417 915853 904216 893553 882854 872313 862474 853111 844074 836277 830537 826231 822408 819352
59305H19352j774j459k558l288k286l39J520L497N439N992M902M309O162R952
$$ 819352 817578 816119 813561 810273 807987 807648 809168 812665 818104 824096 828998 833307 839469 849421
59291H49421J4165J8038K0536J9532J4060O039j703p855j1963j3222j1652r029
$$ 849421 863586 881624 902160 921692 935752 941791 940088 932233 920270 907048 895396 886367
59279H86367o862m582j098L057O593R320J1751J3881J5632J7498J9656K1390K2135
$$ 886367 879505 874923 873825 876882 883475 892795 904546 918427 934059 951557 971213 992603 1014738
59266A014738K2071K1041J8497J5156J2919J2198J1013P714K998j587n259p398
$$ 1014738 1036809 1057850 1076347 1091503 1104422 1116620 1127633 1135347 1138345 1136758 1131499 1124101
59254A124101p512o815p625j0007j1308j0172q515q078p742o066l995k942k473
$$ 1124101 1116589 1109774 1102149 1092142 1080834 1070662 1062147 1054069 1046327 1040261 1036266 1033324 1030851
59241A030851j971k284l649m256l267k858m762o997o901n332m851n554n859n946
$$ 1030851 1028880 1026596 1022947 1018691 1015424 1012566 1007804 1000807 993906 988574 983723 978169 972310 966364
59227I66364p158r118j0395j1072j1945j2246j0954r308r175r788r089p431o946
$$ 966364 959206 950088 939693 928621 916676 904430 893476 884168 874993 865205 856116 848685 841739
59214H41739p780p959o723n213l928k070M90K729M059M634M354L260K345K323
$$ 841739 833959 826000 819277 814064 810136 808066 808556 811285 815344 819978 824332 827592 829937 832260
59200H32260K264J195N5K52J328K020K411K880K302j13k459k428r95p98j788j662
$$ 832260 834524 835719 835774 836026 837354 839374 841785 844665 846967 846854 844395 841967 840972 840174 838386 836724
59184H36724k0J204J280J393J689P94j235k321j473j11L77J78k94j146j814j120
$$ 836724 836704 837908 839188 840581 842270 843064 841829 839508 838035 837924 838301 838479 838185 837039 835225 834105
59168H34105Q16K386K690K539K872L610M151L848K143n40k520k872l051m841p447
$$ 834105 834921 837307 839997 842536 845408 849018 853169 857017 859160 858620 856100 853228 850177 845336 837889
59153H37889q668q286q036q502q483p390o160n630n741o365p325p816p450p418
$$ 837889 829221 820935 812899 804397 795914 788524 782364 776734 770993 764628 757303 749487 742037 734619
59139G34619q781j0230r568o966m599l448k650j652p67K13J785L322L944M394
$$ 734619 725838 715608 706040 699074 694475 691027 688377 686725 685958 686171 687956 691278 695222 699616
59125F99616N874P528P615O760P284R408J0937J0940J1006J2320J4066J5347J6364
$$ 699616 705490 713018 720633 727393 734677 744085 755022 765962 776968 789288 803354 818701 835065
59112H35065J7011J6518J5095J4014J3454J2205R891P597N906M229K367Q48n64
$$ 835065 852076 868594 883689 897703 911157 923362 933253 940850 946756 950985 953352 954200 953636
59099I53636k682m979n915n560n766p251q567q512p556o278m398k198j020j433
$$ 953636 950954 945975 940060 934500 928734 921483 912916 904404 896848 890570 886172 883974 882954 881521
59085H81521k325k615k633l268m847p207r766j1447j1587j0772r712p981n396
$$ 881521 879196 876581 873948 870680 865833 858626 848860 837413 825826 815054 805342 797361 791965
59072G91965l689m645p038p825o184m066k887k231j879k498l773m135l107j922
$$ 791965 788276 783631 776593 768768 762584 758518 755631 753400 751521 749023 745250 741115 738008 736086
59058G36086j460j399j624k460l314l070k167k132k941k912j469J91J301K157
$$ 736086 734626 733227 731603 729143 725829 722759 720592 718460 715519 712607 711138 711329 712630 714787
59044G14787K416J215o58j194k42K93l18p20k93j02k44R59L940O579P307P367
$$ 714787 717203 718418 717760 716566 716324 716617 716299 715579 715286 715184 714940 715899 719839 726418 733725 741092
59028G41092Q537J0640J2661J4659J7182K0191K3431K6486K7933K6127K1531J6461
$$ 741092 749629 760269 772930 787589 804771 824962 848393 874879 902812 928939 950470 966931
59016I66931J1969O951J006m121p009q496r976j1556j2977j4566j5980j5559j2293
$$ 966931 978900 985851 986857 982736 975727 967231 957255 945699 932722 918156 902176 886617 874324
59003H74324p462l310j021l75k13J013L788O420O833N450M482M550M246L154K567
$$ 874324 866862 863552 862531 862156 861943 862956 866744 873164 879997 885447 889929 894479 898725 901879 904446
58988I04446K738K048j04k054k698l140m235m638k859M13L492N726P298Q356R301
$$ 904446 907184 909232 909128 907074 904376 901236 897001 892363 889504 889917 893409 899135 906433 914789 924090
58973I24090J0588J1676J1618J1088J1904J4107J5671J5655J5368J5516J4789
$$ 924090 934678 946354 957972 969060 980964 995071 1010742 1026397 1041765 1057281 1072070
58962A072070J2553J0590J0390J0650R250O250L237Q22j806n626j0991j7084k1695
$$ 1072070 1084623 1095213 1105603 1116253 1125503 1131753 1134990 1135812 1134006 1128380 1117389 1100305 1078610
58949A078610k2744k0697j8164j6874j6499j6536j7219j8011j7341j4727j1460
$$ 1078610 1055866 1035169 1017005 1000131 983632 967096 949877 931866 914525 899798 888338
58938H88338q495n506k591q16k58N18K094L331L626M074N337O284N783M099J748
$$ 888338 879843 874337 871746 870930 870672 871190 873284 876615 880241 884315 889652 895936 901719 905818 907566
58923I07566j309m482o382o614o186n657m776m110m750n930n393k877p66m73o01
$$ 907566 906257 901775 895393 888779 882593 876936 872160 868050 863300 857370 851977 849100 848334 847861 847260
58908H47260M56K511N046Q178J1189J2614J2765J3730J5923J7407J7440J7733
$$ 847260 847716 850227 855273 863451 874640 887254 900019 913749 929672 947079 964519 982252
58896I82252J8853J8673J6163J3826J4216J6464J8341J9505K0774K2212K3779
$$ 982252 1001105 1019778 1035941 1049767 1063983 1080447 1098788 1118293 1139067 1161279 1185058
58885A185058K5869K7738K7371K4384K0795J7607J3257O962Q14l441p047j1501
$$ 1185058 1210927 1238665 1266036 1290420 1311215 1328822 1342079 1349041 1349855 1346414 1339367 1327866
58873A327866j5588j7485j7665j7460j6814j5543j4752j4812j3997j1319q824
$$ 1327866 1312278 1294793 1277128 1259668 1242854 1227311 1212559 1197747 1183750 1172431 1163607
58862A163607q737j0167j0869j0586j0404j0372r936r379r005q303p410p559q549
$$ 1163607 1154870 1144703 1133834 1123248 1112844 1102472 1092536 1083157 1074152 1065849 1058439 1050880 1042331
58849A042331p924m622j405j512m628q201j0966j3094j4440j4811j4883j5220
$$ 1042331 1034407 1029785 1028380 1026868 1022240 1014039 1003073 989979 975539 960728 945845 930625
58837I30625j5610j6292j7979j9718j9049j5603j2018r894p567l670n1J131P30
$$ 930625 915015 898723 880744 861026 841977 826374 814356 804462 796895 793225 793174 794305 795035
58824G95035P32J327K043L482N640O678N586M031L688L919L878M303N229M657
$$ 795035 795767 797094 799137 802619 808259 814937 820523 824554 828242 832161 836039 840342 845571 850228
58810H50228J694j463k805l031k980j743L93O16k098m660m703m248n425o251m500
$$ 850228 851922 850459 847654 844623 841643 839900 840293 840909 838811 834151 829448 825200 819775 813524 809024
58795H09024k333k792m594m756l807l941m466l530k227k447k676l58L292N351
$$ 809024 806691 803899 799305 794549 790742 786801 782335 778805 776578 774131 771455 771097 774389 779740
58781G79740O250Q340J1035J2062J2012J2940J3720J1630P577M961L990J840j934
$$ 779740 785990 794330 805365 817427 829439 842379 856099 867729 875306 880267 884257 886097 884163
58768H84163m813n920o836p881p670o517o449p684q560q774r226r146o869l237
$$ 884163 879350 873430 866594 858713 851043 844526 838077 830393 821833 813059 803833 794687 787818 784581
58754G84581p02M48J577K210R07j113j312m36j409l840m008p20L063N071O309
$$ 784581 783879 784327 785904 788114 789021 787908 786596 786160 784751 780911 776903 776183 779246 784317 790626
58739G90626P980R380R959J0286J0240Q976P247O998Q212Q841Q141P297O734N588
$$ 790626 798606 807986 817945 828231 838471 847447 854694 861692 869904 878745 886886 894183 900917 906505
58725I06505M104L590L721K589j20k449k914j702O31L435N218N123M687N726P159
$$ 906505 910609 914199 917920 920509 920389 917940 915026 913324 913955 917390 922608 927731 932418 938144 945303
58710I45303O574M196K275J239m30k944n094p009r900j3253j5386j6612j8766
$$ 945303 951877 956073 958348 959587 959157 956213 951119 944110 934210 920957 905571 888959 870193
58697H70193k1694k3222k2566k1009j9255j6842j4014j1530r006n935l723l913
$$ 870193 848499 825277 802711 781702 762447 745605 731591 720061 711055 705120 701397 697484
58685F97484n158m984l834m293o664q476q031n790k742QQ11o65k114j501J17J283
$$ 697484 692326 687342 683508 679215 672551 664075 656044 650254 647512 647520 648331 647666 645552 644051 644168 645451
58669F45451L412P879J2096J2862J1898J3404J7332J9804J9248J7264J4176Q691
$$ 645451 648863 656742 668838 681700 693598 707002 724334 744138 763386 780650 794826 803517
58657H03517J799l669p313j0686j3058j2351r993r877j2322j3760j2777j1810
$$ 803517 805316 801647 794334 783648 770590 758239 748246 738369 726047 712287 699510 687700
58645F87700j2373j2980j2448j1328r639o945m582l930k995J026O358Q569P489
$$ 687700 675327 662347 649899 638571 628932 621987 617405 613475 610480 611506 617864 626433 633922
58632F33922P051Q409Q558O114L176P71k418o045p664p110o563n806k445K721
$$ 633922 640973 649382 657940 664054 667230 668001 665583 659538 651874 644764 638201 632395 629950 632671
58618F32671N826O118O662Q085P340L981J886K856L905K924J935K527K925J920
$$ 632671 638497 644615 651277 659362 666702 670683 672569 675425 679330 682254 684189 686716 689641 691561
58604F91561J275K039K613K369K926M182L531Q38k35K082M821N053L551K102J143
$$ 691561 692836 694875 697488 699857 702783 706965 710496 711334 711099 713181 718002 723055 726606 728708 729851
58589G29851J526M426Q158R377Q576R856J4065J7232J7244J6657J7042J6035J2471
$$ 729851 731377 735803 743961 753338 761914 771770 785835 803067 820311 836968 854010 870045 882516
58576H82516R263Q374P741N972N459P916J1256J3725J6864K1513K5110K5926K6201
$$ 882516 891779 900153 907894 913866 919325 927241 938497 952222 969086 990599 1015709 1041635 1067836
58563A067836K8209L0850L2648L4383L6330L6437L3643K9495K4664J7630Q589
$$ 1067836 1096045 1126895 1159543 1193926 1230256 1266693 1300336 1329831 1354495 1372125 1380714
58552A380714O62m577q709j2116j2645j0306q382p984o507l581l069o662j0936
$$ 1380714 1381376 1376799 1368090 1355974 1343329 1333023 1324641 1316657 1310150 1306569 1303500 1296838 1285902
58539A285902j3628j7392k3979l0021l2422l3021l4002l3400k9276k4140k1027
$$ 1285902 1272274 1254882 1230903 1200882 1168460 1135439 1101437 1068037 1038761 1014621 993594
58528I93594j8928j5917j3224j2422j2001j0203q047o554m407j222M50p16k293
$$ 993594 974666 958749 945525 933103 921102 910899 902852 896298 891891 890669 891119 890403 888110
58515H88110k250j872k163j653j88l79k564l128o94R62n74k046l57K217K598K075
$$ 888110 885860 883988 881825 880172 879984 879605 877041 873913 873219 874181 873607 871561 871204 873421 876019 878094
58499H78094K793L406K407J626K461K635N92r73J87J742J221M65J832L945N206
$$ 878094 880887 884293 886700 888326 890787 893422 894014 893041 893228 894970 896191 896656 898488 902433 907639
58484I07639P363J1620J5246J6136J6858K0162K4195K6117K6599K6963K5667K1431
$$ 907639 915002 926622 941868 958004 974862 995024 1019219 1045336 1071935 1098898 1124565 1145996
58472A145996J6121J1061M548l622r694j1585j2422j4801j6271j4436j1697j0538
$$ 1145996 1162117 1173178 1177726 1174104 1164410 1152825 1140403 1125602 1109331 1094895 1083198 1072660
58460A072660q831m271R76M339P297J1530J5145J6772J8758K2106K3087J9154
$$ 1072660 1063829 1059558 1060534 1064873 1072170 1083700 1098845 1115617 1134375 1156481 1179568 1198722
58448A198722J3405Q918L744m015j1351j5299j7665k0200k0438j7060j3849j3278
$$ 1198722 1212127 1221045 1224789 1220774 1209423 1194124 1176459 1156259 1135821 1118761 1104912 1091634
58436A091634j1784o721k171k131l566k186L32R89J817N271Q557Q912R352J2744
$$ 1091634 1079850 1073129 1070958 1068827 1065261 1063075 1063407 1064396 1066213 1071484 1080041 1088953 1098305 1111049
58422A111049J5520J3837J0696J0070R257M264k222n566p096j0036j2325j0933
$$ 1111049 1126569 1140406 1151102 1161172 1170429 1174693 1172471 1166905 1159809 1149773 1137448 1126515
58410A126515q847j0205j2668j1923r464q757q112m725j416j828l225j398J738
$$ 1126515 1117668 1107463 1094795 1082872 1073408 1064651 1056539 1051814 1050398 1048570 1045345 1043947 1045685
58397A045685K671L638P752J1560J0543P572P753R425Q312O194P026Q778P597
$$ 1045685 1048356 1051994 1059746 1071306 1081849 1089421 1097174 1106599 1114911 1121105 1128131 1136909 1144506
58384A144506N884P732J0555R647O754N605L550l259j0791j2569j0196r116q025
$$ 1144506 1150390 1158122 1168677 1178324 1185078 1190683 1194233 1190974 1180183 1167614 1157418 1148302 1140277
58371A140277k109O636J2059J3785J5628J7351J6651J5869J8095K0381J9144J7882
$$ 1140277 1138168 1144804 1156863 1170648 1186276 1203627 1220278 1236147 1254242 1274623 1293767 1311649
58359A311649K0902K4387K2848J9146J8419J7583J1457L944K069L747K731P67
$$ 1311649 1332551 1356938 1379786 1398932 1417351 1434934 1446391 1450335 1452404 1456151 1458882 1459649
58347A459649L166P067O260L329M755Q222P284M480O830J2097J2765J0303J2116
$$ 1459649 1462815 1469882 1476142 1479471 1484226 1492448 1499732 1504212 1511042 1523139 1535904 1546207 1558323
58334A558323J7407J9405J8848K1799K6686K6856K3596K3339K4507K0589J3682
$$ 1558323 1575730 1595135 1613983 1635782 1662468 1689324 1712920 1736259 1760766 1781355 1795037
58323A795037J1251J1893Q295J916O32L891M540L228O565J2882J4449J2193J3764
$$ 1795037 1806288 1818181 1826476 1828392 1829024 1832915 1837455 1840683 1847248 1860130 1874579 1886772 1900536
58310A900536J8711K0115J8882K1512K5767K3993J8804J9719K5823K7617K4534
$$ 1900536 1919247 1939362 1958244 1979756 2005523 2029516 2048320 2068039 2093862 2121479 2146013
58299B146013K4441K7275K5713K0991K1415K6064K6345K2735K3361K7466K7213
$$ 2146013 2170454 2197729 2223442 2244433 2265848 2291912 2318257 2340992 2364353 2391819 2419032
58288B419032K4292K7081L3022L2027K5914K5771L1344L2341K8913L0928L7771
$$ 2419032 2443324 2470405 2503427 2535454 2561368 2587139 2618483 2650824 2679737 2710665 2748436
58277B748436L9216L5745L7487M3642M4152M1044M6019N6993O0062N5061N5870
$$ 2748436 2787652 2823397 2860884 2904526 2948678 2989722 3035741 3092734 3152796 3207857 3263727
58266C263727O4501O8767O6965P0517Q0091Q3752Q1133Q4639R4061R5306Q7266
$$ 3263727 3328228 3396995 3463960 3534477 3614568 3698320 3779453 3864092 3958153 4053459 4140725
58255D140725Q4398Q9590R0398Q5217Q6591R5214R7807R4126R8428J10950J16680
$$ 4140725 4225123 4314713 4405111 4490328 4576919 4672133 4769940 4864066 4962494 5073444 5190124
58244E190124J15421J23118J40071J49187J49375J57967J75936J84903J83494
$$ 5190124 5305545 5428663 5568734 5717921 5867296 6025263 6201199 6386102 6569596
58235F569596J91057K09837K20590K21918K35306K63497K83863K91484L07746
$$ 6569596 6760653 6970490 7191080 7412998 7648304 7911801 8195664 8487148 8794894
58226H794894L37084L58216L68547L92634M35031M70627M93913N29986N84034
$$ 8794894 9131978 9490194 9858741 10251375 10686406 11157033 11650946 12180932 12764966
58217A2764966O30342O65482P19287P97989Q72132R36845J024838J142509J256956
$$ 12764966 13395308 14060790 14780077 15578066 16450198 17387043 18411881 19554390 20811346
58208B0811346J365555J510364J702803J907909K126283K411450K780673L197798
$$ 20811346 22176901 23687265 25390068 27297977 29424260 31835710 34616383 37814181
58200C7814181L674791M293376N093326O048705P191442Q631774J0414570J2511020
$$ 37814181 41488972 45782348 50875674 56924379 64115821 72747595 83162165 95673185
58192I5673185J5016408J8186666K2223166K7247597L3489277M0893430M7962236
$$ 95673185 110689593 128876259 151099425 178347022 211836299 252729729 300691965
58185C00691965N1293210M7241066L4679461J6142884l756276k0886938l2951551
$$ 300691965 351985175 399226241 433905702 450048586 446292310 425405372 392453821
58178C92453821l9384236m0816906l8598994l4239457k8956110k3676199j9226481
$$ 392453821 353069585 312252679 273653685 239414228 210458118 186781919 167555438
58171A67555438j6187683j4553189j3781376j3270157j2684354j1891164j0837537
$$ 167555438 151367755 136814566 123033190 109763033 97078679 85187515 74349978
58164G4349978r586542q314168p156802o125971n202923m415377l775252l233613
$$ 74349978 64763436 56449268 49292466 43166495 37963572 33548195 29772943 26539330
58156B6539330k752266k350311k038619j776010j530382j321742j167100j039003
$$ 26539330 23787064 21436753 19398134 17622124 16091742 14770000 13602900 12563897
58148A2563897r14133q10658p43304o88765o27213n73956n40609n06686m57628
$$ 12563897 11649764 10839106 10095802 9407037 8779824 8205868 7665259 7158573 6700945
58139F700945m11628l82484l53267l11709k75319k56895k39746k11067j86975
$$ 6700945 6289317 5906833 5553566 5241857 4966538 4709643 4469897 4258830 4071855
58130D071855j80940j78581j66519j56442j58307j58289j45356j32844j32341
$$ 4071855 3890915 3712334 3545815 3389373 3231066 3072777 2927421 2794577 2662236
58121B662236j31709j19587j07143j05259j03471r1287p8350p4530p1063n9647
$$ 2662236 2530527 2410940 2303797 2198538 2095067 2003780 1925430 1850900 1779837 1720190
58111A720190m9902n0393n1862m5966m1357m5033m6938l9163l1898l4415l8287
$$ 1720190 1670288 1619895 1568033 1522067 1480710 1435677 1388739 1349576 1317678 1283263 1244976
58100A244976l4832l1421l5003l7120l0795k5460k9589l4605l1302k6505k8423
$$ 1244976 1210144 1178723 1143720 1106600 1075805 1050345 1020756 986151 954849 928344 899921
58089H99921l0699k6050k1096k2922k4905k0282j6031j9130k2443j8333j3264
$$ 899921 869222 843172 822076 799154 774249 753967 737936 718806 696363 678030 664766
58078F64766j5042j8252j6014j3785j7805k1847j9026j5243j7591k0584j6995
$$ 664766 649724 631472 615458 601673 583868 562021 542995 527752 510161 489577 472582
58067D72582j1502j0785j0733n944j560l247n665k798N22j060k345J392L327k610
$$ 472582 461080 450295 439562 433618 432058 428811 423146 420348 420870 419810 417465 418857 422184 419574
58053D19574r025p415k871l592n862k893J032r60m395j892K470Q75l503k912N23
$$ 419574 410549 403134 400263 396671 390809 387916 388948 387988 383593 381701 384171 385046 381543 378631 379154
58038C79154q6l081k731j224l809p439o239l034l945o680n451k485l509o629o520
$$ 379154 379068 375987 373256 372032 368223 360784 354545 351511 347566 340886 335435 332950 329441 322812 316292
58023C16292m811n888p225m373o17j386l870k535O8j467m320k323K462L719K243
$$ 316292 311481 305593 298368 293995 293378 291992 288122 285587 285655 284188 279868 277545 280007 283726 285969
58008B85969K975M581K642m51P75M413M613K423L315O718P736O688P348Q113M201
$$ 285969 288944 293525 296167 295716 296491 300904 305517 307940 311255 317973 325709 332397 339745 347858 352059
57993C52059l401r911j5148k1330k5284k2036j4161q767o944m441q01M99n70j073
$$ 352059 348658 338747 323599 302269 276985 254949 240788 232021 225077 220636 219835 220334 219764 218691
57979B18691j408l702n787m088n43L86n97J40J825J436N23K508N514N330L138
$$ 218691 217283 213581 207794 203706 203163 203549 202952 203092 204917 206353 206876 209384 214898 220228 223366
57964B23366L033M223L122Q56J272L478L562J769J008M96k218n222n125l573m096
$$ 223366 226399 230622 233744 234600 235872 239350 242912 244681 245689 246185 243967 238745 233620 230047 225951
57949B25951n182l603j470k487m096j423L560N050L312L265N268N849N902R463
$$ 225951 220769 217166 215696 213209 209113 207690 211250 216300 219612 222877 228145 233994 239896 249359
57935B49359J5220J7591J5720J3770J3072J1609J0204J1254J2038P372j281p123
$$ 249359 264579 282170 297890 311660 324732 336341 346545 357799 369837 377209 375928 368805
57923C68805q241r000j1389j2683j2041j2015j2765j1664r146q476r386q346n323
$$ 368805 360564 351564 340175 327492 315451 303436 290671 279007 269861 261385 251999 243653 238330
57910B38330l815m105k982l15P22J66J408M291M644J480j492k356l151m649m667
$$ 238330 234515 230410 227428 227113 227835 228001 229409 233700 238344 239824 238332 235976 232825 228176 223509
57895B23509k427M05L479P552J0750J0284P764P387R210R644Q113P293P203N341
$$ 223509 221082 221487 224966 232518 243268 253552 261316 268703 277913 287557 295670 302963 310166 315507
57881C15507K551K414M625N115L068J672J644L28k300l068j762j619k877k055
$$ 315507 318058 320472 325097 330212 333280 334952 336596 336924 334624 331556 329794 328175 325298 323243
57867C23243J236L013J786P54J608J790k40k244k473j996j447J92K498L744M628
$$ 323243 324479 327492 329278 330032 331640 333430 333190 330946 328473 326477 325030 325222 327720 331464 336092
57852C36092P207R973R199N464L294L771L240K39k045j676p91r73r12j59l71j503
$$ 336092 343299 353272 362471 367935 371229 375000 378240 378479 376434 374758 373967 372994 372082 371923 371552 370049
57836C70049j373j4K29m53N60K915L329J650J212K484K445J137K320O085P392
$$ 370049 368676 368662 368891 368438 368998 371913 375242 376892 378104 380588 383033 384170 386490 392575 399967
57821C99967M239Q86M15K11k132m379m584n050p598r656q769o685n618m582k750
$$ 399967 404206 405092 405507 405718 403586 399207 394623 389573 381975 372319 363550 356865 351247 346665 343915
57806C43915k355m829p600q025p179o896o428m861l500l038j616J578L999L682
$$ 343915 341560 336731 329131 321106 313927 307031 300603 295742 292242 289204 287588 289166 293165 296847
57792B96847K456K683L705M017M028M392M425M211N434Q113R549Q505P299P816
$$ 296847 299303 301986 305691 309708 313736 318128 322553 326764 332198 340311 349860 358365 365664 373480
57778C73480Q615Q087P257P368P680P638Q157Q919P736M569K660L534M277K151
$$ 373480 382095 390182 397439 404807 412487 420125 428282 437201 444937 449506 452166 455700 459977 462128
57764D62128j459m100n965p932r042q719q650r828j0342q616o137m572k896O6
$$ 462128 460669 456569 450604 442672 433630 424911 416261 406433 396091 387475 381338 376766 373870 373936
57750C73936K940M253M984N996N546K227j791l499l184l113l541k704K13M231
$$ 373936 376876 381129 386113 392109 397655 399882 398091 394592 391408 388295 384754 382050 382263 386494
57736C86494P839R730R272P293N253L165R3l165m427l662l305m303m711l270j396
$$ 386494 394333 404063 413335 420628 425881 429046 429139 425974 421547 417885 414580 410277 405566 402296 400900
57721D00900m36J53P33M97l20k41M86j06j770j635J050L392L440K569J914M36
$$ 400900 400464 400617 401350 401847 401527 401286 401772 401666 399896 398261 399311 402703 406143 408712 410626 411062
57705D11062j566j304J802M243L831L055M278N512M293K172J712K052J100l77
$$ 411062 409496 408192 409994 414237 418068 421123 425401 430913 435206 437378 439090 441142 442242 441865
57691D41865m79J25m36k027l377m321m749l464n29J530J318J053L011O004P973
$$ 441865 441386 441511 441075 439048 435671 431350 426601 423137 422608 424138 425456 426509 429520 435524 443497
57676D43497R604J2534J6289J9783K3818K9445L6026M3521N4452P0715Q9986J07196
$$ 443497 453101 465635 481924 501707 525525 554970 590996 634517 688969 759684 849670 956866
57664I56866J17226J14555R4102N6419J0249l3069o6378q6987r4340r0939q2525
$$ 956866 1074092 1188647 1282749 1339168 1349417 1316348 1249970 1162983 1068643 977704 895179
57653H95179p3277o2689m9904l8010l0270k5028j8839j2437r002q128o431l227
$$ 895179 821902 759213 709309 671299 641029 616001 597162 584725 575723 567595 561164 557937
57641E57937j191j593k800l376l303k390m12J298J146j45o55k59j69l85r3L02
$$ 557937 556746 555153 552353 548977 545674 543284 542872 544170 545316 545171 544516 544257 544088 543703 543610 543912
57625E43912m6n42m00o22k268l884l219n84J961L612M693M747L345J621N76r46
$$ 543912 543866 543324 542924 542302 540034 536150 532931 532347 534308 537920 542613 547360 550705 552326 552902 551956
57609E51956m107p362q494p998p622o955m510j145P58Q66Q04J214J517J855K727
$$ 551956 547849 540487 531993 523995 516373 509418 504908 503763 504521 505387 506191 507405 508922 510777 513504
57594E13504L398K992K292K259J970M02j154j023l7J18m3P00J304K22j285j072
$$ 513504 516902 519894 522186 524445 526415 526817 525663 524640 524603 524721 524678 525378 526682 526904 525619 524547
57578E24547j08q00k395j965M91J857Q33n50o87l15k02K58J393K582L562M510
$$ 524547 524439 523639 521244 519279 519770 521627 522460 521910 521223 520908 520706 520964 522357 524939 528501 533011
57562E33011M906M299L750M393N187M364K493J659K261L161M276O353Q605R428
$$ 533011 537917 542216 545966 550359 555546 559910 562403 564062 566323 569484 573760 580113 588718 598146
57548E98146R152R502J0682J1316J0911R914Q000M883K195J822K884K975J797
$$ 598146 607298 616800 627482 638798 649709 659623 667623 672506 674701 676523 679407 682382 684179
57535F84179R20P27M35M05J410K262J382m9J03P04j188m941o461m183j029K92
$$ 684179 685099 685826 686261 686666 688076 690338 691720 691671 691774 692478 691290 686349 679888 675705 674676 674968
57519F74968M56R15J539K209L919O831R488J1026J2249J3753J4939J5501J5984
$$ 674968 675424 676339 677878 680087 684006 690837 700325 711351 723600 737353 752292 767793 783777
57506G83777J6393J6141J5433J4907J3965J1656Q943P763P950P645O543O072O475
$$ 783777 800170 816311 831744 846651 860616 872272 881215 888978 896928 904573 911116 917188 923663
57493I23663O542O220O553O890N425K805J931L456M673L930L062M138O434Q146
$$ 923663 930205 936425 942978 949868 955293 958098 960029 963485 968158 972088 975150 979288 985722 993868
57479I93868Q806Q636P487N710M411L937L548L054K977K838J448o84j459j58J797
$$ 993868 1002674 1011310 1018797 1024507 1028918 1032855 1036403 1039457 1042434 1045272 1046720 1046036 1044577 1044419 1046216
57464A046216L438N307P433Q656Q757R071J0216J1249J1695J2268J2952J2557
$$ 1046216 1049654 1054961 1062394 1071050 1079807 1088878 1099094 1110343 1122038 1134306 1147258 1159815
57452A159815J0909R572R625J0553J1685J2778J2973J1339Q904P931Q864J0175
$$ 1159815 1170724 1180296 1189921 1200474 1212159 1224937 1237910 1249249 1258153 1266084 1274948 1285123
57440A285123J1268J2969J4812J4875J3062J1819J2495J3484J3013J1489J0064
$$ 1285123 1296391 1309360 1324172 1339047 1352109 1363928 1376423 1389907 1402920 1414409 1424473
57429A424473R066Q777R634J0854J1016J0520J1213J3078J3971J3225J2706J3371
$$ 1424473 1433539 1442316 1451950 1462804 1473820 1484340 1495553 1508631 1522602 1535827 1548533 1561904
57417A561904J3805J3205J2906J3467J3198J1443J0606J2741J6251J8051J7444
$$ 1561904 1575709 1588914 1601820 1615287 1628485 1639928 1650534 1663275 1679526 1697577 1715021
57406A715021J6025J5244J5522J6492J6979J5983J4262J3365J2934J1330R223
$$ 1715021 1731046 1746290 1761812 1778304 1795283 1811266 1825528 1838893 1851827 1863157 1872380
57395A872380R498J2685J5523J5704J5023J5985J8029J9270J9608J9830J9618
$$ 1872380 1881878 1894563 1910086 1925790 1940813 1956798 1974827 1994097 2013705 2033535 2053153
57384B053153J8810J8821K0628K2783K3402K2775K2260K2020K1534K1006K0746
$$ 2053153 2071963 2090784 2111412 2134195 2157597 2180372 2202632 2224652 2246186 2267192 2287938
57373B287938K0377J9811J9630J9579J8483J6597J5892J6879J7591J6984J6815
$$ 2287938 2308315 2328126 2347756 2367335 2385818 2402415 2418307 2435186 2452777 2469761 2486576
57362B486576J8300J9620J8950J7692J8129J9877K1152K1855K2858K3711K3509
$$ 2486576 2504876 2524496 2543446 2561138 2579267 2599144 2620296 2642151 2665009 2688720 2712229
57351B712229K2850K2773K3010K3254K4610K7604L0288L0618K9449K8857K8786
$$ 2712229 2735079 2757852 2780862 2804116 2828726 2856330 2886618 2917236 2946685 2975542 3004328
57340C004328K7766K5883K4633K4650K5677K7846L0844L2750L1985K9743K8483
$$ 3004328 3032094 3057977 3082610 3107260 3132937 3160783 3191627 3224377 3256362 3286105 3314588
57329C314588K8683K8948K8610K8204K8009K7859K8009K8658K9262K9492L0003
$$ 3314588 3343271 3372219 3400829 3429033 3457042 3484901 3512910 3541568 3570830 3600322 3630325
57318C630325L0987L1382L0774L0583L1684L2505L1500K9920K9856L0957L1426
$$ 3630325 3661312 3692694 3723468 3754051 3785735 3818240 3849740 3879660 3909516 3940473 3971899
57307C971899L1153L1360L2018L2107L1707L1625L1591L0965L0470L1215L2644
$$ 3971899 4003052 4034412 4066430 4098537 4130244 4161869 4193460 4224425 4254895 4286110 4318754
57296D318754L3482L3883L4674L5417L5328L5132L5805L6451L5813L4860L5392
$$ 4318754 4352236 4386119 4420793 4456210 4491538 4526670 4562475 4598926 4634739 4669599 4704991
57285D704991L6977L7901L8307L9595M1339M1884M1615M2504M4346M4530M1982
$$ 4704991 4741968 4779869 4818176 4857771 4899110 4940994 4982609 5025113 5069459 5113989 5155971
57274E155971L8704L6733L5863L4987L3686L1927K9971K8764K8828K8812K7046
$$ 5155971 5194675 5231408 5267271 5302258 5335944 5367871 5397842 5426606 5455434 5484246 5511292
57263E511292K4259K2799K3335K4555K5804K7490K8962K8813K7655K7888L0086
$$ 5511292 5535551 5558350 5581685 5606240 5632044 5659534 5688496 5717309 5744964 5772852 5802938
57252E802938L2206L3100L4122L6126L7561L7145L6296L7007L8910M0085L9722
$$ 5802938 5835144 5868244 5902366 5938492 5976053 6013198 6049494 6086501 6125411 6165496 6205218
57241F205218L8487L7201L6336L6045L5735L4346L1786K9314K7928K7185K6151
$$ 6205218 6243705 6280906 6317242 6353287 6389022 6423368 6455154 6484468 6512396 6539581 6565732
57230F565732K4598K2786K0972J9629J9181J9143J8401J6848J5736J6038J7338
$$ 6565732 6590330 6613116 6634088 6653717 6672898 6692041 6710442 6727290 6743026 6759064 6776402
57219F776402J8756J9963K1007K2072K3736K6474K9556L1469L1823L1803L2354
$$ 6776402 6795158 6815121 6836128 6858200 6881936 6908410 6937966 6969435 7001258 7033061 7065415
57208G065415L3042L3212L3074L3019L2778L2017L1084L0463K9946K8933K7191
$$ 7065415 7098457 7131669 7164743 7197762 7230540 7262557 7293641 7324104 7354050 7382983 7410174
57197G410174K5020K3077K2104K2237K2514K1581J9104J6048J3692J2674J2738
$$ 7410174 7435194 7458271 7480375 7502612 7525126 7546707 7565811 7581859 7595551 7608225 7620963
57186G620963J2766J1469Q728N830L742J809q97l679n162n479n984p070p911q210
$$ 7620963 7633729 7645198 7653926 7659756 7663498 7665307 7664410 7660731 7655569 7650090 7644106 7637036 7629125 7620915
57172G620915q438q528p958p223p474q780j0482j3236j8374k4889k9514l0756
$$ 7620915 7612477 7603949 7595991 7588768 7581294 7572514 7562032 7548796 7530422 7505533 7476019 7445263
57160G445263l0722l1802l3614l4726l5568l7692m1183m4561m6568m6816m5228
$$ 7445263 7414541 7382739 7349125 7314399 7278831 7241139 7199956 7155395 7108827 7062011 7016783
57149G016783m2034l7851l3010k7355k1232j5653j1047o968l558j684q93Q72M070
$$ 7016783 6974749 6936898 6903888 6876533 6855301 6839648 6828601 6821633 6818075 6816391 6815498 6816370 6820440
57136F820440N939L740j852q381j4976k1825k7851l1746l4495l7981m1610m3159
$$ 6820440 6826379 6830119 6828267 6819886 6804910 6783085 6755234 6723488 6688993 6651012 6609402 6566243
57124F566243m2637m2270m2560m1518l8203l3867k8828k1464j1586j702O734J5578
$$ 6566243 6523606 6481336 6438776 6397258 6359055 6325188 6296360 6274896 6263310 6261608 6268342 6283920
57112F283920K6715L9268N2074O6302Q3195J01791J21455J44320J72488K05258
$$ 6283920 6310635 6349903 6401977 6468279 6551474 6653265 6774720 6919040 7091528 7296786
57102G296786K42195K86687L43111M12771M95896N95296P14523Q55462J021556
$$ 7296786 7538981 7825668 8168779 8581550 9077446 9672742 10387265 11242727 12264283
57093A2264283J219275J450991J710547J991930K296225K620568K946231L249232
$$ 12264283 13483558 14934549 16645096 18637026 20933251 23553819 26500050 29749282
57085B9749282L513486L711746L779818L647453L313023K858524K359534J796231
$$ 29749282 33262768 36974514 40754332 44401785 47714808 50573332 52932866 54729097
57077E4729097J089627K24397o96527j526004k174785k634522k935990l115183
$$ 54729097 55818724 56043121 55346594 53820590 51645805 49011283 46075293 42960110
57069D2960110l205894l232643l202283l112891k971236k793471k592235k373737
$$ 42960110 39754216 36521573 33319290 30206399 27235163 24441692 21849457 19475720
57061A9475720k146188j921215j706584j504997j319698j154415j008442q78421
$$ 19475720 17329532 15408317 13701733 12196736 10877038 9722623 8714181 7835760
57053G835760p64519o68879n88974n18976m57034m04964l61419l21947k85694
$$ 7835760 7071241 6402362 5813388 5294412 4837378 4432414 4070995 3749048 3463354
57044C463354k55598k31526k09440j87993j69985j56101j42949j28766j15756
$$ 3463354 3207756 2976230 2766790 2578797 2408812 2252711 2109762 1980996 1865240
57035A865240j05166r4914q3933p4391o7602o1606n4517m6822l9113l1024k3348
$$ 1865240 1760074 1665160 1581227 1506836 1439234 1377628 1323111 1276289 1237176 1206152 1182804
57024A182804j7565j2363m349O986J8942L0902M5111O0275O8787O2959M1361Q049
$$ 1182804 1165239 1152876 1148527 1155513 1174455 1205357 1250468 1310743 1379530 1442489 1483850 1491899
57012A491899l0463o5598q8834r7246r5227q8843q0616p0932o0998n2013m3912
$$ 1491899 1461436 1395838 1307004 1209758 1114531 1025688 945072 874140 813142 761129 717217
57001G17217l7030l2638l0330k7485k3000j8878j6449j4131j0869q762r632j1571
$$ 717217 680187 647549 617219 589734 566734 547856 531407 517276 506407 497645 488013 476442
56989D76442j1634r838p904n877k642J570N502Q484R800P859K038n611j2198j6603
$$ 476442 464808 454970 447066 441189 438547 440117 445619 454103 463903 471762 473800 468189 455991 439388
56975D39388j9037j9438j7811j5045j2086r237o955n914n502l887m88L182N874
$$ 439388 420351 400913 383102 368057 355971 346734 339779 333865 328363 324476 323988 327170 333044
56962C33044Q037J0173J1951J3784J7198K2327K6913K8628K6572J9959Q228o391
$$ 333044 341081 351254 363205 376989 394187 416514 443427 472055 498627 518586 526814 520423
56950E20423j9127k7096l1248l2859l1112k6012k0556j7315j5129j1739p589m328
$$ 520423 501296 474200 442952 410093 378981 352969 332413 315098 299969 288230 280641 276313
56938B76313j365L060Q557J3016J5821J8553K2898K9166L6071M0572L9022K9899
$$ 276313 274948 278008 286565 299581 315402 333955 356853 386019 422090 462662 501684 531583
56926E31583J4967k510j9376l2331l8773l9300l7351l5189l2244k8129k4343k1418
$$ 531583 546550 544040 524664 492333 453560 414260 376909 341720 309476 281347 257004 235586
56914B35586j7475j1799p075n564n594m616l314l644m851m718l303k201j363L20
$$ 235586 218111 206312 199237 193673 188079 183463 180149 176505 171654 166936 163633 161432 160069 160389
56900A60389K280L088L221M272O115P519Q833J1432J5018J8009K0222K2958K6658
$$ 160389 162669 165757 168978 173250 179365 186884 195717 207149 222167 240176 260398 283356 310014
56887C10014L0516L3950L6495L6667L2933K5501J5698M306p756j8017k3776k4654
$$ 310014 340530 374480 410975 447642 480575 506076 521774 526080 518324 500307 476531 451877
56875D51877k2360j8593j4479j1013q339n285j142L082O456J0007J5097K1317
$$ 451877 429517 410924 396445 385432 377093 371808 370666 373748 380204 390211 405308 426625
56863D26625K7781L5320M5331N7121O7992P4731P3816O2001L9447J1382j5297
$$ 426625 454406 489726 535057 592178 660170 734901 808717 870718 910165 921547 906250
56852I06250l6436n0579n6922n5978n0850m4918l8687l0961k1861j2522k943P301
$$ 906250 869814 819235 762313 706335 655485 610567 571880 540919 519058 506536 503593 510894
56840E10894J7243K5916L4637M5593N9161P4924R3635J14640J31787J35388J19121
$$ 510894 528137 554053 588690 634283 693444 768368 862003 976643 1108430 1243818 1362939
56829A362939Q3877L6098j4953n9336q9897j05272j08616j03640r3213q0316o7560
$$ 1362939 1446816 1482914 1467961 1408625 1318728 1213456 1104840 1001200 907987 827671 760111
56818G60111n5681m4272l3516k3618j3661k982P387J6896K7780M2670O0777P8510
$$ 760111 704430 660158 626642 603024 589363 586381 593768 610664 638444 681114 741891 820401
56806H20401R2220R7629Q8771O2299K3145j7650n1274p5105q9493r4626r1395
$$ 820401 912621 1010250 1099021 1161320 1184465 1166815 1115541 1040436 950943 856317 764922
56795G64922q2198o9657n6086m4005l4915k7636k0054j2265n820n00N439J2346
$$ 764922 682724 613067 556981 512976 478061 450425 430371 418106 412286 411786 417225 429571
56783D29571J9376K7172L6996M6980N2188M8963L7038J7919n599k8289m4529n2731
$$ 429571 448947 476119 513115 560095 612283 661246 698284 716203 710604 682315 637786 585055
56771E85055n5536n5340n2226m6427l9690l3196k6676k0449j6058j4059j3178
$$ 585055 529519 474179 421953 375526 335836 302640 275964 255515 239457 225398 212220
56760B12220j2257j1169r681p463n424m778m802l800k232k300m257n844n715m843
$$ 212220 199963 188794 179113 171650 166226 161448 156646 152846 150614 148314 144057 138213 132498 127655
56746A27655m128l149j859j081p48M3R29M65j273k642l107l606m078l252j186
$$ 127655 123527 120378 118519 117438 116690 116733 117662 118127 116854 114212 111105 107499 103421 100169 98983
56731I8983N11J221J650J600O8k194l019j922l95Q35K132K883K285J919L872O328
$$ 98983 99494 100715 102365 103965 104033 101839 98820 96898 96503 97338 99470 102353 104638 106557 110429 116757
56715A16757N214O98k242r39J505J519j03q83p36r31j598k361l371m130l520k065
$$ 116757 121971 122669 120427 119488 120993 122512 122409 121526 120790 119859 118261 115900 112529 108399 104879 102814
56699A02814j767k749k769j112J44j56l74O27J680K192L548N917O993N913N131
$$ 102814 101047 98298 95529 94417 94561 94405 94031 94658 96338 98530 102078 107995 114988 120901 126032
56684A26032O300P548P223O979Q316R172P185L870K337K825L507L846M207L795
$$ 126032 132332 139880 147103 154082 162398 171570 178755 182625 184962 187787 191294 195140 199347 203142
56670B03142J935P9j22N09K44n49l64O21J068Q88J110J980K828L115K507R23n85
$$ 203142 205077 205156 205034 205543 205787 205238 204874 205495 206563 207451 208561 210541 213369 216484 218991 219914 219329
56653B19329n44M39k01l281o387p323o784o218n424m132l631m745o114o354o017
$$ 219329 218785 219224 219023 215742 209355 202032 195248 189030 183606 179474 175843 171098 164984 158630 152613
56638A52613n749m772k959k024k603k595o92Q31m68l233m542m092l373k518j034
$$ 152613 146864 142092 139133 137109 134506 131911 131219 132050 131582 128349 123807 119715 116342 113824 112790
56623A12790m4p83j958j494J69J106J178J679K649L101L125L463L841L750L945
$$ 112790 112746 111963 110005 108511 108680 109786 110964 112643 115292 118393 121518 124981 128822 132572 136517
56608A36517M985N409L689J050M1R61J889J674Q95L42L12R02J656J540M19m81
$$ 136517 141502 146911 150600 151650 151691 152652 154541 156215 157110 157452 157764 158666 160322 161862 162281 161800
56592A61800n17o14j263j396n63j83r85j393j98J232J494J674L046M333L795K169
$$ 161800 161283 160669 159406 158010 157447 157264 156279 154886 154688 155920 157414 159088 162134 166467 170262 172431
56576A72431J046K24q60j039M56J796J383J024L125O478Q204Q271Q595R046Q268
$$ 172431 173477 173701 172841 171802 172258 174054 175437 176461 179586 186064 194268 202539 211134 220180 228448
56561B28448P462R317J3534J6988J8243J8469J7907J4951R282L042j772m848o224
$$ 228448 235910 245227 258761 275749 293992 312461 330368 345319 354601 357643 355871 351023 344799
56548C44799n813m643m461n622o854p147o404m634k200n57j036l046m834n460
$$ 344799 338986 334343 329882 324260 317406 310259 303855 299221 297021 296464 295428 292382 287548 282088
56534B82088m810k771P5J941J829J069J320K236K757L195L946L641R62k875n700
$$ 282088 277278 274507 274582 276523 278352 279421 280741 282977 285734 288929 292875 296516 297478 294603 288903
56519B88903p346q750r445q508p026o931q011q456p647o371n011l580k639k367
$$ 288903 281557 272807 263362 254854 247828 240897 232886 224430 216783 210412 205401 201821 199182 196815
56505A96815j819q66j259l782o159o251n343n569n957m301j338L90O97J362K517
$$ 196815 194996 194130 192871 189089 182930 176679 171336 165767 159810 155509 154171 154561 155258 156620 159137
56490A59137K772K258K395L075K973K139J648J399P74O42K004L715M013L220K461
$$ 159137 161909 164167 166562 169637 172610 174749 176397 177796 178570 179212 181216 184931 188944 192164 194625
56475A94625J260p96j823k53J961K106J103J493K780K666J535J550K388K082J073
$$ 194625 195885 195089 193266 193013 194974 197080 198183 199676 202456 205122 206657 208207 210595 212677 213750
56460B13750J270J995J170m14l79N42k37j963j465J043K176J274J067K155J997
$$ 213750 215020 217015 218185 217771 217392 217934 217697 215734 214269 215312 217488 218762 219829 221984 223981
56445B23981J10p37M09J029j11j023o00m30j009l60J961L327K314R36Q19O02r11
$$ 223981 224091 223354 223763 224792 224681 223658 223058 222628 221619 221259 223220 226547 228861 229797 230616 231218 230307
56428B30307k137j282Q57K440K745J672p08l175m029l416k954k909k101o04K42
$$ 230307 228170 226888 227745 230185 232930 234602 233894 230719 226690 223274 220320 217411 215310 214706 214948
56413B14948N38J578K974K984J718Q32J23k010m844n750m666m204m924m378j666
$$ 214948 215486 217064 220038 223022 224740 225572 225695 223685 218841 213091 208425 204221 199297 194919 193253
56398A93253Q97J736K099L214M609O163Q529J0755J0679Q469O567N632L898J068
$$ 193253 194150 195886 197985 201199 205808 211971 220500 231255 241934 250403 256970 262602 266500 267568
56384B67568p58o56N0R12L002N811P062O291N247M243J768j976m860o543q522
$$ 267568 266810 266154 266204 267116 270118 275929 282991 289282 294529 298772 300540 298564 293704 287161 278639
56369B78639j0226r242n941l533k825j282J967M520N033M871M609L278J729K237
$$ 278639 268413 259171 253230 249697 246872 245590 247557 252077 257110 261981 266590 269868 271597 273834
56355B73834L999L847K074K323M775N137J989n77J74J614J125K28N84O86m85j032
$$ 273834 277833 281680 283754 286077 290852 295989 297978 297401 297575 299189 300314 300542 301126 301812 301327 300295
56339C00295o7K99n39L36M127P507P969P746R492J2135J3932J5605J7508J7495
$$ 300295 300228 300527 299988 300324 304451 311958 319927 327673 337165 349300 363232 378837 396345 413840
56325D13840J4528J0809P909M627P87j153p50j315m219o068m544k538l112m656
$$ 413840 428368 439177 447086 451713 452500 451347 450597 449282 445063 438995 434451 431913 428801 424145
56311D24145m555l577l119j929R03L315L856M194N288N021K786K084N066Q507
$$ 424145 419590 416013 412894 410965 411868 415183 419039 423233 428521 433542 436328 438412 443478 451985
56297D51985Q857P412O976P110O442N969O606O773N679N399O823P504O487O769
$$ 451985 460842 468254 475230 482340 488782 494751 501357 508130 513809 519208 526031 533535 540022 546791
56283E46791R711J1691J0074P872Q481J0245J0528J0763J2939J5156J5246J4983
$$ 546791 556502 568193 578267 586139 594620 604865 615393 626156 639095 654251 669497 684480
56271F84480J6324J7400J6587J6495J9338K2359K2567K2136K4254K7512K9405
$$ 684480 700804 718204 734791 751286 770624 792983 815550 837686 861940 889452 918857
56260I18857L1719L7159M4025M9291N3888O0204O7511P4512Q3078R4804J07163
$$ 918857 950576 987735 1031760 1081051 1134939 1195143 1262654 1337166 1420244 1515048 1622211
56249A622211J17512J27433J38771J49375J57354J65213J74664J81731J82399
$$ 1622211 1739723 1867156 2005927 2155302 2312656 2477869 2652533 2834264 3016663
56240C016663J78825J74054J65185J48301J26132J03652P9542M9411J4907j7592
$$ 3016663 3195488 3369542 3534727 3683028 3809160 3912812 3992354 4041765 4056672 4039080
56230D039080m5412p0121r1631j08375j21798j34518j45257j51094j53084j54298
$$ 4039080 3993668 3923547 3831916 3723541 3601743 3467225 3321968 3170874 3017790 2863492
56220B863492j54184j50290j43551j36549j28686j18472j08357j01760r7334r1573
$$ 2863492 2709308 2559018 2415467 2278918 2150232 2031760 1923403 1821643 1724309 1632736
56210A632736q4779p9242p3997o6918n9631n4805n1007m5669m0409l7838l5942
$$ 1632736 1547957 1468715 1394718 1327800 1268169 1213364 1162357 1116688 1076279 1038441 1002499
56199A002499l1513k6329k3879k2752j9510j5323j3456j2823j0466p796p833q841
$$ 1002499 970986 944657 920778 898026 878516 863193 849737 836914 826448 818652 810819 801978
56187H01978p266m550m368n516m304j675j223k386k161j172j558j524J298L979
$$ 801978 794712 790162 785794 780278 775974 774299 773076 770690 768529 767357 765799 764275 765573 769552
56173G69552K689M1Q38L620L999L197N204Q268P807N280N671Q339Q973Q456J0984
$$ 769552 772241 772282 773120 776740 780739 783936 789140 797408 805215 810495 816166 824505 833478 841934 852918
56158H52918J5192J6208J5013J6783K1186K3295K3076K5041K9307L1746L2260
$$ 852918 868110 884318 899331 916114 937300 960595 983671 1008712 1038019 1069765 1102025
56147A102025L4316L7218L7594L7675M3143N3348O2457O9563P8763Q9780R7741
$$ 1102025 1136341 1173559 1211153 1248828 1291971 1345319 1407776 1477339 1556102 1645882 1743623
56136A743623J02020J06204J09406J06493R7151Q6260P5631O3925N4135N1719
$$ 1743623 1845643 1951847 2061253 2167746 2264897 2351157 2426788 2490713 2544848 2596567
56126B596567N4915N5568M9787L9971K7249J0960n000j4536j8085k1006k4633
$$ 2596567 2651482 2707050 2756837 2796808 2824057 2835017 2830017 2815481 2797396 2776390 2751757
56115B751757k7728l4686n1658p5322r5646j09132j19279j25382j22413j11780
$$ 2751757 2724029 2689343 2637685 2562363 2466717 2357585 2238306 2112924 1990511 1878731
56105A878731j00760r0889p7793o2604n2064m6598l9715l0221k3906k2029j9144
$$ 1878731 1777971 1687082 1609289 1546685 1494621 1448023 1408308 1378087 1354181 1332152 1313008
56094A313008j3628r600p405k871L160N288M053N174Q203P361L667M319R550J2242
$$ 1313008 1299380 1289780 1282375 1279504 1282664 1287952 1292005 1297179 1305382 1312743 1316410 1320729 1330279 1342521
56080A342521J1142J2135J5863J6759J5018J6671K0984K0932J6950J6809K1014
$$ 1342521 1353663 1365798 1381661 1398420 1413438 1430109 1451093 1472025 1488975 1505784 1526798
56069A526798K2168J9707K0915K6243K8345K6940K9416L5116L4793K7788K3812
$$ 1526798 1548966 1568673 1589588 1615831 1644176 1671116 1700532 1735648 1770441 1798229 1822041
56058A822041K5228K3742J7356J4176J6197J5904J2376J3776K0332K2145J7831
$$ 1822041 1847269 1871011 1888367 1902543 1918740 1934644 1947020 1960796 1981128 2003273 2021104
56047B021104J7720K4236K7208K3374K2233K7147K9185K5533K5350L1133L3082
$$ 2021104 2038824 2063060 2090268 2113642 2135875 2163022 2192207 2217740 2243090 2274223 2307305
56036B307305K8577K8263L5901M1177L9686M0756M8058N2117M9835N1445N9945
$$ 2307305 2335882 2364145 2400046 2441223 2480909 2521665 2569723 2621840 2671675 2723120 2783065
56025B783065O3888N9102N7041O2779O5686O1203O0436O8349P3936P2212P4109
$$ 2783065 2846953 2906055 2963096 3025875 3091561 3152764 3213200 3281549 3355485 3427697 3501806
56014C501806Q4288R1333R0409R2849J02631J07033J01717J00604J09353J14487
$$ 3501806 3586094 3677427 3767836 3860685 3963316 4070349 4172066 4272670 4382023 4496510
56004D496510J10959J13885J29619J42341J43553J47207J60945J71085J71722
$$ 4496510 4607469 4721354 4850973 4993314 5136867 5284074 5445019 5616104 5787826
55995E787826J78899J99302K15334K18724K27250K49886K68441K73584K84600
$$ 5787826 5966725 6166027 6381361 6600085 6827335 7077221 7345662 7619246 7903846
55986G903846L12098L36592L47013L63829L99597M34380M56061M85744N35818
$$ 7903846 8215944 8552536 8899549 9263378 9662975 10097355 10553416 11039160 11574978
55977A1574978N83924O17617O61859P31505Q01872Q59162R31631J035600J142855
$$ 11574978 12158902 12776519 13438378 14169883 14971755 15830917 16762548 17798148 18941003
55968A8941003J240141J365144J541313J737396J938221K190050K524330K909275
$$ 18941003 20181144 21546288 23087601 24824997 26763218 28953268 31477598 34386873
55960C4386873L336703L878743M592818N458983O486475P780005R412413J1355984
$$ 34386873 37723576 41602319 46195137 51654120 58140595 65920600 75333013 86688997
55952H6688997J3657519J6549073K0262258K4922060L0753656L7918622M5434050
$$ 86688997 100346516 116895589 137157847 162079907 192833563 230752185 276186235
55945B76186235N0284774M8516304L8043479K0526893M00024j7810933l1339200
$$ 276186235 326471009 374987313 413030792 433557685 433957709 416146776 384807576
55938C84807576l9306404m2126851m1044021l7658835l3320806k8805473k4488576
$$ 384807576 345501172 303374321 262330300 224671465 191350659 162545186 138056610
55931A38056610k0607033j7272948j4437194j2013918r989934q353919p018643
$$ 138056610 117449577 100176629 85739435 73725517 63735583 55381664 48363021
55924D8363021n894856m968246m236761l641431l122431k681986k333161k041545
$$ 48363021 42468165 37499919 33263158 29621727 26499296 23817310 21484149 19442604
55916A9442604j771444j538246j362992j220405j079570r53318q61692p85962
$$ 19442604 17671160 16132914 14769922 13549517 12469947 11516629 10654937 9868975
55908I868975p02468o25666n75942n37937m90052m43772m16064l92473l54425
$$ 9868975 9166507 8540841 7964899 7426962 6936910 6493138 6077074 5684601 5330176
55899E330176l15630k95761k83217k58240k29555k15037k07417j90856j71915
$$ 5330176 5014546 4718785 4435568 4177328 3947773 3732736 3525319 3334463 3162548
55890C162548j64106j59806j45698j28976j21865j16790j02184q6592q2682q3155
$$ 3162548 2998442 2838636 2692938 2563962 2442097 2325307 2223123 2136531 2053849 1970694
55880A970694p5848o7018o6730o6620n5110m0326l5748l7028l4252l3289m3349
$$ 1970694 1894846 1827828 1761098 1694478 1639368 1599042 1563294 1526266 1492014 1458725 1415376
55869A415376n6231n9075n6028n7379n9026n2348m3067m1106m2301l8255l3471
$$ 1415376 1359145 1300070 1244042 1186663 1127637 1075289 1032222 991116 948815 910560 877089
55858H77089l5058l6565k9884k2278k3841k8713k6386k1194k2720k6911k4682
$$ 877089 842031 805466 775582 753304 729463 700750 674364 653170 630450 603539 578857
55847E78857k0069k2042k6879k5978k2827k5190k8566k4438j7422j7276k0915
$$ 578857 558788 536746 509867 483889 461062 435872 407306 382868 365446 348170 327255
55836C27255j8847j3027j2006j4345j2655q710r292j2122j0374o129n651o564
$$ 327255 308408 295381 283375 269030 256375 247665 238373 226251 215877 209748 204097 197533
55824A97533l199R76m44l921k492Q17p09l827j477L299L080MN51K189r36m661
$$ 197533 194334 195310 194866 190945 188453 189270 188561 184734 183257 186556 189636 189640 190191 192380 191444 186783
55808A86783j239N815P496N180O683J0844J0459O919P618J1556J1332P039N003
$$ 186783 185544 191359 198855 204035 210718 221562 232021 238940 246558 258114 269446 276485 281488
55795B81488M984J430m604p337p824j1528j6522j6292j2167j0935j2054r202k800
$$ 281488 286472 287902 283298 275961 268137 256609 240087 223795 211628 200693 188639 179437 176637
55782A76637P47P23J515K177j853q003r158n799m550n870m341lJ896J545L950
$$ 176637 177384 178107 179622 181799 179946 171943 162785 156986 152436 146566 142225 142222 144118 145663 149613
55767A49613Q370R132O396N502O241L477k085m483l575m957q911j0085q438j0018
$$ 149613 157983 167115 173511 179013 185254 188731 186646 182163 178588 173631 164720 154635 146197 136179
55753A36179j5976k0767k2109k3197k4195H759e843r897q423o589m197m798p204
$$ 136179 120203 99436 77327 54130 29935 8759 -5843 -15740 -24163 -30752 -34949 -39747 -46951
55740d6951n920j157P23j887l266l84K888L539L611M615M895M281M792N549L457
$$ -46951 -52871 -54028 -53305 -55192 -58458 -58842 -55954 -52415 -48804 -44189 -39294 -35013 -30221 -24672 -21215
55725b1215l89j560L6J41k006k720j174n59j520j309J5o53l096l684j897n70J79
$$ -21215 -21604 -23164 -23128 -22987 -24993 -27713 -28887 -29446 -30966 -32275 -32260 -32913 -36009 -39693 -41590 -42160 -41981
55708d1981K678N789O201N137O516f688F56J875F09a858l431n622n746l731l270
$$ -41981 -39303 -33514 -27313 -22176 -15660 -6688 656 2531 609 -1858 -5289 -10911 -16657 -20388 -23658
55693b3658m284k804Q46J690r46k085nJ413O58J104L753N203M738N909F37R951
$$ -23658 -27942 -30746 -29900 -28210 -29156 -31241 -31246 -29833 -29175 -28071 -24318 -19115 -14377 -8468 637 10588
55677A0588P267N311N801N044J614m32R88K171M82j391j171j029k629l729k774
$$ 10588 17855 23166 28967 34011 35625 35193 36181 38352 38834 37443 36272 35243 32614 28885 26111
55662B6111j709j599l70K600M580M296L831M050L096J026O88K336K634N11j304
$$ 26111 24402 22803 22433 25033 29613 33909 37740 41790 44886 45912 46600 48936 51570 52081 50777
55647E0777j890l615o563p451n783n254p135D961a732n659o328o105m150l572
$$ 50777 48887 45272 38709 31258 25475 20221 13086 4961 -1732 -7391 -13719 -19824 -23974 -27546
55633b7546n428o260m243k247k243k037k58O89n80j694j145p95j446r61J039J654
$$ -27546 -32974 -39234 -43477 -45724 -47967 -50004 -50262 -49573 -50153 -51847 -52992 -53787 -55233 -56194 -55155 -53501
55617e3501J37l60J327K093M65o51L86R75m03j286l53j06j559j835R6O91j833
$$ -53501 -53364 -53724 -52397 -50304 -49839 -50490 -50104 -49129 -49532 -50818 -51171 -51277 -52836 -54671 -54575 -53884 -55717
55600e5717l818k329R4L96k47k15j139l889n424l554q69l21q13l87J83K13J268
$$ -55717 -59535 -61864 -61770 -61374 -61621 -61836 -62975 -66864 -72288 -75842 -76711 -77032 -77845 -78232 -78049 -77836 -76568
55583g6568L433L624Q85r63P07L091K997J758J501J001q34j541O47K953K513J128
$$ -76568 -73135 -69511 -68626 -69589 -68882 -65791 -62794 -61036 -59535 -58534 -59368 -60909 -60262 -57309 -54796 -53668
55567e3668J623K969L069L060M710O537O439N414N041M074J176j768k501j937
$$ -53668 -52045 -49076 -46007 -42947 -38237 -31700 -25261 -19847 -14806 -10732 -9556 -11324 -13825 -15762
55553a5762j700r20J289K986K291N47k06k33k6J473L901b160h24j177n99Q35L18
$$ -15762 -17462 -18382 -17093 -14107 -11816 -11269 -11475 -11708 -11734 -10261 -6360 -2160 -824 -2001 -2600 -1765 -1447
55536a447o40M73G64K613K024K660L751L534K696K524K047L27j034q13q49k636
$$ -1447 -2087 -1614 764 3377 5401 8061 11812 15346 18042 20566 22613 22940 21906 21093 20244 17608
55520A7608m252l954l695B93f742o175m781n799p750p041l732p71P17J560J650
$$ 17608 13356 9402 5707 293 -6742 -12917 -17698 -23497 -31247 -38288 -42020 -42791 -42074 -40514 -38864
55505c8864N28o54q75j292k736l368j780J20M38P45K812M673L828J787J308J406
$$ -38864 -38336 -38990 -39865 -41157 -43893 -47261 -49041 -48921 -48483 -47738 -44926 -40253 -36425 -34638 -33330 -31924
55489c1924o36m069n781n146l887k446k50J571J290m91j863k356k308j240O06
$$ -31924 -32560 -36629 -42410 -47556 -51443 -53889 -54139 -52568 -51278 -51769 -53632 -55988 -58296 -59536 -58930
55474e8930J261R5n21P73J629K81q51M66J723mk180n21L805N806M096J604J08
$$ -58930 -57669 -57574 -58095 -57322 -55693 -55412 -56263 -55797 -54074 -54078 -56258 -56779 -52974 -47168 -43072 -41468 -41360
55457d1360j130j995j393n7K87l8J75Lj806l517k702n24K13j57N38J739J312R5
$$ -41360 -42490 -44485 -45878 -45935 -45648 -45686 -45511 -45508 -47314 -50831 -53533 -54057 -53844 -54001 -53463 -51724 -50412 -50317
55439e0317O40K336K433J197J290K501J907p20k318j731j107j514j284L98J936
$$ -50317 -49677 -47341 -44908 -43711 -42421 -39920 -38013 -38733 -41051 -42782 -43889 -45403 -46687 -46289 -44353
55424d4353K164J578L45j895l830l335r22O36M52L91J519K630K740K337J749P04
$$ -44353 -42189 -40611 -40266 -42161 -45991 -49326 -50248 -49612 -49160 -48769 -47250 -44620 -41880 -39543 -37794 -37090
55408c7090l12m50k27p52j575j549j119j333j460k96J058O54p61q80K41N33k66
$$ -37090 -37402 -37852 -38079 -38831 -40406 -41955 -43074 -44407 -45867 -46163 -45105 -44451 -45212 -46092 -45851 -45318 -45584
55391d5584m24N26J504K451M010N115M157K214J749K434J776l36j395n98K78N15
$$ -45584 -46008 -45482 -43978 -41527 -37517 -32402 -28245 -26031 -24282 -21848 -20072 -20408 -21803 -22401 -22123 -21608
55375b1608J369K907L402K510J622M90k979q548j2563j2376r219n655k820j139
$$ -21608 -20239 -17332 -13930 -11420 -9798 -9308 -12287 -20835 -33398 -45774 -54993 -60648 -63468 -64607
55361f4607j087j890j622K18J858J778M68p35r63J30J982K851J705q0o19m18j000
$$ -64607 -65694 -67584 -69206 -68988 -67130 -65352 -64884 -65619 -66582 -66452 -64470 -61619 -59914 -59994 -60613 -61031 -62031
55344f2031j629l42K291L666L253K917L045J775j320l943m356l231j523P81L032
$$ -62031 -63660 -64002 -61711 -58045 -54792 -51875 -48830 -47055 -48375 -52318 -56674 -59905 -61428 -60647 -57615
55329e7615L748L078L075M532N758N335L849K149P9k108l068k170m99P14J263
$$ -57615 -53867 -50789 -47714 -43182 -37424 -32089 -28240 -26091 -26012 -28120 -31188 -33358 -33857 -33143 -31880
55314c1880J253P39L56Q11J563J331r3j780k916k807p14K474L662J087k609l544
$$ -31880 -30627 -29888 -29532 -28721 -27158 -25827 -25920 -27700 -30616 -33423 -34137 -31663 -28001 -26914 -29523 -33067
55298c3067j792l64p9P62K061J507j004k499j549l06o56j431r86R9N33M01M19
$$ -33067 -34859 -35223 -35302 -34540 -32479 -30972 -31976 -34475 -36024 -36330 -36986 -38417 -39403 -39304 -38771 -38370 -37951
55281c7951P18J291K112K367J336J33N46K128K675J673Q29J036J301R80N02l06
$$ -37951 -37233 -35942 -33830 -31463 -30127 -29994 -29448 -27320 -24645 -22972 -22143 -21107 -19806 -18826 -18324 -18630
55265a8630k034l582l075j148n02j696k337j021Q54J907K400K314Q12j325j762
$$ -18630 -20664 -24246 -27321 -28469 -28971 -30667 -33004 -34025 -33171 -31264 -28864 -26550 -25738 -27063 -28825
55250b8825k41P15j27q60j12N55l38j477j162j06K27J63O48J176P32m14j390k069
$$ -28825 -29066 -28351 -28478 -29338 -29450 -28895 -29233 -30710 -31872 -31978 -31751 -31588 -30940 -29764 -29032 -29446 -30836 -32905
55232c2905k518k291j248m2R48J908K480J890N70j0M54P62L56rn6l55o66m3J003
$$ -32905 -35423 -37714 -38962 -39004 -38056 -36148 -33668 -31778 -31208 -31218 -30764 -30002 -29646 -29655 -29711 -30066 -30732 -30775 -29772
55213b9772P83o60j250j15J207J395R07K68p32j438m29J946L411L007K128J754
$$ -29772 -28989 -29649 -30899 -31014 -29807 -28412 -27505 -27237 -27969 -29407 -29836 -27890 -24479 -21472 -19344 -17590
55197a7590J168J62k03M8o45k356k940j542j82m43j179r06r4M50J046J646J143
$$ -17590 -16422 -16260 -16463 -16415 -17060 -19416 -22356 -23898 -24080 -24523 -25702 -26608 -26702 -26252 -25206 -23560 -22417
55180b2417l75j014p9O95K38J9J209K460K151P95m25j242j145Q93L963N069L146
$$ -22417 -22792 -23806 -23885 -23190 -22952 -22933 -21724 -19264 -17113 -16318 -16743 -17985 -19130 -18237 -14274 -9205 -6059
55163f059P68J77K60n28j044J77J844J945R28L56J24m03l95P40B01a20k690l139
$$ -6059 -5291 -5114 -4854 -5382 -6426 -6249 -4405 -2460 -1532 -1176 -1052 -1455 -1850 -1110 201 -120 -2810 -5949
55145e949j688m61j72K08R09R27l3j112j640j588j009j26M46L81l4p38j881k675
$$ -5949 -7637 -8098 -8270 -8062 -7153 -6226 -6259 -7371 -9011 -10599 -11608 -11734 -11288 -10907 -10941 -11679 -13560 -16235
55127a6235j869nQ18J53J9J509K970K925K427K762a429I65J549J533J315j48j624
$$ -16235 -18104 -18109 -17291 -17138 -17119 -15610 -12640 -9715 -7288 -4526 -1429 965 2514 4047 5362 5214 3590
55110C590j618I26f01k458k184r02j24p8K11J037J980b48C159K815J348O32J168
$$ 3590 1972 926 -601 -3059 -5243 -6145 -6269 -6347 -6136 -5099 -3119 -248 3159 5974 7322 7954 9122
55093I122J119o31k041p43K205L736K812R00o65j612j815j384j119j462j596q53
$$ 9122 10241 9610 7569 6826 9031 12767 15579 16479 15814 14202 12387 11003 9884 8422 6826 5973
55077E973J16O15J062J671J565M38o15j163k434B517c402m557j873N08K908a022
$$ 5973 6089 6704 7766 9437 11002 11440 10825 9662 7228 2517 -3402 -7959 -9832 -9324 -6416 -1022
55060D926L550P84M44J412J027m27r16o46j273k355k058n95L17N82J228J740J091
$$ 4926 8476 9260 9704 11116 12143 11716 10800 10154 8881 6526 4468 3873 4190 4772 6000 7740 8831
55043H831M69J555K840J381k158l927k436j30Q21Q72O81l82k220B968B82a478
$$ 8831 9300 10855 13695 15076 12918 8991 6555 6425 7246 8118 8799 8417 6197 2968 282 -1478
55026b767n24J086D16K942J881o2k029B27b266j921j918j261J034c115a92G91
$$ -2767 -3291 -2205 416 3358 5239 5177 3148 227 -2266 -4187 -6105 -7366 -6332 -3115 -192 791
55009A067J449K522K528K483K732K307J238O85M71o39j876q03K460M506L386J251
$$ 1067 2516 5038 7566 10049 12781 15088 16326 17011 17482 16843 14967 14164 16624 21130 24516 25767
54993B5767P12J107M51j111j958j753j494j605j700j709j976k412k533k059j069
$$ 25767 26479 27586 28037 26926 24968 23215 21721 20116 18416 16707 14731 12319 9786 7727 6658
54978F658J50J079J311J031P19M11q9m88k57N05J286J971K631K889K446J801J423
$$ 6658 6808 7887 9198 10229 10948 11359 11270 10782 10525 11030 12316 14287 16918 19807 22253 24054 25477
54961B5477P58p73k274k342j131o2L42R20K278L952N094N017L446J106m74p25
$$ 25477 26235 25462 23188 20846 19715 19653 19995 20915 23193 27145 32239 37256 40702 41808 41334 40609
54945D0609q57j748k268j205L22M10n71p97j92l52j481j893q03N50R31N51K33
$$ 40609 39752 38004 35736 34531 34853 35263 34692 33895 33703 33351 31870 29977 29174 29724 30655 31206 31439
54928C1439P07K652N833Q343Q403O884O264P342Q736R422R716R730Q726O294K732
$$ 31439 32146 34798 40631 48974 57377 64261 70525 77867 86603 96025 105741 115471 124197 130491 133223
54913A33223j544n569p470o542n027n613p675q467p463o567o253m878k286q45
$$ 133223 131679 126110 118640 112098 107071 101458 93783 85316 77853 71286 65033 60155 57869 57024
54899E7024j767l238l493l226l492l516k270m43O96J096J371J746K416L666M854
$$ 57024 55257 52019 48526 45300 41808 38292 36022 35579 36275 37371 38742 40488 42904 46570 51424
54884E1424M687L328K725M071O312P889Q567Q790Q684Q497Q730R072Q353O059
$$ 51424 56111 59439 62164 66235 72547 80436 89003 97793 106477 114974 123704 132776 141129 147188
54870A47188K773j065n323q967j0577j0529j0780j1828j1794r463o331m510m176
$$ 147188 149961 148896 143573 134606 124029 113500 102720 90892 79098 69635 63304 58794 54618
54857E4618m165l806l080k145j533j699j835n69J635K460Q27j616k936l143k993
$$ 54618 50453 46647 43567 41422 39889 38190 36355 35786 37421 39881 40708 39092 36156 33013 30020
54842C0020k325r81J18K93L69J267K218J717l37k480l214k223o15j81j446k563
$$ 30020 27695 26714 26832 27125 27494 28761 30979 32696 32359 29879 26665 24442 23827 23646 22200 19637
54826A9637j467R21J632j8j344m63R92Q50q1K48J546J692J29j608k321k273j900
$$ 19637 18170 19091 20723 20705 19361 18898 19890 20740 20659 20907 22453 24145 24274 22666 20345 18072 16172
54809A6172j086J22J346K530L818M628L815J157j883l223j994O15K387K153Q61
$$ 16172 15086 15208 16554 19084 22902 27530 31345 32502 30619 27396 25402 26017 28404 30557 31418
54794C1418L12J095K228K601K047J187Q45J542K752L017J630j65o75K6O36Q58
$$ 31418 31730 32825 35053 37654 39701 40888 41733 43275 46027 49044 50674 50509 49834 49860 50496 51354
54778E1354J413K027J381n57j889j131J098L309M875O062P371R187J1234J2356
$$ 51354 52767 54794 56175 55618 53729 52598 53696 57005 61880 67942 75313 84500 95734 108090
54764A08090J1754J0243R096Q107O192L531J151j224m703q574j0436r576q042
$$ 108090 119844 130087 139183 147290 153482 157013 158164 156940 152237 143663 133227 123651 115609
54751A15609p808q654r362r123p313l861m57O30n02j593j663k048l310l839k574
$$ 115609 107801 99147 89785 80662 73349 69488 69031 69661 69159 67566 65903 63855 60545 56706 54132
54736E4132q15L7M49J195J885K312L226M544M841M001M129O267Q409Q534P548
$$ 54132 53317 53354 53803 54998 56883 59195 62421 66965 71806 75807 79936 86203 94612 103146 110694
54721A10694P307P692P668P369O919M926N90m127o796p793q966j0232j0015q256
$$ 110694 118001 125693 133361 140730 147649 152575 153165 149038 142242 134449 125483 115251 105236 96980
54707I6980o578n877n763n835n639m086r36J716J488j078l279l766l342k612j040
$$ 96980 90402 84525 78762 72927 67288 63202 62266 63982 65470 64392 61113 57347 54005 51393 50353
54692E0353J388L465M230L888K902J373m72k113l283l952l832k690j001L32Q15
$$ 50353 51741 55206 59436 63324 66226 67599 67127 65014 61731 57779 53947 51257 50256 50588 51403
54677E1403M08p81k176k631j525K62J181O31p39j954k497k496k454k481j887j98
$$ 51403 51811 51030 48854 46223 44698 44960 46141 46772 46033 44079 41582 39086 36632 34151 32264 32066
54661C2066J638K189J601J359J762J362o04k778l487k620j030N59J390R33M9L35
$$ 32066 33704 35893 37494 38853 40615 41977 41373 38595 35108 32488 31458 32017 33407 34340 34389 34724
54645C4724J695K198J106O0L46J012R61Q81J517J938J234L11K35L39k72q56n06
$$ 34724 36419 38617 39723 39783 40129 41141 42102 42983 44500 46438 47672 47983 48218 48557 48285 47429 46923
54628D6923J8k40n02K47J073M84j145k305k590k507k179j820k221l162k750j09
$$ 46923 46941 46701 46199 46446 47519 48003 46858 44553 41963 39456 37277 35457 33236 30074 27324 27215
54612B7215K754L670L269L138K882J545L38R79K460K373O43r11j815k843l424
$$ 27215 29969 33639 36908 40046 42928 44473 44811 45790 48250 50623 51266 50355 48540 45697 42273
54597D2273k243q1R21P11J071K075J872K54o44R7O80l46j815j953q58O7p6j179
$$ 42273 40030 39949 40870 41581 42652 44727 46599 46853 46209 46306 46986 46640 44825 42872 42014 42081 42005 40826
54579D0826k350k473j446o49r90j203K85K464K962J694Q51J269J394K89p74m97
$$ 40826 38476 36003 34557 33908 32918 31715 32000 34464 37426 39120 39971 41240 42634 42923 42149 41652
54563D1652N97J503K202K903L196K802K046J172J18p75r43o33o18q82q35o52j028
$$ 41652 42249 43752 45954 48857 52053 54855 56901 58073 58191 57416 56473 55840 55222 54340 53505 52853 51825
54546E1825j625j287J75J750K764L248K899J321o00j123K00J973K692J996L95
$$ 51825 50200 48913 49088 50838 53602 56850 59749 61070 60470 59347 59547 61520 64212 66208 66603
54531F6603j080j234l1Q23m2j584j884j083q30j332j225k04M12m0p26j009j134
$$ 66603 65523 64289 64258 65081 65039 63455 61571 60488 59658 58326 57101 56897 57309 57269 56543 55534 54400
54514E4400j099n99k14q34j793j440K50J488J321N62j20j156k628l533k944q07
$$ 54400 53301 52702 52488 51654 49861 48421 48671 50159 51480 52042 51922 50766 48138 44605 41661 40854
54498D0854K320N000N102K132j151j682j80J89j213j807k41J706K279J935J427
$$ 40854 43174 48174 53276 55408 54257 52575 52395 52584 51371 49564 49323 51029 53308 55243 56670
54483E6670M62o29l36J555L107K946J864Q59k51j315j297l27m5o94k50K112M048
$$ 56670 57132 56503 56167 57722 60829 63775 65639 66498 66247 64932 63635 63308 63263 62569 62319 64431 68479
54466F8479L328J090p2M11J260J654J673J476J317J381R80o03k085j181J534K429
$$ 68479 71807 72897 72825 73236 74496 76150 77823 79299 80616 81997 82977 82374 80289 79108 80642 83071
54450H3071j23l112l230j292N9P14K089L443K594k57k409k351j262p78j171j845
$$ 83071 82948 79836 76606 75314 75373 76087 78176 81619 84213 83956 81547 79196 77934 77156 75985 74140
54434G4140k169j742r00p23j581k276j602j1J354K356L286L583K681J428J077
$$ 74140 71971 70229 69329 68606 67025 64749 63147 63136 64490 66846 70132 73715 76396 77824 78901
54419G8901J452J516J192J149J340J231J042J201J028l97k314k844j564o4K29
$$ 78901 80353 81869 83061 84210 85550 86781 87823 89024 90052 89655 87341 84497 82933 82869 83098
54404H3098m54j144j422j350r27j27Q35J472J332N61J75J061K555K851J313n64
$$ 83098 82644 81500 80078 78728 77801 77674 78509 79981 81313 81874 82049 83110 85665 88516 89829 89265
54388H9265j076k87O77J306J643J372K85q00p56L20J245J250O53R3j93l25l79
$$ 89265 88189 87902 88579 89885 91528 92900 93185 92385 91629 91949 93194 94444 95097 95190 94997 94672 94293
54371I4293j62O01J686K224J810J366K048L486M216L769K923J983N11r94j081
$$ 94293 94131 94732 96418 98642 100452 101818 103866 107352 111568 115337 118260 120243 120754 119760 118679
54356A18679L79J638J603J137R46J14j974l998m583m307m275m174l415k827l199
$$ 118679 119058 120696 122299 123436 124382 124496 122522 118524 113941 109634 105359 101185 97770 94943 91744
54341I1744l202r89K755N256M915K598K1j632j874j097n94j220k269k522j882
$$ 91744 88542 87553 90308 95564 100479 103077 103098 101466 99592 98495 97901 96681 94412 91890 90008
54326I0008j180r19r97j026k55J843M157M514K560N58J40k4j618l636m077l242
$$ 90008 88828 87909 86912 85886 85631 87474 91631 96145 98705 99263 99403 99379 97761 94125 90048 86806
54310H6806k764k550j405R2K35o60n83P35J487J053Q94J629J856Q17n3N56J759
$$ 86806 84042 81492 80087 80179 80414 79754 79171 79906 81393 82446 83340 84969 86825 87642 87589 88145 89904
54293H9904J954R11o16j977k433j200J189K672J957J86o34j92J30o25j853k369
$$ 89904 91858 92769 92153 90176 87743 86543 87732 90404 92361 92547 91913 91721 91851 91226 89373 87004
54277H7004j942j558k071k785k077L10K568L170K877L159L565K582N52m15M40
$$ 87004 85062 83504 81433 78648 76571 76881 79449 82619 85496 88655 92220 94802 95354 94939 95379
54262I5379J539J527R51O71L82k45m72K82J237J406J105J167J420J072J29o17
$$ 95379 96918 98445 99396 100067 100449 100204 99732 100014 101251 102657 103762 104929 106349 107421 107550 106933
54246A06933p18l11M52J434J960J049j491m440n847m641j715O61R80q3p26k64
$$ 106933 106215 105904 106356 107790 109750 110799 109308 104868 99021 94380 92665 93326 94306 94223 93497 93233
54230I3233M35O02O48J282K425L471M073M180L715K752J616M76q65k410l531l604
$$ 93233 93668 94270 94918 96200 98625 102096 106169 110349 114064 116816 118432 118908 118043 115633 112102 108498
54214A08498k890k302k246k096j079N23J432Q15o17j336p10M96J231J181N55l24
$$ 108498 105608 103306 101060 98964 97885 98408 99840 100655 100038 98702 97992 98488 99719 100900 101455 101131
54198A01131r39p79r0J77k94o02LR14J123P93Q17J223J082j31j901l289l499k171
$$ 101131 100192 99413 99323 99500 99206 98604 98607 99521 100644 101437 102254 103477 104559 104428 102527 99238 95739 93568
54180I3568R9J805J999J500J736K627K696J285n42j441j214m70K19N01K05m24
$$ 93568 93667 95472 97471 98971 100707 103334 106030 107315 106773 105332 104118 103648 103867 104368 104573 104149
54164A04149q35p73m67k39k99q08j701k498k765k571k048q20J301L274L450J509
$$ 104149 103314 102541 102074 101835 101536 100728 99027 96529 93764 91193 89145 88325 89626 92900 96350 97859
54148I7859r67k212k001j394j232j343j073j89Q45J443J542J485J416J186Q23
$$ 97859 96892 94680 92679 91285 90053 88710 87637 87448 88293 89736 91278 92763 94179 95365 96188
54133I6188N54L17q9l93j47K72p1j113j595q69K66J108K062L197L277J639j66
$$ 96188 96742 97059 96970 96577 96430 96702 96631 95518 93923 93054 93320 94428 96490 99687 102964 104603 104437
54116A04437k65Q48J279P88R59K624M891O770Q154Q991Q885P809O128L928J384
$$ 104437 104172 105020 106299 107087 108046 110670 115561 122331 130485 139476 148361 156170 162298 166226 167610
54101A67610m05l86O27N44j369l730n052n205m593l384k122j811k625l358k959
$$ 167610 167205 166819 167446 167990 166621 162891 157839 152634 148041 144657 142535 140724 138099 134741 131782
54086A31782j924j499j995k525k157r83k5j19q45r50qJ003J172Q35N77Kj204j889
$$ 131782 129858 128359 126364 123839 121682 120699 120674 120555 119710 118760 118752 119755 120927 121762 122339 122341 121137 119248
54068A19248o65J795L258K669J040k52p19l89M13Q49L78k24J76J228J548Q84L68
$$ 119248 118583 120378 123636 126305 127345 127093 126374 125985 126398 127247 127625 127401 127577 128805 130353 131237 131605
54051A31605O35J189J700K317K608J746J23p55k57Q34J973L400M784N065M274
$$ 131605 132240 133429 135129 137446 140054 141800 141923 141168 140911 141745 143718 147118 151902 156967 161241
54036A61241L873M634N588N796N737O250P260Q239Q794Q351O558M425L739M794
$$ 161241 165114 169748 175336 181132 186869 193119 200379 208618 217412 225763 232321 236746 240485 245279
54022B45279N987O041N234M140K777J441P00O3j541l503l845k488j873l286m904
$$ 245279 251266 257307 262541 266681 269458 270899 271599 271662 270121 266618 262773 260285 258412 255126 250222
54007B50222n013m778n891p485p702o632n472m140k177o72q03j436q04K34n75
$$ 250222 245209 240431 234540 227055 219353 212721 207249 203109 200932 200260 199457 198021 197217 197451 196876
53992A96876k827l621j971l10q01k597l744l905l813l460k352q42Kk97j095j436
$$ 196876 194049 190428 188457 188147 187346 184749 181005 177100 173287 169827 167475 166633 166635 166338 165243 163807
53976A63807j093p39r27r91L36K872M557L946K297J990L524N457O899Q331R791
$$ 163807 162714 161975 161048 160057 160393 163265 167822 171768 174065 176055 179579 185036 191935 200266 210057
53961B10057R800O855J418m051o871o255m101l251m307m924l103k19O95j014l096
$$ 210057 219857 226712 228130 224079 217208 210953 206852 203601 199294 194370 191267 191048 191743 190729 187633
53946A87633l570k480m30K448N480P179P073O498O680P198P171O741O343N526
$$ 187633 184063 181583 181153 183601 189081 196260 203333 209831 216511 223709 230880 237621 243964 249490
53932B49490L739J570P1o79j293j859j949j534q36M02K462M574N344M397K870
$$ 249490 253229 254799 254870 254191 252898 251039 249090 247556 246720 247122 249584 254158 259502 263899 266769
53917B66769K117K597M103O165P949Q526P948P497Q231R571J0003R015P559O508
$$ 266769 268886 271483 275586 281751 289700 298226 306174 313671 321902 331473 341476 350491 358050 364558
53903C64558N448L541J068o54q02R8Q93Q78Mj420k889l969m783n935p585q912
$$ 364558 370006 373547 374615 373961 373159 373257 374150 375028 375032 373612 370723 366754 361971 356036 348451 339539
53887C39539r016q145p386p206p038o462n967o113o469o159n094m008l347k977
$$ 339539 330523 322378 314992 307786 300748 294286 288319 282206 275737 269578 264484 260476 257129 254152
53873B54152l047m117o030p447p264n996m888m100k886j417j085k554m556n352
$$ 254152 251105 246988 240958 233511 226247 220251 215363 211263 208377 206960 205875 203321 198765 193413
53859A93413m689l581k831k483k294j977j318o43p95j973l104l108k302j726j489
$$ 193413 188724 185143 182312 179829 177535 175558 174240 173597 172802 170829 167725 164617 162315 160589 159100
53844A59100r46j42J94j0m2J73k16j474k512k199o95R91K031K123J448P26O57
$$ 159100 158154 158012 158206 158196 158154 158327 158111 156637 154125 151926 151231 152222 154253 156376 157824 158550 159207
53827A59207J063J165Q68R33J629K128J738Q85K55k91j177j982j754k47J651K786
$$ 159207 160270 161435 162303 163236 164865 166993 168731 169616 169871 169580 168403 166421 164667 164420 166071 168857
53811A68857K757K160J922K305K715K752K974M058N469N870M869L455K659K731
$$ 168857 171614 173774 175696 178001 180716 183468 186442 190500 195969 201839 206708 210163 212822 215553
53797B15553L571N000O335O691O059N225M538L743L070L219L938L995L067K302
$$ 215553 219124 224124 230459 237150 243209 248434 252972 256715 259785 263004 266942 270937 274004 276306
53783B76306K374K335J279j90j190k046l341m511m797m703n196o049o272n713
$$ 276306 278680 281015 282294 282104 280914 278868 275527 271016 266219 261516 256320 250271 243999 238286
53769B38286n070m639m168l508k615j326n7n0j833m003m701l814k646j917j418
$$ 238286 233216 228577 224409 220901 218286 216960 216903 216853 215020 211017 206316 202502 199856 197939 196521
53754A96521j245j927l290m439m806m409l251j601n61j048k298k621j624n44l22
$$ 196521 195276 193349 190059 185620 180814 176405 173154 171553 170992 169944 167646 165025 163401 162857 162535
53739A62535o13q78j142j238n78P36J558J173L28R0L51K07n38j059o24N56J716
$$ 162535 161922 161044 159902 158664 158086 158822 160380 161553 161881 161971 162322 162529 161991 160932 160308 160864 162580
53722A62580K497L186M020M538M052K648J232M25Q8M2M74J111J000j04q72l5J790
$$ 162580 165077 168263 172283 176821 180873 183521 184753 185178 185266 185308 185782 186893 187893 187789 186917 186882 188672
53705A88672K944K908K386J775J064J035K775N689P585P408O458O230O197M891
$$ 188672 191616 194524 196910 198685 199749 200784 203559 209248 216833 224241 230699 236929 243126 248017
53691B48017K230l66j814k238k233k013j466n22N92J323J218N26M5J30L22K36
$$ 248017 250247 249881 248067 245829 243596 241583 240117 239595 240187 241510 242728 243254 243299 243429 243751 243987
53675B43987L06R92J707J396J64o03n4J039J474J196Q25J82j357l086l191j378
$$ 243987 244293 245285 246992 248388 248552 247949 247895 248934 250408 251604 252429 252611 251254 248168 244977 243599
53659B43599Q0p90k737k946r86R00J365J671L078M514M258K637J505J692K316
$$ 243599 243679 242889 240152 237206 236220 237120 238485 240156 243234 247748 252006 254643 256148 257840 260156
53644B60156K240J107o67k019j689M92L068M422M373L699K830J959J728K388K808
$$ 260156 262396 263503 262836 260817 259128 259620 262688 267110 271483 275182 278012 279971 281699 284087 286895
53629B86895J693k97j020N55L260N287N742M753L151K264K875M131M302K806P02
$$ 286895 288588 288291 287271 287826 291086 296373 302115 306868 310019 312283 315158 319289 323591 326397 327099
53614C27099p35j021j61J438K740L015L131M593O952P737N720K857J807K689L537
$$ 327099 326364 325343 325182 326620 329360 332375 335506 340099 347051 354788 360508 363365 365172 367861 371398
53599C71398L152K000P77l51j040p72R0L52l41q44k24P67P70j77r20j183j857
$$ 371398 374550 376550 377327 376976 375936 375164 375254 375606 375265 374421 374197 374964 375734 375557 374637 373454 371597
53582C71597l045l275j603N07P99q30k383k616k370k826l705l967l230j931p07
$$ 371597 368552 365277 363674 364181 364980 364150 361767 359151 356781 353955 350250 346283 343053 341122 340415
53567C40415j60n54j243j174l47R6l25n90J79J270J605J430J679K337K658K423
$$ 340415 340255 339701 338458 337284 336937 337033 336708 336118 336297 337567 339172 340602 342281 344618 347276 349699
53551C49699J892R94k61r99l86R83J817J962K310L097L566L323K864K593K379
$$ 349699 351591 352585 352324 351325 350939 351922 353739 355701 358011 361108 364674 367997 370861 373454 375833
53536C75833K175K149K083J685J612L158O410R487J0248Q503O228N714P417R565
$$ 375833 378008 380157 382240 383925 385537 388695 395105 404592 414840 423343 429571 435285 442702 452267
53522D52267J0207R648J0133J2735J5638J6494J5579J5248J6635J8420J8914J8181
$$ 452267 462474 472122 482255 494990 510628 527122 542701 557949 574584 593004 611918 630099
53510F30099J7723J8874K1680K4783K6399K5879K4275K3069K2752K2930K3153
$$ 630099 647822 666696 688376 713159 739558 765437 789712 812781 835533 858463 881616
53499H81616K2989K2086K0876K0401K0711K0512J9276J8321J8545J8581J7098
$$ 881616 904605 926691 947567 967968 988679 1009191 1028467 1046788 1065333 1083914 1101012
53488A101012J5588J6448J9140K0858K0577J9725J9064J7815J6160J5705J6597
$$ 1101012 1116600 1133048 1152188 1173046 1193623 1213348 1232412 1250227 1266387 1282092 1298689
53477A298689J6798J5393J4214J4768J5547J4149J0471O262K792M70l71l1m3j879
$$ 1298689 1315487 1330880 1345094 1359862 1375409 1389558 1400029 1406291 1409083 1409553 1409182 1409151 1409108 1407229
53463A407229n404r410j2962j5442j6199j5293j4011j3660j4236j4798j4714j4133
$$ 1407229 1401825 1392415 1379453 1364011 1347812 1332519 1318508 1304848 1290612 1275814 1261100 1246967
53451A246967j3873j5035j7898k0883k1792k0450j8920j8706j9122j9052j8619
$$ 1246967 1233094 1218059 1200161 1179278 1157486 1137036 1118116 1099410 1080288 1061236 1042617
53440A042617j8102j6660j3692j0242p555n237k446NO34j14k00J069K197K017
$$ 1042617 1024515 1007855 994163 983921 976366 971129 968683 968688 969322 969208 969008 970077 972274 974291
53426I74291J539K428M755P131Q562R262R790J0254J0635J1464J3446J6353J8937
$$ 974291 975830 978258 983013 990144 998706 1007968 1017758 1028012 1038647 1050111 1063557 1079910 1098847
53413A098847K0233K0611K1082K2043K3299K4846K6814K8856L0491L1896L3497
$$ 1098847 1119080 1139691 1160773 1182816 1206115 1230961 1257775 1286631 1317122 1349018 1382515
53402A382515L4969L5538L5264L5232L6492L9515M4110M8911N1592N1070M9276
$$ 1382515 1417484 1453022 1488286 1523518 1560010 1599525 1643635 1692546 1744138 1795208 1844484
53391A844484M9162N1205N3502N4956N6157N7044N6256N3666N1253N0234M9241
$$ 1844484 1893646 1944851 1998353 2053309 2109466 2166510 2222766 2276432 2327685 2377919 2427160
53380B427160M6733M3437M0868L8797L5986L2327K8595K4847K0575J6001J1838
$$ 2427160 2473893 2517330 2558198 2596995 2632981 2665308 2693903 2718750 2739325 2755326 2767164
53369B767164Q012L658j752p925j4097j9487k3994k8547l4063l9848m4234m6852
$$ 2767164 2775176 2778834 2777082 2769157 2755060 2735573 2711579 2683032 2648969 2609121 2564887 2518035
53357B518035m8894n0803n1535n0765m9939n0041n0003m8660m6638m4955m3183
$$ 2518035 2469141 2418338 2366803 2316038 2266099 2216058 2166055 2117395 2070757 2025802 1982619
53346A982619m0732l8623l8205l9009l9424l8749l7259l5229l3251l2438l2829
$$ 1982619 1941887 1903264 1865059 1826050 1786626 1747877 1710618 1675389 1642138 1609700 1576871
53335A576871l2667l0715k8121k6346k4622k1428j7418j4551j3041j1561j0048
$$ 1576871 1544204 1513489 1485368 1459022 1434400 1412972 1395554 1381003 1367962 1356401 1346353
53324A346353r939j1627j3763j5220j5994j6146j5567j4941j5236j6015j5779
$$ 1346353 1336414 1324787 1311024 1295804 1279810 1263664 1248097 1233156 1217920 1201905 1186126
53313A186126j4111j2126j0641r302p606n539l146o48J045J260R26J706L808N910
$$ 1186126 1172015 1159889 1149248 1139946 1132340 1126801 1123655 1123007 1124052 1125312 1126238 1127944 1131752 1137662
53299A137662P234Q245R402J0603J2003J4003J6301J8266K0173K2751K5484K6929
$$ 1137662 1144896 1153141 1162543 1173146 1185149 1199152 1215453 1233719 1253892 1276643 1302127 1329056
53287A329056K6857K6482K6285K5295K3126K1107K0418K0227J8715J5231J0842
$$ 1329056 1355913 1382395 1408680 1433975 1457101 1478208 1498626 1518853 1537568 1552799 1563641
53276A563641P202N295M601L307Q9m141p132q025q228r391j1779j4943j8764k2937
$$ 1563641 1570843 1576138 1580739 1584046 1584135 1579994 1572862 1564837 1556609 1547218 1535439 1520496 1501732 1478795
53262A478795k6379k8122k8362k7990k7524k7057k6893k7425k8505k9414k9568
$$ 1478795 1452416 1424294 1395932 1367942 1340418 1313361 1286468 1259043 1230538 1201124 1171556
53251A171556k8982k7990k6622k4601k2144k0484k0854k2839k4452k4262k2870
$$ 1171556 1142574 1114584 1087962 1063361 1041217 1020733 999879 977040 952588 928326 905456
53240I05456k1774k1502k1487k1153k0362j9146j7735j6566j5813j5253j4840
$$ 905456 883682 862180 840693 819540 799178 780032 762297 745731 729918 714665 699825
53229F99825j4627j3919j1685q406o219o262p185p429p599q986j1030j2191j2427
$$ 699825 685198 671279 659594 651188 644969 638707 631522 624093 616494 607508 596478 584287 571860
53216E71860j2848j3565j3862j4016j4791j5515j4795j2951j1707j1518j1286
$$ 571860 559012 545447 531585 517569 502778 487263 472468 459517 447810 436292 425006
53205D25006j0680j0424j0204q629n956m483n419p256q241q603r200r630r053
$$ 425006 414326 403902 393698 385069 379113 374630 369211 361955 353714 345111 335911 326281 317228
53192C17228p801o880o709p139p893q333p685o202n206n378n809n331l851j974
$$ 317228 309427 302547 295838 288699 280806 272473 264788 258586 253380 248002 242193 236862 233011 231037
53178B31037k48P16L51r51j845j577q60p84j428j956j594l46Q22O96p50k052k142
$$ 231037 230789 231505 231856 230905 229060 227483 226623 225839 224411 222455 220861 220515 221337 222033 221283 219231 217089
53161B17089j835k309k955k488j499j666k674k412m57J069O77o69j632k142k079
$$ 217089 215254 212945 209990 207502 206003 204337 201663 199251 198794 199863 200540 199871 198239 196097 194018
53146A94018o41J693K628J030j328k242j735q40K61J332J207k11o67J489M430
$$ 194018 193377 195070 197698 198728 197400 195158 193423 192583 192844 194176 195383 195172 194505 195994 200424
53131B00424N108L442J803J231P21k8J30J384K081J128l43o34L44J398J756J569
$$ 200424 205532 208974 210777 212008 212729 212701 212831 214215 216296 217424 217081 216447 216791 218189 219945 221514
53115B21514J154N18k66o14K36K196L989M325L344K197J300j8k017l843m677m566
$$ 221514 222668 223186 222920 222306 222542 224738 228727 233052 236396 238593 239893 239875 237858 234015 229338 224772
53099B24772l664j831L30J233Q0j979l384l925m201m222l620k538j296J98J812
$$ 224772 221108 219277 219607 220840 220920 218941 215557 211632 207431 203209 199589 197051 195755 195953 197765
53084A97765K628J940L27j046j662j635j210q81j145j578j137l7N9j364k449j599
$$ 197765 200393 202333 202660 201614 199952 198317 197107 196226 195081 193503 192366 192329 192388 191024 188575 186976
53068A86976N4M85j39k39K48k2j191j900j663j536k167k773k560j746p68K90J138
$$ 186976 187030 187515 187376 187137 187385 187363 186172 184272 182609 181073 178906 176133 173573 171827 171059 171349 172487
53051A72487J238P15L93O23R17R80J182J745K262K361K174J911J494Q98M08L34
$$ 172487 173725 174440 174833 175456 176373 177353 178535 180280 182542 184903 187077 188988 190482 191380 191788 192122
53035A92122P37J369J749J540J094J121J486J027p62k664l211k568j855j159L99
$$ 192122 192859 194228 195977 197517 198611 199732 201218 202245 201483 198819 195608 193040 191185 190026 190425
53020A90425K791M583M589L066J182ml1P63J381J047k2j078j658j573o27R22K139
$$ 190425 193216 197799 202388 205454 206636 206632 206601 207364 208745 209792 209770 208692 207034 205461 204834 205756 207895
53003B07895K411K198K058J630N37m01j75P07Q22j06j043j216o39P08K746M479
$$ 207895 210306 212504 214562 216192 216729 216328 216153 216860 217682 217576 216533 215317 214678 215386 218132 222611
52987B22611M701L643K682K420K233J725J172N98k12p19j87O81L60j029j589o03
$$ 222611 227312 230955 233637 236057 238290 240015 241187 241785 241573 240854 240667 241348 241708 240679 239090 238487
52971B38487L57L8n69j63P16R66R24J257J022r79l418l352j58L325M252K837J129
$$ 238487 238844 238882 238313 238150 238866 239832 240756 242013 243035 242056 238638 235286 235128 238453 242705 245542 246671
52954B46671P4q40j783j994j170k19l0k42R4J049J686J277m3j644k783k712j305
$$ 246671 246745 245905 244122 242128 240958 240739 240709 240467 240561 241610 243296 244573 244530 242886 240103 237391 236086
52937B36086K12J95j345k545k070q22m30r81j342j095q39r12j002r18p67m67r9
$$ 236086 236298 236493 235148 232603 230533 229711 229281 228300 226958 225863 225024 224112 223110 222192 221425 220958 220859
52920B20859m63k153m156m618l063q33P41J512J806J783J715J837J673O39o38
$$ 220859 220396 218243 214087 209469 206406 205573 206314 207826 209632 211415 213130 214967 216640 217279 216641
52905B16641q68k32k93j382j742l58J048M38j311j514M62K302J901j96j936k222
$$ 216641 215773 215541 215248 213866 212124 211766 212814 213252 211941 210427 210889 213191 215092 214896 212960 210738
52889B10738j434k96Q89J912K271J553J98n98p9J094J520Q15M4K10R58J270J082
$$ 210738 209304 209008 209897 211809 214080 215633 215831 215233 215154 216248 217768 218583 218627 218837 219795 221065 222147
52872B22147J403K888M802N613M493K194N38Q83K825M490M153J684j479l556l747
$$ 222147 223550 226438 231240 236853 241346 243540 244078 244961 247786 252276 256429 258113 256634 253078 249331
52857B49331k753k116k739l983m417l524k248j824k479l496m098l910k928j535
$$ 249331 246578 244462 241723 237740 233323 229799 227551 225727 223248 219752 215654 211744 208816 207281
52843B07281m95n23j679l261m350m421l600k412j363o70k70P6O72J626K576K927
$$ 207281 206786 206263 204584 201323 196973 192552 188952 186540 185177 184507 184237 184313 184985 186611 189187 192114
52827A92114K453J485M11n63j100p63L13J269J521J439J472J252L44o75r85r98
$$ 192114 194567 196052 196463 195900 194800 194037 194350 195619 197140 198579 200051 201303 201647 200972 199987 198989
52811A98989j749k805k273N85L906N293M504L211K507J749o9k602m303m115k681
$$ 198989 197240 194435 192162 192747 196653 201946 206450 209661 212168 213917 213848 211246 206943 202828 200147
52796B00147j603j629k015j854j411j479j898j671m58R51J767J884J344Q9j269
$$ 200147 198544 196915 194900 193046 191635 190156 188258 186587 186129 187080 188847 190731 192075 192164 190895
52781A90895j466r5J436J383k15j534j077Q01K462K655J584M07q3k35r24k336
$$ 190895 189429 189334 190770 192153 191938 190404 189327 190128 192590 195245 196829 197236 197153 196918 195994 193658
52765A93658l667l957k897q42J531L486M467M281L067J233n09j447j558j506j521
$$ 193658 189991 186034 183137 182295 183826 187312 191779 196060 199127 200360 199851 198404 196846 195340 193819
52750A93819r15O65K079J938N64m55l87L09J524L527N273M736J782r33j191R4
$$ 193819 192904 193569 195648 197586 198150 197695 197308 197617 199141 202668 207941 212677 214459 213526 212335 212429
52734B12429P79O57J018K004K477K187K129K669L001K632J958J068m62k066k123
$$ 212429 213208 213865 214883 216887 219364 221551 223680 226349 229350 231982 233940 235008 234546 232480 230357
52719B30357l33J070j24l158n244m992l563k504j914j225n63m50o81n60q6Q0n8
$$ 230357 230024 231094 230970 227812 222568 217576 214013 211509 209595 208370 207807 207357 206676 206116 206030 206110 206052
52702B06052N12K220L688L091N64j701j935n63Q25J443J609J661J525J222J125
$$ 206052 206564 208784 212472 215563 216127 214426 212491 211928 212753 214196 215805 217466 218991 220213 221338
52687B21338J478K041K267J684L08j065j324l93K61p38k678l428k243p95q26j837
$$ 221338 222816 224857 227124 228808 229116 228051 226727 226334 226595 225857 223179 219751 217508 216713 215887 214050
52671B14050k089j164k27j3K4M02O35K62o1O23K078K958K283M21j287j543l0K217
$$ 214050 211961 210797 210570 210557 210581 210983 211618 211880 211819 212442 214520 217478 219761 220182 218895 217352 217322 219539
52653B19539L623L626L221L532M252M182K959J427K63q44k363l900m443l424j422
$$ 219539 223162 226788 230009 233541 237793 241975 244934 246361 246624 245780 243417 239517 235074 231650 230228
52638B30228J46J79r24j509n51J068J770J322P79P75J018J279J615J605Q05Q4
$$ 230228 230374 230553 229629 228120 227569 228637 230407 231729 232508 233283 234301 235580 237195 238800 239605 239689
52622B39689Q32K444K504K85j828j800j064k152m538n286l361q44L24O25J282
$$ 239689 240521 242965 245469 245754 243926 242126 241062 238910 234372 229086 225725 224881 225205 225830 227112
52607B27112J981J520k04j823k000p64N31N91l95r48j43J210J675Q71n41j826
$$ 227112 229093 230613 230409 228586 226586 225822 226353 226944 226549 225601 225458 226668 228343 229214 228673 226847
52591B26847k341j439O99K572K867J976J120N74M2M8J199K513K314Q15r7L50R85
$$ 226847 224506 223067 223766 226338 229205 231181 232301 232875 232917 232965 234164 236677 238991 239806 239709 240059 241044
52574B41044R78R50J267J133K38l63n4K13l97j088q54j75l6l08l53m25j128k112
$$ 241044 242022 242972 244239 245372 245610 245247 245193 245406 245009 243921 243067 242892 242856 242548 242195 241770 240642 238530
52556B38530k457j944j009O9R86J107K49p35j096j299j922k191r25J275K289J081
$$ 238530 236073 234129 233120 233189 234175 235282 235531 234796 233700 232401 230479 228288 227363 228638 230927 232008
52540B32008j035j978j056P05J742J273j28j227j505j593k061k258j149J021K832
$$ 232008 230973 228995 227939 228644 230386 231659 231531 230304 228799 227206 225145 222887 221738 222759 225591
52525B25591L517L846M828O028N847L481K29j554q73R34J897J637J261J386J427
$$ 225591 229108 232954 237782 243810 249657 253138 253367 251813 250940 251874 253771 255408 256669 258055 259482
52510B59482J019J029K357M383N336M164J532q19j622j295j583l558n982o491
$$ 259482 260501 261530 263887 268270 273606 277770 279302 278483 276861 275566 273983 270425 264443 257952
52496B57952m519k020j005j369j722j291j69J357K520J856j283n157o781n017
$$ 257952 253433 251413 250408 249039 247317 246026 245857 247214 249734 251590 250307 245150 238369 233352
52482B33352j804k3n50j642j013J608M127M420K797J518J949L174L640L106K248
$$ 233352 231548 231525 230975 229333 228320 229928 234055 238475 241272 242790 244739 247913 251553 254659 256907
52467B56907J314L00j52P78K771M404M549L269J454R8k80j07m67j893l608m401
$$ 256907 258221 258521 258369 259147 261918 266322 270871 274140 275594 275692 275412 275305 274838 272945 269337 264936
52451B64936m025l294k910k688j920k83J460J729l70l686n801n509l909k728k336
$$ 264936 260911 257617 254707 252019 250099 249816 251276 253005 252635 248949 243148 237639 233730 231002 228666
52436B28666j984j238l30M68J001J054O17O0l58p87j092o30P07J775J427N0r01
$$ 228666 226682 225444 225114 225582 226583 227637 228254 228314 227956 227169 226077 225447 226154 227929 229356 229406 228505
52419B28505n99O22K090L356M076L992L072J503j90r95k08J366K046J716K436
$$ 228505 227906 228528 230618 233974 238050 242042 245114 246617 246427 245432 245224 246590 248636 250352 252788
52404B52788N723J0252J3468J4500J4025J2152Q349L239j388m566o698q012p971
$$ 252788 258511 268763 282231 296731 310756 322908 331257 334496 333108 328542 321844 313832 305861
52391C05861o596n007m052l466k881k632k995l476l443k819j783n02M67L56o69
$$ 305861 299265 294258 290206 286740 283859 281227 278232 274756 271313 268494 266711 266209 266676 267032 266363
52376B66363j229k50J763L552M738N846P098Q056Q456Q562Q336O916L685k80k697
$$ 266363 265134 264884 266647 270199 274937 280783 287881 295937 304393 312955 321291 328207 331892 331612 328915
52361C28915k479j129j028k663m336m520l511k401j542o41L12J082J690K168K145
$$ 328915 326436 325307 324279 321616 317280 312760 309249 306848 305306 304665 304977 306059 307749 309917 312062
52346C12062J386M60L06J269K954M640N496M946L418K265K283K822K923K817L440
$$ 312062 313448 313908 314214 315483 318437 323077 328573 333519 336937 339202 341485 344307 347230 350047 353487
52331C53487M945O650Q162R613J1007J2098J2860J3449J3775J3726J3538J3443
$$ 353487 358432 365082 373244 382857 393864 405962 418822 432271 446046 459772 473310 486753
52319D86753J3304J3121J3354J4079J4426J3798J3063J3525J5114J6582J7246
$$ 486753 500057 513178 526532 540611 555037 568835 581898 595423 610537 627119 644365
52308F44365J7521J7933J8667J9861K1437K2783K3439K3837K4557K5228K5065
$$ 644365 661886 679819 698486 718347 739784 762567 786006 809843 834400 859628 884693
52297H84693K4007K2420K0163J7179J4381J2537J0763P746M059J489K54j136l182
$$ 884693 908700 931120 951283 968462 982843 995380 1006143 1013889 1017948 1019437 1019691 1018555 1015373
52284A015373m635m859m873n276n076l713k450k356k376j108O27Q17o56j841j430
$$ 1015373 1010738 1005879 1001006 995730 990654 986941 984491 982135 979759 978651 979278 980095 979439 977598 976168
52269I76168j25J003K052L547N086N681N156M500M799O185P985R540J0668J1583
$$ 976168 976043 977046 979098 982645 987731 993412 998568 1003068 1007867 1014052 1022037 1031577 1042245 1053828
52255A053828J2720J4523J6879J8862J9652J9680K0018K0523J9696J6793J2995
$$ 1053828 1066548 1081071 1097950 1116812 1136464 1156144 1176162 1196685 1216381 1233174 1246169
52244A246169R766P165M756K963K277J899P43q97k118l172m798o338o447n529
$$ 1246169 1255935 1263100 1267856 1270819 1273096 1274995 1275738 1274841 1272723 1269551 1264753 1258415 1251968 1246439
52230A246439n579p476j0086j2184j3567j4031j3169j1556j0577j0530j0353r607
$$ 1246439 1240860 1233384 1223298 1211114 1197547 1183516 1170347 1158791 1148214 1137684 1127331 1117724
52218A117724r080q962q155o212m284l368k975k402j873j580j034j99K38N83K387
$$ 1117724 1108644 1099682 1091527 1085315 1081031 1077663 1074688 1072286 1070413 1068833 1067799 1067600 1067838 1068421 1070808
$$ [...]
##END NTUPLES=NMR SPECTRUM
##END=
