##TITLE=AC1431_GUAAH13235_7764268_Js82BZObB1
##JCAMPDX= 6.0         $$ Bruker NMR JCAMP-DX V2.0
##DATA TYPE= NMR SPECTRUM
##DATA CLASS= NTUPLES
##ORIGIN= BRUKER
##OWNER= Administrator
$$ 1.72 TOPSPIN		Version 2.1
$$ 2013-04-16 18:01:29.754 -0700  Administrator@X
$$ Compression mode = diff/dup
##.OBSERVE FREQUENCY= 400.02188249412
##.OBSERVE NUCLEUS= ^1H
##.ACQUISITION MODE= SIMULTANEOUS (DQD)
##.ACQUISITION SCHEME= undefined
##.AVERAGES= 8
##.DIGITISER RES= 22
##SPECTROMETER/DATA SYSTEM= spect
##.PULSE SEQUENCE= zg30
##.SOLVENT NAME= COFFEE_meoh
##.SHIFT REFERENCE= INTERNAL, COFFEE_meoh, 1, 14.98509
##AUDIT TRAIL= $$ (NUMBER, WHEN, WHO, WHERE, PROCESS, VERSION, WHAT)
$$ ##TITLE= Audit trail, TOPSPIN		Version 2.1
$$ ##JCAMPDX= 5.01
$$ ##ORIGIN= Bruker BioSpin GmbH
$$ ##OWNER= Administrator
$$ $$ E:\/data/COFFEE/nmr/AC1431_GUAAH13235_7764268_Js82BZObB1/10/pdata/1/auditp.txt
$$ ##AUDIT TRAIL=  $$ (NUMBER, WHEN, WHO, WHERE, PROCESS, VERSION, WHAT)
(   1,<2013-04-16 18:01:22.176 -0700>,<Administrator>,<X>,<go>,<TOPSPIN 2.1>,
      <created by zg
	started at 2013-04-16 18:00:16.473 -0700,
	POWCHK enabled, PULCHK disabled,
       configuration hash MD5:
       33 CF 6A 21 5C D3 B9 40 6C 15 AA 8D 27 A2 4F 13
       data hash MD5: 64K
       31 B2 15 C8 50 59 FC 9A E0 A1 21 7C 1A 33 72 F1>)
(   2,<2013-04-16 18:01:25.238 -0700>,<Administrator>,<X>,<proc1d>,<TOPSPIN 2.1>,
      <Start of raw data processing
       efp LB = 0 FT_mod = 6 PKNL = 1 PHC0 = 0 PHC1 = 0 SI = 32K 
       data hash MD5: 32K
       F0 FB 6A EC 9B 6B C4 A4 24 2F 2A 88 45 F8 CE B0>)
(   3,<2013-04-16 18:01:25.598 -0700>,<Administrator>,<X>,<proc1d>,<TOPSPIN 2.1>,
      <pk PHC0 = 97.68494 PHC1 = 0 
       data hash MD5: 32K
       0E E9 B7 09 5D 62 C0 8B A1 13 35 44 EA 7E 3C A4>)
(   4,<2013-04-16 18:01:25.816 -0700>,<Administrator>,<X>,<proc1d>,<TOPSPIN 2.1>,
      <abs ABSG = 1 
       data hash MD5: 32K
       88 2A A3 7F 8F B8 9B 05 9B 92 81 DC 15 40 47 88>)
(   5,<2013-04-16 18:01:25.973 -0700>,<Administrator>,<X>,<proc1d>,<TOPSPIN 2.1>,
      <abs ABSG = 2 
       data hash MD5: 32K
       19 83 59 9A 9B AE B9 4E 6E 37 BA 60 E1 4C 3B D7>)
(   6,<2013-04-16 18:01:26.113 -0700>,<Administrator>,<X>,<proc1d>,<TOPSPIN 2.1>,
      <abs ABSG = 3 
       data hash MD5: 32K
       4E 5A C7 6F 72 C3 01 88 28 CE 60 E6 7F 28 F6 CD>)
(   7,<2013-04-16 18:01:26.207 -0700>,<Administrator>,<X>,<proc1d>,<TOPSPIN 2.1>,
      <abs ABSG = 4 
       data hash MD5: 32K
       71 5D E1 4B 71 BA 88 41 63 C3 F0 E4 5F 1F CB 78>)
(   8,<2013-04-16 18:01:26.363 -0700>,<Administrator>,<X>,<proc1d>,<TOPSPIN 2.1>,
      <abs ABSG = 5 
       data hash MD5: 32K
       BC A7 09 85 31 45 02 3E 46 03 14 4A B7 70 88 A0>)
$$ ##END=
$$ 
$$ $$ hash MD5
$$ $$ 56 CF B4 CF 16 88 CE 38 5C 07 9D E2 B7 BC 9B 14
##$RELAX= 
##$RELAX= 
##$RELAX= 
##$RELAX= 
##$RELAX= 
##$RELAX= 
##$RELAX= 
$$ Bruker specific parameters
$$ --------------------------
##$DU= <E:\>
##$EXPNO= 10
##$NAME= <AC1431_GUAAH13235_7764268_Js82BZObB1>
$$ [...]
150 150 150 150 150 150 150 150
##$TP07= 0
##$TPNAME0= <>
##$TPNAME1= <>
##$TPNAME2= <>
##$TPNAME3= <>
##$TPNAME4= <>
##$TPNAME5= <>
##$TPNAME6= <>
##$TPNAME7= <>
##$TPOAL= (0..7)
0.5 0.5 0.5 0.5 0.5 0.5 0.5 0.5
##$TPOFFS= (0..7)
0 0 0 0 0 0 0 0
##$TUNHIN= 0
##$TUNHOUT= 0
##$TUNXOUT= 0
##$USERA1= <user>
##$USERA2= <user>
##$USERA3= <user>
##$USERA4= <user>
##$USERA5= <user>
##$V9= 5
##$VALIST= <valist>
##$VCLIST= <CCCCCCCCCCCCCCC>
##$VD= 0
##$VDLIST= <DDDDDDDDDDDDDDD>
##$VPLIST= <PPPPPPPPPPPPPPP>
##$VTLIST= <TTTTTTTTTTTTTTT>
##$WBST= 2048
##$WBSW= 25
##$XGAIN= (0..3)
0 0 0 0
##$XL= 0
##$YL= 0
##$YMAX_a= 644596
##$YMIN_a= -548339
##$ZGOPTNS= <>
##$ZL1= 120
##$ZL2= 120
##$ZL3= 120
##$ZL4= 120
##$ABSF1= 14.98509
##$ABSF2= -5.573092
##$ABSG= 5
##$ABSL= 3
##$ALPHA= 0
##$AQORDER= 0
##$ASSFAC= 0
##$ASSFACI= 0
##$ASSFACX= 0
##$ASSWID= 0
##$AUNMP= <proc_prof1d_extract_pilot.lims>
##$AXLEFT= 0
##$AXNAME= <>
##$AXNUC= <1H>
##$AXRIGHT= 0
##$AXTYPE= 0
##$AXUNIT= <>
##$AZFE= 0.1
##$AZFW= 0.1
##$BCFW= 0
##$BC_mod= 0
##$BYTORDP= 0
##$COROFFS= 0
##$CY= 15
##$DATMOD= 1
##$DC= 0
##$DFILT= <>
##$DTYPP= 0
##$F1P= 0
##$F2P= 0
##$FCOR= 0.5
##$FTSIZE= 32768
##$FT_mod= 6
##$GAMMA= 0
##$GB= 0
##$INTBC= 1
##$INTSCL= 1
##$ISEN= 128
##$LB= 0
##$LEV0= 0
##$LPBIN= 0
##$MAXI= 10000
##$MC2= 0
##$MEAN= 0
##$ME_mod= 0
##$MI= 0
##$NCOEF= 0
##$NC_proc= -8
##$NLEV= 6
##$NOISF1= 0
##$NOISF2= 0
##$NSP= 0
##$NTH_PI= 0
##$NZP= 0
##$OFFSET= 14.98509
##$PC= 1
##$PHC0= 97.68494
##$PHC1= 0
##$PH_mod= 1
##$PKNL= yes
##$PPARMOD= 0
##$PPDIAG= 0
##$PPIPTYP= 0
##$PPMPNUM= 2147483647
##$PPRESOL= 1
##$PSCAL= 4
##$PSIGN= 0
##$PYNMP= <proc.py>
##$REVERSE= no
##$SF= 400.02
##$SI= 32768
##$SIGF1= 0
##$SIGF2= 0
##$SINO= 400
##$SIOLD= 32768
##$SPECTYP= <>
##$SREGLST= <1H.CDCl3>
##$SSB= 0
##$STSI= 32768
##$STSR= 0
##$SW_p= 8223.68421052631
##$SYMM= 0
##$S_DEV= 0
##$TDeff= 65536
##$TDoff= 0
##$TI= <>
##$TILT= no
##$TM1= 0
##$TM2= 0
##$TOPLEV= 0
##$USERP1= <user>
##$USERP2= <user>
##$USERP3= <user>
##$USERP4= <user>
##$USERP5= <user>
##$WDW= 1
##$XDIM= 32768
##$YMAX_p= 462498205
##$YMIN_p= -654533
##$CURPLOT= <Network HP LaserJet P1505>
##$CURPRIN= <$Network HP LaserJet P1505>
##$DFORMAT= <normdp>
##$LAYOUT= <+/1D_H.xwp>
##$LFORMAT= <normlp>
##$PFORMAT= <normpl>
##$SURQMSG= 1
$$ End of Bruker specific parameters
$$ ---------------------------------
##NTUPLES= NMR SPECTRUM
##VAR_NAME=  FREQUENCY,     SPECTRUM/REAL,   SPECTRUM/IMAG
##SYMBOL=    X,             R,               I
##VAR_TYPE=  INDEPENDENT,   DEPENDENT,       DEPENDENT
##VAR_FORM=  AFFN,          ASDF,            ASDF
##VAR_DIM=   32768,         32768,           32768
##UNITS=     HZ,            ARBITRARY UNITS, ARBITRARY UNITS
##FACTOR=    0.250966925370066, 1,           1
##FIRST=     8223.43324360094, -229214,      -222251
##LAST=      0,             -40603,          -195465
##MIN=       0,             -654533,         0
##MAX=       8223.43324360094, 462498205,    0
$$ Real data points
##PAGE= N=1
##DATA TABLE= (X++(R..R)), XYDATA
$$ [...]
$$ plain form
19550 15180 -66973 -84853 -91594 -110787 185074 -3255 -356362 161707 74296 -20630 220398
19538 1375 -190269 -13297 -55787 -194367 -51531 -54087 -46225 -183589 -52637 -48173 48325 -319242
19525 -80622 120548 -43077 102630 189210 6602 -23226 63558 237343 -391837 62171 24863
19513 -315400 107854 -10274 170928 146686 -342124 -3483 -124701 -20923 250136 -218902
19502 -234932 -40629 -455077 -158128 122404 -46661 -390863 -292496 -150497 -100969 -243418
19492 -243418 60036 22007 136719 -207625 130748 75324 -53131 144292 -65236 -69239 -92741
19481 -92741 -31311 -199522 -75402 -90316 -56920 -330965 -321555 -285498 428841 -263492 119064
19469 23136 -255084 223114 -63202 -526895 -95538 -188906 -187689 152790 94324 -136595 -297558
$$ packed form
19550A5180f6973j7880o741j9193A85074c255l53107A61707G4296b0630B20398
19538A375a90269a3297m2490j38580e1531k556P862j37364e2637M464D8325c19242
19525h0622A20548d3077A02630Q6580F602b3226F3558J73785c91837F2171B4863
19513c15400A07854a0274A70928k4242c42124c483j21218b0923B50136b18902
19502b34932d0629m14448a58128A22404d6661l44202R8367J41999M9528j42449
19492b43418F0036B2007J14712b07625A30748n5424e3131A44292f5236m003k3502
19481i2741c1311j68211g5402j4914L3396k74045R410L6057D28841b63492A19064
19469B3136b55084B23114f3202m63693i5538r3368J217A52790n8466a36595j60963
$$ plain form
19458 -297558 -242688 -214893 -64485 -188240 24590 -80402 45506 -46248 74098 -424069 19321
19446 -66632 -233610 -138342 -152764 -106182 -238675 -78021 -48881 -49447 270102 -11127 51101
19434 92753 -42133 -112943 94896 -87596 -410344 -130563 -119787 -331139 -63261 283299 172208
19423 172208 -185214 -157436 -79130 -129175 95743 -200045 -79115 -1146 -263274 -203758 -274077
19412 -274077 -203937 77049 16925 -87276 116597 -164841 -165416 43953 48578 198706 70615
19400 7228 16001 -57477 2241 11943 64771 -151458 -155566 -192501 -121377 111767 84558 99960
19388 99960 -109085 89288 148416 -275850 153010 -14142 -218657 -196177 28969 10114 69575
19377 69575 122056 84687 -232462 164227 -94941 -41920 -114955 121244 86851 -215606 -129766
$$ packed form
19458b97558N4870K7795f4485j23755B4590h0402D5506d6248G4098d24069A9321
19446f6632j66978R5268j4422M6582j32493g8021K9140n66B70102a1127E1101
19434I2753d2133p0810I4896h7596l22748a30563J0776k11352f3261B83299j11091
19423A72208a85214K7778P8306n0045I5743b00045g9115a146k62128N9516p0319
19412b74077P0140G7049A6925h7276A16597a64841n75D3953M625J50128G0615
19400G228Q773e7477B241R702N2828a51458m108l6935P1124A11767k7209J5402
19388I9960a09085H9288N9128b75850A53010a4142k04515K2480B8969A0114N9461
19377F9575N2481l7369b32462A64227i4941d1920p3035A21244l4393b15606Q5840
$$ plain form
19366 -129766 -127873 44404 -196774 121328 -145057 -33910 67717 -21890 -109337 -140463 -272953
19355 -272953 58570 -37315 -170674 256518 168196 -231785 -119969 273792 -51569 -21087
19344 1118 -175026 -86949 60812 50928 36825 -386957 -297942 203282 157215 -51303 -48083 -295257
19332 -295257 -366487 -97704 -21889 58531 440496 -46678 -179392 -141113 -120942 -13914 -483643
19321 -483643 122623 -295846 306787 266442 39063 1919 -181077 124244 -122658 -149642
19311 -149642 -195274 -210329 -69221 -54848 -171107 -149755 5333 -6228 -87617 93955 86783 94203
19299 94203 -86809 140495 -230367 -12552 -237490 30245 -584298 -17704 -54573 -261843 -179404
19288 -179404 -202358 -201673 392935 66791 142610 -128005 -118534 64404 40920 -146517 -361678
$$ packed form
19366a29766J893D4404a96774A21328a45057c3910F7717b1890q7447l1126j32490
19355b72953E8570c7315j33359B56518q8322b31785J11816B73792e1569b1087
19344A118a75026h6949F0812r884j4103c86957Q9015B03282m6067e1303L220k47174
19332b95257p1230i7704b1889E8531L81965d6678j32714L8279K0171a3914m69729
19321d83643A22623b95846C06787m0345C9063A919a81077A24244a22658k6984
19311a49642m5632j5055f9221J4373j16259K1352E333f228q1389I3955p172P420
19299I4203h6809A40495b30367a2552k24938C0245e84298a7704l6869k07270Q2439
19288a79404k2954O85C92935F6791P5819a28005R471F4404k3484a46517k15161
$$ plain form
19277 -361678 -166187 -26079 -253762 -89791 -64149 -162105 174817 -278845 -77099 10899 -28213
19265 45903 275707 -184907 255938 33900 133871 -2385 -260193 7714 -73104 -65586 -120314
19254 -120314 20946 -261910 -344986 -70853 -270325 26717 -141377 140816 -27935 187407
19243 90060 132695 -103974 69295 -61557 114225 -71033 -25693 -27208 -428781 180388 123589
19232 123589 129886 -27295 100851 -173562 -54726 -174380 -284272 -110511 154901 -267192
19221 -194941 -85245 -218182 22142 -88578 -404188 -374594 -53438 234660 -142573 -45676 -213862
19210 -213862 190646 -152537 -163474 12180 28953 -114170 -63264 120766 66344 -325414
19199 -505120 -189921 -107434 68725 192754 73816 143326 -42627 -102725 86803 -72335 132144
$$ packed form
19277c61678a66187b6079k27683h9791K5642r7956A74817b78845g7099A0899b8213
19265D5903K29804a84907B55938C3900R9971b385k57808G714g3104P518n4728
19254a20314B0946b61910q3076g0853j99472B6717a41377A40816b7935A87407
19243I0060M2635a03974F9295f1557A14225g1033b5693j515m01573A80388n6799
19232A23589O297b7295A00851a73562e4726j19654j09892a10511A54901b67192
19221a94941h5245j32937B2142h8578l15610K9594e3438B34660a42573d5676j68186
19210b13862A90646a52537j0937A2180J6773a14170N0906A20766n4422c25414
19199e05120a89921Q2487F8725J24029G3816O9510d2627o0098H6803g2335A32144
$$ plain form
19187 -238559 111725 -197591 37007 246784 148939 -123979 -17575 -58353 -216744 -99561
19176 -115508 -147222 132051 94 -221959 -107327 89658 -37296 -179905 -129882 109672 -67201
19164 -100844 -201843 -323828 -152449 44422 144210 -52415 -70107 153375 -325453 -207540
19154 -207540 284960 -177669 75696 185750 292748 49469 -127646 -13555 -247647 -103150
19143 -208539 -132024 19738 16196 -252205 -120475 -171824 -49371 -151496 32673 -75195 166721
19131 -140004 -17852 -255923 359162 -148505 -346071 -115188 10205 -126213 -95744 -98558
19121 -98558 -184611 181706 114682 -97354 -82364 86509 160398 -1810 76393 15425 -272279
19109 181537 -26305 -227548 -42845 -67601 183807 66206 112152 -122449 -111575 -118454 33282
$$ packed form
19187b38559A11725a97591C7007K09777r7845a23979a7575m0778j58391i9561
19176a15508l1714A32051I4b21959a07327H9658c7296j42609N0023A09672f7201
19164a00844j00999j21985a52449D4422R9788e2415j7692A53375c25453J17913
19154b07540B84960a77669G5696J10054J06998D9469a27646a3555k34092a03150
19143b08539P6515A9738l542b52205a20475n1349d9371j02125C2673g5195A66721
19131a40004a7852k38071C59162a48505j97566a15188A0205a26213L0469k814
19121i8558q6053A81706o7024i7354J4990H6509P3889a810G6393A5425b72279
19109A81537b6305k01243d2845k4756A83807F6206M5946a22449J0874o879C3282
$$ plain form
19097 -103787 280750 -112063 -106247 -33825 -202325 189067 -108567 196416 -36335 -56861
19087 -56861 -477990 162293 -34907 159363 -288402 109832 -14623 -194516 -238480 50201
19076 -110831 254157 156334 15461 -184682 -155804 -203609 -269993 116442 328750 145576
19065 -117262 133263 -183225 10532 -303287 -308317 -143824 -77419 -298008 -134022 -467735
19055 -467735 79138 -69484 14773 -267981 -36734 138393 -99073 -404079 -219821 -226941 -478474
19044 -478474 -314522 47748 -147102 81889 -43179 -85457 -196600 236038 -4138 -8239 -113892
19033 -113892 450992 -104409 -41572 73882 -92632 16623 -260405 -114636 221441 68530
19022 -7806 127128 -116959 27238 -42598 128648 418752 81024 -92296 140940 -9802 -37494
$$ packed form
19097a03787B80750a12063N816c3825j68500A89067a08567A96416c6335k0526
19087e6861m21129A62293c4907A59363b88402A09832a4623j79893m3964E0201
19076a10831B54157r7823A5461a84682K8878m7805o6384A16442K12308A45576
19065a17262A33263a83225A0532c03287n030a43824O6405k20589a34022l33713
19055d67735G9138f9484A4773b67981c6734A38393i9073l05006J84258p120k51533
19044d78474J63952D7748a47102H1889d3179m2278j11143B36038d138m101j05653
19033a13892D50992a04409d1572G3882i2632A6623b60405a14636B21441F8530
19022g806A27128a16959B7238d2598A28648K90104H1024i2296A40940i802k7692
$$ plain form
19011 -37494 -107701 -299936 21020 -266259 -175917 100757 -46852 208796 -29158 -434347 -219885
19000 -219885 -144388 12228 -228960 -55627 7305 -103319 17728 -157619 -327137 -173075 46583
18988 -6990 202884 -6784 92261 -486649 -328091 24178 -34484 -131518 31248 187237 -335615
18976 -45559 208437 -24333 90841 -122460 -355692 7558 70934 -13462 -77826 -87218 -205273
18965 -205273 -140700 -182558 -82798 -212151 -57814 5199 -285642 -141377 -172495 820 70946
18954 70946 165822 49280 39880 -76473 34756 -202310 136549 -113360 -141354 103561 -144830
18942 379569 -117575 24413 10676 30135 -10696 533130 -124855 -171489 98168 -43918 187186
18930 -157526 -275357 157324 -20140 -256578 -80358 221378 203027 -144594 -392159 246450
$$ packed form
19011c7494p0207j92235B1020b66259R0342A00757d6852B08796b9158m05189K14462
19000b19885P5497A2228b28960e5627G305a03319A7728a57619j69518J54062D6583
18988f990B02884f784I2261d86649J58558B4178c4484r7034C1248J55989c35615
18976d5559B08437b4333I0841a22460k33232G558O3376a3462o4364r392j18055
18965b05273O4573m1858h2798j29353e7814E199b85642a41377l1118H20P0126
18954G0946R4876D9280r400g6473C4756b02310A36549a13360k7994A03561a44830
18942C79569a17575B4413A0676J9459a0696E33130a24855m6634I8168d3918A87186
18930a57526j17831A57324b0140k36438h0358B21378j8351a44594k47565B46450
$$ plain form
18919 -12618 124577 39998 207860 -234168 -175973 -347359 -6879 -140385 -264251 -147755
18909 -147755 -111055 -19430 82324 277661 -175308 60409 -182236 -205398 -46066 -23063 -27298
18898 -27298 -193395 -150941 92473 -236399 257115 -98593 -81428 -330815 -234425 240810 54549
18886 187583 -84403 -314447 87124 227294 -132633 -12937 46352 171940 -577117 -95924
18875 -85242 28479 99236 -307921 -39920 121187 -103551 -164920 3809 -214348 -209046 -150380
18864 -150380 -13857 120738 291078 -32443 70846 -116281 213151 -27439 44690 -188187
18853 -137074 -13266 107597 -80556 -50051 260649 -94514 -26606 -36246 114935 -79240 29212
18841 -238590 26682 -135381 -38413 196388 5348 -166400 -15202 -86901 289891 -177769 -312403
$$ packed form
18919a2618A24577C9998J67862b34168N8195j71386f879j33506j23866J16496
18909a47755L6700a9430H2324J95337a75308F0409a82236k3162d6066K3003m235
18898b7298j66097M2454I2473b36399B57115i8593J7165k49387R6390B40810E4549
18886A87583h4403k30044H7124J40170a32633a2937D6352J25588e77117i5924
18875h5242B8479P0757c07921c9920A21187a03551o1369C809b14348N302N8666
18864a50380a3857A20738J70340c2443G0846a16281B13151b7439D4690a88187
18853a37074a3266A07597h0556L0505B60649i4514b6606r640A14935g9240B9212
18841b38590B6682a35381c8413A96388E348a66400a5202p1699B89891a77769j34634
$$ plain form
18830 -312403 11144 -15701 -200191 -41887 -49600 52728 -22379 -37055 -135861 -280898 285556
18818 225240 149393 140623 90680 143055 306513 -119340 107235 96070 280653 -221438 -279217
18807 -279217 -341008 -123418 -10130 -266974 -264335 123519 -190532 -189806 163753 178308 -173624
18795 307797 -268569 -87552 -29356 -41640 -259753 -210147 202882 -3943 264358 283071 71700
18783 12806 -59019 104461 -72606 169196 106204 -344024 -439960 11723 -71468 151644 -171304
18771 112237 -97220 145650 131467 33658 -189328 28707 -59618 -271713 17204 -495927 71555
18759 -94761 -333920 49497 -141560 333634 220632 176120 -134197 -25381 -90065 -300315
18749 -300315 -187784 111019 -130427 75790 52167 145175 -135630 127566 -138985 -270473
$$ packed form
18830c12403A1144a5701j84490d1887p713E2728b2379j4676r8806j45037B85556
18818B25240p5847q770m9943N2375J63458a19340A07235j1165J84583b21438n7779
18807b79217o1791a23418a0130k56844K639A23519a90532P26A63753J4555a73624
18795C07797b68569h7552b9356j2284k18113M9606B02882c943B64358J8713G1700
18783A2806e9019A04461g2606A69196o2992c44024r5936A1723g1468A51644a71304
18771A12237i7220A45650j4183C3658a89328B8707e9618k12095A7204d95927G1555
18759i4761k39159D9497a41560C33634j13002m4512a34197b5381o4684k10250
18749c00315J12531A11019a30427G5790k3623R3008a35630A27566a38985j31488
$$ plain form
18739 -270473 -197003 -50923 203267 147841 -83766 71518 236055 -195843 24313 150092 37917
18727 -221757 -96189 -24908 117237 176995 7753 157228 6114 -177556 -213177 170565 223159
18716 223159 -112761 -232053 -56446 -195062 -169 131420 231875 -36191 -38217 -321777 -88683
18704 83839 -144138 -260084 141515 195974 -55499 124175 24766 -223721 -194601 -217656 -192868
18693 -192868 -328777 -42594 75802 -212027 253937 -70022 -28573 45425 134163 -71968 -213285
18682 -213285 -244809 -160463 153001 234140 -131815 223769 -172589 183804 -59546 -3363 -179730
18671 -179730 -283288 19349 -131476 -120652 -139833 -122685 156782 83543 -196742 47061 -249925
18659 -168548 -74910 -178567 137475 -52084 305956 -52238 -84606 100398 54743 27257 9362
$$ packed form
18739b70473P3470e0923B03267n5426h3766G1518J64537a95843B4313J25779C7917
18727b21757i6189b4908A17237N9758G753J49475F114a77556l5621A70565N2594
18716B23159a12761j19292e6446j38616a69A31420J00455c6191k026k83560h8683
18704H3839a44138j15946A41515N4459e5499A24175B4766b23721K9120k3055K4788
18693a92868j35909d2594G5802b12027B53937g0022b8573D5425Q8738g1968j41317
18682b13285l1524Q4346A53001Q1139a31815B23769a72589A83804e9546c363j76367
18671a79730j03558A9349a31476J0824j9181J7148A56782p3239a96742D7061b49925
18659a68548g4910j03657A37475e2084C05956e2238l2368A00398m5655B7257I362
$$ plain form
18647 -343772 -126836 -191843 60576 24883 -145952 81717 28114 -175491 -206324 -447957 107596
18635 50277 -166472 6246 -34071 -17670 191977 46974 -104563 -368483 -103178 -4883 31524
18623 -217650 88411 -107847 104605 -249119 -167287 6948 142640 -97920 -27558 -745 -166198
18612 -166198 -192847 -119209 -193511 -122165 -182470 -272419 -70237 -110802 -219935 223323 100427
18600 -168477 -101089 -198122 -115978 16731 43639 -523382 40539 -314630 147812 -160623 132199
18588 -184867 25928 -186676 -241518 71367 172977 95211 -45282 -365431 -14798 50436 61283
18577 61283 -113764 -253833 150186 -182926 -63461 -219379 -33259 -195866 -323830 -135632
18566 127412 38426 -215716 -258958 -272984 59676 -363061 -176364 -136430 -188352 -57386 -534775
$$ packed form
18647c43772a26836o5007F0576B4883a45952H1717B8114a75491l0833k41633A07596
18635E0277a66472F246c4071J6401A91977D6974a04563k63920a03178d883C1524
18623b17650H8411a07847A04605b49119Q1832F948J35692i7920b7558g45j65453
18612a66198k6649P3638p4302P1346o0305q9949g0237m0565j09133B23323A00427
18600a68477O7388r7033Q2144A6731K6908e23382D0539c14630A47812a60623A32199
18588a84867B5928a86676n4842G1367J01610p7766d5282l20149a4798E0436J0847
18577F1283a13764j40069A50186a82926f3461j55918c3259j62607j27964a35632
18566A27412C8426b15716m3242j4026E9676c63061a76364L9934n1922e7386m77389
$$ plain form
18555 -534775 -226868 -81499 -106819 52402 266333 407060 176070 -247738 -187224 -32958
18544 94718 27073 -169051 365086 -22632 -60202 -95572 62265 -345745 -59886 -186731 -342645
18533 -342645 -13410 -76475 -62630 -46458 -24989 -207112 149917 -61024 -226856 -136604 -49859
18521 8902 49176 34064 -83776 -285216 -241819 236801 -143605 -20665 53598 -217787 -171391
18510 -171391 39632 -61880 85382 178713 330206 -255581 126641 165090 -173990 -61059 -220608
18499 -220608 -322515 -233146 64932 -220338 -61144 308174 -117778 -1872 -64908 -137396 77737
18487 -251392 -51660 -9809 -200229 81052 -37414 361015 306337 56617 115964 -119510 11830
18475 14066 263840 -88233 -494503 93197 139169 262521 -44653 149121 76725 -83427 121098
$$ packed form
18555e34775b26868h1499k5320E2402K13931J40727A76070b47738O0514c2958
18544I4718B7073a69051C65086b2632l7570l5370F2265c45745e9886j26845j55914
18533c42645a3410o3065J3845J6172K1469j82123A49917f1024j65832R0252d9859
18521H902M0274j5112h3776k01440M3397B36801a43605b0665E3598b17787M6396
18510a71391C9632f1880H5382R3331J51493b55581A26641L8449a73990f1059j59549
18499b20608j01907Q9369F4932b20338f1144C08174a17778a872o3036p2488G7737
18487b51392e1660i809j90420H1052c7414C61015n4678E6617N9347a19510A1830
18475A4066K49774h8233m06270I3197M5972J23352d4653A49121p2396h3427A21098
$$ plain form
18463 -87367 5413 51820 -25829 -147053 -283849 -135962 5131 124786 -334523 -108164 124984
18451 168860 53609 -191746 -37944 273292 -138071 -255017 114746 63901 -244953 -125252
18441 -125252 -195856 -136946 41875 -97524 -119487 -209026 -96591 -134791 -105225 63429 183535
18430 183535 -511705 -178492 -34037 -40241 -85584 46101 6581 -205436 110391 -279602 -88121
18418 84285 -228116 45379 -201205 11692 302316 315057 137678 55964 37136 -152005 -160930
18407 -160930 40478 96529 -75450 -401220 -13890 -54954 242795 35321 -40271 -373500 -79237
18395 178937 -106343 -102264 129380 -231510 -23824 27260 87393 -41317 -32662 44650 -262522
18383 -275389 -292392 -113540 -20101 15110 53345 9241 272436 115944 -36793 -5514 -203205
$$ packed form
18463h7367E413M6407b5829j21224j36796a35962E131J19655c34523a08164A24984
18451A68860E3609a91746c7944B73292a38071j16946A14746n0845b44953J19701
18441a25252p0604N8910D1875i7524k1963q9539i6591l8200K9566F3429J20106
18430A83535e11705a78492c4037o204m5343D6101F581b05436A10391b79602h8121
18418H4285b28116D5379b01205A1692K90624J2741A37678E5964j8828a52005q925
18407a60930D0478N6051g5450l25770a3890m1064B42795C5321d0271l33229g9237
18395A78937a06343M079A29380b31510b3824B7260O0133d1317Q655D4650b62522
18383b75389j7003a13540b0101A5110L8235I241K63195A15944c6793e514j97691
$$ plain form
18372 -203205 31914 -278124 220179 58512 76948 48230 -97675 -327247 220310 -229018
18361 26470 7326 -107996 -147726 144263 23655 -175676 -275143 -102268 192649 -142982 31347
18349 -164987 26908 -333899 204556 155957 318213 35728 -100261 106419 -69671 -333757
18339 -333757 -70383 323665 -253716 -220925 -37330 -52579 -13843 117940 65033 -86269 -94874
18328 -94874 -137908 -255360 -29665 -33968 -24101 33435 -313584 -140197 -155345 4920 131636
18317 131636 -183853 -10541 41517 16130 -109492 -17158 -101603 46491 592922 -73603 158974
18305 147270 -45440 -95393 -110163 78987 -54141 96065 85869 -92981 -356590 -59857 -122554
18294 -122554 109010 -103165 6641 -34167 50428 -117247 -306078 75877 -26090 -116964 -185834
$$ packed form
18372b03205C1914b78124B20179E8512J8436k8718i7675k29572B20310b29018
18361B6470G326a07996l9730A44263B3655a75676r9467a02268A92649a42982C1347
18349a64987B6908c33899B04556m8599J62256C5728a00261A06419f9671k64086
18339c33757g0383C23665b53716L2791c7330j5249a3843A17940n2907h6269q605
18328i4874m3034j17452b9665m303R867C3435c13584a40197j5148D920J26716
18317A31636a83853a0541D1517A6130a09492a7158q4445D6491N46431g3603A58974
18305A47270d5440m9953j4770G8987e4141I6065j0196i2981k63609e9857o2697
18294a22554A09010a03165F641c4167E0428a17247j88831G5877b6090r0874o8870
$$ plain form
18283 -185834 4628 -248056 211246 -269017 178859 -197397 -142043 -153310 125760 124847 -32823
18271 -61903 -130932 144209 -204609 -274243 -144793 -151251 137451 -56178 -1198 315039 183322
18260 183322 131388 292899 1558 4714 -119181 203950 -173791 172976 -313458 5026 -85708
18248 106205 149407 -254423 49314 -7439 -179486 -127549 7062 214926 -16337 -178280 333870
18236 -445526 173756 154690 116639 164831 -270813 214086 -308845 -371307 177407 181642 -377600
18224 123606 -18637 126590 -123447 -226965 55611 -294228 132370 -37230 -99317 74614
18213 -218504 131168 62188 146771 -259220 -78925 -351282 -54841 131325 222906 -215752
18202 -237694 -176251 -110524 137391 65118 -3969 -211536 -284182 136952 -51160 199661 64924
$$ packed form
18283a85834D628b48056B11246b69017A78859a97397N5354j1267A25760r13c2823
18271f1903o9029A44209b04609o9634J29450o458A37451e6178a198C15039j31717
18260A83322n1934J61511A558L156a19181B03950a73791A72976c13458E026h5708
18248A06205M3202b54423D9314g439j72047N1937G062K07864a6337j61943C33870
18236d45526A73756j9066l8051M8192b70813B14086c08845o2462A77407M235c77600
18224A23606a8637A26590a23447j03518E5611b94228A32370c7230o2087G4614
18213b18504A31168F2188Q4583b59220g8925k72357e4841A31325R1581b15752
18202b37694O1443O5727A37391F5118c969k07567p2646A36952e1160A99661F4924
$$ plain form
18190 -3993 296347 -306186 -237044 -138827 -162391 187448 -128026 -73760 111411 282317 117823
18178 176120 -142216 -108773 -13919 -253482 -9299 -327344 -110559 -41034 -81727 -397395 10654
18166 -61012 -126116 25385 273529 58471 15467 283736 292755 151110 261539 -43408 123014
18154 -9544 -216784 -78885 58005 95270 364089 -282815 106201 -118474 -612 122489 -283066
18142 -552203 -82330 238032 12898 57622 -126519 -299068 4355 192276 -29701 -149000 66375
18130 -428217 56272 -189601 -6709 82207 -149801 -92220 15369 -263115 -203124 190481 476239
18119 476239 220809 166169 26532 21243 146029 -125380 -423524 -202517 -16435 45876 326530
18108 326530 -120018 -206903 128127 19102 -136261 -132830 39505 140798 -90071 -196504 187848
$$ packed form
18190c993B96347c06186O9142R8217k3564A87448a28026N4266A11411J70906A17823
18178A76120a42216L3443a3919k39563i299l18045a10559d1034m0693l15668A0654
18166f1012o5104B5385K48144E8471A5467K68269R019j41645J10429d3408A23014
18154i544k07240g8885E8005L7265K68819b82815A06201a18474f12A22489b83066
18142e52203h2330B38032A2898M4724a26519j72549D355J87921b9701j19299F6375
18130d28217E6272a89601f709H2207a49801N7581A5369b63115N9991A90481K85758
18119D76239B20809n4640B6532n289J24786a25380k98144b02517a6435D5876K80654
18108C26530a20018q6885A28127A9102a36261L431C9505J01293i0071j06433A87848
$$ plain form
18096 -96677 113874 -195641 209616 51875 4689 -227080 -285979 -179258 347036 -282963
18085 177811 -205585 139590 103186 -123089 -186167 65369 -123077 37422 -265109 240993
18074 -78060 45266 -41506 -205851 -279796 -313440 -270853 -128713 -76914 -8940 -59997 69532
18062 -41985 -42965 23968 -65381 164546 -3670 -401206 -62212 -87125 143246 -233709 -329437
18051 -329437 -53381 186703 142714 -509314 28409 -362027 -48564 227327 -107250 50932
18040 370250 203512 -317980 -45003 307294 -203913 18215 -392016 52527 -134495 -49600
18029 210617 -48968 79485 -8467 161391 143042 -85957 12207 85865 241291 -218217 311842
18017 282524 -23418 -122207 72190 -185627 160484 229265 25616 274764 -46140 -105805 -100432
$$ packed form
18096i6677A13874a95641B09616E1875D689b27080n8899J06721C47036b82963
18085A77811b05585A39590l6404a23089o3078F5369a23077C7422b65109B40993
18074g8060D5266d1506j64345p3945l3644M2587a28713N1799h940n1057F9532
18062d1985r80B3968f5381A64546c670l97536f2212k4913A43246b33709r5728
18051c29437e3381A86703m3989e09314B8409c62027d8564B27327a07250E0932
18040C70250j66738c17980d5003C07294b03913A8215c92016E2527a34495d9600
18029B10617d8968G9485h467A61391j8349h5957A2207P3658J55426b18217C11842
18017B82524b3418r8789G2190a85627A60484O8781B5616K49148d6140n9665N373
$$ plain form
18006 -100432 -208230 72625 -40070 -102529 2757 232194 -28347 -21557 -16763 27608 29739 -99788
17993 361564 188947 124125 -430084 -63688 -133484 -196762 -106288 -4028 -171548 -43705 164787
17981 -144990 -161048 19505 -261646 -195801 196045 7952 91263 -62838 -1928 49744 130413
17970 130413 -100451 -266801 -172641 -96749 -103542 -120920 -1425 -16308 86845 -187739 173354
17958 196065 -33607 96458 -10738 120928 180048 47614 -51729 -29353 -59239 23711 -83562
17946 187010 149212 -72034 -178194 -51572 -179196 -239461 -54742 38786 193480 198293 -22033
17934 -247978 -106710 -22789 -64048 79755 -92587 94491 -21176 -345413 157473 -152994 186551
17922 31854 -146134 -62391 -44582 220242 -52275 -117868 199391 230929 110197 129978 -234977
$$ packed form
18006a00432j07798G2625d0070o2459B757K29437b8347O790M794B7608K131i9788
17993C61564j72617o4822d30084f3688o9796o3278R0474d028j67520d3705A64787
17981a44990j6058A9505b61646O5845A96045G952Q3311f2838a928D9744Q0669
17970A30413a00451j66350R4160P5892o793j7378a425j4883H6845a87739A73354
17958A96065c3607I6458a0738A20928N9120D7614e1729K2376k9886B3711h3562
17946A87010l7798g2034j06160e1572j27624o0265e4742C8786J54694M813b2033
17934b47978a06710b2789m1259G9755i2587I4491b1176l24237A57473a52994A86551
17922C1854a46134f2391J7809B20242e2275o5593A99391L1538A10197J9781b34977
$$ plain form
17910 186216 -31095 61690 86146 -29429 160778 -213102 -25446 9804 55666 111529 1231
17898 126626 85405 -73830 202724 -141199 -54090 201922 245453 33359 37051 59780 195760
17887 195760 264596 200847 -224160 -15265 291276 110732 223878 -297340 -255121 -654533
17877 -654533 124616 107340 -105637 -128086 -84574 -100627 5288 78762 371565 93571 48726
17866 48726 -53406 -305319 180231 60540 -132390 -16551 208449 34286 -199929 -177875 42626
17854 -101691 1393 78521 -266331 -291485 78818 118677 -6655 52721 -32233 -5039 20045 -7517
17841 104256 50562 -92542 -2126 -311129 25096 -29566 -68406 266708 259816 -52331 -181983
17830 -181983 134198 -16574 232516 -171212 40111 -198856 124904 -232584 -72185 -30659
$$ packed form
17910A86216c1095F1690K4456b9429A60778b13102b5446I804M5862N5863A231
17898A26626m1221g3830B02724a41199e4090B01922M3531C3359L692K2729J35980
17887A95760O8836o3749b24160a5265B91276A10732J13146b97340M2219l99412
17877f54533A24616j7276a05637k2449M3512j6053E288P3474K92803I3571m4845
17866D8726e3406k51913A80231F0540a32390a6551B08449C4286a99929K2054D2626
17854a01691A393P7128b66331k5154G8818L9859f655E2721c2233e039B0045g517
17841A04256E0562i2542b126l09003B5096b9566l8840B66708o892e2331j29652
17830a81983A34198a6574B32516a71212D0111a98856A24904b32584g2185c0659
$$ plain form
17819 161807 125378 -165056 160654 220876 -92357 -162784 -79665 -112527 268336 64949 27336
17807 254305 146451 163416 36237 -313890 -10596 -136705 -3041 -61292 112745 57062 90060
17796 90060 159130 -40814 134170 173952 -10716 -65859 -26563 116917 -377187 107160 -45915
17784 -116622 228077 -58008 35701 281444 301980 133642 339998 -165294 66658 -9732 181857
17772 -13998 17801 36586 65007 334413 -153552 -112138 -164448 76125 -167695 -111748 -454569
17761 -454569 5270 256274 -218382 39195 210863 -146120 -94805 238063 35542 59094 -42339
17749 223397 5618 13584 225503 -26865 -25780 68706 47155 271583 -104437 87591 -64604
17737 207429 170978 -62659 142326 315107 61384 138846 317526 -28313 180712 -144004
$$ packed form
17819A61807l6429a65056A60654O0222i2357p0427g9665l2862B68336F4949B7336
17807B54305j07854J6965C6237c13890a0596j26109c041n8251A12745n5683L2998
17796I0060O9070d0814A34170L9782a0716n5143b6563A16917c77187A07160d5915
17784a16622B28077e8008C5701K45743K0536A33642K06356a65294F6658i732A81857
17772a3998A7801J8785K8421K69406a53552M1414n2310G6125a67695N5947l42821
17761d54569E270K51004b18382C9195J71668a46120N1315B38063C5542K3552d2339
17749B23397E618P966K11919b6865J085F8706k1551K24428a04437H7591f4604
17737B07429l6451f2659A42326J72781F1384P7462J78680b8313A80712a44004
$$ plain form
17726 -202802 -58812 -40351 26071 102621 -152386 -21522 51520 84420 101332 -35727 -51058
17715 -51058 -60393 -141023 -101640 -3496 186194 -422450 -46596 -195929 -47099 -148360 -50042
17703 -189477 251336 11896 176251 288588 31083 3837 2223 125006 202868 331924 -241841
17691 151496 469729 -197965 166429 -51588 -167306 269844 104428 127734 -188729 -81006
17680 -81189 -2194 7383 -153961 135651 152024 220572 -257817 138818 12952 -123545 237431
17668 258496 -39357 92855 -170337 98562 35362 -128298 329815 -264191 -18587 179579
17657 20377 323897 21939 58575 464786 164423 -147172 -312359 -85227 -10556 -33802 254217
17645 -345243 72882 -225886 303318 20420 -222050 -146551 4244 -97762 266919 -149109 -39538
$$ packed form
17726b02802e8812J8461B6071P6550a52386b1522E1520L2900J6912c5727j5331
17715e1058r335q0630L9383c496A86194d22450d6596j49333d7099j01261e0042
17703a89477B51336A1896J64355J12337C1083C837j614J22783P7862J29056b41841
17691A51496L18233a97965A66429e1588j15718B69844A04428K3306a88729h1006
17680h1189b194G383a53961A35651J6373O8548b57817A38818A2952a23545B37431
17668B58496c9357I2855a70337I8562C5362a28298C29815b64191a8587A79579
17657B0377L03520B1939L6636M06211A64423a47172j65187h5227a0556k3246B54217
17645c45243G2882b25886C03318B0420b22050P5499D244i7762B66919a49109c9538
$$ plain form
17633 234513 137956 333708 -72953 323900 -54014 85563 18136 33709 78255 330534 32090
17621 76677 59011 211767 -182235 31478 205587 -1853 -47282 -298967 206078 84360 -200871
17609 -279524 -119610 175305 -73787 -16536 131961 209444 -157714 167395 -351465 18229
17598 157115 -26948 12417 -52437 121918 124514 119177 -32548 -213067 11792 21945 -147695
17586 -223143 -230189 107421 129433 223362 23340 -189190 7188 128656 222263 -46118 60190
17574 -53137 127337 -64113 71762 -132439 -117331 -120576 -18127 -68805 288449 193341 -153423
17562 -172185 -246877 41744 -117666 278754 299546 70534 56375 221121 21358 -9151 165037
17550 149490 171574 -25728 -40068 144481 -232061 -74588 -261469 102430 3750 127821 108254
$$ packed form
17633B34513r6557J95752g2953C23900e4014H5563A8136J5573M4546K52279C2090
17621G6677j7666J52756a82235C1478J74109a853m5429k51685B06078H4360b00871
17609b79524a19610A75305g3787a6536A31961P7483a57714A67395c51465A8229
17598A57115b6948A2417e2437A21918K596n337c2548j80519A1792J0153a47695
17586b23143p046A07421K2012R3929B3340a89190G188J21468R3607d6118F0190
17574e3137A27337f4113G1762a32439J5108l245a8127n0678B88449r5108a53423
17562a72185p4692D1744a17666B78754K0792G0534j4159J64746B1358i151A65037
17550A49490K2084b5728j4340A44481b32061g4588j86881A02430C750J24071j9567
$$ plain form
17539 108254 -86852 135988 -353309 -119321 84282 -202647 56585 12935 247144 -197939
17528 22871 151803 140157 195645 -177472 -117557 26573 169707 278935 73421 -91134 136122
17516 -145371 111728 109459 -129233 44959 148858 364148 6996 143179 157838 50104 92001
17505 92001 392844 327839 117548 -82855 183983 213276 -41652 -76449 37789 224276 597057
17494 597057 247339 5511 82214 -96686 66770 417448 257389 -118065 -75379 179057 29859
17482 145922 290865 267956 -85182 123487 -5866 18023 32544 232940 -68721 207785 146547
17471 146547 113811 -214583 117516 -140255 220081 -149185 176703 29603 297798 -193385
17460 265827 163037 396958 16718 131175 244420 -274946 73068 175200 422489 443883
$$ packed form
17539A08254h6852A35988c53309a19321H4282b02647E6585A2935K34209a97939
17528B2871J28932j1646N5488a77472N9915B6573J43134J09228G3421i1134A36122
17516a45371A11728k269a29233D4959J03899K15290F996J36183J4659E0104M1897
17505I2001L00843o5005A17548h2855A83983K9293d1652l4797C7789J86487L72781
17494E97057B47339E511P6703i6686F6770L50678j60059a18065M2686A79057B9859
17482A45922J44943k2909h5182A23487e866A8023J4521K00396f8721B07785o1238
17471A46547l2736b14583A17516a40255B20081a49185A76703B9603K68195a93385
17460B65827j02790K33921A6718J14457J13245b74946G3068J02132K47289K1394
$$ plain form
17450 443883 -96586 178157 278009 285139 379826 43777 141096 122040 229324 228336 114590
17439 114590 299829 63619 487698 23813 170946 144752 211928 286987 371485 350983 -136482
17427 659 204567 415577 515606 255611 47367 382797 63401 274588 511242 108147
17416 123555 629571 293927 467428 307660 323439 215748 283731 478729 234147 341459
17406 341459 92816 239230 185384 -253868 100585 8041 414016 222185 77457 48405 57934
17395 57934 61921 86851 392011 148192 -204064 226288 395842 218155 139937 98680 -97786
17383 -86942 118352 293979 21931 -5313 18288 211275 -174942 210495 72675 121249 -8785
17371 146694 366132 91236 131550 124471 28905 290075 290406 -175379 61933 623002 65897
$$ packed form
17450D43883i6586A78157R9852P130R4687D3777R7319j9056J07284r88j13746
17439A14590J85239F3619M24079B3813J47133k6194O7176P5059Q4498k0502a36482
17427F59K03908K11010J00029B55611D7367L35430F3401K11187K36654A08147
17416A23555N06016B93927J73501j59768J5779j07691O7983J94998B34147J07312
17406C41459I2816J46414n3846b53868A00585H041M05975j91831G7457k9052R529
17395E7934L987K4930L05160A48192b04064B26288J69554j77687p8218m1257i7786
17383h6942A18352J75627B1931e313A8288J92987a74942B10495G2675M8574h785
17371A46694K19438I1236M0314p079B8905K61170L31a75379F1933N61069F5897
$$ plain form
17359 249358 -156520 -120232 8990 223850 350089 86441 317504 -228499 -146113 224102
17348 364615 460573 -295656 -205404 -245888 124642 201294 209223 -115790 142950 153871 66705
17336 10542 180214 65943 227629 183213 -85319 -10753 -398607 -161867 61179 134624 375064
17325 375064 -149463 361172 73632 348139 113173 272563 280499 302151 195143 -75297
17314 128017 -23341 301021 145814 211476 271224 -117403 193948 223537 50756 357374
17304 357374 150007 251617 53919 93087 -93181 151941 -17911 -75954 129833 245985
17294 245985 61694 113812 500224 -279987 -232204 231693 213369 109333 15037 129468
17284 129468 306400 -31515 629086 76188 257894 249627 117783 250206 -265569 272397
$$ packed form
17359B49358a56520L6288H990K14860J26239H6441K31063b28499Q2386B24102
17348C64615R5958b95656R0252m0484A24642P6652P929a15790A42950J0921F6705
17336A0542J69672F5943J61686m4416h5319a0753l87854a61867F1179P3445K40440
17325C75064a49463C61172G3632K74507A13173J59390P936K1652j07008g5297
17314A28017b3341C01021A45814O5662N9748a17403A93948K9589E0756L06618
17304C57374A50007J01610E3919L9168i3181A51941a7911n8043A29833J16152
17294B45985F1694N2118L86412b79987M7783B31693j8324j04036A5037J14431
17284A29468J76932c1515F29086G6188J81706q267A17783J32423b65569B72397
$$ plain form
17273 252826 124385 1805 155958 -54394 232610 464056 260558 218989 394281 170145
17262 196477 -103662 216084 354413 -150644 -133063 -22003 65487 175555 30231 68842
17252 68842 309039 46994 391904 140941 152321 33255 178459 235913 507577 130149
17241 234241 87001 269809 238698 -28310 -79077 409276 142998 138426 526741 243407 278614
17230 278614 -46510 229613 290331 173362 276428 584646 118487 179943 -57432 57757
17219 271172 182528 241816 230522 32950 76398 165595 403068 23537 514609 236264 375355
17208 375355 279787 228698 288856 108329 -28763 262062 56963 242393 -9871 319936 179874
17197 179874 287642 508064 538311 459818 221773 468699 296665 418043 618520 113886
$$ packed form
17273B52826A24385A805J54153e4394B32610K31446k03498m1569J75292A70145
17262A96477a03662B16084J38329a50644J7581b2003F5487J10068C0231L8611
17252F8842K40197D6994L44910A40941J1380C3255J45204N7454K71664A30149
17241B34241H7001J82808l1111b8310n0767D09276A42998m572L88315B43407L5207
17230B78614d6510B29613O0718j16969J03066L08218A18487O1456e7432E7757
17219B71172q8644N9288j1294C2950M3448Q9197K37473B3537M91072B36264J39091
17208C75355r5568n1089O0158A08329b8763B62062E6963J85430i871C19936j40062
17197A79874J07768K20422L0247p8493B21773K46926j72034J21378K00477A13886
$$ plain form
17186 377069 196840 337337 385693 283393 311652 253237 331241 148828 -122649 455177
17175 410227 116993 497075 427790 75478 367440 329455 260643 413530 -128439 505571
17164 432204 311753 -48423 695123 315707 437409 579926 449837 358093 175080 228132
17154 228132 559044 99015 406264 372448 -39734 479719 368127 56966 535719 338194
17144 338194 315968 342003 300818 149785 588324 182942 161252 120909 394624 443692 167920
17132 186801 146772 454817 353532 413084 225375 291617 535201 661349 133142 294559
17122 294559 69258 117447 189175 282799 428248 590370 442814 618001 296633 365048
17112 365048 400078 158551 520148 526446 407544 454734 350367 551376 401615 336971
$$ packed form
17186C77069j80229J40497M8356j02300K8259n8415P8004A48828a22649D55177
17175D10227A16993L80082o9285G5478K91962l7985o8812J52887a28439E05571
17164D32204j20451d8423F95123C15707J21702J42517j30089r1744A75080N3052
17154B28132L30912I9015L07249l3816c9734D79719j11592E6966M78753j97525
17144C38194k2226K6035m1185A49785M38539A82942k1690m0343K73715M9068A67920
17132A86801m0029L08045j01285N9552j87709O6242K43584J26148A33142J61417
17122B94559F9258M8189P1728R3624J45449J62122j47556J75187B96633O8415
17112C65048L5030A58551L61597O298j18902M7190j04367K01009j49761o4644
$$ plain form
17102 336971 247721 315797 474982 437351 209275 564184 576490 365414 611803 528231
17092 528231 257582 311658 572660 419554 478256 447925 490440 344763 586712 353406
17082 353406 329791 561293 205395 411020 562115 619226 208343 763904 463515 716607
17072 716607 417756 478050 367488 487387 243768 412638 498077 308443 647989 411707
17062 411707 535209 505701 559611 580927 701584 559806 676433 606461 524592 512873 447714
17051 447714 731871 588351 498401 719118 755479 742580 920252 632517 530830 650279
17041 650279 658453 558763 776877 267670 623914 719457 512055 725660 697874 719028 693942
17030 693942 730361 480088 904069 713606 613816 432731 505819 489778 438598 676165
$$ packed form
17102C36971q9250O8076J59185l7631B09275L54909J2306k11076K46389q3572
17092E28231B57582N4076K61002j53106N8702l0331M2515j45677K41949k33306
17082C53406k3615K31502B05395K05625J51095N7111B08343N55561l00389K53092
17072G16607k98851O0294j10562J19899k43619J68870Q5439j89634L39546k36282
17062D11707J23502k9508N3910K1316J20657j41778J16627o9972q1869j1719o5159
17051D47714K84157j43520q9950K20717L6361j2899J77672k87735j01687J19449
17041F50279Q174r9690K18114B67670L56244R5543k07402K13605k7786K1154k5086
17030F93942L6419k50273M23981j90463r9790j81085P3088j6041n1180K37567
$$ plain form
17020 676165 610843 987901 813843 400394 535018 672434 611682 752793 860386 888467
17010 888467 855198 608559 1227590 664104 571329 717413 613746 870812 719050 1000192
17000 1000192 603938 774873 974159 835782 622138 668716 907338 686358 962699 557425
16990 557425 577274 920024 650957 1164203 900094 691134 848796 768639 928811 911442
16980 911442 938778 861158 991847 824582 1247597 710009 1125365 845003 884569 1153942
16970 1153942 861567 945545 897390 1093995 974308 814133 1148557 1034303 1273402 847580
16960 847580 1104524 1027551 1134596 1202406 1144554 1229695 1214212 1368676 922932 1149244
16950 1149244 1271550 1073721 1253742 1520036 1354730 1060270 1421868 1217775 1011001
$$ packed form
17020F76165o5322L77058j74058D00394J34624J37416o0752J41111J07593K8081
17010H88467l3269k46639O19031n63486r2775J46084j03667K57066j51762K81142
17000A000192l96254J70935J99286j38377k13644M6578K38622k20980K76341m05274
16990E57425J9849L42750k69067N13246k64109k08960J57662q0157J60172j7369
16980I11442K7336p7620J30689j67265M23015n37588M15356k80362L9566K69373
16970A153942k92375Q3978m8155J96605j19687j60175L34424j14254K39099m25822
16960H47580K56944p6973J07045O7810n7852Q5141j5483J54464m45744K26312
16950A149244J22306j97829J80021K66294j65306k94460L61598k04093k06774
$$ plain form
16941 1011001 1115051 1346517 1078547 1181896 1102856 1520909 1585182 1230777 1424634 1373205
16931 1373205 1527853 1423626 1390763 1523302 1248802 1351096 1530113 1373753 1449103 1515978
16921 1515978 1398742 1665307 1565345 1163821 1188552 1240941 1916789 1558023 1714742 1753780
16911 1753780 1701952 1633186 1425138 1718906 1820542 1793925 1685843 1639084 1980456 1782246
16901 1782246 1913842 1887040 1869352 1901225 2096083 1710808 1661719 2109198 1705524 2096780
16891 2096780 1890794 2145472 1898170 1856379 2036915 2189880 2185682 1794607 2278124 2001305
16881 2001305 2156634 2410321 2569786 2251333 2293491 2378587 2424025 2188745 2560576 2126233
16871 2126233 2282395 2768835 2430704 2367703 2873327 2822706 2907292 3158685 2801813 2883627
$$ packed form
16941A011001J04050K31466k67970J03349p9040M18053O4273l54405J93857n1429
16931A373205J54648j04227l2863J32539k74500J02294J79017j56360P5350O6875
16921A515978j17236K66565r9962m01524K4731N2389O75848l58766J56719L9038
16911A753780n1828o8766k08048K93768J01636k6617j08082m6759L41372j98210
16901A782246J31596k6802j7688L1873J94858l85275m9089M47479m03674L91256
16891B096780k05986K54678k47302m1791J80536J52965m198l91075M83517k76819
16881B001305J55329K53687J59465l18453M2158Q5096M5438k35280L71831m34343
16871B126233J56162M86440l38131o3001N05624n0621Q4586K51393l56872Q1814
$$ plain form
16861 2883627 2881388 3060130 3031730 3004967 3054683 3032666 2982345 3157983 3168348 3305181 3299716
16850 3299716 3298922 3551606 3450942 3507312 3640534 3604523 4086540 3783107 4068558 3773352
16840 3773352 4052965 3879148 4186450 4322662 4238924 4147426 4399226 4505756 4475634 4601279
16830 4601279 4727410 4512940 4769487 5393160 5012547 5088821 5072526 4794957 5226614 5259606
16820 5259606 5546939 5749065 6123116 5860572 6063968 6027261 6146671 6321582 6797815 6497345
16810 6497345 6787806 6557256 6930444 7148500 7039479 7313612 7551559 7652584 7876350
16801 7876350 7729160 8304604 8598336 8479901 8873037 9209754 9561732 9634130 9589110 10076348
16791 10076348 10129730 10616270 10862459 11059445 11160280 11554480 11871583 12403194 12732999
$$ packed form
16861B883627k239J78742k8400k6763M9716k2017n0321J75638J0365J36833n465
16850C299716p94K52684j00664N6370J33222l6011M82017l03433K85451k95206
16840C773352K79613j73817L07302J36212q3738r1498K51800J06530l0122J25645
16830D601279J26131k14470K56547O23673l80613P6274j6295k77569M31657L2992
16820E259606K87333K02126L74051k62544K03396l6707J19410J74911M76233l00470
16810F497345K90461k30550L73188K18056j09021K74133K37947J01025K23766
16801G876350j47190N75444K93732j18435L93136L36717L51978P2398m5020M87238
16791A0076348N3382M86540K46189J96986J00835L94200L17103N31611L29805
$$ plain form
16782 12732999 13076856 13440542 13720818 14197164 14552159 14965685 15200571 15874367 16522922
16773 16522922 16953641 17693795 18046060 18545982 19370863 19928183 21153448 21237752 21936666
16764 21936666 23153639 24094481 25011128 25621468 26888524 27874900 28859403 30053568 31641903
16755 31641903 33005991 34111712 35523036 37538299 38871054 41003836 42912900 44701105
16747 44701105 47168740 49866532 51883977 54576332 57403801 60704994 64154921 67475444
16739 67475444 71007833 75060943 79787347 84091727 89174787 94129983 99624429 105375732
16731 105375732 111902436 117951807 124784303 131627410 138572186 145700678 152945751 159674733
16723 159674733 166298069 172583436 178190235 182819918 186542798 189551357 190707269 191229965
$$ packed form
16782A2732999L43857L63686K80276M76346L54995M13526K34886O73796O48555
16773A6522922M30719P40154L52265M99922Q24881N57320J225265Q4304O98914
16764B1936666J216973R40842R16647O10340J267056R86376R84503J194165J588335
16755C1641903J364088J105721J411324K015263J332755K132782J909064J788205
16747D4701105K467635K697792K017445K692355K827469L301193L449927L320523
16739F7475444L532389M053110M726404M304380N083060M955196N494446N751303
16731A05375732O526704O049371O832496O843107O944776P128492P245073O728982
16723A59674733O623336O285367N606799M629683L722880L008559J155912N22696
$$ plain form
16715 191229965 189814557 187286877 184492939 179866027 174508302 168062890 161081828 154555116
16707 154555116 147058021 139629691 132210030 124906535 118064745 111065871 104569044 98298735
16699 98298735 92785723 87275256 82040312 77367220 72872883 68619239 65003367 60997422
16691 60997422 57697029 54813309 51707622 49100964 46585583 44224385 41696005 40084298
16683 40084298 37610234 36098131 34161962 32319218 31508024 29998344 28682093 27348322
16675 27348322 26148624 25049797 23909386 23089781 22163077 21467954 20210495 19927176 19061552
16666 19061552 18601778 17535702 17010004 15990830 15975184 15394830 14908492 14465651 13703665
16657 13703665 13216843 13079077 12513571 12055561 11707233 11520716 11001566 10752388 10358151
$$ packed form
16715A91229965j415408k527680k793938m626912n357725o445412o981062o526712
16707A54555116p497095p428330p419661p303495o841790o998874o496827o270309
16699I8298735n513012n510467n234944m673092m494337m253644l615872m005945
16691F0997422l300393k883720l105687k606658k515381k361198k528380j611707
16683D0084298k474064j512103j936169j842744q11194j509680j316251j333771
16675B7348322j199698j098827j140411q19605r26704o95123j257459k83319q65624
16666A9061552m59774j066076n25698j019174j5646n80354m86338m42841p61986
16657A3703665m86822j37766n65506m58010l48328j86517n19150k49178l94237
$$ plain form
16648 10358151 10222776 9931831 9474045 9126390 8878273 8948738 8517879 7985707 8019009 8202188
16638 8202188 7634014 7821829 7462858 7198315 6970113 6794701 6658586 6684955 6406658 5840867
16628 5840867 6167506 5603742 5728155 5558448 5133728 5811544 5312684 5236215 5309327 4830399
16618 4830399 4889186 4676847 4762196 4831759 4546969 4453395 4239030 4320639 4171939 4290817
16608 4290817 3834221 3936754 3862975 3775473 3911161 3486145 3693622 3647221 3184198 3260622
16598 3260622 3308492 3170046 3143811 3163947 3373513 2775353 3180303 2885180 2736856 2702895
16588 2702895 2568295 2665421 2617513 2202658 2754860 2478222 2606333 2253052 2367118 2335519
16578 2335519 1958469 2496392 2132166 1891342 2137856 2162120 2089398 1663795 2112158 2013915
$$ packed form
16648A0358151j35375k90945m57786l47655k48117P0465m30859n32172L3302J83179
16638H202188n68174J87815l58971k64543k28202j75412j36115K6369k78297n65791
16628E840867L26639n63764J24413j69707m24720O77816m98860p6469P3112m78928
16618D830399N8787k12339Q5349O9563k84790r3574k14365Q1609j48700J18878
16608D290817m56596J02533p3779q7502J35688m25016K07477m6401m63023P6424
16598C260622M7870j38446k6235K0136K09566n98160M04950k95123j48324l3961
16588B702895j34600R7126m7908m14855N52202k76638J28111l53281J14066l1599
16578B335519l77050N37923l64226k40824K46514K4264p2722m25603M48363r8243
$$ plain form
16568 2013915 1998096 2176846 2110893 2272010 1939532 1846908 1736684 1476613 1594868 2035268
16558 2035268 1693207 1577063 1595327 1784691 1551193 1667442 1476530 1717252 1557905 1730791
16548 1730791 1556022 1533066 1590520 1507336 1400045 1332401 1439040 1263295 1131696 1601581
16538 1601581 1381774 1436524 1514202 1100608 1119717 1410508 1184246 1169120 1416440 1182419
16528 1182419 1013898 753826 1333451 867979 1365273 1082480 993636 1100353 876260 1255285
16518 1255285 1042988 1038161 884741 1058070 1348817 778953 990307 1084392 944961 1018731
16508 1018731 976800 1052619 906132 629974 817650 969231 825273 863415 546450 1055755
16498 1055755 828516 690465 820646 656013 805694 624173 1071869 1072148 973050 627238
$$ packed form
16568B013915j5819J78750o5953J61117l32478r2624j10224k60071J18255M40400
16558B035268l42061j16144J8264J89364k33498J16249j90912K40722j59347J72886
16548A730791j74769k2956N7454q3184j07291o7644J06639j75745j31599M69885
16538A601581k19807N4750P7678m13594J9109K90791k26262j5126K47320k34021
16528A182419j68521k60072N79625m65472M97294k82793q8844J06717k24093L79025
16518A255285k12297m827j53420J73329K90747n69864K11354R4085j39431P3770
16508A018731m1931P5819j46487k76158J87676J51581j43958L8142l16965N09305
16498A055755k27239j38051J30181j64633J49681j81521M47696K79r9098l45812
$$ plain form
16488 627238 602361 772079 1123022 645887 745177 399679 1119911 577817 426146 797323
16478 797323 817705 426838 588621 466197 650557 792067 552035 548861 785159 588449
16468 588449 292994 693058 134742 346059 706997 264438 606974 576290 772303 671487
16458 671487 345105 274460 310655 591950 571154 844339 659133 719178 135868 -53300
16447 316592 479738 374766 317235 468081 660359 140645 484908 883352 503703 627700
16437 627700 99587 16055 293753 423861 404821 691340 588355 682622 391300 304612
16427 304612 328405 586718 500692 41694 172706 473062 436571 558714 423087 215554
16417 215554 286404 593109 606011 283197 288483 397388 80255 451147 279626 527339
$$ packed form
16488F27238k4877J69718L50943m77135R9290l45498P20232n42094j51671L71177
16478G97323K0382l90867J61783j22424J84360J41510k40032l174K36298j96710
16468E88449B92994M00064A34742K11317L60938B64438L42536l0684J96013j00816
16458F71487l26382p0645L6195K81295k0796K73185j85206O0045A35868e3300
16447C16592J63146j04972n7531J50846J92278A40645L44263L98444l79649J23997
16437F27700I9587A6055K77698J30108j9040K86519j02985R4267k91322q6688
16427C04612K3793K58313q6026D1694J31012L00356l6491J22143j35627k07533
16417B15554P0850L06705J2902B83197N286J08905H0255L70892j71521K47713
$$ plain form
16407 527339 179060 256383 481631 473651 358867 418140 263817 390078 662607 446866
16397 446866 359969 314969 70610 365182 128106 250621 201742 578203 423671 173346
16386 357388 305856 324153 86836 354028 278179 428534 98369 296235 173524 70692 206850
16375 206850 72207 -155382 199382 -25041 193858 -190076 284850 218148 475511 519246
16365 519246 181409 180950 271847 -116662 151693 136623 249537 375368 -177296 -52163 481821
16353 -133442 179404 -78108 122785 388682 76526 301416 97258 139681 49805 79367 421296
16342 421296 -67266 132497 231871 541893 251383 -185606 328451 -76185 39442 29422
16332 29422 233514 626246 150404 257410 -56404 104818 136919 237733 46144 273275
$$ packed form
16407E27339A79060P7323K25248p980j14784N9273j54323J26261K72529k15741
16397D46866q6897m5000G0610K94572A28106J22515m8879L76461j54532A73346
16386C57388n1532J8297H6836K67192p5849J50355I8369J97866j22711G0692J36158
16375B06850G2207a55382A99382b5041A93858a90076B84850o6702K57363M3735
16365E19246A81409m59R0897a16662A51693j5070J12914J25831a77296e2163D81821
16353a33442A79404g8108A22785K65897G6526K24890I7258M2423D9805K9562L41929
16342D21296f7266A32497R9374L10022B51383a85606C28451g6185C9442j0020
16332B9422K04092L92732A50404J07006e6404A04818L2101J00814D6144K27131
$$ plain form
16322 273275 253691 -116394 -17143 54471 261765 284318 -115846 483372 32530 108296 59533
16311 59533 70695 -86333 187231 213843 -96877 66793 344139 12422 426356 187757 398493
16300 398493 246714 -129315 94381 257428 334911 125654 32367 188446 137653 100977
16290 100977 156081 157747 443852 36407 -9037 264505 387667 252898 -10457 81955 65625
16279 65625 75373 202642 91354 124123 -91360 5123 270521 110775 8517 89699 19840 91176
16267 91176 90039 -341733 143565 169007 89221 221297 -100404 294392 327061 65039 88087
16256 88087 -80290 119238 134972 -40024 377863 -64249 -213250 -157232 118105 -6239 -68756
16245 -68756 16719 224048 253970 -125491 219018 37421 266083 132225 -6964 -134638 -86509
$$ packed form
16322B73275j9584a16394a7143E4471K07294K2553a15846D83372C2530P5766m8763
16311E9533J1162h6333A87231K6612i6877F6793K77346A2422M13934A87757K10736
16300C98493j51779a29315I4381J63047P7483A25654C2367J56079n0793l6676
16290A00977N5104J666K86105C6407i037B64505J23162j34769a0457H1955j6330
16279F5625R748J27269I1354L2769i1360E123K65398A10775H517Q1182A9840P1336
16267I1176j137c41733A43565K5442p9786J32076a00404B94392L2669F5039K3048
16256H8087h0290A19238J5734d0024C77863f4249j49001N6018A18105f239o2517
16245f8756A6719K07329K9922a25491B19018C7421K28662A32225f964j27674M8129
$$ plain form
16234 -86509 143435 83526 99723 -18021 -158724 129084 -115100 268151 165483 -36270
16223 168029 262087 38216 -90700 -115979 -200670 190136 -290991 86146 135941 -168187 -243158
16212 -243158 276380 104155 -200273 82514 32675 -81730 -29715 87601 159012 -88035 531084
16200 -147515 164825 -96890 150239 -20438 -133496 -190720 -116927 226971 259250 12745 -8656
16188 -252757 327684 60063 -127532 -177871 138106 16713 169810 132484 -381602 355549
16177 183708 82225 -194799 -367199 50801 22282 -205942 49757 -41209 -173363 -141530 79625
16165 302791 230905 -106122 38813 -154873 99073 79794 -25112 141670 196136 15623 143798
16154 143798 -246591 -22160 -302770 -87044 -264138 91961 93209 143874 18573 -380349 188229
$$ packed form
16234h6509A43435n9909J6197a8021j40703A29084a15100B68151j02668c6270
16223A68029R4058C8216i0700k5279q4691A90136b90991H6146M9795a68187p4971
16212b43158B76380A04155b00273H2514C2675h1730b9715H7601P1411h8035E31084
16200a47515A64825i6890A50239b0438j13058n7224P3793B26971L2279A2745h656
16188b52757C27684F0063a27532n0339A38106A6713J53097l7326c81602C55549
16177A83708H2225a94799j72400E0801B2282b05942D9757d1209j32154L1833G9625
16165C02791p1886a06122C8813a54873I9073j9279b5112A41670N4466A5623J28175
16154A43798b46591b2160k80610h7044j77094I1961J248N0665A8573c80349A88229
$$ plain form
16142 -101054 158289 -38796 172999 79464 -105779 11485 -248122 -153369 -232155 146169
16131 249966 53396 195308 55076 117950 -238325 40770 7235 86389 98095 40599 407538
16120 407538 -124286 198121 -73044 -301804 -41681 -86177 -51412 92209 -188012 150200
16109 -227853 201879 10641 10599 558 -168935 -81296 -332557 -3461 -52201 338329 90703 313558
16097 313558 -15372 -32280 -102003 293905 29245 -84262 -332267 6494 -8638 103001 161488
16086 161488 179761 78089 -174698 -81794 -27880 170471 75604 149255 54087 -319902 -43851
16074 -80737 -61253 -63540 6941 -88681 7144 7644 -58151 39707 90511 -174507 -47313 392764
16061 -88270 -119567 -59776 -77675 284340 163856 7122 130100 48763 -116657 -94985 52968
$$ packed form
16142a01054A58289c8796A72999G9464a05779A1485b48122R4753p8786A46169
16131B49966E3396J41912E5076O2874b38325D0770G235P9154J1706D0599L66939
16120D07538a24286A98121g3044k28760d1681m4496L4765I2209a88012A50200
16109b27853B01879A0641m2E58a68935h1296k51261c461m8740C38329I0703K22855
16097C13558a5372j6908o9723B93905B9245h4262k48005F494h638A03001N8487
16086A61488J8273G8089a74698h1794b7880A70471G5604P3651E4087c19902d3851
16074h0737J9484k287F941h8681G144N00e8151C9707N0804a74507d7313C92764
16061h8270l1297e9776j7899B84340j20484G122J22978D8763a16657K1672E2968
$$ plain form
16049 -376178 75163 259742 84474 18598 329570 -77921 -148736 294746 -105628 67805 -163831
16037 396751 92675 -14076 -189286 -82710 315421 -120471 135470 153063 -287597 -72490
16026 -69101 380640 -95276 -152034 234340 -64587 103243 85577 -9092 -209576 -80265 69441
16014 -128947 4941 -199471 -350057 -142924 -73783 -172928 -66946 -55029 21108 44458 -158889
16002 66030 185110 -152534 -20867 98272 41827 86955 63769 265513 -19222 -42081 12567
15990 -459138 -149522 -71426 -132128 -277328 337857 203252 346097 133548 575508 309052
15980 309052 204851 355995 -378683 81193 17534 36850 -122172 196420 132417 195434
15970 195434 -73157 -24382 -171693 224672 190297 -4576 -46812 -70125 -103546 79750 -153704
$$ packed form
16049c76178G5163J84579H4474A8598L10972g7921p0815B94746a05628F7805a63831
16037C96751I2675a4076j75210h2710C15421a20471A35470J7593b87597g2490
16026f9101C80640i5276n6758B34340f4587A03243j7666i092k00484h0265F9441
16014a28947D941a99471j50586a42924O9141r9145f6946J1917B1108K3350a58889
16002F6030J19080a52534b0867I8272D1827M5128k3186K01744a9222k2859A2567
15990d59138a49522g1426o0702j45200C37857j34605J42845A33548M41960k66456
15980C09052j04201J51144c78683H1193A7534J9316a22172A96420o4003O3017
15970A95434g3157b4382j47311B24672l4375d576m2236k3313l3421G9750a53704
$$ plain form
15958 -57843 -123095 17596 -104550 -296878 56093 3039 -94699 24602 -39580 -210639 -129562
15947 -129562 -319019 168986 -188017 416298 65467 -114154 470210 93982 217466 -36834
15936 42520 -17737 -113117 -256818 262412 5159 -153254 -170373 -262196 -173467 -916 -5663 203216
15923 25117 86073 -216822 -245739 13271 -227684 -180613 -80608 -192997 -106957 68533 -171894
15911 -89392 -109277 -360927 -356512 -220496 282283 109089 71112 -165185 54969 -122064 -170991
15900 -170991 74822 -156228 -91662 -42631 49509 -70193 -175821 -85256 250839 40977 27268
15889 27268 -247099 -252101 -32141 142330 -121835 227076 116451 38698 78086 109579 -330128
15877 58466 -32329 -92010 -64530 44600 -98711 149813 161981 1005 -204866 -154039 -242008
$$ packed form
15958e7843o5252A7596a04550j92328E6093C039i4699B4602c9580j71059Q1077
15947a29562j89457A68986a88017D16298F5467a14154D70210I3982J23484c6834
15936D2520a7737r5380j43701B62412E159a53254j7119r1823Q8729i16m747B03216
15923B5117O0956b16822k8917A3271b27684M7071h0608j12389Q6040F8533a71894
15911h9392j9885k51650M415J36016B82283A09089l7977a65185E4969a22064m8927
15900a70991G4822a56228O4566d2631D9509g0193j05628h5256B50839D0977j3709
15889B7268b47099n002c2141A42330a21835B27076j10625C8698L9388L1493c30128
15877E8466c2329n9681K7480D4600i8711A49813J2168A005b04866N0827q7969
$$ plain form
15866 -242008 -62733 -157687 -254560 14909 -74430 -421746 415383 -120796 -72530 41798 207392
15855 207392 -57277 -47416 -68705 -20393 -357905 -252145 -148962 -215549 -292844 -186924 -77147
15843 -31713 -235616 241976 14777 4667 224916 -63911 17706 12558 -9476 66957 96725 -59135
15830 40910 25005 36066 -230344 -256092 -221413 -16108 168857 180184 35680 71810 -100426
15818 200024 -76970 9997 58674 -23435 60621 224002 -24382 -59918 -242825 45248 -84351
15806 -105205 -368039 51155 -185770 -106509 -318791 -154060 30881 -245966 -14757 129284
15795 -168709 106056 121371 -149145 159745 117469 -190878 -157108 -196294 -11597 -92107 169662
15783 19334 64898 -337095 -360413 79184 -64780 11238 -107452 -387582 -255835 -166627 221079
$$ packed form
15866b42008f2733r4954r6873A4909g4430l47316D15383a20796M8266D1798J65594
15855B07392e7277R861k1289b0393l37512J05760J03183o6587p7295J05920g7147
15843c1713k03903B41976A4777D667K20249f3911A7706n148i476F6957K9768e9135
15830D0910j5905J1061b30344k5748L4679a6108A68857J1327C5680L6130a00426
15818B00024g6970I997M8677b3435F0621J63381b4382l5536j82907D5248h4351
15806a05205k62834E1155a85770P9261k12282a54060C0881b45966a4757A29284
15795a68709A06056J5315a49145A59745m2276a90878L3770l9186a1597q0510A69662
15783A9334M5564c37095k3318G9184f4780A1238a07452k80130J31747Q9208B21079
$$ plain form
15771 -118605 -171520 -278359 -61316 -9731 148455 -86140 -189757 113420 -126649 34531 204450
15760 204450 181743 152291 -42050 -227871 -94769 -262821 -8106 266835 -122719 -123726 -107172
15749 -107172 39343 199164 5678 -26923 99136 440025 -8220 -26367 60633 259225 -339290
15737 45116 168463 -50303 91128 126281 -60671 146157 129595 181597 294195 -86 -123036
15726 -123036 -5091 -123829 102230 -13689 66326 158816 -52971 -82513 35339 135890 400612
15715 400612 62189 8341 -147742 -312313 -38762 -88724 212985 -140199 126184 122856 -24237
15703 81366 -37198 -95434 89750 85623 68891 -122241 258647 211547 47335 -26669 -25988 -99021
15691 -99021 196381 -46599 -194448 101981 -159234 -27098 75887 -82928 261320 -49188 95408
$$ packed form
15771a18605n2915j06839f1316i731A48455h6140j03617A13420a26649C4531J69919
15760B04450k2707k9452d2050j85821i4769j68052h106B66835a22719j007J6554
15749a07172C9343J59821E678b6923I9136L40889h220j8147F0633J98592c39290
15737D5116J23347e0303I1128L5153f0671A46157j6562N2002J12598h6j22950
15726a23036e091j18738A02230a3689F6326R2490e2971k9542C5339J00551K64722
15715D00612F2189H341a47742j64571c8762m9962B12985a40199A26184l328b4237
15703H1366c7198n8236H9750m127j6732a22241B58647m7100D7335b6669O81p3033
15691i9021A96381d6599j47849A01981a59234b7098G5887h2928B61320d9188I5408
$$ plain form
15679 94479 -159483 76804 -229221 -377100 -90265 327266 -198621 334969 -32584 118074
15668 -53343 199356 190646 87361 -142167 53669 -282072 78022 38813 -166046 -149643 52022
15656 -10902 301930 -239559 -326324 103134 6580 -99728 -71204 -288483 -189785 -7194 -108052
15645 -108052 84828 -254560 -11054 265933 184954 -101488 95710 -117391 392814 7826 -37850
15633 41747 -120658 -259019 -33612 -41181 -54146 -109466 27083 -18668 -126421 335427 -167155
15621 -49362 96325 64996 -30451 -23790 193311 84227 -12738 180672 -267880 -1767 97854
15609 94891 216448 -120716 10036 121801 131343 90998 -202432 258738 122179 -446879
15598 -219715 945 -3510 47392 47645 -510178 -200025 22239 62098 288509 262174 186276 234592
$$ packed form
15679I4479a59483G6804b29221j47879i0265C27266a98621C34969c2584A18074
15668e3343A99356q710H7361a42167E3669b82072G8022C8813a66046J6403E2022
15656a0902C01930b39559q6765A03134F580i9728K8524k17279R8698g194j00858
15645a08052H4828b54560a1054B65933q0979a01488I5710a17391C92814G826c7850
15633D1747a20658j38361c3612p569j2965n5320B7083a8668j07753C35427a67155
15621d9362I6325l1329c0451O661A93311H4227a2738A80672b67880a767I7854
15609I4891J21557a20716A0036J11765R542m0345b02432B58738A22179d46879
15598b19715I45c510D7392K53e10178b00025B2239L9859K26411k6335p5898M8316
$$ plain form
15586 234592 294468 -125413 -53322 -128030 -108266 -441706 93266 -138732 172570 145645 162907
15575 162907 -209754 11658 181502 -11116 -85548 9096 58477 43948 -113485 217061 -145049
15563 123119 -108129 264290 140737 232168 -174569 126408 149150 -70803 -9823 -41154 -224361
15552 -224361 58373 318435 -116422 -126950 -345660 62144 -47701 143130 101624 177103 33565
15540 -188178 -66924 -21829 34154 -22693 371433 -178457 -15498 97263 120276 -25174 92085
15528 -83234 -203679 -97837 23722 4078 155474 2446 -127803 82923 44228 -167967 -158197
15517 -158197 64817 -231801 2961 -201290 108578 -51274 -59719 27339 85318 -199763 192425
15505 -137656 70943 -72581 -164223 52781 -222314 199913 11504 393966 -8424 -125867 -264679
$$ packed form
15586B34592N9876a25413e3322p4708J9764l33440I3266a38732A72570k6925J7262
15575A62907b09754A1658J69844a1116p4432I096M9381j4529a13485B17061a45049
15563A23119a08129B64290j23553R1431a74569A26408K2742g0803i823l1331j83207
15552b24361E8373K60062a16422j0528k18710F2144d7701A43130m1506P5479C3565
15540a88178f6924b1829C4154b2693C71433a78457a5498I7263K3013b5174I2085
15528h3234j20445i7837B3722D078J51396B446a27803H2923l8695a67967R770
15517a58197F4817b31801B961b01290A08578e1274q445B7339N7979a99763A92425
15505a37656G0943g2581r1642E2781b22314A99913A1504L82462h424j17443j38812
$$ plain form
15494 -264679 -40519 -18120 -38326 -132207 242415 312468 155572 -134163 184778 96718 -128702
15482 -173983 -120635 -191039 48298 264343 -29748 -226591 -338018 106202 -31674 -241491
15472 -241491 -12111 -34845 48934 -337868 72745 -130521 -35736 -81240 133173 -131372 39558
15460 -175543 17502 369095 -104873 -184422 -252895 46611 -342383 -125807 328854 -69040
15449 -96184 9851 -10575 237462 -90810 205001 19409 152639 -164089 245891 65635 -281458
15437 -40668 236885 -114269 -197459 -153904 250763 -266856 104507 -25250 -27257 -131977 96598
15425 247597 -133192 228800 45423 -238493 41894 75320 -219760 821 -46565 204313 -354743
15413 132960 -11864 -82685 -79571 70110 -144572 -179118 344044 49311 141270 -194597 -138483
$$ packed form
15494b64679d0519a8120k0206r3881B42415P0053A55572a34163A84778q8060a28702
15482a73983N3348p0404D8298K16045b9748j96843j11427A06202c1674k09817
15472b41491a2111k2734D8934c37868G2745a30521c5736m5504A33173a31372C9558
15460a75543A7502L51593a04873p9549o8473D6611c42383a25807C28854f9040
15449i6184I851a0575B37462i0810B05001A9409J33230a64089B45891F5635b81458
15437d0668B36885a14269q3190M3555B50763b66856A04507b5250k007j04720I6598
15425B47597a33192B28800D5423b38493D1894L3426b19760H21d6565B04313c54743
15413A32960a1864p0821L114G0110a44572l4546C44044D9311R1959a94597N6114
$$ plain form
15402 -138483 205107 -93901 -66671 -292074 93750 148262 -61784 -393934 -192800 151010
15391 143490 37016 28984 19251 140567 120937 250949 89348 2945 -61892 72522 -107441
15379 -1229 -17456 25373 263076 -180482 -38154 -263842 95666 229555 -105676 -193479 321923
15367 -100 242221 254162 314755 132025 213135 -322509 143669 171952 104990 -136182 -279739
15356 -279739 127034 87242 112986 22744 -281770 85868 -80983 170452 192406 197365 -153541
15344 6959 143080 56941 -66497 -117555 119137 111038 -219043 173764 47969 116833 263013
15333 263013 -260871 191594 -52979 82442 7587 41542 48184 206193 575309 226070 -193202
15321 -6552 -154364 -42044 110463 -147749 -201444 -99244 51425 110515 246798 -160331 95758
$$ packed form
15402a38483B05107i3901K7230k25403I3750N4512f1784l32150a92800A51010
15391A43490C7016q032r733J21316j9630J30012H9348B945f1892G2522a07441
15379a229j6227B5373K37703a80482c8154k25688I5666J33889a05676q7803C21923
15367a00B42221J1941O0593A32025Q1110c22509A43669K8283o6962a36182j43557
15356b79739A27034l9792K5744B2744b81770H5868h0983A70452K1954M959a53541
15344F959J36121E6941f6497n1058A19137q099b19043A73764D7969O8864J46180
15333B63013b60871A91594e2979H2442G587L3955O642J58009L69116B26070a93202
15321f552j47812d2044A10463a47749n3695i9244E1425N9090J36283a60331I5758
$$ plain form
15309 132836 171047 -254553 -275707 -69076 200029 274954 -45 150685 162067 192384 105380
15298 105380 219221 119053 -130187 -33122 -83218 281676 161489 88535 122022 62651
15288 62651 139077 90934 -87341 -219645 19757 170864 65020 7327 -244396 115745 159853
15277 159853 -102927 8947 57363 225008 159311 26332 292456 -19352 -198926 -1657 94305
15265 -73246 292551 304478 396280 192108 146277 -72930 -13207 201985 -182263 -35277 281432
15253 -88909 296010 241444 134363 134959 119503 122418 1113887 1841528 1275889 1745795 1542823
15242 1542823 459743 211645 121743 324960 497294 134094 -5125 139265 -220734 -36468
15231 198813 -250786 64955 115030 239381 -21363 -247991 42226 233350 -119554 -130334
$$ packed form
15309A32836L8211b54553k1154f9076B00029P4925d5A50685J1382L0317q7004
15298A05380J13841j00168a30187c3122n0096B81676j20187p2954L3487n9371
15288F2651P6426m8143h7341j32304A9757J51107F5020G327b44396A15745M4108
15277A59853a02927H947M8416J67645o5697B6332K66124a9352j79574a657I4305
15265g3246B92551J1927R1802A92108m5831g2930a3207B01985a82263c5277B81432
15253h8909B96010n4566j07081N96j5456K915R91469P27641n65639M69906k02972
15242A542823D59743B11645q9902K03217J72334A34094e125A39265b20734c6468
15231A98813b50786F4955N0075J24351b1363k26628D2226J91124a19554j0780
$$ plain form
15221 -130334 -81735 -281635 -6589 368805 -84199 8855 50824 -69727 -107096 -106765 238415 44376
15208 466432 -218441 148800 -129763 296764 44158 -250259 -64854 -43929 -27472 -280749
15198 -280749 -196893 50904 14741 315898 219787 142949 310652 -402096 37877 32734 106462
15187 106462 287482 -177954 88631 82042 231394 48664 26048 118205 43152 -178674 -110388
15176 -110388 178369 -173276 -101401 49161 125454 218676 120441 -11422 -89276 277749 98891
15164 94905 137084 -102592 205368 -127751 246070 -121039 353455 -53145 -16524 256086
15153 87938 306529 246233 150616 189113 187384 283267 96908 109371 73116 -29256 132339
15141 102259 438907 345890 -8216 210752 165885 108584 424180 -111561 89199 135777 -171849
$$ packed form
15221a30334M8599j99900f589C68805h4199H855M1969f9727l7369L31B38415D4376
15208D66432b18441A48800a29763B96764D4158b50259f4854K0925J6457k53277
15198b80749Q3856E0904A4741L01157r6111p6838J67703d02096C7877n143P3728
15187A06462J81020a77954H8631o589J49352D8664k2616R2157D3152a78674O8286
15176a10388A78369a73276P1875D9161P6293R3222r8235a1422p7854B77749I8891
15164I4905M2179a02592B05368a27751B46070a21039C53455e3145a6524B56086
15153H7938K18591o0296r5617L8497j729R5883I6908J2463l6255b9256A32339
15141A02259L36648r3017h216B10752m4867n7301L15596a11561H9199M6578a71849
$$ plain form
15129 -125957 -167471 -314926 -71886 169590 8562 -27642 -58322 100553 153830 45416 188930
15118 188930 222347 158189 -222076 197929 100911 -25175 -267746 308800 165542 82627
15107 -12933 77094 -63871 153787 -80901 -6327 213840 -183833 110195 282352 462119 -52486
15095 256136 225586 206536 235629 -2622 277849 180678 132653 -135215 153635 255969 269273
15084 269273 295319 29494 -65885 273851 134025 242941 -61620 -22558 165536 289851
15074 289851 -53318 369836 -77443 151502 147955 -61102 57827 182544 289321 -50432 122352
15062 235339 306600 291926 -111639 288102 45290 514672 -167059 226983 225551 -63973 -55094
15051 -55094 304089 48403 419022 87597 -25085 161304 142928 299111 -15552 7329 73773
$$ packed form
15129a25957m1514j47455g1886A69590H562b7642l0680A00553N3277D5416J43514
15118A88930L3417o4158b22076A97929r7018b5175k42571C08800j43258H2627
15107a2933G7094f3871A53787h0901f327B13840a83833A10195J72157J79767e2486
15095B56136l0550j9050K9093b622B77849r7171m8025a35215A53635J02334J3304
15084B69273K6046B9494f5885B73851A34025J08916f1620b2558A65536J24315
15074B89851e3318C69836g7443A51502l547f1102E7827J24717J06777e0432A22352
15062B35339P1261j4674a11639B88102D5290M69382a67059B26983j432f3973Q879
15051e5094C04089D8403L70619H7597b5085A61304j8376J56183a5552G329O6444
$$ plain form
15040 73773 -267538 99228 71361 231563 288365 9512 92999 253189 145814 18970 157846
15029 157846 -4427 15237 143765 49937 364505 139739 -198566 -126863 184177 500978
15019 500978 362562 -118363 352729 24756 -41256 331093 148475 591894 174214 -53294
15008 214553 123904 98578 375707 206076 431857 113762 17080 -22494 86348 539622
14998 539622 333317 126535 474448 126892 -148187 90956 412082 559722 118540 179547
14988 179547 -38427 218311 405332 528015 578359 277362 411064 -90476 37065 312191
14978 312191 356909 92749 281510 305831 287748 296323 517928 390694 239046 413038 14989
14966 301221 56498 368627 352858 346199 166475 630630 372384 44177 334993 -47054 534297
$$ packed form
15040G3773b67538I9228k7867J60202N6802I512Q3487J60190j07375A8970J38876
15029A57846d427A5237J28528D9937L14568A39739a98566P1703A84177L16801
15019E00978j38416a18363C52729B4756d1256C31093A48475M43419A74214e3294
15008B14553r0649k5326K77129j69631K25781A13762A7080b2494H6348M53274
14998E39622k06305A26535L47913A26892a48187I0956L21126J47640A18540O1007
14988A79547c8427B18311J87021J22683N0344B77362J33702i0476C7065K75126
14978C12191M4718I2749J88761K4321j8083Q575K21605j27234j51648J73992A4989
14966C01221E6498L12129j5769o659A66475M64155k58246D4177K90816d7054E34297
$$ plain form
14954 567966 781 158121 -627 288576 219985 295278 502174 398846 567816 59027 -13597
14942 361089 127236 266067 82744 266832 551190 305753 529009 329298 505727 234948
14931 330359 468602 40328 405861 600962 520676 418361 164375 291829 202561 19385
14920 370091 204500 492949 291000 314517 272122 361718 496200 322296 14601 67716
14910 67716 361414 515832 328027 323267 280417 425503 213464 256733 490231 419069 196679
14898 534101 153691 210357 529755 209418 355300 221126 363952 129068 184805 361264
14888 361264 436908 300633 166770 798698 458085 469377 201691 356352 418884 461142
14878 461142 313155 189737 434954 143757 155883 572002 521162 439774 505018 235864
$$ packed form
14954E67966G81J57340f27B88576o8591P5293K06896j03328J68970E9027a3597
14942C61089A27236J38831H2744J84088K84358k45437K23256j99711J76429B34948
14931C30359J38243D0328L65533J95101q0286j02315A64375J27454q9268A9385
14920C70091j65591K88449k01949K3517m2395Q9596J34482j73904A4601N3115
14910F7716K93698J54418j87805m760m2850J45086k12039M3269K33498p1162A96679
14898E34101A53691N6666L19398B09418J45882j34174J42826A29068N5737J76459
14888C61264P5644j36275j33863O31928l40613J1292B01691J54661O2532M2258
14878D61142j47987j23418K45217A43757J2126M16119n0840q1388O5244B35864
$$ plain form
14867 107324 577503 395295 786340 609784 347230 359618 705108 406247 462383 160287
14856 226951 214594 486166 315277 285535 325305 517850 323601 474720 92102 611302
14846 611302 709157 366335 254062 517710 536546 585141 606000 40907 227059 274834 575962
14835 575962 602531 482643 641405 651397 101794 195651 647081 618686 441260 538338 917461
14824 917461 314465 436411 365381 494380 419105 504525 686520 742899 436413 403543
14814 403543 628408 667423 555382 462110 283366 337595 382896 528747 742668 464356
14804 464356 228752 374785 446701 402763 618511 606433 491904 593082 335427 925165
14794 925165 473400 774189 720057 624657 454922 435251 416299 690957 783430 509038
$$ packed form
14867A07324M70179j82208L91045j76556k62554J2388L45490k98861N6136A60287
14856B26951j2357K71572j70889k9742L9770J92545j94249J51119I2102N19200
14846F11302R7855l42822j12273K63648J8836M8595K0859D0907J86152M7775L01128
14835E75962K6569j19888J58762R992A01794R3857M51430k8395j77426R7078L79123
14824I17461C14465J21946p1030J28999p5275Q5420J81995N6379l06486l2870
14814D03543K24865L9015j12041r3272j78744N4229M5301J45851K13921k78312
14804D64356B28752J46033P1916m3938K15748j2078j14529J01178k57655N89738
14794I25165m51765L00789n4132r5400j69735j9671j8952K74658R2473k74392
$$ plain form
14784 509038 625557 428910 429208 646396 278772 494105 690765 753511 841302 906645 437674
14772 266708 416252 645319 727171 706451 599812 250209 476318 781083 569954 788486
14762 788486 702620 885239 663013 763040 865402 605536 428881 846733 424203 547349
14752 547349 598295 748485 766493 618516 864051 892554 955511 734543 627420 718403
14742 718403 570113 1025998 467460 575414 710329 411974 764009 547229 648037 913449
14732 913449 637556 567793 819016 629101 1001212 720866 693354 1014717 970025 723169
14722 723169 973538 685717 620323 999113 749585 833569 372008 847804 908160 1148605
14712 1148605 1034251 891365 1084633 929797 557242 665988 1256067 693475 1145399
$$ packed form
14784E09038J16519j96647K98K17188B78772K15333J96660O2746Q7791O5343D37674
14772B66708J49544K29067Q1852k0720j06639B50209K26109L04765k11129K18532
14762G88486q5866J82619k22226J00027J02362k59866j76655M17852m22530J23146
14752E47349N0946J50190J8008j47977K45535K8503O2957k20968j07123R0983
14742G18403j48290M55885D67460J07954J34915k98355L52035k16780J00808K65412
14732I13449k75893o9763K51223j89915L72111k80346k7512L21363m4692k46856
14722G23169K50369k87821o5394L78790k49528Q3984C72008M75796O0356K40445
14712A148605j14354j42886J93268j54836l72555J08746N90079n62592M51924
$$ plain form
14703 1145399 828607 939490 1209562 1213872 655344 862437 869745 843323 669812 925601
14693 925601 787423 804004 1120175 950289 705772 682944 1154359 665733 828943 976562
14683 976562 778091 1012168 1085922 849678 1015031 855568 1227603 833052 955631 1210395
14673 1210395 824838 1044180 929176 995310 1167263 949560 869076 1273040 890914 1251215
14663 1251215 1048707 1080811 1081844 1068735 987517 1143933 808129 1334287 1087065 1261271
14653 1261271 953405 1259710 919676 1241740 1438400 1293468 1064564 1041919 1197122 901895
14643 901895 1135031 820278 1039033 1390857 1328441 1382414 1396589 1159469 1487928 1063971
14633 1063971 1473803 1326875 1140150 1042312 1463260 1569393 1261688 1396038 1035537 1475051
$$ packed form
14703A145399l16792J10883K70072M310n58528K07093P308k6422j73511K55789
14693I25601j38178J6581L16171j69886k44517k2828M71415m88626J63210J47619
14683I76562j98471K34077P3754k36244J65353j59463L72035l94551J22579K54764
14673A210395l85557K19342j15004O6134J71953k17703q0484M03964l82126L60301
14663A251215k02508L2104J033j3109q1218J56416l35804N26158k47222J74206
14653A261271l07866L06305l40034L22064J96660j44932k28904k2645J55203k95227
14643I01895K33136l14753K18755L51824o2416N3973J4175k37120L28459m23957
14633A063971M09832j46928j86725r7838M20948J06133l07705J34350l60501M39514
$$ plain form
14623 1475051 1339038 1649006 1428714 1457473 1649665 1491878 1686720 1372602 1393954 1649929
14613 1649929 1583541 1488044 1550906 1538565 1280725 1684910 1638045 1594975 1608407 1604741 1708797
14602 1708797 1474012 1895022 1725516 1717210 1583758 1970318 1703283 1573319 1849728 1725277
14592 1725277 1954306 1614035 1774760 1954435 1706876 1686498 1684842 2030986 2032521 2366287
14582 2366287 1697511 1860375 1833236 1831870 1982058 2084450 1938657 2021201 1958257 2159836
14572 2159836 1895694 2273036 2368827 2389021 2555831 2678048 2560921 2550290 2646251 2833298
14562 2833298 2468992 2947990 2634226 2770115 2764068 2912936 3220861 3741241 3456599 3696140
14552 3696140 4228734 4720305 5317145 7092333 10543623 18685096 40278856 47919862
$$ packed form
14623A475051j36013L09968k20292K8759J92192j57787J94842l14118K1352K55975
14613A649929o6388r5497O2862j2341k57840M04185m6865m3070J3432l666J04056
14602A708797k34785M21010j69506q306j33452L86560k67035j29964K76409j24451
14592A725277K29029l40271J60725J79675k47559k0378j656L46144J535L33766
14582B366287o68776J62864k7139j366J50188J02392j45793Q2544o2944K01579
14572B159836k64142L77342R5791K0194J66810J22217j17127j0631R5961J87047
14562B833298l64306M78998l13764J35889o047J48868L07925N20380k84642K39541
14552C696140N32594M91571N96840J775188L451290Q141473K1593760P641006
$$ plain form
14544 47919862 18378745 9614381 7509820 4131609 2879581 2405159 2420523 2360283 2274991
14535 2274991 1878006 2350835 1726296 2013722 2225934 2550049 2242388 2038117 2031721 2315570
14525 2315570 2205113 2211984 2313548 2362063 2465356 2564513 2728819 2507209 2397452 2857517
14515 2857517 2541603 2576438 2707459 2570087 2905041 3053989 2771725 2956622 2840261 2811826
14505 2811826 3033672 3130403 3027744 3152900 3104297 2974402 3106239 3171765 3084400 3532292
14495 3532292 3446042 3184654 3322219 3228972 3556180 3345182 3650723 3564015 3501142 3789709
14485 3789709 4078490 3814107 3907978 3665305 3886720 4230763 3767409 4156696 3872693 4146469
14475 4146469 3971030 4117156 4313722 4129521 4506393 4700302 4261953 4688675 4596034 4980884
$$ packed form
14544D7919862A8378745q764364k104561l378211j252028m74422J5364o0240q5292
14535B274991l96985M72829o24539K87426K12212L24115l07661k04271o396K83849
14525B315570j10457O871J01564M8515J03293R9157J64306k21610j09757M60065
14515B857517l15914L4835J31021j37372L34954J48948k82264J84897j16361k8435
14505B811826K21846R6731j02659J25156m8603j29895J31837O5526q7365M47892
14495C532292q6250k61388J37565r3247L27208k10998L05541q6708o2873K88567
14485C789709K88781k64383R3871k42673K21415L44043m63354L89287k84003K73776
14475D146469j75439J46126J96566j84201L76872J93909m38349M26722r2641L84850
$$ plain form
14465 4980884 4144548 4511908 4706187 4812941 4584015 5089282 4544291 5019453 5181327
14456 5181327 4865707 5081645 5176086 5205952 5355206 5258591 5535015 5476811 5874471 5629437
14446 5629437 5986997 5744109 5841175 5773809 6159332 6345711 5981558 6478850 6337972 6151162
14436 6151162 6614254 6441292 6719003 6580635 6900326 6875789 6943590 6985912 6868336 7080835
14426 7080835 7171455 7068991 7602421 7605346 8093640 7983081 8140909 8196729 8320239 8047264
14416 8047264 8533388 8554119 8679785 8698465 9004230 9058639 9541115 9315237 9223910 9582652
14406 9582652 10003367 9762630 10195281 10425263 10045744 10616593 11171722 10935305 11203600
14397 11203600 11223241 11325318 11830886 12121178 11719081 12339064 12220796 12567770 12843720
$$ packed form
14465D980884q36336L67360J94279J06754k28926N05267n44991M75162J61874
14456E181327l15620K15938R4441K9866J49254r6615K76424n8204L97660k45034
14446E629437L57560k42888R7066o7366L85523J86379l64153M97292j40878j86810
14436F151162M63092j72962K77711j38368L19691k4537O7801M2322j17576K12499
14426G080835R0620j02464N33430K925M88294j10559J57828N5820J23510k72975
14416H047264M86124K0731J25666J8680L05765N4409M82476k25878r1327L58742
14406I582652M20715k40737M32651K29982l79519N70849N55129k36417K68295
14397A1203600J9641J02077N05568K90292m02097O19983j18268L46974K75950
$$ plain form
14388 12843720 12950116 13377620 13404906 13601576 13989054 14073479 14345822 14687658 15106664 15290565
14378 15290565 15681659 15708731 16159574 16570478 16544002 16976470 17234563 17900726 18033572 18495097
14368 18495097 18643841 19225753 19452200 19822513 20247615 21053665 21160862 21315184 22323706
14359 22323706 22657974 22741914 23977107 24358720 24718461 25259061 25883361 26604406 27023346
14350 27023346 27995891 28341697 29325234 30024782 30449897 31181123 32212692 33324866 34011225
14341 34011225 34833116 36082717 37068441 37957167 38840218 40053846 40960004 42194362 43538689
14332 43538689 45064239 46322000 47854329 49467070 50679664 52212887 53989242 55887749
14324 55887749 57495259 59378719 61211822 63530086 65833187 68050111 70578332 73021304
$$ packed form
14388A2843720J06396M27504K7286J96670L87478Q4425K72343L41836M19006J83901
14378A5290565L91094K7072M50843M10904k6476M32468K58093O66163J32846M61525
14368A8495097J48744N81912K26447L70313M25102Q06050J07197J54322J008522
14359B2323706L34268Q3940J235193L81613L59741N40600O24300P21045M18940
14350B7023346R72545L45806R83537O99548M25115P31226J031569J112174O86359
14341C4011225Q21891J249601R85724Q88726Q83051J213628R06158J234358J344327
14332D3538689J525550J257761J532329J612741J212594J533223J776355J898507
14324E5887749J607510J883460J833103K318264K303101K216924K528221K442972
$$ plain form
14316 73021304 75918423 78704379 81453588 84962327 87965547 91399954 95130657 99202432
14308 99202432 103491328 107748398 112448925 117739670 122271016 127797095 133877473 139650833
14300 139650833 146167049 153172321 160222756 168276011 176813714 184974361 194026132 203836995
14292 203836995 214179682 224708306 235697380 247552355 259744070 272433600 286116632
14285 286116632 300013713 314053295 328872332 343560684 358484127 373113216 387542391
14278 387542391 401315415 414759641 427163794 438312729 447900155 455473147 459339215
14271 459339215 461180236 462498205 460535332 458073363 453759094 447380885 439073050 428091699
14263 428091699 415506520 401971828 387572609 372267450 356442729 340831998 325346699
$$ packed form
14316G3021304K897119K785956K749209L508739L003220L434407L730703M071775
14308I9202432M288896M257070M700527N290745M531346N526079O080378N773360
14300A39650833O516216P005272P050435Q053255Q537703Q160647R051771R810863
14292B03836995J0342687J0528624J0989074J1854975J2191715J2689530J3683032
14285B86116632J3897081J4039582J4819037J4688352J4923443J4629089J4429175
14278C87542391J3773024J3444226J2404153J1148935R587426P572992L866068
14271D59339215J841021J317969j962873k461969m314269o378209q307835j0981351
14263D28091699j2585179j3534692j4399219j5305159j5824721j5610731j5485299
$$ plain form
14256 325346699 309696940 294928158 279878171 267401589 254139447 241549866 229071074
14249 229071074 217496287 206666872 196366911 186840896 177795431 169704588 161460860
14242 161460860 153488685 146463652 139509350 133168031 127507546 122293589 116564443 111694103
14234 111694103 106612426 102253585 98309285 94655106 90933699 86983631 84083614 80329666
14226 80329666 76971374 74455728 71582634 69025176 66722534 64257098 62249604 59936334
14218 59936334 58023350 56034917 54385963 52107997 51272678 49754066 48101227 46506821
14210 46506821 44879612 43519159 42400507 41954291 40881882 39370248 37895493 36883169
14202 36883169 36056248 35249049 34781474 33243463 32665657 31681999 30529847 29889720 29406484
$$ packed form
14256C25346699j5649759j4768782j5049987j2476582j3262142j2589581j2478792
14249B29071074j1574787j0829415j0299961r526015r045465q090843q243728
14242A61460860p972175p025033o954302o341319n660485n213957n729146m870340
14234A11694103n081677m358841l944300l654179l721407l950068k900017l753948
14226H0329666l358292k515646k873094k557458k302642k465436k007494k313270
14218E9936334j912984j988433j648954k277966q35319j518612j652839j594406
14210D6506821j627209j360453j118652m46216j072409j511634j474755j012324
14202C6883169q26921q07199m67575j538011n77806r83658j152152o40127m83236
$$ plain form
14193 29406484 28589041 27849023 27180341 26630369 25948134 25083986 24741877 23835214 23855026
14184 23855026 23379792 22649276 21939204 21684457 21397678 20713372 20116454 20002705 19429468
14175 19429468 19034159 18892077 18552690 18058239 17526921 17360285 16482755 16569804 16350641
14166 16350641 16069210 15607703 15397040 15114885 14859319 14434102 14263661 13872394 13963058
14157 13963058 13878189 13073089 13238563 13122239 12449756 12420157 12379783 12023976 11986008 11786612
14147 11786612 11131130 11243687 10969327 10823249 10454499 10344869 10492211 10052616 10031634
14138 10031634 10104923 9767177 9694867 9293861 9509375 9241270 9170128 8912502 8895545 8691371
14128 8691371 8701807 8586859 8520954 8576892 8330056 7628967 8006728 7446907 7933055 7831657
$$ packed form
14193B9406484q17443p40018o68682n49972o82235q64148l42109r06663J9812
14184B3855026m75234p30516p10072k54747k86779o84306n96918j13749n73237
14175A9429468l95309j42082l39387m94451n31318j66636q77530Q7049k19163
14166A6350641k81431m61507k10663k82155k55566m25217j70441l91267R0664
14157A3963058q4869q05100J65474j16324o72483k9599m0374l55807l7968j99396
14147A1786612o55482J12557k74360j46078l68750j09630J47342m39595k0982
14138A0031634P3289l37746p2310m01006K15514k68105p1142k57626j6957k04174
14128H691371J0436j14948o5905N5938k46836p01089L77761n59821M86148j01398
$$ plain form
14118 7831657 7760159 7528859 7251454 7158193 6999185 7234776 6985913 6967807 7141192 6795908
14108 6795908 6912713 6511764 6278965 6691908 6258328 6190051 6202817 6309355 6140466 6009478
14098 6009478 5729483 5709518 5702955 5843945 5404956 5412641 5547293 5542874 5716126 5458597 5307187
14087 5307187 5242728 5190653 4881386 4979508 4885276 5211900 4838689 4866936 4629160 4698383
14077 4698383 4746259 4640541 4618987 4626389 4507773 4557779 4252169 4388258 4177726 4659350
14067 4659350 3887429 4232099 3913592 4088159 4027938 4230206 4254102 3617171 4044721 4199416
14057 4199416 4009417 4006038 3692403 3867291 3908002 3679885 3590277 3569837 3292428 3658779
14047 3658779 3640255 3889946 3476523 3142010 3335843 3415542 3465129 3291768 3310736 2986860
$$ packed form
14118G831657p1498k31300k77405r3261j59008K35591k48863j8106J73385l45284
14108F795908J16805m00949k32799M12943m33580o8277J2766J06538j68889j30988
14098F009478k79995j9965o563J40990m38989P685J34652m419J73252k57529j51410
14087E307187o4459n2075l09267R8122r4232L26624l73211K8247k37776O9223
14077D698383M7876j05718k1554P402j18616N0006l05610J36089k10532M81624
14067D659350p71921L44670l18507J74567o0221K02268K3896o36931M27550J54695
14057D199416j89999l379l13635J74888M0711k28117q9608k0440k77409L66351
14047C658779j8524K49691m13423l34513J93833P9699M9587j73361J8968l23876
$$ plain form
14037 2986860 3136939 3143548 3078897 3259137 3016115 3047172 3156313 3090416 3080677 2706286 2800649
14026 2800649 2959478 2959138 2716784 2956039 2574197 2536263 2510377 2900332 2536413 2747477
14016 2747477 2313373 2460862 2514969 2540036 2263286 2360423 2494176 2109312 2463143 2375363
14006 2375363 2430486 2596072 2206580 2514809 2171232 2165203 2214382 2172863 2280430 2040767
13996 2040767 2013513 2082287 2481944 2096955 2193045 2230101 2576952 3529397 5249528 11250081
13986 11250081 30705416 52291193 25408910 12993903 7785765 5866575 5026402 4104264
13978 4104264 3928981 3486740 2989987 2861405 2880272 2738159 2479539 2744353 2309593 2344947
13968 2344947 2646578 2525431 2336518 1983346 2535275 2226905 2361176 2360260 2111014 2078320
$$ packed form
14037B986860J50079O609o4651J80240k43022L1057J09141o5897r739l74391R4363
14026B800649J58829l40k42354K39255l81842l7934k5886L89955l63919K11064
14016B747477m34104J47489N4107K5067k76750R7137J33753l84864L53831q7780
14006B375363N5123J65586l89492L08229l43577o029M9179m1519J07567k39663
13996B040767k7254O8774L99657l84989R6090L7056L46851R52445J720131O000553
13986A1250081J9455335K1585777B5408910j2415007n208138j919190q40173r22138
13978D104264j75283m42241m96753j28582J8867j42113k58620K64814m34760L5354
13968B344947L01631j21147j88913l53172N51929l08370J34271r16k49246l2694
$$ plain form
13958 2078320 2185276 2141151 2169940 2091848 1931147 1937359 1844121 1813644 2080929 1755126 2023151
13947 2023151 1450177 1870588 1871238 1567914 1685970 1948526 1650829 1904742 1714864 1675079
13937 1675079 2139176 1304903 1720915 1298534 1299025 1562919 1846995 1698911 2034485 1658996
13927 1658996 1623819 1593657 1680776 1517589 1721880 1483357 1588511 1684705 2046386 1481867
13917 1481867 1536999 1358165 1439284 1286529 1525156 1529314 1372081 1518608 1199356 1615184
13907 1615184 1744455 1862783 1428514 1649177 1502244 1307806 1385152 1071060 1120531 1377871
13897 1377871 1275928 1164482 1482892 1262816 1184041 1484733 1368486 1271931 1143159 1496909
13887 1496909 1518383 1163917 1281444 1111706 1137933 1175688 749901 1164784 1031641 1476163
$$ packed form
13958B078320J06956m4125K8789p8092j60701O212r3238l0477K67285l25803K68025
13947B023151n72974M20411O50l03324J18056K62556k97697K53913j89878l9785
13937A675079M64097q34273M16012m22381M91K63894K84076j48084L35574l75489
13927A658996l5177l0162Q7119j63187K04291k38523J05154R6194L61681n64519
13917A481867N5132j78834Q1119j52755K38627M158j57233J46527l19252M15828
13907A615184J29271J18328m34269K20663j46933j94438P7346l14092M9471K57340
13897A377871j01943j11446L18410k20076p8775L00692j16247r6555j28772L53750
13887A496909K1474l54466J17527j69738K6227L7755m25787M14883j33143M44522
$$ plain form
13877 1476163 1190477 1113890 873763 1294283 789469 1101178 1014919 1259303 1215069 746913
13867 746913 1190581 1025211 1059146 1205113 1428044 1165052 1165817 994704 871443 895532
13857 895532 1140268 1260810 1068058 1106895 719550 918452 732470 998813 949449 1151584
13847 1151584 1259850 872103 863412 910358 970047 1024916 1206938 1084480 907660 1078479
13837 1078479 930311 884112 900784 851598 984571 1009603 1048584 760321 964759 920666
13827 920666 697837 546520 1045203 708476 1025303 524745 809552 573950 1032207 960399
13817 960399 645928 1258971 615345 597750 728881 953690 552805 476077 983858 1137220
13807 1137220 969587 960037 856418 570337 599424 849284 887888 695179 657909 820193
$$ packed form
13877A476163k85686p6587k40127M20520n04814L11709q6259K44384m4234m68156
13867G46913M43668j65370L3935J45967K22931k62992P65j71113j23261K4089
13857H95532K44736J20542j92752L8837l87345J98902j85982K66343m9364K02135
13847A151584J08266l87747q691M6946N9689N4869J82022j22458j76820J70819
13837A078479j48168m6199J6672m9186J32973K5032L8981k88263K04438m4093
13827I20666k22829j51317M98683l36727L16827n00558K84807k35602M58257p1808
13817I60399l14471O13043F15345j7595J31131K24809m00885p6728N07781J53362
13807A137220j67633r550j03619k86081K9087K49860L8604j92709l7270J62284
$$ plain form
13797 820193 521503 736888 555830 966115 636738 642198 987177 589315 993847 774646
13787 774646 752154 1008149 798666 464251 348185 1000371 756334 789312 752897 957427
13777 957427 317802 524295 614827 876770 455699 638956 691408 779907 752375 401969
13767 401969 490375 634863 845358 422203 409239 558769 480622 587907 536345 668523
13757 668523 753591 738401 625601 745946 464029 352784 701843 661090 462247 394970
13747 394970 654420 1007764 562323 480617 589788 693656 373560 489608 466989 789907
13737 789907 774629 399416 597811 435985 602818 584723 774528 670657 808517 559603
13727 559603 659996 341165 662539 944716 556232 638748 623042 776631 857859 833142
$$ packed form
13797H20193k98690K15385j81058M10285l29377N460L44979l97862M04532k19201
13787G74646k2492K55995k09483l34415j16066O52186k44037L2978l6415K04530
13777I57427C17802K06493R0532K61943m21071J83257N2452Q8499k7532l50406
13767D01969Q8406J44488K10495D22203j2964J49530p8147J07285n1562J32178
13757F68523Q5068j5190j12800J20345k81917j11245L49059m0753j98843o7277
13747C94970K59450L53344m45441q1706J09171J03868l20096J16048k2619L22918
13737G89907j5278l75213J98395j61826J66833j8095J89805j03871J37860k48914
13727E59603J00393l18831L21374K82177l88484Q2516j5706J53589Q1228k4717
$$ plain form
13717 833142 460191 676010 658215 732148 575444 445679 642605 506258 449131 731961
13707 731961 762373 284611 480563 635276 516190 208020 685121 284916 846154 339782
13696 608957 969015 263808 338255 531970 470485 473297 383365 315819 602799 572374 635548
13685 635548 673925 430665 517936 558668 346276 317961 740018 264313 357557 282599 756577
13674 756577 765852 409672 327567 527578 328382 594953 499985 574793 806499 510840
13664 510840 537677 387384 422920 672806 158599 363255 314622 531732 646699 198997
13653 365998 228434 339688 355914 393712 383635 650506 392928 444954 500966 307290
13643 307290 271953 461445 759677 284820 603266 376725 423129 325085 552399 53064
$$ packed form
13717H33142l72951K15819j7795P3933j56704j29765J96926j36347n7127K82830
13707G31961L0412B84611J95952J54713j19086B08020M77101B84916N61238C39782
13696F08957L60058B63808P4447J93715o1485K812q9932o7546K86980l0425O3174
13685F35548L8377k43260Q7271M0732k12392k8315M22057B64313R3244p4958M73978
13674G56577R275l56180q2105K00011j99196K66571r4968P4808K31706k95659
13664E10840K6837j50293L5536K49886A58599K04656m8633K17110J14967A98997
13653C65998j37564J11254J6226L7798j0077K66871k57578N2026N6012j93676
13643C07290l5337J89492K98232B84820L18446k26541M6404r8044K27314E3064
$$ plain form
13632 362624 374832 311474 189518 263203 251099 525917 248981 415247 269871 455197
13622 455197 405492 275473 -75814 517725 273059 288578 446970 319193 412234 437920
13612 437920 717671 690745 544426 153417 143982 372616 423287 447056 239676 287902 443681
13601 443681 538889 264562 255519 218395 206381 367102 252114 559013 600108 436178 453190
13590 453190 170957 112910 97895 196249 103056 147396 506524 290516 281395 396043 371952
13579 371952 109703 379236 410185 423059 573308 -35660 263961 503665 603194 251446
13568 370776 289676 357760 319381 445871 277219 229273 140890 178832 523434 407271 127463
13556 225463 102226 401224 367164 281785 105950 268614 141832 290488 242203 16515
$$ packed form
13632C62624J2208o3358j21956P3685j2104K74818B48981J66266j45376J85326
13622D55197m9705j30019g5814E17725k44666J5519J58392j27777R3041K5686
13612D37920K79751k6926j46319A53417r435K28634N0671K3769k07380M8226J55779
13601D43681R5208B64562r043l7124j2014J60721j14988L06899M1095j63930J7012
13590D53190A70957n8047j5015R8354r3193M4340L59128k16008r121J14648k4091
13579C71952A09703K69533L0949J2874J50249c5660B63961K39704R9529B51446
13568C70776q1100O8084l8379J26490j68652m7946q8383L7942L44602j16163A27463
13556B25463A02226K98998l4060q5379A05950J62664j26782J48656m8285A6515
$$ plain form
13545 405109 398700 413104 260102 -19647 563508 175573 397202 39037 636303 525078
13535 525078 447262 276341 -9422 222766 -42942 262417 90325 64718 35323 473112 439897
13524 439897 149800 177309 466573 358153 40018 504829 394779 -7527 274867 16140
13513 518080 710145 -40799 273638 279957 342374 325994 34117 -31822 147439 92665 219269
13502 219269 205357 -8752 593870 21910 130205 3010 310407 462670 97106 208515 -9271
13490 539795 183945 119365 59955 497021 217352 475671 321661 337190 119762 50668
13479 62301 410159 324726 383751 289883 157977 72442 37860 392872 605713 312392 249184
13468 249184 -47172 245396 77673 364516 309665 5132 267681 183069 272494 262407 206762
$$ packed form
13545D05109o409J4404j53002a9647E63508A75573K21629C9037N97266j11225
13535E25078p7816j70921i422B22766d2942B62417I0325k5607k9395M37789l3215
13524D39897A49800K7509K89264j08420D0018M64811j10050g527B74867A6140
13513E18080J92065d0799B73638O319O2417j6380C4117c1822A47439n4774J26604
13502B19269j3912h752E93870B1910J08295C010L07397J52263I7106J11409i271
13490E39795A83945o4580n9410M37066B17352K58319j54010J5529A19762E0668
13479F2301L47858q5433N9025r3868j31906G2442l4582L55012K12841k93321o3208
13468B49184d7172B45396G7673K86843n4851E132K62549q4612Q9425j0087n5645
$$ plain form
13457 206762 149562 107410 -26702 110157 122740 46601 581319 277368 164126 340188
13447 340188 81801 119237 15989 59631 109475 342526 430773 244393 455306 363036 303642
13436 303642 222623 171127 227336 152356 39894 173886 36413 367224 37544 471121 323310
13425 323310 398674 56494 347878 423997 100888 -28070 198812 317445 -52183 735623
13414 272973 339627 208453 278667 116436 182250 228536 152394 170005 336472 -46055 -45460
13403 -45460 155344 274665 57751 359378 -10981 307328 516198 212324 197839 202384 -41601
13391 -15641 204449 301806 112294 250344 51050 296235 43311 141602 213618 200890 201005
13380 201005 284706 90815 -125287 -26624 244342 117568 214398 148854 259431 349598 -58586
$$ packed form
13457B06762n7200m2152b6702A10157J2583D6601N34718B77368j13242J76062
13447C40188H1801L7436A5989M3642M9844K33051Q8247j86380K10913r2270n9394
13436C03642q1019n1496N6209p4980C9894J33992C6413L30811C7544M33577j47811
13425C23310P5364E6494K91384P6119A00888b8070A98812J18633e2183G35623
13414B72973O6654j31174P0214A16436O5814M6286p6142J7611J66467d6055N95
13403d5460A55344J19321E7751L01627a0981C07328K08870B12324j4485M545d1601
13391a5641B04449R7357A12294J38050E1050K45185D3311R8291P2016j2728J15
13380B01005Q3701I0815a25287b6624B44342A17568R6830o5544J10577R0167e8586
$$ plain form
13368 144021 368684 445910 505224 76644 215680 246998 345189 125291 7049 119874 597084
13357 597084 284588 211678 328478 116773 378408 297681 93056 391143 166858 11433
13346 64283 469395 -7640 365417 562478 430792 303395 576728 259189 265295 303228 79475
13334 250170 -27223 226598 397030 321186 406779 191100 99687 326232 -53258 301617
13323 380383 -16341 426791 138629 294659 153972 308468 118460 133929 50701 156613
13313 156613 -27933 164074 -8391 68487 582555 289110 292535 106643 125348 256360 142497
13302 142497 99375 73629 -141838 -325790 468807 472351 637327 83892 87792 -137548 12473
13290 90733 -13305 301588 143691 195786 141038 264675 130801 -101338 48937 -38931 -41466
$$ packed form
13368A44021K24663P7226N9314G6644J39036L1318R8191A25291G049J12825M77210
13357E97084B84588p2910J16800A16773K61635q0727I3056K98087A66858A1433
13346F4283M05112g640C65417J97061j31686j27397K73333B59189O106L7933G9475
13334B50170b7223B26598J70432p5844Q5593A91100r1413K26545e3258C01617
13323C80383a6341D26791A38629J56030j40687J54496A18460J5469E0701J05912
13313A56613b7933A64074h391F8487N14068B89110L425A06643J8705J31012j13863
13302A42497m3122k5746a41838j83952D68807L544J64976H3892L900a37548A2473
13290I0733a3305C01588A43691N2095n4748J23637A30801a01338D8937c8931k535
$$ plain form
13279 -41466 187496 -45049 -73764 275014 339123 2964 -125379 364273 188058 -61218 134457
13267 19505 223157 -121790 247269 -204874 194982 259027 -18012 426879 -11446 -172332
13257 -172332 -69497 -76364 307510 75263 291046 302285 248930 174460 110345 -35135 -193152
13246 -193152 167627 -91089 272037 -148175 139624 -23042 7552 81167 104283 225858 238960
13235 238960 -9103 -99314 247188 -176677 352671 41108 129327 -2405 227204 -63603 414288
13223 -69005 -16652 135913 34472 46738 31308 -33498 177419 385854 -281943 32654 447825
13212 447825 -52031 271841 396366 393662 119153 150314 75384 532579 -195054 -191534 -165553
13201 -165553 119900 291371 291745 143252 234067 77340 235097 -172911 248159 -106106
$$ packed form
13279d1466A87496d5049k8715B75014O4109B964a25379C64273j76215f1218A34457
13267A9505K03652a21790B47269b04874A94982O4045a8012D26879a1446j60886
13257a72332f9497o867C07510G5263K15783J1239n3355p4470o4115c5135j58017
13246a93152A67627i1089B72037a48175A39624b3042G552P3615K3116J21575J3102
13235B38960i103r0211B47188a76677C52671D1108Q8219b405B27204f3603D14288
13223f9005a6652A35913C4472J2266j5430c3498A77419K08435b81943C2654M15171
13212D47825e2031B71841J24525k704A19153L1161p4930M57195a95054L520K5981
13201a65553A19900J71471L74A43252R0815G7340J57757a72911B48159a06106
$$ plain form
13190 -111030 -78712 -111740 270568 139391 106418 178174 33306 71022 -144828 81867 19694
13178 107735 173014 -61534 99458 -98472 -58196 498834 -29276 238966 -19011 114396 127767
13167 127767 254241 418491 221499 -20248 -109298 -47334 220990 59643 157164 -57065 -105436
13156 -105436 -48859 12057 -97918 -153514 22538 264399 322638 -279434 -193914 -50034 -118160
13145 -118160 163978 17266 120440 161194 -22107 194143 -198108 192335 66085 -135675
13134 -132248 -191162 270056 374873 -185430 158329 243623 169918 -39148 204935 69528
13123 174072 -8316 172569 191981 -300505 4830 31097 -36627 381148 473358 260814 -23518
13111 233132 12546 170123 541176 60539 309547 503679 9024 32758 141663 290594
$$ packed form
13190a11030L2318l3028B70568j31177l2973P1756C3306L7716a44828H1867A9694
13178A07735O5279f1534I9458i8472M0276D98834b9276B38966a9011A14396J3371
13167A27767J26474J64250j96992b0248q9050d7334B20990E9643R7521e7065m8371
13156a05436d8859A2057i7918n5596B2538K41861N8239b79434Q5520e0034o8126
13145a18160A63978A7266J03174M0754b2107A94143a98108A92335F6085a35675
13134a32248n8914B70056J04817a85430A58329Q5294p3705c9148B04935F9528
13123A74072h316A72569J9412c00505D830K6267c6627C81148R2210k12544b3518
13111B33132A2546J57577L71053F0539K49008J94132I024K3734J08905J48931
$$ plain form
13101 290594 130203 -10583 100804 -16129 65439 193556 169796 -34826 -131230 -145428 158019
13089 24633 121614 -63105 -158469 -142129 7082 -15251 37042 -220341 80586 72818 232757 -83779
13076 362367 -281833 190477 -412324 37497 32520 -278876 425352 -109412 -347044 -87096
13065 -52237 218476 33913 -39877 294216 13320 251566 -67827 -30526 234321 64766 231151
13054 231151 270325 228580 32257 63873 163297 33231 295442 470027 217884 260074 -128384
13042 -61940 -76995 235147 95170 -110357 -78455 -175174 302002 123815 264618 655904
13032 655904 -20311 16541 -293254 353695 -110102 210241 407844 281606 79864 268988
13022 268988 113516 180137 205125 286154 130453 -144593 -164058 4527 260991 212493 313393
$$ packed form
13101B90594A30203a0583A00804a6129F5439J28117k3760c4826r6404j4198A58019
13089B4633R6981f3105r5364J6340G082a5251C7042b20341H0586p768J59939h3779
13076C62367b81833A90477d12324C7497m977b78876D25352a09412k37632h7096
13065e2237B18476C3913c9877B94216A3320K38246f7827c0526B34321F4766J66385
13054B31151L9174m1745C2257L1616R9424C3231K62211J74585B17884M2190a28384
13042f1940j5055B35147I5170a10357L1902r6719C02002A23815J40803L91286
13032F55904b0311A6541b93254C53695a10102B10241J97603j26238G9864J89124
13022B68988A13516O6621K4988Q1029A30453a44593j9465D527K56464m8498J00900
$$ plain form
13011 313393 367272 -140916 75790 638 -180452 99381 -124036 308492 235805 235033 280195
13000 280195 50422 116717 253052 313976 203742 221912 259870 13847 32396 -302554 -37778
12988 140893 10058 122602 59787 -41412 74239 48495 -99501 171208 -91289 153143 -224865
12976 156569 -79367 23448 147494 139558 870 73224 118667 110927 -28480 49877 -11528 267173
12963 254492 217736 36543 -119279 -60426 286120 7520 67897 135851 64359 -105932 345492
12951 -90850 120117 58226 204497 90300 -149277 270308 -69300 102943 -18230 10272 -40253
12939 16884 -31086 143137 -326604 -247407 -29824 -32905 165629 -18436 -77927 76989 391941
12928 391941 118175 45120 31372 126280 -47709 -257897 -32739 248748 90108 -29429 250196
$$ packed form
13011C13393N3879a40916G5790F38a80452I9381a24036C08492p2687p72M5162
13000B80195E0422O6295J36335O0924j10234J8170L7958A3847J8549c02554c7778
12988A40893A0058J12544E9787d1412G4239k5744i9501A71208i1289A53143b24865
12976A56569g9367B3448J24046p936H70P2354M5443p740b8480D9877a1528B67173
12963B54492l6756C6543a19279N8853B86120G520O0377O7954F4359a05932C45492
12951i0850A20117E8226J46271I0300a49277B70308f9300A02943a8230A0272d0253
12939A6884c1086A43137c26604P9197b9824l081A65629a8436n9491G6989L14952
12928C91941A18175D5120j3748R4908d7709k10188c2739B48748I0108b9429B50196
$$ plain form
12916 -196951 57855 -68090 -37504 -304467 171159 -105405 -168744 -271027 22351 157416
12906 157416 182607 -49407 48256 196429 41157 -72390 -10934 59201 183999 -57153 136935
12894 110239 -219378 345914 -59589 -261650 -49459 -98461 -127775 500128 1159 222913 -4800
12882 22778 -307135 -19104 -130376 171748 34145 112547 93027 119349 255035 123805 -57143
12870 -293697 315157 -164115 108642 14658 -263031 143449 19644 -72101 -540026 -149792
12859 -351115 89180 -60220 -60620 266993 -81441 27959 -75893 116296 192344 -96524 -230714
12848 -230714 170824 -58334 110891 11342 160229 -263097 238489 -89548 -143373 -44735
12837 153922 216591 -72228 141637 -326604 20151 158392 168424 148983 67018 -176256 128261
$$ packed form
12916a96951E7855f8090L0586k66963A71159a05405o3339j02283B2351J35065
12906A57416K5191d9407D8256J48173D1157g2390a0934E9201J24798e7153A36935
12894A10239b19378C45914e9589k02061d9459m9002k9314E00128A159K21754d800
12882B2778c07135a9104j11272A71748C4145P8402j9520K6322J35686A23805e7143
12870b93697C15157a64115A08642A4658b63031A43449A9644g2101m67925a49792
12859c51115H9180f0220m00B66993h1441B7959g5893A16296P6048i6524j34190
12848b30714A70824e8334A10891A1342J48887b63097B38489h9548n3825d4735
12837A53922O2669g2228A41637c26604B0151J38241J0032j9441F7018a76256A28261
$$ plain form
12825 277801 -126196 343649 -121258 18127 -85802 10335 -463330 18464 188426 93221
12814 17396 71276 197181 -236717 150530 90484 -14867 36445 27715 147629 47806 -114360
12802 -3097 -121638 27493 -208460 -36274 206693 161758 -212788 48170 110415 -60518 -5557
12790 -73575 38182 -36657 237450 -74679 -143034 -88368 201688 -84373 -63073 201781 54472
12778 87707 17949 -2670 -13434 -333444 151513 48119 262849 -74969 -53430 114390 -243124
12766 -407953 -325948 1072 -135833 -99281 272122 -330718 50454 349487 64378 -331318 31274
12754 77133 -395514 20862 -21879 110547 -63682 125718 81250 -174519 -52347 375213 55042
12742 -270192 113999 -102252 -129122 -306234 -16201 374574 -29496 171531 274085 170831
$$ packed form
12825B77801a26196C43649a21258A8127h5802A0335d63330A8464J69962I3221
12814A7396N3880J25905b36717A50530o0046a4867C6445q730J19914D7806a14360
12802c097j18541B7493b08460c6274B06693m4935b12788D8170O2245f0518e557
12790g3575C8182c6657B37450g4679o8355N4666B01688h4373K1300B01781E4472
12778H7707A7949b670j0764l20010A51513D8119K14730g4969K1539A14390b43124
12766d07953Q2005A072a35833L6552B72122c30718E0454K99033F4378c31318C1274
12754G7133c95514B0862b1879A10547f3682A25718m4468a74519e2347C75213E5042
12742b70192A13999a02252k6870j77112a6201C74574b9496A71531J02554j03254
$$ plain form
12732 170831 -47574 -27658 -206571 395186 478852 -91028 -106955 194089 115323 41390 -11749
12720 201932 -225224 183785 -131404 280870 -55032 265327 -47291 -7846 209073 213678 112658
12709 112658 181638 321310 241426 197249 11066 204586 474636 230223 48646 166042
12699 166042 37635 68157 182514 176348 210005 -336856 -225193 319989 -287018 261933
12688 374736 225255 -391431 -108919 36844 203804 141843 146560 66783 -186057 -103027 62783
12676 60048 206397 291533 -18614 -32501 217494 286280 320850 21577 44621 290868 154829
12665 154829 53188 158762 27576 -55299 -66479 121338 209324 276962 263941 27651 418971
12654 418971 75806 176147 11759 160705 68068 196128 130821 -162278 269000 218811
$$ packed form
12732A70831d7574J9916j78913C95186Q3666i1028j5927A94089p8766D1390a1749
12720B01932b25224A83785a31404B80870e5032B65327d7291g846B09073M605j01020
12709A12658O8980J39672p9884m4177A1066J93520K70050B30223D8646J17396
12699A66042C7635L0522J14357o166L3657c36856J11663C19989b87018B61933
12688C74736j49481c91431a08919C6844J66960o1961M717F6783a86057Q3030F2783
12676F0048J46349Q5136a8614j3887B17494O8786L4570B1577K3044K46247j36039
12665A54829E3188J05574B7576e5299j1180A21338Q7986O7638j3021B7651L91320
12654D18971G5806J00341A1759J48946F8068J28060o5307a62278B69000n0189
$$ plain form
12644 218811 -88878 -51868 89178 48211 15779 199570 -245192 -119976 -95629 -272853 64068
12632 299850 101337 -358237 419193 18269 144920 -97240 250301 -64231 258797 507775
12622 507775 383623 -49366 136706 283791 -9297 -20291 290167 312995 32793 -121528 247429
12610 342220 -53489 135979 -49123 193512 -280380 -76456 142246 12640 -88982 61219 -38248
12598 189718 37139 521440 76280 77860 336167 33905 24943 246865 -86616 -12519 -138810
12587 -138810 -140358 487821 418073 -225801 -257904 131727 -4250 -181939 -6694 118849 177760
12576 177760 -205820 -170629 100581 57986 166623 -111747 31505 300144 54100 553604
12566 553604 173420 120612 125507 21534 42311 -448839 -6072 -114783 -282820 -118896 29116
$$ packed form
12644B18811h8878L7010H9178m0967A5779J83791b45192a19976K4347j77224F4068
12632B99850A01337c58237D19193A8269J26651i7240B50301f4231B58797K48978
12622E07775j24152d9366A36706J47085i297j0994B90167K2828C2793a21528B47429
12610C42220e3489A35979d9123A93512b80380g6456A42246A2640h8982F1219c8248
12598A89718C7139M84301G6280J580K58307C3905q962K21922h6616a2519j26291
12587a38810j548D87821o9748b25801l2103A31727d250j77689f694A18849N8911
12576A77760b05820L5191A00581m2595J08637a11747C1505K68639E4100M99504
12566E53604A73420n2808M895B1534K0777d48839f072j08711j68037a18896B9116
$$ plain form
12554 110784 -42486 -117392 526946 -94430 -287212 -285908 -69861 60068 98581 52470 185266
12543 185266 -176463 220898 -22318 -122872 42390 9592 -141702 -29575 -399347 266876
12532 208009 -152301 69511 -122747 -249603 -130617 -33164 -124490 65092 -28180 -16107 391149
12520 -187278 283750 83295 192856 169215 -220733 2111 358733 -150985 242387 39042
12509 9973 27186 39915 232367 -367375 -61318 340743 -162286 77867 225131 -23434 123991
12497 25442 144328 208818 21999 -136157 166601 56640 343372 -170802 253019 -396338
12486 130575 231776 46415 -104567 27477 -46528 13513 -362189 147147 129399 9713 170629
12475 170629 2046 240049 195842 115392 -54169 14669 8706 -162552 -281540 -116891 188949
$$ packed form
12554A10784d2486p4906E26946i4430j92782J304f9861F0068L8513m6111J32796
12543A85266a76463B20898b2318j00554D2390I592a41702b9575l69772B66876
12532B08009a52301F9511a22747j26856J18986c3164r1326F5092b8180J2073C91149
12520a87278B83750H3295J09561k3641b20733B111L56622a50985B42387C9042
12509I973J7213J2729J92452c67375f1318C40743a62286G7867J47264b3434A23991
12497B5442J18886O4490B1999a36157A66601E6640K86732a70802B53019c96338
12486A30575J01201D6415a04567B7477d6528A3513c62189A47147j7748I713J60916
12475A70629B046K38003m4207q0450e4169A4669n963a62552j18988a16891A88949
$$ plain form
12463 97544 -42815 23167 335479 201809 16289 111196 -110918 264769 142641 62296 -55935
12451 272191 -130747 -225728 -48878 143523 -15841 30111 -40590 -93444 -335902 -61157 -102818
12440 -102818 107846 84246 -187257 2028 -172097 16819 71155 88426 -45530 -120726 24077
12428 180460 -140135 -143643 -222288 17808 -94657 -2854 79398 -84026 -47727 -348139 -120825
12416 -60756 -41089 62384 120050 -73908 -96008 70406 22109 -78031 -223582 67923 -122123
12404 344993 198160 224511 32216 327243 -218223 -189211 -20640 172798 206611 -44045 28715
12392 -77357 -13600 -110722 98690 256296 89394 39799 -70231 331665 69038 316578 213230
12381 213230 -183397 198518 145036 62330 76669 -60946 -130446 -6378 -137821 -230542 -51986
$$ packed form
12463I7544d2815B3167L12312j33670A6289R4907a10918B64769j22128F2296e5935
12451B72191a30747r4981d8878A43523a5841C0111d0590n2854k42458f1157m1661
12440a02818A07846k3600a87257B028a72097A6819N4336J7271d5530p5196B4077
12428A80460a40135l508p8645A7808i4657b854G9398h4026L6299l00412a20825
12416f0756J9667F2384N7666g3908k2100G0406B2109g8031j45551F7923a22123
12404C44993j46833K6351C2216K95027b18223K9012b0640A72798L3813d4045B8715
12392g7357a3600r7122I8690J57606H9394C9799g0231C31665F9038K47540j03348
12381B13230a83397A98518n3482F2330J4339f0946o9500f378j31443r2721e1986
$$ plain form
12369 -91710 171384 -14239 206728 -39109 -95873 70759 -147115 -226872 -427 -108089 -238804
12358 -238804 -361501 178444 -411581 -275159 214716 -83024 -171453 -85524 103568 -35856
12347 37392 -3268 -154779 404003 18141 93809 -260674 -111147 -129736 -95041 253229 -152602
12335 -6846 -11075 -210664 -862 -384511 66292 132287 93165 70448 -88998 80797 13477 166056
12323 166056 114496 80893 109625 -66801 58464 79016 -15025 -150512 -24544 -127113 23406
12311 69317 225931 -98544 -74860 -183245 86908 -4978 107748 -236871 -252379 122246 15469
12299 -261068 225628 86905 79097 48384 -219235 153027 -132182 119255 421798 46145
12288 -14026 55929 42936 262281 205499 338750 101149 196823 31018 236576 288068 4584
$$ packed form
12369i1710A71384a4239B06728c9109n6764G0759a47115p9757d27j07662j30715
12358b38804j22697A78444d11581J36422B14716h3024q8429h5524A03568c5856
12347C7392c268j51511D04003A8141P5668b60674a11147j8589L4695B53229a52602
12335f846m229j99589h62l83649F6292O5995l9122k2717h8998H0797A3477J52579
12323A66056n1560l3603K8732f6801E8464K0552a5025j35487b4544j02569B3406
12311F9317J56614i8544K3684j08385H6908d978A07748b36871j5508A22246A5469
12299b61068B25628H6905p808l0713b19235A53027a32182A19255L02543D6145
12288a4026E5929j2993K19345n6782J33251A01149R5674C1018K05558N1492D584
$$ plain form
12276 -49847 212661 366832 -167947 388260 -34362 5864 -126989 210529 406765 454938
12266 454938 33577 277331 225503 281221 -125782 133351 403941 7315 -192168 119015
12255 -17736 277544 -98166 5841 68318 -186791 130121 -93836 475177 40868 -247704 -91072
12243 279752 87063 88343 -54484 36598 -156824 -306007 -55186 56269 263229 -63085 164018
12231 476710 381309 -49961 429742 436216 449177 110738 419535 -114725 294392 11898 280082
12220 280082 209620 160488 79038 -252360 267296 293341 333418 432404 359389 97409 142366
12209 142366 16129 429967 -68730 -25360 -210419 137710 249817 148567 397438 -123870
12198 203582 181137 -80156 307916 172060 -152034 275681 393584 313582 -9418 397607
$$ packed form
12276d9847B12661J54171a67947C88260c4362E864a26989B10529J96236M8173
12266D54938C3577K43754n1828N5718a25782A33351K70590G315a92168A19015
12255a7736B77544i8166E841O2477a86791A30121i3836D75177D0868b47704i1072
12243B79752H7063J280e4484C6598a56824j49183e5186E6269K06960f3085A64018
12231D76710r5401d9961D29742O474J2961A10738L08797a14725B94392A1898K68184
12220B80082p0462m9132G9038b52360B67296K6045M0077R8986p3015I7409M4957
12209A42366A6129M13838f8730b5360j85059A37710J12107j01250K48871a23870
12198B03582k2445h0156C07916j35856a52034B75681J17903q0002i418C97607
$$ plain form
12187 425121 133958 57281 157027 -149030 54201 212795 265334 8717 100329 -67213 134915
12175 -159894 -14947 185095 107377 71858 239629 113910 181486 177422 129519 79798 427295
12164 427295 142236 99522 390073 27922 201759 -199496 -179706 80706 81788 83976 324711
12153 324711 40128 169505 -108827 97451 10264 78858 113402 -201151 -347283 -86910 148376
12141 100879 262903 278092 301967 182306 -174908 352779 -79453 -110561 53035 158463
12131 158463 -17275 387275 137456 183452 19765 1580 95713 251874 -128814 -75900 44816
12119 99527 40337 -2804 335668 10162 19652 -34296 -95490 64200 -71059 -101346 332755 -64010
12106 -377197 -266237 310292 288943 -10917 70324 17547 33996 218950 225011 -282353 -322579
$$ packed form
12187D25121A33958E7281R9746a49030E4201J58594N2539H717R1612f7213A34915
12175a59894a4947A85095p7718l5519J67771A13910O7576m064m7903m9721L47497
12164D27295A42236m2714K90551B7922J73837a99496J9790H0706J082K188K40735
12153C24711D0128J29377a08827I7451A0264O8594L4544b01151j46132h6910A48376
12141A00879J62024J5189K3875j19661a74908C52779g9453l1108E3035J05428
12131A58463a7275C87275A37456M5996A9765A580R4133J56161a28814N2914D4816
12119I9527D0337b804C35668A0162R490c4296o1194F4200g1059l0287C32755f4010
12106c77197J10960C10292k1349a0917G0324A7547J6449J84954O061b82353m0226
$$ plain form
12095 -322579 -136817 -12011 -156807 162600 251257 -187925 13772 48031 107430 36191 -344342
12083 -120052 -79535 -82207 208829 174336 540493 593090 1683522 2259703 645903 407839
12073 407839 150649 31701 -6605 -153701 -61867 -120688 -72342 -114447 -117961 -1405 -275039
12062 -275039 241067 79154 481877 -13819 60304 70622 -179687 183817 -56948 158318
12051 138780 -127319 -151530 -21362 209206 -325406 117816 28323 -163867 8372 375830
12041 375830 -28506 184287 239418 -247253 67683 -217857 45047 -131087 -417246 195699
12030 236071 -38758 -276813 -338733 99912 7128 -40980 -16637 -70379 -178415 41985 -161610
12018 78508 137705 207535 82916 -200868 -107458 -13064 -75097 16339 -165365 -199711 21693
$$ packed form
12095c22579a36817a2011j44796A62600Q8657a87925A3772L4259N9399C6191c44342
12083a20052M0517k672B08829l4493L66157N2597J090432N76181F45903k38064
12073D07839A50649C1701f605j47096f1867n8821M8346m2105l514a405k73634
12062b75039B41067G9154M02723a3819F0304J0318a79687A83817e6948A58318
12051A38780a27319k4211b1362B09206c25406A17816B8323a63867H372L67458
12041C75830b8506A84287N5131b47253F7683b17857D5047a31087k86159A95699
12030B36071c8758k38055o1920I9912G128d0980a6637n3742j08036D1985a61610
12018G8508N9197O9830H2916b00868R3410a3064o2033A6339a65365l4346B1693
$$ plain form
12006 -53622 72258 22822 172947 -117569 -88501 45749 -264632 160017 -229072 -219727 -498066
11995 -498066 -309636 -150772 -85401 -53203 -485916 -96170 13669 99184 -38674 168447 -179596
11983 -194295 -98787 62141 -121978 -1266 -99536 -4773 -303213 -277591 -120050 18274 59166
11972 59166 127176 -213667 -140869 66198 69621 -342338 215583 308487 -252561 38137 246714
11961 246714 -39835 -15778 -40756 -183281 236817 -183249 1327 -15238 18963 -140421 -159479
11950 -159479 -257760 48798 54681 321483 -29649 -193022 23135 -90922 334761 90350 -171502
11938 271643 150494 -117888 46730 -215476 256674 33858 -295076 -20679 200511 33767
11927 97236 40041 176804 71962 -256642 -100201 217500 -64517 -43532 -154079 -209858 -44884
$$ packed form
12006e3622G2258B2822J50125a17569K9068D5749b64632A60017b29072R345k78339
11995d98066J88430a50772O5371L2198m32713i6170A3669Q5515c8674A68447a79596
11983a94295R5508F2141a21978a266r8270d773k98440K5622a20050A8274M0892
11972E9166O8010b13667P2798F6198L423c42338B15583R2904b52561C8137K08577
11961B46714c9835a5778k4978j42525B36817a83249A327a5238A8963a40421j9058
11950a59479r8281D8798N883K66802b9649j63373B3135i0922C34761I0350a71502
11938B71643j21149a17888D6730b15476B56674C3858b95076b0679B00511C3767
11927I7236D0041J36763G1962b56642a00201B17500f4517K0985j10547n5779d4884
$$ plain form
11915 40176 278609 9755 70456 -151573 39103 147752 -15547 -133885 -31041 33143 -162404
11903 163475 -57606 56916 178428 177990 34818 -158860 -328292 364725 27892 146952 143015
11892 143015 43600 -373309 170340 -206022 -173692 -243489 -261819 119110 4482 59753 174955
11881 174955 220998 20605 -302467 281621 -248111 -137914 -30752 117215 -10567 698 127785
11870 127785 59445 255491 -8655 46244 72096 -129498 30569 147202 -108139 103751 102652
11859 102652 -42119 79693 85279 -26646 -257090 -15009 265236 -131420 -158381 -278445 -70517
11847 -17385 -11440 145179 -316615 128157 -157970 321780 41393 164681 66314 194991
11837 194991 -84575 -60459 148270 -265998 -327124 -84553 -645560 67158 299075 -99885 268558
$$ packed form
11915D0176K38433I755O0701a51573C9103J08649a5547j18338c1041C3143a62404
11903A63475e7606E6916J21512m38C4818a58860j69432C64725B7892J19060l937
11892A43015D3600c73309A70340b06022L2330o9797j8330A19110D482N5271J15202
11881A74955M6043B0605c02467B81621b48111J10197c0752A17215a0567F98J27087
11870A27785E9445J96046h655D6244K5852a29498C0569J16633a08139A03751j099
11859A02652d2119G9693N586b6646k30444a5009B65236a31420k6961j20064g0517
11847a7385N945A45179c16615A28157a57970C21780D1393J23288F6314J28677
11837A94991h4575K4116A48270b65998o1126h4553n61007F7158K31917i9885B68558
$$ plain form
11825 -140414 -125855 -376620 113739 151840 38802 127875 -94547 174678 112590 -193461 -150288
11814 -150288 33938 -113866 -23465 -110775 -409337 -2483 103930 -35477 -82159 -107322 -109589
11803 -109589 115124 117355 27989 198465 -137391 -224889 -110993 -239039 40356 -205212
11792 -156896 -230054 -85591 -185651 473360 -69554 -31917 -115208 124062 -73091 274554 100325
11780 213771 -158680 -267889 197051 -128716 -193869 -325442 191805 220911 -75718 -63936
11770 -63936 172179 -42450 -30605 -101039 95427 -52089 23072 95042 -201971 -172061 -456 233810
11757 288405 -76215 -87058 156544 195551 129325 -117552 -220475 133931 -255270 -239011
11747 -239011 52041 -40987 -193070 -88187 -122910 51748 -138285 23558 -155717 -41456 64706
$$ packed form
11825a40414J4559k50765A13739L8101C8802Q9073i4547A74678o2088a93461M3173
11814a50288C3938a13866b3465q7310k98562b483A03930c5477m6682k5163k267
11803a09589A15124K231B7989J70476a37391q7498a10993j28046D0356b05212
11792a56896p3158h5591j00060D73360f9554c1917q3291A24062g3091B74554A00325
11780B13771a58680j09209A97051a28716o5153j31573A91805K9106g5718J1782
11770f3936A72179d2450J1845p0434I5427e2089B3072P1970b01971K9910d56B33810
11757B88405g6215j0843A56544L9007o6226a17552j02923A33931b55270J6259
11747b39011E2041d0987j52083h8187l4723E1748a38285B3558a55717d1456F4706
$$ plain form
11735 150371 -190976 262276 -15211 -319745 -110905 96324 1057 6046 -54495 -202063 60999
11723 -76626 -193 163850 135805 -52736 309328 -73171 180948 216326 -235631 450877 -139561
11711 69026 47717 114570 -21847 -239540 -133990 33528 -105224 -292841 68004 -36830 83278
11699 218899 308123 -144296 117296 -17092 -139261 28880 -121509 87859 94913 135488 -103848
11687 26342 -204812 247564 -24064 -78180 -19430 -32754 253081 75432 168202 -51154 155183
11675 -193501 310851 -12829 -162773 -112573 -175626 94617 389013 359919 -184537 82408 109806
11664 109806 -18393 -330952 -169726 79654 186960 4721 -62904 -252502 200368 208052 -135579
11652 -2617 40434 157179 103173 -10445 -12896 241597 -60616 -245130 -126162 279203 140942
$$ packed form
11735A50371a90976B62276a5211l04534a10905I6324A057M989e4495j47568F0999
11723g6626a93A63850k8045e2736C09328g3171A80948L5378b35631D50877a39561
11711F9026k1309O6853b1847k17693J05550C3528a05224j87617F8004c6830H3278
11699B18899Q9224a44296A17296a7092j22169B8880a21509H7859P054M0575a03848
11687B6342b04812B47564b4064n4116a9430j3324B53081G5432R2770e1154A55183
11675a93501C10851a2829j49944N0200o3053I4617K94396k9094a84537H2408K7398
11664A09806a8393l12559J61226G9654J07306D721f2904j89598B00368P684a35579
11652b617D0434J16745n4006a0445k451B41597f0616j84514J18968B79203j38261
$$ plain form
11641 140942 -81052 143957 121985 -13877 131516 -186311 -162237 323896 -281480 43110
11630 -115195 -211849 91188 344228 24909 205464 -114802 124292 -139885 -39526 15678
11619 83485 23447 133426 -262665 1939 72105 319837 323832 -137173 -192059 328804 224498
11608 224498 -78174 411750 244240 -70297 32632 -192661 166550 -124959 -94673 -144380
11598 -144380 -136893 -27614 -199485 -322336 -128631 395042 240946 -51583 -193089 4727 -20561
11586 174715 49545 237514 290666 91089 -83406 222161 -152224 23858 -362115 26050 118224
11575 118224 -119270 105588 199292 -44537 368271 179475 14697 295937 -12369 261837
11564 -18353 113362 -16080 390203 -169055 105262 -25167 -268662 -71539 -93711 -87625 57487
$$ packed form
11641A40942h1052A43957k1972a3877A31516a86311K4074C23896b81480D3110
11630a15195r6654I1188K53040B4909J80555a14802A24292a39885c9526A5678
11619H3485B3447J09979b62665A939P0166K47732L995a37173n4886C28804j04306
11608B24498g8174D11750j67510g0297C2632a92661A66550a24959L0286m9707
11598a44380P487b7614j71871j22851a28631C95042j54096e1583j41506D727b0561
11586A74715D9545J87969N3152I1089h3406B22161a52224B3858c62115B6050R2174
11575A18224a19270A05588R3704d4537C68271A79475A4697K81240a2369B61837
11564a8353A13362a6080C90203a69055A05262b5167k43495g1539k2172O086E7487
$$ plain form
11552 240173 22452 180411 -232837 -238158 -35356 -267436 -87439 114967 -105922 141286
11541 211058 312436 316921 158447 228841 -95116 48879 253121 -16961 147546 250797 92432
11529 188811 315651 132808 251273 146684 -112572 -24633 282520 196755 223891 -178996
11518 -82217 173666 401890 286384 104987 -52468 282697 -128100 -312279 231731 454861
11508 454861 32336 388159 44438 200336 48742 22197 28150 -111262 284886 -59067 168892
11496 199440 49774 318676 358499 225993 17027 245223 194392 49891 -3389 18378 159613
11485 159613 68543 -83903 240554 66998 75001 169041 416990 81222 623 325821 109459
11473 148395 216547 18634 323759 246378 376223 103650 5870 -11828 280744 640202 52712
$$ packed form
11552B40173B2452J57959b32837n321c5356k32080h7439A14967a05922A41286
11541B11058J01378M485A58447P0394i5116D8879K04242a6961A47546J03251I2432
11529A88811J26840A32808J18465j04589a12572b4633B82520q5765K7136a78996
11518h2217A73666K28224j15506A04987e2468B82697a28100j84179B31731K23130
11508D54861C2336L55823D4438J55898D8742B2197N953a11262B84886e9067A68892
11496A99440D9774K68902L9823j32506A7027K28196n0831D9891c389A8378J41235
11485A59613F8543h3903B40554F6998Q003R4040K47949H1222F23L25198A09459
11473A48395O8152A8634L05125p7381J29845A03650E870a1828B80744L59458E2712
$$ plain form
11461 -23836 116309 182351 30314 29819 53922 -154181 304119 433898 92869 49701 219014
11450 219014 437683 -205279 -67496 269119 126609 317691 24205 226475 152169 130162
11440 130162 196257 -1762 120342 -4461 -21389 90689 -181697 -2115 143206 20837 265510
11429 265510 -364325 200807 -152672 42598 148721 230011 108543 -13715 -48465 53539
11418 -41512 80565 -118010 -335958 247049 103536 223805 68401 28076 182031 -26180
11407 -239234 192626 24577 164255 367541 122678 245067 322884 135506 -27428 -49898
11397 -49898 127998 170283 -2339 235860 -53128 -40417 31852 -141609 -243738 86273 -103056
11385 -288596 154946 -47440 -165462 94895 293515 -287410 182607 -114227 40504 -136735
$$ packed form
11461b3836A16309O6042C0314m95K4103a54181C04119J29779I2869m3168J69313
11450B19014K18669b05279f7496B69119A26609J91082B4205K02270p4306k2007
11440A30162O6095a762A20342d461j6928I0689a81697b115A43206B0837K44673
11429B65510c64325B00807a52672D2598J06123Q1290A08543a3715l4750E3539
11418d1512H0565a18010k17948B47049A03536J20269F8401B8076J53955b6180
11407b39234A92626B4577J39678K03286A22678J22389P7817A35506b7428k2470
11397d9898A27998M2285b339B35860e3128J2711C1852a41609j02129H6273a03056
11385b88596A54946d7440j18022I4895J98620b87410A82607a14227D0504a36735
$$ plain form
11374 -20394 154297 94606 -91693 301986 -380064 -87501 -53280 -260396 -212562 -189549 -358814
11363 -358814 -132466 -72994 -174696 -217214 -131591 -17931 -215596 259291 -215181 165238
11352 72690 -82302 29412 -149674 -299769 -176059 -340597 -297367 93893 7772 -133818 -119646
11341 -119646 114936 -63409 -97808 -52573 224567 170323 40958 52279 -416513 -33703 -307091
11330 -307091 5588 -146229 -354569 7994 -192221 214950 -3083 -199636 -123612 -100483 276930
11318 -159276 -181164 -84024 123839 82252 282228 -88181 -106519 -237070 -15072 -86767 165640
11306 109717 61612 120064 266568 -278720 -296814 -413327 13414 -409131 -179625 128529
11295 -49244 107453 120121 -371528 185515 23005 -448192 -298285 207759 -67320 190115
$$ packed form
11374b0394A54297n9691i1693C01986c80064h7501L4221k07116M7834K3013j69265
11363c58814a32466N9472j01702m2518Q5623a7931j97665B59291b15181A65238
11352G2690h2302B9412a49674j50095J23710j64538M3230I3893G772a33818J4172
11341a19646A14936f3409l4399M5235B24567n4244D0958J1321d16513c3703k73388
11330c07091E588a46229k08340G994a92221B14950c083j96553P6024K3129B76930
11318a59276k1888h4024A23839m1587J99976h8181j8338j30551a5072p1695A65640
11306A09717m8105N8452J46504b78720j8094j16513A3414d09131a79625A28529
11295d9244A07453J2668c71528A85515B3005d48192J49907B07759f7320A90115
$$ plain form
11284 -43773 -171128 -8438 89647 -91440 -74607 -39546 -100775 -4440 115392 -57773 -84720 185
11271 195920 162226 197391 106683 68484 -161674 -121045 -172795 167091 -18645 -32811 -316778
11260 -316778 -245454 -102060 150288 -122339 -90710 -163099 211740 -56317 305198 -86944
11249 -7795 -10871 122808 131868 118367 -262729 41856 12153 -151069 13944 3548 178489 -75832
11236 -186890 -224791 201679 24635 167401 -82492 -163443 191545 -259454 81422 13441 -225462
11224 -105808 -200052 141062 -251448 19500 -275140 -83741 43235 -183640 -17351 -250156
11214 -250156 -239791 218816 -117626 -60850 -11804 46695 185258 -97816 -345776 41724 22074
11203 22074 250957 209919 92295 -129451 24039 -360649 134920 -44292 -188340 214566
$$ packed form
11284d3773j27355h438H9647i1440J6833L5061o1229d440A15392e7773k6947A85
11271A95920l3694L5165r0708l8199a61674M0629n1750A67091a8645j4166k83967
11260c16778P1324a02060A50288a22339L1629p2389B11740e6317C05198h6944
11249g795l076A22808R060j3501b62729D1856A2153a51069A3944C548J74941g5832
11236a86890l7901B01679B4635J42766h2492q0951A91545b59454H1422A3441b25462
11224a05808r4244A41062b51448A9500b75140h3741D3235a83640a7351k32805
11214b50156J0365B18816a17626N6776a1804D6695J38563i7816k47960D1724j9650
11203B2074K28883m1038I2295a29451B4039c60649A34920d4292j44048B14566
$$ plain form
11192 -247802 17963 -194258 -208265 -108629 -51312 158042 188651 -257069 -186504 265807 20381
11180 -269721 83129 -249200 83682 260762 25078 247058 8857 11677 -133956 148183 -8797
11168 -401023 -69665 -337143 -189717 -11864 111375 195266 49019 -111883 -76956 -92330 83352
11156 248636 -92922 -37349 -39176 244096 80670 -185404 31892 -202444 -252319 -213063 294851
11144 255957 -426782 -151665 47998 325675 254289 -174331 237932 -150669 399964 149298
11133 -112506 -76536 134136 -152639 -6913 -253950 164805 304191 291014 -155853 -140109
11123 -140109 108182 109380 -103257 -26410 -119853 266055 209940 -103380 160066 287177
11113 287177 130530 -69919 329878 -238714 218562 80069 8239 274244 -22496 237818
$$ packed form
11192b47802A7963a94258j4007R9636e1312A58042L0609b57069P0565B65807B0381
11180b69721H3129b49200H3682J77080B5078K21980H857K820a33956A48183h797
11168d01023f9665k67478J47426a1864A11375Q3891D9019a11883L4927j5374H3352
11156B48636i2922c7349j827B44096H0670a85404C1892b02444m9875L9256B94851
11144B55957d26782a51665D7998K77677p1386a74331B37932a50669C99964A49298
11133a12506L5970A34136a52639f913k47037A64805J39386j3177a55853J5744
11123a40109A08182J198a03257b6410r3443B66055n6115a03380A60066J27111
11113B87177A30530f9919C29878b38714B18562H0069H239K66005b2496B37818
$$ plain form
11102 111543 -144419 316155 172986 -46154 -3049 22594 258395 584597 156553 112985
11092 112985 -67144 -171948 131104 -55459 105951 333165 53034 273144 405766 251009
11082 251009 251066 270277 147593 248771 17826 239326 145225 306671 263096 527034 222564
11070 241165 79906 459958 185133 150298 367201 596379 606986 331004 492619 999243
11060 999243 498541 419463 258307 591133 822307 634412 702384 877127 632971 668270
11050 668270 555675 692092 851879 679461 735466 927621 520373 437761 917712 738372
11040 738372 718181 594888 813650 733309 715184 584440 612211 619420 918109 523540 579624
11029 579624 790865 800754 625948 548232 1008259 589336 586233 981452 752176 793007 988267
$$ packed form
11102A11543a44419C16155j43169d6154c049B2594K35801L26202A56553m3568
11092A12985f7144j04804A31104e5459A05951K27214E3034K20110J32622j54757
11082B51009N7J9211j22684J01178A7826K21500r4101J61446m3575K63938B22564
11070B41165G9906L80052A85133l4835K16903K29178J0607k75982J61615N06624
11060I99243D98541p9078j61156L32826K31174j87895O7972J74743k44156L5299
11050F68270j12595J36417J59787j72418N6005J92155m07248q2612M79951j79340
11040G38372k0191j23293K18762q0341j8125j30744K7771P209K98689l94569N6084
11029E79624K11241R889j74806p7716M60027m18923l103L95219k29276M0831J95260
$$ plain form
11018 988267 567334 400105 346023 -48908 635525 672119 561645 856960 471568 518543
11008 518543 540318 428045 807929 452953 963501 734368 775630 760125 733363 337853
10997 458049 519033 259905 141738 791773 667070 654452 822822 667496 716584 640102
10987 640102 506518 909192 854341 1118216 1232883 906371 1096584 1165708 1444872 1007035
10977 1007035 1789881 1718939 1874439 2069890 2321366 2712045 2739244 2579259 2355640 2427908
10967 2427908 2174077 2248788 1940996 1765447 1402685 1584431 1794815 1906704 1632459 1517856
10957 1517856 1894385 2220703 1983538 1838508 1624574 1377563 1374485 728663 723258 688531
10947 688531 617601 479147 644538 309854 454680 473214 298285 403033 -413999 414938
$$ packed form
11018I88267m20933j67229n4082d8908F35525L6594j10474K95315l85392M6975
11008E18543K1775j12273L79884l54976N10548k29133M1262j5505k6762C37853
10997D58049O0984k59128j18167O50035j24703j2618J68370j55326M9088p6482
10987F40102j33584M02674n4851K63875J14667l26512J90213O9124K79164m37837
10977A007035P82846p0942J55500J95451K51476L90679K7199j59985k23619P2268
10967B427908k53831P4711l07792j75549l62762J81746K10384J11889k74245j14603
10957A517856L76529L26318k37165j45030k13934k47011l078o45822n405l4727
10947F88531p0930j38454J65391C09854J44826J8534j74929J04748d13999D14938
$$ plain form
10936 181405 327190 -25045 523108 108749 135281 438440 82883 10547 285740 80609
10925 92462 177376 244242 74757 67069 213574 -97211 -64722 -91121 104759 240834 -241283
10913 90493 215597 56427 232331 -239294 -33111 371585 81776 -24633 -102484 -354012 80432
10901 -62174 5985 -156425 58347 88116 186760 139526 -111098 64932 108379 -255694 70250
10889 74679 -216681 -14569 72048 -104597 -325550 -63293 141454 78211 -72387 -63447 -246982
10878 -246982 -50818 44506 9016 -394771 97998 -149064 133608 -22654 154287 204756 -107052
10866 144174 451806 309112 -195507 -108064 -314293 -383765 265494 -75966 178751 -104960
10855 179081 -116125 -190205 161350 -158160 97627 -246167 15504 -262120 59012 28707
$$ packed form
10936A81405J45785b5045E23108A08749K6532L03159H2883A0547K75193H0609
10925I2462Q4914O6866G4757p688J46505i7211L2489k6399A04759J36075b41283
10913I0493J25104E6427J75904b39294c3111C71585H1776b4633p7851k51528H0432
10901f2174E985a56425E8347K9769R8644m7234a11098F4932M3447b55694G0250
10889G4679b16681a4569G2048a04597k20953f3293A41454o3243g2387Q940j83535
10878b46982e0818D4506I016c94771I7998a49064A33608b2654A54287N0469a07052
10866A44174L07632j42694a95507Q7443k06229o9472B65494g5966A78751a04960
10855A79081a16125p4080A61350a58160I7627b46167A5504b62120E9012B8707
$$ plain form
10844 -151449 -17861 75426 -57587 333317 -72133 117796 234518 -67554 -286520 -169658
10834 -169658 102111 -36961 245515 170539 -143425 -214824 -34635 74301 -128742 -69270 -315949
10823 -315949 61749 -164875 -231472 -53034 -257065 170858 -128402 -175213 -112259 -102635 356423
10811 -183231 -187733 8113 -162684 -130378 -220922 146281 -33992 7999 -83548 -233237 27529
10799 -148770 2391 -23687 -500825 -210573 -162051 -229951 -111531 -74159 107000 -310591 -228113
10788 -228113 -142175 192719 -159529 -108670 159675 247847 -19583 -41299 -29781 -219127 -210199
10777 -210199 -139832 242830 57808 80498 -228852 -34157 -305482 179313 41801 60759 64999
10766 64999 -319663 -122610 15972 -70706 -259075 -497 -66340 -23983 -182244 6890 -48977
$$ packed form
10844a51449a7861G5426e7587C33317g2133A17796J16722f7554k18966J16862
10834a69658A02111c6961B45515p4976a43425p1399c4635G4301a28742N9472k46679
10823c15949F1749a64875o6597e3034k04031A70858a28402m6811O2954R624C56423
10811a83231m502H113a62684L2306r0544A46281c3992G999h3548j49689B7529
10799a48770B391b3687m77138b10573M8522o7900a11531L7372A07000c10591Q2478
10788b28113Q5938A92719a59529N0859A59675Q8172a9583k1716J1518j89346Q928
10777b10199P0367B42830E7808K2690b28852c4157k71325A79313D1801J8958M240
10766F4999c19663a22610A5972g0706j88369d97o5843b3983j58261F890d8977
$$ plain form
10754 147193 -434206 -67013 -186835 -26686 -225768 211480 -132962 109189 191055 67745
10743 -32578 -113485 -59123 -122713 -92588 -9181 -360374 -71979 -140913 -210270 8515 99650 284948
10731 284948 225707 -177127 130938 -280966 8435 -183968 7311 49668 155783 -27676 -178018
10720 -178018 -4651 129379 65596 -1953 -348700 28589 -41139 -127706 -4126 -6652 -168786 -39817
10707 54508 -122481 -19656 -76570 121558 -434690 -186862 180237 64830 -192831 -331093
10697 -331093 -101334 -43886 281659 174067 -266014 78072 123910 -144991 46818 -397588
10686 -74696 -56592 -267891 16223 -226432 -133087 159353 -286300 182694 -18211 -155562
10676 -155562 106002 65399 -154921 -74979 95503 -339760 240807 278136 110325 -32331
$$ packed form
10754A47193d34206f7013j19822b6686j99082B11480a32962A09189Q1866F7745
10743c2578q0907N4362o3590L0125i181l51193g1979o8934o9357H515R1135J85298
10731B84948n9241a77127A30938b80966H435a83968G311M2357J06115b7676j50342
10720a78018d651A29379o3783a953l46747B8589d1139q6567d126k526j62134c9817
10707E4508a22481a9656n6914A21558d34690a86862A80237F4830a92831j38262
10697c31093a01334d3886B81659j07592b66014G8072M5838a44991D6818c97588
10686g4696J8104k11299A6223b26432R3345A59353b86300A82694a8211j37351
10676a55562A06002m0603a54921g4979I5503c39760B40807L7329A10325c2331
$$ plain form
10665 -70844 70723 18179 13865 -48295 244135 73022 -277014 -146910 123226 183446 -315438
10653 -327415 12532 204915 62460 -68318 74000 -66434 46009 -226856 97670 310125 -76598
10641 -91984 -140438 137400 73064 266553 -292822 -257377 -155909 151647 69836 97782 -20652
10629 -162363 87561 98389 155321 16853 102261 77511 46077 140896 -32929 -2033 -220761
10618 -220761 79808 -86743 -363700 -47341 -144764 -52095 137686 60724 69338 186540 -373920
10606 -141112 -49971 -277896 -81578 -47 73175 -248757 -359930 -193815 89965 -199082 -142891
10595 -142891 -113792 -35861 28651 -38460 17817 -43953 4843 324601 -294672 34776 -199875
10583 -114941 -318070 -33232 -169712 4845 -109891 215857 11576 99553 80514 459930 -93883
$$ packed form
10665g0844G0723A8179m314d8295B44135G3022b77014J30104A23226O0220c15438
10653c27415A2532J92383F2460f8318G4000f6434D6009b26856I7670K12455g6598
10641i1984m8454A37400o4336J93489b92822L5445J01468A51647F9836K7946b0652
10629a62363H7561J0828N6932A6853Q5408k4750l1434R4819c2929b033k18728
10618b20761G9808h6743k76957d7341r7423e2095A37686F0724Q614J17202c73920
10606a41112d9971k27925h1578d7G3175b48757j11173J66115H9965a99082N6191
10595a42891K9099c5861B8651c8460A7817d3953D843L19758b94672C4776a99875
10583a14941k03129c3232j36480D845a09891B15857A1576Q7977j9039L79416i3883
$$ plain form
10571 -115268 -61874 -252873 218915 -314840 117156 -12644 -35755 199231 -163080 227078
10560 192660 170739 145327 -378816 -193363 210701 224022 19200 180708 218358 -167020
10549 -79431 -159001 -86563 195989 -357534 -180326 -283004 245508 -32920 278170 -36424
10538 58021 -80977 -64339 33376 11597 -74556 -194462 161129 -214722 -90574 -68623 -287746
10527 -287746 -192505 8781 -404883 120605 -9009 -102206 55294 -380783 56473 117458 -113587
10515 35216 -60646 -303366 -37485 -208191 -618715 282690 89834 -32119 107968 106451 168926
10504 168926 -243909 150970 -229218 -128616 156552 -107864 223141 7846 -158241 -83379
10494 -83379 32215 17195 -66703 -143040 93344 -113347 64744 -265766 -32159 -150533 22945
$$ packed form
10571a15268N3394j90999B18915c14840A17156a2644k3111A99231a63080B27078
10560A92660k1921k5412c78816J85453B10701J3321A9200J61508L7650a67020
10549g9431p9570P2438A95989c57534J77208j02678B45508c2920B78170c6424
10538E8021h0977J6638C3376A1597g4556j19906A61129b14722i0574K1951k19123
10527b87746R5241H781d04883A20605i009r3197E5294c80783E6473O0985a13587
10515C5216f0646k42720c7485j70706m10524B82690H9834c2119A07968j517O2475
10504A68926b43909A50970b29218J00602A56552a07864B23141G846a58241P4862
10494h3379C2215j5020f6703p6337I3344a13347F4744b65766c2159j18374B2945
$$ plain form
10482 215470 289384 -407893 527559 455242 522565 147457 69485 126310 -72789 -131738 59578
10470 196227 -187091 351 72301 -377554 -92803 -311401 99423 -147938 -160527 12215 380409
10459 380409 -182947 -308665 178556 -117559 -144287 341937 68494 39394 53278 119561
10449 119561 399289 -97560 -155956 -72683 70765 123829 -324289 175422 370055 261639
10439 261639 -419795 157418 23971 -300287 -120172 -84654 142985 -64121 -285673 73380
10428 -77276 84550 -130487 -155951 -230116 -35826 140573 -388929 -39684 81746 -150110 -511437
10417 -511437 110546 -274792 56135 -291786 -119615 -15282 116485 -184496 89571 53036
10407 53036 -88179 75600 -240296 12840 -104827 25434 -326844 -215800 157380 104144 165215
$$ packed form
10482B15470P3914d07893E27559p2317O7323A47457F9485N6825g2789n8949E9578
10470A96227a87091C51P1950c77554i2803k18598I9423a47938j2589A2215L68194
10459C80409a82947j25718A78556a17559k6728C41937F8494k9100J3884O6283
10449A19561K79728i7560n8396g2683G0765N3064c24289A75422J94633j08416
10439B61639d19795A57418B3971c00287a20172L5518A42985f4121k21552G3380
10428g7276H4550a30487k5464p4165c5826A40573c88929c9684H1746a50110l61327
10417e11437A10546b74792E6135b91786a19615a5282A16485a84496H9571l6535
10407E3036h8179G5600b40296A2840a04827B5434c26844J11044A57380n3236O1071
$$ plain form
10396 165215 -233032 -89787 331575 154070 272119 299125 285535 107804 -278636 218256
10385 55047 -41663 -85440 174732 -31012 -98856 318142 144346 -109917 392008 486190 270395
10374 270395 368038 424731 58 98563 144118 92305 339551 748756 419952 808322 278787
10362 334057 34120 238252 322624 522956 280383 231230 110737 306372 173047 416647
10352 416647 496866 381098 733596 223303 49437 248557 530630 458233 469645 297998
10342 297998 432118 57117 205991 182544 313259 -116924 111075 22668 344747 42481
10331 70087 64115 -166449 26998 150591 76248 290551 222855 -37586 246550 121843 115949
10320 115949 60709 273794 73394 295052 -10149 73326 -113196 160203 -1809 271546 -110551
$$ packed form
10396A65215b33032h9787C31575A54070J18049K7006j3590A07804b78636B18256
10385E5047d1663m3777A74732c1012o7844C18142A44346a09917C92008R4182k15795
10374B70395R7643N6693E8R8505M5555n1813K47246M09205l28804L88370B78787
10362C34057C4120K04132Q4372K00332k42573m9153A10737J95635j33325K43600
10352D16647Q0219j15768L52498B23303D9437J99120K82073p2397J1412j71647
10342B97998J34120E7117J48874k3447J30715a16924A11075B2668L22079D2481
10331G0087n972a66449B6998J23593p4343K14303o7696c7586B46550A21843n894
10320A15949n5240K13085G3394K21658a0149G3326a13196A60203a809B71546a10551
$$ plain form
10308 242670 318575 -190451 251419 -18621 185483 50493 107487 72885 226891 69133 326233
10297 326233 236439 -90738 22922 -40448 49885 -137977 224893 31309 -319433 -194406 238447
10285 -117978 252743 -83009 181999 6804 41225 16012 77905 275672 128986 -391380 115769
10273 -23353 -210604 -308173 -74207 -25485 -446885 -56139 -131218 -171883 -453780 124385 -46559
10261 -7110 -171493 -82347 -196376 482952 411555 439988 189632 103376 360475 112528 -77997
10249 250652 27842 263 17434 -78316 -55724 114574 17512 -340528 -127062 -176120 262324
10237 29820 -88570 -96268 176336 -245146 -81700 47316 -55564 173361 255644 90818 -409001
10225 -41582 -240856 -104089 123673 -224668 256602 -132562 -382115 -112285 -71933 -109138
$$ packed form
10308B42670P5905a90451B51419a8621A85483E0493N6994l4602J54006F9133K57100
10297C26233q9794i0738B2922d0448D9885a37977B24893C1309c19433J25027B38447
10285a17978B52743h3009A81999F804L4421A6012O1893J97767A28986c91380A15769
10273b3353j87251r7569g4207b5485m21400e6139p5079m0665k81897A24385d6559
10261g110j64383h2347j14029D82952p1397K8433A89632q6256K57099A12528g7997
10249B50652B7842B63J7171g8316K2592A14574A7512c40528a27062m9058B62324
10237B9820h8570p698A76336b45146h1700D7316e5564A73361Q2283I0818d09001
10225d1582j99274a04089A23673b24668B56602a32562k49553a12285M0352l7205
$$ plain form
10215 -109138 203492 239090 -27261 -87953 -151027 66736 -5136 -86860 -69326 -234272 10084
10203 81978 -135423 -146906 74132 1803 -159684 68483 -114899 -267286 -83311 309168 70099
10191 -108019 -78243 48934 -52407 -52512 255845 -282929 -222681 3442 -405588 76258 -169866
10179 -71280 -8094 -229016 -46487 125706 -373942 -9501 189913 -106817 -451580 -67028 -65644
10168 -65644 -93561 -75250 108625 -310845 -3379 -369996 -275342 68343 20216 -43579 -145628
10157 -145628 -493167 -285848 -118771 -35185 -127598 181654 191358 117756 -42876 -203484 -199060
10146 -199060 -113781 19845 -145327 -11598 100517 20094 -110077 34251 90480 -259047 90518
10134 -328139 -383071 -3037 -3251 -206895 31708 -130804 -120490 -271629 105529 50049 134307
$$ packed form
10215a09138B03492L5598b7261o0692o3074F6736e136q1724J7534j64946A0084
10203H1978a35423j1483G4132A803a59684F8483a14899j52387h3311C09168G0099
10191a08019K9776D8934e2407j05B55845b82929O0248C442d05588G6258a69866
10179g1280h094k20922d6487A25706c73942i501A89913a06817l44763f7028J384
10168f5644k7917J8311A08625c10845c379l66617R4654F8343B0216d3579j02049
10157a45628l47539K07319a18771c5185r2413A81654R704p3602d2876j60608M424
10146a99060Q5279A9845a45327a1598A00517B0094a10077C4251N6229b59047I0518
10134c28139n4932c037k14k03644C1708a30804J0314j51139A05529E0049Q4258
$$ plain form
10123 134307 -78646 -377717 -352022 13957 -193439 -183850 -245628 -215544 123555 54344 65400
10112 65400 -118910 -7715 -237639 -229905 -19153 350046 221541 -165025 282781 -41595 -2722
10100 -267184 158867 57312 -131976 83780 11686 -272367 132404 -234207 -57086 -232969
10090 -232969 64509 202164 -99203 107905 -64033 -349777 -49683 90583 259182 -196490
10079 -239281 -111258 94152 -83492 -164324 -101138 19568 43529 -75278 -282867 94812 291664
10068 291664 -117125 41549 -158963 -22179 80700 83413 -111757 -396049 -117627 -92358 1468
10056 -134878 -95993 -129630 -362594 -24574 240590 20147 -98080 262278 -68341 -307489 -38642
10044 -285650 -130214 19783 -15300 -111676 -30759 98682 234989 -46825 10874 -188342 -234676
$$ packed form
10123A34307g8646k99071K5695A3957a93439R589o1778L0084A23555E4344J1056
10112F5400a18910g715k29924P734a9153C50046j28505a65025B82781d1595b722
10100b67184A58867E7312a31976H3780A1686b72367A32404b34207e7086j75883
10090b32969F4509J37655i9203A07905f4033k85744d9683I0583J68599a96490
10079b39281a11258I4152h3492q0832O3186A9568K3961g5278k07589I4812J96852
10068B91664a17125D1549a58963b2179H0700K713a11757k84292a17627K5269A468
10056a34878L8885l3637k32964b4574B40590B0147i8080B62278f8341k39148c8642
10044b85650a30214A9783a5300r6376c0759I8682J36307d6825A0874a88342m6334
$$ plain form
10033 -234676 -25443 -123930 -177776 235396 -65478 -219269 -66738 -18727 -249251 -309819 48916
10021 14352 -278564 -3057 211783 -202948 -138873 213131 -57026 101302 -29361 -72273 -430274
10010 -430274 -31682 -61426 -144116 28653 -221936 -205478 -2260 -148654 17758 -470383 -52781
9998 28072 85394 -1200 -90390 -37794 -103160 -134475 -17276 40371 -51562 46111 44946 2793
9985 185704 112215 17745 245736 -18724 -204755 -18808 131902 -202766 -120803 -178079 254170
9973 -116367 -36877 -21284 214610 -18626 -4149 -274627 -19437 83331 127749 -292226 -76548
9961 -139094 10872 15991 93634 -299266 -192559 -221439 -104026 56881 -70720 328970 259161
9950 259161 10720 -205278 -123647 -189247 -66291 -114406 -261866 169067 -119993 -176785 -34685
$$ packed form
10033b34676b5443r8487n3846B35396f5478j53791f6738a8727k30524o0568D8916
10021A4352b78564c057B11783b02948O4075B13131e7026A01302b9361m2912l58001
10010d30274c1682k9744q2690B8653b21936J6458b260j46394A7758d70383e2781
9998B8072N7322a200q9190c7794o5366l1315a7276D0371e1562D6111j165B793
9985A85704p3489A7745K27991a8724j86031a8808A31902b02766Q1963n7276B54170
9973a16367c6877J5593B14610a8626d149k70478a9437H3331M4418b92226g6548
9961a39094A0872N119P7643b99266J06707k8880a04026E6881g0720C28970o9809
9950B59161A0720b05278Q1631o5600f6291m8115j47460A69067a19993n6792c4685
$$ plain form
9938 115092 -47108 140431 234451 -56386 -100744 -204135 -97905 -188429 3520 364 179236 -441472
9925 -224957 -277743 26337 4658 -161815 -334382 83709 156224 -254176 370777 153031 -298825
9913 -550336 -212278 -170912 -114752 -281922 -32159 -151295 -72542 -183163 151429 -365545
9902 266758 -135262 -112666 44391 252747 -169643 199019 -64826 210197 -315692 92408
9891 8993 71325 -97822 -131328 237493 -300862 6342 24956 -262730 -125390 -177082 47417
9879 -262654 98602 -132668 17892 -276561 165810 -269157 -88966 -206631 -308459 -264602
9869 -264602 -27525 -302951 -205839 -30742 44626 -35906 -52529 39045 22176 271140 -131481
9857 -394497 -81399 201536 -213144 -385532 -337044 -57618 -119851 -106555 -489271 -765 -131424
$$ packed form
9938A15092d7108A40431R4020e6386m4358j03391i7905r0524C520C64J78872d41472
9925b24957n2786B6337D658a61815j72567H3709P2515b54176C70777A53031b98825
9913e50336b12278M1366N6160j67170c2159j19136g2542j10621A51429c65545
9902B66758a35262K2596D4391K08356a69643A99019f4826B10197c15692I2408
9891H993O2332i7822l3506B37493c00862F342J8614b62730a25390n1692D7417
9879b62654I8602a32668A7892b76561A65810b69157h8966j17665j01828M3857
9869b64602b7525k75426R7112c0742D4626c5906j6623C9045j6869K48964a31481
9857c94497h1399B01536b13144j72388M8488e7618o2233J3296l82716g65j30659
$$ plain form
9846 -131424 -155563 76494 61953 22449 -75329 -395996 -167777 14745 -52778 -244269 -31814
9834 131929 -86668 24212 -229445 -82692 -110578 -45297 -256717 142258 -274763 -267076 -29084
9822 144712 -41561 56215 -32402 -153580 139861 250654 127632 135965 161423 -184040 255661
9810 -346076 -89541 39762 -86189 -471959 -110064 -175213 -275190 125215 5865 -20998 68815
9798 -258707 -305505 -71329 235257 219338 376622 31195 87730 -142503 -323018 -510158 -124287
9786 -90547 98488 -262259 81387 -355859 -116750 -374588 -93951 313100 -44716 -232173 -9516
9774 155702 178626 220694 -236838 224071 128901 -203456 -305889 -38882 -223138 150338
9763 110809 112009 -136241 -208441 -114026 12610 84802 42641 -152215 -42854 78911 -171003
$$ packed form
9846a31424k4139G6494j4541B2449g5329l20667a67777A4745e2778j91491c1814
9834A31929h6668B4212b29445h2692k7886d5297k11420A42258b74763P687b9084
9822A44712d1561E6215c2402j21178A39861J10793j23022Q333K5458a84040B55661
9810c46076h9541C9762h6189l85770a10064o5149r9977A25215E865b0998F8815
9798b58707m6798g1329B35257j5919J57284C1195N6535a42503j80515j87140a24287
9786i0547I8488b62259H1387c55859a16750k57838i3951C13100d4716j87457i516
9774A55702K2924M2068b36838B24071r5170b03456j02433c8882j84256A50338
9763A10809J200a36241p2200R4415A2610P2192m2161a52215d2854G8911a71003
$$ plain form
9751 267220 -21451 -157279 -210963 -106491 16712 -194995 199846 -5727 122051 54344 -37341
9739 317944 -170556 -8727 168167 -179214 -138552 96950 -535547 -129960 -16055 -271644 -54455
9727 46863 -322322 -246302 -91616 -284788 -187967 -48192 -79529 108778 188275 -143114 187178
9715 -181016 -220883 -91279 -151158 -2290 -104662 -242805 43211 -135932 109386 256917 -236337
9703 -65917 -27590 129256 -157719 -113335 126596 -127298 -269893 114815 -33366 -141242
9693 -141242 -88208 134008 -378452 82818 29999 -241391 168944 -292291 -184235 -283293
9683 -283293 -58629 -1397 15052 -402140 -27367 -168259 -166557 -10522 -184287 -164522 -57378
9671 -338756 -186158 6933 -120659 50699 -46400 -91630 360977 -41411 191211 104624 -62525
$$ packed form
9751B67220b1451j35828n3684J04472A6712a94995A99846e727A22051E4344c7341
9739C17944a70556h727A68167a79214M0662I6950e35547a29960a6055k55589e4455
9727D6863c22322P6020i1616j93172R6821d8192l1337A08778P9497a43114A87178
9715a81016l9867i1279n9879b290j02372j38143D3211a35932A09386J47531b36337
9703f5917b7590A29256a57719M4384A26596a27298j42595A14815c3366j07876
9693a41242N3034A34008c78452H2818B9999b41391A68944b92291J08056r9058
9683b83293e8629a397A5052d02140b7367j40892J702a0522j73765J9765e7378
9671c38756J52598F933a20659E0699d6400m5230C60977d1411A91211q6587f2525
$$ plain form
9659 -52109 60668 5454 -189787 111775 -320170 502543 9063 8202 -46348 -142382 180429 -341606
9646 -237511 272417 -37277 -285774 251256 -38916 -178907 -86593 -15320 -139691 103451
9635 -76403 287554 -167675 -54653 -291351 -300377 51018 -4778 155169 3941 -151273 -169710
9624 -169710 -267731 4907 -251404 16822 194560 -421449 4491 233405 128603 -272589 -49101
9612 -325374 -12667 -162295 -41229 -5136 -168857 -248357 -179753 312400 83741 21690 -209531
9600 -252177 -169784 -123116 -289021 -46210 49285 -275875 -28188 -224409 105341 -32192 -14058
9588 -244431 -99092 -112420 138664 -171939 104633 -219541 -52438 -109070 -95634 -167111 -89435
9577 -89435 -203635 -202892 -177074 -317057 -160037 -78234 30263 197084 -169770 -252649 -43717
$$ packed form
9659e2109F0668E454a89787A11775c20170E02543I063q61d6348r6034A80429c41606
9646b37511B72417c7277k48497B51256c8916j39991h6593a5320j24371A03451
9635g6403B87554a67675e4653k36698r026E1018d778A55169C941a51273j8437
9624a69710r8021D907b51404A6822J77738d21449D491K28914j04802b72589d9101
9612c25374a2667j49628d1229e136j63721p9500O8604C12400H3741B1690b09531
9600b52177Q2393M6668j65905d6210D9285b75875b8188j96221A05341c2192a4058
9588b44431i9092j3328A38664a71939A04633b19541e2438n6632J3436p1477P7676
9577h9435j14200P43K5818j39983J57020g8234C0263J66821a69770q2879d3717
$$ plain form
9565 21981 -202870 -265755 108455 48836 -274685 -56304 -150342 -195372 -149063 -87959 -91374
9554 -91374 -381815 -57415 -334093 -233278 -100464 -298364 31349 -131652 10523 -304323
9543 -157831 -23911 -115562 160479 -62141 -93722 58967 -58584 -32338 -378524 -63545 -85112
9532 -85112 -106976 -6361 84078 -76496 177131 128459 1035 258859 86535 29630 -194098 112407
9519 -164053 130392 -66936 -193093 -4057 75141 -17573 112074 28757 178261 -8275 100773
9507 -262108 77679 -123613 146822 -133649 121546 6532 152180 80778 113428 -61785 28770
9495 23237 514664 -215335 37086 233153 -111412 84987 -13783 -116954 -241229 -427966
9485 -427966 -166523 -147495 -286387 -73266 -160452 214051 80265 -333933 -303677 23075 -165142
$$ packed form
9565B1981b02870o2885A08455D8836b74685e6304r4038m5030M6309O1104l415
9554i1374k90441e7415k76678J00815a00464j97900C1349a31652A0523c04323
9543a57831b3911r1651A60479f2141l1581E8967e8584K6246l46186f3545k1567
9532h5112k1864f361H4078g6496A77131m8672A035K57824H6535B9630a94098A12407
9519a64053A30392f6936j26157d057G5141a7573A12074B8757J49504h275A00773
9507b62108G7679a23613A46822a33649A21546F532J45648p1402L2650f1785B8770
9495B3237M91427b15335C7086J96067a11412H4987a3783j03171j24275j86737
9485d27966a66523J9028j38892g3266q7186B14051H0265c33933L0256B3075a65142
$$ plain form
9473 -186185 33702 100801 -308855 -186421 -171474 -168724 -87705 -414330 183373 -372516 -12429
9461 -236591 -231793 -113503 -278748 -86602 47119 -327769 -65596 230783 -405782 25056 234109
9450 234109 45221 3081 -128331 -222200 146713 89094 -177711 -105834 -93262 -181000 -88852
9438 -173649 187582 -130173 17330 -262148 34587 33760 -126797 -182991 -143147 69635 118223
9427 118223 -89362 82288 -120893 141537 97785 44801 203894 3958 -93354 -191440 -98599
9416 -98599 -189995 -311796 -61998 143562 232748 -187156 -239346 61346 -247951 14209 -259380
9404 -23002 -247605 -217889 -48545 82368 -18309 86865 185521 63326 -412188 330534 -244402
9392 322574 -300785 54778 364996 16416 -80965 -175254 -16313 -66861 150030 -12850 -112905
$$ packed form
9473a86185C3702O7099c08855J22434J4947K750Q1019l26625A83373c72516a2429
9461b36591M798a13503j65245h6602D7119c27769f5596B30783d05782B5056K09053
9450B34109D5221C081a28331r3869A46713n7619a77711P1877J2572q7738h8852
9438a73649A87582a30173A7330b62148C4587q27a26797n6194L9844F9635M8588
9427A18223h9362H2288a20893A41537m3752D4801J59093C958i3354r8086R2841
9416i8599r1396j21801f1998A43562Q9186a87156n2190F1346b47951A4209b59380
9404b3002k24603K9716d8545H2368a8309H6865R8656F3326d12188C30534b44402
9392C22574c00785E4778L10218A6416h0965r4289a6313n0548A50030a2850j00055
$$ plain form
9381 -112905 -18208 -281113 -164112 -270569 -96670 -231673 42875 -75827 -39985 -469578 -123835
9369 -218811 -151174 251002 -180269 -25182 228400 -190630 196498 29156 -84913 157278
9358 94046 182212 -42360 -306643 -73477 -205861 -301279 -152599 -335568 -108177 -269262 246394
9346 57559 -29138 -50776 6557 -444641 34031 -105372 -34264 -193623 -179637 -312522 202927
9334 136399 210440 124746 26688 -6179 -187357 -176798 -196401 19140 -4198 -317978 228538
9322 -49530 -19127 88295 -21970 -37339 -230193 -203953 -54229 -173801 -118579 -94911 -85683 -206628
9310 -206628 164810 300154 -65805 -202281 -337063 -77528 12594 62215 -78864 63207 -284213
9298 -147042 -29847 202270 22401 111967 90251 -65632 301153 86044 -306984 66 -343981
$$ packed form
9381a12905a8208k62905J17001j06457i6670j35003D2875g5827L5842m29593a23835
9369b18811O7637B51002a80269b5182B28400a90630A96498B9156h4913A57278
9358I4046Q8166d2360k64283g3477j32384r5418J48680j82969a08177j61085B46394
9346E7559b9138k1638F557d44641C4031a05372c4264j59359J3986j32885B02927
9334A36399P4041q5694B6688f179j81178J0559j9603A9140d198l13780B28538
9322d9530a9127H8295b1970j5369j92854K6240e4229j19572N5222K3668R228j20945
9310b06628A64810J35344f5805j36476j34782g7528A2594M9621g8864F3207b84213
9298a47042b9847B02270B2401Q9566k1716f5632C01153H6044c06984F6c43981
$$ plain form
9286 -53514 61728 -4308 121160 88371 -269998 -182793 119788 324845 -165659 -68068 -189101
9275 -189101 12921 -134327 -93071 -18857 -135037 84183 340500 -3821 -66222 12139 -211794
9263 -15372 -58824 -192221 -309052 188375 13827 -254214 -89907 -76024 -108900 -28637 -146667
9252 -146667 260321 -82448 -135035 -278 -187089 40528 -324493 -221610 -318748 -187233 -372828
9241 -372828 193401 16206 58579 -90214 -57226 -66717 -76319 181314 105777 -309422 -348109
9230 -348109 -143052 -71329 -143648 -65338 41748 207784 -104970 -49691 -57525 22840 -193190
9218 -238760 -144286 -161616 8215 -232484 -48644 137029 -166802 -452302 72683 -321714 -70440
9206 -139016 -117955 -311392 -208585 -225211 -155175 -75818 -83023 -257381 -274982 -225878 48496
$$ packed form
9286e3514F1728d308A21160l2789b69998Q7205A19788K05057a65659f8068j21033
9275a89101A2921a34327M1256a8857j16180H4183K56317c821o2401A2139b11794
9263a5372m3452j33397j16831A88375A3827b54214h9907J3883l2876b8637j18030
9252a46667B60321h2448n2587b78j86811D0528c24493J02883r7138J31515j85595
9241c72828A93401A6206M2373i0214L2988r491r602A81314p5537c09422l8687
9230c48109a43052g1329p2319f5338D1748J66036a04970d9691p834B2840a93190
9218b38760R4474j7330H215b32484d8644A37029a66802k85500G2683c21714g0440
9206a39016K1061j93437J02807j6626P0036g5818p205j74358j7601M9104D8496
$$ plain form
9194 338863 276583 -304877 110766 -69371 14648 -82177 -326785 257940 -2811 8445 127571
9183 127571 -269711 48471 -333883 -48924 -4714 -224159 -144939 61759 121594 -104017 -106577
9172 -106577 -23130 14268 -281334 103971 194587 41260 -29844 -35478 -256010 79715 -108667
9160 92854 136175 97896 109272 -274489 -936 -260882 159971 -43217 -157182 -143079 215848
9148 -506216 184026 145099 -10694 356629 225471 -294119 -371614 264079 37783 -160602
9137 499575 -192647 -291576 92815 -26091 -72802 -12895 19827 -96171 -390866 203812 51033
9125 13201 -273774 125331 -40833 -308136 -277220 112906 -96261 -287968 -30462 -104608 -57616
9114 -57616 -206542 -389199 20258 134140 79991 -159437 -264760 -164156 121081 -331540
$$ packed form
9194C38863o2280c04877A10766f9371A4648h2177k44608B57940b811H445J19126
9183A27571b69711D8471c33883d8924d714k19445P9220F1759N9835a04017k560
9172a06577b3130A4268b81334A03971R0616D1260b9844n634k20532G9715a08667
9160I2854M3321l8279J1376b74489i36k59946A59971d3217j13965J4103B15848
9148e06216A84026l8927a0694C56629j31158b94119p7495B64079C7783a60602
9137D99575a92647r8929I2815b6091m6711a2895A9827i6171k94695B03812E1033
9125A3201b73774A25331d0833k67303L0916A12906i6261j91707c0462p4146M6992
9114e7616j48926j82657B0258J13882n4149a59437j05323J00604A21081c31540
$$ plain form
9103 -65544 453658 -189720 -68918 -159592 68788 -164071 -1654 -114872 -87115 -369726 -51976
9091 194492 -184644 -195091 -255836 -38695 -268804 -49254 -78923 91672 -98029 31609 36160
9080 36160 250179 3251 -419007 113462 -338900 -72975 49654 -91349 -233338 239627 -28124
9068 -184937 147479 -241890 81978 41622 -283864 -426562 -157346 -388001 -11133 145368
9057 26110 192083 -87524 -161833 -175839 -64203 -109430 99179 -353023 117796 135111 -138500
9045 76106 -278422 -147496 165799 -56511 -12147 -192735 -52894 238119 221732 89597 45370
9034 45370 -215326 70764 -15338 -108620 151575 4882 26475 -228556 110416 53319 -329248
9022 124111 -162648 15655 -81219 -140794 -171138 -20068 -22302 -569735 -443015 -335545 138740
$$ packed form
9103f5544D53658a89720f8918r0674F8788a64071a654j13218K7757k82611e1976
9091A94492a84644j0447o0745c8695k30109d9254k9669I1672i8029C1609M551
9080C6160K14019C251d19007A13462c38900g2975D9654i1349j41989B39627b8124
9068a84937A47479b41890H1978m0356b83864j42698a57346k30655a1133A45368
9057B6110J65973h7524p4309j4006f4203m5227I9179c53023A17796J7315a38500
9045G6106b78422J30926A65799e6511a2147j80588e2894B38119j6387H9597m4227
9034D5370b15326G0764a5338r3282A51575D882K1593b28556A10416E3319c29248
9022A24111a62648A5655h1219n9575l0344b0068k234n47433J26720J07470A38740
$$ plain form
9010 79138 -87896 -70211 -350987 -175863 -265821 86248 -112321 -16159 298700 -69977 -226897
8999 -226897 73593 154793 113169 -266977 -281944 17733 100860 134116 67492 48629 -277000
8987 978 91894 -105614 51012 112199 74928 -52893 -20176 240803 -193749 68842 238991
8976 238991 -92073 8829 -262896 109898 52397 24376 163196 -67252 205518 -45791 -105486
8965 -105486 -72306 -245013 -311765 -1347 102890 -64797 26182 -50987 -192911 -203761 -88045
8953 27967 268385 -220798 -55037 108893 -163697 138907 -165217 -194620 -327117 -284357
8943 -284357 58423 -71926 216102 -123141 15390 -41011 82611 -327313 109487 49650 -463376
8931 -66161 210689 6468 -117633 123255 86195 -16899 -83118 -50624 296714 751017 3089279
$$ packed form
9010G9138h7896J7685k80776J75124q9958H6248a12321a6159B98700f9977j56920
8999b26897G3593Q1200m1624b66977j4967A7733Q3127L3256o6624j8863b77000
8987I78R0916a05614E1012O1187l7271e2893b0176B40803a93749F8842J70149
8976B38991i2073H829b62896A09898E2397B4376J38820f7252B05518d5791n9695
8965a05486L3180j72707o6752a347A02890f4797B6182e0987j41924j0850h8045
8953B7967K40418b20798e5037A08893a63697A38907a65217k9403j32497M2760
8943b84357E8423g1926B16102a23141A5390d1011H2611c27313A09487D9650d63376
8931f6161B10689F468a17633A23255l7060a6899o6219L2494B96714M54303K338262
$$ plain form
8920 3089279 453524 212096 178998 129739 -70256 52004 -133891 -58898 141340 -98540 335903
8908 116988 -56935 82797 51901 54263 225955 -41638 76312 -332420 -147480 215496 -147295
8896 -137259 -109554 30423 -486574 129457 -63558 -173998 -17730 70353 -114741 -45817 -260613
8885 -260613 1912 185932 -215750 -53691 26147 -154191 -88357 -161871 349689 -9632 -162216
8874 -162216 280701 157222 -463445 -428777 -52429 -27065 -202397 62662 -248336 -355893
$$ packed form
8920C089279D53524B12096l3098m9259g0256E2004a33891e8898A41340i8540C35903
8908A16988e6935H2797l0896K362J71692d1638G6312c32420a47480B15496a47295
8896a37259K7705C0423d86574A29457f3558j10440a7730G0353a14741d5817k14796
8885b60613A912J84020b15750e3691B6147a54191O5834p3514C49689i632j52584
8874a62216B80701j23479d63445L4668e2429K5364j75332F2662b48336j07557
$$ [...]
##END NTUPLES=NMR SPECTRUM
##END=
