##TITLE=AC1432_GUAAH13236_7764488_e3P6ADAF8P
##JCAMPDX= 6.0         $$ Bruker NMR JCAMP-DX V2.0
##DATA TYPE= NMR SPECTRUM
##DATA CLASS= NTUPLES
##ORIGIN= BRUKER
##OWNER= Administrator
$$ 1.72 TOPSPIN		Version 2.1
$$ 2013-04-16 23:45:11.590 -0700  Administrator@X
$$ Compression mode = diff/dup
##.OBSERVE FREQUENCY= 400.02188249412
##.OBSERVE NUCLEUS= ^1H
##.ACQUISITION MODE= SIMULTANEOUS (DQD)
##.ACQUISITION SCHEME= undefined
##.AVERAGES= 64
##.DIGITISER RES= 22
##SPECTROMETER/DATA SYSTEM= spect
##.PULSE SEQUENCE= noesygpps1d.comp
##.SOLVENT NAME= COFFEE_meoh
##.SHIFT REFERENCE= INTERNAL, COFFEE_meoh, 1, 14.96106
##AUDIT TRAIL= $$ (NUMBER, WHEN, WHO, WHERE, PROCESS, VERSION, WHAT)
$$ ##TITLE= Audit trail, TOPSPIN		Version 2.1
$$ ##JCAMPDX= 5.01
$$ ##ORIGIN= Bruker BioSpin GmbH
$$ ##OWNER= Administrator
$$ $$ E:\/data/COFFEE/nmr/AC1432_GUAAH13236_7764488_e3P6ADAF8P/12/pdata/1/auditp.txt
$$ ##AUDIT TRAIL=  $$ (NUMBER, WHEN, WHO, WHERE, PROCESS, VERSION, WHAT)
(   1,<2013-04-16 23:45:06.496 -0700>,<Administrator>,<X>,<go>,<TOPSPIN 2.1>,
      <created by zg
	started at 2013-04-16 23:33:36.682 -0700,
	POWCHK enabled, PULCHK disabled,
       configuration hash MD5:
       33 CF 6A 21 5C D3 B9 40 6C 15 AA 8D 27 A2 4F 13
       data hash MD5: 64K
       7E D1 16 D6 F2 D8 D5 E7 2C 94 59 7D 89 CD AC AD>)
(   2,<2013-04-16 23:45:09.512 -0700>,<Administrator>,<X>,<proc1d>,<TOPSPIN 2.1>,
      <Start of raw data processing
       efp LB = 0.3 FT_mod = 6 PKNL = 1 PHC0 = 0 PHC1 = 0 SI = 128K 
       data hash MD5: 128K
       91 CC 96 32 8B 7D 84 DD D3 A6 93 66 B2 59 AC BC>)
(   3,<2013-04-16 23:45:10.512 -0700>,<Administrator>,<X>,<proc1d>,<TOPSPIN 2.1>,
      <pk PHC0 = -77.16248 PHC1 = 0 
       data hash MD5: 128K
       9D CE 06 68 FF 8A B3 8E 64 73 20 A7 F4 B9 BC 9D>)
(   4,<2013-04-16 23:45:10.996 -0700>,<Administrator>,<X>,<proc1d>,<TOPSPIN 2.1>,
      <abs ABSG = 1 
       data hash MD5: 128K
       20 F4 93 49 79 5B 32 2A 99 8D 44 9B 73 06 FE 0A>)
(   5,<2013-04-16 23:45:11.121 -0700>,<Administrator>,<X>,<proc1d>,<TOPSPIN 2.1>,
      <abs ABSG = 2 
       data hash MD5: 128K
       81 6B B6 5C F1 7B A0 A4 10 A1 C2 2A F7 90 85 86>)
(   6,<2013-04-16 23:45:11.231 -0700>,<Administrator>,<X>,<proc1d>,<TOPSPIN 2.1>,
      <abs ABSG = 3 
       data hash MD5: 128K
       B4 5E 23 14 C9 7F 94 9A 38 22 61 2E 77 E0 AB 80>)
(   7,<2013-04-16 23:45:11.324 -0700>,<Administrator>,<X>,<proc1d>,<TOPSPIN 2.1>,
      <abs ABSG = 4 
       data hash MD5: 128K
       72 C7 7E 46 65 B9 A0 D7 CF 23 AD 56 83 A1 CD E3>)
(   8,<2013-04-16 23:45:11.403 -0700>,<Administrator>,<X>,<proc1d>,<TOPSPIN 2.1>,
      <abs ABSG = 5 
       data hash MD5: 128K
       C8 B4 6A 8A CC 37 3E 41 DA 6B 76 9C F1 A4 8A 8E>)
$$ ##END=
$$ 
$$ $$ hash MD5
$$ $$ C5 5B 9F 52 B0 77 31 C3 EB F2 2C 9E 63 AE C9 B6
##$RELAX= 
##$RELAX= 
##$RELAX= 
##$RELAX= 
##$RELAX= 
##$RELAX= 
##$RELAX= 
##$RELAX= 
$$ Bruker specific parameters
$$ --------------------------
##$DU= <E:\>
##$EXPNO= 12
$$ [...]
##$TP07= 0
##$TPNAME0= <>
##$TPNAME1= <>
##$TPNAME2= <>
##$TPNAME3= <>
##$TPNAME4= <>
##$TPNAME5= <>
##$TPNAME6= <>
##$TPNAME7= <>
##$TPOAL= (0..7)
0.5 0.5 0.5 0.5 0.5 0.5 0.5 0.5
##$TPOFFS= (0..7)
0 0 0 0 0 0 0 0
##$TUNHIN= 0
##$TUNHOUT= 0
##$TUNXOUT= 0
##$USERA1= <user>
##$USERA2= <user>
##$USERA3= <user>
##$USERA4= <user>
##$USERA5= <user>
##$V9= 5
##$VALIST= <valist>
##$VCLIST= <CCCCCCCCCCCCCCC>
##$VD= 0
##$VDLIST= <DDDDDDDDDDDDDDD>
##$VPLIST= <PPPPPPPPPPPPPPP>
##$VTLIST= <TTTTTTTTTTTTTTT>
##$WBST= 2048
##$WBSW= 25
##$XGAIN= (0..3)
0 0 0 0
##$XL= 0
##$YL= 0
##$YMAX_a= 6715370
##$YMIN_a= -14555563
##$ZGOPTNS= <>
##$ZL1= 120
##$ZL2= 120
##$ZL3= 120
##$ZL4= 120
##$ABSF1= 14.96106
##$ABSF2= -5.597122
##$ABSG= 5
##$ABSL= 3
##$ALPHA= 0
##$AQORDER= 0
##$ASSFAC= 0
##$ASSFACI= 0
##$ASSFACX= 0
##$ASSWID= 0
##$AUNMP= <proc_prof1d_extract.lims>
##$AXLEFT= 0
##$AXNAME= <>
##$AXNUC= <1H>
##$AXRIGHT= 0
##$AXTYPE= 0
##$AXUNIT= <>
##$AZFE= 0.1
##$AZFW= 0.1
##$BCFW= 0
##$BC_mod= 0
##$BYTORDP= 0
##$COROFFS= 0
##$CY= 15
##$DATMOD= 1
##$DC= 0
##$DFILT= <>
##$DTYPP= 0
##$F1P= 0
##$F2P= 0
##$FCOR= 0.5
##$FTSIZE= 131072
##$FT_mod= 6
##$GAMMA= 0
##$GB= 0
##$INTBC= 1
##$INTSCL= 1
##$ISEN= 128
##$LB= 0.3
##$LEV0= 0
##$LPBIN= 0
##$MAXI= 10000
##$MC2= 0
##$MEAN= 0
##$ME_mod= 0
##$MI= 0
##$NCOEF= 0
##$NC_proc= -2
##$NLEV= 6
##$NOISF1= 0
##$NOISF2= 0
##$NSP= 0
##$NTH_PI= 0
##$NZP= 0
##$OFFSET= 14.96106
##$PC= 1
##$PHC0= -77.16248
##$PHC1= 0
##$PH_mod= 1
##$PKNL= yes
##$PPARMOD= 0
##$PPDIAG= 0
##$PPIPTYP= 0
##$PPMPNUM= 2147483647
##$PPRESOL= 1
##$PSCAL= 4
##$PSIGN= 0
##$PYNMP= <proc.py>
##$REVERSE= no
##$SF= 400.020009614676
##$SI= 131072
##$SIGF1= 0
##$SIGF2= 0
##$SINO= 400
##$SIOLD= 131072
##$SPECTYP= <>
##$SREGLST= <1H.CDCl3>
##$SSB= 0
##$STSI= 131072
##$STSR= 0
##$SW_p= 8223.68421052631
##$SYMM= 0
##$S_DEV= 0
##$TDeff= 65536
##$TDoff= 0
##$TI= <>
##$TILT= no
##$TM1= 0
##$TM2= 0
##$TOPLEV= 0
##$USERP1= <user>
##$USERP2= <user>
##$USERP3= <user>
##$USERP4= <user>
##$USERP5= <user>
##$WDW= 1
##$XDIM= 131072
##$YMAX_p= 388132592
##$YMIN_p= -14509
##$CURPLOT= <Network HP LaserJet P1505>
##$CURPRIN= <$Network HP LaserJet P1505>
##$DFORMAT= <normdp>
##$LAYOUT= <+/1D_H.xwp>
##$LFORMAT= <normlp>
##$PFORMAT= <normpl>
##$SURQMSG= 1
$$ End of Bruker specific parameters
$$ ---------------------------------
##NTUPLES= NMR SPECTRUM
##VAR_NAME=  FREQUENCY,     SPECTRUM/REAL,   SPECTRUM/IMAG
##SYMBOL=    X,             R,               I
##VAR_TYPE=  INDEPENDENT,   DEPENDENT,       DEPENDENT
##VAR_FORM=  AFFN,          ASDF,            ASDF
##VAR_DIM=   131072,        131072,          131072
##UNITS=     HZ,            ARBITRARY UNITS, ARBITRARY UNITS
##FACTOR=    0.0627417313425164, 1,          1
##FIRST=     8223.62146879497, 1,            -56025
##LAST=      0,             1052,            -56483
##MIN=       0,             -14509,          0
##MAX=       8223.62146879497, 388132592,    0
$$ Real data points
##PAGE= N=1
##DATA TABLE= (X++(R..R)), XYDATA
$$ [...]
61488C77642K108K015J287M73M32J282K210K530K356K064J703J272J073J249J412
61473D01108J159O83L86K33p6m82o10l02K62Q47J216J081L42o58j412j689j522
61456D00566r78k82J25L9j26J54P71J149J050P94P32R29J327J728J764J264P04
61439D11710P76J447J998K036J992K329K834L031K911K765K583K156J639J469
61425D41676J600J361L96n56l22J238K868L261K450J534J237J255J041O28L69
61410D60036K83J61K8R1K14r8j107k431l274l039j867o89m78j229j919j765j175
61393D41742j086j630k128k126j738j035Q4J231J551Q69J12J48P03J007J005J175
61377D39884J475J356P76M09O23R68R61Q33J067J620K066K226K220K082J841J830
$$ y = [377642, 379750, 381765, 383052, 383525, 383957, 385239, 387449, 389979, 392335, 394399, 396102, 397374, 398447, 399696, 401108, 402267, 402950, 403336, 403569, 403493, 403011, 402401, 402099, 402361, 403208, 404424, 405505, 405847, 405189, 403777, 402088, 400566, 399588, 399306, 399431, 399470, 399344, 399498, 400269, 401418, 402468, 403262, 403994, 404923, 406250, 407978, 409742, 411006, 411710, 412486, 413933, 415931, 417967, 419959, 422288, 425122, 428153, 431064, 433829, 436412, 438568, 440207, 441676, 443276, 444637, 445033, 444477, 444155, 445393, 448261, 451522, 453972, 455506, 456743, 457998, 459039, 459667, 460036, 460319, 460480, 460508, 460599, 460813, 460715, 459608, 457177, 453903, 450864, 448997, 448308, 447830, 446601, 444682, 442917, 441742, 440656, 439026, 436898, 434772, 433034, 431999, 432083, 433314, 434865, 435734, 435846, 435994, 436697, 437704, 438709, 439884, 441359, 442715, 443491, 443900, 444523, 445491, 446452, 447285, 448352, 449972, 452038, 454264, 456484, 458566, 460407, 462237]
61361D62237K302K789K497J585J351K670M696N812N603N184N588O572P334P771
61347E23991Q397R321R858R347P955O498N566M996M230L119K174J923K220K391
61333F01986K042J332M70o03j813k619k463j491m41J00J57R1J41L36P18J439K510
61316F01892L536L969L792L734M383N353N832N894O585Q449J0745J2497J3701
61303F90362J4856J5765J5665J4355J2404J0202P510M122M61k711m888o030o564
61290G65509p222q486r994j0887j0855j0538j0581j0716j0146q703p131o089n293
61277F48868m031k349j151r31r01O5J838L173L358L012K926L019K940L030L820
61262F66686N012N901O587P806R556J0799J0768R833Q739P628O217M478K729J220
$$ y = [462237, 464539, 467328, 469825, 471410, 472761, 475431, 480127, 485939, 491542, 496726, 502314, 508886, 516220, 523991, 532388, 541709, 551567, 560914, 568869, 575367, 580933, 585929, 590159, 593278, 595452, 597375, 599595, 601986, 604028, 605360, 605830, 605227, 603414, 600795, 598332, 596841, 596400, 596500, 596657, 596748, 596889, 597225, 597943, 599382, 601892, 605428, 609397, 613189, 616923, 621306, 626659, 632491, 638385, 644970, 653419, 664164, 676661, 690362, 705218, 720983, 736648, 751003, 763407, 773609, 781119, 785241, 785702, 782991, 778103, 772073, 765509, 758287, 749801, 739807, 728920, 718065, 707527, 696946, 686230, 676084, 667381, 660250, 654161, 648868, 644837, 642488, 641337, 640406, 639505, 639570, 641408, 644581, 647939, 650951, 653877, 656896, 659836, 662866, 666686, 671698, 677599, 684186, 691992, 701548, 712347, 723115, 732948, 741687, 749315, 755532, 760010, 762739, 763959]
61248G63959J3r57j797k561l114l339l444l669l803l363k376j468j068r53p77
61233G31283o17o01m27L40J711L275M632N557O016O242O697P614Q713R513R845
61218G99793R868R737R445Q956Q343P753P238O680N971N316N086N238N115M268
61204H98807L227K977L738M864N908P133Q790J0541J2023J3411J5046J6805J8213
61191A021483J8956J8953J8162J6558J4198J1236Q072N416L706K489Q83j230l158
61178A135724m691o465q671j0373j0905j1160j2387j4278j5437j5534j5718j6797
61166I93308j8162j8911j9023j8936j8694j8184j7595j7067j6215j4669j2789
61155H03063j1221r918q172n697l147j359m41J68R29J777K355K348J574L7j911
$$ y = [763959, 763972, 763015, 761218, 758657, 755543, 752204, 748760, 745091, 741288, 737925, 735549, 734081, 733013, 732060, 731283, 730666, 730065, 729638, 729978, 731689, 734964, 739596, 745153, 751169, 757411, 764108, 771722, 780435, 789948, 799793, 809661, 819398, 828843, 837799, 846142, 853895, 861133, 867813, 873784, 879100, 884186, 889424, 894539, 898807, 902034, 905011, 908749, 913613, 919521, 926654, 935444, 945985, 958008, 971419, 986465, 1003270, 1021483, 1040439, 1059392, 1077554, 1094112, 1108310, 1119546, 1127618, 1133034, 1136740, 1139229, 1140112, 1138882, 1135724, 1131033, 1124568, 1115897, 1105524, 1094619, 1083459, 1071072, 1056794, 1041357, 1025823, 1010105, 993308, 975146, 956235, 937212, 918276, 899582, 881398, 863803, 846736, 830521, 815852, 803063, 791842, 781924, 773752, 768055, 764908, 763549, 763108, 763276, 764205, 765982, 768337, 770685, 772259, 772296, 770385]
61140G70385l625m625m991n006m577l333j422L23J300J973L331N659Q214J0146
61126G73752J1383J2580J4347J6708J9206K1463K3561K5709K7702K9053K9724
61115A005188L0220L0810L1101L0823L0487L0558L0357K8659K5398K1920J9385
61104A314906J7604J5697J3167R935N948J316l479q012j2306j6428k0085k3072
61092A295191k5757k8544l1060l2489l2622l2052l1306l0387k9248k8137k7185
61081I66404k6060k4323k1903j9118j6439j4357j3099j2251j0961q784o200m039
61069G88870k625j702r59l69k8Q5K38Q55K150L709M794N288N955P430R311J0819
61053H33821J2021J3641J5778J7654J8811J9758K1038K2398K3410K4336K5718
$$ y = [770385, 766760, 762135, 757144, 752138, 747561, 744228, 742806, 743129, 744429, 746402, 749733, 755392, 763606, 773752, 785135, 797715, 812062, 828770, 847976, 869439, 893000, 918709, 946411, 975464, 1005188, 1035408, 1066218, 1097319, 1128142, 1158629, 1189187, 1219544, 1248203, 1273601, 1295521, 1314906, 1332510, 1348207, 1361374, 1371309, 1377257, 1378573, 1375094, 1367082, 1354776, 1338348, 1318263, 1295191, 1269434, 1240890, 1209830, 1177341, 1144719, 1112667, 1081361, 1050974, 1021726, 993589, 966404, 940344, 916021, 894118, 875000, 858561, 844204, 831105, 818854, 807893, 799109, 792909, 788870, 786245, 784543, 783584, 783215, 783187, 783272, 783510, 784365, 786515, 790224, 795018, 800306, 806261, 813691, 823002, 833821, 845842, 859483, 875261, 892915, 911726, 931484, 952522, 974920, 998330, 1022666, 1048384]
61042A048384K7434K8893K9895L0732L1511L2054L2362L2567L2481L1809L0920
61031A389042L0683L1276L1842L1676L1281L1698L3166L4998L6561L7752L8664
61020A758639L9315L9913M0909M2614M5205M9189N5402O4005P3829Q3379R2468
61009B384867J02394J14479J29162J46813J68790J97242K34268K81681L40972
61000D100668M12919M98064N98717P20309Q70153J055601J282606J548705J826171
60991A2913913K049055K129465K006285J690144J262137Q27967M72218K45636
60983B3596820J70201K30568L56808M35572L63459J04745k95475p47973j167432
60974B3047293j497221j710517j805120j798811j720659j598767j453174j297354
$$ y = [1048384, 1075818, 1104711, 1134606, 1165338, 1196849, 1228903, 1261265, 1293832, 1326313, 1358122, 1389042, 1419725, 1451001, 1482843, 1514519, 1545800, 1577498, 1610664, 1645662, 1682223, 1719975, 1758639, 1797954, 1837867, 1878776, 1921390, 1966595, 2015784, 2071186, 2135191, 2209020, 2292399, 2384867, 2487261, 2601740, 2730902, 2877715, 3046505, 3243747, 3478015, 3759696, 4100668, 4513587, 5011651, 5610368, 6330677, 7200830, 8256431, 9539037, 11087742, 12913913, 14962968, 17092433, 19098718, 20788862, 22050999, 22878966, 23351184, 23596820, 23767021, 23997589, 24354397, 24789969, 25153428, 25258173, 24962698, 24214725, 23047293, 21550072, 19839555, 18034435, 16235624, 14514965, 12916198, 11463024, 10165670]
60966A0165670j141868r94146q57218p31769o19348n22039m39818l70535l12528
60957D176401k65514k28499j98738j73631j52468j35346j21352j08920r7350q7075
60947B607508p8755p2787o9255o7595o6625o5546o4697o4714o5359o5761o5485
60936A860929o4631o3170o0986n8422n6034n3741n0998m7828m4965m2858m1072
60925A276224l8977l6496l3960l1637k9645k8014k6526k4813k2807k0900j9433
60914I63016j8214j6795j5063j3313j1786j0408r014p672o598n839n221m668m337
60901H34088m287m309m261m390m916n515n664n466n541o070o558o635o435n996
60887G58045n084l947l476l996m591m369l853m261n794p494q568q960q797q172
$$ y = [10165670, 9023802, 8029656, 7172438, 6440669, 5821321, 5299282, 4859464, 4488929, 4176401, 3910887, 3682388, 3483650, 3310019, 3157551, 3022205, 2900853, 2791933, 2694583, 2607508, 2528753, 2455966, 2386711, 2319116, 2252491, 2186945, 2122248, 2057534, 1992175, 1926414, 1860929, 1796298, 1733128, 1672142, 1613720, 1557686, 1503945, 1452947, 1405119, 1360154, 1317296, 1276224, 1237247, 1200751, 1166791, 1135154, 1105509, 1077495, 1050969, 1026156, 1003349, 982449, 963016, 944802, 928007, 912944, 899631, 887845, 877437, 868423, 860751, 854153, 848314, 843093, 838425, 834088, 829801, 825492, 821231, 816841, 811925, 806410, 800746, 795280, 789739, 783669, 777111, 770476, 764041, 758045, 752961, 749014, 745538, 741542, 736951, 732582, 728729, 724468, 718674, 711180, 702612, 693652, 684855, 676683]
60873F76683p506p355p691p937p776p386o921o378n912n674n372m642l788l333
60859E89012k909j545P60K662L049K191R88j16r81j313j061p03n03OJ159K264
60843E92960K291J121n41k113l365m030m049l991m480n145m987l814k580k070
60829E55207j984j656j011l01N25J561K308K100J074K23K25P33R62O50J33k50
60813E60499m86p34j143j795k554l038k971k604k432k496k374j996k034l018m390
60798E26434m967m302l197k708l083l806m351m574m447l860k868j966j829k582
60784D77894l560l959l691l313l136k862k193j359p97o26p19r57j079o45L98J442
60768D50838J967K274K899L684M121M394N164O290O700N848M509L755L732L904
$$ y = [676683, 669177, 661822, 654131, 646194, 638418, 631032, 624111, 617733, 611821, 606147, 600775, 596133, 592345, 589012, 586103, 584558, 585318, 587980, 591029, 593220, 594208, 594092, 593111, 591798, 590737, 590034, 589531, 589537, 590696, 592960, 595251, 596372, 595831, 593718, 590353, 586323, 582274, 578283, 573803, 568658, 563671, 559857, 557277, 555207, 553223, 551567, 550556, 550255, 550780, 552341, 554649, 556749, 557823, 558046, 558271, 559004, 559966, 560616, 560749, 560499, 560013, 559279, 558136, 556341, 553787, 550749, 547778, 545174, 542742, 540246, 537872, 535876, 533842, 530824, 526434, 521467, 517165, 513968, 511260, 508177, 504371, 500020, 495446, 490999, 487139, 484271, 482305, 480476, 477894, 474334, 470375, 466684, 463371, 460235, 457373, 455180, 453821, 453024, 452398, 451679, 450722, 449643, 448998, 449396, 450838, 452805, 455079, 457978, 461662, 465783, 470177, 475341, 481631, 488331, 494179, 498688, 502443, 506175, 510079]
60754E10079L865L408K326Q03l33m84j13j48o71r06n02r9m17j354k427l660n421
60737E03946p481q866q854p786o591n779n312n162n364n504m902l657k852l151
60723D22685l710l292k038j198j215j177l94N16O81K72Q2L26O26Q08J007J157
60707D15136J008O00K40Q1J22M50J044J465J305Q83R23J523K036K155K447L428
60691D34846M502M516L253J871J758L139M931N857N588M911M792N300N587M980
60677D95831L916L473L947M378L703K051N01j74j04J75K38k69j557l250m501m911
60661E03447m922n006m910m182l086k364k266k379k306k049j753j531j486j463
60647D63744r59K55J500J828J150J67o97j563k306k442k042j859k189k400k056
$$ y = [510079, 513944, 517352, 519678, 520481, 520148, 519664, 519551, 519403, 518732, 517826, 517324, 517225, 516808, 515454, 513027, 509367, 503946, 496465, 487599, 478745, 470959, 464368, 458589, 453277, 448115, 442751, 437247, 432345, 428688, 425836, 422685, 418975, 415683, 413645, 412447, 411232, 410055, 409661, 410177, 410858, 411130, 411212, 411538, 412164, 412972, 413979, 415136, 416144, 416744, 416984, 417065, 417187, 417637, 418681, 420146, 421451, 422334, 423257, 424780, 426816, 428971, 431418, 434846, 439348, 443864, 447117, 448988, 450746, 453885, 458816, 464673, 470261, 475172, 479964, 485264, 490851, 495831, 499747, 503220, 507167, 511545, 515248, 517299, 517800, 517626, 517522, 517697, 517935, 517666, 516109, 512859, 508358, 503447, 498525, 493519, 488609, 484427, 481341, 478977, 476711, 474332, 472026, 469977, 468224, 466693, 465207, 463744, 462785, 463040, 464540, 466368, 467518, 467685, 466988, 465425, 463119, 460677, 458635, 456776, 454587, 452187, 450131]
60632D50131j739k022k333j690k17R59J174Q10N23N16P47J149J476J368Q26L58
60616D52036L62O08N41K1m70l98J87O94O87L31K4k11o45j263j624j451r53m71
60598D48005k3N35J213J853K288K414K232J925J736J741J894K156K363K135J291
60583D73758K63k80k15P9M03P90J033Q68O28R45J680K072K067K564L933N368O267
60566E02223P238Q875J0481J1078J1010J1330J2038J2105J1029R260P142M553
60554F18362J656r01k753m053m864n080m889m624m079k795j054L19J198K302L861
60539E92606N133N762O548Q278J0495J2280J3658J5288J7151J8437J8599J7745
60527G41980J5991J3194R549N772K403o51l542n871p129p541p877q417q591p848
$$ y = [450131, 448392, 446370, 444037, 442347, 442130, 443089, 444263, 445073, 445596, 446112, 446859, 448008, 449484, 450852, 451678, 452036, 452398, 453006, 453547, 453568, 453098, 452700, 452887, 453581, 454268, 454599, 454623, 454412, 453767, 452504, 450880, 449429, 448476, 448005, 447982, 448517, 449730, 451583, 453871, 456285, 458517, 460442, 462178, 463919, 465813, 467969, 470332, 472467, 473758, 474021, 473741, 473526, 473605, 474008, 474798, 475831, 476699, 477327, 478272, 479952, 482024, 484091, 486655, 490588, 495956, 502223, 509461, 518336, 528817, 539895, 550905, 562235, 574273, 586378, 597407, 606667, 613809, 618362, 620018, 619117, 616364, 612311, 607447, 602367, 597478, 592854, 588775, 585980, 584926, 585245, 586443, 588745, 592606, 597739, 603501, 610049, 618327, 628822, 641102, 654760, 670048, 687199, 705636, 724235, 741980, 757971, 771165, 780714, 786486, 788889, 788238, 784696, 778825, 771696, 764155, 756278, 747861, 739270, 731422]
60513G31422o499n283m445l710l014k606k389j783n49Q35J964L210N179P837J0724
60498G30893J3803J7405K1501K5660K9707L3841L8011M1614M4000M4905M4372
60487A085712M2574L9778L6132L1392K5262J8122J0990M571j441p901j5190k2837
60475A247164k9919l5708l9938m2689m4126m4440m3920m2802m0938l8014l4302
60464H10368l0837k8459k6860k5021k2444j9571j7066j5132j3485j1774j0026
60453E89693q782q534q830q404o642m562l678m192m938m925m184l234k472k104
60439E14212k062j907j416j127j550k064j563k30N18P3n29l27J86J78j11n7ko35
60421E01587j559j652p68O6K04J46M87J002J186J080J084J326J623J821J822J523
$$ y = [731422, 724923, 719640, 715195, 711485, 708471, 705865, 703476, 701693, 701144, 701979, 703943, 707153, 712332, 720169, 730893, 744696, 762101, 783602, 809262, 838969, 872810, 910821, 952435, 996435, 1041340, 1085712, 1128286, 1168064, 1204196, 1235588, 1260850, 1278972, 1289962, 1294533, 1293092, 1285191, 1270001, 1247164, 1217245, 1181537, 1141599, 1098910, 1054784, 1010344, 966424, 923622, 882684, 844670, 810368, 779531, 751072, 724212, 699191, 676747, 657176, 640110, 624978, 611493, 599719, 589693, 580911, 572377, 563547, 555143, 548501, 543939, 540261, 536069, 531131, 526206, 522022, 518788, 516316, 514212, 512150, 510243, 508827, 507700, 506150, 504086, 502523, 502293, 502811, 502884, 502355, 502028, 502214, 502392, 502281, 502224, 502222, 501587, 500028, 498376, 497608, 497674, 497878, 498024, 498511, 499513, 500699, 501779, 502863, 504189, 505812, 507633, 509455, 510978]
60405E10978J025P28R14J301J329Q86N06O96J326J805J809J530J313J325J670
60390E29141K471L566M353M307L628L014K862K986L030K840K453K089K175K976
60376E71891M062M556M054L002K098J663J673J950K086J658Q23M08R42J880K221
60361F04967J770J332J643K465K942K696K287K584L745N113O080O844P995R647
60347F62110J1265J2254J2335J1404R547P274N224L518J719n07l017n462p479
60334G20185q624q671q110p748p716p428o671o013n840n785n507n340n509n396
60320F25827m400k989k155k074k101j800j256n32L91J340K260L697O165R148J1572
60305F43093J3203J4805J6799J8669J9948K0869K1577K1381J9379J5394R908L545
$$ y = [510978, 512003, 512731, 513645, 514946, 516275, 517161, 517667, 518363, 519689, 521494, 523303, 524833, 526146, 527471, 529141, 531612, 535178, 539531, 543838, 547466, 550480, 553342, 556328, 559358, 562198, 564651, 566740, 568915, 571891, 575953, 580509, 584563, 587565, 589663, 591326, 592999, 594949, 597035, 598693, 599516, 599924, 600866, 602746, 604967, 606737, 608069, 609712, 612177, 615119, 617815, 620102, 622686, 626431, 631544, 637624, 644468, 652463, 662110, 673375, 685629, 697964, 709368, 718915, 726189, 731413, 734931, 736650, 736143, 733126, 727664, 720185, 711561, 702890, 694780, 687032, 679316, 671888, 665217, 659204, 653364, 647579, 642072, 636732, 631223, 625827, 621427, 618438, 616283, 614209, 612108, 610308, 609052, 608520, 608911, 610251, 612511, 616208, 622373, 631521, 643093, 656296, 671101, 687900, 706569, 726517, 747386, 768963, 790344, 809723, 825117, 835025, 838570]
60293H38570k809p993j1366j3456j5238j6857j7650j7290j6249j5038j3599j1794
60281F79231j0047r031q791q576p633o022m564m065m621n624o360o546o318n793
60267E85240m889l601k307j563j585k090k634k933k816k180j201l71n4p2K9L81
60251E57354P73J112J519J937K026J587Q28K3p26j274j293p36j64j98o93q06L0
60234E61299J393K303K263J737J538J928K522L010L525M075M176L593L115L726
60220F00203N111N865N421M853N328O600P694Q386R105R783R843R231Q616Q500
60206G04539Q716R000R324R583R409Q639P584O604N738M831L790K546J087l52
60192G91038j412k075k727l622m482m897m954n179n898o772p148o801o184n835
$$ y = [838570, 835761, 827768, 816402, 802946, 787708, 770851, 753201, 735911, 719662, 704624, 691025, 679231, 669184, 660153, 651362, 642786, 635153, 629131, 624567, 620502, 615881, 610257, 603897, 597351, 591033, 585240, 580351, 576750, 574443, 572880, 571295, 569205, 566571, 563638, 560822, 558642, 557441, 557070, 557016, 556944, 556973, 557354, 558127, 559239, 560758, 562695, 564721, 566308, 567136, 567159, 566433, 565159, 563866, 563130, 562966, 562768, 562075, 561269, 561299, 562692, 564995, 567258, 568995, 570533, 572461, 574983, 577993, 581518, 585593, 589769, 593362, 596477, 600203, 605314, 611179, 616600, 621453, 626781, 633381, 641075, 649461, 658566, 668349, 678192, 687423, 696039, 704539, 713255, 722255, 731579, 741162, 750571, 759210, 766794, 773398, 779136, 783967, 787757, 790303, 791390, 791038, 789626, 787551, 784824, 781202, 776720, 771823, 766869, 761690, 755792, 749020, 741872, 735071, 728887, 723052]
60178G23052n739n527n197n097n136m647l403k193j776j716j032K17R22N34j64
60163F83098k41J70K74j90p65j016r86r55j054j105p80K4R47J514J704J939K405
60146F84983K823L019L350M151N056N328M883M518N028O346P722Q556Q814Q730
60132G63307Q410P883P300O823O351N635M658L675K837K100J540J409J643J743
60118H25314J510J451J945K391J841L74r08j285j173j278j731k319l055m040n077
60103H13960n829o158o093n722n304n204n416n441m871l893k959k275j840j692
60089G51263j724j490o25O81J901K746L224L319K979K371J743J120L97l73j112
60074G66420k093l635n484o924p639q070q714r404r575q999p963o920o186n877
$$ y = [723052, 717313, 711786, 706589, 701492, 696356, 691709, 688306, 686113, 684337, 682621, 681589, 681806, 682728, 683262, 683098, 682857, 683027, 683301, 683111, 682346, 681330, 680344, 679389, 678335, 677230, 676450, 676474, 677421, 678935, 680639, 682578, 684983, 687806, 690825, 694175, 698326, 703382, 708710, 713593, 718111, 723139, 729485, 737207, 745763, 754577, 763307, 771717, 779600, 786900, 793723, 800074, 805709, 810367, 814042, 816879, 818979, 820519, 821928, 823571, 825314, 826824, 828275, 830220, 832611, 834452, 834826, 833918, 832633, 831460, 830182, 828451, 826132, 823077, 819037, 813960, 808131, 801973, 795880, 790158, 784854, 779650, 774234, 768793, 763922, 760029, 757070, 754795, 752955, 751263, 749539, 748049, 747424, 748105, 750006, 752752, 755976, 759295, 762274, 764645, 766388, 767508, 767905, 767532, 766420, 764327, 760692, 755208, 748284, 740645, 732575, 723861, 714457, 704882, 695883, 687920, 681000, 674814, 668937]
60060F68937n823n600m926m042l480l366l217k574j609q90n49l3J256L249N218
60045F42551O438O704O350N984O100O685P185P025O216N249M376L327J805j9j739
60030G14237l204m494n589o409p064p708q195q210p788p338p123o993o778o522
60016F20822o238n773n186m923n222n624n487m846m275l966l518k721j969j649
60002E59425j501j007j34O19Q39N65J99K69J106K470L623M038L952L982M379M936
59986E87760N409N586N082L650J758K90m56j071k078l190l832l982m045m193m326
59971E82362m446m625m610l941k560r60L63J317K011K444K561K447K266K108K021
59956E78758K022K001J719J104N41N76J233J821J701J106Q39J090J096K12j047
$$ y = [668937, 663114, 657514, 652588, 648546, 645066, 641700, 638483, 635909, 634300, 633410, 632861, 632828, 634084, 637333, 642551, 648989, 655693, 662043, 668027, 674127, 680812, 687997, 695022, 701238, 706487, 710863, 714190, 715995, 715976, 714237, 711033, 706539, 700950, 694541, 687477, 679769, 671574, 663364, 655576, 648238, 641115, 634122, 627344, 620822, 614584, 608811, 603625, 598702, 593480, 587856, 582369, 577523, 573248, 569282, 565764, 563043, 561074, 559425, 557924, 556917, 556783, 557402, 558241, 558806, 559005, 559274, 560380, 562850, 566473, 570511, 574463, 578445, 582824, 587760, 593169, 598755, 603837, 607487, 609245, 609535, 609079, 608008, 605930, 602740, 598908, 594926, 590881, 586688, 582362, 577916, 573291, 568681, 564740, 562180, 561220, 561583, 562900, 564911, 567355, 569916, 572363, 574629, 576737, 578758, 580780, 582781, 584500, 585604, 586145, 586721, 587954, 589775, 591476, 592582, 593421, 594511, 595607, 595819, 594772]
59941E94772j596j209p03p03r03p62m39n01r65j180o00O37J947K906L549M096
59925E98346M562M731M675M887N656O550P006P269Q041R234R858R333Q105O655
59911F94908M819K577P48J6r9m33q58p26k71m15j315k178k588k901l171k722j339
59894F84052J07P90J107K006L569M883N170M545L795L704M479N667O604P039P166
59879G44683P206P276P514P853P764O804N437M554M105L027Q59j474l022m098
59865G98488n404o580o793o313o327p208p982p807p059o515o250n862n285m726
59851G08377m064k933j376Q7J101J938L107M770O598Q095Q880Q764P754O147M487
59836G61732L313K837K912L301L958M946O053O601N795L466M10k275m204n809
$$ y = [594772, 593176, 591967, 591264, 590561, 589658, 588896, 588457, 587956, 586991, 585811, 585211, 585848, 587795, 590701, 594250, 598346, 602908, 607639, 612314, 617201, 622857, 629407, 636413, 643682, 651723, 660957, 670815, 680148, 688253, 694908, 699727, 702304, 703052, 703068, 702969, 702536, 701678, 700952, 700681, 700266, 698951, 696773, 694185, 691284, 688113, 685391, 684052, 684159, 684949, 686056, 688062, 691631, 696514, 701684, 706229, 710024, 713728, 718207, 723874, 730478, 737517, 744683, 751889, 759165, 766679, 774532, 782296, 789100, 794537, 799091, 803196, 806223, 807082, 805608, 802586, 798488, 793084, 786504, 779711, 773398, 767071, 759863, 751881, 744074, 737015, 730500, 724250, 718388, 713103, 708377, 704313, 701380, 700004, 700091, 701192, 703130, 706237, 711007, 717605, 725700, 734580, 743344, 751098, 757245, 761732, 765045, 767882, 770794, 774095, 778053, 782999, 789052, 795653, 801448, 804914, 805324, 803049, 798845, 793036]
59822G93036p402q522q589p822p063o732o539o174n707n166m323l289k803l371
59808G09534m448m981m633m021l751l757l648l305k921k700k740l032l458l795
59794F58344l830l502k940k494k560l220l942l917k889j546q96j218j761j600
59780F22029o47L33O73N32N47R67J376J289Q31O63J242K258K897K745K323K444
59764F42502L169L719L626L446L952M940N437N018M319M104M452N046N780O546
59750G06056O870O318N254M677N159O189O729O265N166M068L186K279J193J95
59736G69604l21k84L1K56J26m53j235j707j548r56l28K20P29R60O46P7p0M09R77
59717G67133J067O16j50r70j462j296q36r72j926k647j968n9J783K615K571K287
$$ y = [793036, 785634, 777112, 768523, 760701, 753638, 746906, 740367, 734193, 728486, 723320, 718997, 715708, 712905, 709534, 705086, 700105, 695472, 691451, 687700, 683943, 680295, 676990, 674069, 671369, 668629, 665597, 662139, 658344, 654514, 651012, 648072, 645578, 643018, 639798, 635856, 631939, 629050, 627504, 626608, 625390, 623629, 622029, 621382, 621715, 622388, 622920, 623467, 624434, 625810, 627099, 627930, 628593, 629835, 632093, 634990, 637735, 640058, 642502, 645671, 649390, 653016, 656462, 660414, 665354, 670791, 675809, 680128, 684232, 688684, 693730, 699510, 706056, 712926, 719244, 724498, 729175, 734334, 740523, 747252, 753517, 758683, 762751, 765937, 768216, 769409, 769604, 769283, 768999, 769030, 769286, 769412, 768959, 767724, 766017, 764469, 763513, 763185, 763405, 764134, 765094, 765740, 765817, 765747, 766156, 767133, 768200, 768816, 768666, 767696, 766234, 764938, 764102, 763130, 761204, 758557, 756589, 756530, 758313, 760928, 763499, 765786]
59701G65786K173K295K489K532K465K758L776N092N774N357M231L010J922R61
59687H10621J95l95j067j980k773k867k212j528j651k765m338n731o675p164p182
59672G62488o812o493o730p396p664o893n414m122l500l317l186k948k509j712
59658F93792n95N44J525K451L343L877L831L527L447L554L391K787J998J039m57
59643G28054k476m204m888m795m724m826m585l889l359l366l435l070k583k554
59629F75300k814k680k057j696k212l316m150m111l327k493k313k898l705m138
59615F33390m121l876l419k567j399l25L64Q22J450K494L719M407L931K547J325
59600F38742R86J093Q41K67P0M15O49K92l60q28j069j225j259j110q87o64l40
$$ y = [765786, 767959, 770254, 772743, 775275, 777740, 780498, 784274, 789366, 795140, 800497, 804728, 807738, 809660, 810621, 810816, 810421, 809354, 807374, 804601, 801734, 799522, 797994, 796343, 793578, 789240, 783509, 776834, 769670, 762488, 755676, 749183, 742453, 735057, 727393, 720500, 715086, 710964, 707464, 704147, 700961, 698013, 695504, 693792, 693197, 693741, 695266, 697717, 701060, 704937, 708768, 712295, 715742, 719296, 722687, 725474, 727472, 728511, 728054, 725578, 721374, 716486, 711691, 706967, 702141, 697556, 693667, 690308, 686942, 683507, 680437, 677854, 675300, 672486, 669806, 667749, 666053, 663841, 660525, 656375, 652264, 648937, 646444, 644131, 641233, 637528, 633390, 629269, 625393, 621974, 619407, 618008, 617683, 618047, 618869, 620319, 622813, 626532, 630939, 634870, 637417, 638742, 639728, 640821, 641662, 641929, 641999, 642414, 643063, 643355, 642995, 642167, 641098, 639873, 638614, 637504, 636617, 635953, 635613]
59583F35613P3K40j59j005j766j930j473r33r25j412j788j753j728k022k153j625
59567F15254q75o70q36n76J06L68n0m24k70J5P8J99N13N92K79J54N88J148J513
59548F17106K125L213L957L608K885L229M907O786P933Q712J0261J3236J6985
59535G04943J9644J9351J5833J0599N407J017k337m116l942k428p07O47J648K256
59521G67815K426K465K509J982L53j775l318m282n676p782r551j0099r932j0087
59507G15048j0622j0670r723q238o958o055n192m235l506l198k841j822k95Q43
59493F42536J014M61k58p51o25M19J957K991L181L321M155N356O158O429O487
59478F82831O483O633P430Q847R891R774Q959Q237P388N838M053K981K423J373
$$ y = [635613, 635686, 635926, 635767, 634762, 632996, 631066, 629593, 628660, 627735, 626323, 624535, 622782, 621054, 619032, 616879, 615254, 614379, 613709, 612873, 612297, 612403, 612771, 612721, 612297, 612027, 612042, 612120, 612319, 612832, 613424, 613703, 613857, 614445, 615593, 617106, 619231, 622444, 626401, 630009, 632894, 636123, 641030, 647816, 655749, 664461, 674722, 687958, 704943, 724587, 743938, 759771, 770370, 775777, 776794, 774457, 770341, 766399, 763971, 763264, 763911, 765559, 767815, 770241, 772706, 775215, 777197, 777550, 775775, 772457, 768175, 762499, 754717, 745166, 735067, 725135, 715048, 704426, 693756, 684033, 675795, 668837, 662782, 657590, 653355, 649849, 646651, 643810, 641988, 641693, 642536, 643550, 644011, 643753, 643002, 642377, 642796, 644753, 647744, 650925, 654246, 658401, 663757, 669915, 676344, 682831, 689314, 695947, 703377, 712224, 722115, 731889, 740848, 749085, 756473, 762311, 766364, 769345, 771768, 773141]
59464G73141j03p55l2J170J984K652L699N014O292P548Q776R697J0304J0979J1780
59449H52146J2219J2053J1613J1012R715P278L957K31l687p464j0371j1963j2598
59436H74141j2819j2573j1484r656p759o492o164o562o975o505m744k110N44K696
59422G83538M615P159J0842J4999J8213J9919K1101K2894K5152K7131K8927L0825
59410A015315L1415K8059J9779Q654k154j0741j6427j8676j7295j3006o961o0
59398A017902O494J0560J0155N239k229r957j6536k1266k3725k3905k2374k0027
59386I10331j7625j5458j3293j0730p832n289l788l343l338l092k289j065N7N42
59372H23788L45m8j63J0K13L90O98J203J672J830J746J904K735M061N227N908
$$ y = [773141, 773038, 772283, 772251, 773421, 775405, 778057, 781756, 786770, 793062, 800610, 809386, 819083, 829387, 840366, 852146, 864365, 876418, 888031, 899043, 908758, 916036, 919993, 920224, 916537, 909073, 898702, 886739, 874141, 861322, 848749, 837265, 827609, 819850, 813358, 807194, 800632, 793657, 787152, 782408, 780298, 780842, 783538, 788153, 795312, 806154, 821153, 839366, 859285, 880386, 903280, 928432, 955563, 984490, 1015315, 1046730, 1074789, 1094568, 1103222, 1101068, 1090327, 1073900, 1055224, 1037929, 1024923, 1017962, 1017902, 1024396, 1034956, 1045111, 1050350, 1048121, 1038164, 1021628, 1000362, 976637, 952732, 930358, 910331, 892706, 877248, 863955, 853225, 845393, 840104, 836316, 832973, 829635, 826543, 824254, 823189, 823246, 823788, 824133, 824085, 823922, 823932, 824145, 824535, 825233, 826436, 828108, 829938, 831684, 833588, 836323, 840384, 845611, 851519]
59356H51519O493P433Q694J0120J1910J4152J6250J7554J8368J9497K0945K1850
59344A024785K1834K1427K0921J9674J7092J3670J0358P301L821m84n068q998
59332A146333j1832j3847j5517j6944j7990j8789j9653k0371k0184j8862j7215
59321I55129j6028j5080j3919j2994j2967j3317j2849j1451j0173r544q978q060
59309H09769p231o833o453n756n070m694m392l904l245k210m15J852L754N179
59295G70351P022R641J2070J3175J2835J1247Q142L522j540n670q342r627r507
59282H13319q176o501n300m375k908n21K486N604Q345J0390J1931J3514J5212
59269H53020J6411J6679J6282J5512J4134J1898R039N886K584m47k574l891n347
$$ y = [851519, 858012, 865445, 874139, 884259, 896169, 910321, 926571, 944125, 962493, 981990, 1002935, 1024785, 1046619, 1068046, 1088967, 1108641, 1125733, 1139403, 1149761, 1157062, 1160883, 1160399, 1155331, 1146333, 1134501, 1120654, 1105137, 1088193, 1070203, 1051414, 1031761, 1011390, 991206, 972344, 955129, 939101, 924021, 910102, 897108, 884141, 870824, 857975, 846524, 836351, 826807, 817829, 809769, 802538, 795705, 789252, 783496, 778426, 773732, 769340, 765436, 762191, 759981, 759566, 761418, 765172, 770351, 777373, 787014, 799084, 812259, 825094, 836341, 844483, 848005, 846465, 840795, 832453, 822826, 813319, 805143, 798642, 793342, 788967, 786059, 785538, 788024, 793628, 801973, 812363, 824294, 837808, 853020, 869431, 886110, 902392, 917904, 932038, 943936, 952975, 958861, 961445, 960998, 958424, 954533, 949186]
59256I49186p436r384j0225r961r243q575q336q706r012q055n657l085j297K02
59242H50416K056L701M405M698N591O957P889Q080P869P414O785O289N788M343
59228I32281J530j561l630m795n874o890p564q416r865j0938j0504r271q885r411
59214H36207r544r095r240j0193j0540r469p986p226o895o164n006l909l075k491
59200G35374k110j631o72N56J460J943K355K620K424K139K533L381L660L206L045
59185G60283L759M709N261N601N928N914N514N235N152M731M124M425N894P149
59171H33679P001O155O023O673P136P055O879O765O378N606M592L161J019j576
59157I06546m021o201q456j0762j2572j3546j3978j4266j4365j3939j2939j1836
$$ y = [949186, 941750, 932366, 922141, 912180, 902937, 894362, 886026, 877320, 868308, 860253, 854596, 851511, 850214, 850416, 852472, 856173, 860578, 865276, 870867, 877824, 885713, 893793, 901662, 909076, 915861, 922150, 927938, 932281, 933811, 932250, 928620, 923825, 917951, 911061, 903497, 895081, 885216, 874278, 863774, 854503, 845618, 836207, 826663, 817568, 808328, 798135, 787595, 778126, 770140, 762914, 756019, 749855, 744849, 740940, 737865, 735374, 733264, 731633, 730961, 731517, 732977, 734920, 737275, 739895, 742319, 744458, 746991, 750372, 754032, 757238, 760283, 764042, 768751, 774012, 779613, 785541, 791455, 796969, 802204, 807356, 812087, 816211, 820636, 826530, 833679, 840680, 846835, 852858, 859531, 866667, 873722, 880601, 887366, 893744, 899350, 903942, 907103, 908122, 906546, 902525, 896324, 887868, 877106, 864534, 850988, 837010, 822744, 808379, 794440, 781501, 769665]
59145G69665j1193j1034j0762r911q758p875p315o700o033n757n874n748m989
59132F67716l975l185k490j557m89L37Q01J111J545K414L957N968P756Q735R002
59117F97646R197R939J1393J3170J4529J4923J4440J3651J3047J2755J2555J1946
59105H49191J0437Q163N928M218K521K51k095l530m077m644n487n834n273m384
59091H45385l671k843j722r60j122j714j821j417j359k317m102n920o996p174
59077H02247p029p112p245o920o315o139o458o543o070n615n606n626n231m601
59063G15737l919k858j417m36n07j036j200j269j929k810k810j771p79o15q35
59048F91546o67q3M04N38M80L49N1n29j279j894k078j738j004j21O22J013J146
$$ y = [769665, 758472, 747438, 736676, 726765, 718007, 710132, 702817, 696117, 690084, 684327, 678453, 672705, 667716, 663741, 660556, 658066, 656509, 656020, 656357, 657158, 658269, 659814, 662228, 666185, 672153, 679909, 688644, 697646, 706843, 716782, 728175, 741345, 755874, 770797, 785237, 798888, 811935, 824690, 837245, 849191, 859628, 867791, 873719, 877937, 880458, 880709, 878614, 875084, 871007, 866363, 860876, 855042, 849769, 845385, 841714, 838871, 837149, 836189, 835067, 833353, 831532, 830115, 828756, 826439, 822337, 816417, 809421, 802247, 795218, 788106, 780861, 773941, 767626, 761487, 755029, 748486, 742416, 736801, 731195, 725569, 720338, 715737, 711818, 708960, 707543, 707107, 706600, 705564, 704364, 703095, 701166, 698356, 695546, 693775, 692996, 692381, 691546, 690879, 690796, 691200, 691738, 692218, 692567, 692618, 692089, 690810, 688916, 686838, 685100, 684096, 683975, 684597, 685610, 686756]
59031F86756J440K212L333M517N802P388R123J0574J1575J2272J2660J2578J2143
59018G92373J1668J1055R830P912N834M022K393P62p80k112l182l805l800l344
59004H28826k657j439O25K851M087M366M979O444P584P273O127N548N844O283
58990H86741O335N856M586K517M92n70q66j212j591j193L4J070J365J789L418
58975I08771N974Q176R385J0221J1495J3051J4052J4255J4422J5333J6725J7633
58963A059493J7538J6682J5413J3848J2178J0523Q362M815j17n250r549j3171
58951A130765j6699j9969k2326k3601k4070k3732k2379k0307j8287j6732j5252
58940I07411j3225j0529p720n562m370l760l209k730k609k612k100j118n98j092
$$ y = [686756, 688196, 690408, 693741, 698258, 704060, 711448, 720571, 731145, 742720, 754992, 767652, 780230, 792373, 804041, 815096, 824926, 832838, 838672, 842694, 845087, 845849, 845069, 842957, 839775, 835970, 832170, 828826, 826169, 824730, 825355, 828206, 832293, 836659, 841638, 848082, 855666, 862939, 869066, 874614, 880458, 886741, 893076, 898932, 903518, 906035, 906527, 905957, 905091, 903879, 902288, 901095, 901129, 902199, 903564, 905353, 908771, 914745, 922921, 932306, 942527, 954022, 967073, 981125, 995380, 1009802, 1025135, 1041860, 1059493, 1077031, 1093713, 1109126, 1122974, 1135152, 1145675, 1154037, 1158852, 1158735, 1153485, 1143936, 1130765, 1114066, 1094097, 1071771, 1048170, 1024100, 1000368, 977989, 957682, 939395, 922663, 907411, 894186, 883657, 875937, 870375, 866005, 862245, 859036, 856306, 853697, 851085, 848985, 847867, 847269, 846177]
58926H46177j963k344k304k389k554k363j936j855k197k390k094j533r25p2J213
58911H20471K661L736M171M225M556N746P794J0091J2010J3420J4615J5902J7404
58898I36802J8949K0033K0180J9515J8796J8667J9171K0108K1535K3561K5894
58887A163211K7891K8953K8758K7308K4911K1908J8371J4259R837N501J215l430
58875A368693q458j3356j7819k1948k5454k7324k6899k4830k2459k0461j8625
58864A141060j6655j4684j3071j2063j1679j1662j1682j1661j1798j2163j2443
58853A001499j2204j1305j0054r080q886r285r530r314r248r847j0539j0525j0242
58840H71440j0781j2006j2551j1837j0808j0279r817q796p481o355n272l980k660
$$ y = [846177, 844214, 841870, 839566, 837177, 834623, 832260, 830324, 828469, 826272, 823882, 821788, 820255, 819330, 819258, 820471, 823132, 826868, 831039, 835264, 839820, 845566, 853360, 863451, 875461, 888881, 903496, 919398, 936802, 955751, 975784, 995964, 1015479, 1034275, 1052942, 1072113, 1092221, 1113756, 1137317, 1163211, 1191102, 1220055, 1248813, 1276121, 1301032, 1322940, 1341311, 1355570, 1365407, 1370908, 1372123, 1368693, 1360235, 1346879, 1329060, 1307112, 1281658, 1254334, 1227435, 1202605, 1180146, 1159685, 1141060, 1124405, 1109721, 1096650, 1084587, 1072908, 1061246, 1049564, 1037903, 1026105, 1013942, 1001499, 989295, 977990, 967936, 958856, 949970, 940685, 931155, 921841, 912593, 902746, 892207, 881682, 871440, 860659, 848653, 836102, 824265, 813457, 803178, 793361, 784565, 777084, 770729, 765457, 761477, 758817]
58827G58817j368K26K008L220L626L934M532M863M769N153O369P146O329M735
58813H14359L929L909L497K390J343O57j38j135j881k288k776l488m248n135o223
58798H02772o990o920o501o709p561q036p403n902m202k896k282k053j351K39
58784G34205K066L348M211N089N707N619N332N714O564O762N677L635J121j468
58770G93582l593m955n955p001p641p356o715o675o999o554n093l499k357j415
58756G17774n50j27j50j0O01J292J643J616J413J502K586M743O805P516P135O918
58740G60707P251P412P096O952P423Q110Q463Q288P503O301N531N976P095P508
58726H61616O755N655M873M173L342K757K707L014L612M626N686N996N403M595
$$ y = [758817, 757449, 757675, 759683, 762903, 766529, 770463, 774995, 779858, 784627, 789780, 796149, 803295, 809624, 814359, 818288, 822197, 825694, 828084, 829427, 830084, 829946, 828811, 826930, 824642, 821866, 818378, 814130, 808995, 802772, 795782, 788862, 782361, 775652, 768091, 760055, 752652, 746750, 742548, 739652, 737370, 735317, 733966, 734205, 736271, 739619, 743830, 748919, 754626, 760245, 765577, 771291, 777855, 784617, 790294, 793929, 795050, 793582, 789989, 785034, 779079, 772078, 764437, 757081, 750366, 743691, 736692, 730138, 725045, 721546, 719189, 717774, 717224, 717097, 716947, 716937, 717538, 718830, 720473, 722089, 723502, 725004, 727590, 732333, 739138, 746654, 753789, 760707, 767958, 775370, 782466, 789418, 796841, 804951, 813414, 821702, 829205, 835506, 841037, 847013, 854108, 861616, 868371, 874026, 878899, 883072, 886414, 889171, 891878, 894892, 898504, 903130, 908816, 914812, 920215, 924810]
58712I24810L993L235K033P43k64j131k150l369m839o681q783j0884j2904j4780
58698H69029j6157j6858j7300j7752j7577j6150j4180j2902j2254j1165r547q488
58686F98699q360q171p286o380o126o091n595m761m052l508l011k585k027r25
58672F29821O17J983L007M172N656P009Q109R534J1607J3761J5230J5616J4621
58659G40743J2015Q257M335P22k796o104q433r374r406r091q468p608o919o588
58645F91285o323n835n004l561j443N36J412J475J945L050L641L014J849R37J21
58630F87099q78j657j890j979k243k232j504m47K62M82N30P72J645L384N545P314
58614F94203Q455R274R757R649R309R289Q997P171M022J469O85O14k84j963l326
$$ y = [924810, 928803, 932038, 934071, 934814, 934550, 933419, 931269, 927900, 923061, 916380, 907597, 896713, 883809, 869029, 852872, 836014, 818714, 800962, 783385, 767235, 753055, 740153, 727899, 716734, 707187, 698699, 690339, 682168, 674882, 668502, 662376, 656285, 650690, 645929, 641877, 638369, 635358, 632773, 630746, 629821, 630438, 632421, 635428, 639600, 645256, 652265, 660374, 669908, 681515, 695276, 710506, 726122, 740743, 752758, 761015, 765350, 766072, 763276, 757172, 748739, 739365, 729959, 720868, 712400, 704792, 697873, 691285, 684962, 679127, 674123, 670562, 669119, 669655, 671067, 672542, 674487, 677537, 681178, 684192, 686041, 686978, 687099, 686221, 684564, 682674, 680695, 678452, 676220, 674716, 674269, 674531, 675013, 675543, 676315, 677960, 681344, 686889, 694203, 702658, 711932, 721689, 731338, 740647, 749936, 758933, 766104, 770126, 771595, 772280, 772894, 772610, 770647, 767321]
58599G67321l857l862l772l879m200m137k969j020N35J294K178M002O467Q989
58585G63090J1394J3417J4540J4876J5141J5354J4724J3213J1865J0996R605P419
58573I15634N986O551Q150R140R629J0933J3439J6362J9101K1614K3845K5774
58561A086158K7681K9467L0112K8647K5328K1080J6324J0999N412L07l640n997
58549A271878o714o446o176o198o089n880o370p945j0116j2600j5768j9466k2556
58536A139554k4246k4967k5220k4626k2853k0445j8007j5493j3019j1260j0266
58525I29152q983o821m647l361k587j664q46n21k85J25L4r27j830j883j793k478
58509H90685l340l268k477k008j985j783j378j163r10j77N34K41j052k339k854
$$ y = [767321, 763464, 759602, 755830, 751951, 747751, 743614, 740645, 739625, 740160, 741454, 743632, 747634, 754101, 763090, 774484, 787901, 802441, 817317, 832458, 847812, 862536, 875749, 887614, 898610, 908215, 915634, 921620, 928171, 936321, 945461, 955090, 966023, 979462, 995824, 1014925, 1036539, 1060384, 1086158, 1113839, 1143306, 1173418, 1202065, 1227393, 1248473, 1264797, 1275796, 1281208, 1281515, 1277875, 1271878, 1265164, 1258718, 1252542, 1246344, 1240255, 1234375, 1228005, 1220060, 1209944, 1197344, 1181576, 1162110, 1139554, 1115308, 1090341, 1065121, 1040495, 1017642, 997197, 979190, 963697, 950678, 939418, 929152, 920169, 913348, 908701, 905340, 902753, 901089, 900243, 899722, 899437, 899562, 899596, 898669, 896839, 894956, 893163, 890685, 887345, 884077, 881600, 879592, 877607, 875824, 874446, 873283, 872373, 872196, 872730, 872971, 871919, 869580, 866726]
58494H66726k607j964j357j051o53O05K722M762O229P691R524J1182J2414J4049
58480I28272J6642J9397K1312K2323K2370K0638J6839J2228Q101M244L4m005o941
58467A081454q866j0339j1184j0982r976q439o107l125m85J489L878P285J0548
58454A035151J2540J3886J5354J5963J4370J1001P141K996j629n860q784j0985
58442A101144j3220j4613j4033j2304j1002r907p786m937k839j737o05Q83K260
58429A011304L793O109Q662J0294J1072J1880J2562J2267J1131R909Q272N268
58417A122523J226k455n115o936p761p507p235q077r463j0009r746r705r879r401
58403A020460q340p494o743n333l475k022r22L93J563J933K043K816L849M168
$$ y = [866726, 864119, 862155, 860798, 859747, 859094, 859699, 862421, 867183, 873412, 881103, 890627, 901809, 914223, 928272, 944914, 964311, 985623, 1007946, 1030316, 1050954, 1067793, 1080021, 1088122, 1092366, 1092400, 1088395, 1081454, 1072588, 1062249, 1051065, 1040083, 1030107, 1021668, 1015561, 1012436, 1011951, 1013440, 1017318, 1024603, 1035151, 1047691, 1061577, 1076931, 1092894, 1107264, 1118265, 1125406, 1128402, 1126773, 1120913, 1112129, 1101144, 1087924, 1073311, 1059278, 1046974, 1035972, 1026065, 1018279, 1013342, 1010503, 1008766, 1008161, 1009044, 1011304, 1015097, 1021206, 1029868, 1040162, 1051234, 1063114, 1075676, 1087943, 1099074, 1108983, 1117255, 1122523, 1123749, 1121294, 1116179, 1109243, 1101482, 1093975, 1086740, 1078663, 1069200, 1059191, 1049445, 1039740, 1029861, 1020460, 1012120, 1004626, 997883, 992550, 989075, 987053, 986131, 986524, 988087, 990020, 992063, 994879, 998728, 1002896]
58389A002896L973L927L574K453J758K717M172M195L459M313O989R390J0481J1196
58375A075493J1904J1584R991Q430P902Q218R095J0426J1538J1862J2192J3596
58363A202231J5481J6479J6722J7255J7803J7265J5883J4594J2881R667N907L716
58351A365884L186K592J463Q45Q05L32k82M04K399M286N761P785J0284J2166J3540
58336A431450J5469J7701J9043J9724K0825K1752K0999J9080J7804J6922J4544
58325A635313J0729P571N761M122K551K270L060L350L208M136N897O779P016Q551
58311A710314J1234J2769J2737J3162J4679J5649J5644J6274J7878J8788J8599
58300A877727J8868J9924K0268J9721J9889K0952K1318K0961K1645K3477K4651
$$ y = [1002896, 1006869, 1010796, 1014370, 1016823, 1018581, 1021298, 1025470, 1029665, 1033124, 1037437, 1044426, 1053816, 1064297, 1075493, 1087397, 1098981, 1108972, 1117402, 1125304, 1133522, 1142617, 1153043, 1164581, 1176443, 1188635, 1202231, 1217712, 1234191, 1250913, 1268168, 1285971, 1303236, 1319119, 1333713, 1346594, 1356261, 1362168, 1365884, 1369070, 1371662, 1373125, 1373970, 1374775, 1375107, 1374825, 1375229, 1377628, 1381914, 1387675, 1395460, 1405744, 1417910, 1431450, 1446919, 1464620, 1483663, 1503387, 1524212, 1545964, 1566963, 1586043, 1603847, 1620769, 1635313, 1646042, 1653613, 1659374, 1663496, 1666047, 1668317, 1671377, 1674727, 1677935, 1682071, 1687968, 1694747, 1701763, 1710314, 1721548, 1734317, 1747054, 1760216, 1774895, 1790544, 1806188, 1822462, 1840340, 1859128, 1877727, 1896595, 1916519, 1936787, 1956508, 1976397, 1997349, 2018667, 2039628, 2061273, 2084750, 2109401]
58289B109401K4947K5877K7100K6705K5361K6001K8845L0944L1331L2276L4618
58278B423406L6321L6661L7547L9502M0671M0870M2301M5189M7139M7827M9836
58267B887270N3754N7043N8831O1134O4275O6037O6388O7976P0790P1684P0338
58256C595520P0024P1311P1001O8870O9111P3079P6877P8428Q0702Q5541R0601
58245D431065R4947J01280J09933J17033J21410J26945J35387J43518J50078J58405
58235E690001J69344J78957J86358J96256K10345K24147K35772K49566K67350
58226G608096K84753L00361L19504L44504L70446L95266M24360M60248M97882
58217A1005420N35642N80236O34937O94155P55960Q28186R15523J013197J120773
$$ y = [2109401, 2134348, 2160225, 2187325, 2214030, 2239391, 2265392, 2294237, 2325181, 2356512, 2388788, 2423406, 2459727, 2496388, 2533935, 2573437, 2614108, 2654978, 2697279, 2742468, 2789607, 2837434, 2887270, 2941024, 2998067, 3056898, 3118032, 3182307, 3248344, 3314732, 3382708, 3453498, 3525182, 3595520, 3665544, 3736855, 3807856, 3876726, 3945837, 4018916, 4095793, 4174221, 4254923, 4340464, 4431065, 4526012, 4627292, 4737225, 4854258, 4975668, 5102613, 5238000, 5381518, 5531596, 5690001, 5859345, 6038302, 6224660, 6420916, 6631261, 6855408, 7091180, 7340746, 7608096, 7892849, 8193210, 8512714, 8857218, 9227664, 9622930, 10047290, 10507538, 11005420, 11541062, 12121298, 12756235, 13450390, 14206350, 15034536, 15950059, 16963256, 18084029]
58208A8084029J248818J404105J582642J786223K030983K330985K690761L124676
58200C4283222L665785M345310N184207O215501P489077R041748J0896263J3113693
58192I4234806J5820220J9164601K3264802K8125103L3377509L7920569L9946029
58185B91853639L7725800L0721000K0035569P796584l909500j3663918k0736387
58178C49822787k4939037k6582656k6381099k5168236k3593520k2007861k0524551
58171A80625827j9119286j7713769j6249103j4724765j3183129j1676512j0254386
58164G7704877q957249p801893o780104n880102n098714m428339l849100l344258
58156C1565118k910681k545720k236456j970654j746275j561031j403424j263067
$$ y = [18084029, 19332847, 20736952, 22319594, 24105817, 26136800, 28467785, 31158546, 34283222, 37949007, 42294317, 47478524, 53694025, 61183102, 70224850, 81121113, 94234806, 110055026, 129219627, 152484429, 180609532, 213987041, 251907610, 291853639, 329579439, 360300439, 380336008, 388132592, 384223092, 370559174, 349822787, 324883750, 298301094, 271919995, 246751759, 223158239, 201150378, 180625827, 161506541, 143792772, 127543669, 112818904, 99635775, 87959263, 77704877, 68747628, 60945735, 54165631, 48285529, 43186815, 38758476, 34909376, 31565118, 28654437, 26108717, 23872261, 21901607, 20155332, 18594301, 17190877, 15927810]
58148A5927810j140135j036231r45107q60586p84870p20689o63013o06420n53434
58139H617325n07914m66826m25859l87024l53795l24495k96893k73758k57416
58130E323345k44077k29525k15475k04541j94146j81244j68325j58778j50630
58121C576604j40520j29824j21395j14108j05838r8111r2785q7748q0845p4437
58111B530993p1229o8940o4176n8316n4722n2997n0808m8669m8221m8147m6266
58100A918502m3561m2103m1121l8910l6374l5017l3738l1200k8953k8654k8543
58089A530328k6365k3437k2197k1982k0892j9589j9569j9785j8656j7508j8360
58078A301988k0099k0379j9557j9337j9302j8252j7236j7752j8545j7575j5699
$$ y = [15927810, 14787675, 13751444, 12806337, 11945751, 11160881, 10440192, 9777179, 9170759, 8617325, 8109411, 7642585, 7216726, 6829702, 6475907, 6151412, 5854519, 5580761, 5323345, 5079268, 4849743, 4634268, 4429727, 4235581, 4054337, 3886012, 3727234, 3576604, 3436084, 3306260, 3184865, 3070757, 2964919, 2866808, 2774023, 2686275, 2605430, 2530993, 2459764, 2390824, 2326648, 2268332, 2213610, 2160613, 2109805, 2061136, 2012915, 1964768, 1918502, 1874941, 1832838, 1791717, 1752807, 1716433, 1681416, 1647678, 1616478, 1587525, 1558871, 1530328, 1503963, 1480526, 1458329, 1436347, 1415455, 1395866, 1376297, 1356512, 1337856, 1320348, 1301988, 1281889, 1261510, 1241953, 1222616, 1203314, 1185062, 1167826, 1150074, 1131529, 1113954, 1098255]
58067A098255j4957j4782j3336j1216j0324j0237r105p185o265o475o664p019
58055I80690q329r640r563q898r137r451q144o050n303n679n215l834l224l644
58041H84579l808l552l857m536m582m436n346o743o864n705m981n380o172p164
58027H11453q715j0039r855q634p992q081p625o339n233m689m215l922m306m763
58013G17045m288l384l394m144m159l046j880j285q82n01l65k37J71K64m80j161
57997F88274o64L48L65m33m22J005K879M316N136N077L981K582J780J423R62P18
57981G17327J111J397O72n15j060j097j353j519r42j59J4P9P75J312O68k08K70
57964G16772J579J948J382J348J987K042J362R75P92k65j857k430j962k035k885
$$ y = [1098255, 1083298, 1068516, 1055180, 1043964, 1033640, 1023403, 1014298, 1007113, 1000848, 994373, 987709, 980690, 972361, 962721, 953158, 944260, 935123, 925672, 917528, 911478, 906175, 900496, 895281, 891447, 888223, 884579, 880771, 877219, 873362, 868826, 864244, 859808, 854462, 847719, 840855, 835150, 830169, 824789, 818617, 811453, 802738, 792699, 782844, 774210, 766218, 758137, 750512, 744173, 738940, 734251, 730036, 726114, 721808, 717045, 712757, 709373, 705979, 701835, 697676, 694630, 692750, 691465, 690583, 690082, 689717, 689480, 689651, 689915, 689435, 688274, 687610, 687958, 688323, 687890, 687468, 688473, 691352, 695668, 700804, 705881, 709862, 712444, 714224, 715647, 716609, 717327, 718438, 719835, 720507, 719992, 718932, 717835, 716482, 714963, 714021, 713862, 713876, 713955, 714730, 716042, 716710, 716502, 716772, 718351, 720299, 721681, 723029, 725016, 727058, 728420, 729395, 730187, 729922, 728065, 725635, 723673, 721638, 718753]
57949G18753k823j178N10J008J003J403J938K354L239M773O067O548O796P453
57935G57844Q471R806J1466J2615J2105J0243Q571P551O072L639J374J90n13j517
57921H47917k577l294l948m665m812m056l082k586k367j946j293m51P86K326L548
57906H19500L891L270J896L24n68m82l65j205k513l141l134l416l902l542k266
57891H04347j204q05l15N80J128R42O52O94P15N93P89J323J511J114O14K41j32
57874H12787k6J242K999L562K600J700K116L322M284M803M996M769M406M581N266
57859H63407N692N708N943O394O292N700N587N897N244L244J453R93Q80j61j694
57844I20579k624l051l715m512m830m642m277l769l240l097l163k532j076J6l3
$$ y = [718753, 715930, 714752, 715262, 716270, 717273, 718676, 720614, 722968, 726207, 730980, 737047, 743595, 750391, 757844, 766315, 776121, 787587, 800202, 812307, 822550, 831121, 838672, 844744, 848383, 849757, 849947, 849434, 847917, 845340, 842046, 838098, 833433, 828621, 824565, 821483, 818897, 816530, 814584, 813291, 812840, 813626, 815952, 819500, 823391, 826661, 828557, 828881, 828313, 827831, 827466, 826261, 823748, 820607, 817473, 814057, 810155, 806613, 804347, 803143, 802338, 802023, 802603, 803731, 804673, 805325, 806019, 806734, 807327, 808116, 809439, 810950, 812064, 812678, 812919, 812787, 812761, 814003, 817002, 820564, 823164, 824864, 826980, 830302, 834586, 839389, 844385, 849154, 853560, 858141, 863407, 869099, 874807, 880750, 887144, 893436, 899136, 904723, 910620, 915864, 919108, 920561, 921554, 922434, 922273, 920579, 917955, 914904, 911189, 906677, 901847, 897205, 892928, 889159, 885919, 882822, 879659, 877127, 876051, 876067, 876034]
57829H76034l98j06M32M89N72J535K942L619L332K825K554K450K427K265J465
57814I02437Q8p71k62R67J574J179L68l41p46o43j98j24p14j113m23R38J842K020
57796I06078K130K560L107L672M468N515O490P093P182O791O272O165O586P148
57782I81257P637Q241Q881R052Q590P964P474O885O160N646N174L995K115O29
57768A069700R9l29j424k618l153l391l906m238l779l003k604k176j068K11P57
57753A039078Q56J435K498L472M566O263P850Q095P271O921P577Q177P853O922
57739A118834N814M415K868J909J904K345K723L041L328L447L529L835M028L453
57725A165473K320J686K020K593K579J968J095J35n88n34K98J118J210O86Q6k69
$$ y = [876034, 875636, 875530, 875962, 876451, 877023, 878558, 881500, 885119, 888451, 891276, 893830, 896280, 898707, 900972, 902437, 902525, 901754, 901492, 902459, 904033, 905212, 905580, 905239, 904493, 903850, 903652, 903528, 902814, 901701, 901278, 902216, 904058, 906078, 908208, 910768, 913875, 917547, 922015, 927530, 934020, 941113, 948295, 955086, 961358, 967523, 974109, 981257, 988894, 997135, 1006016, 1015068, 1023658, 1031622, 1039096, 1045981, 1052141, 1057787, 1062961, 1066956, 1069071, 1069700, 1069799, 1069470, 1068046, 1065428, 1062275, 1058884, 1054978, 1050740, 1046961, 1043958, 1041354, 1039178, 1038110, 1038321, 1039078, 1039934, 1041369, 1043867, 1047339, 1051905, 1058168, 1066018, 1074113, 1081384, 1088305, 1095882, 1104059, 1111912, 1118834, 1124648, 1129063, 1131931, 1133840, 1135744, 1138089, 1140812, 1143853, 1147181, 1150628, 1154157, 1157992, 1162020, 1165473, 1167793, 1169479, 1171499, 1174092, 1176671, 1178639, 1179734, 1179869, 1179281, 1178747, 1179045, 1180163, 1181373, 1182059, 1182145, 1181876]
57709A181876l43k87l56n44k89Q29K155K478J661Q99J137J988K644L044L547M104
57693A204543M427M590M832M934M438L362K321J872K085K715L566M622N934P461
57679A261702R106J0909J3024J5415J7891K0642K4454K9957L6808M4197N2093
57668A536198O1265P1715Q1366Q6445Q3382P0744N0060K5038k44k2664m0139n1466
57656A951700n6791n7727n6109n2702m7622m1641l6002l1027k5982k0536j5394
57645A510167j1227p879n121l265k390j714n10Q65J634J891K411L427M398M927
57631A497614N209N440N460N211N044N276N615N442M544L458K978L438M454N336
57617A564519N696N578N155M485L670L050L051L785M871N677N860N714N915O775
$$ y = [1181876, 1181533, 1181246, 1180890, 1180346, 1180057, 1180886, 1183041, 1185519, 1187180, 1188079, 1189216, 1191204, 1193848, 1196892, 1200439, 1204543, 1208970, 1213560, 1218392, 1223326, 1227764, 1231126, 1233447, 1235319, 1237404, 1240119, 1243685, 1248307, 1254241, 1261702, 1270808, 1281717, 1294741, 1310156, 1328047, 1348689, 1373143, 1403100, 1439908, 1484105, 1536198, 1597463, 1669178, 1750544, 1836989, 1920371, 1991115, 2041175, 2066213, 2065969, 2043305, 2003166, 1951700, 1894909, 1837182, 1781073, 1728371, 1680749, 1639108, 1603106, 1572079, 1546097, 1525561, 1510167, 1498940, 1491061, 1485940, 1482675, 1480285, 1478571, 1478061, 1478926, 1480560, 1482451, 1484862, 1488289, 1492687, 1497614, 1502823, 1508263, 1513723, 1518934, 1523978, 1529254, 1534869, 1540311, 1544855, 1548313, 1551291, 1554729, 1559183, 1564519, 1570215, 1575793, 1580948, 1585433, 1589103, 1592153, 1595204, 1598989, 1603860, 1609537, 1615397, 1621111, 1627026, 1633801]
57603A633801P849Q394Q139P415O649O044N727N810O182O478O421O033N462M805
57589A725209M245M129M650N530O244O565O732P036P371P353O810O022N457N368
57575A808721N683O112O267N864N103M668N028N842O436O739P245P995Q347Q010
57561A898060P652P930Q550Q786Q631Q647Q973R227R309R646J0506J1574J2345
57548B019836J2616J2573J2620J3052J3599J3505J2411J0958J0034R682R363R052
57536B159301R261R949J0249R612Q632Q349R109J0379J1379J1698J1586J1743
57524B281247J2598J3752J4468J4562J4384J4042J3384J2717J2683J3176J3248
57513B430261J2495J1822J2181J3194J3770J3574J3171J2980J2894J2804J2809
$$ y = [1633801, 1641650, 1650044, 1658183, 1665598, 1672247, 1678291, 1684018, 1689828, 1696010, 1702488, 1708909, 1714942, 1720404, 1725209, 1729454, 1733583, 1738233, 1743763, 1750007, 1756572, 1763304, 1770340, 1777711, 1785064, 1791874, 1797896, 1803353, 1808721, 1814404, 1820516, 1826783, 1832647, 1837750, 1842418, 1847446, 1853288, 1859724, 1866463, 1873708, 1881703, 1890050, 1898060, 1905712, 1913642, 1922192, 1930978, 1939609, 1948256, 1957229, 1966456, 1975765, 1985411, 1995917, 2007491, 2019836, 2032452, 2045025, 2057645, 2070697, 2084296, 2097801, 2110212, 2121170, 2131204, 2140886, 2150249, 2159301, 2168562, 2178511, 2188760, 2198372, 2207004, 2215353, 2224462, 2234841, 2246220, 2257918, 2269504, 2281247, 2293845, 2307597, 2322065, 2336627, 2351011, 2365053, 2378437, 2391154, 2403837, 2417013, 2430261, 2442756, 2454578, 2466759, 2479953, 2493723, 2507297, 2520468, 2533448, 2546342, 2559146, 2571955]
57502B571955J2867J2742J2436J2232J2197J2009J1368J0400R613R597J0598J2187
57490B710201J3410J3570J2858J2030J1619J1657J1939J2260J2481J2686J3167
57479B847878J4037J4990J5675J6120J6423J6335J5643J4830J4646J5071J5253
57468C016901J4684J3816J3289J3040J2706J2434J2822J4058J5589J6608J6744
57457C172691J6358J6265J6980J8083J8617J8262J7738J7787J8171J8212J7973
57446C367137J8085J8583J8800J8560J8535J9074J9451J8992J8286J8451J9495
57435C573449K0394K0564K0411K0329K0100J9599J9320J9628K0082K0083J9837
57424C793796K0072K0908K1627K1583K0921K0255J9967J9962J9965J9880J9873
$$ y = [2571955, 2584822, 2597564, 2610000, 2622232, 2634429, 2646438, 2657806, 2668206, 2677819, 2687416, 2698014, 2710201, 2723611, 2737181, 2750039, 2762069, 2773688, 2785345, 2797284, 2809544, 2822025, 2834711, 2847878, 2861915, 2876905, 2892580, 2908700, 2925123, 2941458, 2957101, 2971931, 2986577, 3001648, 3016901, 3031585, 3045401, 3058690, 3071730, 3084436, 3096870, 3109692, 3123750, 3139339, 3155947, 3172691, 3189049, 3205314, 3222294, 3240377, 3258994, 3277256, 3294994, 3312781, 3330952, 3349164, 3367137, 3385222, 3403805, 3422605, 3441165, 3459700, 3478774, 3498225, 3517217, 3535503, 3553954, 3573449, 3593843, 3614407, 3634818, 3655147, 3675247, 3694846, 3714166, 3733794, 3753876, 3773959, 3793796, 3813868, 3834776, 3856403, 3877986, 3898907, 3919162, 3939129, 3959091, 3979056, 3998936, 4018809]
57413D018809K0159K0740K1413K1996K2469K2912K3376K3755K3708K2928K1736
57402D264001K1095K1564K2431K2608K2240K2546K3894K5059K4997K4391K4541
57391D519367K5399K5835K5495K5181K5365K5512K5204K4981K5499K6442K6872
57380D801152K6331K5200K4214K3864K4106K4397K4201K3573K2995K2695K2459
57369E065187K2174K2103K2409K2822K3023K3053K3097K3158K3217K3478K4153
57358E317874K5119K5966K6362K6278K6017K6050K6548K7071K7049K6568K6324
57347E607226K6648K7106K7236K7203K7327K7370K6877K5968K5258K5040K5041
57336E898300K5028K5182K5634K6045K5888K5133K4373K4253K4847K5650K6152
$$ y = [4018809, 4038968, 4059708, 4081121, 4103117, 4125586, 4148498, 4171874, 4195629, 4219337, 4242265, 4264001, 4285096, 4306660, 4329091, 4351699, 4373939, 4396485, 4420379, 4445438, 4470435, 4494826, 4519367, 4544766, 4570601, 4596096, 4621277, 4646642, 4672154, 4697358, 4722339, 4747838, 4774280, 4801152, 4827483, 4852683, 4876897, 4900761, 4924867, 4949264, 4973465, 4997038, 5020033, 5042728, 5065187, 5087361, 5109464, 5131873, 5154695, 5177718, 5200771, 5223868, 5247026, 5270243, 5293721, 5317874, 5342993, 5368959, 5395321, 5421599, 5447616, 5473666, 5500214, 5527285, 5554334, 5580902, 5607226, 5633874, 5660980, 5688216, 5715419, 5742746, 5770116, 5796993, 5822961, 5848219, 5873259, 5898300, 5923328, 5948510, 5974144, 6000189, 6026077, 6051210, 6075583, 6099836, 6124683, 6150333, 6176485]
57325F176485K6333K6550K7025K7594K7869K7568K6775K6017K5941K6627K7381
57314F472165K7534K7282K7262K7451K7157K6292K5746K6125K6783K6780K6271
57303F766848K6064K6210K6040K5536K5615K6679K7792K7834K6990K6350K6436
57292G058394K6757K6732K6384K5974K5457K4659K3776K3248K3127K2878K2026
57281G329412K0836K0056J9935J9890J9328J8439J7807J7487J7020J6326J5974
57270G532510J6299J6841J7070J7206J7762J8571J8880J8384J7563J6882J6269
57259G724237J5560J4946J4603J4297J3815J3444J3562J3899J3701J2693J1403
57248G876160J0429R739Q911P858P038O905P318P599P231O453N955O021O169N856
$$ y = [6176485, 6202818, 6229368, 6256393, 6283987, 6311856, 6339424, 6366199, 6392216, 6418157, 6444784, 6472165, 6499699, 6526981, 6554243, 6581694, 6608851, 6635143, 6660889, 6687014, 6713797, 6740577, 6766848, 6792912, 6819122, 6845162, 6870698, 6896313, 6922992, 6950784, 6978618, 7005608, 7031958, 7058394, 7085151, 7111883, 7138267, 7164241, 7189698, 7214357, 7238133, 7261381, 7284508, 7307386, 7329412, 7350248, 7370304, 7390239, 7410129, 7429457, 7447896, 7465703, 7483190, 7500210, 7516536, 7532510, 7548809, 7565650, 7582720, 7599926, 7617688, 7636259, 7655139, 7673523, 7691086, 7707968, 7724237, 7739797, 7754743, 7769346, 7783643, 7797458, 7810902, 7824464, 7838363, 7852064, 7864757, 7876160, 7886589, 7896328, 7905239, 7913097, 7920135, 7927040, 7934358, 7941957, 7949188, 7955641, 7961596, 7967617, 7973786, 7979642]
57234G979642N199M758M745M908N122N621O547P595Q288Q348P692O316M470K756
57220H062007J743J391R74k93k553n238p765j0171j2810j5549j7786j9367k0933
57207G953650k2782k3950k3314k1351j9926k0135k1192k1777k1670k1549k1759
57196G714245k1980k1875k1458k0923k0505k0482k1027k2029k3198k4251k4925
57185G471592k5006k4636k4390k4795k5727k6426k6227k5208k4119k3518k3138
57174G198402k2424k1615k1727k3164k4966k5996k6269k6419k6400k5693k4466
57163F929263k3361k2321k0832j9241j8517j8547j8040j6503j4898j3786j2257
57152F730960r646p201o802q765j1881j5050j8060k1204k4993k9838l5446m0932
$$ y = [7979642, 7984841, 7989599, 7994344, 7999252, 8004374, 8009995, 8016542, 8024137, 8032425, 8040773, 8048465, 8054781, 8059251, 8062007, 8063750, 8065141, 8066115, 8065822, 8063269, 8058031, 8050266, 8040095, 8027285, 8011736, 7993950, 7974583, 7953650, 7930868, 7906918, 7883604, 7862253, 7842327, 7822192, 7801000, 7779223, 7757553, 7736004, 7714245, 7692265, 7670390, 7648932, 7628009, 7607504, 7587022, 7565995, 7543966, 7520768, 7496517, 7471592, 7446586, 7421950, 7397560, 7372765, 7347038, 7320612, 7294385, 7269177, 7245058, 7221540, 7198402, 7175978, 7154363, 7132636, 7109472, 7084506, 7058510, 7032241, 7005822, 6979422, 6953729, 6929263, 6905902, 6883581, 6862749, 6843508, 6824991, 6806444, 6788404, 6771901, 6757003, 6743217, 6730960, 6721314, 6714113, 6707311, 6698546, 6686665, 6671615, 6653555, 6632351, 6607358, 6577520, 6542074, 6501142]
57140F501142m5801n0131n3503n4844n3963n2245n1037n0283m9519m9190m9890
57129E940736n1092n1631n0832m8482m4506l9577l5195l2319l0541k9180k8114
57118E499267k6873k4219j9764j4871j0998q099n373k015L614J3823K9191M7924
57106E481607O8679R2236J19218J48426J79292K13980K55448L06020L69906M54433
57096G689245N66316P09042Q85722J100434J353385J638120J946138K268824K590592
57087B0747818K886419L130797L298387L346546L215457K879323K404527J927677
57079D3836951J547498J238399Q80788L73788k83133r97987j648215k138844k432437
57070D0376808k549125k541843k465219k360793k258631k176586k113137k049738
$$ y = [6501142, 6455341, 6405210, 6351707, 6296863, 6242900, 6190655, 6139618, 6089335, 6039816, 5990626, 5940736, 5889644, 5838013, 5787181, 5738699, 5694193, 5654616, 5619421, 5587102, 5556561, 5527381, 5499267, 5472394, 5448175, 5428411, 5413540, 5402542, 5394443, 5389070, 5387055, 5390669, 5404492, 5433683, 5481607, 5550286, 5642522, 5761740, 5910166, 6089458, 6303438, 6558886, 6864906, 7234812, 7689245, 8255561, 8964603, 9850325, 10950759, 12304144, 13942264, 15888402, 18157226, 20747818, 23634237, 26765034, 30063421, 33409967, 36625424, 39504747, 41909274, 43836951, 45384449, 46622848, 47503636, 47877424, 47594291, 46596304, 44948089, 42809245, 40376808, 37827683, 35285840, 32820621, 30459828, 28201197, 26024611, 23911474, 21861736]
57062B1861736j967144j858203j725640j575265j415367j256860j108183r71712
57054I983362q47498p37375o42836n62208m93087m35282l88867l51795l21874
57045E202540k98749k81537k66747k51212k35242k20605k07193j93976j81447
57036C065832j70642j61113j51974j43640j36414j28761j19086j08109r7411q6870
57026A761812p5468o3475n1560l8656k3169o116Q734J7638J8528J0741m804k5110
57014A529095m6155o4651p8388q5872q6974q3418p7437p0244o2510n5307m9339
57003G68800m4024l8598l3525k9570k6333k3046k0127j8469j7597j6144j3909
56992D87458j2005j0977j0002q160n451k430M61L074N539P896R327Q362M496q04
$$ y = [21861736, 19894592, 18036389, 16310749, 14735484, 13320117, 12063257, 10955074, 9983362, 9135864, 8398489, 7755653, 7193445, 6700358, 6265076, 5876209, 5524414, 5202540, 4903791, 4622254, 4355507, 4104295, 3869053, 3648448, 3441255, 3247279, 3065832, 2895190, 2734077, 2582103, 2438463, 2302049, 2173288, 2054202, 1946093, 1848682, 1761812, 1686344, 1622869, 1571309, 1532653, 1509484, 1503368, 1512102, 1529740, 1548268, 1559009, 1554205, 1529095, 1482940, 1418289, 1339901, 1254029, 1167055, 1083637, 1006200, 935956, 873446, 818139, 768800, 724776, 686178, 652653, 623083, 596750, 573704, 553577, 535108, 517511, 501367, 487458, 475453, 464476, 454474, 446314, 440863, 438433, 438894, 441968, 447507, 455403, 464730, 473092, 477588, 476784]
56978D76784n466q815j1506j4004j5943j6803j6396j4819j2462r872p324m775
56966C38599k406n23J300M073P886J1514J4133J6473J9382K2137K3099K1382J7007
56953D94056J0242J864o462j3164j7861k0777k1782k0857j8881j6886j4932j2487
56941C42073r488o204k664R68M086O614R684J4335K0081K5507K9616L1549K9918
56928D96075K3865J4557M425m842j2708j8756k2547k4366k4967k4657k3450k1796
56916C60833k0218j8505j6220j3733j1826j0538r354q215p415o770n828m693l745
56903B23773k806j462L6J100J735K257K535K371K295L001M327N685P099Q916J0961
56888B71823J3079J5898J9724K2984K3216J9558J3346O462K21m481p419r467j1537
$$ y = [476784, 471318, 462503, 450997, 436993, 421050, 404247, 387851, 373032, 360570, 350698, 343374, 338599, 336193, 335670, 336970, 341043, 348929, 360443, 374576, 391049, 410431, 432568, 455667, 477049, 494056, 504298, 506162, 499700, 486536, 468675, 447898, 426116, 405259, 386378, 369492, 354560, 342073, 332585, 326381, 323717, 324685, 328771, 335385, 345069, 359404, 379485, 404992, 434608, 466157, 496075, 519940, 534497, 538922, 534080, 521372, 502616, 480069, 455703, 430736, 406079, 382629, 360833, 340615, 322110, 305890, 292157, 280331, 269793, 260439, 252224, 244809, 238039, 232211, 227518, 223773, 220967, 219505, 219541, 220641, 222376, 224633, 227168, 229539, 231834, 234835, 239162, 244847, 251946, 260862, 271823, 284902, 300800, 320524, 343508, 366724, 386282, 399628, 406090, 406311, 401830, 394411, 384944, 373407]
56875C73407j3115j2869j0639p620m600j273K633O726J0713J4815J9282K4353
56863D01813L0608L8367M6661N3621N7709N7772N2408M0882K4742P359q391k1155
56851G82396l0227l5182l6521l5363l2230k7104k0642j4074p685o75P350J5921
56839E65964K4920L4961M6261N8338P0885Q3347R3047R5328Q6760O7751M1724
56828A269286J2797j5208l8893n6003o6131p0347p0261o7305o2288n5366m6863
56817G33418l7818k9150k0530j1045p65R486J9750L1047M3608N5912O5406O9242
56805I28561O4709N0781K9781O362j5616l4441m9223n8961o3445o3605o0515n5031
56793F79357m8554m2519l6747k9811k1612j4015q222l076L063J0183J7346K4184
$$ y = [373407, 360292, 347423, 336784, 329164, 324564, 323291, 325924, 332650, 343363, 358178, 377460, 401813, 432421, 470788, 517449, 571070, 628779, 686551, 738959, 779841, 804583, 811942, 803551, 782396, 752169, 716987, 680466, 645103, 612873, 585769, 565127, 551053, 543368, 542693, 550043, 565964, 590884, 625845, 672106, 730444, 801329, 884676, 977723, 1073051, 1159811, 1227562, 1269286, 1282083, 1266875, 1227982, 1171979, 1105848, 1035501, 965240, 897935, 835647, 780281, 733418, 695600, 666450, 645920, 634875, 634110, 643596, 663346, 694393, 738001, 793913, 859319, 928561, 993270, 1044051, 1073832, 1080194, 1064578, 1030137, 980914, 921953, 858508, 794903, 734388, 679357, 630803, 588284, 551537, 521726, 500114, 486099, 477877, 474801, 477864, 488047, 505393, 529577]
56781E29577L0339L4280L3982K8468J8151M517r908k2227l0884l6262l9269m0128
56769E00636l8965l6524l3533l0159k6614k3457k0800j8177j5572j3582j2126
56758B31127j0319q137o824o942p297o737n680m933m289l391k800k927l011k322
56744A55518j481j392j791j934j799j504n85R52J830J108k92r23p76o90o69k96
56728A45276N0r6j17O60J464J219M80N60J297J462J024J064J689J867J411J316
56712A60626J820J831Q36j22K9R39J589J562J055L55k36m92n66p91j082j041o00
56695A65712r7K49L97K38k43o87p93p25o69l83K24O08L75L3J43L30K6l35kO57
56675A65058O56ll54l5L31L05J60K11N01J101J950K508K436K326K822L365K939
$$ y = [529577, 559916, 594196, 628178, 656646, 674797, 679314, 669406, 647179, 616295, 580033, 540764, 500636, 461671, 425147, 391614, 361455, 334841, 311384, 290584, 272407, 256835, 243253, 231127, 220808, 212671, 205847, 198905, 191608, 184871, 179191, 174258, 169969, 166578, 163778, 160851, 157840, 155518, 154037, 152645, 150854, 148920, 147121, 145617, 145032, 145984, 147814, 148922, 148630, 147707, 146931, 146241, 145572, 145276, 145326, 145230, 145113, 145773, 147237, 148456, 148936, 149496, 150793, 152255, 153279, 154343, 156032, 157899, 159310, 160626, 162446, 164277, 165113, 164991, 165020, 165959, 167548, 169110, 170165, 170520, 170284, 169792, 169226, 168435, 167353, 166312, 165712, 165615, 165864, 166261, 166499, 166256, 165569, 164776, 164051, 163382, 162999, 163223, 163831, 164206, 164239, 164382, 164712, 164738, 164403, 164401, 165058, 165714, 165711, 165357, 165322, 165653, 165958, 166118, 166329, 166830, 167931, 169881, 172389, 174825, 177151, 179973, 183338, 186277]
56658A86277J832J367J873K260J840J344J626K365K643K144J330Q82J220K162
56644B11165K954K994K475J952J474P18l20j317k157k833l146l102l147l457l471
56629B00782k946k803l828n066m897l356k011j626j412p89l75p51j353j304o40
56614A67625j21k96j062j781j805j134m34j06K25Q24J087N11j75N9R21J245P92
56597A66375L82M59O84Q62J115J224Q82N11P21J149R57L11J03L50K61j69j58K98
56579A76317L31j69l12J67M81L59N55J363K026K143K326K901L225K983K918L637
56563B01251M762N940P533R688J1660J2779J3135J2740J1057Q040M703J953l21
56550C04920k393l873m393m295m024l613l281l673m806n666n473m635l864l176
$$ y = [186277, 188109, 189476, 191349, 193609, 195449, 196793, 198419, 200784, 203427, 205571, 206901, 207783, 209003, 211165, 214119, 217113, 219588, 221540, 223014, 223732, 223412, 222095, 219938, 217105, 213959, 210857, 207710, 204253, 200782, 197836, 195033, 191205, 186139, 181242, 177886, 175875, 174249, 172837, 172048, 171673, 170922, 169569, 168265, 167625, 167504, 167208, 166146, 164365, 162560, 161426, 160992, 160886, 161111, 161935, 163022, 163533, 163358, 163417, 164338, 165583, 166375, 166757, 167216, 167900, 168762, 169877, 171101, 171983, 172494, 173215, 174364, 175321, 175632, 175735, 176085, 176346, 176177, 176019, 176317, 176648, 176479, 176167, 176334, 176815, 177174, 177729, 179092, 181118, 183261, 185587, 188488, 191713, 194696, 197614, 201251, 206013, 211953, 219486, 229174, 240834, 253613, 266748, 279488, 290545, 298585, 303288, 305241, 304920, 302527, 298654, 294261, 289966, 285942, 282329, 279048, 275375, 270569, 264903, 259430, 254795, 250931, 247755]
56536B47755k372j782j800k276k853l335l366k556j296n76o25o18j90j16q92j722
56520B21380j800j604j949k595k802k662k781l094k960k237j486j187j295j438
56506A91490j235o68k82o13j262j195j23J087J629J638J581J508J344J218J157
56491A97274J027R96J302J485Q05m05q56j59N90N39K65O13J417K060K332K107
56475B11392J109l18j089p50j1N50J238K044K006P40m97m63L32O38L63K57M25
56458B17966M15K74L61M94L00M2J87N77P65P83Q24O86L10K31O85R10K52o67p92
56439B24603j67M07O69Q60Q23K72l23j37Q01J609J692J184M48k38o06n15l8P61
56421B32105J774K421K001Q14O0K13L98ok96K13P76L73n01n08N89J816K412K403
$$ y = [247755, 245383, 243601, 241801, 239525, 236672, 233337, 229971, 227415, 226119, 225543, 224918, 224300, 224110, 223994, 223102, 221380, 219580, 217976, 216027, 213432, 210630, 207968, 205187, 202093, 199133, 196896, 195410, 194223, 192928, 191490, 190255, 189587, 189305, 188692, 187430, 186235, 186112, 187199, 188828, 190466, 192047, 193555, 194899, 196117, 197274, 198301, 199297, 200599, 202084, 202889, 202484, 201628, 201469, 202059, 202598, 202863, 203476, 204893, 206953, 209285, 211392, 212501, 212183, 211094, 210344, 210333, 210883, 212121, 214165, 216171, 216911, 216414, 215951, 216283, 216921, 217284, 217541, 217966, 218381, 218655, 219016, 219510, 219810, 219852, 220039, 220616, 221381, 222164, 222988, 223674, 223984, 224215, 224900, 225810, 226062, 225395, 224603, 224436, 224843, 225512, 226372, 227195, 227467, 227144, 227007, 227808, 229417, 231109, 232293, 232741, 232503, 231897, 231382, 231344, 232105, 233879, 236300, 238301, 239115, 239175, 239388, 239786, 239780, 239484, 239697, 240473, 240846, 240345, 239837, 240426, 242242, 244654, 247057]
56403B47057K023J533J376J670J813J308O00L92N96O42L74k9m95p78l86M45M99
56386B58640p50j951j512J44J188Q69J35jM07Q01R22Q62Q74J162J552J642J473
56369B66457J561J979K157J908J777J908J664R67Q00J495J786P29n70n24N58J152
56353B85804Q69O30R31J428J920K416K496J809R42P80J315J927K409K765K677
56338C11118K126J927K570L278L354L468M396N279M899L832L623M279M468L901
56324C62518L663M190M633M341L545K448J060r7l63r0k10p15p82l01J1p7j12J19
56306C83781O04J837M091O236O825O266O324P435Q159P517O307N575N232M778
56292D60967M256L889L693L873M813O276P392P685P526P453P733Q528R772J0903
$$ y = [247057, 249080, 250613, 251989, 253659, 255472, 256780, 257380, 257772, 258368, 259010, 259384, 259355, 258860, 258082, 257696, 258141, 258640, 257890, 255939, 254427, 254571, 255759, 256628, 256763, 256762, 257169, 257970, 258892, 259754, 260628, 261790, 263342, 264984, 266457, 268018, 269997, 272154, 274062, 275839, 277747, 279411, 280378, 281178, 282673, 284459, 285188, 284618, 284094, 284652, 285804, 286673, 287303, 288234, 289662, 291582, 293998, 296494, 298303, 299245, 300025, 301340, 303267, 305676, 308441, 311118, 313244, 315171, 317741, 321019, 324373, 327841, 332237, 337516, 342415, 346247, 349870, 354149, 358617, 362518, 366181, 370371, 375004, 379345, 382890, 385338, 386398, 386301, 385938, 385848, 385638, 384923, 384141, 383840, 383851, 383774, 383662, 383781, 384385, 386222, 390313, 396549, 403374, 409640, 415964, 423399, 431558, 439075, 445382, 450957, 456189, 460967, 465223, 469112, 472805, 476678, 481491, 487767, 495159, 502844, 510370, 517823, 525556, 534084, 543856, 554759]
56278E54759J1330J1232J1282J1760J2509J3409J4276J4721J4823J5416J7032
56267G02549J9147K1244K3750K7025L0315L2904L5454L8918M2971M7028N1889
56256A073194N8720O6964P5080Q2916R1643J01639J12158J22867J34011J45209
56246B064401J55647J65279J74332J81777J85833J85818J82085J74403J62054
56237C631629J45263J25053J01762P5192M6082J6122j3266m0980o5765q7092j05856
56226C828144j22667j36258j45222j50389j53518j54654j53012j49493j45752
56217B517179j41341j34629j26168j18370j11929j05301r7747r0250q3297p6415
56207A431732p0033o5189o1094n5796m9531m4639m1746l8817l4694l0649k7706
$$ y = [554759, 566089, 577321, 588603, 600363, 612872, 626281, 640557, 655278, 670101, 685517, 702549, 721696, 742940, 766690, 793715, 824030, 856934, 892388, 931306, 974277, 1021305, 1073194, 1131914, 1198878, 1273958, 1356874, 1448517, 1550156, 1662314, 1785181, 1919192, 2064401, 2220048, 2385327, 2559659, 2741436, 2927269, 3113087, 3295172, 3469575, 3631629, 3776892, 3901945, 4003707, 4078899, 4124981, 4141103, 4127837, 4086857, 4021092, 3934000, 3828144, 3705477, 3569219, 3423997, 3273608, 3120090, 2965436, 2812424, 2662931, 2517179, 2375838, 2241209, 2115041, 1996671, 1884742, 1779441, 1681694, 1591444, 1508147, 1431732, 1361699, 1296510, 1235416, 1179620, 1130089, 1085450, 1043704, 1004887, 970193, 939544, 911838]
56196I11838k5082k2337k0451j9642j8481j6274j4159j2872j1601r966q900q678
56184G23395q246p349p019p187o230l875k085j954k161j679j509k303k697j648
56170F67453k81K25O20J817L022L241L061L405M002M393N077O371P574Q260Q999
56155G27239J0051J0823J1312J2432J4273J5840J7088J9202K2325K5263K8030
56144I13878L2181L7953M3677M9055N6220O6167P6703Q5452R2369R7695R9917
56133A651267R7647R1653Q3507P4165O5011N8053N3574M9661M5156M0745L6024
56122B346463K8612J7947P225n39o034j1390j6991k2741l0063m0040n1272o1658
56110B159519p0668p8128q2782q4032q3237q1453p7704p1233o3429n5775m7916
$$ y = [911838, 886756, 864419, 843968, 824326, 805845, 789571, 775412, 762540, 750939, 740973, 732073, 723395, 715149, 707800, 700781, 693594, 687364, 683489, 681404, 679450, 677289, 675610, 674101, 671798, 669101, 667453, 667172, 667397, 668017, 669834, 672856, 676097, 679158, 682563, 686565, 690958, 696035, 702406, 709980, 718240, 727239, 737290, 748113, 759425, 771857, 786130, 801970, 819058, 838260, 860585, 885848, 913878, 946059, 984012, 1027689, 1076744, 1132964, 1199131, 1275834, 1361286, 1453655, 1551350, 1651267, 1748914, 1840567, 1924074, 1998239, 2063250, 2121303, 2174877, 2224538, 2269694, 2310439, 2346463, 2375075, 2393022, 2400247, 2399708, 2393674, 2382284, 2365293, 2342552, 2312489, 2272449, 2221177, 2159519, 2088851, 2010723, 1927941, 1843909, 1760672, 1679219, 1601515, 1530282, 1466853, 1411078, 1363162]
56099A363162l9570l2299k7364k3653j9543j5137j1175p611m620k978k163l77
56087A176672K415M002L723L859N771P720Q217Q442R440J0064R693R872J1190
56074A271080J1717J0696J0537J2736J5231J6224J7175J9352K0916K0411J9750
56063A445825K0619K1245J9870J8163J7946J7724J5844J3930J3857J4370J4046
56052A633439J4363J6516J8438J8491J8724K0867K2633K1784K0459K1455K3562
56041A850731K4603K5604K7938K9861L0036L0974L4559L7917L8225L7838L9887
56030B208173M2653M3340M3586M5887M8307M8308M8192N0942N4282N4727N4145
56019B742542N6215N9722O1506O2700O5915O9480P0891P2603P7854Q4071Q7064
$$ y = [1363162, 1323592, 1291293, 1263929, 1240276, 1220733, 1205596, 1194421, 1186810, 1182190, 1179212, 1177049, 1176672, 1179087, 1183089, 1186812, 1190671, 1196442, 1204162, 1212379, 1220821, 1230261, 1240325, 1250018, 1259890, 1271080, 1282797, 1293493, 1304030, 1316766, 1331997, 1348221, 1365396, 1384748, 1405664, 1426075, 1445825, 1466444, 1487689, 1507559, 1525722, 1543668, 1561392, 1577236, 1591166, 1605023, 1619393, 1633439, 1647802, 1664318, 1682756, 1701247, 1719971, 1740838, 1763471, 1785255, 1805714, 1827169, 1850731, 1875334, 1900938, 1928876, 1958737, 1988773, 2019747, 2054306, 2092223, 2130448, 2168286, 2208173, 2250826, 2294166, 2337752, 2383639, 2431946, 2480254, 2528446, 2579388, 2633670, 2688397, 2742542, 2798757, 2858479, 2919985, 2982685, 3048600, 3118080, 3188971, 3261574, 3339428, 3423499, 3510563]
56008C510563Q8467R2224R7144R9922J02277J07770J14771J19840J24766J32941
55998D590685J42250J48964J55133J64417J74461J81363J87697J97898K09939
55989F152807K20124K31537K48582K67934K84481L01456L24546L51000L75324
55980H757791M00641M33171M70694N08260N49725O01253O59203P17758P82468
55971A3880964Q62445R55818J057732J175499J319869J489306J680440J905844
55963B4327917K183334K518037K916625L409253M035144M818914N785925O984418
55955E6979567Q462061J0241291J2360851J4930329J8106242K2023476K6731238
55948A69835055L2011007L7010772M0069584L9265136L3548452K3521307J1120976
$$ y = [3510563, 3599030, 3691254, 3788398, 3888320, 3990597, 4098367, 4213138, 4332978, 4457744, 4590685, 4732935, 4881899, 5037032, 5201449, 5375910, 5557273, 5744970, 5942868, 6152807, 6372931, 6604468, 6853050, 7120984, 7405465, 7706921, 8031467, 8382467, 8757791, 9158432, 9591603, 10062297, 10570557, 11120282, 11721535, 12380738, 13098496, 13880964, 14743409, 15699227, 16756959, 17932458, 19252327, 20741633, 22422073, 24327917, 26511251, 29029288, 31945913, 35355166, 39390310, 44209224, 49995149, 56979567, 65441628, 75682919, 88043770, 102974099, 121080341, 143103817, 169835055, 201846062, 238856834, 278926418, 318191554, 351740006, 375261313, 386382289]
55941C86382289j430460j2450648k0974038k6628000k9558516l0317593k9582392
55934B35440642k7891468k5611836k3039169k0418452j7892808j5518105j3336935
55927I1731869j1398165r718472q277070p052583o032259n188492m480493l881986
55919C5702349l383028k966627k608041k296193k033504j814600j624604j457305
55911A7518447j316061j197003j088611r87660q99690q23777p51842o82852o23482
55902I147469n74329n28447m83765m44702m11309l78489l46157l19332k97870
55893E363069k76298k53837k34837k19495k03518j86874j73718j63844j52913
55884C497735j40854j31453j24067j14222j02158r2477q5560p7521o8631o3664
$$ y = [386382289, 384951829, 372501181, 351527143, 324899143, 295340627, 265023034, 235440642, 207549174, 181937338, 158898169, 138479717, 120586909, 105068804, 91731869, 80333704, 70615232, 62338162, 55285579, 49253320, 44064828, 39584335, 35702349, 32319321, 29352694, 26744653, 24448460, 22414956, 20600356, 18975752, 17518447, 16202386, 15005383, 13916772, 12929112, 12029422, 11205645, 10453803, 9770951, 9147469, 8573140, 8044693, 7560928, 7116226, 6704917, 6326428, 5980271, 5660939, 5363069, 5086771, 4832934, 4598097, 4378602, 4175084, 3988210, 3814492, 3650648, 3497735, 3356881, 3225428, 3101361, 2987139, 2884981, 2792504, 2706944, 2629423, 2560792, 2497128]
55874B497128o3615o4572o4993o6894o9699p0149o8457o7794o7616o4307n8315
55863A770717n3840n1447m7787m2727l9815l9326l7718l4487l2956l3488l2458
55852A324668k9023k6664k6807k6818k5547k5189k6368k6736k5676k5372k6096
55841A034372k5423k3108k1793k1879k0718j7930j6590j7793j8697j7402j5479
55830H17560j4355j3232j1821j1231j1145r844p730p137q114q313p478p879r764
55817F89517j0612r627q826q863p943n733m273m079l329j725j179j715q39J966
55803F22740M132M561N247P086P995O686M612K705k48m453p881r654j1389j3712
55789F18427j4798j3800j2453j1786j0483p991o065n633n237m146m001n589o926
$$ y = [2497128, 2433513, 2368941, 2303948, 2237054, 2167355, 2097206, 2028749, 1960955, 1893339, 1829032, 1770717, 1716877, 1665430, 1617643, 1574916, 1535101, 1495775, 1458057, 1423570, 1390614, 1357126, 1324668, 1295645, 1268981, 1242174, 1215356, 1189809, 1164620, 1138252, 1111516, 1085840, 1060468, 1034372, 1008949, 985841, 964048, 942169, 921451, 903521, 886931, 869138, 850441, 833039, 817560, 803205, 789973, 778152, 766921, 755776, 745932, 738202, 731065, 722951, 714638, 707160, 699281, 689517, 678905, 669278, 660452, 651589, 643646, 637913, 633640, 629561, 626232, 624507, 623328, 621613, 620774, 622740, 626872, 631433, 636680, 643766, 651761, 658447, 663059, 665764, 665516, 661063, 653182, 643528, 632139, 618427, 603629, 589829, 577376, 565590, 555107, 547116, 541051, 535418, 530181, 526035, 522034, 516445, 509519]
55776E09519o355m866l638j815J514N447Q841J1585J3024J1545P051J671l132
55763E50391p864j2545j5659j6717j7264j8080j7842j5775j3177j1121r139p243
55751C87965o656p281p118n528m470n118n894n336m304l797l106j826j168j570
55737C24793j415R6J120R4j706k372k027j580r22k15q37l073m859m703l975m370
55721B94049n063m450l031k270k101j577q12k99M83K006L404L891M274N379O257
55706C00140N589L808K146P11r20k252k672k821l686n015n906o145n940n253m383
55691B67401m167m629m477k970j075J31R45J906K626K771K929L387L412K828K769
55676B73787L627L848K187j81j315j074n50j51K32K17l94q16m55j1k58o80m51
$$ y = [509519, 503164, 498298, 494660, 492845, 494359, 499806, 508647, 520232, 533256, 544801, 551852, 553523, 550391, 542527, 529982, 514323, 497606, 480342, 462262, 444420, 428645, 415468, 404347, 395208, 387965, 381309, 374028, 366910, 361382, 356912, 351794, 345900, 340564, 336260, 332463, 329357, 327531, 326363, 324793, 323378, 323474, 324594, 324688, 322982, 320610, 318583, 317003, 316081, 315866, 315029, 311956, 307097, 302394, 298419, 294049, 288986, 284536, 281505, 279235, 277134, 275557, 274745, 274446, 274929, 276935, 280339, 284230, 288504, 293883, 300140, 305729, 309537, 311683, 312394, 311474, 309222, 306550, 303729, 300043, 295028, 289122, 282977, 277037, 271784, 267401, 263234, 258605, 254128, 251158, 250083, 250214, 251159, 253065, 255691, 258462, 261391, 264778, 268190, 271018, 273787, 277414, 281262, 283449, 283268, 281953, 280879, 280329, 280178, 280410, 280627, 280233, 279417, 278962, 278951, 278693, 278013, 277562]
55659B77562K42R64J970L227L695K861J860J726J680N58j145k181k597l325m440
55644B82657n293n773o250o672o810o846o871o448n401m342l661k982k159j800
55630B11349k096k277j922j603j560j192n98r22k269l000k202j141r68r16k52
55615A88431j56j717l597l833k688j763j457j200j129j502j501n06L56j15r69
55600A66654o12M36N18k74n14j18k73j040j381j330j903k838k666j238j12j02
55584A53207k55K34Q60J033R56P33k8j206j877j538o96Q6Q59J730K509L161L819
55567A63587M207L828K837K043J902K099K199K107J850J381O63k97j352k014j850
55552A83190j251j129j605j779j171m70l13m15n31j056j855j753k54J372J858
$$ y = [277562, 277804, 278768, 280738, 283965, 287660, 290521, 292381, 294107, 295787, 296345, 295200, 293019, 290422, 287097, 282657, 277364, 271591, 265341, 258669, 251859, 245013, 238142, 231694, 226293, 221951, 218290, 215308, 213149, 211349, 209253, 206976, 205054, 203451, 201891, 200699, 200101, 199179, 196910, 193910, 191708, 190567, 189599, 188683, 188431, 188275, 186558, 182961, 179128, 176440, 174677, 173220, 172020, 170891, 169389, 167888, 167382, 167738, 167623, 166654, 166042, 166478, 166996, 166722, 166208, 166090, 165817, 164777, 163396, 162066, 160163, 157325, 154659, 153421, 153309, 153207, 152952, 153186, 154046, 155079, 156035, 156768, 156740, 155534, 153657, 152119, 151423, 151509, 152368, 154098, 156607, 159768, 163587, 167794, 171622, 174459, 176502, 178404, 180503, 182702, 184809, 186659, 188040, 188703, 188406, 187054, 185040, 183190, 181939, 180810, 179205, 177426, 176255, 175785, 175472, 175057, 174526, 173470, 171615, 169862, 169608, 170980, 172838]
55537A72838J720J961K242J796J115J010R16j29j507j810j161r37j622k497l172
55522A70763l790l968l235k296k311l074l358k902k524k457k094j384r08o00J68
55507A36030J175J387O13k20m88m11k02J55K89k63j148j646j831k179k361j733
55491A27167p74n79j073j184o34j44J47Q39J846K228J717J037N92J06l44k38K54
55474A30963L76J02M8J09m05j276j487r73o66p06k50N90M78q96j989j631n90o0
55456A21737J9J80K07k10o15n23k27o6L32J183J726J179o6r81j174r27m96pK75
55437A21546K31J60L49O50P49N71K37r9k63j94q2n6J17N31O64P0p07p45p1N03
55417A24161P57J209J923K276K038J673J361P63m8l83l9K93L2o40j358k023k493
$$ y = [172838, 174558, 176519, 178761, 180557, 181672, 182682, 183598, 183469, 181962, 180152, 178991, 178054, 176432, 173935, 170763, 166973, 163005, 159770, 157474, 155163, 152089, 148731, 145829, 143305, 140848, 138754, 137370, 136462, 135862, 136030, 137205, 138592, 139205, 138985, 138497, 138086, 137884, 138039, 138328, 138065, 136917, 135271, 133440, 131261, 128900, 127167, 126393, 125814, 124741, 123557, 122923, 122779, 122926, 123765, 125611, 127839, 129556, 130593, 131185, 131291, 130947, 130709, 130963, 131339, 131441, 131489, 131598, 131193, 129917, 128430, 127457, 126791, 126085, 125835, 126425, 126903, 126007, 124018, 122387, 121797, 121737, 121756, 121936, 122143, 121933, 121318, 120795, 120568, 120502, 120834, 122017, 123743, 124922, 124856, 123875, 122701, 121774, 121278, 121271, 121546, 121777, 121937, 122286, 122936, 123685, 124256, 124493, 124394, 124131, 123937, 123855, 123799, 123916, 124447, 125111, 125181, 124474, 123729, 123658, 124161, 124918, 126127, 128050, 130326, 132364, 134037, 135398, 136161, 136113, 135730, 135691, 135984, 136016, 135376, 134018, 131995, 129502]
55400A29502k518k229j941j439l37Q99J289Q06M36N94N78q3q18r58n61O2P38J036
55382A25056M37o79j141m55O16J215J239P88j48j081j138k53O41R34R36Q39K52
55365A28058p70j396j302j196j456j355m16N43O08J08j76k62m67m47J80Q33O10
55348A21697l21r35p28j50J53o6o18r96p27K3N19L88O1N4L12N89Q94J229J372
55329A22750J269J132R27L32n06q93n74j10K9j7j13m96j066j170n64J80O52J117
55311A22879J550J167l25j807j999r86K17R73J167P25j68q09p19k56M3K28M61
55294A22341N17L58N76J455K268K230J561Q32J0r58j368p56j3l10j256j478o96
55277A25313Q4L33N66R57P56m23j761k283j980j424q80l51NK8q2j6K65O51J085
$$ y = [129502, 126984, 124755, 122814, 121375, 121038, 121937, 123226, 124032, 124468, 125062, 125640, 125557, 124739, 123781, 123220, 123282, 124020, 125056, 125493, 124814, 123673, 123218, 123834, 125049, 126288, 127076, 126928, 125847, 124709, 124456, 125097, 126031, 126967, 127806, 128058, 127288, 125892, 124590, 123394, 121938, 120583, 120167, 120710, 121318, 121426, 121250, 120988, 120521, 120074, 120254, 121087, 121697, 121376, 120441, 119713, 119563, 119716, 119650, 119032, 118036, 117309, 117332, 117851, 118239, 118300, 118354, 118666, 119255, 120149, 121378, 122750, 124019, 125151, 126078, 126410, 125904, 125011, 124437, 124327, 124356, 124339, 124226, 123730, 122664, 121494, 120930, 121110, 121762, 122879, 124429, 125596, 125271, 123464, 121465, 120479, 120696, 121669, 122836, 123561, 123393, 122584, 121865, 121609, 121652, 121880, 122341, 122858, 123216, 123792, 125247, 127515, 129745, 131306, 132138, 132148, 131190, 129822, 129066, 129053, 128743, 127487, 126009, 125313, 125397, 125730, 126296, 127253, 128009, 127586, 125825, 123542, 121562, 120138, 119258, 118907, 118912, 118940, 118858, 118842, 119107, 119758, 120843]
55258A20843J371J051l1j141j129K55J818K092R52l30o51j84L31P42J244J461
55242A28694P15p30j701j596j103j052j349j463j343j244j100o69p6K73J98j15
55226A16339l24j31M53R29P90K39J4L40O53N06K06K39N85R06R49N66r9l83K98
55207A23075J406J657P42j85k26M3k61p93n97L20J023R23K21o99j524j812j284
55190A22029l01M55O90N49J98k07l90k58j43l24n45l80J39O57R93J128J004O85
55172A25979M93O15Q44R26Q71P48N60M97P75J033N55n56j239r55n01o62q88k41
55154A28854R34J379O58m85j328j750j645p50O59J606J373L03o04p76n52o66j272
55137A25938j621j004J81Q21N57J92L85P62O97L24J21R1m7j75K2M60P05N33P3
$$ y = [120843, 122214, 123265, 123234, 122093, 120964, 121219, 123037, 125129, 126081, 125751, 125100, 124916, 125247, 125989, 127233, 128694, 129409, 128679, 126978, 125382, 124279, 123227, 121878, 120415, 119072, 117828, 116728, 116059, 115983, 116256, 116454, 116339, 116015, 115884, 116337, 117266, 118056, 118295, 118309, 118649, 119302, 119808, 120014, 120253, 120838, 121744, 122693, 123259, 123160, 122777, 123075, 124481, 126138, 126880, 126695, 126469, 126512, 126251, 125458, 124861, 125181, 126204, 127127, 127348, 126649, 125125, 123313, 122029, 121728, 122183, 122873, 123422, 123620, 123413, 123023, 122765, 122622, 122298, 121753, 121373, 121512, 122169, 123162, 124290, 125294, 125979, 126472, 127087, 127931, 128857, 129728, 130476, 131036, 131533, 132308, 133341, 133896, 133340, 132101, 131146, 130645, 129983, 129095, 128854, 129788, 131167, 131825, 131340, 130012, 128262, 126617, 125867, 126526, 128132, 129505, 129808, 129204, 128428, 127876, 127210, 125938, 124317, 123313, 123494, 124315, 124872, 125064, 125449, 126211, 126908, 127232, 127353, 127444, 127397, 127222, 127244, 127704, 128409, 128942, 129015]
55118A29015l55l57K06Q93J083Q15O76P73O35K65L27R48J345J104Q24Q63O19k35
55100A39444q52n62m9j76n48m33j63l64n37J23J081J145L95m5J65L43J97J28K03
55081A39495M8k73l31j85p7L67J492K421J908K82q70q78l94K26J282K323K125
55064A48961O85l66p1M86K5r55j180n96k02m32q13r69j089j378j619j386n33M96
55046A39064R02L65m96q49p20p34r36p26k4L95J8o24p24j42P23J493J888J728
55028A40601J170O52M30L82L50K45r0p12j256j277q61m61k24L7L29N19P29J086
55010A41649J228Q12L00M04Q90R18M30J99M59N84L39L31Q62J344J308J085J007
54993A54149P54L2p76j184j161q42k48L41M42J22K1L24N26M55O32J155J256N52
$$ y = [129015, 128660, 128303, 128509, 129402, 130485, 131300, 131976, 132749, 133384, 133649, 133976, 134924, 136269, 137373, 138197, 139060, 139679, 139444, 138592, 138030, 137981, 137805, 137257, 136824, 136661, 136297, 135760, 135883, 136964, 138109, 138504, 138459, 138624, 138967, 139164, 139292, 139495, 139543, 139270, 138939, 138754, 138677, 139044, 140536, 142957, 144865, 145147, 144277, 143399, 143005, 143231, 144513, 146836, 148961, 149646, 149280, 149209, 149695, 149720, 148765, 147585, 146989, 146787, 146355, 145542, 144573, 143484, 142106, 140487, 139101, 138568, 139064, 139966, 140331, 139835, 138986, 138266, 137532, 136596, 135870, 135846, 136241, 136259, 135635, 134911, 134769, 135492, 136985, 138873, 140601, 141771, 142423, 142853, 143235, 143585, 143830, 143740, 143028, 141772, 140495, 139634, 139173, 138949, 138986, 139315, 139834, 140563, 141649, 142877, 143689, 143989, 144393, 145283, 146201, 146631, 146830, 147289, 147873, 148212, 148543, 149405, 150749, 152057, 153142, 154149, 154903, 154935, 154159, 152975, 151814, 150972, 150724, 151065, 151507, 151629, 151650, 151974, 152500, 152955, 153587, 154742, 155998, 156550]
54975A56550j77k30j21n99j300j351q29m78m15j77J71K2n68p14L9J013J381J261
54957A53478J283J500J305M95k39k33J24q7q19r59n5P26J85j028j199Q6J478J746
54939A57787J029J04m97l65O98J993K262J274L02N40J796L221M444N403N874N908
54923A91773O154O969P759P799P151O192M831K977J190J3r32k361m172n660o569
54908B23114p134p305o803n877n196m913m499l620k587j818j395j209j188j180
54894A68390r61n00LM07P59J167J666K231K820L377L865M303M715N156N689O257
54878B09344O682O924P050O771N441L004N61q47j666l082n063o325o381o195o425
54863B09793o313n221m028l904m539m744m246l668l172k308j180o34j138k184
$$ y = [156550, 156373, 156143, 156022, 155423, 154123, 152772, 151943, 151465, 151050, 150873, 151044, 151066, 150498, 149784, 149823, 150836, 152217, 153478, 154761, 156261, 157566, 158061, 157822, 157589, 157713, 157626, 156807, 155848, 155793, 156519, 156704, 155676, 154477, 154563, 156041, 157787, 158816, 158920, 158423, 158058, 158756, 160749, 163011, 164285, 164587, 165127, 166923, 170144, 174588, 179991, 185865, 191773, 197927, 204896, 212655, 220454, 227605, 233797, 238628, 241605, 242795, 242808, 241876, 239515, 235343, 229683, 223114, 215980, 208675, 201872, 195995, 190799, 185886, 181387, 177767, 175180, 173362, 171967, 170758, 169570, 168390, 167429, 166929, 166932, 167339, 168098, 169265, 170931, 173162, 175982, 179359, 183224, 187527, 192242, 197398, 203087, 209344, 216026, 222950, 230000, 236771, 242212, 245216, 245777, 244930, 243264, 240182, 235119, 228794, 222413, 216218, 209793, 203480, 198259, 194231, 190327, 185788, 181044, 176798, 173130, 169958, 167650, 166470, 165836, 164698, 162514]
54849A62514k961l063k533j680q85k69L17P22L55r03k126k264j424n63k06j19
54833A44912l7K5J19L56O34Q08J008J225R72Rq39m98Q00J620J133O7m25j55J42
54814A51876j75j014j665j385j52J182J753J589J316J167Q39K62j89l29m01m49
54798A54225n3R73K000K142J220p6r24j006o25k88k01j65N8M39Q16J174J537J747
54780A62993J657J444J490J881K312K442K256K142K674M102N937P265P740P901
54766B14236Q274Q554Q069O731N026L288J554p6j559l205n205o913p387o678n864
54751B18845n613n401m522l222k326k161k409k700k873k790k419k023j825j507
54737A77054n38Q89J726J259J28l00N12J784K537K721L038L984N457P023Q161
$$ y = [162514, 159553, 156490, 153957, 152277, 151392, 151123, 151440, 152162, 152517, 151614, 149488, 147224, 145800, 145237, 145031, 144912, 144875, 144900, 145019, 145375, 146009, 146817, 147825, 149050, 150022, 150031, 149192, 148694, 149494, 151114, 152247, 152314, 151889, 151734, 151876, 151701, 150687, 149022, 147637, 147485, 148667, 150420, 152009, 153325, 154492, 155331, 155593, 155404, 155075, 154674, 154225, 154172, 155145, 157145, 159287, 160507, 160431, 159507, 158501, 157876, 157588, 157387, 157222, 157280, 157719, 158535, 159709, 161246, 162993, 164650, 166094, 167584, 169465, 171777, 174219, 176475, 178617, 181291, 185393, 191330, 198595, 206335, 214236, 222510, 231064, 239133, 245864, 250890, 254178, 255732, 255656, 254097, 250892, 245687, 238774, 231387, 224709, 218845, 213232, 207831, 203309, 200087, 197761, 195600, 193191, 190491, 187618, 184828, 182409, 180386, 178561, 177054, 176516, 177405, 179131, 180390, 180518, 180218, 180730, 182514, 185051, 187772, 190810, 194794, 200251, 207274, 215435]
54722B15435Q357P438N807M105K596J195j05j252k472m048n713o779o938o517
54708B11109n937n425n232n495n757n290m074k814j877j016k80k56r33j288p03
54693A64732R0J48k79m55m50p06q79l29N41O92O9l02K8K81k91j374k183k372k009
54674A54952j236l59J63J62n3j66j92k60l21k50j7L07N79O93P14P92P87L38m72
54655A56161r54p10k59k45m82m07j22j25l01qQ45J617J844J622J107L42l27m37
54637A59161j11M0j71l12j52pj29l32l85k55N2M21M06k99j109j063j39O63O80
54618A56959K97J14K05M47Q49J176R55K54j92n0O4m26j191j552j353p93K4Q39
54600A56626J073N57NR5N34O52N82R87J773J967J019m38j363j412j015o46m08
$$ y = [215435, 223792, 231230, 237037, 241142, 243738, 244933, 244828, 243576, 241104, 237056, 231343, 224564, 217626, 211109, 205172, 199747, 194515, 189020, 183263, 177973, 173899, 171085, 169208, 168192, 167912, 167656, 166723, 165435, 164732, 164822, 164970, 164691, 164236, 163786, 163080, 162201, 161872, 162413, 163105, 163174, 162872, 162900, 163181, 162890, 161516, 159333, 156961, 154952, 153716, 153357, 153520, 153682, 153629, 153463, 153271, 153011, 152690, 152440, 152423, 152730, 153309, 154002, 154716, 155508, 156295, 156633, 156161, 155207, 154497, 154238, 153993, 153511, 153104, 152982, 152857, 152556, 152548, 153393, 155010, 156854, 158476, 159583, 159925, 159598, 159161, 159050, 159090, 158919, 158607, 158455, 158448, 158319, 157987, 157602, 157347, 157399, 157820, 158226, 157927, 156818, 155755, 155616, 156279, 156959, 157256, 157370, 157575, 158022, 158871, 160047, 161002, 161256, 161064, 161014, 161078, 160652, 159461, 157909, 156556, 155763, 155787, 156626, 157699, 158256, 158261, 158356, 158890, 159542, 160124, 161111, 162884, 164851, 165870, 165432, 164069, 162657, 161642, 160996, 160588]
54583A60588k26j91m21o73m00N58J527J670J006L47J74J46j87p24j139j383j461
54566A59211j128k59P53J365J463J268R60O85O71R02Q69J83p16r65l52L72M55
54549A65737jl34k12J11L09M51P56J043Q70K33j83K07J098J662J536J060O38L38
54531A75319J43J04J55O8k25o45j159j680j810j246m39k35p04r96n60J23L96L65
54513A66974M74O78O04K52l1p1J5N8j48p53j482j664j013q6L77K36k49r22j520
54494A61729j384k30J111J462P93J84L60R88J515J910K207K012J023l12j170j219
54478A70979p61j64M33R49J261J333J326J401J531J546J292P96K65m0j0J73J20
54461A82430l70r67j006k36P24R61K81n97q80m79J20L90P5p14j442j506r28m07
$$ y = [160588, 160362, 160171, 159750, 159077, 158677, 159235, 160762, 162432, 163438, 163785, 163959, 164105, 163918, 163194, 162055, 160672, 159211, 158083, 157824, 158577, 159942, 161405, 162673, 163633, 164318, 164989, 165891, 166760, 166943, 166227, 165262, 164910, 165282, 165737, 165736, 165402, 165190, 165301, 165610, 166061, 166817, 167860, 168730, 168963, 168780, 168987, 170085, 171747, 173283, 174343, 174981, 175319, 175462, 175566, 175721, 175789, 175564, 174919, 173760, 172080, 170270, 169024, 168585, 168350, 167646, 166650, 166090, 166213, 166609, 166974, 167448, 168126, 168730, 168982, 168951, 168880, 168895, 168953, 168805, 168052, 166570, 164906, 163893, 163807, 164184, 164420, 164171, 163249, 161729, 160345, 160115, 161226, 162688, 163481, 163665, 164025, 165013, 166528, 168438, 170645, 172657, 173680, 173368, 172198, 170979, 170218, 170054, 170487, 171436, 172697, 174030, 175356, 176757, 178288, 179834, 181126, 181922, 182187, 182147, 182137, 182310, 182430, 182060, 181093, 180087, 179851, 180575, 181536, 181817, 181220, 180340, 179861, 179981, 180371, 180446, 179732, 178290, 176784, 175856, 175449]
54443A75449m31o49m66LK00Q0J66N89P49K06n94q68m95p3j06m61n73m9R41J766
54423A75384J899J414Q45N89O53R25J253J230L92r96j810j337k83J21j46J4J051
54406A81198K001J962J346J051J058P76L27M00R62J153O24Q8K17P44J077J110
54390A96094R92O58J08k73k37j43m20q88j114j110j101r19k54O17J000O76J51
54373A93837n7O9K81M05L89K99L71Q03J506K161K513K473K103J669J538J838K354
54356B14552K891L424L828L836L512L230K921J988L60j034j510j649k303l160
54342B30886l344k979k964l430l607l261l067l348l466k819j594l01P18J053M35
54327A98912n51q65m02j76p12j185p38J56M63J01j47R6M23L17k49r13j266j142
$$ y = [175449, 175018, 174369, 173903, 173906, 174106, 174186, 174352, 174941, 175690, 175896, 175302, 174434, 173939, 173866, 173760, 173299, 172726, 172677, 173618, 175384, 177283, 178697, 179542, 180131, 180784, 181709, 182962, 184192, 184584, 183588, 181778, 180441, 180158, 180279, 180133, 180147, 181198, 183199, 185161, 186507, 187558, 188616, 189392, 189719, 190119, 191081, 192234, 192858, 192946, 193163, 193907, 194984, 196094, 197086, 197744, 197852, 197579, 197342, 197199, 196779, 195891, 194777, 193667, 192566, 191647, 191393, 192010, 193010, 193686, 193837, 193780, 193849, 194130, 194535, 194924, 195223, 195594, 196397, 197903, 200064, 202577, 205050, 207153, 208822, 210360, 212198, 214552, 217443, 220867, 224695, 228531, 232043, 235273, 238194, 240182, 240542, 239508, 237998, 236349, 234046, 230886, 227542, 224563, 221599, 218169, 214562, 211301, 208234, 204886, 201420, 198601, 197007, 196706, 197424, 198477, 198912, 198361, 197496, 197094, 196918, 196206, 195021, 194283, 194439, 194902, 195003, 194856, 194952, 195375, 195692, 195443, 194530, 193264, 192122]
54309A92122p41l67j12k6l95j295k008j648m42L99K82j22j32l5k92n84l60J89
54291A84433M66L87L78O16Q39P13J92l57l17N17J352J095j67j085o33P66J996
54274A91191K413J912O39q18j588j387q01l52J11P38J197J292J288J214O55k05
54258A97499l55N26J320J073M76O50J345J568J312J338J600J322L89m98j030j524
54242B07011j975j877j120k56K16J79k38o49m40L79P88lj285j749j217n28j7O05
54224A97824J164J108O79P24J203J145K51n64o25l19j54kK99M44L19L11N73O30
54206B05010J19o88j372j710j446m62O11Q18J41m96o39p69j131j201p70m59n23
54189A95033k72O35J279Q57L9j59j5l99j035q54J25P05L61o9J26M51J82m74q39
$$ y = [192122, 191381, 191014, 190902, 190876, 190481, 189186, 187178, 185530, 185088, 185487, 185769, 185647, 185515, 185480, 185188, 184604, 184244, 184433, 184899, 185286, 185664, 186280, 187119, 187832, 188024, 187667, 187350, 187867, 189219, 190314, 190147, 189062, 188429, 189195, 191191, 193604, 195516, 196155, 195337, 193749, 192362, 191561, 191209, 191320, 192058, 193255, 194547, 195835, 197049, 197704, 197499, 197144, 197670, 198990, 200063, 200539, 201189, 202534, 204102, 205414, 206752, 208352, 209674, 210063, 209565, 208535, 207011, 205036, 203159, 202039, 201783, 201999, 202178, 201940, 201291, 200851, 201230, 202018, 202015, 200730, 198981, 197764, 197236, 197219, 197824, 198988, 200096, 200775, 201499, 202702, 203847, 204098, 203534, 202909, 202590, 202436, 202434, 202733, 203177, 203496, 203807, 204380, 205010, 205129, 204441, 203069, 201359, 199913, 199451, 200062, 200880, 201021, 200525, 199886, 199117, 197986, 196785, 196015, 195556, 195033, 194761, 195396, 196675, 197532, 197571, 197412, 197397, 196998, 195963, 195109, 195234, 195939, 196300, 196231, 196357, 196808, 196990, 196516, 195677]
54170A95677p98o69m63k3L35J14m17l55N11J170P14l49q37n82m45p42o86J63R37
54151A93255O55k96p38l19L39P71J018J019N00m05j155j487j551j409r84m77j42
54134A88594K81J263K552L301L082K192R88k48q92m26N49O99l08j334j371p03
54118A98219j10K29N28P89J038J514K129K333J943J577J703J913J626R64M01P0
54102B16866j8L67J165J663J247K09o88j103j149r75p85q14q55k20J314L040M161
54085B23425M646M835M836M861N479O798P894P852O875N656M214K183j76k205
54071B87173l732m841n184m488l435k977k990k695k177k299l050l373k836k296
54057B40800k378k468j840q81l83l47k20J81P15J433K313K842K576J906J653J972
$$ y = [195677, 194879, 194210, 193747, 193724, 194059, 194173, 193756, 193401, 193912, 195082, 195796, 195447, 194610, 194028, 193583, 192841, 192155, 192318, 193255, 193910, 193614, 192876, 192557, 192896, 193667, 194685, 195704, 196204, 195799, 194644, 193157, 191606, 190197, 189213, 188736, 188594, 188875, 190138, 192690, 195991, 199073, 201265, 202253, 202005, 201113, 200687, 201236, 201935, 201627, 200293, 198922, 198219, 198109, 198338, 198866, 199655, 200693, 202207, 204336, 206669, 208612, 210189, 211892, 213805, 215431, 216395, 216796, 216866, 216848, 217215, 218380, 220043, 221290, 221499, 220811, 219708, 218559, 217584, 216799, 215985, 215130, 214910, 216224, 219264, 223425, 228071, 232906, 237742, 242603, 248082, 254880, 262774, 270626, 277501, 283157, 287371, 289554, 289378, 287173, 283441, 278600, 273416, 268928, 265493, 262516, 259526, 256831, 254654, 252355, 249305, 245932, 243096, 240800, 238422, 235954, 234114, 233233, 232850, 232503, 232283, 232464, 233179, 234612, 236925, 239767, 242343, 244249, 245902, 247874]
54041B47874K249K036J643J719K625M185N845P034P622P936Q176Q083P480O881
54027C21388P010P781Q272P811O643N352M082K713J364K68o62j734k921l887m514
54012C58966m996n384n453n241n231n709o212o074n268m392l925l896m107m333
53998B88745m323l979l500l059k476j588p68n84r85j357j407j410j561j619j428
53983B58701j238j274j419j547j687j709j345p38m18m56k91K49M75p5p10n40J45
53966B46123L54l8j59M54J189J319R71P75J005J359J378R24L86L50R51J654J964
53949B60959K081K485L084L371L335L611M544N681O411O693O860P095P425Q012
53935C31647R048J0413J1757J2926J4094J5295J5892J4784J1403O502J653k094
$$ y = [247874, 250123, 252159, 253802, 255521, 258146, 262331, 268176, 275210, 282832, 290768, 298944, 307027, 314507, 321388, 328398, 336179, 344451, 352262, 358905, 364257, 368339, 371052, 372416, 372684, 372022, 370288, 367367, 363480, 358966, 353970, 348586, 343133, 337892, 332661, 326952, 320740, 314666, 309398, 305006, 301081, 297185, 293078, 288745, 284422, 280443, 276943, 273884, 271408, 269820, 269052, 268468, 267483, 266126, 264719, 263309, 261748, 260129, 258701, 257463, 256189, 254770, 253223, 251536, 249827, 248482, 247744, 247326, 246870, 246579, 246828, 247303, 247228, 246518, 245978, 246123, 246477, 246439, 246280, 246734, 247923, 249242, 250213, 250988, 251993, 253352, 254730, 255654, 256040, 256390, 257341, 258995, 260959, 263040, 265525, 268609, 271980, 275315, 278926, 283470, 289151, 295562, 302255, 309115, 316210, 323635, 331647, 340695, 351108, 362865, 375791, 389885, 405180, 421072, 435856, 447259, 453761, 455414, 453320]
53923D53320m767o679p617p279o112n007m226l247j766k98N49R14J457K543L966
53908D15751N286O096O047N003L274J530K83m40q96j205j338j419j725k288k735
53893D31224k838k940l493m290m667m484m384m918n931o969p799q195p797o670
53879C55849n579n147n076m755m330m395m842m831m028l077k665k750k987l312
53865B98075l675l699l163k522k388k647k649k221j968k381l102l394l052k479
53851B58735j974j402o48j9R3k20m67l50k7J77J05j62l71l18j59l38r77j502j326
53832B48850p18l98m43k35L89P86N64K65M65R01J039R96J178J428J279P89M64
53815B57599M05L24K49N79J388K208K660K814K881K931K984L029K908K508K080
$$ y = [453320, 448553, 441874, 434257, 426978, 420866, 415859, 411633, 408386, 406620, 406322, 406871, 407785, 409242, 411785, 415751, 421037, 427133, 433180, 438183, 441457, 442987, 443270, 442830, 441934, 440729, 439391, 437972, 436247, 433959, 431224, 428386, 425446, 421953, 417663, 412996, 408512, 404128, 399210, 393279, 386310, 378511, 370316, 362519, 355849, 350270, 345123, 340047, 335292, 330962, 326567, 321725, 316894, 312866, 309789, 307124, 304374, 301387, 298075, 294400, 290701, 287538, 285016, 282628, 279981, 277332, 275111, 273143, 270762, 267660, 264266, 261214, 258735, 256761, 255359, 254711, 254692, 254785, 254565, 254098, 253748, 253721, 253898, 254003, 253841, 253470, 253152, 252993, 252655, 251678, 250176, 248850, 248132, 247734, 247291, 247056, 247445, 248231, 248795, 249060, 249525, 250426, 251465, 252461, 253639, 255067, 256346, 257135, 257599, 258004, 258328, 258577, 259156, 260544, 262752, 265412, 268226, 271107, 274038, 277022, 280051, 282959, 285467, 287547]
53800B87547K083K693L716M838N684N836N270M566M305M290L892K998K154J776
53786C41648J717J665J485J140O64K33j06o78j755l021l929m457m921n203m903
53771C19579m263m075m460m546l708k481j813j904k314k658k798k636k292k140
53757B77491k290k303j822j265j329j995k480k187j334n84l65n70p19l81M09J087
53741B59363J088M18l40n93k55L18P53R12P57J99o62j249r07K56J322J595J404
53724B64379J507K065K638K901K833K356J456O12M28P65Q31K51m34m93K47J470
53708B83812K702L434L431L148L332M026M459M108L389K950K906L027L299L750
53694C31773M127M154L839L246K304J177M01K48L13J65J1K10M89K61m54j081j380
$$ y = [287547, 289630, 292323, 296039, 300877, 306561, 312397, 317667, 322233, 326538, 330828, 334720, 337718, 339872, 341648, 343365, 345030, 346515, 347655, 348319, 348552, 348446, 347768, 346013, 342992, 339063, 334606, 329685, 324482, 319579, 315316, 311241, 306781, 302235, 298527, 296046, 294233, 292329, 290015, 287357, 284559, 281923, 279631, 277491, 275201, 272898, 271076, 269811, 268482, 266487, 264007, 261820, 260486, 259902, 259537, 258967, 258248, 257867, 258276, 259363, 260451, 260869, 260529, 259936, 259681, 259999, 260752, 261664, 262421, 262620, 261958, 260709, 259802, 260058, 261380, 262975, 264379, 265886, 267951, 270589, 273490, 276323, 278679, 280135, 280747, 281175, 281940, 282771, 283022, 282588, 282095, 282342, 283812, 286514, 289948, 293379, 296527, 299859, 303885, 308344, 312452, 315841, 318791, 321697, 324724, 328023, 331773, 335900, 340054, 343893, 347139, 349443, 350620, 351021, 351269, 351582, 351747, 351758, 351968, 352457, 352718, 352264, 351183, 349803]
53677C49803j674k085k151j415j27R30J103L64o71j235j056o28n99j040j431j391
53661C36697j096r56j064j159r60m87kL09N05P42R98J101R82P65N51K89q3n04
53643C36628p97p18j7J265K599L320L193K481J531O23J18K63P87J183J443J994
53627C55896K750K940K284J603J683K054J771R97R12K107L857N122N539N286M609
53612C99410L878L612M039M873N721O481P160P600P650P323O621N526M393L982
53598D78269M633N567N587M373K628J015m94j925k699k353j473j201j834k516
53584D87577k511k126k058k403k733k791k592k086j345q78j140j776j947j457
53570D59734j007j179j739k184k422k553k343j502k44Q16J279J227R38N45op01
$$ y = [349803, 348129, 346044, 343893, 342478, 342351, 343281, 344384, 344748, 344077, 342842, 341786, 341158, 340559, 339519, 338088, 336697, 335601, 334645, 333581, 332422, 331462, 330975, 330973, 331282, 331787, 332529, 333527, 334628, 335610, 336375, 336926, 337215, 337132, 336628, 335831, 335113, 335096, 336361, 338960, 342280, 345473, 347954, 349485, 350108, 350226, 350489, 351276, 352459, 353902, 355896, 358646, 361586, 363870, 365473, 367156, 369210, 370981, 371978, 372890, 374997, 378854, 383976, 389515, 394801, 399410, 403288, 406900, 410939, 415812, 421533, 428014, 435174, 442774, 450424, 457747, 464368, 469894, 474287, 478269, 482902, 488469, 494056, 498429, 501057, 502072, 501578, 499653, 496954, 494601, 493128, 491927, 490093, 487577, 485066, 482940, 480882, 478479, 475746, 472955, 470363, 468277, 466932, 466054, 464914, 463138, 461191, 459734, 458727, 457548, 455809, 453625, 451203, 448650, 446307, 444805, 444561, 445377, 446656, 447883, 448821, 449366, 449360, 448659]
53554D48659j143p09O88K100K318J308L51M70J251J667J562J646K287L041L441
53539D68937L548L519L220K672K432L020M145N013N389N838O784P836Q502R084
53525E39939J0204J1575J2105J1425J0575J0685J1633J2564J3204J3931J4872
53514F72712J5780J6663J7731J8856J9751K0612K1814K3095K3880K4292K4893
53503I00079K5496K5335K4546K4207K4495K4192K2651K1029K0618K0967K0833
53492A154448K0142J9768J9984K0266K0315K0171J9680J8881J8534J9211K0148
53481A371548K0207J9591J9376J9547J8964J7328J5714J4805J3945J2447J0622
53470A554094Q833O630L624M94j817l295m615o207q153j0444j2725j4217j4569
$$ y = [448659, 447516, 446807, 447495, 449595, 451913, 453221, 453572, 454042, 455293, 456960, 458522, 460168, 462455, 465496, 468937, 472485, 476004, 479224, 481896, 484328, 487348, 491493, 496506, 501895, 507733, 514517, 522353, 530855, 539939, 550143, 561718, 573823, 585248, 595823, 606508, 618141, 630705, 643909, 657840, 672712, 688492, 705155, 722886, 741742, 761493, 782105, 803919, 827014, 850894, 875186, 900079, 925575, 950910, 975456, 999663, 1024158, 1048350, 1071001, 1092030, 1112648, 1133615, 1154448, 1174590, 1194358, 1214342, 1234608, 1254923, 1275094, 1294774, 1313655, 1332189, 1351400, 1371548, 1391755, 1411346, 1430722, 1450269, 1469233, 1486561, 1502275, 1517080, 1531025, 1543472, 1554094, 1562927, 1569557, 1573181, 1573675, 1571858, 1568563, 1563948, 1557741, 1549588, 1539144, 1526419, 1512202, 1497633]
53457A497633j4389j4425j4688j4911j5304j6122j6958j7361j7803j9064k0805
53446A315803k1738k1309k0332j9705j9309j8542j7321j5943j4341j2103r191
53435A125969o255m182l362l360l233k298o63J034K338L220L795M203M842O223
53421A128271Q291J0157J0962J0880J0983J2181J4534J7411K0020K1843K2975
53410A288508K4063K5607K7326K8542K9171K9856L1046L2488L3883L5416L7251
53399A623157L9011M0418M2000M4416M7348M9858N1698N3337N4736N5178N4647
53388B155804N4264N4761N5432N5348N4855N4807N4868N3808N1321M8402M5780
53377B739450M2949L9217L4865L0664K6704K2407J7502J2456P843L546j185o875
$$ y = [1497633, 1483244, 1468819, 1454131, 1439220, 1423916, 1407794, 1390836, 1373475, 1355672, 1336608, 1315803, 1294065, 1272756, 1252424, 1232719, 1213410, 1194868, 1177547, 1161604, 1147263, 1135160, 1125969, 1119714, 1115532, 1112170, 1108810, 1105577, 1103279, 1102616, 1103650, 1105988, 1109208, 1113003, 1117206, 1122048, 1128271, 1136562, 1146719, 1157681, 1168561, 1179544, 1191725, 1206259, 1223670, 1243690, 1265533, 1288508, 1312571, 1338178, 1365504, 1394046, 1423217, 1453073, 1484119, 1516607, 1550490, 1585906, 1623157, 1662168, 1702586, 1744586, 1789002, 1836350, 1886208, 1937906, 1991243, 2045979, 2101157, 2155804, 2210068, 2264829, 2320261, 2375609, 2430464, 2485271, 2540139, 2593947, 2645268, 2693670, 2739450, 2782399, 2821616, 2856481, 2887145, 2913849, 2936256, 2953758, 2966214, 2974057, 2977603, 2976418, 2969543]
53365B969543j3201j9319k4843l0074l5217l9731m2987m5296m7657n0438n2880
53354B567900n4067n4003n3405n2793n2062n0916m9382m7817m6391m4778m2600
53343B019686m0201l8611l8409l8961l9045l8056l6219l3950l1568k9416k7634
53332A627616k5796k3402k0704j8464j6861j5355j3782j2791j2843j3477j3999
53321A440142j4379j4844j5174j4999j4476j3989j3427j2438j1182j0157r253
53310A295824p785n592l421j949r29K19J480K469L186M016N060O170P610R936
53296A316294J3008J5702J7171J7966J9290K1424K3537K4919K5719K6300K6648
53285A547978K6661K6403K5702K4061K1437J8671J6593J5080J3474J1503R172
$$ y = [2969543, 2956342, 2937023, 2912180, 2882106, 2846889, 2807158, 2764171, 2718875, 2671218, 2620780, 2567900, 2513833, 2459830, 2406425, 2353632, 2301570, 2250654, 2201272, 2153455, 2107064, 2062286, 2019686, 1979485, 1940874, 1902465, 1863504, 1824459, 1786403, 1750184, 1716234, 1684666, 1655250, 1627616, 1601820, 1578418, 1557714, 1539250, 1522389, 1507034, 1493252, 1480461, 1467618, 1454141, 1440142, 1425763, 1410919, 1395745, 1380746, 1366270, 1352281, 1338854, 1326416, 1315234, 1305077, 1295824, 1288039, 1282447, 1279026, 1277077, 1276148, 1276367, 1277847, 1280316, 1283502, 1287518, 1292578, 1298748, 1306358, 1316294, 1329302, 1345004, 1362175, 1380141, 1399431, 1420855, 1444392, 1469311, 1495030, 1521330, 1547978, 1574639, 1601042, 1626744, 1650805, 1672242, 1690913, 1707506, 1722586, 1736060, 1747563, 1756735]
53274A756735O194K361j632m603o283p629r671j2498j5499j7976j9531k0400k1504
53261A628064k3616k6332k8438k9291k9367k9341k9404k9608l0084l0507l0116
53250A311960k8773k7450k7046k7291k7288k6731k5924k5108k4411k4127k4279
53239A023532k4168k3049k1207j9623j8699j7981j7113j6319j5716j4891j3540
53228H21226j2057j1043j0523j0087r580r310r558j0112j0477j0396j0223j0659
53216F97201j2042j3839j5028j4969j3947j2817j2213j2149j2242j2111j1580
53205E54264j0589r273q099p713q253q977q936q104p417p613q394q936q866q400
53191D34694p871p453p217p006o427n373m402m211m719n082m668l665k687k153
$$ y = [1756735, 1762929, 1765290, 1763658, 1759055, 1752772, 1745143, 1735472, 1722974, 1707475, 1689499, 1669968, 1649568, 1628064, 1604448, 1578116, 1549678, 1520387, 1491020, 1461679, 1432275, 1402667, 1372583, 1342076, 1311960, 1283187, 1255737, 1228691, 1201400, 1174112, 1147381, 1121457, 1096349, 1071938, 1047811, 1023532, 999364, 976315, 955108, 935485, 916786, 898805, 881692, 865373, 849657, 834766, 821226, 809169, 798126, 787603, 777516, 767936, 758626, 749068, 738956, 728479, 718083, 707860, 697201, 685159, 671320, 656292, 641323, 627376, 614559, 602346, 590197, 577955, 565844, 554264, 543675, 534402, 526303, 518590, 510337, 501360, 492424, 484320, 476903, 469290, 460896, 451960, 443094, 434694, 426823, 419370, 412153, 405147, 398720, 393347, 388945, 384734, 380015, 374933, 370265, 366600, 363913, 361760]
53177C61760k163k589l107l349l236k982k678k202j644j462j873k357k211j432
53163C28475o90m41n30p02j046j620k090k026j465p78j93K25K68k38r12j000l16
53146C14921L90L16m27j079j185r18n73k76j29k38m13k44L77J027J250J084R15
53129C14798R37R98Q44M13j49o24q21o12M2R34J550J407N80k11k77M18J400K272
53111C23899K843K926K353J260K7j082j996k563k598k162j549r55m40k26n96j439
53095C17702k177k379k159j870j711j706j778j706j283o37j55O3K86N60M54l01
53079C01203j226j554j114l97R3K55J81j00n21q35o98k1Q06J111N27o41j721k241
53061B93107k135j504n50L56Q77R99Q73M53k99r50q91j07Q15J492K005K241J722
$$ y = [361760, 359597, 357008, 353901, 350552, 347316, 344334, 341656, 339454, 337810, 336348, 334475, 332118, 329907, 328475, 327785, 327344, 326814, 326112, 325066, 323446, 321356, 319330, 317865, 317087, 316894, 317119, 317387, 317149, 316237, 315237, 314921, 315311, 315627, 315200, 314121, 312936, 312018, 311445, 311169, 311040, 310802, 310389, 310145, 310522, 311549, 312799, 313883, 314798, 315735, 316733, 317577, 317990, 317841, 317217, 316396, 315784, 315826, 316760, 318310, 319717, 320297, 320086, 319809, 320227, 321627, 323899, 326742, 329668, 332021, 333281, 333308, 332226, 330230, 327667, 325069, 322907, 321358, 320403, 319963, 319737, 319141, 317702, 315525, 313146, 310987, 309117, 307406, 305700, 303922, 302216, 300933, 300296, 300141, 300204, 300490, 301050, 301504, 301203, 299977, 298423, 297309, 296912, 297005, 297260, 297441, 297341, 296820, 295985, 295287, 295266, 296072, 297183, 297710, 297069, 295348, 293107, 290972, 289468, 288918, 289274, 290151, 291150, 292023, 292476, 292177, 291227, 290336, 290229, 291044, 292536, 294541, 296782, 298504]
53044B98504M23r01j542j568j344r29l66n5j31k6O70J250O97p44j656j164J25
53027B91243J078J280J119J081J262J363J033L03k89k67K21O65Q23P61M31k08
53011C01899o98m18M87J078P99K05J08N14Q27Q24Q37J088J347J376J209Q83K49
52994C12614o57j293j103k48M98P06P68J232J953K336K219K089K349K729K618
52979C28810J822Q33L92P40J288J189L87k30K5O90Q98P10Q94J521J771J309Q62
52962C43911J005J241Q30j35j127j958k500k341j537j101j761k669k426j145k78
52947C28009n01r29p08k55m40j310k181k475j984q15M93J145Q32M7n49q27r67
52930C16585r13m41L55R71R17J32q93j458j237n69m6J16P1p0l08m95m72m14o29
$$ y = [298504, 298927, 298026, 296484, 294916, 293572, 292643, 292277, 292222, 292091, 292065, 292735, 293985, 294682, 293938, 292282, 291118, 291243, 292321, 293601, 294720, 295801, 297063, 298426, 299459, 299762, 299473, 299206, 299427, 300092, 300915, 301676, 302107, 301899, 301201, 300783, 301270, 302348, 303147, 303352, 303460, 303974, 304801, 305625, 306462, 307550, 308897, 310273, 311482, 312365, 312614, 311957, 310664, 309561, 309313, 309811, 310517, 311285, 312517, 314470, 316806, 319025, 321114, 323463, 326192, 328810, 330632, 331465, 331857, 332597, 333885, 335074, 335461, 335231, 335256, 335946, 336844, 337554, 338448, 339969, 341740, 343049, 343911, 344916, 346157, 346987, 346852, 345725, 343767, 341267, 338926, 337389, 336288, 334527, 331858, 329432, 328287, 328009, 327508, 326579, 325871, 325616, 325176, 323866, 321685, 319210, 317226, 316411, 316904, 318049, 318881, 318928, 318379, 317552, 316585, 315672, 315231, 315586, 316557, 317474, 317606, 316713, 315255, 314018, 313449, 313403, 313519, 313590, 313520, 313212, 312717, 312245, 311831, 311202]
52911C11202r38p71PQ07J011O12Jn35q78r58q56p71p04l84L32J142J581J424P86
52892C12110J0m28k44K55L55k80j122j364q35j92j23n20o17L6R48J253Q66N38
52874C10646P21R67P76M64O09J099J498J981K958L999M124L278K496K405K388
52859C40409J666L95p57j489j807j726j556j883k725l213k720j867j740k473l301
52844C15213l703l788l671l216k481j858j615j603j514j151n04J72M63K58J8K57
52828B91277Q10J008N36k39p68q80p64o71p07p72o57l22M8K81M67P76J181J524
52810B92128J722J735J481J003N11O9n73j565k534k877k491j854j449j314j212
52795B82780j008q39r79j457j784j340j60R08J118O64K52J24Pj01K26J099J924
$$ y = [311202, 310264, 309493, 309500, 310307, 311318, 311930, 311931, 311396, 310518, 309560, 308704, 307933, 307229, 306845, 307177, 308319, 309900, 311324, 312110, 312120, 311692, 311448, 311703, 312058, 311778, 310656, 309292, 308457, 308265, 308142, 307622, 307005, 307041, 307989, 309242, 310108, 310646, 311367, 312334, 313110, 313574, 314183, 315282, 316780, 318761, 321719, 325718, 329842, 333120, 335616, 338021, 340409, 342075, 342470, 341713, 340224, 338417, 336691, 335135, 333252, 330527, 327314, 324594, 322727, 320987, 318514, 315213, 311510, 307722, 304051, 300835, 298354, 296496, 294881, 293278, 291764, 290613, 290109, 290281, 290744, 291002, 291020, 291277, 292087, 293095, 293631, 293392, 292624, 291744, 290980, 290309, 289602, 288830, 288173, 287851, 287899, 288180, 288647, 289423, 290604, 292128, 293850, 295585, 297066, 298069, 298580, 298649, 298076, 296511, 293977, 291100, 288609, 286755, 285306, 283992, 282780, 281772, 280933, 279954, 278497, 276713, 275373, 275213, 276121, 277239, 277903, 278155, 278279, 278286, 278185, 278411, 279510, 281434]
52778B81434K122J908J968K525K974K590J323j40j044j151o95kO10O75j74j612
52762B93311k611k430j434o23m61n46l41K17Q39J248J219O75r8n35l44K20Q03
52745B89109J441K260K901K759J849J012R77J509J870J845J759J671J240N92N83
52730C13377J611K749K783J799R22O18K91m11r12q12p35j372k326k707k408j960
52714C10507j484o86J83L58l04r51q12q5M94N58L02J17K53N76N66j75j292j827
52696C06298j201J79J362J701J253N82K43K14p5q22j208k72J539K570J871L06
52680C14540p19q54o63m86k60k5J46M45Q43O61n01j644j340K22J259Q41L1O8N26
52661C13090L25l10k60N10Q35L06M0J028K655L554L318K622K037J464O46k93r60
$$ y = [281434, 283556, 285464, 287432, 289957, 292931, 295521, 296844, 296704, 295660, 294509, 293814, 293812, 294422, 295097, 294923, 293311, 290700, 288270, 286836, 286213, 285752, 285206, 284865, 285082, 285921, 287169, 288388, 289063, 288965, 288430, 288086, 288306, 289109, 290550, 292810, 295711, 298470, 300319, 301331, 302308, 303817, 305687, 307532, 309291, 310962, 312202, 312794, 313377, 314988, 317737, 320520, 322319, 323241, 323859, 324150, 323739, 322827, 322015, 321280, 319908, 317582, 314875, 312467, 310507, 309023, 308337, 308520, 308878, 308574, 307623, 306811, 306726, 307220, 307778, 308080, 308197, 308450, 309026, 309592, 309417, 308125, 306298, 305097, 305276, 306638, 308339, 309592, 310174, 310417, 310631, 310556, 309734, 308526, 308254, 309793, 312363, 314234, 314540, 313821, 312967, 312304, 311818, 311558, 311533, 311679, 312124, 312967, 313628, 313127, 311483, 310143, 310365, 311624, 312465, 312496, 312564, 313090, 313415, 313105, 312845, 313355, 314190, 314496, 314536, 315564, 318219, 321773, 325091, 327713, 329750, 331214, 331860, 331567, 330607]
52644C30607j064o66j82q9m47q04p57m07j41q4o0J22M99J010J444J478J016M03
52626C31878K5j78n56j129j510j426j049o91n05n27p48r81q65k48N14Q35N10r6
52608C23253n14p00r23j185j086m11L63N55J66j33P5M53N28L40J95J09j15m18
52590C20552m65J9J000K068K552K050J059O64J245J920J701P94J83K24L70J61
52574C36097k16m34m96n85q02j143j471j548j355j220j281j116m34K19R4o06r22
52557C22781n02L9J09j89m86o15n18k62j80m81o89k00O30P55j04j087j432j277
52539C16292r60l95M34J087J241J101R79J001J367K146K658K005N63j66L97J055
52523C30805P46J52M74J503K083J853J436J307J503K099L076M001M603N253O118
$$ y = [330607, 329543, 328877, 328695, 328606, 328159, 327355, 326598, 326191, 326050, 325966, 325906, 326028, 326527, 327537, 328981, 330459, 331475, 331878, 331903, 331725, 331169, 330040, 328530, 327104, 326055, 325364, 324859, 324332, 323584, 322603, 321738, 321490, 322004, 322839, 323349, 323253, 322739, 322039, 321116, 319931, 318845, 318434, 318797, 319352, 319518, 319385, 319460, 319913, 320441, 320781, 320976, 321085, 320970, 320552, 320087, 320106, 321106, 323174, 325726, 327776, 328835, 329499, 330744, 332664, 334365, 335159, 335342, 335566, 335936, 336097, 335881, 335447, 334951, 334366, 333564, 332421, 330950, 329402, 328047, 326827, 325546, 324430, 323996, 324215, 324309, 323703, 322781, 322279, 322318, 322427, 322238, 321752, 321137, 320619, 320357, 320177, 319696, 319007, 318807, 319437, 320192, 320088, 319001, 317569, 316292, 315332, 314937, 315371, 316458, 317699, 318800, 319779, 320780, 322147, 324293, 326951, 328956, 329519, 329353, 329750, 330805, 331551, 331703, 332177, 333680, 335763, 337616, 339052, 340359, 341862, 343961, 347037, 351038, 355641, 360894, 367012]
52508C67012O351N105K880Q64o48k083l241l503l194l413m323m841m343l533l218
52493C45872l146k618j575n57n2k40q98j387j167m99j41k97l90l0M64O48N98O78
52475C35263J093J766K291K060R44j41L8J601L429M483M716M543M131L498K799
52460C72514K168J608J178Q96L56r87l018m883n906o112n785n014l973l035k361
52445C37646j714r66m42m83r44j298j072j94Q56J257O43m30j105j217j201j277
52429C28059j292j290j399j325o24M23J090J327J740K374K520J938J265Q84M20
52414C36110j22J23J462K769L028K955L925N872P448Q097Q669R842J0912J0628
52400D11718Q668N863L199R14j394l875n871o620o364o236o780p232o647n167
$$ y = [367012, 373363, 378468, 381348, 382212, 381564, 379481, 376240, 372737, 369543, 366130, 361807, 356966, 352623, 349090, 345872, 342726, 340108, 338533, 337976, 337924, 337684, 336786, 335399, 334232, 333733, 333592, 333295, 332905, 332875, 333339, 333987, 334585, 335263, 336356, 338122, 340413, 342473, 343417, 343276, 343314, 344915, 348344, 352827, 357543, 362086, 366217, 369715, 372514, 374682, 376290, 377468, 378364, 378720, 377733, 374715, 369832, 363926, 357814, 352029, 347015, 343042, 340007, 337646, 335932, 334966, 334524, 334041, 333097, 331799, 330727, 330533, 331389, 332646, 333289, 332859, 331754, 330537, 329336, 328059, 326767, 325477, 324078, 322753, 322129, 322552, 323642, 324969, 326709, 329083, 331603, 333541, 334806, 335690, 336110, 335988, 336111, 337573, 340342, 343370, 346325, 350250, 356122, 363570, 371667, 380336, 390178, 401090, 411718, 420386, 426249, 429448, 430362, 428968, 425093, 419222, 412602, 406238, 400002, 393222, 385990, 379343, 374176]
52386C74176l648k461j322j36P56J109J114J124J380J888K381K503K340K531L551
52371C87286N013O014N990N057L703K459J676J285Q73K16m24p39q18r48j182j348
52355D14113j222o51K44R04Q19L66N17J402J888J111k13o99o3Q99J645K293K812
52338D26165K824K409K336L150M470N527O057O451P186Q326R510J0440J1276J2377
52324E18504J3596J4250J3987J3282J2757J2451J2156J2009J2196J2446J2444
52313F60078J2551J3420J5037J6722J7984J8804J9237J9366J9635K0545K1988
52302H55367K3339K4240K4739K4757K4052K2783K1452K0153J8451J6169J3693
52291A089195J1325Q939O534M530L137J870J66j817l372m031l950l670l735m333
$$ y = [374176, 370528, 368067, 366745, 366609, 367365, 368474, 369588, 370712, 372092, 373980, 376361, 378864, 381204, 383735, 387286, 392299, 398313, 404303, 409360, 413063, 415522, 417198, 418483, 419356, 419572, 419148, 418409, 417591, 416643, 415461, 414113, 412891, 412240, 412484, 413388, 414207, 414573, 415090, 416492, 418380, 419491, 419278, 418579, 418516, 419415, 421060, 423353, 426165, 428989, 431398, 433734, 436884, 441354, 446881, 452938, 459389, 466575, 474901, 484411, 494851, 506127, 518504, 532100, 546350, 560337, 573619, 586376, 598827, 610983, 622992, 635188, 647634, 660078, 672629, 686049, 701086, 717808, 735792, 754596, 773833, 793199, 812834, 833379, 855367, 878706, 902946, 927685, 952442, 976494, 999277, 1020729, 1040882, 1059333, 1075502, 1089195, 1100520, 1109459, 1115993, 1120523, 1123660, 1125530, 1125696, 1123879, 1120507, 1116476, 1112526, 1108856, 1105121, 1100788]
52277A100788n086n343m835l917l120k603k150j478m97O26J581K239K823L541
52263A082569M213M617N114O401Q589J0940J2746J4034J5227J6467J7528J8138
52251A216583J8117J7467J6506J5667J4969J3912J2120R841P603N629L874K370
52239A354658J122j86j940m019n814o935p593q233q976r638j0151j0722j1470
52226A270103j2078j2017j1171j0204j0096j1197j2722j3348j2367j0309q360
52215A146234p205o528n647m395l194k397j861j204k75O90J272J213O99L39O47
52200A118388J625K977M538O178P430P816P574P441P638P617P018O245N723N150
52186A203358L992K249L05j573l152m182m907o110p956r376r383q562q231q429
$$ y = [1100788, 1095702, 1090359, 1085524, 1081607, 1078487, 1075884, 1073734, 1072256, 1071759, 1072385, 1073966, 1076205, 1079028, 1082569, 1086782, 1091399, 1096513, 1102914, 1111503, 1122443, 1135189, 1149223, 1164450, 1180917, 1198445, 1216583, 1234700, 1252167, 1268673, 1284340, 1299309, 1313221, 1325341, 1335182, 1342785, 1348414, 1352288, 1354658, 1355780, 1355594, 1353654, 1349635, 1343821, 1336886, 1329293, 1321060, 1312084, 1302446, 1292295, 1281573, 1270103, 1258025, 1246008, 1234837, 1224633, 1214537, 1203340, 1190618, 1177270, 1164903, 1154594, 1146234, 1139029, 1132501, 1126854, 1122459, 1119265, 1116868, 1115007, 1113803, 1113528, 1114218, 1115490, 1116703, 1117402, 1117741, 1118388, 1120013, 1122990, 1127528, 1133706, 1141136, 1148952, 1156526, 1163967, 1171605, 1179222, 1186240, 1192485, 1198208, 1203358, 1207350, 1209599, 1209904, 1208331, 1205179, 1200997, 1196090, 1189980, 1182024, 1172648, 1163265, 1154703, 1146472, 1138043]
52172A138043p922o200m329l495l631l868l633k825j512J00J667K985L967M317
52158A113664L719K437J229M79r5p26j202j307j130o36L99J766K729K914K732
52143A126972K610K362J826J470J736K130J772O61k54k24N64J467K225L210M981
52128A153508P610J0361J2300J3316J4249J5815J7714J9112J9778K0277K1141
52117A325181K2182K2761K2526K1853K1462K1575K1609K0986K0031J9588J9804
52106A559558K0040K0049K0438K1559K2642K2709K1817K0708J9612J8134J6024
52095A783290J3287R735N227L96l614o317q269j0148j1999j3565j4794j5667j5980
52082A711582j5632j4969j4482j4341j4361j4247j3758j2776j1501j0359r515
$$ y = [1138043, 1130121, 1123921, 1119592, 1116097, 1112466, 1108598, 1104965, 1102140, 1100628, 1100728, 1102395, 1105380, 1109347, 1113664, 1117383, 1119820, 1121049, 1121528, 1121433, 1120707, 1119505, 1118198, 1117068, 1116432, 1116831, 1118597, 1121326, 1124240, 1126972, 1129582, 1131944, 1133770, 1135240, 1136976, 1139106, 1140878, 1141539, 1141285, 1141061, 1141625, 1143092, 1145317, 1148527, 1153508, 1161118, 1171479, 1183779, 1197095, 1211344, 1227159, 1244873, 1263985, 1283763, 1304040, 1325181, 1347363, 1370124, 1392650, 1414503, 1435965, 1457540, 1479149, 1500135, 1520166, 1539754, 1559558, 1579598, 1599647, 1620085, 1641644, 1664286, 1686995, 1708812, 1729520, 1749132, 1767266, 1783290, 1796577, 1806312, 1811539, 1811935, 1808321, 1802004, 1793735, 1783587, 1771588, 1758023, 1743229, 1727562, 1711582, 1695950, 1680981, 1666499, 1652158, 1637797, 1623550, 1609792, 1597016, 1585515, 1575156, 1565641]
52071A565641q579p057n000k977j390p6J347K981M687O411Q203R951J1439J2745
52057A598326J4233J6021J7630J8451J8364J7634J6381J4506J2051R290O454L665
52045A763006J126q97k347l354m043m654n624p086q408q822q547q651r683j1084
52031A680932j2137j2828j3511j4317j5267j6395j7356j7492j6728j5853j5486
52020A513562j5289j4725j3945j3226j2181j0412q531p494p241o889o228o042
52008A391359o950q793j1176j3772j5998j7274j7805j8385j9252j9869j9969j9928
51996A202188j9866j9285j8030j6824j6351j6498j7004j8065j9601k0658k0427
51985I99579j9433j8834j8890j9033j9154j9724k0678k1091k0341j8854j7349
$$ y = [1565641, 1557062, 1550005, 1545005, 1542028, 1540638, 1540562, 1541909, 1544890, 1549577, 1555988, 1564191, 1574142, 1585581, 1598326, 1612559, 1628580, 1646210, 1664661, 1683025, 1700659, 1717040, 1731546, 1743597, 1752887, 1759341, 1763006, 1764132, 1763235, 1760888, 1757534, 1753491, 1748837, 1743213, 1736127, 1727719, 1718897, 1710350, 1701699, 1692016, 1680932, 1668795, 1655967, 1642456, 1628139, 1612872, 1596477, 1579121, 1561629, 1544901, 1529048, 1513562, 1498273, 1483548, 1469603, 1456377, 1444196, 1433784, 1425253, 1417759, 1410518, 1403629, 1397401, 1391359, 1384409, 1375616, 1364440, 1350668, 1334670, 1317396, 1299591, 1281206, 1261954, 1242085, 1222116, 1202188, 1182322, 1163037, 1145007, 1128183, 1111832, 1095334, 1078330, 1060265, 1040664, 1020006, 999579, 980146, 961312, 942422, 923389, 904235, 884511, 863833, 842742, 822401, 803547, 786198]
51974G86198j5941j4367j2568j0603q319n555k532L41K926N320P382Q651Q768
51961G49701P822O105L770Q75k253m914o522p164p497q026q606q726q081o751
51947F99733m961k932p95J558M453P883J1120J3268J4247J4738J5070J4727J3285
51934H01394J1345R921R075P794N254J727j857m874p316r502j1694j3755j5114
51921G82398j5288j4451j3189j1623r309o174k926r7K743O059R036J0121Q899
51908G46199O596M548K939J271n89k328l702m614n149n838p499j0234j2950j4458
51894F94192j4851j5215j6173j7192j7416j6549j4843j2700j0409q081n651l084
51882E42028n50J757L840N760P467R018J0656J2322J3346J3154J2003J0450Q309
$$ y = [786198, 770257, 755890, 743322, 732719, 724400, 718845, 716313, 716654, 719580, 724900, 732282, 740933, 749701, 757523, 763628, 767398, 768273, 766020, 761106, 754584, 747420, 739923, 731897, 723291, 714565, 706484, 699733, 694772, 691840, 691045, 692603, 697056, 704939, 716059, 729327, 743574, 758312, 773382, 788109, 801394, 812739, 822660, 831735, 839529, 844783, 846510, 844653, 839779, 832463, 822961, 811267, 797512, 782398, 767110, 752659, 739470, 727847, 718538, 712364, 709438, 709341, 712084, 718143, 727179, 737300, 746199, 752795, 757343, 760282, 761553, 760964, 758636, 754934, 750320, 745171, 739333, 731834, 721600, 708650, 694192, 679341, 664126, 647953, 630761, 613345, 596796, 581953, 569253, 558844, 550763, 545112, 542028, 541478, 543235, 547075, 552835, 560302, 569320, 579976, 592298, 605644, 618798, 630801, 641251, 649560]
51869F49560M993Q76k612m536n329n762n804n116m029l247k876k459j777j074
51855F10808o19m92o73q74o24mn4j629m047n662n880n806o625q114r187r196q229
51838E43093o577m642l035k142j647r76p0P16J348K049K580K268R73n03j355j645
51822E30435j940k403k771k896k742k004l82J649K992L124K641K267J750L85j594
51807E28511k954k895j981j328j308j477j450j234q25o7R09J509J253L28o69j318
51791E15004j527j299o98k1L25K36l4k70n62j006j382j433j336j575k164k267
51775D99991r52J712M589O596P677Q510R516J0511J1179J1411J1086R956P975
51762E99757N460K725q6k611m156m463m296m695n761o769p358p852q378q439p741
$$ y = [649560, 654553, 655429, 652817, 648281, 642952, 637190, 631386, 626270, 622241, 618994, 616118, 613659, 611882, 610808, 610189, 609697, 609024, 608150, 607526, 607522, 607468, 605839, 601792, 596130, 590250, 584444, 577819, 569705, 560518, 551322, 543093, 536516, 531874, 528839, 526697, 525050, 524074, 524004, 524720, 526068, 528117, 530697, 532965, 533938, 533435, 532080, 530435, 528495, 526092, 523321, 520425, 517683, 515679, 515297, 516946, 519938, 523062, 525703, 527970, 529720, 530105, 528511, 525557, 522662, 520681, 519353, 518045, 516568, 515118, 513884, 513059, 512992, 513901, 515410, 516663, 516991, 516322, 515004, 513477, 512178, 511480, 511459, 511784, 512020, 511986, 511716, 511154, 510148, 508766, 507333, 505997, 504422, 502258, 499991, 499039, 500751, 505340, 511936, 519613, 528123, 537639, 548150, 559329, 570740, 581826, 591782, 599757, 605217, 607942, 607856, 605245, 601089, 596626, 592330, 587635, 581874, 575105, 567747, 559895, 551517, 543078, 535337]
51747E35337o736n860m823l249j550m49J60J090K670M317N411O029O585P176P516
51732E53624P348O670N707M677L557K251J105R09J957L342L757K997K037J599
51718F01537J253K31j458l073m004m120l616k849k257k135k494l177l873m034
51704E65931l126j276N93J526J321M02p43j746k199j824p47N23J501J993K035
51689E64164J723J055m9j548l121m385n195n510n107l895k430j612j629j838j764
51674E28859j661j690j298p5J352K119K526L760O301R366J1964J3685J4301J3365
51660F02874J0767P196L645O29j791l509m215l728k232k04J792L397M564N265
51646F24450N132L641P57k811o171q971j1354j3397j4735j4849j3665j1781j0027
$$ y = [535337, 528601, 522741, 517918, 514669, 513119, 512670, 512830, 513920, 516590, 520907, 526318, 532347, 538932, 546108, 553624, 560972, 567642, 573349, 578026, 581583, 583834, 584939, 585848, 587805, 591147, 594904, 597901, 599938, 601537, 602790, 603021, 601563, 598490, 594486, 590366, 586750, 583901, 581644, 579509, 577015, 573838, 569965, 565931, 562805, 561529, 562122, 563648, 564969, 565371, 564628, 562882, 560683, 558859, 558112, 558635, 560136, 562129, 564164, 565887, 566942, 566893, 565345, 562224, 557839, 552644, 547134, 542027, 538132, 535702, 534090, 532461, 530623, 528859, 527198, 525508, 524210, 524135, 525487, 527606, 530132, 533892, 540193, 549559, 561523, 575208, 589509, 602874, 613641, 620837, 624482, 625111, 623320, 619811, 615596, 611868, 609636, 609432, 611224, 614621, 619185, 624450, 629582, 633223, 633980, 631169, 624998, 616027, 604673, 591276, 576541, 561692, 548027, 536246, 526219]
51633E26219q742p613o240m694l358k403j667r62k35N01J155J495J309P21J67
51618D95653OK63O50P51L10m62j051j227j297j527j640j310q75r04j218j017m8
51601D85057J014J672K303L401M706N711O597P993R874J1298J1231R275N766J651
51587E67549j752l521l883l856l955l608k136J26K173L608N037P104R590J1791
51573E84267J3489J5132J7078J9066K0578K1427K1736K1540K0834K0105K0361
51562G95613K2329K5748K9794L4045L8580M3073M6364M7335M5827M2204L6411
51551A207323K8224J8303Q050j846j1765k1592k9882l5495l9325m2996m6299m7467
51539I85233m6012m3582m1531l9139l5299l0608k6519k3245k0084j7189j5456
$$ y = [526219, 517477, 509864, 503624, 498930, 495572, 493169, 491502, 490540, 490305, 490806, 491961, 493456, 494765, 495486, 495653, 495659, 495922, 496572, 497323, 497633, 497171, 496120, 494893, 493596, 492069, 490429, 489119, 488244, 487340, 486122, 485105, 485057, 486071, 487743, 490046, 493447, 498153, 503864, 510461, 518454, 528328, 539626, 550857, 560132, 565898, 567549, 565797, 562276, 558393, 554537, 550582, 546974, 544838, 544964, 547137, 550745, 555782, 562886, 572476, 584267, 597756, 612888, 629966, 649032, 669610, 691037, 712773, 734313, 755147, 775252, 795613, 817942, 843690, 873484, 907529, 946109, 989182, 1035546, 1082881, 1128708, 1170912, 1207323, 1235547, 1253850, 1261900, 1260054, 1248289, 1226697, 1196815, 1161320, 1121995, 1078999, 1032700, 985233, 939221, 895639, 854108, 814969, 779670, 749062, 722543, 699298, 679214, 662025, 646569]
51528F46569j4766j3822j2033j0164q783p309n290l488k771k587j635K90K060
51515E66271K791K783K717K543J652j29k107l413l909m248n039o107o704o328
51501E40773n182l878k918k380j944j308o52n82j312k138k147j339n98n54r74
51486E12867j394j819k498l301l780l701l309l059l178l460l472l057k547k356
51472D71936k425k331j894j408j254j468j812k022j951j668j373j133q00m01k91
51457D49705o35r07m63N88J597K392L386M653N611N898N891O088O495P117Q432
51442E05848J0746J3267J4483J3577J1111Q319O053M480L483K974K694J974J65
51429E99174k579n296p297q836j0329j1301j0892r230p448o265n274l937k509
$$ y = [646569, 631803, 617981, 605948, 595784, 587001, 579692, 574402, 570914, 568143, 565556, 563921, 564211, 566271, 569062, 571845, 574562, 577105, 578757, 578628, 576521, 573108, 569199, 564951, 559912, 553805, 547101, 540773, 535591, 531713, 528795, 526415, 524471, 523163, 522511, 521929, 520617, 518479, 516332, 514993, 514395, 513841, 512867, 511473, 509654, 507156, 503855, 500075, 496374, 493065, 490006, 486828, 483368, 479896, 476839, 474292, 471936, 469511, 467180, 465286, 463878, 462624, 461156, 459344, 457322, 455371, 453703, 452330, 451197, 450397, 449996, 449705, 449070, 448163, 447700, 448288, 449885, 452277, 455663, 460316, 465927, 471825, 477716, 483804, 490299, 497416, 505848, 516594, 529861, 544344, 557921, 569032, 577351, 583404, 587884, 591367, 594341, 597035, 599009, 599174, 596595, 591299, 584002, 575166, 564837, 553536, 542644, 533414, 525966, 519701, 514427, 510490, 507981]
51416E07981j509q03J39J419K538K978K659J960J421J296J336J184Q99P79Q49
51401E25126R54J207J748K132J833J299J727L465N497O819P524Q152Q826R594
51387E85903J0901J3096J6036J9699K4462L0191L5813M0547M4956N0052N5876
51376I27532O1721O6976P0802P1548O7779N9713M8760L5961K1839P472n709j7323
51364A417071k8091l8229m6752n2738n6486n8905o0368o0560n9040n5667n0789
51353H49446m5205l9752l4853l0601k6999k3766k0308j6581j3667j2653j3016
51342E72045j3022j1779j0008q728q097p875q009q206p709o192m473l623l693
51329D70631l784l253k342j686j532j534j196n03Nq3m72n47j53M27J116K115L331
$$ y = [507981, 506472, 505669, 505808, 507227, 509765, 512743, 515402, 517362, 518783, 520079, 521415, 522599, 523498, 524277, 525126, 526080, 527287, 529035, 531167, 533000, 534299, 536026, 539491, 544988, 551807, 559331, 567483, 576309, 585903, 596804, 609900, 625936, 645635, 670097, 700288, 736101, 776648, 821604, 871656, 927532, 989253, 1056229, 1127031, 1198579, 1266358, 1326071, 1374831, 1410792, 1432631, 1440103, 1434394, 1417071, 1388980, 1350751, 1303999, 1251261, 1194775, 1135870, 1075502, 1014942, 955902, 900235, 849446, 804241, 764489, 729636, 699035, 672036, 648270, 627962, 611381, 597714, 585061, 572045, 559023, 547244, 537236, 528508, 520411, 512536, 504527, 496321, 488612, 482420, 477947, 474324, 470631, 466847, 463594, 461252, 459566, 458034, 456500, 455304, 454801, 454806, 454723, 454251, 453704, 453551, 453978, 455094, 457209, 460540]
51312D60540M304M814N086N247N130M667M022L212K074P35m28j386k465l585m186
51297D87781m147m134m596n031m714l834l314l720m644n077m290k546r80l64o2
51282D36328J222L623N824O756O729O446N794M401K680J470R52P38P36J085J560
51267D86344J811K092K942M231N170N294M715L485J542o20k067k538k749l244
51253E06408l629l412k953k897l096k877k234j912k282k786k773k366k125k247
51239D68819k518k767k919k782k273j800j870k312k351j675q75n84o03l65J68
51224D43293N56N53K66j65n02k49Q62K271L059L036K783K713K685K647K901L560
51208D70269M314M954N543N842N292L918K667K273K291J796O90k95o77p65j164
$$ y = [460540, 464844, 469658, 474744, 479991, 485121, 489788, 493810, 497022, 499096, 499831, 499403, 498017, 495552, 491967, 487781, 483634, 479500, 474904, 469873, 465159, 461325, 458011, 454291, 449647, 444570, 440280, 437734, 436754, 436390, 436328, 437550, 441173, 446997, 453753, 460482, 466928, 472722, 477123, 479803, 481273, 482225, 482963, 483699, 484784, 486344, 488155, 490247, 493189, 497420, 502590, 507884, 512599, 516084, 517626, 517006, 514939, 512401, 509652, 506408, 502779, 499367, 496414, 493517, 490421, 487544, 485310, 483398, 481116, 478330, 475557, 473191, 471066, 468819, 466301, 463534, 460615, 457833, 455560, 453760, 451890, 449578, 447227, 445552, 444677, 444093, 443490, 443125, 443293, 443849, 444402, 444668, 444503, 444001, 443752, 444614, 446885, 449944, 452980, 455763, 458476, 461161, 463808, 466709, 470269, 474583, 479537, 485080, 490922, 496214, 500132, 502799, 505072, 507363, 509159, 509849, 509554, 508877, 508112, 506948]
51193E06948k083l147l668l277k344j597j253r56o11o05r81j088n71o7k51p09
51177D83740n30L25J115J471J653J758J557J129Q86Q11M33l24q50o52R5R78J758
51160D95353K194K074J682J664K117K337J860J206J102J413J437J036P46Q38Q24
51145E17883P7j371k888l885m263m309m228l950l445l076l218l521l059j559j01
51130D75087J1j069j825j215J68J123J444J910K891L742L780L335L365M188N058
51115E01993N074M196L232K950L390L979M108L570K623J752J367J481J633J316
51101E42664N27j58k69MJ39L3lj1n12j629k517k261j094k15l82j207j808j712
51083E29589j000l2P34R40O62L54L22M25M10K93K69M32P86J329J977K560L020
$$ y = [506948, 504865, 501718, 498050, 494773, 492429, 490832, 489579, 488623, 488012, 487407, 486426, 485338, 484767, 484700, 484449, 483740, 483210, 483535, 484650, 486121, 487774, 489532, 491089, 492218, 493104, 493915, 494348, 494024, 493174, 492522, 492617, 493595, 495353, 497547, 499621, 501303, 502967, 505084, 507421, 509281, 510487, 511589, 513002, 514439, 515475, 516221, 517059, 517883, 517960, 516589, 513701, 509816, 505553, 501244, 497016, 493066, 489621, 486545, 483327, 479806, 476747, 475188, 475087, 475098, 474029, 472204, 470989, 471157, 472280, 473724, 475634, 478525, 482267, 486047, 489382, 492747, 496935, 501993, 507067, 511263, 514495, 517445, 520835, 524814, 528922, 532492, 535115, 536867, 538234, 539715, 541348, 542664, 543191, 543033, 542764, 542768, 542907, 542940, 542937, 542926, 542414, 540785, 538268, 536007, 534913, 534698, 534316, 533109, 531301, 529589, 528589, 528557, 529291, 530231, 530893, 531247, 531569, 531994, 532404, 532697, 532966, 533398, 534184, 535513, 537490, 540050, 543070]
51066E43070L555M357N425O649P995R525J1348J3595J6224J8714K0182K0017J8413
51053F99069J6238J4496J3831J4294J5390J6440J6950J6761J5975J4797J3229
51042H67470J0794O862J619l653p702j0400j2206j2918j2000j0078q980r784j1679
51029G87345j3218j3948j4233j4162j3469j2125j0345q174n657l186j155N47K253
51016F80473L962N493O831P920Q402Q113P574P477P860Q361Q926R709J0494J0895
51002G92490J1029J1396J2084J2622J2515J1549R761P683O301O044N961M679K157
50989I06271k37j449j695j593j240n00M99J736L671O634J0123J3171J5246J6590
50975I67227J7764J9203K1008K2974K4873K6826K9299L2645L6747M1211M5735
$$ y = [543070, 546625, 550982, 556407, 563056, 571051, 580576, 591924, 605519, 621743, 640457, 660639, 680656, 699069, 715307, 729803, 743634, 757928, 773318, 789758, 806708, 823469, 839444, 854241, 867470, 878264, 885126, 886745, 883092, 875390, 864990, 852784, 839866, 827866, 817788, 808808, 799024, 787345, 774127, 760179, 745946, 731784, 718315, 706190, 695845, 687671, 682014, 678828, 677673, 678220, 680473, 684435, 689928, 696759, 704679, 713081, 721194, 728768, 736245, 744105, 752466, 761392, 771101, 781595, 792490, 803519, 814915, 826999, 839621, 852136, 863685, 873446, 881129, 887430, 893474, 899435, 904114, 906271, 906034, 904585, 902890, 901297, 900057, 899557, 900056, 901792, 905463, 912097, 922220, 935391, 950637, 967227, 984991, 1004194, 1025202, 1048176, 1073049, 1099875, 1129174, 1161819, 1198566, 1239777, 1285512]
50964A285512N0300N5037N9914O4491O8105P0437P1772P2448P2213P0443O6874
50953B007546O1902N6156N0122M4005L7683L0864K3574J6466J0338N519J924n57
50941B345542k119l315m731o480q386j0550j3216j6158j8763k0714k2256k3821
50929B195033k5724k8126l0855l3497l6054l9187m3200m7186n0005n1728n3207
50918A756264n4440n4539n3295n1583m9904m7717m4663m1314l8133l4776l1140
50907A254760k8147k6501k5531k4197k2639k1557k0521j8352j5074j2309j1300
50896A028632j1412j1080r630p639n916m694l792l057k368j460j67J164J872J840
50882I72293J768K258L107L957N184P236R414J0462J0423J0688J1958J3319J3878
$$ y = [1285512, 1335812, 1390849, 1450763, 1515254, 1583359, 1653796, 1725568, 1798016, 1870229, 1940672, 2007546, 2069448, 2125604, 2175726, 2219731, 2257414, 2288278, 2311852, 2328318, 2338656, 2344175, 2346099, 2345542, 2343423, 2340108, 2335377, 2328897, 2320511, 2309961, 2296745, 2280587, 2261824, 2241110, 2218854, 2195033, 2169309, 2141183, 2110328, 2076831, 2040777, 2001590, 1958390, 1911204, 1861199, 1809471, 1756264, 1701824, 1647285, 1593990, 1542407, 1492503, 1444786, 1400123, 1358809, 1320676, 1285900, 1254760, 1226613, 1200112, 1174581, 1150384, 1127745, 1106188, 1085667, 1067315, 1052241, 1039932, 1028632, 1017220, 1006140, 996510, 988871, 982955, 978261, 974469, 971412, 969044, 967584, 967417, 968581, 970453, 972293, 974061, 976319, 979426, 983383, 988567, 995803, 1005217, 1015679, 1026102, 1036790, 1048748, 1062067, 1075945]
50869A075945J4196J5262J6954J8524J9988K1943K4469K7188L0070L3365L6961
50858A334865M0701M5041N0536N6866O3215O9531P6551Q4661R3522J02861J12694
50847B131044J22664J31987J40333J48082J55367J61499J65543J67013J65661
50838C489193J61103J53055J41598J27016J09552Q9679O8326M6657K5612N751
50828D417542j2514k8505m1162m9553n3677n4491n2888m9030m2994l5719k8801
50817C968208k3616k1055k1759k5827l2416m0404m9552o0368p2849q5938r8387
50806C436037j09462j18671j25416j29402j30908j30318j27668j22913j16388
50797B324891j08748j00566r2128q3407p4319o5116n6439m8700m1618l4801k8592
$$ y = [1075945, 1090141, 1105403, 1122357, 1140881, 1160869, 1182812, 1207281, 1234469, 1264539, 1297904, 1334865, 1375566, 1420607, 1471143, 1528009, 1591224, 1660755, 1737306, 1821967, 1915489, 2018350, 2131044, 2253708, 2385695, 2526028, 2674110, 2829477, 2990976, 3156519, 3323532, 3489193, 3650296, 3803351, 3944949, 4071965, 4181517, 4271196, 4339522, 4386179, 4411791, 4417542, 4405028, 4376523, 4335361, 4285808, 4232131, 4177640, 4124752, 4075722, 4032728, 3997009, 3968208, 3944592, 3923537, 3901778, 3875951, 3843535, 3803131, 3753579, 3693211, 3620362, 3534424, 3436037, 3326575, 3207904, 3082488, 2953086, 2822178, 2691860, 2564192, 2441279, 2324891, 2216143, 2115577, 2023449, 1940042, 1865723, 1800607, 1744168, 1695468, 1653850, 1619049, 1590457]
50786A590457k3748k0338j7638j5164j3103j1546j0029q246o626n768n733o281
50774A446237p332q690r751j0111j0208j0831j2110j3501j4674j5800j6877j7344
50762A299008j6694j5200j3685j2622j1749j0632r241p809o286m396k237l61R72
50749A189068K235M023O344Q903J1734J5050J8706K2461K6598L1628L7404M3182
50737A417336M8628N4113N9934O5866P1635P7140Q1975Q5400Q7206Q8069Q8630
50726B225932Q8654Q7516Q5138Q2037P8629P4750O9668O2433N2582M0653K7604
50715B975596J3722j205j6515l0281m0823m7925n2072n3282n1491m7463m2270
50704B605991l6172k8991k1484j5273j1310r211q355q962j1768j7128k4652l3378
$$ y = [1590457, 1566709, 1546371, 1528733, 1513569, 1500466, 1488920, 1478891, 1470645, 1464019, 1458251, 1452518, 1446237, 1438905, 1430215, 1420464, 1410353, 1400145, 1389314, 1377204, 1363703, 1349029, 1333229, 1316352, 1299008, 1282314, 1267114, 1253429, 1240807, 1229058, 1218426, 1209185, 1201376, 1195090, 1190694, 1188457, 1188096, 1189068, 1191303, 1195326, 1201670, 1210573, 1222307, 1237357, 1256063, 1278524, 1305122, 1336750, 1374154, 1417336, 1465964, 1520077, 1580011, 1645877, 1717512, 1794652, 1876627, 1962027, 2049233, 2137302, 2225932, 2314586, 2402102, 2487240, 2569277, 2647906, 2722656, 2792324, 2854757, 2907339, 2947992, 2975596, 2989318, 2988113, 2971598, 2941317, 2900494, 2852569, 2800497, 2747215, 2695724, 2648261, 2605991, 2569819, 2540828, 2519344, 2504071, 2492761, 2483550, 2475195, 2466233, 2454465, 2437337, 2412685, 2379307]
50692B379307m2132n0125n7318o3848o9122p1971p1875o9609o6350o2592n8196
50681A696169n3131m7683m2036l6030k9511k2783j6522j1136o241j050M629R970
50669A444645J3946J6379J7827J8716J9016J8711J8073J7330J6482J5543J4707
50658A631375J4111J3780J3889J4706J6081J7286J7667J7376J7286J8264K0552
50647A812373K3709K7066L0335L3852L8110M3084M8173N2815N6912O0593O3771
50636B290793O6068O7036O6404O4367O1622N8893N6362N3876N1720N0729N1118
50625B938988N1278M8245L9712K5772Q771q427k3966l6946m6383n1058n0728m6895
50613B848363m1616l5729k8915k1367j4391r091n396l002k502m722r299j4943
$$ y = [2379307, 2337175, 2287050, 2229732, 2165884, 2096762, 2024791, 1952916, 1883307, 1816957, 1754365, 1696169, 1643038, 1595355, 1553319, 1517289, 1487778, 1464995, 1448473, 1437337, 1431096, 1430046, 1434675, 1444645, 1458591, 1474970, 1492797, 1511513, 1530529, 1549240, 1567313, 1584643, 1601125, 1616668, 1631375, 1645486, 1659266, 1673155, 1687861, 1703942, 1721228, 1738895, 1756271, 1773557, 1791821, 1812373, 1836082, 1863148, 1893483, 1927335, 1965445, 2008529, 2056702, 2109517, 2166429, 2227022, 2290793, 2356861, 2423897, 2490301, 2554668, 2616290, 2675183, 2731545, 2785421, 2837141, 2887870, 2938988, 2990266, 3038511, 3078223, 3103995, 3112766, 3104339, 3080373, 3043427, 2997044, 2945986, 2895258, 2848363, 2806747, 2771018, 2742103, 2720736, 2706345, 2697254, 2691858, 2688856, 2686354, 2681632, 2672333, 2657390]
50601B657390k1036k8127l6725m6255n5520o3537o9658p3339p4425p3471p1429
50590B043868o8957o6195o3004n9226n4877n0330m6250m3015m0267l7299l3931
50579A480517l0708k8172k6131k3955k1366j8680j6209j3744j0859p498m040p80
50567A278375K272N150P726R936J1968J4019J6018J7885J9853K2175K4589K6400
50555A456366K7258K7518K7753K8100K8316K8216K7864K7381K6736K5748K4334
50544A755590K2828K2036K2695K4785K7569L0449L3549L7341M1982M7313N3246
50533B119383N9849O7085P4827Q3055R1766J00680J09348J17434J24738J31015
50523C079180J36134J40251J43378J44805J43507J39214J32468J23422J11279
$$ y = [2657390, 2636354, 2608227, 2571502, 2525247, 2469727, 2406190, 2336532, 2263193, 2188768, 2115297, 2043868, 1974911, 1908716, 1845712, 1786486, 1731609, 1681279, 1635029, 1592014, 1551747, 1514448, 1480517, 1449809, 1421637, 1395506, 1371551, 1350185, 1331505, 1315296, 1301552, 1290693, 1283195, 1279155, 1278375, 1280647, 1285797, 1293523, 1303459, 1315427, 1329446, 1345464, 1363349, 1383202, 1405377, 1429966, 1456366, 1483624, 1511142, 1538895, 1566995, 1595311, 1623527, 1651391, 1678772, 1705508, 1731256, 1755590, 1778418, 1800454, 1823149, 1847934, 1875503, 1905952, 1939501, 1976842, 2018824, 2066137, 2119383, 2179232, 2246317, 2321144, 2404199, 2495965, 2596645, 2705993, 2823427, 2948165, 3079180, 3215314, 3355565, 3498943, 3643748, 3787255, 3926469, 4058937, 4182359, 4293638]
50514D293638R5452P6777N6853L6440J5266o697k8466m8829o7232q3547r7293
50503D242362j07508j13282j14234j10589j03021r2358p9246o4096m7322k9588
50493C381118j1757N320K0850L3988M3683M8725M8060M1217K8494J0808j0506
50482C640000l3743n7021p8736r7757j13204j24372j31211j34555j35368j33875
50472B600158j29876j23680j16175j07960r9101q9821q0755p2227o3999n6092
50462A660472m9161m3484l8189l2262k5982k0527j6371j2938r814p372n851m593
50450A393928k724k02K357M638O881R304J1786J4121J6273J8167J9500J9985J9655
50437A533669J8750J7369J5506J3394J1498R958Q408O663N378N360O303O878O330
$$ y = [4293638, 4389090, 4465867, 4522720, 4559160, 4574426, 4567729, 4539263, 4490434, 4423202, 4339655, 4242362, 4134854, 4021572, 3907338, 3796749, 3693728, 3601370, 3522124, 3458028, 3410706, 3381118, 3369361, 3374681, 3395531, 3429519, 3473202, 3521927, 3569987, 3611204, 3639698, 3650506, 3640000, 3606257, 3549236, 3470500, 3372743, 3259539, 3135167, 3003956, 2869401, 2734033, 2600158, 2470282, 2346602, 2230427, 2122467, 2023366, 1933545, 1852790, 1780563, 1716564, 1660472, 1611311, 1567827, 1529638, 1497376, 1471394, 1450867, 1434496, 1421558, 1411744, 1404372, 1398521, 1393928, 1391204, 1391002, 1393359, 1397997, 1404878, 1414182, 1425968, 1440089, 1456362, 1474529, 1494029, 1514014, 1533669, 1552419, 1569788, 1585294, 1598688, 1610186, 1620144, 1628552, 1635215, 1640593, 1645953, 1652256, 1659134, 1665464]
50424A665464N392N211N913O810P648Q856J0759J3345J6785K1444K7106L2853
50412A827586L8117M3305M8975N4793N9819O3573O6277O8144O8956O8454O6777
50401B474776O4291O1128N6963N1196M3405L3722K2808J1199j254j4994k9701
50390B773539m3934n6073o5485p2415p6905p8432p6798p2836o7655o1384n3320
50379B048302m3319l2467k2091j2544l347N743J4131K0621K3987K3518J9398J2509
50367B054441L715o513j7620k8531l8102m5874n2024n6710n9845o1282o0924n8806
50355A571925n5517n2264m9953m8285m6216m3190l9372l5013l0276k5665k1641
50344A124533j7798j3208p886k940J006M699Q933J2983J5052J3887R563L310k842
$$ y = [1665464, 1670856, 1676067, 1681980, 1688790, 1696438, 1705294, 1716053, 1729398, 1746183, 1767627, 1794733, 1827586, 1865703, 1909008, 1957983, 2012776, 2072595, 2136168, 2202445, 2270589, 2339545, 2407999, 2474776, 2539067, 2600195, 2657158, 2708354, 2751759, 2785481, 2808289, 2819488, 2818234, 2803240, 2773539, 2729605, 2673532, 2608047, 2535632, 2458727, 2380295, 2303497, 2230661, 2163006, 2101622, 2048302, 2004983, 1972516, 1950425, 1937881, 1934534, 1940277, 1954408, 1975029, 1999016, 2022534, 2041932, 2054441, 2058156, 2051643, 2034023, 2005492, 1967390, 1921516, 1869492, 1812782, 1752937, 1691655, 1630731, 1571925, 1516408, 1464144, 1414191, 1365906, 1319690, 1276500, 1237128, 1202115, 1171839, 1146174, 1124533, 1106735, 1093527, 1085641, 1082701, 1083707, 1088406, 1097339, 1110322, 1125374, 1139261, 1148824, 1152134, 1149292]
50331A149292o913q333q346q493q997r144q686p992p043n290k599L37K738M400
50317A074931N519O277O661O478N612M409L521L070K443J400P63J362K689L624
50303A128759M129N076O607P868Q531R345J0813J2442J3868J5743J8834K2922
50291A264937K7069L0096L0308K5857J6464M335p479j7297k4793k9702l1680l1152
50279A256963k9108k6107k2276j8063j4067j0167n842j373K225M526O071P204
50267A149986P473O602N201M032L203K512K010J705J281O90N10J156K150K764
50253A191275L008L316L625L586L527M280N930P518Q337Q932J0291J2480J4584
50240A280689J5888J6543J7076J7635J8069J8467J9238K0363K0833J9206J4990
$$ y = [1149292, 1142379, 1134046, 1125700, 1117207, 1108210, 1099066, 1090380, 1082388, 1075345, 1070055, 1067456, 1067793, 1070531, 1074931, 1080450, 1086727, 1093388, 1099866, 1105478, 1109887, 1113408, 1116478, 1118921, 1120321, 1121084, 1122446, 1125135, 1128759, 1132888, 1137964, 1144571, 1152439, 1160970, 1170315, 1181128, 1193570, 1207438, 1223181, 1242015, 1264937, 1292006, 1322102, 1352410, 1378267, 1394731, 1399066, 1391587, 1374290, 1349497, 1319795, 1288115, 1256963, 1227855, 1201748, 1179472, 1161409, 1147342, 1137175, 1131333, 1129960, 1132185, 1136711, 1142782, 1149986, 1157459, 1164061, 1169262, 1173294, 1176497, 1179009, 1181019, 1182724, 1184005, 1184695, 1185205, 1186361, 1188511, 1191275, 1194283, 1197599, 1201224, 1204810, 1208337, 1212617, 1218547, 1226065, 1234402, 1243334, 1253625, 1266105, 1280689, 1296577, 1313120, 1330196, 1347831, 1365900, 1384367, 1403605, 1423968, 1444801, 1464007, 1478997]
50229A478997R224L550j281n642j0017j4104j7138j8709j8982j8250j6627j4230
50217A356791j1446r082q201r685j3540j8584k3126k6219k8158k9656l0717l0602
50205A117775k8827k5920k3053k1151k0272j9720j8662j6856j4893j3614j3166
50194I01641j2800j1734j0041q488p643p313o885o008m891m033l676l569l323
50181H11237k947k819l033l093k514j578j032j127j326j023k98L21N52O04P75
50166G92699J028J059P19K95L04R73K013K918L438L745M268N405P143Q820R470
50151H44297Q739P250N860M714L440K056J131R39J016Q33M89M93J111K232L682
50136H88282N494P914J1261J5535K0137K4301K7878L1381L5009L8071L9659L9735
$$ y = [1478997, 1488221, 1491771, 1490490, 1484848, 1474831, 1460727, 1443589, 1424880, 1405898, 1387648, 1371021, 1356791, 1345345, 1336263, 1328062, 1318377, 1304837, 1286253, 1263127, 1236908, 1208750, 1179094, 1148377, 1117775, 1088948, 1063028, 1039975, 1018824, 998552, 978832, 960170, 943314, 928421, 914807, 901641, 888841, 877107, 867066, 858578, 850935, 843622, 836737, 830729, 825838, 821805, 818129, 814560, 811237, 808290, 805471, 802438, 799345, 796831, 795253, 794221, 793094, 791768, 790745, 790447, 790768, 791320, 791924, 792699, 793727, 794786, 795505, 795800, 796104, 797077, 799090, 802008, 805446, 809191, 813459, 818864, 826007, 834827, 844297, 853036, 860286, 866146, 870860, 874300, 876356, 877487, 878426, 879442, 880275, 880764, 881257, 882368, 884600, 888282, 893776, 901690, 912951, 928486, 948623, 972924, 1000802, 1032183, 1067192, 1105263, 1144922, 1184657]
50124A184657L9144L8758L8900L9469M0240M1015M1682M2012M1398L9032L4617
50113A620924K8685K1911J4399N977l045j1838j9663k6165l1219l4906l7609l9588
50101A487863m0494l9799l7783l5599l4119l3108l1758k9723k7405k5406k3978
50090A128691k2914k1811k0476j9033j7628j6106j4250j2215j0360q710o990n274
50078I52924m075l571l088j791L55K527L903M343M386M697N455O106N961N011
50064I83143L971L354K891K106J125M49J86n1m87r20j190j498k134l077m022m581
50048I79265m429l539k368j563j295r73P6J811L561M810N652O481P517Q795J0374
50033A014175J2276J4252J5878J6919J7441J7516J7026J5947J4603J3383J2304
$$ y = [1184657, 1223801, 1262559, 1301459, 1340928, 1381168, 1422183, 1463865, 1505877, 1547275, 1586307, 1620924, 1649609, 1671520, 1685919, 1691896, 1688851, 1677013, 1657350, 1631185, 1599966, 1565060, 1527451, 1487863, 1447369, 1407570, 1369787, 1334188, 1300069, 1266961, 1235203, 1205480, 1178075, 1152669, 1128691, 1105777, 1083966, 1063490, 1044457, 1026829, 1010723, 996473, 984258, 973898, 965188, 958198, 952924, 948849, 945278, 942190, 940399, 940754, 943281, 947184, 951527, 955913, 960610, 966065, 972171, 978132, 983143, 987114, 990468, 993359, 995465, 996590, 997039, 997225, 997174, 996687, 995767, 994577, 993079, 990945, 987868, 983846, 979265, 974836, 971297, 968929, 967366, 966071, 965098, 965174, 966985, 970546, 975356, 981008, 987489, 995006, 1003801, 1014175, 1026451, 1040703, 1056581, 1073500, 1090941, 1108457, 1125483, 1141430, 1156033, 1169416, 1181720]
50022A181720J1157J0040R459R682J0206J0089Q801O615M260K421J563J986L722
50009A271721O262Q693J0353J1364J2308J3394J4305J4904J5688J7186J9199K0977
49997A436354K1998K2116K1079J8433J3972P931O22p700j6525k4990l2342l8248
49985A422700m2592m5266m6318m6010m4550m2052l8827l5417l2101k8724k5192
49974I95651k1833j9053j6894j5118j3477j1706r704p873o854o625o249m948k971
49961H52346j019P09K338L703M687N814P639R709J1000J1338J1470J1622J1010
49948I42366R133O705M749L415K210R32k85j534l127n146p365r524j1367j2623
49934I18539j3281j3720j4298j5004j5662j6179j6334j5668j4075j2183j0655
$$ y = [1181720, 1192877, 1202917, 1212376, 1222058, 1232264, 1242353, 1251154, 1257769, 1262029, 1264450, 1266013, 1267999, 1271721, 1277983, 1286676, 1297029, 1308393, 1320701, 1334095, 1348400, 1363304, 1378992, 1396178, 1415377, 1436354, 1458352, 1480468, 1501547, 1519980, 1533952, 1541883, 1542505, 1534805, 1518280, 1493290, 1460948, 1422700, 1380108, 1334842, 1288524, 1242514, 1197964, 1155912, 1117085, 1081668, 1049567, 1020843, 995651, 973818, 954765, 937871, 922753, 909276, 897570, 887866, 879993, 873139, 866514, 860265, 855317, 852346, 851327, 852036, 854374, 858077, 862764, 868578, 876217, 885926, 896926, 908264, 919734, 931356, 942366, 951499, 958204, 962953, 966368, 968578, 969510, 969225, 967691, 964564, 959418, 952053, 942529, 931162, 918539, 905258, 891538, 877240, 862236, 846574, 830395, 814061, 798393, 784318, 772135, 761480]
49923G61480r303p416m835k182l5J567K720L318L362L227L358L930M917O214P526
$$ y = [761480, 752177, 744761, 739926, 737744, 737709, 739276, 741996, 745314, 748676, 751903, 755261, 759191, 764108, 770322, 777848]
$$ [...]
##END NTUPLES=NMR SPECTRUM
##END=
