##TITLE=AC1432_GUAAH13236_7764488_e3P6ADAF8P
##JCAMPDX= 6.0         $$ Bruker NMR JCAMP-DX V2.0
##DATA TYPE= NMR SPECTRUM
##DATA CLASS= NTUPLES
##ORIGIN= BRUKER
##OWNER= Administrator
$$ 1.72 TOPSPIN		Version 2.1
$$ 2013-04-16 23:32:12.104 -0700  Administrator@X
$$ Compression mode = diff/dup
##.OBSERVE FREQUENCY= 400.02188249412
##.OBSERVE NUCLEUS= ^1H
##.ACQUISITION MODE= SIMULTANEOUS (DQD)
##.ACQUISITION SCHEME= undefined
##.AVERAGES= 8
##.DIGITISER RES= 22
##SPECTROMETER/DATA SYSTEM= spect
##.PULSE SEQUENCE= zg30
##.SOLVENT NAME= COFFEE_meoh
##.SHIFT REFERENCE= INTERNAL, COFFEE_meoh, 1, 14.98509
##AUDIT TRAIL= $$ (NUMBER, WHEN, WHO, WHERE, PROCESS, VERSION, WHAT)
$$ ##TITLE= Audit trail, TOPSPIN		Version 2.1
$$ ##JCAMPDX= 5.01
$$ ##ORIGIN= Bruker BioSpin GmbH
$$ ##OWNER= Administrator
$$ $$ E:\/data/COFFEE/nmr/AC1432_GUAAH13236_7764488_e3P6ADAF8P/10/pdata/1/auditp.txt
$$ ##AUDIT TRAIL=  $$ (NUMBER, WHEN, WHO, WHERE, PROCESS, VERSION, WHAT)
(   1,<2013-04-16 23:32:05.198 -0700>,<Administrator>,<X>,<go>,<TOPSPIN 2.1>,
      <created by zg
	started at 2013-04-16 23:30:59.820 -0700,
	POWCHK enabled, PULCHK disabled,
       configuration hash MD5:
       33 CF 6A 21 5C D3 B9 40 6C 15 AA 8D 27 A2 4F 13
       data hash MD5: 64K
       A3 1D D7 59 6D E0 DB 8B 2E 30 BC CA 35 1E C6 50>)
(   2,<2013-04-16 23:32:08.151 -0700>,<Administrator>,<X>,<proc1d>,<TOPSPIN 2.1>,
      <Start of raw data processing
       efp LB = 0 FT_mod = 6 PKNL = 1 PHC0 = 0 PHC1 = 0 SI = 32K 
       data hash MD5: 32K
       F7 41 9F A4 5B 26 76 E6 18 C7 1D E7 34 82 CF 61>)
(   3,<2013-04-16 23:32:08.432 -0700>,<Administrator>,<X>,<proc1d>,<TOPSPIN 2.1>,
      <pk PHC0 = 100.7941 PHC1 = 0 
       data hash MD5: 32K
       8D 59 5D A8 4D 14 3E AD 87 E3 2E 03 D6 D9 62 0B>)
(   4,<2013-04-16 23:32:08.526 -0700>,<Administrator>,<X>,<proc1d>,<TOPSPIN 2.1>,
      <abs ABSG = 1 
       data hash MD5: 32K
       99 B1 F6 2B DE DA 42 EA 86 A5 C1 E5 77 40 D7 31>)
(   5,<2013-04-16 23:32:08.573 -0700>,<Administrator>,<X>,<proc1d>,<TOPSPIN 2.1>,
      <abs ABSG = 2 
       data hash MD5: 32K
       F0 A3 F6 33 7B D0 98 7C BC 11 DA 31 37 48 52 76>)
(   6,<2013-04-16 23:32:08.635 -0700>,<Administrator>,<X>,<proc1d>,<TOPSPIN 2.1>,
      <abs ABSG = 3 
       data hash MD5: 32K
       E7 B4 60 05 99 CE 88 83 5D 51 8E 5A 32 3A 24 2C>)
(   7,<2013-04-16 23:32:08.698 -0700>,<Administrator>,<X>,<proc1d>,<TOPSPIN 2.1>,
      <abs ABSG = 4 
       data hash MD5: 32K
       BD 53 68 8C 61 58 09 8E 8A 3D E7 39 60 E7 FD 26>)
(   8,<2013-04-16 23:32:08.791 -0700>,<Administrator>,<X>,<proc1d>,<TOPSPIN 2.1>,
      <abs ABSG = 5 
       data hash MD5: 32K
       63 C3 13 0E 1D 3A 58 77 F6 66 B5 EE AD 56 AE 35>)
$$ ##END=
$$ 
$$ $$ hash MD5
$$ $$ F5 2B 63 BD 6E 28 AE F7 5D B6 27 1F 27 D3 FC 79
##$RELAX= 
##$RELAX= 
##$RELAX= 
##$RELAX= 
##$RELAX= 
##$RELAX= 
##$RELAX= 
$$ Bruker specific parameters
$$ --------------------------
##$DU= <E:\>
##$EXPNO= 10
##$NAME= <AC1432_GUAAH13236_7764488_e3P6ADAF8P>
$$ [...]
##$TP= (0..7)
150 150 150 150 150 150 150 150
##$TP07= 0
##$TPNAME0= <>
##$TPNAME1= <>
##$TPNAME2= <>
##$TPNAME3= <>
##$TPNAME4= <>
##$TPNAME5= <>
##$TPNAME6= <>
##$TPNAME7= <>
##$TPOAL= (0..7)
0.5 0.5 0.5 0.5 0.5 0.5 0.5 0.5
##$TPOFFS= (0..7)
0 0 0 0 0 0 0 0
##$TUNHIN= 0
##$TUNHOUT= 0
##$TUNXOUT= 0
##$USERA1= <user>
##$USERA2= <user>
##$USERA3= <user>
##$USERA4= <user>
##$USERA5= <user>
##$V9= 5
##$VALIST= <valist>
##$VCLIST= <CCCCCCCCCCCCCCC>
##$VD= 0
##$VDLIST= <DDDDDDDDDDDDDDD>
##$VPLIST= <PPPPPPPPPPPPPPP>
##$VTLIST= <TTTTTTTTTTTTTTT>
##$WBST= 2048
##$WBSW= 25
##$XGAIN= (0..3)
0 0 0 0
##$XL= 0
##$YL= 0
##$YMAX_a= 659132
##$YMIN_a= -560893
##$ZGOPTNS= <>
##$ZL1= 120
##$ZL2= 120
##$ZL3= 120
##$ZL4= 120
##$ABSF1= 14.98509
##$ABSF2= -5.573092
##$ABSG= 5
##$ABSL= 3
##$ALPHA= 0
##$AQORDER= 0
##$ASSFAC= 0
##$ASSFACI= 0
##$ASSFACX= 0
##$ASSWID= 0
##$AUNMP= <proc_prof1d_extract_pilot.lims>
##$AXLEFT= 0
##$AXNAME= <>
##$AXNUC= <1H>
##$AXRIGHT= 0
##$AXTYPE= 0
##$AXUNIT= <>
##$AZFE= 0.1
##$AZFW= 0.1
##$BCFW= 0
##$BC_mod= 0
##$BYTORDP= 0
##$COROFFS= 0
##$CY= 15
##$DATMOD= 1
##$DC= 0
##$DFILT= <>
##$DTYPP= 0
##$F1P= 0
##$F2P= 0
##$FCOR= 0.5
##$FTSIZE= 32768
##$FT_mod= 6
##$GAMMA= 0
##$GB= 0
##$INTBC= 1
##$INTSCL= 1
##$ISEN= 128
##$LB= 0
##$LEV0= 0
##$LPBIN= 0
##$MAXI= 10000
##$MC2= 0
##$MEAN= 0
##$ME_mod= 0
##$MI= 0
##$NCOEF= 0
##$NC_proc= -8
##$NLEV= 6
##$NOISF1= 0
##$NOISF2= 0
##$NSP= 0
##$NTH_PI= 0
##$NZP= 0
##$OFFSET= 14.98509
##$PC= 1
##$PHC0= 100.7941
##$PHC1= 0
##$PH_mod= 1
##$PKNL= yes
##$PPARMOD= 0
##$PPDIAG= 0
##$PPIPTYP= 0
##$PPMPNUM= 2147483647
##$PPRESOL= 1
##$PSCAL= 4
##$PSIGN= 0
##$PYNMP= <proc.py>
##$REVERSE= no
##$SF= 400.02
##$SI= 32768
##$SIGF1= 0
##$SIGF2= 0
##$SINO= 400
##$SIOLD= 32768
##$SPECTYP= <>
##$SREGLST= <1H.CDCl3>
##$SSB= 0
##$STSI= 32768
##$STSR= 0
##$SW_p= 8223.68421052631
##$SYMM= 0
##$S_DEV= 0
##$TDeff= 65536
##$TDoff= 0
##$TI= <>
##$TILT= no
##$TM1= 0
##$TM2= 0
##$TOPLEV= 0
##$USERP1= <user>
##$USERP2= <user>
##$USERP3= <user>
##$USERP4= <user>
##$USERP5= <user>
##$WDW= 1
##$XDIM= 32768
##$YMAX_p= 466055740
##$YMIN_p= -718909
##$CURPLOT= <Network HP LaserJet P1505>
##$CURPRIN= <$Network HP LaserJet P1505>
##$DFORMAT= <normdp>
##$LAYOUT= <+/1D_H.xwp>
##$LFORMAT= <normlp>
##$PFORMAT= <normpl>
##$SURQMSG= 1
$$ End of Bruker specific parameters
$$ ---------------------------------
##NTUPLES= NMR SPECTRUM
##VAR_NAME=  FREQUENCY,     SPECTRUM/REAL,   SPECTRUM/IMAG
##SYMBOL=    X,             R,               I
##VAR_TYPE=  INDEPENDENT,   DEPENDENT,       DEPENDENT
##VAR_FORM=  AFFN,          ASDF,            ASDF
##VAR_DIM=   32768,         32768,           32768
##UNITS=     HZ,            ARBITRARY UNITS, ARBITRARY UNITS
##FACTOR=    0.250966925370066, 1,           1
##FIRST=     8223.43324360094, 27114,        198764
##LAST=      0,             69439,           99748
##MIN=       0,             -718909,         0
##MAX=       8223.43324360094, 466055740,    0
$$ Real data points
##PAGE= N=1
##DATA TABLE= (X++(R..R)), XYDATA
$$ [...]
19540C08105D8326d5827B29426f905A45457k0351J04544F3080J02790c24737a56452
19528C29162C4929M5304a72247h2718F0812O1064g0009k2309C592b04561M0887
19517a63674H7446a50262F5821a00999j8431n5305Q5192b6518j22822A72272b85853
19505a88297C61783a56389G3478k8469K2337F504b64904n713M7974b2666B9998
19493b25399B06930a75506l8540k11964I632b01447j51249c279o6893o6307N9049
19482g7430l11738J57422K1091A80258E5965L0605K3572a49071k31703A05484
19471a47339G4109f0481k25826m026j5896J01379A77008a58597D0929c55069L90
19460c54679J75582J7768A74068B7494c03517Q2567N3197g8367G1253d01904d5376
$$ y = [308105, 48326, -45827, 229426, -6905, 145457, 125106, 229650, 63080, 165870, -324737, -156452, 329162, 34929, 80233, -172247, -82718, 60812, 121876, -70009, -92318, 3592, -204561, -163674, 87446, -150262, 65821, -100999, -119430, -174735, -89543, -26518, -149340, 172272, -285853, -188297, 361783, -156389, 73478, 45009, 67346, 6504, -264904, -270617, -222643, -22666, 29998, -225399, 206930, -175506, -214046, -426010, 9632, -201447, -352696, -3279, -70172, -136479, -77430, -389168, -231746, -210655, 180258, 55965, 86570, 110142, -149071, -380774, 105484, -147339, 74109, -60481, -286307, -290333, -306229, -204850, 177008, -158597, 40929, -355069, -354679, -179097, -161329, 174068, 27494, -303517, -220950, -167753, -78367, 71253, -401904, -45376]
19448D8119J14113e7630j8452j245A80960b71995G1695a66183J9266A2349a38747
19436a45475L7627K9980o6697B10137e7563o7155a034F95P9103J43945h7934j60010
19424b47944B81142A0392J48937c05352L4687k66792b57558C07286a06489B03693
19413A83041b89901A15585h4669B2802a36842A14838a572j34660n5426d7895h314
19401b78118j06829B7545f6203j3368l72918A41839C0638J64417j2997q6720O0160
19390A55498a58117A54138a09018C181a64634d6455j05627d7114A49248l1501
19380A17747b72409C15356a16529c0480A23759a58442q4120j24121J66638F3898
19369B80918A5179b195C3506a41439e9314E274f7100C26040E3531r643c28178
$$ y = [48119, 162232, -57630, -76082, -77327, 180960, -271995, 71695, -166183, -146917, 12349, -138747, -145475, -107848, -77868, -144565, 210137, -57563, -124718, -1034, 695, 79798, 223743, -87934, -247944, 281142, 10392, 159329, -305352, -270665, -537457, -257558, 307286, -106489, 203693, 183041, -289901, 115585, -84669, 22802, -136842, 114838, -1572, -136232, -191658, -47895, -8314, -278118, -384947, 27545, -66203, -79571, -452489, 141839, 30638, 195055, 182058, 95338, 155498, -158117, 154138, -109018, 3181, -164634, -46455, -152082, -47114, 149248, 117747, -272409, 315356, -116529, -30480, 123759, -158442, -242562, -366683, -200045, 63898, 280918, 15179, -2195, 33506, -141439, -59314, 5274, -67100, 326040, 53531, 43888, -328178]
19357b59702G8228J15118g6913q7449K9479n0128g6547j36705B45857d32979a18030
19345a50042a7887C1818M6843M7478d1085A46646e8369p9959m0640K000n0770
19334b27738e2324o7329j48836N3181k4326A05660b31120C8289J10195M1754b39914
19322b68170o4521f0318B92605G9820a60388E9615a14948k44614g600k0281j8262
19311d6143A552a89678B67338f3895m12045e4351B04196a23894A15392a79533
19300E5779a21653c3563g136o9005j76760J7985j5445G1088b83592g1573D934
19288E6701g0244o5718B6234A706c13643J19422p5340C2338a02509c7235C8641
19276a05409m500B9381j0078M03678A16758l7098L33602a01986j45199A03166
$$ y = [-259702, 78228, 193346, -76913, -164362, -134883, -185011, -76547, -213252, 245857, -432979, -118030, -150042, -17887, 31818, 78661, 126139, -41085, 146646, -58369, -138328, -178968, -176968, -227738, -52324, -119653, -268489, -215308, -239634, 105660, -231120, 38289, 148484, 190238, -239914, -268170, -332691, -60318, 292605, 79820, -160388, 59615, -114948, -359562, -7600, -27881, -46143, 1552, -189678, 267338, -63895, -475940, -54351, 204196, -123894, 115392, -179533, 55779, -121653, -33563, -7136, -76141, -252901, -234916, -250361, 71088, -283592, -71573, 4934, 56701, -70244, -135962, 26234, 1706, -313643, -194221, -269561, 32338, -102509, -37235, 38641, -105409, -109909, 29381, 19303, 422981, 116758, 79660, 413262, -101986, -247185, 103166]
19265B87801a37084E6726a22863M1469B8955J01345n1522J71916a5374r8420K5113
19254h8681C39539o6373n692b75557k2787A30841a18891p4402k33818a23391j30843
19243b54234f5449n2141B76728q8837p1948d8125A00546a76913A10941a44994
19232a3742q6660j80810n7905L3646N1407J05257a9549H0463a161q5315d0327
19220A66317b04197R1693H8706L6753a00689b8433C9095b99556d9238r7193O1641
19209h4790A15047R5627b25780L1677I000P6565a27373I4410A1056N1348i5835
19197G8559c12746A68106E7582b13791e4929l4840j7238I4519a54505A24918O1372
19186A86290b4928l1357j40693h6220l5095e5675l5177k38780c8948A250J8246
$$ y = [287801, -137084, 56726, -122863, -81394, 28955, 130300, 78778, 250694, -15374, -113794, -88681, 339539, 273166, 267474, -275557, -298344, 130841, -118891, -193293, -427111, -123391, -254234, -65449, -117590, 276728, 187891, 115943, -48125, 100546, -176913, 110941, -144994, -13742, -100402, -281212, -339117, -305471, -254064, -148807, -19549, 80463, -1161, -86476, -40327, 166317, -204197, -112504, 88706, 125459, -100689, -28433, 39095, -299556, -49238, -146431, -84790, 115047, 210674, -225780, -194103, 9000, 85565, -127373, 94410, 11056, 62404, -95835, 78559, -312746, 168106, 57582, -213791, -54929, -89769, -107007, 94519, -154505, 124918, 186290, -24928, -56285, -196978, -86220, -121315, -55675, -90852, -329632, -38948, 1250, 19496]
19175A9496c07431C386N6796h8199k53143a08490A25182b3396r6674B47405j1275
19164B36130I77b9492B16106a36727N5205j12502g5024J7186R314j96726A07622
19152B03263c3904k77913K6701q7276B5777J91842E2489h6039c7148l24393C2756
19140a63358L4092b9478j47971N8873h34B32496e4283m2581j72978n8498c2680
19128c2492h588n6984k16663b6438E6622G191K90153H2200e5961k99731f6576
19116F2181b52245a02147J7559E9898b64730j2726E0589a79311I0476a63524j83967
19105c47491a10621j98306A40208d22366G961d464A56884R0751a84403A75043
19094h2055H2770i0565k37210p9C6572d2132A65084b07145l29341C18811A01461
$$ y = [19496, -307431, 3386, 60182, -88199, -341342, -108490, 125182, -23396, -120070, 247405, 236130, 977, -29492, 216106, -136727, -81522, -194024, -75024, -57838, -48524, -245250, 107622, 203263, -33904, -311817, -285116, -372392, 25777, 217619, 52489, -86039, -37148, -361541, 32756, -163358, -129266, -29478, -177449, -118576, -834, 232496, -54283, -96864, -269842, -328340, -32680, -32492, -8588, -65572, -282235, -26438, 56622, 7191, 297344, 82200, -55961, -355692, -66576, 62181, -252245, -102147, -84588, 59898, -264730, -277456, 50589, -179311, 90476, -163524, -347491, -110621, -308927, 140208, -422366, 7961, -4464, 156884, 247635, -184403, 175043, -82055, 82770, -90565, -327775, -327854, 36572, -42132, 165084, -207145, -536486, 318811, 101461]
19082I8378a75253G0521f0908A92122a56419B89274b98357a25173k7185C51060
19071e4121A91166b53754r1032b8272I121a3578G3686P1949a24892m5015Q3188
19060h6719q3065F904b9541o9789I4023b20465B55659b09853P7856G6204b11753
19048c01182B45662c03660f1961G8006J8134h2649K6387m1016j47104a0973j34927
19037a45900k95713i8525M937j0961A661P7702J69145a19443A58622J49208q6523
19026B21307D2717I199a37112A9376a45891B95659A29935P905R2458a54780A73098
19014b17643B2244R7508g5528I9755d1597J756D25684C3055J51937E7940a28494
19002e7926A4702D105J00416K9219e7787b4195k86790p35I8346c15436D3001a67610
$$ y = [98378, -175253, 70521, -60908, 192122, -156419, 289274, -298357, -125173, -152358, 351060, -54121, 191166, -253754, -344786, -28272, 9121, -13578, 73686, 145635, -124892, -169907, -86719, -169784, 6904, -29541, -99330, 94023, -220465, 255659, -209853, -131997, 76204, -211753, -301182, 245662, -303660, -61961, 78006, 96140, -82649, -56262, -97278, -244382, -10973, -145900, -441613, -98525, -93588, -104549, 1661, 79363, 248508, -119443, 158622, 307830, 221307, 42717, 9199, -137112, 19376, -145891, 295659, 129935, 137840, 230298, -154780, 173098, -217643, 22244, 119752, -75528, 99755, -41597, -39841, 425684, 33055, 184992, 57940, -128494, -57926, 14702, 4105, 104521, 133740, -57787, -24195, -310985, -311720, 98346, -315436, 43001, -167610]
18989c81991a53649l3113M4159E4352a54516j4626R465A90259c266j21341j89910
18978c14517A19999E5988c85966A35488K1567i5898o1332n4770C6251Q1653f4791
18966a79441h1752J8620p9184B76907a16152k85714B16635a42138B17433b51626
18955c78685E19789B1171K00772a93353m4645i7548j226B70291C6859c19493e6674
18943a79048E8377b4911A98035o5393f4338B44353a28635a8648j89426k2656A52829
18931B19122B5020a47784D3648O0447f9469q1072b4560B41441a47884I816c89854
18919d1134k7141k25394B39177F208a73038A08004e4433B59248c93609a37063
18908E2232f511r5590A7630a05535j56943A44396b02814h0695B2185b90763J05607
$$ y = [-381991, -153649, -186762, -142603, 54352, -154516, -169142, -159677, 190259, -3266, -124607, -314517, 119999, 55988, -385966, 135488, 157055, -95898, -157230, -212000, 36251, 117904, -64791, -179441, -81752, -63132, -142316, 276907, -116152, -401866, 216635, -142138, 217433, -251626, -378685, 519789, 21171, 221943, -193353, -237998, -97548, -98774, 270291, 36859, -319493, -56674, -179048, 58377, -24911, 198035, 132642, -64338, 244353, -128635, -18648, -208074, -230730, 152829, 219122, 25020, -147784, 43648, 104095, -69469, -150541, -24560, 241441, -147884, 9816, -389854, -41134, -68275, -293669, 239177, 6208, -173038, 108004, -54433, 259248, -393609, -137063, 52232, -6511, -102101, 17630, -105535, -262478, 144396, -202814, -80695, 22185, -290763, -185156]
18897a85156I880q05Q7512A2560N9809J8104a38722A6699J25333j9581d3320E494
18884H4277a54702H937i3600q082k9732B04432q7423a41204m8522A96610a40910
18872a39133c6142C4274b1692j45401B4521b6703j99007a5864j91904A98961r4618
18861A04343a6557j74827O8139e4767C017c04156c7808J1316I1857f998j9804
18850b6802j70894K4082I5250K27412G7534K06234A37187a02565c1145r8709f3113
18838H0034J12165a09233a8291j5713q2822J510c0416k03824a9120A44642a13500
18826b94954B44181C5008e3227j2671A75482E9473E25O4735a76555I9677j2737
18815H6940I864K8177e2308A40523a0913A5962L145M48229a68228q0296i7864
$$ y = [-185156, 9880, 9075, 96587, 12560, 72369, 90473, -138722, 16699, 142032, 122451, -43320, 5494, 84277, -154702, 8937, -93600, -101682, -131414, 204432, 117009, -141204, -189726, 196610, -140910, -139133, -36142, 34274, -21692, -167093, 24521, -26703, -225710, -15864, -207768, 198961, 104343, -16557, -191384, -123245, -54767, 3017, -304156, -37808, -26492, 91857, -6998, -26802, -197696, -173614, 95250, 322662, 77534, 283768, 137187, -102565, -31145, -129854, -63113, 80034, 192199, -109233, -18291, -34004, -116826, -115316, -30416, -234240, -19120, 144642, -113500, -294954, 244181, 35008, -53227, -65898, 175482, 59473, 525, 65260, -176555, 99677, 86940, 9864, 38041, -52308, 140523, -10913, 15962, 19107, 467336, -168228, -248524, -97864]
18803i9818c1313m3958B40543I9181F218J08442m1215a69221L4350j99017K9693
18792c04195e8949m2793D59094d56777A89289b19369a08228j01052g3393B68834
18781a25398j39174J6026h4094j55239A8060a58131j24677h9038B29505a04427
18770E1494a29699j61857c5152B16587c0711j41732n774B8121b3915F8651J08001
18759A76652b24476P154p0257d3724A40971a04139A7865K37131E6088c36752F353
18747b44609Q2131e155j67668a688A97170r0365m5172b12290e0954j10076c6937
18735B50536b900B99145G9331o69J36377d3806q3816H0615f5512J5864C1550a08796
18722A62935F639K35004a74233o5813m6879H4909i3488F8767d06746B11893g1727
$$ y = [-99818, -31313, -75271, 240543, 99181, 6218, 114660, 73445, -169221, -134871, -333888, -304195, -58949, -101742, 459094, -456777, 189289, -219369, -108228, -209280, -73393, 268834, -125398, -264572, -248546, -84094, -239333, 18060, -158131, -282808, -89038, 229505, -104427, 51494, -129699, -291556, -35152, 216587, -30711, -172443, -178217, 28121, -23915, 68651, 176652, -224476, -217322, -287579, -43724, 140971, -104139, 17865, 254996, 56088, -336752, 6353, -244609, -162478, -5155, -172823, -1688, 197170, 106805, 61633, -212290, -50954, -161030, -36937, 250536, -2900, 299145, 79331, 78662, 215039, -43806, -127622, 80615, -65512, -49648, 31550, -108796, 162935, 6639, 241643, -174233, -240046, -286925, 84909, -93488, 68767, -406746, 211893, -71727]
18710h9552m9109O5737q6757r0837P140a13980g328j56618G0009b0939o2862G8405
18697c6750k11893E4865c80123A25660g1741J5169k25025J15238j16337B02112
18686g2187B15705c8600j62592a3457j38855C9108C732b10765e9646k14979O9038
18675b05587b6548k45760H571a53083I7712f8129H3059d10901E575L5375K2404
18664F3354J38920J08609j17808b37133E7889b06019A84219a72918A04340J14686
18654B19026b10754A14473e4871B21737a2396p7055B8909a06787k3518j00249
18644b30554f4561l64633a16657A8211K0718A2218a72647F9853c363l62956a49251
18632c9544D5709b49575c4845I7672a00793j12767d3380J5301j8832j31758c8806
$$ y = [-89552, -138661, -72924, -159681, -250518, -243378, -113980, -7328, -163946, 70009, -20939, -83801, 78405, -36750, -248643, 54865, -380123, 125660, -71741, -56572, -281597, -166359, -282696, 202112, -72187, 215705, -38600, -201192, -13457, -152312, 39108, 3732, -210765, -59646, -274625, -205587, -26548, -272308, 8571, -153083, 97712, -68129, 83059, -410901, 5575, 40950, 63354, 202274, 310883, 193075, -237133, 57889, -206019, 184219, -172918, 104340, 219026, -210754, 114473, -54871, 221737, -12396, -89451, 28909, -106787, -130305, -230554, -64561, -429194, -116657, 18211, 38929, 12218, -172647, 69853, -3363, -366319, -149251, -39544, 45709, -249575, -34845, 97672, -100793, -213560, -43380, -28079, -46911, -178669, -38806]
18620a74361Q0035B9029a27227D407L3776K6621a42005A03078A0928a31383j49376
18609b80759N3264a0437B22297b45181H7593a03201B19999a96096d8550j70718
18599b19268d0716A28949L3481J3494R9823b60140J01022F6484i4106G8781J738
18588H0519O2046O5420k2298E9092j1390n204r878a7263k74013f1632F2732k0991
18576D1741A3053b2936j61919e8930j44205M7460B1307c06501F6075a07103k92385
18565c99488C9124J41063H534b05114N9875a5666r3580A00085c37091h1654n6419
18554a38073A70419d5117A07179f2284j22312A55255a11965d9305B61699b89159
18543a4076C12709I3557C000a3266j46612j89708I8565M7802b01509l30652A73247
$$ y = [-174361, -94326, 29029, -127227, 4407, 38183, 64804, -142005, 103078, 10928, -131383, -280759, -227495, -10437, 222297, -245181, 87593, -103201, 219999, -196096, -48550, -219268, -40716, 128949, 162430, 175924, 275747, -260140, -159118, 66484, -94106, 78781, 80519, 142565, 207985, 185687, 59092, 47702, 42498, 32620, -17263, -291276, -61632, 62732, 41741, 13053, -22936, -184855, -58930, -203135, -155675, 21307, -306501, 66075, -107103, -399488, 39124, 180187, 8534, -205114, -145239, -15666, -109246, 100085, -337091, -81654, -138073, 170419, -45117, 107179, -62284, -184596, 155255, -111965, -49305, 261699, -289159, -14076, 312709, 93557, 3000, -13266, -159878, -349586, 98565, 146367, -201509, -532161, 173247]
18531b95165J03371j62100N7337I7878a86288H2456N9629F098J68856c00884M8207
18520b52677j07439A32134C0400D295e1778A09412i7990c5178F5246K91523C4165
18508i1602E4382a7939q2162J5599c2760E3348k3687c16280e3695B53344J1749
18497B65093g7385O100m6398C85812j55703a92643j07085A05427J27562a43170
18486c68060a12186a6528p5621p5290F5389O5907n7539b71603b5684j35089F9268
18474c51070J71393h1554A83087h4512B1878a01846b0080k32H823a00760A66697
18462c65029c7547A97438h2750b5285A62194J7639a90899P7360G8306A1330R549
18451B0879K78114C8746a06059j24451b4853j42230j9766B85641F2954K2955c130
$$ y = [-295165, -191794, -353894, -296557, 97878, -186288, 82456, 142085, 6098, 174954, -300884, -252677, -360116, 132134, 30400, 4295, -51778, 109412, -97990, -35178, 65246, 356769, 34165, -91602, 54382, -17939, -100101, -84502, -32760, 53348, 29661, -316280, -53695, 253344, 265093, -77385, -71285, -117683, 385812, 230109, -192643, -299728, 105427, 232989, -143170, -368060, -112186, -16528, -92149, -167439, 65389, 131296, 73757, -271603, -25684, -160773, 69268, -351070, -179677, -81554, 183087, -84512, 21878, -101846, -20080, -20312, 8823, -100760, 166697, -365029, -37547, 197438, -82750, -25285, 162194, 179833, -190899, -113539, 78306, 11330, 20879, 298993, 38746, -106059, -230510, -24853, -167083, -186849, 285641, 62954, 85909, -3130]
18439B6210b16885N3206A17790b92411A13193b04953o5361a20070B95672g9718
18428g9520p2338j3669f1394A3152b91485A92556b1067R292D03843j67314g2690
18416E6353i307j10241M5622K7356j04310m9485C9571P0985b09115N6998o4744
18405b16861O2213q2493C168c65024F5142a83198I2942N6024D0303K83244b90876
18393b17639A09622K05299a09944j08912J02470C55369g6372A05397l9262a21912
18382h9903m80209a79096O6910a6721k49448A17659k2320k3280i2865B3275n962
18371A7313p448N0173E76L8169r111f3589b5408E5892J3909A9769J38254a68304
18358C71037c3387k2964J6910A32603h9767h125p06A17451i5173A31187O1071
$$ y = [26210, -216885, -163679, 117790, -292411, 113193, -204953, -270314, -120070, 295672, -79718, -79520, -151858, -165527, -61394, 13152, -291485, 192556, -21067, -11775, 403843, 236529, -72690, 56353, -9307, -119548, -73926, -46570, -150880, -200365, 39571, 110556, -209115, -152117, -216861, -154648, -237141, 3168, -365024, 65142, -183198, 92942, 148966, 40303, 323547, -290876, -217639, 109622, 314921, -109944, -218856, -116386, 355369, -76372, 105397, 66135, -121912, -89903, -570112, -179096, -112186, -16721, -266169, 117659, 95339, 72059, -92865, 23275, 17313, 9865, 60038, 576, 38745, 29634, -63589, -25408, 55892, 69801, 19769, 158023, -168304, 371037, -33387, -56351, -39441, 132603, -89767, -8125, -8831, 117451, -95173, 131187, 192258]
18347A92258a51064j69921C2142h2098r6584B8897K1128a27758J5633A05603a70906
18335b68471F8498L6926b12787Q9411j36709F1394a73726A50313a60098A26473
18324B42264d1753B82570F4026a54932B6519Q6316b2243A38946K32838a18477
18313A48487h3850n9025j01854B1147N4182d84410d5158n3849A1028a05265I8931
18301b9599M928A51469A9133i6917H2320L6304D2983b83615A29480o3223B0435
18289B00501J22639j04675H4395J50155L305o2019o6031a87410g7091A74700a76005
18277C0185c13689I3629f8828q4312D154J49930a27666A33470D7554R6947A5618
18265a70824f5749I7908a24545M628j91370B13182c31690g3255k67079A12239
$$ y = [192258, -151064, -320985, 32142, -82098, -178682, 28897, 50025, -127758, -112125, 105603, -170906, -268471, 68498, 105424, -212787, -123376, -260085, 61394, -173726, 150313, -160098, 126473, 242264, -41753, 282570, 64026, -154932, 26519, 112835, -22243, 138946, 371784, -118477, 148487, -83850, -142875, -244729, 21147, 75329, -484410, -45158, -99007, 11028, -105265, 98931, -29599, -24671, 151469, 19133, -96917, 82320, 118624, 42983, -283615, 129480, 66257, 20435, 200501, 323140, 218465, 84395, 234550, 237855, 175836, 109805, -187410, -77091, 174700, -176005, 30185, -313689, 93629, -68828, -153140, 4154, 154084, -127666, 133470, 47554, 144501, 15618, -170824, -65749, 97908, -124545, -119917, -311287, 213182, -331690, -73255, -340334, 112239]
18254A57993b76221j2221R6701G7846F792i7384A08742b52172D5593a03054n25297
18243f28351B2672b29531j81692C9240a66140H1402P7902g3732c1339k24405A21127
18231A3182b05851B16J7426b62726e9439A92444m4780Q244B2502b6477A5894J94298
18219B10192j04656l993a67090f2521p4660B10399I2156h453j0618k91635B5715
18207a16904k80644a96675r9413A55736C7980h4304A07763K3053a47486b0501
18196H0344J401a14166A20299l2826b71876P1226A22151f1624l21962e2283L298
18185d8985p7154l249F7037M1691a49127A59973g9217n2628A60095b04710A17095
18173e29557E6643K85821F2734J31470a16039J3914k23583E4469a115k18975k73566
$$ y = [157993, -276221, -288442, -191741, 77846, 6792, -97384, 108742, -252172, 45593, -103054, -628351, 22672, -229531, -411223, 39240, -166140, 81402, 159304, -73732, -31339, -255744, 121127, 13182, -205851, 216, 17642, -262726, -59439, 192444, 147664, 155908, 22502, -26477, 15894, 210192, 105536, 101543, -167090, -62521, -137181, 210399, 92156, -8453, -19071, -310706, 25715, -116904, -397548, -196675, -296088, 155736, 37980, -84304, 107763, 130816, -147486, -20501, 80344, 81745, -114166, 120299, 87473, -271876, -200650, 122151, -61624, -383586, -52283, -48985, -126139, -129388, 67037, 108728, -149127, 159973, -79217, -131845, 160095, -204710, 117095, -529557, 56643, 342464, 62734, 194204, -116039, -102125, -325708, 54469, -1115, -220090, -493656]
18162d93656C0798c74491A23286k4006J25547a6470I7061B2059f7166b7536j78902
18151b06438A66577k7884C1993g533A47605d2124K0237m5658B87789f9170B94729
18139b30312A24616K03696b12607Q547B4698J58993n0047f458j62043K2684O9558
18128g6259j8142m3390j90476b2737j52917D0770A9246b31554O519A85652e8697
18116f5383E0737N0244N8238a89139b1516p0349c5716n4283A30639d41653A28615
18104c6658B5344h1530a7330l7505k4999j37397A07632c97657C56068b4329F2577
18092A7051K6678b38078j497A8184i6105L4912j31270A02429a2342n51302K34148
18081c29496a23829A61190P0407l4957a10996G9871c938C59647d9958F4365M4933
$$ y = [-493656, 30798, -374491, 123286, 99280, 224827, -16470, 97061, 22059, -67166, -27536, -206438, 166577, 138693, 31993, -7533, 147605, -42124, -21887, -67545, 287789, -69170, 294729, -230312, 124616, 328312, -212607, -204060, 24698, 183691, 133644, -6458, -168501, -145817, -76259, -94401, -137791, -328267, -22737, -175654, 40770, 19246, -231554, -225035, 185652, -58697, -65383, 50737, 100981, 159219, -189139, -21516, -91865, -35716, -89999, 130639, -441653, 128615, -36658, 25344, -81530, -17330, -54835, -79834, -217231, 107632, -397657, 356068, -24329, 62577, 17051, 43729, -238078, -239575, 18184, -96105, -61193, -192463, 102429, -12342, -563644, -329496, -123829, 161190, 231597, 196640, -110996, 79871, -3938, 359647, -49958, 64365, 109298]
18070A09298a16097b5434A84106P9094A03547J51546a03980a0796F3374b27877
18059d8814D09623a94531A04453L7933J2995a89023a5805l17816a29487j82555
18049c12042e8128G502J36787b1949B5553d0478j2270B93092A45349G428f1210
18037A8625K5993J12354C3079c5006j46589M5940l1117a7147m0315j32121h3707
18025A60101c31034A72029q5839J24991I264O211a64267A55757C7519M9195b2134
18013a3183d025k45795Q0073C06383a39082A29737a11528A08772a12461j02777
18003b15238B47333a32235f2229o9892M4988A48719K51639a40506l9328f717r151
17992a5868k51973D7728f0589j14590C04683b03172P1237O4754a6176k12487b9468
$$ y = [109298, -116097, -25434, 184106, 263200, 103547, 255093, -103980, -10796, 63374, -227877, -48814, 409623, -194531, 104453, 142386, 155381, -189023, -15805, -333621, -129487, -312042, -58128, 7502, 144289, -21949, 25553, -40478, -52748, 293092, 145349, 7428, -61210, 18625, 44618, 156972, 33079, -35006, -181595, -135655, -166772, -17147, -57462, -189583, -83707, 160101, -331034, 172029, 86190, 211181, 9264, 15475, -164267, 155757, 37519, 86714, -22134, -13183, -4025, -249820, -169747, 306383, -139082, 129737, -111528, 108772, -112461, -215238, 247333, -132235, -62229, -132121, -87133, 148719, 400358, -140506, -179834, -6717, -15868, -267841, 47728, -60589, -175179, 304683, -203172, -131935, -67181, -16176, -228663, -29468]
17980H8204b49416A92142l9727h3201b5505B2990P4703g8552A929N2049b705l3174
17968c5879H9657i789k0896f016o3663l42241c3253A04677O7455b75018B67691
17956a65850k0521B36929q1501G2836a3920j42734k83543I1659b28986K2384a3934
17944a04416r2715q2394A88406c11321a16920C4651M3839c7947q5090B28952b2053
17932a75476k84998a148A49549N1234D1956K00210A15673J47871a46039A26239
17921a12691E8651g2714C61247H5773a04189a5514k7648H5358b10002l7986A15645
17909i3072j03646A01267B5103a61142a7582G2599c4794o1384A9969f9207K5296
17898d3911I6910A9817c28513B39065q6313C2210R5703a93269K8137b636q7880
$$ y = [88204, -249416, 192142, 152415, -83201, -25505, 22990, 97693, -78552, 1929, 53978, -2705, -35879, 89657, -9789, -30685, -6016, -69679, -411920, -33253, 104677, 172132, -275018, 267691, -165850, -186371, 236929, 155428, 72836, -13920, -156654, -440197, 91659, -228986, -206602, -13934, -104416, -197131, -279525, 188406, -311321, -116920, 34651, 78490, -37947, -123037, 228952, -22053, -175476, -460474, -1148, 149549, 200783, 41956, 242166, 115673, 263544, -146039, 126239, -112691, 58651, -72714, 361247, 85773, -104189, -15514, -43162, 85358, -210002, -247988, 115645, -93072, -196718, 101267, 25103, -161142, -17582, 72599, -34794, -96178, 19969, -69207, -43911, 96910, 19817, -328513, 239065, 152752, 32210, 127913, -193269, -165132, -2636, -90516]
17887i0516R810o5949b8971A04211a35045C69297a50400A91283E0386b36493a0368
17875B52827B8975b17345C2822e6834B08964F5328L0725R4916c18272R7786G6673
17863b53844c5119j2871A90318L4176f1637l2000G9862a27779J0831A29018a10473
17851F7557c23258I3275J8604J272C3034b6289b355B7251e8398k14939A12541
17839B84772a8285q9347A59300a24287C8752a27572A92057R6378r5585A843a032
17827b00153R7868L7701b5897k05696J042p9795Q2472j22371C2859K44390e6830
17815a66178g5526A43181n0478J33589J9030A09919b10419H7457A8670b98924
17804E2499a89366B6652a60118A00467J50148B8429J66644a66356e970F6674C904
$$ y = [-90516, -80706, -146655, -28971, 104211, -135045, 369297, -150400, 191283, 50386, -236493, -10368, 252827, 28975, -217345, 32822, -56834, 208964, 65328, 96053, 190969, -318272, -220486, 76673, -253844, -35119, -47990, 190318, 224494, -61637, -93637, 79862, -127779, -116948, 129018, -110473, 67557, -323258, 93275, 111879, 113151, 33034, -26289, -2355, 27251, -58398, -273337, 112541, 284772, -18285, -107632, 159300, -124287, 38752, -127572, 192057, 288435, 192850, 1843, -1032, -200153, -102285, -64584, -25897, -231593, -230551, -310346, -227874, -350245, 32859, 277249, -56830, -166178, -75526, 143181, 92703, 226292, 245322, 109919, -210419, 87457, 18670, -298924, 52499, -189366, 26652, -160118, 100467, 250615, 28429, 195073, -166356, -5970, 66674, 3904]
17792H8754K5000J01418e9105k51078a31199L9817D1586a1670k59314j17120D3652
17780a02129b0824l0672B6597M18513A65002N0408h4742G5704J25688M4641i2263
17768b63804p974d2475k10930G210J64843a19452I1497J1359A576M3412c689j39824
17756a43513A50915l7709b74036A1423O6725O2170a7700l01539a59339B94940
17745F3330j3793b5113D15872i0430D06225A52199f8253j10294A90198A0727R2
17734A0819K19086p4295k5821b0380e903A92844g486k30263M1850j48577a07871
17722a93144C8884c9760A98826M4278h7598q0328k4675B2350f6133k24264A51238
17710b0278H0615B6957a52918f040F651J19725b58924A97623b0721A8744a3180
$$ y = [88754, 113754, 215172, -59105, -310183, -131199, -91382, 41586, -11670, -270984, -388104, 43652, -102129, -20824, -51496, 26597, 445110, 165002, 215410, -84742, 75704, 201392, 246033, -92263, -263804, -271778, -42475, -253405, 7210, 172053, -119452, 91497, 102856, 1576, 44988, -3689, -143513, 150915, 113206, -274036, 11423, 78148, 140318, -17700, -319239, -159339, 294940, 63330, 49537, -25113, 415872, -90430, 406225, 152199, -68253, -178547, 190198, 10727, 10819, 229905, 155610, 129789, -20380, -5903, 192844, -7486, -237749, -195899, -344476, -107871, -193144, 38884, -39760, 198826, 243104, -87598, -167926, -192601, 22350, -66133, -290397, 151238, -20278, 80615, 26957, -152918, -6040, 6651, 126376, -258924, 197623, -20721, 18744, -13180]
17698A21311L6121F7443j0324h3571A84582c9879H2492J83747h0645A24435d9904
17686B28129K602A5097R1661a55239L5283j81609a04172n1824f9209C3539N919
17675C9458J64437f0120j16202B93352d5741B6565J01516C3077c4783E5117J21643
17664A76760g1190B84318F1947J31583K7267A03956b664j45919b8676B2849a10528
17652g703k38412A67827a2612m69403B00652b36878O2607B07441C0559a1525C4434
17640b4197C18923b05730A69564b79639i6641E19968k11956E7176J41400H1756
17629C9589a2945q0231A10963a30157A36246g2869g832B09297a35143L3980J9451
17618h1712d10k6553A84822L6734D0400a50343c0990j75934A62825m8297C8488
$$ y = [121311, 157432, 67443, 57119, -83571, 184582, -39879, 82492, 266239, -80645, 124435, -49904, 228129, 230731, 15097, 106758, -155239, -119956, -301565, -104172, -155996, -69209, 33539, 39458, 203895, -60120, -176322, 293352, -45741, 26565, 128081, 33077, -34783, 55117, 176760, -71190, 284318, 61947, 193530, 220797, 103956, -2664, -148583, -28676, 22849, -110528, -7703, -246115, 167827, -12612, -482015, 200652, -236878, -174271, 207441, 30559, -11525, 34434, -24197, 318923, -205730, 169564, -279639, -96641, 519968, 308012, 57176, 198576, 81756, 39589, -12945, -93176, 110963, -130157, 136246, -72869, -7832, 209297, -135143, -101163, -81712, -410, -26963, 184822, 221556, 40400, -150343, -30990, -206924, 162825, 114528, 38488]
17606a34567A84772e9047l20273a5753A57801E0953K8369b452E0147K64915k1723
17595B93339a3015k53270O7465j05878g2771A63006J80031C0503i4001I8670b44089
17583a40852m1791P0907R646B13152m3873G4998P6119c8431H463J14979D0831
17571a76666M7151E4695B0317J75164O4565b2172F8413j3485f8478n7432o3669
17560a89579A2102O7671g7391A2080J74695n3362c11432C73509A54285K02382
17550C56667I7299Q4437Q1724F4919L1432r4D2710A4203i4952B07844G3032c24973
17537B61015A5230f424B59420b48310h588D3687K50640A18938c21137R8592J02574
17526a19971n7441d8232n6167j73641a20762m5535E2918N4645O2701e2830A79798
$$ y = [-134567, 184772, -59047, -379320, -15753, 157801, 50953, 79322, -2452, 50147, 315062, 293339, -13015, -266285, -198820, -304698, -72771, 163006, 343037, 30503, -94001, 98670, -244089, -140852, -182643, -111736, -102090, 213152, 169279, 74998, 151117, -38431, 8463, 123442, 40831, -176666, -129515, 54695, 20317, 195481, 260046, -22172, 68413, 54928, -68478, -125910, -189579, 12102, 79773, -77391, 12080, 186775, 133413, -311432, 373509, 154285, 356667, 97299, 181736, 263460, 64919, 96351, 96257, 42710, 14203, -94952, 207844, 73032, -324973, 261015, 15230, -6424, 259420, -248310, -8588, 43687, 294327, 118938, -321137, -222545, -119971, -177412, -48232, -104399, -278040, -120762, -166297, 52918, 107563, 170264, -52830, 179798]
17514C8506J61210o5540F1432J04617G1754M9805n5709a01949B24116a44069f8415
17502A5746f9751k93840h3353g29j65098A06801m1141k69J8263J64140Q6262k439
17490C31617I6581a37816C0003M6739a16939B19751a00006B54765a5147A84025
17479H2665L39412j95988J80187A94190c06014G8814c5038A40102b8893G4477
17468I7505g4528E8648J20649K60345H0642N5324D1874N736j7712O8473K27223
17457C25594A22027J67055i1209J4385B29734J34943j08441m8707c4177B34602
17446D36099j52868B6065K99049r9361k6236L09762Q7574B60037j19935R2426
17436B32528F6269L04248A76528J46055O5690j71906O4170c2507A10320e255A74310
$$ y = [38506, 199716, 134176, 61432, 166049, 71754, 121559, 65850, -101949, 224116, -144069, -68415, 15746, -69751, -363591, -83353, -729, -165827, 106801, 65660, 65391, 83654, 247794, 334056, 331617, 96581, -137816, 30003, 76742, -116939, 219751, -100006, 254765, -15147, 184025, 82665, 422077, 226089, 406276, 194190, -306014, 78814, -35038, 140102, -28893, 74477, 97505, -74528, 58648, 179297, 439642, 80642, 135966, 41874, 47610, 29898, 98371, 325594, 122027, 289082, -91209, -76824, 229734, 364677, 256236, 207529, -34177, 234602, 436099, 283231, 26065, 325114, 225753, 199517, 509279, 596853, 260037, 140102, 232528, 66269, 370517, 176528, 322583, 388273, 216367, 280537, -32507, 110320, -5255, 174310]
17424B10441L8468b31638C19962J1109n9791A08583J62967J31937n7016K84797
17414F31268B72554r8884L8965J09595q0186A01124K14622j27370J86748A10532
17403A21010J98417A55706b0930G5000h6610H7726b0372C13187F8522L6532n1572
17392E3482b03258A63505E367L3873L71017j39485J62949A17420E6362j3729L15927
17381C58560a0791B34681A15900J05614N1975I8347g9854I3066j3100M10017j22285
17370C67698A81506h215A58728F4376A115K29097J43440A83322n18n4100O7233
17359A95937b9022C62122G9726K53392O5932I8942a06069C38820E3630h7844B38046
17347A45877c6895A66614G5859L20774j13122N697J10933g0869A66035P4350a32135
$$ y = [210441, 248909, -231638, 319962, 331071, 271280, 108583, 271550, 403487, 346471, 631268, 272554, 173670, 212635, 322230, 242044, 101124, 315746, 188376, 375124, 110532, 121010, 319427, 155706, -20930, 75000, -86610, 87726, -20372, 313187, 68522, 105054, 53482, -203258, 163505, 5367, 39240, 410257, 270772, 433721, 117420, 56362, 42633, 358560, -10791, 234681, 115900, 221514, 273489, 98347, -79854, 93066, 79966, 489983, 367698, 181506, -8215, 158728, 64376, 1115, 230212, 373652, 183322, 182804, 128704, 195937, -29022, 362122, 79726, 333118, 399050, 98942, -106069, 338820, 53630, -87844, 238046, 145877, -36895, 166614, 75859, 396633, 283511, 289208, 400141, -70869, 166035, 240385, -132135]
17335b40512H0949J9067J40122F1931e9060n4427L0865A32134a90551I8047j7394
17324H0653K31569l5141j05743D6268M69311B10591a98896B19620J6716r7030
17314A39306J70685A08890R8970j8016L3584o525P8120L2167k8589A49230J64151
17303C13381A20774m1858b29121A80168Q274G0957b39264b9280j06396E41291
17292H9600m239b4504C22438F0074M8020J84751D864J39215m6418K1399L4213
17281A53273J64080E2124j6249N2349L91448i0735B79898I5020J33245g4915n8995
17270a33910A89072g4077j21957L7951B36215A12978D9189g2654k36334B11201
17259I9973K90488r1754j00353C0986J3930J41872C88L79733a40230E0678J90658
$$ y = [-240512, 80949, 100016, 240138, 61931, -59060, -113487, -82622, 132134, -190551, 98047, 80653, 312222, 277081, 171338, 46268, 515579, 210591, -198896, 219620, 236336, 139306, 309991, 108890, 207860, 189844, 223428, 216903, 295023, 327190, 298601, 149230, 313381, 120774, 78916, -229121, 180168, 188442, 70957, -239264, -29280, -135676, 541291, 89600, 85361, -24504, 322438, 60074, 108094, 292845, 4864, 144079, 97661, 119060, 153273, 317353, 52124, 35875, 88224, 479672, -90735, 279898, 95020, 228265, -74915, -133910, 189072, -74077, -196034, -158083, 236215, 112978, 49189, -72654, -308988, 211201, 99973, 390461, 298707, 198354, 30986, 44916, 186788, 388, 380121, -140230, 50678, 241336]
17248B41336o0675J62511j00104p2440q3055M03752B24745I9199J67316l3810
17238B32705r2402o8343L34346H6904C683e4844C55055E9713J57304I6430K47692
17227C44122B4171J32773J97087A45944J42605J89663A42723K69327A71739J44451
17217C16190A24345J02063k2707I9342j921C3897L97574r3084A48721m1664K18439
17206C25496Q3650j12033I4801J27652j434l5192K72896E6487K50568q27h1380
17194E06126B19812R926J57366F2631J1375M08444j68185p3202n7663R5111J67658
17183D46169k06772A01411a27860D53044B0601L36225R1180j17365J25655l2500
17173D23796j2719C2198M21316n8215a41180C29832j34800L36239A80819J22619
$$ y = [241336, 180661, 343172, 243068, 170628, 87573, 491325, 224745, 99199, 266515, 232705, 140303, 71960, 406306, 86904, 3683, -54844, 355055, 59713, 217017, 96430, 344122, 24171, 156944, 354031, 145944, 288549, 478212, 142723, 412050, 171739, 316190, 124345, 226408, 203701, 99342, 97421, 33897, 431471, 338387, 148721, 107057, 325496, 409146, 297113, 94801, 222453, 221019, 185827, 458723, 56487, 307055, 306228, -81380, 506126, 219812, 229738, 387104, 62631, 74006, 482450, 314265, 241063, 183400, 278511, 446169, 239397, 101411, -127860, 453044, 20601, 356826, 448006, 330641, 456296, 423796, 411077, 32198, 453514, 395299, -141180, 329832, 195032, 531271, 180819, 303438]
17163C03438K42106K4122k29985p7295K99821A82451J67209J18549k0516j04218
17153C43475O4525b1706D02778j59145j0159A15975K35437A37208K77205R5956
17143E10369K907j37617q4504m7458J97229j1754N1494D6234M56200m8975p7704
17132C75755J16070j04159K80099q5537A71848J83489j442J8848J19410A35661
17121F2576K12580J73241K33811j20758m0463k20582K68255k59022J45431k13001
17111B42068I7276K13119K65846k76811J6334Q5643K15449B08558J68051L2889
17101D09498l3912j34836O3973M94151k91321q0263R919j47934K58070K2912J03412
17090F73669M2470k94739r3559L45700K21285C04567J37534K0780r522A80221
$$ y = [303438, 545544, 569666, 339681, 262386, 562207, 182451, 349660, 468209, 447693, 343475, 408000, -21706, 402778, 243633, 233474, 115975, 351412, 137208, 414413, 510369, 513276, 375659, 291155, 243697, 440926, 429172, 480666, 46234, 502434, 453459, 375755, 491825, 387666, 667765, 582228, 171848, 355337, 353895, 372743, 492153, 135661, 62576, 275156, 448397, 682208, 561450, 520987, 300405, 568660, 309638, 455069, 242068, 97276, 310395, 576241, 299430, 315764, 401407, 616856, 208558, 376609, 409498, 375586, 240750, 304723, 798874, 507553, 427290, 437209, 289275, 547345, 570257, 673669, 716139, 421400, 327841, 673541, 894826, 304567, 442101, 462881, 453359, 180221]
17079B41802Q2931J46089m482J35346j19176K21266k35262L94161C37175K26485
17069E63660N5146B87212r7313L94327k16801O765L15945l3150n2471F8096N63476
17058F31572F5927N04527o2909J98333J50207k34630K49395j88381j32961Q4399
17048F33907j10256m1596M20015l52481j71599J86293M9616K16151C17452J27885
17038D45337J12452J46738o2967l0981o4959J3416J05523k13680L18370J09179
17028H78428M0989k59049l18776N10433J26330k15818k78682K79770k6072B66847
17017H44387p5334j4105C68932L66249A61320M75241K12664p6652L33222l58509
17007G47286L18299j40571k06825J80558J12545l58536J22803j00103J92416k77370
$$ y = [241802, 324733, 470822, 466340, 601686, 482510, 703776, 468514, 862675, 337175, 563660, 618806, 287212, 189899, 584226, 367425, 374190, 690135, 656985, 604514, 68096, 631572, 65927, 570454, 507545, 705878, 856085, 621455, 870850, 682469, 549508, 633907, 523651, 482055, 902070, 549589, 377990, 564283, 613899, 830050, 317452, 445337, 557789, 704527, 641560, 610579, 545620, 559036, 664559, 450879, 769249, 878428, 919417, 660368, 341592, 852025, 978355, 762537, 483855, 763625, 737553, 266847, 844387, 769053, 754948, 368932, 735181, 161320, 636561, 849225, 772573, 1105795, 747286, 1065585, 925014, 718189, 898747, 1011292, 652756, 775559, 675456, 867872, 590502]
16997E90502J45634K65450j23436P7777O0946j55451k7387R9845j09106l9610
16987G85164L03737k66329K03340k38112L94380n69621L07071j88640n9410K65070
16977I36650L07227m62155M20255j57823k63311M70461M164j14510n0504j81331
16967I09123M2230R7569J50873O8422l64390m865J95676J97529J1488k45407j14015
16956I44233L40403l63847L28929j91234P7229O7243n9706J33266K09947l74027
16946A112436L23363k56403J20016j17450J21371J48319j65432M67258l61133
16937A392345R3977p0199o20967L61732k5977k0523M26255j80832J22623Q7662
16927A566096j50372p2483M98124l92694k7886m5009p2287J60670R5596K71837
$$ y = [590502, 736136, 1001586, 878150, 955927, 1016873, 861422, 834035, 933880, 824774, 785164, 1088901, 822572, 1025912, 787800, 1182180, 612559, 919630, 730990, 671580, 936650, 1243877, 781722, 1201977, 1044154, 780843, 1251304, 1255468, 1140958, 1090454, 909123, 951353, 1048922, 1199795, 1268217, 903827, 898962, 1094638, 1292167, 1303655, 1058248, 944233, 1284636, 920789, 1249718, 1058484, 1135713, 1202956, 1143250, 1276516, 1486463, 1112436, 1435799, 1179396, 1299412, 1181962, 1303333, 1451652, 1286220, 1753478, 1392345, 1486322, 1416123, 795156, 1156888, 1130911, 1110388, 1536643, 1355811, 1478434, 1566096, 1415724, 1343241, 1841365, 1448671, 1420785, 1375776, 1303489, 1464159, 1559755, 1831592]
16917A831592l68115M41528k44969M2478O2028j99063P6076J91068k80957K12599
16907A764265j61808M6494n6716K89857k01174K33399J06504J24767l64206L96841
16897B178223l04794K94765m4457j20528N68306n56004R4828j56613N53522l49465
16887B157783N4160k05512J57691K53761k5259p4875O1401K28523p4659j34263
16877B398751K73580j1429J73870Q855J59623l30126j55211K49309O8907J7869
16867B853998K35518l684J65774j18729J44496p2164l09606J46773J84139K35587
16857C462102j74611j08572M15501P2288k35274J28280j35149K28295j3071J1492
16847C651281K14325j37875L43635J23373l58956K04554K39845J62255J08835
$$ y = [1831592, 1463477, 1905005, 1660036, 1702514, 1764542, 1565479, 1641555, 1832623, 1551666, 1764265, 1602457, 1648951, 1592235, 1882092, 1680918, 1914317, 2020821, 2145588, 1781382, 2178223, 1873429, 2168194, 2123737, 2003209, 2571515, 2015511, 2110339, 1953726, 2507248, 2157783, 2211943, 2006431, 2164122, 2417883, 2392624, 2317749, 2379150, 2607673, 2533014, 2398751, 2672331, 2660902, 2834772, 2843627, 3003250, 2673124, 2517913, 2767222, 2836129, 2853998, 3089516, 3085832, 3251606, 3132877, 3277373, 3205209, 2895603, 3042376, 3226515, 3462102, 3287491, 3178919, 3594420, 3666708, 3431434, 3559714, 3424565, 3652860, 3639789, 3651281, 3865606, 3727731, 4071366, 4194739, 3835783, 4040337, 4280182, 4442437, 4551272]
16838D551272m36977q8587O89545k14j88800k98783N23805M20925j13462J09981
16828E168705R8754k5001j31233J50492M64362j48742L0107J14384M85989l48215
16818E859602L2936L33740P6805N7742O71577m3727J37366l10277J89020J85370
16808G190154Q0318K31889J72432L63781L44970m5576r9479L92893q805J29927
16798H752504O03207J69564J31021J36497M47265K61373k3873K43693M1383M13646
16788A1176280M87336L59557M63943L22554l4945Q58293K03907L98440q3990M89060
16778A4640435P75803O60132O5957N23286N08355O15730N84046L14992J025708
16769A9714444M49180O11156R01540P05847P67714O10836J083775J071638Q06619
$$ y = [4551272, 4114295, 4025708, 4715253, 4715039, 4526239, 4227456, 4751261, 5172186, 5058724, 5168705, 5267459, 5242458, 5111225, 5261717, 5726079, 5577337, 5607444, 5721828, 6207817, 5859602, 5892538, 6226278, 6303083, 6360825, 7032402, 6988675, 7126041, 6815764, 7004784, 7190154, 7270472, 7502361, 7674793, 8038574, 8383544, 8337968, 8238489, 8631382, 8622577, 8752504, 9355711, 9525275, 9656296, 9792793, 10240058, 10501431, 10477558, 10721251, 10762634, 11176280, 11663616, 12023173, 12487116, 12809670, 12774725, 13633018, 13836925, 14235365, 14151375, 14640435, 15416238, 16076370, 16142327, 16665613, 17173968, 17789698, 18373744, 18688736, 19714444, 20163624, 20774780, 21676320, 22382167, 23149881, 23760717, 24844492, 25916130, 26722749]
16760B6722749R48236J004906J256408J098764J673492R21144J521198J465751
16752C6612648K161559J361823J625114K543872J764652J935912K001693K710981
16744E2718254K749085L058600K676489L395896L720592L313821M012062M007508
16736G9652307M544282M646587M807747N287575N446049N713749O437466O060769
16728A22596531O118788O603005O693575O542665O408562O407836N474819N149518
16720A71995299M095970M023624K467414J628443N92012r28656j415047l039207
16712A79419852l360797m597110n344617n748504o270410o633534o299004o957124
16704A34208752o921116o592345o730533n745421o003808n791386n540036m800076
$$ y = [26722749, 27670985, 28675891, 29932299, 31031063, 32704555, 33625699, 35146897, 36612648, 38774207, 40136030, 41761144, 44305016, 46069668, 48005580, 50007273, 52718254, 55467339, 58525939, 61202428, 64598324, 68318916, 71632737, 75644799, 79652307, 84196589, 88843176, 93650923, 98938498, 104384547, 110098296, 116535762, 122596531, 128715319, 135318324, 142011899, 148554564, 154963126, 161370962, 166845781, 171995299, 176091269, 180114893, 182582307, 184210750, 184802762, 183874106, 182459059, 179419852, 176059055, 171461945, 166117328, 160368824, 154098414, 147464880, 141165876, 134208752, 127287636, 120695291, 113964758, 108219337, 102215529, 96424143, 90884107, 86084031]
16696H6084031n030067m447764m380732l928111l806222l414056k945230l364740
16688E4767109k446133k587106k878169k261220j923702k206730k116053j590657
16680C6757339j758724j462596j419538j594241j029755j374628j268165o77681
16672B6172011j442039j292334k82403j124369n16371j094829p45944q64249l39412
16663A8470061j089801l58925j54034j054877r8498r28183n54999k99739m13089
16654A3517916j95406o45649q5261m56814o22773j5027l32019m39373k5674p49633
16644I950287j92781m38186L9582K2507o18075q361j98854l50676n5508j66443
16634G983492p63799K09933r3608m75494l3151k33573M7618l44329L85687n82411
$$ y = [86084031, 81053964, 76606200, 72225468, 68297357, 64491135, 61077079, 58131849, 54767109, 52320976, 49733870, 46855701, 44594481, 42670779, 40464049, 38347996, 36757339, 34998615, 33536019, 32116481, 30522240, 29492485, 28117857, 26849692, 26172011, 24729972, 23437638, 23155235, 22030866, 21514495, 20419666, 19673722, 18809473, 18470061, 17380260, 17021335, 16867301, 15812424, 15713926, 14785743, 14230744, 13931005, 13517916, 13322510, 12676861, 12591600, 12134786, 11512013, 11496986, 11164967, 10725594, 10699920, 9950287, 9757506, 9319320, 9358902, 9381409, 8763334, 8754973, 8556119, 8205443, 8149935, 7983492, 7219693, 7429626, 7336018, 6860524, 6827373, 6593800, 6641418, 6297089, 6682776, 6100365]
16624F100365Q2242l81044L79621m88124l36799L0743r0962l6717j16267j58710
16614D984348k14465n6931N2738K40839l70902j37504l30744K02303k89651K2884
16604D102915l8098p5678k28310K17693k99308j00340K83647k39605l98913J11843
16594C335846j56008J40677k87625j19302N58815k43440k90545k8157l01592J51504
16584B760173J06197k23239j32007J10786J24641Q6089m56931K91249k49221K24695
16574B642432l76426J80981l59091n2694l477J49181J26228j55369q9406K66823
16564B329182j86118m29020L29586j24093j20332l2633K71633J14524k98229P8022
16554A932522K2072k82230j50860L58449p1329j6223j6584K48506j69919k46579
$$ y = [6100365, 6182607, 5801563, 6181184, 5693060, 5356261, 5387004, 5296042, 5259325, 5143058, 4984348, 4769883, 4712952, 4765690, 5006529, 4635627, 4498123, 4167379, 4369682, 4080031, 4102915, 4064817, 3989139, 3760829, 3978522, 3679214, 3578874, 3862521, 3622916, 3224003, 3335846, 3179838, 3320515, 3032890, 2913588, 3472403, 3228963, 2938418, 2910261, 2608669, 2760173, 2866370, 2643131, 2511124, 2621910, 2746551, 2832640, 2375709, 2666958, 2417737, 2642432, 2266006, 2446987, 2087896, 2035202, 2031725, 2180906, 2307134, 2151765, 2062359, 2329182, 2143064, 1714044, 2043630, 1919537, 1799205, 1766572, 2038205, 2152729, 1854500, 1932522, 1954594, 1672364, 1521504, 1879953, 1808624, 1792401, 1775817, 2024323, 1854404, 1607825]
16544A607825l83219J79578J46620k8017O7136J76395j83902l14548n525o6331
16534A196012L00047J19607l41277K03801l65286K08942R8341k02084n6652K00906
16524A362357j1600j74695K66633j7106j0921k70624N26913l14352O9341k15792
16514A210154p9482J9855J53443j40169q6689R4788k50498L16375k05476k94334
16504G37967N6142O1263P4723L16164l15678L58871n24444J08798j48534L10004
16494A035276J4410k40627j55388J31512k49639M13698j1557K07576k65713L1913
16484I11461l70900q7230N16720l84441M87362D81718L5060J32032P6750K28846
16474I54406l4213C12897O15014l62333K60637k08859M39135m46719K66538j00556
$$ y = [1607825, 1224606, 1404184, 1550804, 1522787, 1589923, 1766318, 1582416, 1267868, 1262343, 1196012, 1496059, 1615666, 1274389, 1478190, 1112904, 1321846, 1420187, 1218103, 1161451, 1362357, 1350757, 1176062, 1442695, 1425589, 1414668, 1144044, 1670957, 1356605, 1425946, 1210154, 1130672, 1150527, 1303970, 1163801, 1077112, 1171900, 921402, 1237777, 1032301, 737967, 794109, 855372, 930095, 1246259, 930581, 1289452, 765008, 873806, 725272, 1035276, 1049686, 809059, 653671, 785183, 535544, 949242, 937685, 1145261, 879548, 911461, 540561, 453331, 970051, 585610, 1072972, 481718, 516778, 648810, 725560, 954406, 920193, 312897, 927911, 565578, 826215, 617356, 1056491, 609772, 876310, 775754]
16464G75754n5111m4395J21606j08645j98265J93641l41032O52662D86066K9630
16454E15696P8950M9431J88247j30885n3614o0044r1945L6708j49752M9790Q4117
16443E16699q3255L04586k74813q5792p2232Q3072p0924L22099M9160k53450K31942
16432F67092j42398K16003k69541j66698L94314j6070l38189L42683B70501N0147
16422C20648J97784k38308n9276L52977q221B12585F8621N42738B07824K50280
16412D58104j45012K50857k65382K59540j31003J33073k31111O863o7065J89851
16402D58715J88818r5705j84851R9680j07434n8414K79422b21946C44988J65152
16392E10140j66634g002E34858A94240J88189J32192k55611L5198K11170A59022
$$ y = [775754, 720643, 676248, 797854, 689209, 490944, 684585, 343553, 996215, 486066, 515696, 594646, 644077, 832324, 701439, 647825, 587781, 495836, 532544, 382792, 432582, 516699, 433444, 738030, 463217, 377425, 305193, 388265, 317341, 639440, 688600, 435150, 667092, 524694, 740697, 471156, 304458, 698772, 682702, 344513, 687196, 270501, 320648, 518432, 280124, 220848, 573825, 565604, 212585, 68621, 611359, 207824, 458104, 313092, 563949, 298567, 558107, 427104, 560177, 329066, 335929, 268864, 458715, 647533, 551828, 366977, 466657, 359223, 300809, 580231, -221946, 344988, 510140, 343506, -7002, 534858, 194240, 382429, 514621, 259010, 294208, 505378, 159022]
16381A74171j3931K10515G1245L42806J68015K3778j1128B92906D2216K97716
16371C39932D7803J38872J62608J11729A27539J609K7899A8517L46367K75895
16361F40779A55232L0779m3959O09274j68037k37526l541a28559B42866L7804
16351B80670J12951d2074C38272K074K59275B37632b8850A19557A5667K11928
16341B27595J16184a84091D42956g6921B24613C3297M70182j60891j36332K60819
16331D67075j72700G1885J16980a2579A27151m7754L03048A64312M84812k30808
16321D18316A33084k6902N3223k2968n8967P6862K17940q7768q4144N2139a60088
16309C27028j33133J20465j0024A51920b07207A90572F8239n610J75547n900I1738
$$ y = [174171, 160240, 370755, 71245, 414051, 582066, 605844, 594716, 292906, 42216, 339932, 47803, 186675, 349283, 461012, 127539, 129148, 157047, 18517, 364884, 640779, 155232, 186011, 142052, 751326, 583289, 345763, 342222, -128559, 242866, 280670, 393621, -42074, 338272, 340346, 599621, 237632, -28850, 119557, 15667, 227595, 343779, -184091, 442956, -76921, 224613, 33297, 503479, 342588, 206256, 467075, 294375, 71885, 188865, -12579, 127151, 79397, 382445, 164312, 649124, 418316, 133084, 106182, 159405, 136437, 77470, 154332, 372272, 284504, 200360, 252499, -160088, 327028, 193895, 314360, 304336, 151920, -207207, 190572, 68239, 62629, 238176, 232276, 91738]
16297A07089K82633r6875q0374a22077A5681P8841K40338A58286J96782A39681
16286a75060A12351k3958C9106M13621k22579I7984f5907A72527K42473k03694
16276B11306n4941j7773Q8607c6204C05374F8329c6222H6111l3447c37539G7010
16264E8752J40744c0464l12393B19135H1114a69714f1073d234l9082A39484M0124
16253A79608a1121A85540J49520j55989b28821R4474A8806K07644c8168A1960
16242A93027m9776F2324K56493D0284L7458N6486J61175A16919L6446P6593a48342
16230A06496k7206g4079A17394c000k37869o9425C52165C6627J15478k9219J37788
16219B60674b15070I6260g2754D48007H6381j8892e6439A78356i5633B50413D3351
$$ y = [107089, 389722, 292847, 212473, -122077, 15681, 94522, 334860, 158286, 355068, 139681, -175060, 112351, 88393, 39106, 452727, 230148, 97984, -65907, 172527, 415000, 211306, 156365, 138592, 227199, -36204, 305374, 68329, -36222, 86111, 52664, -337539, 77010, 58752, 199496, -30464, -342857, 219135, 81114, -169714, -61073, -4234, -43316, 139484, 179608, -11121, 185540, 335060, 179071, -228821, -134347, 18806, 226450, -38168, 11960, 193027, 143251, 62324, 318817, 40284, 77742, 134228, 295403, 116919, 153365, 229958, -148342, 106496, 79290, -74079, 117394, -3000, -240869, -310294, 352165, 36627, 152105, 122886, 260674, -215070, 96260, -72754, 448007, 86381, 67489, -56439, 178356, -95633, 250413, 43351]
16207A15448O5503c73121n1442E6560A3117c249B05492d7570j15788B17454o6712
16196A50742h713m8628C998b91845d8461Q368J9045A76216c609E6363k3399c8297
16183d853C34188E6027M21578A98386c04982B04031c43892C29210A21225a65827
16172C1200b63621f2561j88490c694A33667k2724c47423a13130q5169A86468b37196
16160G3876h3724A42159i4157A28999a81547r8245C41131j66861i7195A18096
16149G5204J61302c9474j05559C51893j18179A03843O7010L3606a27327C07159
16138C41381C4263a36198D22031B2403R3626J59117J92507i7153k5573B64065
16127a63507N6694B58854a31521j89058A83106a3414A64535k6031l5662g8379
$$ y = [115448, 180951, -373121, -424563, 56560, 13117, -3249, 205492, -47570, -163358, 217454, 150742, -8713, -57341, 3998, -291845, -48461, -40093, -21048, 176216, -3609, 56363, 32964, -38297, -4853, 334188, 56027, 477605, 198386, -304982, 204031, -343892, 329210, 121225, -165827, 31200, -263621, -62561, -251051, -3694, 133667, 110943, -347423, -113130, -198299, 186468, -237196, 73876, -83724, 142159, -94157, 128999, -181547, -279792, 341131, 174270, -97195, 118096, 75204, 236506, -39474, -145033, 351893, 233714, 103843, 170853, 204459, -127327, 307159, 341381, 34263, -136198, 422031, 22403, 116029, 275146, 467653, -97153, -122726, 264065, -163507, -106813, 258854, -131521, -320579, 183106, -13414, 164535, 138504, 102842, -78379]
16116A9290c93686J86291i1621j03580h4609a6757D1286J54748H4269b82318J23021
16105a59297B52193o1002b7050n1684D54970A01325l8091P9027J58819a3190A72018
16093a56n0268D05799c51592a9420k35294G4016J25561b79508B24894A01641J36702
16082B38343b32474H2790N4356b49949j44183a17039F6847K04192d314F7498h9927
16070b34047M3150e5925J480I6386l2589J3608b03830A21034c87670A5120Q4040
16059I9160J59197a01239A36685c61070i5387E8013B2839d10783D0948a4641B53009
16047a35860d060j66502l12975A4129g0727B1621c9933B6156f6050a7279F6038
16035f0045A60414J27166b57769g6035a2013A91102M5894a1615k20549R7562L4260
$$ y = [19290, -393686, -207395, -91621, -195201, -84609, -16757, 41286, 196034, 84269, -282318, -159297, 252193, 191191, -27050, -78734, 454970, 101325, 63234, 142261, 301080, -13190, 172018, -156, -50424, 405799, -351592, -19420, -254714, 74016, 199577, -279508, 224894, 101641, 238343, -232474, 82790, 137146, -249949, -394132, -117039, 66847, 271039, -4314, 67498, -89927, -234047, -190897, -55925, -54445, 96386, 63797, 77405, -203830, 121034, -387670, 15120, 99160, 258357, -101239, 136685, -361070, -95387, 58013, 22839, -410783, 40948, -14641, 253009, -135860, -4060, -170562, -483537, 14129, -70727, 21621, -39933, 26156, -66050, -17279, 66038, -60045, 160414, 287580, -257769, -76035, -12013, 191102, 236996, -11615, -232164, -134602, -100342]
16024a00342K23C1770a56467A96000c08128A54325o5652d87410c2122C00163j30413
16013A69750l82A3804a96192D47794e7454A40511h9087k13577k9276E39296h3116
16001I7683f9157E1593J19235c77442D4276J69264i0230I1239a01759A35080b66750
15989e276o135B77870F0609b3443B53099p1484P8000E1669J24186C0646j1251
15978A9395J49658b0523l04085N7155a24373E2582J22900d8495H1935a71538G5198
15966a12496j22719A06976a14420L9917I9863N7153c24783d5673n7611h163B10089
15954e1756J5799n0597b320H25K26045a8634j41689I1717i743A72069j55o2279
15942A09635b62390a7064j05636A8886b82139r8357A83236a56839j54573h1035
$$ y = [-100342, -100119, 31770, -156467, 196000, -308128, 154325, 88673, -487410, -32122, 300163, 169750, 169368, 13804, -196192, 447794, -57454, 140511, -89087, -302664, -331940, 539296, -83116, 97683, -69157, 51593, 170828, -377442, 44276, 213540, -90230, 91239, -101759, 135080, -266750, -5276, -11411, 277870, 60609, -23443, 253099, 181615, 259615, 51669, 175855, 30646, 19395, 169053, -20523, -324608, -267453, -124373, 52582, 175482, -48495, 81935, -171538, 75198, -112496, -235215, 106976, -114420, -74503, 99863, 157016, -324783, -45673, -103284, -8163, 210089, -51756, -35957, -86554, -2320, 825, 226870, -18634, -160323, 91717, -9743, 172069, 171914, 109635, -262390, -17064, -122700, 18886, -282139, -380496, 183236, -156839, -311412, -81035]
15931A711a23582H2730d5379A49771e3616C37790a22352c2166B11801K3171b26593
15919b29604e2689m1551C8808a00745k03400a08700o0651M8147F2884O9063i3843
15907D01648a04525c0193C5598J4517a54196F1638L16685a09870r8153I7399a51733
15895A48096a04273i303j26487C5303P2257b4015l55971f588j10219B26631e7094
15883a46117q6919A22039k922k8972b76997i6576B0063a2666l49979a06717A81577
15871a13212q2225G7356b9646c978j41872K0217A00994f5738o3769c1299c316
15859B16232K2204a04047G3338c50825C03277i5253n5365b149l86501a9486H7397
15847B48157a8852k61418J22560D262K70278j32840a77644A60166b20330B3461
$$ y = [1711, -123582, 82730, -45379, 149771, -53616, 337790, -122352, -32166, 211801, 234972, -226593, -229604, -52689, -94240, 38808, -100745, -304145, -108700, -169351, -121204, 62884, 131947, -93843, 401648, -104525, -30193, 35598, 50115, -154196, 61638, 378323, -109870, -208023, 97399, -151733, 148096, -104273, -9303, -135790, 35303, 107560, -24015, -379986, -6588, -116807, 226631, -57094, -146117, -233036, 122039, 119117, 90145, -276997, -96576, 20063, -12666, -362645, -106717, 181577, -113212, -195437, 77356, -29646, -3978, -145850, -125633, 100994, -65738, -129507, -31299, -3316, 216232, 238436, -104047, 73338, -350825, 303277, -95253, -150618, -2149, -388650, -19486, 87397, 248157, -18852, -280270, -157710, 4262, 274540, 141700, -177644, 160166, -220330, 23461]
15836D8721e48174h4855C1701b39226C24383G0713O3217a24461d5375l30788J5959
15825c60204A2069d3802B08122J62385j68825b47424B46135a09136q4297j78303
15815c71736h7612A90644a71394A4869g6649A94385b18635e6690j79628a138r5255
15804i6393B47676j02775e2896m6456k34926J11927R8214N7409L96A47125n8938
15793H8187a89015B37704f324I5277c8424j31992G7758c3518j36206F0754a99070
15781d13332a19905a0408r0141A68636a15816r520q3286D2384h5783a2009n01951
15770e13960B64960b7489F1907a96917B55139a32276B35674n3119n5234a00021
15759B58938a6955k3073j06752A7373b99751B30609m2632c41579C1688a86862
$$ y = [48721, -548174, -84855, 31701, -239226, 324383, 70713, 133930, -124461, -45375, -376163, -360204, 12069, -43802, 208122, 370507, 201682, -247424, 246135, -109136, -193433, -371736, -87612, 190644, -171394, 14869, -76649, 194385, -218635, -56690, -236318, -1138, -96393, 247676, 144901, -52896, -99352, -334278, -222351, -124137, -66728, -66332, 147125, 88187, -189015, 237704, -6324, 95277, -38424, -170416, 77758, -33518, -169724, 60754, -199070, -413332, -119905, -10408, -100549, 168636, -115816, -125336, -208622, 42384, -85783, -12009, -513960, 264960, -27489, 61907, -196917, 255139, -132276, 235674, 182555, 127321, -100021, 258938, -16955, -40028, -146780, 17373, -299751, 230609, 187977, -341579, 31688, -186862]
15748b24858C1575e8808A89506B6967i1922p5816L2942G5568l6307L38050b58256
15736b67882o9648b7042O356I8620J19649b40203j40227R0631Q8015E7458B1456
15724b75533A55455a14989L1531C42804a31037A24738J39972e8521I0082J25691
15714B15773g08I9645a52961e3905A45425c08419C1806b0208B13266b40627B38733
15702a8340l9477n3370m5363A57987c3547F23782a85941C0603d6104A96412D24
15690A10664N4011Q4626a10166A5597B218K24171E0674a65191n1618E6013O3615
15679A19628d2519A15580a28671D8687a1624r9283E4378a18604B73069A0513R7698
15668A08211M502D3726J35235A9670h2677a7937r3727r4j41647B85958k1823i9986
$$ y = [-224858, 31575, -58808, 189506, 26967, -91922, -167738, -134796, 75568, 39261, 377311, -258256, -267882, -337530, -27042, -20686, 98620, 218269, -240203, -380430, -289799, -201784, 57458, 21456, -275533, 155455, -114989, -83458, 342804, -131037, 124738, 264710, -58521, 90082, 215773, -708, 99645, -152961, -53905, 145425, -308419, 31806, -20208, 213266, -240627, 238733, -18340, -57817, -111187, -156550, 157987, -33547, 623782, -185941, 30603, -46104, 196412, 424, 110664, 164675, 249301, -110166, 15597, 2218, 226389, 50674, -165191, -216809, 56013, 119628, -42519, 115580, -128671, 48687, -11624, -110907, 54378, -118604, 273069, 10513, 108211, 112713, 43726, 178961, 19670, -82677, -17937, -111664, -111758, -253405, 285958, 264135, -99986]
15655a30278C12602j40092l7244a55230P1388C36302b21250B5987J24379J01539
15645B51905b708A08508J05050a63754g6746D3347b58528J19324A00989h0068
15634A32992e387k03484i1231G9407K75457I6541c13779i1789B07359A8445J27706
15623A46151b78311Q5072a9147A86724q5210a85464a1476A81581a11300l1133
15613a42433B02284b88051o8826B41304n1635b77916g4530p8129F7640c88997
15602a69818A48982J34224c1807J5635l6460b3773j82111A25184b4900o7700k01987
15591b94587l3868Q3051G6228g502j02097A41673n8678a69942E1693P8407e6311
15579A12010b62913F9015b69333i152E2857b86945e0954j78398O3694r3475A06015
$$ y = [-130278, 312602, 172510, 135266, -155230, -83842, 336302, -221250, 25987, 150366, 251905, -2708, 108508, 213558, -163754, -76746, 43347, -258528, -139204, 100989, -80068, 132992, -5387, -208871, -91231, 79407, 354864, 96541, -313779, -91789, 207359, 18445, 146151, -278311, -193239, -19147, 186724, 101514, -185464, -11476, 181581, -111300, -142433, 202284, -288051, -356877, 241304, 189669, -277916, -74530, -152659, 67640, -388997, -169818, 148982, 283206, -31807, -16172, -52632, -23773, -205884, 125184, -24900, -92600, -294587, -328455, -245404, 76228, -7502, -109599, 141673, 82995, -169942, 51693, 130100, -56311, 112010, -262913, 69015, -269333, -9152, 52857, -286945, -50954, -229352, -165658, -259133, 106015]
15567a09651L9586B47742p5272H612K57471G9892a77277B82947a1196j084j23093
15556a35373m568k320c1726j30849A77378c58142J27916n8439a33261D4434K87383
15545C31817d0220C311b52116j26331I6224b09206m4827M7051a9693A82664C2142
15533i1448l43173a90277A90573P6169C5021c8824k41018C8284d82861H9907L5869
15522A25776a70307f0875A83042b01248A92385a03502r0541O392L10A19836d1631
15510A1841g5158o5906B8871b25174q454A25246o0744b8075k6817D6600P590K0168
15498G4358g5019D21581B7005J19265a18406A22355c0341C65821G6218a03153
15487e6492b1141g107B1109J68003a33738d9573B10742b52607F7825L7715K6893
$$ y = [-109651, -70065, 247742, 172470, 8612, 266083, 79892, -177277, 282947, -11196, -12280, -135373, -139941, -142261, -31726, -162575, 177378, -358142, -230226, -288665, -133261, 44434, 331817, -40220, 3311, -252116, -378447, 96224, -209206, -254033, -206982, -19693, 182664, 32142, -91448, -434621, -190277, 190573, 266742, 35021, -38824, -279842, 38284, -482861, 89907, 125776, -170307, -60875, 183042, -201248, 192385, -103502, -194043, -187651, -187341, 119836, -41631, 11841, -75158, -141064, 28871, -225174, -233628, 125246, 64502, -28075, -54892, 46600, 54190, 74358, -75019, 421581, 27005, 146270, -118406, 122355, -30341, 365821, 76218, -103153, -56492, -21141, -7107, 21109, 189112, -133738, -49573, 210742, -252607, 67825, 105540, 132433]
15476A32433a95745A67242A4098a89435A7303J37475B5739O0223f029G4971f8385
15464f3469q3274e3585j0378L1583A75754h742E6236b39745A24337O63j20N0527
15452A75407L3804N9059a70370P1075j6427q6485a825A48712M8846a46821B26528
15440B89f9353k7936H9331M0851k8985b8715A72135c38547B7415L03807k1182
15429C10040a47988b6848k8845B63444a0919q8915l8673j51866B00357C6304R7847
15418A34151g5345A61130b78171h0405A79144h8769k4327A31627J88839a12757
15407A30792c9880A36160h9011k80330d2793J9166A3484a13836k3205A25095D9712
15395a8191k49320B37899a05153C8332P2092l0213l0333b0668j91634A78190a55413
$$ y = [132433, -195745, 167242, 14098, -189435, 17303, 154778, 25739, 85962, -6029, 74971, -68385, -63469, -146743, -53585, -63963, -32380, 175754, -8742, 56236, -239745, 124337, 125000, 124880, 175407, 209211, 268270, -170370, -99295, -115722, -202207, -1825, 148712, 197558, -146821, 226528, 289, -69353, -97289, 89331, 130182, 101197, -28715, 172135, -338547, 27415, 331222, 310040, -147988, -26848, -55693, 263444, -10919, -99834, -138507, -290373, 200357, 36304, 134151, -75345, 161130, -278171, -80405, 179144, -88769, -113096, 131627, 320466, -112757, 130792, -39880, 136160, -89011, -369341, -42793, -23627, 13484, -113836, -137041, 125095, 49712, -18191, -267511, 237899, -105153, 38332, 110424, 80211, 49878, -20668, -212302, 178190, -155413]
15383a31699n1978C99431b67930h2885A69542O1380c5604C57722c1196l1740K174
15372f0762a328j69383A82603G6823O762K33615A34105B2045K69199j39972g0570
15360B63938O9219E4347J40097R4110a58913P2508l75035A22012j9425f3845q5627
15349a49472d5817B49575a88314M2705d4929A49588a11710c5420A0782N7851J65395
15338B34028a73626j19803L6694L2491A05045l6219L26653g3756G7417K861J14866
15327A95144m2455F7444J62187e6566A31909J59294g8174p6735j19446a4350k5840
15316d0190G3682c83503B0613i2943l393B76398j05559b08577E6715b30106A63994
15304B75918e7308A97486a88009F1704K45075d2975D73955k20015A11198K403
$$ y = [-131699, -183677, 399431, -267930, -82885, 169542, 230922, -35604, 357722, -31196, -62936, -60762, -1328, -170711, 182603, 76823, 83585, 317200, 134105, 22045, 291244, 151272, -70570, 263938, 333157, 54347, 194444, 288554, -158913, -86405, -461440, 122012, 102587, -63845, -149472, -45817, 249575, -188314, -145609, -44929, 149588, -111710, -35420, 10782, 68633, 234028, -173626, -293429, -256735, -224244, 105045, 68826, 395479, -73756, 77417, 80278, 195144, 152689, 67444, 229631, -56566, 131909, 291203, -78174, -154909, -274355, -14350, -40190, 73682, -383503, 20613, -92943, -96336, 276398, 170839, -208577, 56715, -230106, 163994, 275918, -57308, 197486, -188009, 61704, 306779, -42975, 473955, 253940, 111198, 113601]
15294A13601a7393B00131j9130R5710a02987C27536E5032Q8043L3188Q0946j05611
15283A51598b0362k44711A5648l82K7566e4872E253R9285J34150A144Q8300i5752
15270A34108O7420P4952G8831K7509P8878a8613A93809J6244i7844r527A71231
15258A84616c0843E8212h9736G277N09175b16614J08112i000j12223d8932G79862
15246A201676J93562k18331P02034I01306C80337j5428a03123C02668N6951I8116
15235B27377d4015j1934j86314n7145d5537A35554B9892j4178J5370d4804F1097
15223A30470J2064o7366b91796a08551H3140K31109b8243k2685A72005c15175
15212a06280r1118H7425c0752A25219l7581B3378M991J78485C0094L02783j22541
$$ y = [113601, -17393, 200131, 181001, 276711, -102987, 327536, 55032, 143075, 176263, 257209, 151598, -20362, -265073, 15648, 15266, 42832, -54872, 5253, 104538, 238688, 1144, 89444, -95752, 134108, 201528, 276480, 78831, 106340, 185218, -18613, 193809, 210053, -97844, -107371, 171231, 184616, -30843, 58212, -89736, 7277, 516452, -216614, -108502, -9000, -121223, -48932, 779862, 1201676, 1395238, 1176907, 1878941, 901306, 380337, 364909, -103123, 302668, 359619, 98116, 227377, -44015, -55949, -242263, -299408, -45537, 135554, 29892, 15714, 31084, -44804, 61097, 130470, 142534, 75168, -291796, -108551, 83140, 314249, -28243, -50928, 172005, -315175, -106280, -197398, 87425, -30752, 125219, 87638, 23378, 28369, 206854, 30094, 332877, 210336]
15201B10336a87625h2324B28986c37662B2409a45595q1369i9711A95869q0530
15191A15339f703J387o9005A31593g7422A37809m5003e6281B37426k0963N4860
15180B71323m4025p5938k8462b782A30286m4992g6281A44097a83348B13125L0286
15169B43411a08145B95069j31036j5725j5982f5252G1838e9540A26709l1369j2301
15158H3039J41528p860r6523C210J41298h1644i513B01718J32049n8687o0649
15147B14431j02008L5453n6091O1155H52J6365a70829E0659K87357j07360l2126
15136A98530B4399L17061Q6244D032K80873N7131A15577J69865G5840c74458C70778
15124b21942A74042n0457a12814I7726L1307K00616j2188A23971m5418L0049a38227
$$ y = [210336, -187625, -82324, 228986, -337662, 22409, -145595, -226964, -99711, 195869, 115339, -6703, -5316, -74321, 131593, -77422, 137809, 92806, -56281, 237426, 216463, 271323, 227298, 151360, 122898, -2782, 130286, 85294, -76281, 144097, -183348, 213125, 243411, -108145, 295069, 164033, 148308, 132326, -65252, 71838, -59540, 126709, 95340, 83039, 224567, 216707, 120184, 3210, 144508, -81644, -9513, 201718, 333767, 275080, 214431, 112423, 147876, 91785, 152940, 852, 17217, -170829, 50659, 338016, 230656, 198530, 24399, 341460, 427704, 4032, 284905, 342036, 115577, 285442, 75840, -374458, 370778, -221942, 174042, 123585, -112814, 97726, 129033, 329649, 317461, 123971, 78553, 108602, -138227]
15112B17233a2726E7725q073b50947A46144J32004J56998o8759A33007h2725C0669
15100C53535A37618L5975J4779D5879P7808n165R5296J56439A66586j7555C8910
15088b05213I4150K42791K7042M0186B2451o55K44355L5387N921a60429L9840
15077a20589D16588j42291A34116a28053G3802J90518B7699o14d942B77308h6246
15065C9406L17177a28462B75856E0636M99040B6517K53159H697K25542J03158
15055C37397I9735J17703L6530p5432J76477K1305B1250n323M82405j69685J01970
15044D30617A92621J64568G5303K43542e7004a0000j36663A0419J85870L1369
15034B27658L1897A9577M02526C8213M39081E7049f3150C02338H03L56068A09772
$$ y = [217233, -12726, 57725, 49652, -250947, 146144, 278148, 435146, 366387, 133007, -82725, 30669, 353535, 137618, 173593, 188372, 45879, 123687, 118522, 213818, 370257, 166586, 149031, 38910, -205213, 94150, 336941, 363983, 404169, 22451, 21796, 266151, 301538, 307459, -160429, -120589, 416588, 274297, 134116, -128053, 73802, 264320, 27699, 27085, -4942, 277308, -86246, 39406, 356583, -128462, 275856, 50636, 549676, 26517, 279676, 8697, 234239, 337397, 99735, 217438, 253968, 178536, 355013, 376318, 21250, 15927, 498332, 328647, 430617, 192621, 357189, 75303, 318845, -57004, -10000, -146663, 10419, 196289, 227658, 259555, 19577, 422103, 38213, 477294, 57049, -63150, 302338, 803, 356871, 109772]
15022A03360J87806j41489J4745a61293B71210j25320l8031d3319B09479B4530
15011B31994m1153J381l0495O9121K0572a73927B05101a97939A36718L49730D4115
14999A36629R4172I5917J73504j08546n9163D8626Q3260b8434B56409H3595J57265
14988B40860b69882A07251k5390J80420j08520Q1306m9700P4844J3965a89180
14977C63916A31764b3366A46138l6269M6980p2379J76643k3777K39046k00211
14967B76171L2698j09820J67887A40045K91676j01671p6596M06815C24934n2529
14957B72405n016n2352b4618D72983k29940J8719r4025q2835M92988A61426J75067
14946C36493A31990P8483Q1928R8778A03534M7426O3259J98098J63172j39505
$$ y = [103360, 291166, 149677, 164422, -161293, 271210, 145890, 107859, -43319, 209479, 24530, 231994, 190841, 192222, 161727, 230848, 251420, -173927, 205101, -197939, 136718, 486448, 44115, 136629, 230801, 95917, 269421, 160875, 101712, 48626, 131886, -28434, 256409, 83595, 240860, -269882, 107251, 81861, 262281, 153761, 235067, 185367, 260211, 274176, -189180, 363916, 131764, -23366, 146138, 109869, 156849, 84470, 261113, 237336, 476382, 276171, 308869, 199049, 366936, 140045, 431721, 330050, 253454, 660269, 324934, 272405, 267389, 215037, -24618, 472983, 243043, 261762, 167737, 84902, 577890, 161426, 336493, 131990, 210473, 292401, 391179, 103534, 150960, 214219, 412317, 575489, 435984]
14936D35984A65659K55102j77579K6292A25128L10559j71325r1170K95432J10969
14926E79593j08861B25126M9190r9341J11773M726k9219j5819J10420M218j07895
14915B53179j7745j12783J7911L28097k27319A0829J10860J69314C4650L83105
14905D17755k02988J02256K8667A5952L93479j60796J8575o4113J16726j24984
14895A94839q2396J93338j49017J53351B8864M68876k3673b9479b605C62214n4117
14884C08097K42226J7872J60813l34371j60148N35999C23734n315J95631k08576
14874C05474M44203j72203B34610K74704A50656K28691J54760L35669B26909A04436
14863F68622o8983k16798m3623J49757J4658r6853K06384I8556L30063j50496
$$ y = [435984, 165659, 420761, 243182, 269474, 125128, 435687, 264362, 173192, 468624, 579593, 470732, 225126, 274316, 174975, 286748, 291474, 262255, 246436, 356856, 361074, 253179, 235434, 122651, 140562, 468659, 241340, 10829, 121689, 291003, 34650, 417755, 214767, 317023, 345690, 15952, 409431, 248635, 267210, 203097, 319823, 194839, 112443, 305781, 156764, 310115, 28864, 497740, 474067, -29479, -2605, 362214, 308097, 550323, 568195, 729008, 394637, 234489, 770488, 323734, 318419, 514050, 305474, 749677, 577474, 234610, 509314, 150656, 379347, 534107, 869776, 226909, 104436, 668622, 599639, 382841, 339218, 488975, 503633, 406780, 613164, 98556, 428619, 278123]
14853B78123O5887L83341k09709q8973A17489L11542K65451j85928J49648k44440
14843D13762A71148N79984j59038A25280O93144j75484j37939K8173k05080K24895
14833E52989K27545j74703l0481k84550L80563q208k49479K14473A34406P1132
14823B05538N10747N5653k42055r9136R0439j68739J53405p6409l446j30101O6910
14812C62806Q9961J19649K64209C00254J93020J09612J1311j04430K23486C31620
14801C83395Q846M65658D17290K23041k13223L36438k58574j75233K90510j99602
14791D20647Q0596J38032B30051K07173k42j38018J2973M13336p7833k30799J99024
14780F15665B45660M86945j81300J06938M7315l04111J73387J81500k1334l46153
$$ y = [278123, 344010, 727351, 517642, 428669, 117489, 429031, 694482, 508554, 658202, 413762, 171148, 751132, 592094, 125280, 818424, 642940, 505001, 533174, 328094, 552989, 780534, 605831, 575350, 290800, 671363, 663155, 413676, 628149, 134406, 205538, 716285, 771938, 529883, 430747, 521186, 352447, 505852, 429443, 425997, 295896, 362806, 452767, 572416, 836625, 300254, 493274, 602886, 614197, 509767, 733253, 331620, 383395, 392241, 857899, 417290, 640331, 427108, 763546, 504972, 329739, 620249, 420647, 501243, 639275, 230051, 437224, 436982, 298964, 311937, 725273, 647440, 416641, 615665, 245660, 732605, 551305, 658243, 705558, 401447, 574834, 756334, 735000, 388847]
14770C88847J01618j78035L10555J1411p0953K91278N283k50045l2898J67994
14760G45055k91854K15139j08844N4926A74758M71760j39451L3563J98390k48596
14750D90424J49344n8826K93411J19676l97539L39909j94937R7424K4575k12849
14740F50612k05978K84628o7955J96861k00305n935J37529K9891p3836j78413
14730E67099J55596j83501L08303j57834J7788j51531K78383j25226j01937K14264
14720H21404r3329J82003m8234j28271O64L13765q7975j01640j5573j3570L1321
14709H60565j90102M68639n39473j01392N50034j48622n9358M82498k67229m03510
14699F52050L90098j34053l0291P4997k57262J71892J0316K27191j99347K7915
$$ y = [388847, 490465, 312430, 622985, 634396, 563443, 854721, 860004, 609959, 577061, 745055, 453201, 668340, 559496, 614422, 174758, 646518, 507067, 540630, 739020, 490424, 639768, 580942, 874353, 994029, 596490, 936399, 741462, 838886, 863461, 650612, 444634, 729262, 661307, 858168, 657863, 651928, 789457, 819348, 745512, 567099, 722695, 539194, 847497, 689663, 707451, 555920, 834303, 709077, 607140, 821404, 728075, 910078, 861844, 733573, 734237, 1048002, 960027, 858387, 842814, 829244, 860565, 670463, 1139102, 599629, 498237, 1048271, 899649, 840291, 1322789, 1055560, 652050, 1042148, 908095, 877804, 952801, 695539, 867431, 877747, 1104938, 905591, 933506]
14689I33506l3230j27282K58927j55962K4749L59804m80197N30163l93919Q908
14679I25467J63532j70440N9911K30298J6666k33427J30820J16813l91822O24890
14669A472708n69716L11706l39404L21074j49726k07637K21424J44234m4300m94670
14659F65693L42262J14489m43926O42295r6501k35244J90779k84710M579n38N46855
14648A446033o09474M47087q2568l7594k4299J00905m34738P83432j77820K5983
14638A436947J74835n47929J9495R5269K88117k72347J53154L6409j62708j04397
14628A116845M18082l03950M5242m5082j62658M13667O8075r2856j74274M03056
14618A686147l18446K51653P4229k2665m3595j58458J03284J8173K12781l95884
$$ y = [933506, 900276, 772994, 1031921, 875959, 900708, 1260512, 780315, 1310478, 916559, 925467, 1088999, 918559, 978470, 1208768, 1225434, 992007, 1122827, 1239640, 847818, 1472708, 902992, 1214698, 875294, 1196368, 1046642, 839005, 1060429, 1204663, 1160363, 665693, 1007955, 1122444, 678518, 1320813, 1224312, 989068, 1179847, 895137, 899716, 899178, 1446033, 836559, 1283646, 1201078, 1163484, 1139185, 1240090, 805352, 1588784, 1410964, 1436947, 1611782, 1063853, 1083348, 1178617, 1466734, 1194387, 1347541, 1383950, 1221242, 1116845, 1534927, 1230977, 1276219, 1231137, 1068479, 1482146, 1550221, 1457365, 1283091, 1686147, 1367701, 1619354, 1693583, 1670918, 1627323, 1468865, 1572149, 1590322, 1803103, 1407219]
14608A407219J46379M1956L90042k12586k10538m3979J60158J22906k78895L64582
14598A887244l76198O9592J73809R8777j81473R4829J78550k73845J66148j9789
14588A817644R452m9898K29151L7696j12873P1756L9010L26707J4310m23604Q6973
14577B046324L00660J71616o47543K90916J13330j35526j09056N01245k29037
14568B302929K89470J01869l6429j00806j59065K67786L8401J89782l56859O27465
14558C164543k83947Q0221K99621j4021J27544N10212O7404Q71007N88791J433148
14548F844523L776633Q911984K1478539n09095j8091237q879837o370342k751162
14540D410006j103150q35061j50328j30480k42504K8753J89927N4008j6317l65385
$$ y = [1407219, 1553598, 1595554, 1985596, 1773010, 1562472, 1518493, 1678651, 1801557, 1522662, 1887244, 1511046, 1580638, 1754447, 1853224, 1671751, 1766580, 1945130, 1671285, 1837433, 1817644, 1827096, 1777198, 2006349, 2044045, 1931172, 2002928, 2041938, 2368645, 2382955, 1959351, 2046324, 2346984, 2518600, 1871057, 2161973, 2275303, 2139777, 2030721, 2531966, 2302929, 2592399, 2694268, 2657839, 2557033, 2397968, 2665754, 2704155, 2893937, 2537078, 3164543, 2880596, 2960817, 3260438, 3246417, 3373961, 3884173, 3951577, 4822584, 5411375, 6844523, 10621156, 19533140, 41011679, 40502584, 22411347, 13531510, 7161168, 4410006, 3306856, 2471795, 2321467, 2190987, 1948483, 1977236, 2167163, 2221171, 2204854, 1839469]
14530A839469M62457J41120n0574l6133K42005n4972r7743O8032n7037m1977J49231
14519B563878O5059j70481M06006J75781J13028l64530L23991k70094j92255K28874
14509B879257K8466k33368J84183K89566p8182J43774J55284P209j80823K94557
14499C489923M7913j63344N1854m4969K71778m61266M67676j47737J58495k19716
14489C450607K78032J4048k33805L09482M2956j96838K17502P3420J29512J96612
14479D281528l57156J26217R6215J21977j2411R8361k5190L95640m48079M92394
14469D769496r6959J51576l54783O6701R5819N5652K55300p0586k19733N28349
14459E180832n63187L69340j19240J48741j58846M80321J6148l3795j34939M15626
$$ y = [1839469, 2301926, 2443046, 2392472, 2356339, 2598344, 2543372, 2445629, 2513661, 2456624, 2414647, 2563878, 2628937, 2458456, 2864462, 3040243, 3153271, 2788741, 3112732, 2842638, 2650383, 2879257, 2907723, 2674355, 2858538, 3148104, 3069922, 3213696, 3368980, 3376189, 3195366, 3489923, 3537836, 3374492, 3426346, 3381377, 3653155, 3191889, 3659565, 3511828, 3670323, 3450607, 3728639, 3742687, 3508882, 3818364, 3861320, 3664482, 3881984, 3955404, 4084916, 4281528, 3924372, 4050589, 4146804, 4268781, 4256370, 4354731, 4329541, 4725181, 4277102, 4769496, 4672537, 4824113, 4469330, 4536031, 4631850, 4687502, 4942802, 4872216, 4652483, 5180832, 4617645, 4986985, 4867745, 5016486, 4857640, 5337961, 5354109, 5320314, 5185375, 5601001]
14449E601001J13715K41671o73140Q83403l52646L29491j99355K39027J34777
14440F317944J09737j01483j8240O1350O24765k94461N1735L8809K20441K05926
14430G216523J68728J43422L10150k38044p0445J91367k89819N96865Q972J77024
14420H214743J18271L46941K46664j77578M08531l67620M83375k11090L17661
14411I379898M97006l99314L66816J18614j2820K5067J31929K51879K36351r4931
14401A0500495O82194J37721k32780L47792J60135J59186M75208o816J40293K19523
14391A2582951J62636L8245M40710M06390L72232l95982P74929j80886N72014
14382A4773239R9360J73780K09929M63665J74484L46110J47775P14710l3433N52783
$$ y = [5601001, 5714716, 5956387, 5283247, 6166650, 5814004, 6143495, 5944140, 6183167, 6317944, 6427681, 6326198, 6307958, 6369308, 6994073, 6699612, 6751347, 6790156, 7010597, 7216523, 7385251, 7528673, 7838823, 7600779, 7530334, 7721701, 7431882, 8028747, 8037719, 8214743, 8333014, 8679955, 8926619, 8749041, 9157572, 8789952, 9273327, 9062237, 9379898, 9876904, 9477590, 9844406, 9963020, 9950200, 9975267, 10107196, 10359075, 10595426, 10500495, 11182689, 11320410, 11087630, 11435422, 11595557, 11754743, 12229951, 12223135, 12363428, 12582951, 12745587, 12783832, 13224542, 13630932, 14003164, 13607182, 14382111, 14201225, 14773239, 14872599, 15046379, 15256308, 15719973, 15894457, 16240567, 16388342, 17103052, 17069619, 17622402]
14372A7622402L62602K68107M74045J58666L71846M45573N10117J07920N43357
14363B0864635N22544L80142P56931j16602O75667N56164O23683M89530O57746
14354B5410440L44550Q18489M67605O68709O03428O72984Q99139Q11769N78377
14345C1275490Q73290Q18501O00240P83147J324461R58366Q03175P80243R23757
14336C9140670J434813J259489J075958J183261J001677J843767J249256J326925
14328D9515816J570082J433162J736717J413216K044346J982176J950831K198403
14320F3844749J752294K833314K401121K089008K858906L377863K172714L285829
14312H4615798L212170L330230L619116L868812M045841M082708M412701N022155
$$ y = [17622402, 17985004, 18253111, 18727156, 18885822, 19257668, 19703241, 20213358, 20321278, 20864635, 21387179, 21767321, 22524252, 22407650, 23083317, 23639481, 24263164, 24752694, 25410440, 25754990, 26573479, 27041084, 27709793, 28313221, 28986205, 29885344, 30697113, 31275490, 32148780, 32967281, 33567521, 34350668, 35675129, 36633495, 37436670, 38216913, 39140670, 40575483, 41834972, 42910930, 44094191, 45095868, 46939635, 48188891, 49515816, 51085898, 52519060, 54255777, 55668993, 57713339, 59695515, 61646346, 63844749, 65597043, 68430357, 70831478, 72920486, 75779392, 79157255, 81329969, 84615798, 87827968, 91158198, 94777314, 98646126, 102691967, 106774675, 111187376, 116209531]
14304A16209531N046099N442072N623944N947110N921625O658120P502908O963503
14296A65314912Q315297Q248670R140042Q965392J0123874J0273810J1159310
14289B31541307J1442856J2148725J2995384J3154133J3953704J3953141J4930624
14282C24119874J4718412J5475545J5080373J5324058J4756819J4470148J3562323
14275D27507552J2428005J0935574Q884544N054329J245736j732003k728782l554871
14267D58040084r26953l814942p464511r196266j0642173j2488612j2854950j4204180
14259C86447497j5084258j5705648j5863250j5968666j5698380j4820421j3887656
14252B79419218j3689243j3443956j2791006j1912513j1703660j0558060j0408709
$$ y = [116209531, 121255630, 126697702, 132321646, 138268756, 144190381, 150848501, 158351409, 165314912, 173630209, 181878879, 191018921, 199984313, 210108187, 220381997, 231541307, 242984163, 255132888, 268128272, 281282405, 295236109, 309189250, 324119874, 338838286, 354313831, 369394204, 384718262, 399475081, 413945229, 427507552, 439935557, 450871131, 459755675, 464810004, 466055740, 464323737, 461594955, 458040084, 457113131, 453298189, 445833678, 436637412, 425995239, 413506627, 400651677, 386447497, 371363239, 355657591, 339794341, 323825675, 308127295, 293306874, 279419218, 265729975, 252286019, 239495013, 227582500, 215878840, 205320780, 194912071]
14245A94912071r561178q241222q857901p842094p901703o887356p053963n517244
14237A33049410n796021n991189n286058n127083m540932m226286l880896l721602
14229I4479343m206262l210714l683181l398295k611541l206000k562075k349748
14221F9251527k390990k220735k252376k330356k094922j913408j749409j341043
14213E2958288j568044j517108j774203j530607j481651q55629r26654j146961
14205D2157431j524917j259664r66018j610251j96344j218474o10224j078292
14197C3693247j116306q96511q62984n77026q96221l41069q80520n37777q57703
14188B6727130p91749o51791n05232l87080m31959p50963o02669k70008m61487
$$ y = [194912071, 185350893, 177109671, 168251770, 160409676, 152507973, 145620617, 138566654, 133049410, 127253389, 121262200, 115976142, 110849059, 106308127, 102081841, 98200945, 94479343, 90273081, 87062367, 83379186, 79980891, 77369350, 74163350, 71601275, 69251527, 66860537, 64639802, 62387426, 60057070, 57962148, 56048740, 54299331, 52958288, 51390244, 49873136, 48098933, 46568326, 45086675, 44231046, 43304392, 42157431, 40632514, 39372850, 38406832, 36796581, 36600237, 35381763, 34771539, 33693247, 32576941, 31680430, 30817446, 30240420, 29344199, 29003130, 28122610, 27584833, 26727130, 25935381, 25283590, 24778358, 24391278, 23959319, 23208356, 22605687, 22335679, 21874192]
14179B1874192n19082k91263q68614j21204k15297p49675j44264m74013m37095
14170A8053685o93312J65659m62219k39349o21345K4568m53318j56911n22751
14161A5094707l4815k24055k18263m38434m32337p6699l02991j04631k2423o15051
14151A2625008J34810l49943r5927j96117m60442j17064j40372k8747l04936l81873
14141A0684397R2440j57155k80500K980m22761J47708m45209j33892N7020n33800
14131I011228J58413k52696k41360j87680J76645J06396o39239L92124n27387
14122G996444J52871j13506j69146j62444j74194K5793j99338J30101l09422J16535
14112G293694j50707n5970k14755k8872J9756p1402j72994j55533J67929J30037
$$ y = [21874192, 21355110, 21063847, 20195233, 20074029, 19858732, 19109057, 18964793, 18490780, 18053685, 17360373, 17526032, 17063813, 16824464, 16203119, 16227687, 15774369, 15617458, 15094707, 15059892, 14835837, 14617574, 14179140, 13746803, 13670104, 13367113, 13262482, 13240059, 12625008, 12759818, 12409875, 12313948, 12117831, 11657389, 11540325, 11399953, 11371206, 11066270, 10684397, 10776837, 10619682, 10339182, 10342162, 9919401, 10067109, 9621900, 9488008, 9545028, 9011228, 9169641, 8916945, 8675585, 8487905, 8664550, 8770946, 8131707, 8523831, 7996444, 8149315, 8035809, 7866663, 7704219, 7530025, 7555818, 7356480, 7486581, 7177159, 7293694, 7142987, 7087017, 6872262, 6843390, 6863146, 6791744, 6618750, 6463217, 6631146, 6761183]
14102F761183k49429j88863j65134l22569L35782j33803q92q7114r1010r884o8406
14091E779861m05400M01289k13769J86676m21242l9883K41939m21346k17274n5980
14081D834871M13498k61790j27717J30933L6824l46122M906j68059J5160K30908
14071D763412l97715K38928j87880J26861o57821M03398k53775K03021N7694j68945
14061D127178R6068j755p4563J24631k54387m4032j03649P7727j58287j51674
14051C637257K81479k35409n8815O7196j60171j15623J43379r0321j2628m10207
14041C046137O10752m16348J43003m24702M03769r9751m8754k7281r266m6591
14031C130968K8746j88820K6991L60744m36462k73726N9431M28451k70600K939
$$ y = [6761183, 6511754, 6322891, 6157757, 5835188, 6170970, 6037167, 6036275, 5949161, 5858151, 5848267, 5779861, 5374461, 5775750, 5561981, 5748657, 5327415, 5287532, 5529471, 5108125, 4890851, 4834871, 5248369, 4986579, 4858862, 4989795, 5026619, 4680497, 4685403, 4517344, 4532504, 4763412, 4365697, 4604625, 4416745, 4543606, 3885785, 4289183, 4035408, 4238429, 4296123, 4127178, 4223246, 4221491, 4146928, 4271559, 4017172, 3973140, 3869491, 3947218, 3788931, 3637257, 3918736, 3683327, 3624512, 3691708, 3531537, 3415914, 3559293, 3468972, 3456344, 3046137, 3656889, 3240541, 3383544, 2958842, 3362611, 3262860, 3214106, 3186825, 3177559, 3130968, 3159714, 2970894, 2997885, 3358629, 2922167, 2648441, 2707872, 3136323, 2865723, 2868662]
14021B868662O7578k40952R3995q9291J24642r3727L20994n70932J39582j18375
14011B502176k5297j86445N0344J5921p1954J57440k75567L90239L4093j59335
14001B431615l02990K75749k78257K70698j98569k38395J96351R3073j47435J09686
13991B211526M63575j05169N04477K176125O799778K1403046R823216j6526190
13983B6750384j1285045n939163k772036j131540j056360m69003m58179k48933
13975C390125l20404j14762k87685k44349K49118j96626K64232j37969j25910
13966B475770N6224k03435J27570k50009N4275j74741J60072r1048j04552K2630
13956B072756o0491q559j5543o4886m8640K01402l72431K7450m8875K73567r7653
$$ y = [2868662, 2936240, 2695288, 2789283, 2699992, 2824634, 2730907, 3051901, 2480969, 2620551, 2502176, 2476879, 2290434, 2340778, 2356699, 2284745, 2442185, 2166618, 2556857, 2590950, 2431615, 2128625, 2404374, 2126117, 2396815, 2198246, 1959851, 2156202, 2249275, 2101840, 2211526, 2675101, 2569932, 3074409, 5250534, 12050312, 33453358, 43276574, 26750384, 15465339, 9526176, 6754140, 5622600, 4566240, 4097237, 3639058, 3390125, 3069721, 2954959, 2667274, 2422925, 2672043, 2475417, 2739649, 2601680, 2475770, 2531994, 2328559, 2456129, 2206120, 2260395, 2085654, 2245726, 2154678, 2050126, 2072756, 2012265, 2003706, 1988163, 1923277, 1874637, 2076039, 1703608, 1731058, 1682183, 1955750, 1858097]
13945A858097K80603l34822J64255j27592q4188J45763k82640J996M51728q8597
13935A984603j68212m753j65692j7069N9356O666k57322O9724K23766Q6551n157
13924A812461n2678j69201k04411K96399j44765K64560j9479m33448J97829O4799
13914A612066k67137q4109J35037J39593m1756m86592N02141J31406l51125K05654
13904A495178j26744J02234l41103L75625k88133k30859L85338o0319N88570l45050
13894A554737j59801j9300m36262K77249J26847P7093J4509P7109j26156k31310
13884A154715J48974l27754N38559n04491M53874l30109L59366m56923l25358
13875G10853L95128j4461J48541r3283K05438k88321L24091j52844j08031J13809
$$ y = [1858097, 2138700, 1803878, 1968133, 1840541, 1756353, 1902116, 1619476, 1621472, 2073200, 1984603, 1816391, 1811638, 1645946, 1628877, 1688233, 1694899, 1437577, 1507301, 1731067, 1817618, 1812461, 1759783, 1590582, 1386171, 1682570, 1537805, 1802365, 1782886, 1349438, 1547267, 1612066, 1344929, 1260820, 1395857, 1535450, 1493694, 1007102, 1509243, 1640649, 1289524, 1495178, 1368434, 1470668, 1129565, 1505190, 1217057, 986198, 1371536, 1311217, 1899787, 1554737, 1394936, 1375636, 939374, 1216623, 1343470, 1420563, 1435072, 1512181, 1386025, 1154715, 1303689, 975935, 1514494, 1010003, 1463877, 1133768, 1493134, 1036211, 710853, 1105981, 1091520, 1240061, 1146778, 1352216, 1063895, 1387986, 1235142, 1127111, 1240920]
13865A240920j99969J46268l76014J89686j62823L07387P6788M6966m44345K2516
13855H47380M37444n45514N23627k87796K92223k27563l3450p1279J01551j02512
13845I34111M68955m13074j22328J25438j35468k27871J75655M73911l32030R8957
13835A046256P1903m1965j38837l84976N87500k46320k9719L2705p658K26110
13825A114999l37989L17543k54335k47376J11006K14313R7655l78011N8894N4672
13815G51371K93770O6678j9776k64486N2913r204j50294R8282J08121l44303M46271
13804A029343j17936J29398j46863l45075M49139k69727n9008l7175J36489j19464
13794F49121J51831K38247k72226o7353J96819n8158k71080M92289l74656n3101
$$ y = [1240920, 1040951, 1187219, 811205, 1000891, 838068, 1145455, 1222243, 1269209, 824864, 847380, 1284824, 739310, 1262937, 975141, 1267364, 1039801, 1006351, 935072, 1036623, 934111, 1403066, 989992, 867664, 993102, 857634, 629763, 805418, 1279329, 947299, 1046256, 1118159, 1076194, 937357, 552381, 1139881, 893561, 863842, 896547, 888889, 1114999, 777010, 1094553, 840218, 592842, 703848, 918161, 1015816, 637805, 696699, 751371, 1045141, 1111819, 1092043, 827557, 880470, 871266, 720972, 819254, 927375, 583072, 1029343, 911407, 1040805, 893942, 548867, 998006, 728279, 669271, 632096, 768585, 649121, 800952, 1039199, 766973, 699620, 896439, 838281, 567201, 1059490, 684834, 631733]
13784F31733j08778M30909l77924M98856l66677L02956l13251L34337k78840k17395
13774E35926q8058L45912J98182l64658K35710k16968J51078L512B86731N47652
13764H34383k32104K30543C66726L78543C19575J49506R4440k49936N67289r4086
13754G86788j38533K82133l02839J15616K9703o3576k61898J10482J74479l42566
13744C89789N40998k67913C23449R9035N9634J86554p6455J19098o2679J29892
13734G78528C53630K43804j60009K27136q6136J59836P1275j80759k8157j13659
13724D86961M1720j21315K34001B81124K86164l6260j12412j68625J58925K80938
13714F89854K57349H3020L31295K25168Q1835j14236Q4605k28505j08882K00519
$$ y = [631733, 522955, 953864, 575940, 1074796, 708119, 1011075, 697824, 1032161, 753321, 535926, 447868, 793780, 991962, 627304, 863014, 646046, 797124, 800636, 286731, 834383, 602279, 832822, 366726, 745269, 319575, 469081, 563521, 313585, 880874, 786788, 648255, 930388, 627549, 743165, 772868, 709292, 447394, 557876, 732355, 389789, 930787, 662874, 323449, 422484, 482118, 668672, 592217, 711315, 648636, 778528, 353630, 597434, 437425, 664561, 578425, 738261, 809536, 628777, 600620, 486961, 528681, 407366, 641367, 281124, 567288, 531028, 418616, 249991, 408916, 689854, 947203, 83020, 414315, 639483, 721318, 607082, 691687, 463182, 354300, 554819]
13704E54819k0264B63754L11055J45630j2313r5307J16854j07092k22012M4159
13694D44728L46974k77784J74910k1820K8207j82789o3916J97416k42602j38993
13684B64331K99828k56473A15539M38824B39588M87600A76224M14124B93899K33722
13674E27621j94778J24413R3696j09854K24245j42221k3497j35724L23755j21897
13664E65759K6341K16492C02215J12739j24900J01730K95326B17730J74195J49547
13654E41472j11801P4674l9178j29249J31476n7753K14070A49128L74612N4747
13644E78487L2005K95792l69901K1355N2575j29543j13532K20365l3649A85473
13633E04859L91022A65573K71783j64734K61656k16330J99202j54172l3008L9215
$$ y = [554819, 534555, 263754, 574809, 720439, 708126, 612819, 729673, 622581, 400569, 444728, 791702, 513918, 688828, 667008, 695215, 512426, 448510, 645926, 403324, 264331, 564159, 307686, 115539, 554363, 239588, 727188, 176224, 590348, 293899, 527621, 332843, 457256, 550952, 441098, 665343, 523122, 499625, 363901, 687656, 565759, 592100, 808592, 302215, 414954, 290054, 391784, 687110, 217730, 391925, 541472, 429671, 504345, 465167, 335918, 467394, 409641, 623711, 149128, 523740, 578487, 610492, 906284, 536383, 557738, 610313, 480770, 367238, 587603, 553954, 185473, 504859, 895881, 165573, 437356, 272622, 534278, 317948, 517150, 362978, 329970, 369185]
13623C69185J6660j67787M24186D8607h665D78803p8940C1128L60772Q3562p1877
13612D03585O4287l4317j53398L39834k28039k9431j80418n1735K03090q9358
13602B44100o1655L21678A34283N22442A84232o6564L79871J9457j01311A45954
13591G15345j37635F034L86048A43185M74946R213A80318J75168L86430j59276
13581E82640D7665O81287B01146K29515j80518M48626k81341j00643J60188j34218
13571C42755G1689P55377C7038e4934C41417j56320J43197r7231m0143L41350
13561E32270N5482k13624j16573m0398p4161J99817R9188A05524k7924K57283
13551C34883P9751F3055M76618A88563L17649A14293K85062N4139l0772j45749
$$ y = [369185, 385845, 218058, 642244, 48607, -8665, 478803, 399863, 31128, 391900, 475462, 403585, 467872, 433555, 280157, 619991, 391952, 362521, 182103, 130368, 333458, 244100, 182445, 504123, 134283, 656725, 184232, 117668, 497539, 516996, 415685, 145954, 715345, 577710, 6034, 392082, 143185, 618131, 627344, 180318, 355486, 741916, 582640, 47665, 728952, 201146, 430661, 250143, 698769, 417428, 316785, 476973, 342755, 71689, 827066, 37038, -54934, 341417, 185097, 328294, 231063, 190920, 532270, 587752, 374128, 257555, 217157, 142996, 342813, 442001, 105524, 77600, 334883, 414634, 63055, 539673, 188563, 506212, 114293, 399355, 453494, 422722, 276973]
13541B76973J42587N0559B12825L06772q1568j19022q2304L72738I6473K74700
13531C71173A27155J66357q8794C0893b22967E74473I5076P9066o443J42912M2071
13520C52682N735J39892j37317j4683J09125J7903f4343B46110J8763j29929J03438
13509B38382L72959B33514j633Q3906C861N25366F5246K30600P3892A14523c9127
13497C27339K05405B48269k6439E2819K68694p4422J23177n5341J79867l2241
13487D62553E2487M78347r1795A35239L7349K18118n6559O2663A87819J07558
13477B95377e4546A63870K50453J25101r7959N5357g3415B84761J29028a57332
13466E9722a73D07754B1368L93409j98350K48445B04914k9347J3407K18935A26904
$$ y = [276973, 419560, 470119, 212825, 519597, 438029, 319007, 236703, 609441, 96473, 371173, 127155, 293512, 204718, 30893, -222967, 574473, 95076, 174142, 167699, 310611, 352682, 358417, 498309, 360992, 346309, 455434, 473337, -64343, 246110, 264873, 134944, 238382, 611341, 233514, 231881, 315787, 3861, 529227, 65246, 295846, 369738, 114523, -39127, 327339, 532744, 248269, 221830, 52819, 321513, 247091, 370268, 314927, 494794, 462553, 52487, 530834, 439039, 135239, 172588, 390706, 334147, 396810, 187819, 295377, -54546, 163870, 414323, 539424, 441465, 496822, -73415, 284761, 413789, -157332, 59722, -173, 407754, 21368, 414777, 216427, 464872, 204914, 175567, 188974, 407909, 126904]
13454B27764b67755B96441I3398K50779j64598K69753g4580A03695J05642J93096
13444D02433r0669k8325j19162F0572N8775C7169K29939c99A38507J41323J58854
13433D38684J192q9895Q5699j89564h8705G6830N30259C916Q2081b35341D13361
13421E3737N6846L33740A25747n6548K4938Q9081J20293G2495M56203a0493D60941
13409A26001M9178p0325L7899j9090B8392N39094k65778G9289M6670K51269Q5478
13398D62706A13559L21059A05148J35161J85651A50670A3265K39367a59088I3351
13387A26496R3067c04006B02426J0286I1416L19919f5077C74908A55228K75912
13377D31140j71573P1971p6986h5064B03597Q8113m5230P4191L46484j79213A38563
$$ y = [227764, -267755, 296441, 93398, 344177, 179579, 449332, -74580, 103695, 209337, 402433, 311764, 283439, 164277, 60572, 119347, 37169, 267108, -399, 138507, 279830, 438684, 439876, 349981, 435680, 246116, -88705, 76830, 607089, 3916, 85997, -235341, 413361, 53737, 110583, 444323, 125747, 69199, 94137, 183218, 303511, 72495, 528698, -10493, 460941, 126001, 175179, 104854, 142753, 123663, 28392, 567486, 301708, 79289, 125959, 377228, 462706, 113559, 434618, 105148, 240309, 425960, 150670, 13265, 252632, -159088, 93351, 126496, 219563, -304006, 202426, 212712, 91416, 411335, -65077, 374908, 155228, 431140, 259567, 331538, 254552, -85064, 203597, 291710, 246480, 320671, 667155, 487942, 138563]
13365G4841J95809r5523J53137K85629D0439Q4363J94503l1737l4893n8204R0593
13354B85064r3326H4349l5651K50024j49331M9772J25183e7481D6749L41027n5353
13343C32423j12898K18331p8299n7926b74970B52613p1008p1064k9345a86284
13332E04425j70832J09985A58867l8732J43529D6735g0089B38278f7439A8619
13321C31862A04627P7500K32308j86099J52565L4669c6533R696A11401J94993
13311C06394Q8718o5959n1890K5300A49790D242J24083K8318R6077G9583a66544
13299C42826A27928b9416o2050a9099I2120R7053H7944a76959G9471K44468A50537
13287A07648R2260k5633g6474A54465J11343g0972B03465a62891B96616q2126
$$ y = [74841, 270650, 175127, 328264, 613893, 40439, 124802, 319305, 287568, 252675, 194471, 285064, 191738, 84349, 48698, 298722, 149391, 199163, 324346, -57481, 46749, 387776, 332423, 219525, 437856, 359557, 301631, -274970, 252613, 181605, 110541, 81196, -186284, 504425, 333593, 443578, 158867, 120135, 263664, 46735, -70089, 238278, -67439, 18619, 331862, 104627, 182127, 414435, 228336, 380901, 415570, -36533, -26837, 111401, 306394, 395112, 329153, 277263, 302563, 149790, 4242, 128325, 156643, 252720, 79583, -166544, 342826, 127928, -29416, -91466, -19099, 92120, 189173, 87944, -176959, 79471, 323939, 150537, 107648, 199908, 174275, -76474, 154465, 265808, -70972, 203465, -162891, 296616, 214490]
13277B14490G6856J39562J05459L6740j32159e5623C57632f3583B6506R5688K7704
13266A49898d3210B11575k2880a31869J4208E8756B8382J84540r9996M29355B54581
13254a44755C18161C7219K03640K4526p3302f7179n6985k0591b479j5206f018
13242G1208a7486B87960Q9820A00790J15562a6355E09181D9318B0579J48736b9514
13230C3096J5436J61645J59976N0917d1132L108A23769L3716B7673b07900A33990
13218G8192K20528a01041A08007c31190F5852d3439A97852K35541A44256J56671
13208C00927N6539E9518J1610g3992D62886j95877H6198c8275l3221B36666F1993
13196E2556K50543a5004E96787d01729E0021i3897a0980F6118K6943a6007A25429
$$ y = [214490, 76856, 216418, 321877, 358617, 226458, -55623, 357632, -63583, 26506, 122194, 149898, -43210, 211575, 188695, -131869, -117661, 58756, 28382, 212922, 112926, 542281, 254581, -144755, 318161, 37219, 240859, 265385, 192083, -67179, -124164, -144755, -2479, -17685, -6018, 71208, -17486, 287960, 377780, 100790, 216352, -16355, 509181, 49318, 20579, 169315, -29514, 33096, 48532, 210177, 370153, 421070, -41132, -38024, 123769, 157485, 27673, -207900, 133990, 78192, 298720, -101041, 108007, -331190, 65852, -43439, 197852, 433393, 144256, 300927, 357466, 59518, 71128, -73992, 462886, 267009, 86198, -38275, -71496, 236666, 61993, 52556, 303099, -15004, 596787, -401729, 50021, -93897, -10980, 66118, 93061, -16007, 125429]
13184A71085M4846a01932D4800K39596D082f7601A69625J5224G350J52177a15713
13172B7717a03711C8751P3794L3803B3663J02825J192b62601A4210J7490J87466
13161B19166p566m5874J34584D6676K64678A33947L7131P4884M016j2249A5334
13149A76999P6178n2753A5842c06319c7620A03505J9072Q1380a82291H5917a0306
13137A94673c6842A66637K21840d54646B26571j13108a14277A07037b49277R5981
13127a53296l7813I9799m1200J60849g8205j16131A50817a69862a4001C777Q0990
13116H4767R3041L1589B2355J44484B9082R3850h8294B62450G3914P6015B1406
13104A07117i98B12314a22413M0104B61465J54592a18314o7046B82902C93L6868
$$ y = [171085, 215931, -101932, 44800, 284396, 4082, -67601, 169625, 184849, 7350, 159527, -115713, 27717, -103711, 38751, 112545, 146348, 23663, 126488, 127680, -262601, 14210, 31700, 219166, 211600, 165726, 300310, 46676, 311354, 133947, 171078, 245962, 249978, 237729, 15334, 176999, 253177, 200424, 15842, -306319, -37620, 103505, 122577, 203957, -182291, 85917, -10306, 194673, -36842, 166637, 388477, -454646, 226571, 113463, -114277, 107037, -249277, -153296, -191109, 99799, 58599, 219448, -78205, -194336, 150817, -169862, -14001, 3777, 84767, 177808, 209397, 22355, 166839, 29082, 122932, -88294, 262450, 73914, 149929, 21406, 107117, -998, 212314, -122413, -82309, 261465, 416057, -118314, -185360, 282902, 393, 37261]
13093C7261h074j78931p3248D17430g7916B75724k579B9504f4495j49538A77890
13081A88767F2085e911B74893J45491I5222a05560I4522L5863A3416M39258k20768
13070B31906K62557g5755A23728n5228R048J353G066J74947G3305b38357E3595
13058C86287j70924g3877D30882j35931j2767q2151G3731a11919D32001d6911
13047A73930l0506b2414C0922b37368K2451H6509c0600B14993C6881j0124L53570
13036C80327A69101G2175J81074b2979l18729a26532F4980L2743a89294H5064
13025B03586P606H1782Q7406p9030a61129D84861A90447J08261m8656i0555D3144
13013A18558K88800D8812c4692B07065A7019Q980A1707a86009A75833p6194f5582
$$ y = [37261, -8074, -187005, -260253, 417430, -77916, 275724, 273145, 29504, -64495, -214033, 177890, 188767, 62085, -5911, 274893, 420384, 95222, -105560, 94522, 130385, 13416, 452674, 231906, 494463, -75755, 123728, 68500, 77548, 78901, 7066, 182013, 73305, -238357, 53595, 386287, 215363, -73877, 430882, 294951, 282184, 200033, 73731, -111919, 432001, -46911, 173930, 143424, -22414, 30922, -237368, -214917, 86509, -30600, 214993, 36881, 26757, 380327, 169101, 72175, 253249, -22979, -341708, -126532, 64980, 97723, -189294, 85064, 203586, 211192, 81782, 169188, 90158, -161129, 484861, 190447, 298708, 250052, -90555, 43144, 118558, 407358, 48812, -34692, 207065, 17019, 25999, 11707, -186009, 175833, 99639, -65582]
13001A6871J86144a18003B97725N5837a64832B44283g244B95992a07729a4477
12990C1863K31453r8030c25950B1425O0059b5428j2010q4431A04294a19413B64454
12978e808G9498J46102D6802J31671a64701A27485b6356A03313K75269e2118A3248
12966b0664C5499h9119o1905C00057l3838a24524A27797d4037A741J89708L4801
12955B26250a10302D11617C3722J43275k4580a47158A95086R8838j03420C588
12944c93149B28009A09667L30628a85550C40197a9761A74362N193I05K50554c0587
12932g384n9203A68586b37592O4057e065I5228J4929J626b16559A64025K08857
12921C72882j06110K61772E1367i71j34974f2911H6282N322A0366f8384I7495
$$ y = [16871, 203015, -118003, 297725, 353562, -164832, 244283, -7244, 295992, -107729, -14477, 31863, 263316, 165286, -325950, 21425, 81484, -25428, -37438, -121869, 104294, -119413, 264454, -5808, 79498, 225600, 46802, 178473, -164701, 127485, -26356, 103313, 378582, -52118, 13248, -20664, 35499, -89119, -151024, 300057, 266219, -124524, 127797, -44037, 1741, 191449, 226250, -110302, 411617, 33722, 176997, 152417, -147158, 195086, 293924, 190504, 3588, -393149, 228009, 109667, 440295, -185550, 340197, -19761, 174362, 179555, 905, 251459, -30587, -7384, -66587, 168586, -237592, -173535, -5065, 95228, 110157, 111783, -216559, 164025, 372882, 266772, 528544, 51367, -971, -135945, -62911, 86282, 91604, 10366, -68384, 97495]
12909A397J23622f3703B40687d3414C6426a67440e2494j62941N9627A48214b18303
12897c4128A36012b506I4696e1963j88510b3436A23290a19943A30207J47910R6564
12886C74681j60684a82182A42784a9642m7317A38477b7642o161C28607a41109
12875a04289J0257M73r539K2103j6988F4998f9745k9923B94457a13197j42714
12864b55911A99208E0654c30153D0756f6353j8411I3303c1868r0296G024O9719
12853G6743b00881M6033L1725A59521n6500a35218e4586C7678L44123j50227f3379
12841A77123L5359j06108D4681j0907b06541A56460n4605b14819C921b84162b7627
12829a26317E4067a58264N4798m2927A76561k4301e138j16136h707k56094d5649
$$ y = [1397, 125019, -63703, 240687, -43414, 36426, -167440, -52494, -215435, -155808, 148214, -218303, -34128, 136012, -2506, 94696, -51963, -240473, -23436, 123290, -119943, 130207, 278117, 374681, 213997, -182182, 142784, -19642, -66959, 138477, -27642, -33803, 328607, -141109, -104289, -94032, -93559, -103098, -80995, -97983, 64998, -69745, -99668, 294457, -113197, -255911, 199208, 50654, -330153, 40756, -66353, -84764, 93303, -31868, -122164, 7024, 76743, -200881, -154848, -123123, 159521, 103021, -135218, -54586, 37678, 381801, 231574, -63379, 177123, 212482, 106374, 44681, 33774, -206541, 156460, 101855, -214819, 3921, -284162, -27627, -126317, 54067, -158264, -103466, -146393, 176561, 152260, -5138, -121274, -8707, -264801, -45649]
12817A84331C9418j2643K18240j09015B5730m014b51975a12414j7286q5351d4739
12805g2275a4437A1287a01935A97911c6002A28229J0178a24809C18274A23800
12794c09370H0851i1091n3159B00852a55425A92083m3453a09735j2017A42747
12783A95834H1199b4689F4380J97260E6527J03237a50896b5033j89690D9026b10772
12771A21549R6185g9709K8481G7524a30481D5987f0833K5090B39589I4727d6008
12759a86367B9104K11179q7654k5195L09860j66238A22547h6036j6165E491h921
12747A94574l877K7354q9221b21334C7308a74228B66777m3853K41316k12476e1829
12735c9244B30767a11467A79010b60779D5143e0454m9713D4511P8425a35912B60297
$$ y = [184331, 39418, 26775, 245015, 136000, 25730, 21716, -251975, -112414, -129700, -215051, -44739, -72275, -14437, 11287, -101935, 197911, -36002, 128229, 138407, -124809, 318274, 123800, -309370, 80851, -91091, -144250, 200852, -155425, 192083, 148630, -109735, -121752, 142747, 195834, 81199, -24689, 64380, 261640, 56527, 159764, -150896, -25033, -214723, 49026, -210772, 121549, 217734, -79709, -51228, 77524, -130481, 45987, -60833, -35743, 239589, 94727, -46008, -186367, 29104, 240283, 152629, 127434, 437294, 271056, 122547, -86036, -102201, 5491, -8921, 194574, 190697, 218051, 128830, -221334, 37308, -174228, 266777, 222924, 464240, 251764, -51829, -39244, 230767, -111467, 179010, -260779, 45143, -50454, -100167, 44511, 122936, -135912, 260297]
12723a33799C60589i1621J9565A1209c3789k64458C97883d7604q8561H3681c6398
12711A41704L1428O3570J37105n9149J40353A69238n7527J97611I9362L51238
12701D50600D3920K9926K30794e0020A56314M847E2450e9004j14113F046b8440
12689B36687b0703j67236G5255L24868A46160i25C4105D380J42345B3513M418
12678B7931J28596L51798a8502I8975J21334M0644a25525A65441j38j1624O4301
12667B17980G7845e3057a0876j56477H2241A4519M3050K04674n077a73453k9248
12656b02701B76618A22753E0118J98637n5380c872A43939g523B9283Q3497N0350
12645A63130b04911A5794a34192A48799J27790H3486L099i9452B6860Q3901e0930
$$ y = [-133799, 360589, -91621, -72056, 11209, -33789, -298247, 397883, -47604, -136165, 83681, -36398, 141704, 173132, 236702, 373807, 314658, 455011, 169238, 111711, 309322, 99362, 450600, 43920, 73846, 304640, -50020, 156314, 161161, 52450, -59004, -173117, 6046, -28440, 236687, -20703, -187939, 75255, 400123, 146160, -925, 34105, 4380, 146725, 23513, 27931, 156527, 508325, -18502, 98975, 220309, 260953, -125525, 165441, 165303, 153679, 217980, 77845, -53057, -10876, -167353, 82241, 14519, 57569, 262243, 257166, -173453, -202701, 276618, 122753, 50118, 248755, 193375, -3872, 143939, -7523, 29283, 112780, 163130, -204911, 15794, -134192, 148799, 276589, 83486, 86585, -99452, 26860, 110761, -50930]
12633A38301a52627A00419a04463E4192b8350C97351M4077r1896j74276a85025
12622d9809A76900M997J18127j25241n1753E319P4588c63939B43800A1791c859
12610A95490d15136J81411A0941J51794c8069B38422O2110f6881g754B30758c50117
12598d2573r5681E9661B6656K81051A8156J25267h6521D0864a6440j3955F8088
12586B06054o3848L2713p1240B4798L4820c20E3044a21184K5663H5003L4721J3483
12574A33207C1127J42286B7024D083Q6540K1616k2458K8214e6490e883k9500o4402
12562i9785J6683B94233a8800j16203g66B71183C3818f7083b3253B05446K9781
12551B35227q6101D8500K64404a11149C14111b25992g0475B63325a72575F9635
$$ y = [138301, -152627, 100419, -104463, 54192, -28350, 397351, 441428, 349532, 175256, -185025, -49809, 176900, 181897, 300024, 174783, 123030, 5319, 79907, -363939, 243800, 11791, -3859, 195490, -415136, -233725, 10941, 162735, -38069, 238422, 300532, -66881, -7754, 230758, -350117, -42573, -138254, 59661, 26656, 307707, 18156, 143423, -86521, 40864, -16440, -30395, 68088, 206054, 142206, 174919, 103679, 24798, 59618, -320, 53044, -121184, -95521, 85003, 119724, 133207, 31127, 173413, 27024, 4083, 90623, 112239, 89781, 117995, -56490, -5883, -35383, -99785, -83102, 294233, -18800, -135003, -766, 271183, 33818, -67083, -23253, 205446, 235227, 149126, 48500, 312904, -111149, 314111, -225992, -70475, 263325, -172575, 69635]
12540A45047F0413J41761p5647D2923K37063c28456D8744R0271j9203b77538D1691
12528B10155D6226J21469O6663A1154K22112C709i7179A13400a45148I1476e6933
12516g7418B29937b37808b9507j28450B53111j06760F7569a42342N1298A63555
12505A83051N5271A6071c32208f2808A71701N3095F7737c43674C23424A01638
12494a89924A95392b8490A30468A1791b37248O181D9119L3957a66179e3983F31031
12482h8687J0239A44607C8664J2653c05220B53727d6213r9482R652C0005g2738
12470e3127j12172e5058I2458B9135a88914C9527J45234l1278e5095j03262k24823
12459c83180G654O9816h0277p5321C86563j60541r7382n5726R6766m0851J38282
$$ y = [145047, 60413, 202174, 126527, 42923, 279986, -328456, 48744, 139015, 119812, -277538, 41691, 210155, 46226, 167695, 234358, 11154, 233266, 3709, -97179, 113400, -145148, 91476, -56933, -77418, 229937, -237808, -29507, -157957, 253111, 146351, 67569, -142342, -91044, 163555, 183051, 238322, 16071, -332208, -62808, 171701, 224796, 67737, -343674, 323424, 101638, -189924, 195392, -28490, 130468, 11791, -237248, -231067, 49119, 83076, -166179, -53983, 631031, -88687, -78448, 144607, 38664, 51317, -305220, 253727, -46213, -145695, -136043, 30005, -72738, -53127, -165299, -55058, 92458, 29135, -188914, 39527, 184761, 153483, -55095, -158357, -383180, 7654, 77470, -80277, -155598, 386563, 226022, 128640, 72914, 169680, 128829, 267111]
12448B67111E1824a4300j71761J5054g8241j1300A32226K7592a87433Q016F4747
12436g9813h697A53783g5571k04913Q3247A17730L33103E328a39095R47n605M5575
12424i8178K7466l4071m66965B78697F1693a78586m2562A21189C4253a05262k8435
12413a33697l3874o046c2669A79961b06822e0431j67538j6439Q147g6534E27495
12401A86257F0829K67234A32040f5831k83190a01667D417a23071J9676C00043
12390C4224J70665a8695F9845L4664e4263o938n113B23517q8690J04917b2997
12378H5333b62887M7463O9593E407K10700r9106a01832D8431K17008j11810F6496
12366B95077a64837a8676A65604p0262b27528A123Q4548b782A65543h3286B8183
$$ y = [267111, 51824, -14300, -186061, -171007, -78241, -89541, 132226, 159818, -187433, -179417, 64747, -79813, -8697, 153783, -75571, -280484, -197237, 117730, 450833, 5328, -139095, -138148, -143753, -98178, -70712, -104783, -571748, 278697, 61693, -178586, -221148, 121189, 34253, -105262, -133697, -167571, -173617, -32669, 179961, -206822, -50431, -217969, -234408, -226261, -76534, 527495, 186257, 60829, 328063, 132040, -65831, -349021, -101667, 4417, -123071, -103395, 300043, 34224, 204889, -18695, 69845, 104509, -54263, -61201, -66314, 223517, 134827, 239744, -22997, 85333, -262887, -215424, -145831, 5407, 216107, 117001, -101832, 48431, 265439, 153629, 66496, 295077, -164837, -18676, 165604, 95342, -227528, 1123, 85671, -2782, 165543, -83286, 28183]
12354f8092j27817A5219J21364N6563b15118M9987B3174N9296a9381m6254B94585
12342b9064B39848A6939a7409q4150K0824o2294G101K0505J656J425K96388b79870
12329A02985b26998A54403K03290e0570a4705o8001L9016o561I6283e5795j81800
12318b37595B34110F0145j8712J13654F552J12890c0582D05071e0296A04852b9184
12306A78432C5909i3103A26722J92968C1893i122B57756a68077H9734J66407o3306
12295A92835K9593d5658m1712a4393A42299J49811k3883j04948J37519b87564
12284F489b19394A19444i1555G3526J09292f4807B28093E9463L14772g1932A56536
12272B17995D4123J15777L0141J9519f9853j40582B8802K39572o5803e590m3477
$$ y = [-68092, -195909, 15219, 136583, 193146, -215118, -165131, 23174, 82470, -19381, -65635, 294585, -29064, 239848, 16939, -17409, -101559, -80735, -143029, 7101, 27606, 29262, 30687, 327075, -279870, 102985, -226998, 154403, 357693, -50570, -14705, -82706, -43690, -50251, 96283, -55795, -237595, 234110, 60145, 41433, 155087, 6552, 119442, -30582, 405071, -50296, 104852, -29184, 178432, 35909, -93103, 126722, 319690, 31893, -9122, 257756, -168077, 89734, 256141, 192835, 222428, -45658, -87370, -14393, 142299, 292110, 268227, 163279, 300798, -287564, 6489, -219394, 119444, -91555, 73526, 182818, -64807, 228093, 59463, 374235, -71932, 156536, 217995, 44123, 159900, 190041, 209560, -69853, -210435, 28802, 268374, 202571, -5590, -49067]
12261d9067j38240H1340c5782r461A66342b9273j10295C36637A4303L53205d7643
12249A40076c6684D58087c6885j50010H2707k8280J04007a01596B60458g6161
12238B97510j05012R909c7198G6023b1588I31d0938A97011a17808K5343B48492
12226A99081M1961C4138e0790A59782K73929A50155k5082M3422J39239K32904
12216E40638j00014B5088K3571J48804o0258c68590E31940K2568a68438C26185
12205a5796A82642j8789Q7505c5444A88523J00569i5403F2311J13699J15658H4661
12193B43702P3020K63051A54923a79500r3047B83274a26905K6026A7783K9289
12183D7072J73571J38230a1168A94983a59165A83470o9821A6953K99074c3290
$$ y = [-49067, -187307, 81340, -35782, -45243, 166342, -29273, -139568, 336637, 14303, 367508, -47643, 140076, -36684, 458087, -36885, -186895, 82707, 54427, 158434, -101596, 260458, -76161, 297510, 192498, 202407, -37198, 76023, -21588, 931, -40938, 197011, -117808, -92465, 248492, 199081, 241042, 34138, -50790, 159782, 433711, 150155, 125073, 168495, 307734, 540638, 440624, 25088, 48659, 197463, 137205, -368590, 531940, 554508, -168438, 326185, -15796, 182642, 163853, 251358, -35444, 188523, 289092, -95403, 62311, 176010, 291668, 84661, 243702, 316722, 579773, 154923, -179500, -272547, 283274, -126905, -100879, 17783, 47072, 220643, 358873, -11168, 194983, -159165, 183470, 113649, 16953, 316027, -33290]
12172A82222g3460A31543K70863A57638D2184J69476a61517b9907A97112n9991
12162A37121o2228L3494f9892B98629p6872a86195B7088a37494A01132c21660
12151G40J22977a62109B23719a65733D2007K5212a88631B7204Q1929j5915M0173
12140A33391J56700b36809C04161j50204b9114N833n3057k909A02593l4514a26952
12128B32344k6945c0578k84881A7329b80105p130A21272f3925A79833n9831c6480
12116B20618F5667G103B625J04385d65423c7472A26224k7143l0509b3306a1100
12104C9556e2561H0886d37294J26524B32508j5989J1605e1339A24315O3585a1296
12092G2613N5294i831B10137i4050k37985A4846b85742A01824d6966C1949c93714
$$ y = [182222, -73460, 131543, 402406, 157638, 42184, 211660, -161517, -29907, 197112, 137121, 74893, 108387, -69892, 298629, 221757, -186195, 27088, -137494, 101132, -321660, 740, 123717, -162109, 223719, -165733, 42007, 67219, -188631, 27204, 109133, 93218, 133391, 290091, -236809, 304161, 153957, -29114, -23281, -76338, -79247, 102593, 68079, -126952, 232344, 205399, -30578, -315459, 17329, -280105, -287235, 121272, -63925, 179833, 120002, -36480, 220618, 65667, 7103, 2625, 107010, -465423, -37472, 126224, 99081, 68572, -23306, -11100, 39556, -52561, 80886, -437294, -310770, 232508, 216519, 228124, -51339, 124315, 187900, -11296, 72613, 127907, -9831, 210137, -94050, -332035, 14846, -285742, 101824, -46966, 31949, -393714]
12080D7814a52281f3746j0044C8652N3029K02698J12684P78431R74295p46148
12070A413641D86188A49286j0328a5739n8909B48252C2710P1713D9763J16225
12060A65988b50904A71951H2438d61355E469K30691C2424J77139F0386J21936
12050A82322b34507A03416c5266l33970J45957A11872O4950a69969C8079J23226
12040A61305A9482K6227e3743A18705b31113B9141a96795j34240B4033Q5144K00817
12029C09994D9754c27266g8172m60562b42343h142B16911h0802K4928m0134k36348
12018c32356A03472c1309A50682g765k46771A55957o7293O497a4746F7342b28180
12006a49754k929D9573P4881a2624r0157r9103F3478R0887a36850A94453a08822
$$ y = [47814, -152281, -63746, -73790, 38652, 91681, 294379, 407063, 1185494, 2159789, 1413641, 486188, 149286, 138958, -15739, -74648, 248252, 32710, 104423, 49763, 165988, -250904, 171951, 82438, -461355, 5469, 236160, 32424, 209563, 60386, 182322, -234507, 103416, -35266, -369236, -223279, 111872, 176822, -169969, 38079, 161305, 19482, 45709, -53743, 118705, -231113, 29141, -196795, -331035, 24033, 109177, 309994, 49754, -327266, -78172, -538734, -242343, -8142, 216911, -80802, -55874, -96008, -332356, 103472, -31309, 150682, -7765, -254536, 155957, 88664, 95161, -14746, 67342, -228180, -149754, -152683, 49573, 124454, -12624, -102781, -201884, 63478, 154365, -136850, 194453, -108822]
11994a2451D9432a13664C8423K1719A0269A437i7207K7325G4894B0737N5222J61746
11982B37705l5042H5247d4485j08020B66225A13051a19658c9319r7717A12906
11971a05263B02073F5946c17225e7714N87m0442C6500J9797a06491I5015O9176
11960A64191b62622i7789n5442D7174K64150a62219A52720e7559B4912h6791B3004
11948C05296C3205a02249N700B4013c5666n7408B1335Q6601N1298f6859D1285
11936A28117F3587J38391J4681b11381o1926H1707J96516k7238d19237a77794
11925A35000g4872B74492E4005R5103a91467d1530k70408D13728F3009J93825
11915B56834D8877Q659C07c2067n9730k58328B29292d5898A63040b06537I078
$$ y = [-12451, 49432, -113664, 38423, 60142, 10269, 1437, -97207, -69882, 74894, 20737, 75959, 237705, 202663, 85247, -44485, -152505, 266225, 113051, -119658, -39319, -137036, 112906, -105263, 202073, 65946, -317225, -57714, -57127, -97569, 36500, 56297, -106491, 95015, 164191, -262622, -97789, -153231, 47174, 311324, -162219, 152720, -57559, 24912, -86791, 23004, 305296, 33205, -102249, -96549, 24013, -35666, -93074, 21335, 107936, 159234, -66859, 41285, 128117, 63587, 201978, 216659, -211381, -273307, 81707, 278223, 250985, -419237, -177794, 135000, -74872, 274492, 54005, 149108, -191467, -41530, -311938, 413728, 63009, 256834, 48877, 57536, 307, -32067, -91797, -350125, 229292, -45898, 163040, -206537, 9078]
11903A95491a10729d5037a7734j91128f5401E1409J63909G4953a41539K490A71103
11891a08313K2497O279B10743a31806b4323k40399A98202f6370p9090N8169j33831
11880b21122M543r3748B6376a4270n8260F8941J71306D5033a04948B11759b02383
11868B3048e3137j03993N8692J3930B27508b94337B8849M9409J36141p992A4550
11856h7012k4391k26527A56152J38475a4040k99579a15679A11142k3471J07820
11846A95491n9678a49990d8723p3611j814k5028m0977A58682c64306a2114B71054
11834G1279a26934m5731A92547h2727I3121a30894A49196c04829j08095e5536
11823G8017h4865q3041m9146B92899g7853K9671n0647E63745b4716l83292g0758
$$ y = [195491, -110729, -45037, -17734, -208862, -65401, 51409, 215318, 74953, -141539, -139049, 171103, -108313, -85816, -79537, 210743, -131806, -24323, -264722, 198202, -66370, -145460, -87291, -221122, -216579, -310327, 26376, -14270, -72530, 68941, 240247, 45033, -104948, 211759, -202383, 23048, -53137, -157130, -98438, -84508, 227508, -294337, 28849, 78258, 214399, 206407, 14550, -87012, -111403, -337930, 156152, 294627, -14040, -313619, -115679, 111142, 87671, 195491, 135813, -149990, -48723, -122334, -124148, -149176, -190153, 158682, -364306, -12114, 271054, 71279, -126934, -172665, 192547, -82727, 93121, -130894, 149196, -304829, -412924, -55536, 78017, -84865, -167906, -217052, 292899, -77853, -48182, -98829, 563745, -24716, -408008, -70758]
11811a14498j3079J9415o5848b8827A17617c05863A77018a1162E0627a03661J6163
11800h7498A35141n7483a01335E6903d48296d4113n905k82226B73676o5204J19727
11789C28199b80377A09411A7346b0987q5062F2863M2918i0150A49198f2546C05742
11777f6429k5041m6102A05680i093b738l2948G2441g8730a8653A5088K66399a29868
11764A80023A787O7294R4165M0996a00724F0365J81940b312p2968B36663a06331
11752A8117c224B09443b60502G7388C7509b46218C58725d3762M344A9625a04780
11740a88827D10766A00024c0603k32561a12535B18202M3397j03974Q5010p4010
11730A68625F7359h7708L1700B97428E5573M4347J52762K0038I8132f1577A99656
$$ y = [-114498, -127577, -108162, -174010, -28827, 117617, -305863, 177018, -11162, 50627, -103661, -87498, 135141, 77658, -101335, 56903, -448296, -44113, -50018, -332244, 273676, 208472, 328199, -280377, 109411, 17346, -20987, -106049, 62863, 105781, -90150, 149198, -62546, 305742, -66429, -91470, -137572, 105680, -9093, -2738, -35686, 72441, -78730, -18653, 15088, 281487, -129868, 180023, 1787, 69081, 163246, 204242, -100724, 60365, 242305, -2312, -75280, 236663, -106331, 18117, -3224, 209443, -260502, 77388, 37509, -246218, 358725, -43762, -39418, 19625, -104780, -188827, 410766, 100024, -30603, -263164, -112535, 218202, 261599, 157625, 242635, 168625, 67359, -87708, -56008, 297428, 55573, 99920, 252682, 272720, 98132, -61577, 199656]
11718A69125J22359H6093B2242J12295K14534a85053c7958K848B46859a39097
11707c01837A72932p9277Q9620J92928j86659j6449n9046b3954B21593c6292j05875
11696a42167A71001a81991b9984j15826A50077a21653k76385A45673E3286J07726
11686A61012d05483f1299D012b50632L9113K7008A45782a80363a735B24596a2999
11674b19308c6353C6570b37848e6061E0460a55441H2233B7782o611b8217j02391
11663a30608E1436a70061N3203F8489M4102e6180A6515b31202B53856g567H3836
11651A06310a644j21877A54085M8561b194B5778d7203l64009C06948a81636I2337
11639g1644B6065L68282A21103a74395C56755a66415h1659k5262K4735c6563n4152
$$ y = [169125, 291484, 86093, 22242, 134537, 349071, -185053, -37958, -35110, 246859, -139097, -301837, 172932, 93655, 183275, 376203, 189544, 173095, 114049, -23954, 221593, -36292, -142167, 171001, -181991, -29984, -145810, 150077, -121653, -398038, 145673, 53286, 161012, -405483, -61299, 4012, -250632, -211519, -184511, 145782, -180363, -1735, 224596, -12999, -219308, -36353, 36570, -237848, -56061, 50460, -155441, 82233, 27782, 21171, -28217, -130608, 51436, -170061, -116858, 68489, 112591, -56180, 16515, -231202, 253856, -7567, 83836, 106310, -1644, -123521, 154085, 202646, -2194, 25778, -47203, -411212, 306948, -181636, 92337, -71644, 26065, 394347, 121103, -174395, 356755, -166415, -81659, -106921, -82186, -36563, -90715]
11628i0715B36250k6677H0643b91749h3389K668a1897k0409J0795C0075J57354
11617A87429a79203N3394A818J900a9069j2449B20077b41202A53276a230A04426
11605a76466c1236B14513r2336B6737J49351b6104B42592b09576A24438J17877
11595B42315e0634j14308A03577f3491B78081n9403E6898d5609f129B23810b9661
11583G6888K87978a47365A02427c5693A7466K71582a94771h271A5213c9907D3451
11571C74727D1298M9758J78974g1106C5876A0939b69127a05507C70747o0258a04590
11559A22894c1011A26499J4391c0808A31492e914C46450A48115L00791E829K0465
11548B6294R1178b22322B83112j41245a36236A27189b41532B07375m0376q0651
$$ y = [-90715, 236250, 209573, 80643, -291749, -83389, -80721, -11897, -32306, -21511, 30075, 187429, -179203, -125809, 1818, 3718, -19069, -31518, 220077, -241202, 153276, -1230, 104426, -176466, -31236, 214513, 122177, 26737, 176088, -26104, 242592, -209576, 124438, 242315, -50634, -164942, 103577, -63491, 278081, 218678, 56898, -45609, -6129, 223810, -29661, 76888, 364866, -147365, 102427, -35693, 17466, 289048, -194771, -8271, 15213, -39907, 43451, 374727, 41298, 91056, 270030, -71106, 35876, 10939, -269127, -105507, 370747, 310489, -104590, 122894, -31011, 126499, 140890, -30808, 131492, -5914, 346450, 148115, 448906, 5829, 26294, 117472, -222322, 283112, 141867, -136236, 127189, -241532, 207375, 166999, 86348]
11538H6348j307M888a27581E2409p61K499P2666c25888C3986r539i7885A48030
11525A70641a58077c580q5379C5817c23987A95423K3157i2527d0958J0214A56301
11513D41608B8834K74388A25613f9200I3049Q2668l7074j3211K03032j8874A41958
11501D51060A62303J29305B2389a52094H9628R1674a21626G129a71696D7741J92592
11490B40333p3765C9449a31102B51989G788K31809M8595j9471K8661A32964o5290
11479F7674g2984C66540j49891r196E9460Q0046K68171n7609A20357d1537B55139
11467B61359d5873C84289P5446A77785K1316g817A8023O3503L57535j86381R5254
11456C47934i0481B43513c4242A34892C6443Q067b4063B62224I4468J61011k2025
$$ y = [86348, 85041, 89929, -127581, 52409, 51648, 54147, 126813, -325888, 33986, 24447, -97885, 148030, 170641, -158077, -3580, -88959, 35817, -323987, 195423, 218580, -92527, -40958, -30744, 156301, 441608, 28834, 303222, 125613, -69200, 93049, 175717, 138643, 125432, 328464, 309590, 141958, 451060, 162303, 291608, 22389, -152094, 89628, 181302, -121626, 7129, -171696, 47741, 240333, 166568, 39449, -131102, 251989, 7788, 239597, 288192, 268721, 297382, 132964, 67674, -72984, 366540, 216649, 207453, 59460, 139506, 407677, 350068, 120357, -41537, 255139, 261359, -45873, 384289, 459735, 177785, 199101, -7817, 18023, 81526, 439061, 252680, 347934, -90481, 243513, -34242, 134892, 36443, 44510, -24063, 262224, 94468, 255479, 233454]
11445B33454H5532J58586p6477J8862K21415A74489Q9317K1700d6830j17774C08813
11433I9234b6136l5023A91369a13957B04643I2788a46295D89750a08313F7289
11422C7357K07255m65e68200A16699b85803H7131b7607A89698R6241j37461C1821
11410B03087h4419a229A60066a39813A21020j0738a40507p6037A30728a20714
11399A8498O3424L33574i9820M6330A76257D8216G58b53516J05613E8953d89E3457
11386b57094A8865b88579a687n1544I1304c23018A56083b2532A95909B9155L9733
11375F8888j6315a70986J4551A32605Q1962b85728e4643l86469J02272B25833
11364B043K17515g2783C07036D9122J12811a92261L7612O7033b7716k58219e1944
$$ y = [233454, 85532, 244118, 167641, 186503, 407918, 174489, 263806, 285506, -46830, -164604, 308813, 99234, -26136, -61159, 191369, -113957, 204643, 92788, -146295, 489750, -108313, 67289, 37357, 244612, 244147, -568200, 116699, -285803, 87131, -27607, 189698, 285939, 148478, 31821, 203087, -84419, -1229, 160066, -139813, 121020, 110282, -140507, -216544, 130728, -120714, 18498, 81922, 415496, -99820, -53490, 176257, 48216, 758, -253516, -147903, 58953, -489, 53457, -257094, 18865, -288579, -1687, -53231, 91304, -323018, 156083, -22532, 195909, 29155, 68888, 52573, -170986, -156435, 132605, 214567, -285728, -54643, -441112, -338840, 225833, 2043, 219558, -72783, 307036, 49122, 161933, -192261, -154649, -87616, -27716, -285935, -51944]
11352E8953d56265h2310C21935j14782A01561a49301A16301f0051a1906j13883
11342a25789D96745H4328g6995B3280b67110h4821a2709j94636P5670f4082p7236
11331a41318A46811f2598k35565A42652a1175k07957C6389c34911A36338a97992
11320c22211B76994a83526B2420b16707B13280a93296B48144n0329e3439n0714
11310a04153l45465B2981J17436n0382Q3917e0763d710A73290B9581J0590f6643
11298e0517I2525b00888g2983e004o1401j62162a5440o1825l980a4195B11281
11286A65875J33765j20436a41986r4646Q1790O4018j54451A6581e2143p21B56857
11274d1367A99253q6750q35a88395A90551i1936J0009j54455A98886e6216q9222
$$ y = [58953, -456265, -82310, 321935, 207153, 101561, -149301, 116301, -60051, -11906, -125789, 496745, 84328, -76995, 23280, -267110, -84821, -12709, -207345, -131675, -64082, -141318, 146811, -62598, -298163, 142652, -11175, -219132, 36389, -334911, 136338, -197992, -322211, 276994, -183526, 22420, -216707, 213280, -193296, 248144, 197815, -53439, -104153, -449618, 22981, 140417, 90035, 173952, -50763, -4710, 173290, 29581, 40171, -66643, -50517, 92525, -200888, -72983, -5004, -66405, -228567, -15440, -77265, -81245, -14195, 211281, 165875, 299640, 179204, -141986, -236632, -154842, -90824, -245275, 16581, -52143, -52864, 256857, -41367, 199253, 112503, 111668, -188395, 190551, -91936, -81927, -236382, 198886, -56216, -145438]
11263a45438f0187B69316g4727k01350i8087B4192P4330P684m7527e6183B21665
11251A13604J0810b51505A45292b41739A6111e8541r8412L6693k21497J46860
11241a94897n2761b4660Q39n00373b17595j19087H1357a9444A41563a05537p851
11230a13388A52256b80889F1263d3359B8115K04959b56729e720H1475j9756M5032
11219A06751b0442h277j72582C37160a14905I4657f2025r0346A54255G0255J00270
11208A70525B4910L0202c5304k20948B93671j30044R8021b91247e8088a6748M210
11197a2538D5254J24137b82251H0928h7723F7021J51284B0467a97785j1564C047
11185D60960g5267A050e3143r3523r7610B57437p6689a32964k08363G3661R387
$$ y = [-145438, -60187, 269316, -74727, -276077, -98087, 24192, 98522, 106206, 58679, -56183, 221665, 113604, 124414, -251505, 145292, -241739, 16111, -58541, -156953, -120260, -341757, -194897, -247658, -24660, -23821, -524194, -217595, -336682, 81357, -19444, 141563, -105537, -113388, 152256, -280889, 61263, -43359, 28115, 233074, -256729, -5720, 81475, 61719, 106751, -20442, -8277, -180859, 337160, -114905, 94657, -62025, -152371, 154255, 70255, 170525, 24910, 55112, -35304, -256252, 293671, 163627, 261648, -291247, -58088, -16748, -12538, 45254, 169391, -282251, 80928, -87723, 67021, 218305, 20467, -197785, -209349, 3047, 460960, -75267, 1050, -53143, -146666, -244276, 257437, 180748, -132964, -341327, 73661, 83048]
11174H3048c02857a278C44526A46424A6318b0527E5861a42393H7712J33277J24902
11163C45891G994a7890I9993e9055j02602a3405I5992d9515m2804k12125A57696
11151F1649a81408N0583K3547M444A01592R1922c61028B73384D4449K7197k9077
11140D2569a53565A23322E9460h3213I4733g7105K0335A47920J1142a52481L3328
11129a19153A20710b4952A4872a85682F4796R4060g5610C44823E0016J66990D4542
11117g6587A91907K31479k06034b46517A23244E3253L49423j56242b25792g481
11106C65936A48020J671k1907R567a0489D52872p2968F5503b26174D02331K9117
11095D31448B12496L393A9200J98940K4657A01085K41496l9773J25223F1782L86644
$$ y = [83048, -302857, -1278, 344526, 146424, 16318, -20527, 55861, -142393, 87712, 220989, 345891, 7994, -17890, 99993, -59055, -161657, -13405, 95992, -49515, -92319, -304444, 157696, 61649, -181408, -130825, -107278, -102834, 101592, 193514, -361028, 273384, 44449, 71646, 42569, -153565, 123322, 59460, -83213, 94733, -77105, -56770, 147920, 159062, -152481, -119153, 120710, -24952, 14872, -185682, 64796, 158856, -75610, 344823, 50016, 217006, 44542, -76587, 191907, 423386, 217352, -246517, 123244, 53253, 402676, 246434, -225792, -7481, 365936, 148020, 149691, 127784, 137351, -10489, 452872, 379904, 65503, -226174, 402331, 431448, 212496, 215889, 19200, 218140, 242797, 101085, 342581, 302808, 428031, 61782, 448426]
11084D48426r6642j20636m7006p067J98774J74735k49171K11415Q4043B80893
11073D21836G0519K71314a5574D95387j44497A44504J68702N3036j15143J60830
11063D11929j96939N3220M54005l28269P8095P7114K53367j01530J10509B33101
11052H72510k4731k48823J25884o0620o8214K59069j32197j01689J8900O947k68791
11041C78245N16113j50085L3523j0705n5722j56410p3949K71965K290j52170M43701
11030A046796j95545O1918J03780m74120M4034K91986k84597Q5784j751R7884
11020G76169o2959j3469M2700A88427J87831J61933j7671m7110M07423C90653
11009E03923M73511m12645r9898J57587J67329k93367J77629m881L5006M9998
$$ y = [448426, 351784, 231148, 184142, 177075, 375849, 550584, 301413, 512828, 596871, 280893, 421836, 70519, 341833, -15574, 495387, 350890, 144504, 313206, 366242, 251099, 411929, 214990, 268210, 722215, 393946, 472041, 549155, 802522, 700992, 811501, 233101, 872510, 847779, 598956, 724840, 664220, 596006, 855075, 722878, 621189, 640089, 647036, 378245, 894358, 744273, 777796, 767091, 711369, 554959, 481010, 752975, 755265, 603095, 1046796, 851251, 913169, 1016949, 542829, 586863, 878849, 594252, 680036, 678285, 776169, 713210, 699741, 742441, 188427, 376258, 538191, 520520, 473410, 880833, 390653, 503923, 977434, 564789, 464891, 622478, 789807, 496440, 674069, 669188, 704194, 754192]
10999G54192o45k06520j79929J19351L90409m9818j60865j29847R6654J85019
10989H18001k60022K32428K67438j48627Q2658j60093L0797K94531r9106J7409
10979A075414L48619j70010J75998L01028K53880J71813k4241K16245O93399l25816
10969B716329M15007o80427J12010r9483o12103K5408m48461L69887n8818k34856
10959A504493J90023J44422l13606L78052k05998J51616K1932l36716m27144L4298
10949A141372j76512j75365j16614j40487A99688L03601J2543k57680q6100J17219
10939B89271A8142Q2139N8270Q6302J61659m9348R3659C1010d6942C55983A47257
10927g5460A67296J30321A09532O901a7012k40768b0955j78600k8761A93244O7316
$$ y = [754192, 753547, 547027, 367098, 486449, 876858, 827040, 666175, 536328, 632982, 818001, 557979, 790407, 1057845, 909218, 991876, 831783, 862580, 1157111, 1058005, 1075414, 1424033, 1254023, 1430021, 1731049, 1984929, 2156742, 2132501, 2348746, 3042145, 2716329, 3131336, 2450909, 2562919, 2463436, 1851333, 1876741, 1428280, 1798167, 1739349, 1504493, 1694516, 1838938, 1525332, 1903384, 1697386, 1849002, 1870934, 1534218, 1107074, 1141372, 964860, 789495, 672881, 532394, 199688, 503289, 515832, 258152, 172052, 289271, 18142, 100281, 158551, 244853, 406512, 357164, 450823, 31010, -46942, 355983, 147257, -75460, 167296, 297617, 109532, 116433, -17012, -257780, -20955, -199555, -228316, 193244, 260560]
10916B60560a90932d3208I3209B2691d9731I5998B4091c047F9058Q8693Q290b18767
10903B1811a24803D25765f8469A13597a70220k1125D097h547A08809J01382H1873
10891A4738K30258e909j38200e2306A14279J7625b35620B00967r3898a40697k5986
10880a66683a3896H3663j5107d0781k73365F1616c0474D8121c79428A2744L10867
10869C23611b56262J03256A94926J42345A0962J81468H8807l2228i378j93537
10859b02915e6460B95471c0603A39897k7122b77868a32265o3731N8147l2907M6767
10848a23989C06597B9796d70756A70264m2337a16984l2496A98438o3688e1569
10837d04115A20595c8517m2915B3484N108b73070N6321G3365K7952d72838E09419
$$ y = [260560, -190932, -43208, 93209, 22691, -49731, 95998, 24091, -3047, 69058, 157751, 166041, -218767, 21811, -124803, 425765, -68469, 113597, -170220, -191345, 4097, -8547, 108809, 210191, 81873, 14738, 244996, -5909, -144109, -52306, 114279, 131904, -235620, 200967, 107069, -140697, -166683, -13896, 83663, 68556, -40781, -314146, 61616, -30474, 48121, -379428, 12744, 323611, -256262, -153006, 194926, 337271, 10962, 192430, 88807, 56579, -9378, -202915, -56460, 295471, -30603, 139897, 112775, -277868, -132265, -195996, -137849, -170756, -123989, 306597, 29796, -470756, 170264, 127927, -116984, -149480, 198438, 134750, -51569, -404115, 120595, -38517, -81432, 23484, 28592, -273070, -216749, 73365, 101317, -472838, 509419]
10825a24481O0428A66445e2694k91229D6781J55353J835a57296r278B03598J23942
10814C27540b8721B6863j0103a63173J5532B126a26928H9230J11988E16J9469
10803A9985a88269C1735C631J58970F250J78195A4083K5219K61489a62382D945
10791h0119j8522o2420a270l6242A01862c5787l13061b9205A40589D735c9823
10779a44761m0010A88592p9982b40971F3270b18607P8002j14840a01770F9233
10768A59618F9935c7446m9385l1892G9080a31135A76988c5109F8966f6125m4593
10757a10718A47738n6889D0620a24753D36344a92161G623a29020k25530A07446
10746B15456E191a88072O6120j54184b4157k65935J24250B538L28736a50378j83309
$$ y = [-124481, -64053, 166445, -52694, -343923, 46781, 202134, 203969, -157296, -166574, 203598, 327540, -28721, 26863, 16760, -163173, -147641, 2126, -126928, 89230, 201218, 516, 19985, -188269, 31735, 3631, 162601, 6250, 184445, 14083, 39302, 300791, -162382, 4945, -80119, -98641, -161061, -1270, -37512, 101862, -35787, -348848, -29205, 140589, 4735, -39823, -144761, -184771, 188592, 108610, -240971, 63270, -218607, -140605, -255445, -101770, 69233, 159618, 69935, -37446, -86831, -118723, 79080, -131135, 176988, -35109, 68966, -66125, -110718, 147738, 90849, 40620, -124753, 436344, -192161, 7623, -129020, -354550, 107446, 215456, 5191, -188072, -121952, -276136, -24157, -290092, -165842, 2538, 331274, -150378, -333687]
10735c33687A9814b23554J7369C76850h4636A68084C0627O5399c2986n9180K9484
10724f2682G4759a97257i0406r1494l16500a07144B94314D082a88346m5437f0937
10712b2585o7589K0728j03384j66982F2026a09444c5122j75130B8318J5568e7973
10700a06112M2420r8743n877K9175H059a35937I3629a43676A8659J2008b6072
10688D0518a31574K0321n2900D3629h685B7184a88667P252D4748b3778i469A12079
10675I7179B6252M4096g6066j56055p5646D924a76580l0000h1637o6414q5506
10664b33557f8817j60193N9515f9635k37588A37975C2990M5955k7327M9493P0073
10653A71184n7824d5887j04127H5912c83716H8759a93400F9412J38559n3496a9888
$$ y = [-333687, 19814, -223554, -206185, 376850, -84636, 168084, 30627, 96026, -32986, -92166, -62682, 74759, -197257, -90406, -181900, -498400, -107144, 294314, 4082, -188346, -233783, -60937, -22585, -90174, -69446, -172830, -339812, 62026, -109444, -35122, -210252, 28318, 43886, -57973, -106112, -63692, -162435, -168312, -139137, 8059, -135937, 93629, -143676, 18659, 30667, -26072, 40518, -131574, -111253, -164153, 43629, -8685, 27184, -188667, -181415, 44748, -23778, -9469, 112079, 97179, 26252, 70348, -76066, -232121, -307767, 4924, -176580, -206580, -81637, -148051, -233557, -68817, -229010, -169495, -69635, -307223, 137975, 32990, 78945, 51618, 101111, 171184, 113360, -45887, -150014, 85912, -383716, 88759, -193400, 69412, 207971, 154475, -19888]
10641D6372a58916A82409i3251j06403e6091B92782j33494J12512c85358n1991
10631d37349C0829K5854d7790e847G6775a02806G4506d50849D832K50276a33428
10619E0020Q5563B8024M4640K26426b81760B96283a81791A75472q0252a56457
10608d8547B95408D065K3989a80948e3915j44759f366A0407a72780j1226G2980
10596b76995a10340H2468b96435C28119d5594m0244k16344i0775L4483m67406
10586e23698a12793j81335G166N8297B8416J21926a03875B23343b67965R1920
10576a76045P2445b8029j24457B15420b80978A57137C5267c53254g3729b3323
10565I012K79820a09953A22519I0a03461c3825k09629a08800p2239A73162b41495
$$ y = [46372, -158916, 182409, -93251, -199654, -56091, 292782, 159288, 271800, -385358, -437349, 30829, 56683, -47790, -5847, 76775, -102806, 74506, -450849, 4832, 255108, -133428, 50020, 135583, 28024, 72664, 299090, -281760, 296283, -181791, 175472, 95220, -156457, -48547, 295408, 4065, 28054, -180948, -53915, -198674, -6366, 10407, -172780, -184006, 72980, -276995, -110340, 82468, -296435, 328119, -45594, -85838, -302182, -90775, -56292, -523698, -112793, -294128, 7166, 65463, 28416, 150342, -103875, 223343, -267965, -176045, -103600, -28029, -152486, 215420, -280978, 157137, 35267, -353254, -73729, -23323, 9012, 288832, -109953, 122519, 90, -103461, -33825, -243454, -108800, -181039, 173162, -241495]
10553H5679l6933k0722b43708e9478B44734I8639a33463A40504C1518J06053F4322
10541A82967C64b03136j1985A27219a95330A6179e2719j82723G0458b79808M9195
10530b30613A96737f6710m1025I1141f5099A95293b03859A71849c01075B87427
10519A14683a05128l8278A17229m1306J30140b03350Q0788j4915J2922c3796o6558
10508a00354A473J56460C7709j2310b49124f8705j63357j9281Q969h5344A22559
10496a26477B28884g3266K2413l64014K02547j64443A67212F4817L1415J02095
10486A98327E0984a10593j46716A14872D7056b6465E40324P1750j21419j33236
10476C57419j72846D774f8116B58944A17957a53732A32241J80800e5058b2904
$$ y = [85679, 48746, 28024, -243708, -59478, 244734, 98639, -133463, 140504, 31518, 137571, 64322, 182967, 364, -203136, -215121, 127219, -195330, 16179, -52719, -235442, 70458, -279808, -230613, 196737, -66710, -107735, 91141, -65099, 195293, -203859, 171849, -301075, 287427, 114683, -105128, -143406, 117229, 75923, 206063, -203350, -122562, -137477, -124555, -33796, -100354, 1473, 157933, 37709, 25399, -249124, -68705, -232062, -251343, -242374, -85344, 122559, -126477, 228884, -73266, -50853, -414867, -212320, -376763, 167212, 64817, 96232, 198327, 50984, -110593, -257309, 114872, 47056, -26465, 540324, 612074, 490655, 357419, 184573, 4774, -68116, 258944, 117957, -153732, 132241, 313041, -55058, -22904]
10465D7596J95115a45009A941a8255j36205I7725r599b42387R5427d3595a4630
10453B06092a32523f1087j09779A50489L794a25540r0633R6637a0458B77756r7251
10442A80505b3856k8928l31053q25C12449B7K1303e6814j22562A8594a26648c4010
10429C09021c3399j86477E9955a88992C6017K66694G7615M509a4930B66558A07228
10417b14730b8102B95830G2807e14453a48564A31078C0747J25459k9940a30385
10406c7530p7310N2286i507A64023b06941l8769P9305q1162A4637g080B76446
10394B05077J65737G9520L9515a61549F6608B6489K44392L0107G3179K73008H950
10382d7268E6522J13118l8211M6431a63254H1998c20185C32145A50854a59313
$$ y = [47596, 242711, -145009, 1941, -18255, -154460, 97725, 88126, -242387, -146960, -43595, -14630, 206092, -132523, -61087, -170866, 150489, 154283, -125540, -216173, -119536, -10458, 277756, 180505, -23856, -52784, -383837, -384662, 312449, 27, 21330, -56814, -179376, 18594, -126648, -34010, 309021, -33399, -219876, 59955, -188992, 36017, 302711, 77615, 82124, -14930, 266558, 107228, -214730, -28102, 295830, 72807, -514453, -148564, 131078, 30747, 156206, 126266, -130385, -37530, -114840, -62554, -9507, 164023, -206941, -245710, -166405, -247567, 14637, -7080, 276446, 205077, 370814, 79520, 119035, -161549, 66608, 26489, 270881, 300988, 73179, 346187, 8950, -47268, 56522, 169640, 131429, 177860, -163254, 81998, -320185, 332145, 150854, -159313]
10371A48920L77583B21350M31748A58007L31787K0339r8513j84032J30342d870
10360E4150J77301a27090A63335o4855a11271C30247D6186J38118M7498M17895
10350F49697p4151J12405B23504n1025L1841J2017L27440B25037o9285r837K18130
10339C64045M6812b09090B85361j08030P6422q4580p2135k2143K98241A14164
10328e5555C13042j19600F8920K27166a02634E63123F3725L29348L913o5987l8800
10317B92199A7476a52796d3474B84144m6057b04931A33332a48921m0294c4416
10306A19250j6811b50587b6121D9519Q5805A8350b11194j8114h7674d1013j46777
10295a87790A25197L835j3958a32435A1490a51028H0203b63939d7290h839m02345
$$ y = [148920, 526503, 221350, 653098, 158007, 489794, 510133, 411620, 227588, 357930, -4870, 54150, 231451, -127090, 163335, 98480, -111271, 330247, 46186, 184304, 231802, 649697, 575546, 687951, 223504, 172479, 204320, 216337, 543777, 225037, 155752, 145915, 364045, 410857, -209090, 285361, 177331, 253753, 169173, 97038, 74895, 373136, 114164, -55555, 313042, 193442, 68920, 296086, -102634, 563123, 63725, 393073, 396986, 330999, 292199, 17476, -152796, -43474, 284144, 238087, -204931, 133332, -148921, -189215, -34416, 119250, 102439, -250587, -26121, 49519, 135324, 18350, -211194, -229308, -87674, -41013, -187790, 125197, 129032, 115074, -132435, 11490, -151028, 80203, -263939, -47290, -8839, -411184]
10284d11184e3597A40001a62139E5022a02279A757L5932a96577h2871E89g9102
10272a28758n5087A21809i4702B57519j28113e6412a9617l498j28391H7452c4180
10260G4517L08142E1933M8881K53721J1474j27519d2311A3771K81319h5473c8709
10248A43595b13148a6506A15458a86499A34011a11844k77037A61061J01359c96922
10237C1150d2482C06209b95015F645J15845j7130f0769q3617A43311g0930q1385
10226a52315D1086R6666b05939A2615f5777j14829k25429a05646d0321c549r9497
10215a03046c8864I1863G365c5808B67845G7164K14826b1653l42267a28806j61002
10204b89808i1186d0178k04781a13423F1852B9793K37370a4992j17437N5978m8022
$$ y = [-411184, -53597, 140001, -162139, 55022, -102279, 1757, 37689, -196577, -82871, 589, -79102, -128758, -183845, 121809, -94702, 257519, 129406, -56412, -19617, -23115, -151506, 87452, -34180, 74517, 382659, 51933, 100814, 354535, 366009, 238490, -42311, 13771, 295090, -85473, -38709, 143595, -213148, -16506, 115458, -186499, 134011, -111844, -388881, 161061, 262420, -396922, 31150, -42482, 306209, -295015, 6645, 122490, 105360, -60769, -144386, 143311, -70930, -152315, 41086, 137752, -205939, 12615, -65777, -180606, -406035, -105646, -40321, -3549, -103046, -38864, 91863, 7365, -35808, 267845, 77164, 291990, -21653, -363920, -128806, -289808, -91186, -40178, -244959, -113423, 61852, 29793, 267163, -14992, -132429, -76451, -124473]
10193a24473j79148a07292o9863A53526b56275j50572a06570r9211f4617h555
10182c8300j7942A98140M7794E6155P2734a81362K8459j88768E3588d84238e7062
10170a33918I1499d5426j25938E6315M3965i1274k09461j37160A66360b06519
10159a31497p2856d8544H0102d3772D5805c78054g0280j63899A78422o7499a00952
10147h1970K8857j96558K4989j87124a86701q940B191N9848c4873q3502k49409
10136c67784g9519A21432e6080r6648d4942m2602A73719H6197L9378a21250A98694
10124a0141r7865C07250c2702l91656J93517A37454c2625C2675A4918f3425o876
10113g0301j99615F3789a40866j73399i9027o4690B80478j16034E5319A1506L16514
$$ y = [-124473, -303621, -107292, -177155, 153526, -256275, -406847, -106570, -205781, -64617, -8555, -38300, -56242, 198140, 245934, 56155, 128889, -181362, -152903, -341671, 53588, -484238, -57062, -133918, 91499, -45426, -171364, 56315, 100280, -91274, -300735, -437895, 166360, -206519, -131497, -204353, -48544, 80102, -43772, 45805, -378054, -70280, -234179, 178422, 110923, -100952, -81970, -53113, -249671, -224682, -411806, -186701, -195641, 2191, 62039, -34873, -118375, -367784, -79519, 121432, -56080, -152728, -44942, -87544, 173719, 86197, 125575, -121250, 198694, -10141, -108006, 307250, -32702, -424358, -230841, 137454, -32625, 32675, 14918, -63425, -70301, -269916, 63789, -140866, -314265, -99027, -163717, 280478, 164444, 55319, 11506, 328020]
10102C28020i8587j81528a18003j30951G4160b48535F8185K2283b57600a21975
10091D9085J85058a1489r9295G284M24040a09670j70535B7764b51945a07562J608
10080a05954A67624b7202n5641B3575a77792l7337G6173K587b41896B63366j19256
10069A44110a06486M9068E3038Q5687a60280j23833Q0927F7305g9728J4309D8589
10057a52180b2964q0681k80508m6618B52929J7292j28525l0770a79609A6048J61085
10046A77133b91778b4994D3749h2733H15J82841b5335k78500P5104A4946b30913
10034B3992a51910o966k17375a63340f7922c3848A08966m2183c82434C77512I8621
10022A96406b0398l9299k930j25841R2316K3980j00087C7663b1894k69781G7075
$$ y = [328020, -98587, -280115, -118003, -248954, 74160, -248535, 68185, 90468, -257600, -121975, 49085, 234143, -11489, -110784, 7284, 431324, -109670, -280205, 27764, -251945, -107562, -105954, 167624, -27202, -82843, 23575, -177792, -215129, 76173, 78760, -241896, 263366, 144110, -106486, -57418, 53038, 138725, -160280, -284113, -203186, 67305, -79728, -65419, 48589, -152180, -22964, -103645, -384153, -430771, 252929, 270221, 141696, 110926, -179609, 16048, 177133, -291778, -24994, 43749, -82733, 815, 183656, -25335, -303835, -228731, 14946, -230913, 23992, -151910, -158876, -376251, -163340, -67922, -33848, 108966, 66783, -382434, 377512, 98621, 196406, -20398, -59697, -62627, -188468, -96152, -72172, -172259, 37663, -21894, -291675, 77075]
10010D143J09888M2998e8783e116j20140l6289j09528p0101e404j98984h6842
9998b90614c076j10794p196m7004A12093d041r8180A53169i668m61521B89743
9986a27788n1036f3488A05300b07503n626l53437b53026Q4136j5134a2045B72972
9974a38693B54765d2442a9927j72189A9725a36207h408j10914A52790c65778c0636
9962H9327L1405a65946A0578a25347A89075F426c38649J08867i745A02158a40711
9950b8214A15231b01697C92617b83949G1146K08468b62577F1785g2853l04618
9940c77471a3974l3481j94115a19746j03405j38492R6895b7034l01783b5572B19931
9928a16270j20767b0076j46272L9326A4834J49428a16237k4536j8169C875c19374
$$ y = [4143, 114031, 157029, -58783, -5116, -125256, -161545, -271073, -341174, -5404, -204388, -86842, -290614, -3076, -113870, -121066, -168070, 112093, -4041, -102221, 153169, -9668, -471189, 289743, -127788, -178824, -63488, 105300, -207503, -213129, -566566, -253026, -168890, -184024, -12045, 272972, -138693, 254765, -42442, -19927, -192116, 19725, -136207, -8408, -119322, 152790, -365778, -30636, 89327, 120732, -165946, 10578, -125347, 189075, 6426, -338649, -229782, -9745, 102158, -140711, -28214, 115231, -201697, 392617, -283949, 71146, 279614, -262577, 61785, -72853, -377471, -13974, -47455, -241570, -119746, -223151, -361643, -264748, -27034, -328817, -25572, 219931, -116270, -237037, -20076, -166348, -127022, 14834, 164262, -116237, -140773, -158942, 3875, -319374]
9916B32759A0324b23277A31378e4363B18475r5234J09108j12788b11206e7747
9905B34701a89024O5914m0380K2575f9824B8053e7974H1373b98405a35832G0361
9893b64930C3516R1505l2087A5472c80336h408k76003A04556a94692n2310h1719
9881g7797r1639Q4154J1744m6517B4887h4587K7927i062m3422n208j32491k19356
9869d09539J87973B27886a00452C002b2821f999j30461A87279n168c4118A78941
9857g953k83266C2506a21309m7737j61678H9278B7203R485b29753Q9251f7683
9845c22608A187b48076e852k05467M4049N7617q5648F3077e48774J96185O2175
9834b90414A05624c16638J18136c643o4076C1638g7122D07875G3628a36994A9539
$$ y = [232759, 10324, -223277, 131378, -54363, 218475, 123241, 232349, 119561, -211206, -57747, 234701, -189024, -123110, -163490, -140915, -69824, 28053, -57974, 81373, -298405, -135832, 70361, -264930, 33516, 125021, 92934, 15472, -380336, -8408, -284411, 104556, -194692, -247002, -81719, -77797, -169436, -85282, -73538, -120055, 24887, -84587, -56660, -9062, -52484, -57692, -190183, -409539, -221566, 227886, -100452, 3002, -22821, -6999, -137460, 187279, 182111, -34118, 178941, -7953, -291219, 32506, -121309, -169046, -330724, 89278, 27203, 36688, -229753, -140502, -67683, -322608, 1187, -248076, -5852, -211319, -167270, -109653, -195301, 63077, -548774, -352589, -290414, 105624, -316638, -198502, -3643, -67719, 31638, -77122, 407875, 73628, -136994, 19539]
9822f9354J8087G0243a49394j2167k8439A45383b37929M8619h1086A27503a55951
9810e1132A29726d11704a01020C95779A87232b74786f1289q4033B6114d272C57065
9798d35713G6176J0145c38130k24365I4894J6732e5483k3935k21022J12249M6940
9787a41251A27693a64160O7090k71437a54356A88130a801C1040J39623F4159c5451
9775D745O0628a91962H0921d9880F3645d7836A3769c1451j08375B28587c36323
9763a87078b7792f268j33412L9536A71819E5451d67293J3887f7490J6940A29146
9751A3931d65109D6498b24320J00914Q267D2043K60666A17358N5281i8069k56474
9740c54543B7322b02003e9187j6283F7766a46019M0352l4931a2055j89866i3255
$$ y = [-69354, -51267, 70243, -149394, -161561, -190000, 145383, -237929, -189310, -81086, 127503, -155951, -51132, 129726, -411704, -101020, 395779, 187232, -274786, -61289, -145322, 26114, -4272, 357065, -435713, 76176, 86321, -338130, -562495, 94894, 111626, -55483, -79418, -300440, -188191, -141251, 127693, -164160, -97070, -368507, -154356, 188130, -1801, 31040, 170663, 64159, -35451, 4745, 65373, -191962, 80921, -49880, 63645, -47836, 13769, -31451, -139826, 228587, -336323, -187078, -27792, -6268, -139680, -100144, 171819, 55451, -467293, -453406, -67490, -50550, 129146, 13931, -465109, 46498, -224320, -123406, -115139, 42043, 302709, 117358, 172639, -98069, -354543, 27322, -202003, -59187, -75470, 67766, -146019, -105667, -140598, -12055, -201921, -93255]
9728c96663a85361k05914a00896M8507D9780a60271d8247f189j15360q5275A80172
9716g0077A02578j0025J4042g3376o9688l6249Q8497J7337H7996M937a68225o9226
9704b37451J17706q3489o3165J7273B17376c74565a08601b993l16686P0320A99234
9692i2052F9155b15426a3831A78973a44397D09268a10380B013a57261d1899A8956
9680b37944C5931e5147o0498j72787L0917j57906A01708a25351k13651a14505
9669b51042J06388A35770c340A84142c7638m8331k6378F362e9422l2898D3428
9657D884a57583H2499K1477b39550b5603k64134a00744C4437i5148C6801b10828
9645H2015d25795J62271E0130h0606r4303j48221D684b45375a175D7627c1610
$$ y = [-396663, -185361, -391275, -100896, -52389, 49780, -160271, -48247, -6189, -121549, -206824, 180172, -70077, 102578, 92553, 106595, -73376, -143064, -179313, -90816, -73479, 87996, 92933, -168225, -237451, -119745, -203234, -266399, -249126, 217376, -374565, -108601, -2993, -319679, -249359, 199234, -92052, 69155, -215426, -13831, 178973, -144397, 409268, -110380, 2013, -157261, -41899, 18956, -237944, 35931, -55147, -115645, -288432, -257515, -415421, 101708, -125351, -339002, -114505, -251042, -144654, 135770, -3340, 184142, -37638, -85969, -112347, 6362, -59422, -92320, 43428, 4884, -157583, 82499, 103976, -239550, -25603, -289737, -100744, 34437, -95148, 36801, -210828, 82015, -425795, -263524, 50130, -80606, -174909, -323130, 4684, -245375, -1175, 47627, -31610]
9633e2405l8990J4020A40165B6529b46281H1938a91376k3096f4612B12907b09217
9621b07238B01504c5819j28761P6307a0024A84952a47600l0191o8793A45364D313
9609e12021g3972j91028E26181a75558Q3353C371O3829K4684b18988E843e2855
9597c18705g6456k02585D4146a95393B0088J68956A1592J83935b48555B47177
9586F1022b35877A5421a41219k34771a43616C38387E5865b20738e8009B93786
9575B08171F9235J45695b12002J05687B8834a1084A8515b4564k37474H1331P6822
9564A58153f4812p2473B08155i530j66173A78313K39936A70947a22317A9986i8009
9552A96703b07474A67324a31384G1956b49212L1395M2931g0356k49072P4267i8881
$$ y = [-52405, -91395, -77375, 140165, 26529, -246281, 81938, -191376, -214472, -64612, 212907, -209217, -207238, 201504, -35819, -164580, -88273, -10024, 184952, -147600, -177791, -246584, 145364, 4313, -512021, -73972, -265000, 526181, -175558, -92205, 3371, 67200, 91884, -218988, 5843, -52855, -318705, -76456, -279041, 44146, -195393, 20088, 189044, 11592, 195527, -248555, 247177, 61022, -235877, 15421, -141219, -375990, -143616, 338387, 55865, -220738, -58009, 293786, 208171, 69235, 214930, -212002, -106315, 28834, -11084, 18515, -24564, -262038, 81331, 158153, -64812, -137285, 208155, -9530, -175703, 178313, 418249, 170947, -122317, 19986, -98009, 196703, -207474, 167324, -131384, 71956, -249212, -217817, -174886, -70356, -319428, -245161, -98881]
9540a75195C0721C724Q1708K20761C0170a05628j03910d4459k88640e8295A76410
9528e9735k94420h4253k88079D0851b50931B2751R5524c90714a48104A28668a58815
9516A18851b591o1046j87032I1694O4347a73397C05433B0574b41343J15732c7240
9504b03625F0800a18312j13431a554n5154A26g1778i913j45634e3812l6786A04655
9491e7655j24546G3749c41247A18407a99655h1404j00656O2180e3723K1087k39987
9480b72623A45913c2223j56295k45221E2986a14720j07869a4328k36170h4222
9469d16058d9352A72010a11539E7657c58863C70644c11005J16615D7496a29079
9458c1468l36426J20357c3080j47649N4488C85571F7189g1396b9041m6020K7654
$$ y = [-175195, 30721, 3724, 85432, 306193, 30170, -105628, -209538, -44459, -333099, -58295, 176410, -59735, -354155, -84253, -372332, 40851, -250931, 22751, 118275, -390714, -148104, 128668, -158815, 118851, -2591, -63637, -250669, 91694, 156041, -173397, 305433, 20574, -241343, -125611, -37240, -203625, 60800, -118312, -231743, -1554, -56708, 126, -71778, -9913, -155547, -53812, -90598, 104655, -57655, -182201, 73749, -341247, 118407, -199655, -81404, -182060, -119880, -53723, -32636, -272623, 145913, -32223, -188518, -433739, 52986, -114720, -222589, -14328, -250498, -84222, -416058, -49352, 172010, -111539, 57657, -358863, 370644, -311005, -194390, 47496, -129079, -31468, -367894, -247537, -33080, -180729, -126241, 385571, 67189, -71396, -29041, -75061, -47407]
9447d7407j10183A91142g8429H541b93423g7336F0567g8876k22374d3276j6994
9436f0270A34719B1324b7820j02924a7849C02887a22158J7477d9920o6716k9789
9425a46425A75496i3668r7916j89524Q2298J29887I0511d30688f4989p7630d5578
9413G8325b33042G4105c89616E2653f3627E243M60165F6697a58776B28206a90317
9401I2094c74499J0039a0458j66380g3989D7290a49261A58813a14081E2371b39745
9389C26334E348c6521A26501c28027a07458A10778k9686g6440j1257K8116K3791
9378c5790B37219H7767J284a9430r1593D3843c7394j19781j9920C9886i0391j46432
9366b36823D4910l760a42169n4327G8047i0176j92151e7576j4260k56727J6734
$$ y = [-47407, -157590, 191142, -78429, 8541, -293423, -77336, 60567, -78876, -301250, -43276, -60270, 134719, 21324, -27820, -130744, -17849, 302887, -122158, -104681, -49920, -116636, -146425, 175496, -93668, -191584, -381108, -298810, -168923, 90511, -430688, -64989, -142619, -45578, 78325, -233042, 74105, -389616, 52653, -63627, 5243, 465408, 66697, -158776, 228206, -190317, 92094, -374499, -364460, -10458, -176838, -73989, 47290, -149261, 158813, -114081, 52371, -239745, 326334, 5348, -36521, 126501, -328027, -107458, 110778, 81092, -76440, -87697, -59581, -35790, 237219, 87767, 89051, -19430, -111023, 43843, -37394, -157175, -177095, 39886, -90391, -236823, 44910, 41150, -142169, -196496, 78047, -90176, -282327, -57576, -71836, -328563, -311829]
9355c11829a37732A92862B6320a80979J4849I7513a16619M6765C9385b72620d4714
9343d9624G365b85114a00327r0735B626K2683c29336J18009C0709a08696b2159
9331b34308A7624R5261f1556b0553P958G3627A6736b70157H0077a72594M2528
9320a30066A18227a19623A4206K19963M2216m9066A4793c09600P7535j70851c1573
9308b32893G6626J77590g9071j89034A40187F6765i559B3302K8608c2352E7237
9296B07629b05531J01689G4106d44299J14836Q2793Q6444A52039I146a17582G2278
9284a80493f1291n5846c4673j14824o3895c4538p0506r7887e8098m5122C6131
9272A51930a79301A96716d37562A54958O5342G9983d1462j7842A45043b15654
$$ y = [-311829, -137732, 192862, 26320, -180979, -166130, 97513, -116619, -69854, 39385, -272620, -44714, -49624, 7365, -285114, -100327, -191062, 2626, 25309, -329336, -211327, 30709, -108696, -22159, -234308, 17624, 112885, -61556, -20553, -12595, 73627, 16736, -270157, 80077, -172594, -130066, 118227, -119623, 14206, 234169, 276385, 227319, 14793, -309600, -232065, -402916, -31573, -232893, 76626, 254216, -79071, -268105, 140187, 66765, -9559, 23302, 51910, -32352, 57237, 207629, -205531, -103842, 74106, -444299, -329463, -246670, -160226, 152039, 9146, -117582, 72278, -180493, -61291, -117137, -34673, -149497, -213392, -34538, -105044, -202931, -58098, -103220, 36131, 151930, -179301, 196716, -437562, 154958, 220300, 79983, -41462, -59304, 145043, -215654]
9261C2857c9932B32758a25563j32150A84473l2300e6060A00743K00914b19222
9250a67732b0390l1338o9131I8578h9653o162a0604m32347a04651e0463j26800
9239a77263h8512j18472A6316d8676k58385J07965K7604k66857a47225n350o7043
9228b19618a04208l9646k48695e3916o5183m2302d9101p5321l5545b1616C56650
9216A22758n8158F079c6038j92295H560J44380E2397a07885J4701E9978a80531
9204b45593F5446a20861A29084D4817R3673P774a68352D02447K8051c75388d1475
9192E8529J36860a76669k0995B10994b43886L7312R2020k6489k15136d170j23290
9181a27460j36969M0213c1079E3166f3187o7600j11702a07423e2225i377B35079
$$ y = [32857, -39932, 232758, -125563, -257713, 184473, 152173, -56060, 100743, 301657, -219222, -167732, -20390, -51728, -120859, 98578, -89653, -95815, -10604, -442951, -104651, -50463, -177263, -88512, -206984, 16316, -48676, -307061, -199096, -171492, -438349, -147225, -152575, -219618, -104208, -143854, -392549, -53916, -119099, -161401, -49101, -124422, -159967, -21616, 356650, 122758, 64600, 6079, -36038, -228333, 8560, 152940, 52397, -107885, -93184, 59978, -180531, -245593, 65446, -120861, 129084, 44817, 138490, 146264, -168352, 402447, 430498, -375388, -41475, 58529, 195389, -176669, -197664, 210994, -243886, -206574, -114554, -141043, -356179, -4170, -127460, -264429, -224216, -31079, 53166, -63187, -130787, -242489, -107423, -52225, -9377, 235079]
9169a49249I1240J65257j00156L5253A6702C558c88076j26867D7425I636g5187
9157D7430J4936J77800A7690J1860b00587i7094p173H4827C0320f5745A30973
9145a64762r5134H385e4693j29228j37090M782a00866n8604l7036j85682q8224
9134d70412i0722o4178e2185j23945M7881C7535g9373j12220k65749f5843K1271
9123d4572J8948j37445A2213i1445A61619b93283K8750d5029F0019Q6575J4629
9112A61223A9465K7258J34040A3833J5417g7886A75173a04745B05831a85647J8096
9101a67551k5220A22348e9651j75073B84276H1351f2491l32716i2496j63790P9141
9090a77145Q6400j50125M4019O7010m5052A49514A9983K12187a76268O651K0214
$$ y = [-149249, 91240, 256497, 156341, 191594, 16702, 3558, -388076, -514943, 47425, 9636, -75187, 47430, 62366, 240166, 17690, 29550, -200587, -97094, -104267, 84827, 30320, -65745, 130973, -164762, -259896, 8385, -54693, -183921, -321011, -316229, -100866, -159470, -196506, -382188, -470412, -90722, -154900, -52185, -176130, -128249, 37535, -79373, -191593, -457342, -65843, -44572, -25624, -163069, 12213, -91445, 161619, -293283, -264533, -45029, 60019, 146594, 161223, 19465, 46723, 180763, 13833, 29250, -77886, 175173, -104745, 205831, -185647, -167551, -192771, 122348, -59651, -234724, 284276, 81351, -62491, -395207, -92496, -256286, -177145, -90745, -240870, -196851, -129841, -174893, 149514, 19983, 232170, -176268, -169617, -149403]
9079a49403G8505b9170q0284A61730o4923a77582A18470K27062a22958p0570g2418
9067B34794b47933A13430d05072a40044A40214k7700D3788d7156a6950j10694
9057a27644j25556c4598n8091A03740a38402r0593Q6639e4368F2497K0367l958
9046G8906k1800A9489b59219G4929g6599A56635b91527a17787p7055g0563J3318
9035e7245q0267j43276J16063J3474A5655J54696b02912K9607J7819m4016A40913
9023a76441h8088F3468a32336a8493k12592L3319i8445I1657l4430a2556B9739
9011c2303l71032B18218b14627N1835m2708D8461c07520C5169b68494c0005j95117
9000b25122i5773M628L4567j8682j87922b6962j52869C18436E8669J17626f6361
$$ y = [-149403, 78505, -29170, -109454, 161730, 96807, -177582, 118470, 345532, -122958, -193528, -72418, 234794, -247933, 113430, -405072, -140044, 140214, 112514, 43788, -47156, -16950, -127644, -253200, -34598, -92689, 103740, -138402, -228995, -142356, -54368, 62497, 82864, 78906, 57106, 19489, -259219, 74929, -76599, 156635, -291527, -117787, -194842, -70563, -57245, -137512, -280788, -164725, -151251, 15655, 170351, -202912, -173305, -155486, -199502, 140913, -176441, -88088, 63468, -132336, -18493, -231085, -197766, -98445, 91657, 57227, -12556, 29739, -32303, -403335, 218218, -214627, -162792, -205500, 48461, -307520, 35169, -268494, -30005, -225122, -95773, -91145, -56578, -75260, -263182, -26962, -179831, 318436, 58669, 176295, -66361]
8988a9624j39555L3926o582A34449a57623A02664A9204b3004A40843c23175A02419
8976H2453K5577J87533g1813q7162M4916N6731H4426c370k75763a38050d6219
8964a32321A3116J20822h157p0476A64872b60724b6315C24593b46308h1911j62791
8953b44702B13205o0939a78448B6679a39931B06291b77921C5027a74339m8254
8943b22593B13303A4470f6266K9122A91373a20676d4701L074E32704F4266J34009
8932A98275a21299p4651K8745q2715Q1519E7870K6530b02979B09082n5518O29830
8921G83394P40255E50827j91861L0230i8309d1077j62274C96216h0429o9738k38039
8910c88206A15563L2972c02070a20882p932C6582b20590a612B7320M5956c2692
$$ y = [-19624, -159179, -125253, -131835, 134449, -157623, 102664, 19204, -23004, 140843, -323175, 102419, 82453, 108030, 295563, -71813, -158975, -114059, -57328, 84426, -3370, -279133, -138050, -46219, -132321, 13116, 133938, -8157, -78633, 164872, -260724, -26315, 324593, -246308, -81911, -244702, 213205, 152266, -178448, 26679, -139931, 206291, -277921, 35027, -174339, -222593, 213303, 14470, -66266, -37144, 191373, -120676, -44701, -41627, 532704, 64266, 198275, -121299, -195950, -167205, -249920, -168401, 57870, 84400, -202979, 209082, 153564, 783394, 1523649, 550827, 358966, 389196, -98309, -41077, -203351, 396216, -80429, -150167, -388206, 115563, 148535, -302070, -120882, -128814, 36582, -220590, -1612, 27320, 73276, -32692]
8898a70177a2993A61637a55568k89208f2887a8534l20202a45963j00107O6257
8888a79813A29886e4696p511p7589C3934d9101J979B51145g73k93272I9676a06702
8875e2660B7181R3258c6161n3353B28367B4100c66512A50912b38682M8747d2251
8863c53516I4017D6372A9191M4702N570a26979B4292J01374D2005e0129k76210
$$ y = [-170177, -12993, 161637, -155568, -444776, -62887, -18534, -338736, -145963, -246070, -179813, 129886, -54696, -62207, -139796, 33934, -49101, -47122, 251145, -773, -294045, 99676, -106702, -52660, 27181, 120439, -36161, -89514, 228367, 24100, -366512, 150912, -238682, -189935, -42251, -353516, 94017, 46372, 19191, 63893, 69463, -126979, 24292, 125666, 42005, -50129, -326339]
$$ [...]
##END NTUPLES=NMR SPECTRUM
##END=
