##TITLE=AC1433_HGAAH13242_8011294_Gt3Epax0yJ
##JCAMPDX= 6.0         $$ Bruker NMR JCAMP-DX V2.0
##DATA TYPE= NMR SPECTRUM
##DATA CLASS= NTUPLES
##ORIGIN= BRUKER
##OWNER= Administrator
$$ 1.72 TOPSPIN		Version 2.1
$$ 2013-07-05 15:07:37.821 -0700  Administrator@X
$$ Compression mode = diff/dup
##.OBSERVE FREQUENCY= 400.02188249412
##.OBSERVE NUCLEUS= ^1H
##.ACQUISITION MODE= SIMULTANEOUS (DQD)
##.ACQUISITION SCHEME= undefined
##.AVERAGES= 8
##.DIGITISER RES= 22
##SPECTROMETER/DATA SYSTEM= spect
##.PULSE SEQUENCE= zg30
##.SOLVENT NAME= COFFEE_meoh
##.SHIFT REFERENCE= INTERNAL, COFFEE_meoh, 1, 14.98509
##AUDIT TRAIL= $$ (NUMBER, WHEN, WHO, WHERE, PROCESS, VERSION, WHAT)
$$ ##TITLE= Audit trail, TOPSPIN		Version 2.1
$$ ##JCAMPDX= 5.01
$$ ##ORIGIN= Bruker BioSpin GmbH
$$ ##OWNER= Administrator
$$ $$ E:\/data/COFFEE/nmr/AC1433_HGAAH13242_8011294_Gt3Epax0yJ/10/pdata/1/auditp.txt
$$ ##AUDIT TRAIL=  $$ (NUMBER, WHEN, WHO, WHERE, PROCESS, VERSION, WHAT)
(   1,<2013-07-05 15:07:30.821 -0700>,<Administrator>,<X>,<go>,<TOPSPIN 2.1>,
      <created by zg
	started at 2013-07-05 15:06:24.886 -0700,
	POWCHK enabled, PULCHK disabled,
       configuration hash MD5:
       C8 4E 4E 5D D3 5C D8 9E 9F 52 82 E0 59 8A DE 15
       data hash MD5: 64K
       6A 40 E3 F8 1B CF 97 41 3C A8 59 9E 24 2B 44 01>)
(   2,<2013-07-05 15:07:33.930 -0700>,<Administrator>,<X>,<proc1d>,<TOPSPIN 2.1>,
      <Start of raw data processing
       efp LB = 0 FT_mod = 6 PKNL = 1 PHC0 = 0 PHC1 = 0 SI = 32K 
       data hash MD5: 32K
       8A 3D F6 35 54 94 6A D5 1C 41 32 6D 76 84 B7 D6>)
(   3,<2013-07-05 15:07:34.258 -0700>,<Administrator>,<X>,<proc1d>,<TOPSPIN 2.1>,
      <pk PHC0 = 100.7281 PHC1 = 0 
       data hash MD5: 32K
       3E EF 54 FB A2 D7 8E 36 28 48 AB 0C 4F 0B 92 FF>)
(   4,<2013-07-05 15:07:34.368 -0700>,<Administrator>,<X>,<proc1d>,<TOPSPIN 2.1>,
      <abs ABSG = 1 
       data hash MD5: 32K
       13 EF D1 7A BA 1F C3 71 7A 7F 7D 46 22 CB 5A 9A>)
(   5,<2013-07-05 15:07:34.446 -0700>,<Administrator>,<X>,<proc1d>,<TOPSPIN 2.1>,
      <abs ABSG = 2 
       data hash MD5: 32K
       AC 94 6D E6 70 FB 3F 45 0D AF E6 F8 A1 6B 63 8C>)
(   6,<2013-07-05 15:07:34.540 -0700>,<Administrator>,<X>,<proc1d>,<TOPSPIN 2.1>,
      <abs ABSG = 3 
       data hash MD5: 32K
       CC 46 46 DC A0 B5 44 59 9E DE 31 C6 2C 15 4F D8>)
(   7,<2013-07-05 15:07:34.602 -0700>,<Administrator>,<X>,<proc1d>,<TOPSPIN 2.1>,
      <abs ABSG = 4 
       data hash MD5: 32K
       35 02 B7 AD 1F FA 4A AF 9A 5A 54 EF BD 8B E6 B3>)
(   8,<2013-07-05 15:07:34.649 -0700>,<Administrator>,<X>,<proc1d>,<TOPSPIN 2.1>,
      <abs ABSG = 5 
       data hash MD5: 32K
       1E 6D D1 D0 CD 9A BD 98 D4 4F 99 86 25 C6 A8 E9>)
$$ ##END=
$$ 
$$ $$ hash MD5
$$ $$ 20 0E 7F A5 AE 5E A5 F9 3C C2 21 71 6A 27 18 CE
##$RELAX= 
##$RELAX= 
##$RELAX= 
##$RELAX= 
##$RELAX= 
##$RELAX= 
##$RELAX= 
$$ Bruker specific parameters
$$ --------------------------
##$DU= <E:\>
##$EXPNO= 10
##$NAME= <AC1433_HGAAH13242_8011294_Gt3Epax0yJ>
$$ [...]
150 150 150 150 150 150 150 150
##$TP07= 0
##$TPNAME0= <>
##$TPNAME1= <>
##$TPNAME2= <>
##$TPNAME3= <>
##$TPNAME4= <>
##$TPNAME5= <>
##$TPNAME6= <>
##$TPNAME7= <>
##$TPOAL= (0..7)
0.5 0.5 0.5 0.5 0.5 0.5 0.5 0.5
##$TPOFFS= (0..7)
0 0 0 0 0 0 0 0
##$TUNHIN= 0
##$TUNHOUT= 0
##$TUNXOUT= 0
##$USERA1= <user>
##$USERA2= <user>
##$USERA3= <user>
##$USERA4= <user>
##$USERA5= <user>
##$V9= 5
##$VALIST= <valist>
##$VCLIST= <CCCCCCCCCCCCCCC>
##$VD= 0
##$VDLIST= <DDDDDDDDDDDDDDD>
##$VPLIST= <PPPPPPPPPPPPPPP>
##$VTLIST= <TTTTTTTTTTTTTTT>
##$WBST= 1024
##$WBSW= 4
##$XGAIN= (0..3)
0 0 0 0
##$XL= 0
##$YL= 0
##$YMAX_a= 621727
##$YMIN_a= -530377
##$ZGOPTNS= <>
##$ZL1= 120
##$ZL2= 120
##$ZL3= 120
##$ZL4= 120
##$ABSF1= 14.98509
##$ABSF2= -5.573092
##$ABSG= 5
##$ABSL= 3
##$ALPHA= 0
##$AQORDER= 0
##$ASSFAC= 0
##$ASSFACI= 0
##$ASSFACX= 0
##$ASSWID= 0
##$AUNMP= <proc_prof1d_extract_pilot.lims>
##$AXLEFT= 0
##$AXNAME= <>
##$AXNUC= <1H>
##$AXRIGHT= 0
##$AXTYPE= 0
##$AXUNIT= <>
##$AZFE= 0.1
##$AZFW= 0.1
##$BCFW= 0
##$BC_mod= 0
##$BYTORDP= 0
##$COROFFS= 0
##$CY= 15
##$DATMOD= 1
##$DC= 0
##$DFILT= <>
##$DTYPP= 0
##$F1P= 0
##$F2P= 0
##$FCOR= 0.5
##$FTSIZE= 32768
##$FT_mod= 6
##$GAMMA= 0
##$GB= 0
##$INTBC= 1
##$INTSCL= 1
##$ISEN= 128
##$LB= 0
##$LEV0= 0
##$LPBIN= 0
##$MAXI= 10000
##$MC2= 0
##$MEAN= 0
##$ME_mod= 0
##$MI= 0
##$NCOEF= 0
##$NC_proc= -8
##$NLEV= 6
##$NOISF1= 0
##$NOISF2= 0
##$NSP= 0
##$NTH_PI= 0
##$NZP= 0
##$OFFSET= 14.98509
##$PC= 1
##$PHC0= 100.7281
##$PHC1= 0
##$PH_mod= 1
##$PKNL= yes
##$PPARMOD= 0
##$PPDIAG= 0
##$PPIPTYP= 0
##$PPMPNUM= 2147483647
##$PPRESOL= 1
##$PSCAL= 4
##$PSIGN= 0
##$PYNMP= <proc.py>
##$REVERSE= no
##$SF= 400.02
##$SI= 32768
##$SIGF1= 0
##$SIGF2= 0
##$SINO= 400
##$SIOLD= 32768
##$SPECTYP= <>
##$SREGLST= <1H.CDCl3>
##$SSB= 0
##$STSI= 32768
##$STSR= 0
##$SW_p= 8223.68421052631
##$SYMM= 0
##$S_DEV= 0
##$TDeff= 65536
##$TDoff= 0
##$TI= <>
##$TILT= no
##$TM1= 0
##$TM2= 0
##$TOPLEV= 0
##$USERP1= <user>
##$USERP2= <user>
##$USERP3= <user>
##$USERP4= <user>
##$USERP5= <user>
##$WDW= 1
##$XDIM= 32768
##$YMAX_p= 432899593
##$YMIN_p= -790516
##$CURPLOT= <Network HP LaserJet P1505>
##$CURPRIN= <$Network HP LaserJet P1505>
##$DFORMAT= <normdp>
##$LAYOUT= <+/1D_H.xwp>
##$LFORMAT= <normlp>
##$PFORMAT= <normpl>
##$SURQMSG= 1
$$ End of Bruker specific parameters
$$ ---------------------------------
##NTUPLES= NMR SPECTRUM
##VAR_NAME=  FREQUENCY,     SPECTRUM/REAL,   SPECTRUM/IMAG
##SYMBOL=    X,             R,               I
##VAR_TYPE=  INDEPENDENT,   DEPENDENT,       DEPENDENT
##VAR_FORM=  AFFN,          ASDF,            ASDF
##VAR_DIM=   32768,         32768,           32768
##UNITS=     HZ,            ARBITRARY UNITS, ARBITRARY UNITS
##FACTOR=    0.250966925370066, 1,           1
##FIRST=     8223.43324360094, -42957,       -86183
##LAST=      0,             -35598,          -165604
##MIN=       0,             -790516,         0
##MAX=       8223.43324360094, 432899593,    0
$$ Real data points
##PAGE= N=1
##DATA TABLE= (X++(R..R)), XYDATA
$$ [...]
23831 142451 235307 27629 187950 59347 -181044 54385 -21369 138875 -355384 -290459 16061
23819 -311607 -230777 -52282 373458 -20738 -346320 116183 -23310 73503 -227365 78553 -195849
23807 156218 -15535 -74434 -406136 -93512 -95920 105221 23549 105365 -198025 84516 -73170
23795 51548 -152977 -2408 44170 -2624 -133000 141760 6569 -131551 35779 -169504 -7906
23783 29953 -18679 134761 -159560 20879 142488 44899 -328034 -222357 206375 -254853
23772 192050 -178022 -18518 93295 134901 351344 -235730 80373 23295 -235698 -326495 168100
23760 292230 -103200 119716 -161841 -67936 200828 -209260 -29791 -208356 223461 -274856
23749 114009 -250988 119007 -98525 -180123 49584 -64263 -171668 -76424 137897 -96494 -19451
23737 -59554 185101 157921 -150757 -57006 369503 38135 -188273 43877 129781 -307669 -116608
23725 166286 -154389 -354789 179478 136246 -141639 6741 -47002 155685 178168 -164602
23714 10633 -61118 26998 123950 -322457 138305 401498 -13305 84150 5044 243448 -319317
23702 264225 21063 -157325 -207660 248676 88580 93079 -175485 -50908 10945 -173431 -79086
23690 -46685 -60393 -471943 3910 -226934 241756 -79308 232559 -156628 -16541 -53043 152108
23678 -167953 -365051 152175 247130 142429 -45063 -116101 133389 -164246 -78764 152793
23667 125703 -199955 -92186 -77249 133065 70895 -14964 71030 -75931 54127 -153551 -347719
23656 -347719 -1479 -75349 -118401 116831 -135187 85317 -194742 -13977 -164854 -73274 -154240
23645 -154240 -295730 -80040 226715 -4323 -230879 -112472 105523 40835 -222953 103533
23634 38238 -34523 -178564 -24051 145866 -96869 341528 -97992 73901 18105 146125 -75975
23622 23575 2947 -115905 -113162 257459 186133 187525 266482 205034 202879 200734 55758 -18594
23609 61274 -115626 4507 -124166 -199156 -120967 -5051 -177117 73985 -240808 -61123 148472
23597 62731 -192291 -1239 -16549 -114753 177677 -103309 30658 -219212 47492 -54284 10171
23585 71653 481981 -52396 304399 -41442 24072 -91677 15501 -166036 -23661 -319822 189779
23573 236514 89536 -121337 272836 -156523 -190623 -186258 -104133 -146577 -255899 52813 -167385
23561 -73696 61161 -292931 190073 -79691 -215546 -57758 -79454 185 87621 -91038 -200816
23550 -200816 59214 -74065 -86157 204616 -74694 51152 30411 -135221 -287289 35511 175986
23539 175986 58322 140559 100035 -110487 -192684 -49218 -24154 -43897 -288807 20264 -487420
23527 -175764 -61581 113516 -144487 -95561 128393 -239047 -44586 -359121 -317447 -167251
23517 -167251 -122491 66047 113761 -149676 -30473 110943 -109231 -26430 184253 -113145
23506 11904 149823 169559 19981 21999 -21843 -413409 -3356 -125330 -12228 166419 407253
23495 407253 -21247 81207 157729 -22439 -6645 44890 -280839 -27463 296142 -65936 -29594
23483 223258 -382493 30289 -107189 234687 79344 49272 -3821 -39127 -79842 132174 -161632
23471 71605 324749 39494 -108866 -123214 -10311 -76475 9264 -79315 269860 100838 -20458
23459 155884 31276 194340 62360 -21656 -213294 106086 -85947 -63793 298528 -294604
23448 -397447 -113973 -248136 83829 -211296 82992 -87982 79781 269190 93793 -15306 -93757
23437 -93757 195564 36134 -117447 56271 -285802 -148437 -155262 184448 -119301 275110
23426 -126504 23487 -56574 -138183 -221744 11956 -63130 -275138 165370 -41250 -34521 -80897
23415 -80897 -122191 20774 -42368 -234554 -129314 -20391 12925 38027 188134 2294 -11852
23403 -277002 -27023 -52074 -49575 24509 -103469 -139640 -31824 -118490 -135211 -213918 238525
23391 130090 152864 24576 -148425 -194943 -358238 -331962 -94620 -153902 56729 -98297 129211
23379 596675 -324672 272287 17212 -265098 -65126 179340 159508 -156861 219435 -195686
23368 106558 58711 224721 -34120 -18450 285081 -201036 51997 171882 97897 -50319 62209
23356 22800 -66785 153405 120013 -126528 -161770 100210 -125687 -313461 -311423 118166 117939
23345 117939 -111106 -180833 -125854 12913 -157195 202582 21987 -75075 165983 -90709 97228
23333 -80975 243728 -40606 29880 -43161 -4640 47692 -331047 139637 -162336 4869 247483
23322 247483 -35743 -23162 67421 65778 -95302 -1594 85205 -88812 -202990 -185874 -430947
23311 -430947 25717 -186072 -334486 12290 -28526 -72481 -295706 183208 -127408 101934
23300 49328 71935 126519 142373 -313493 180527 -98212 -173083 112051 420545 76791 -44802
23288 -191013 259859 -343786 38356 32979 -120511 3343 -83252 220724 -25786 -188297 -67471
23276 12021 -84928 168200 -92827 73991 -9009 -309352 -222545 -272370 -169417 -114317 70524
23264 25142 -204057 -10725 -31413 178194 151396 -382561 67985 -78426 296866 -29407 78104
23252 271370 -389403 -106651 15756 -87621 343430 149943 78972 -110775 -10242 236498
23241 19185 99165 -49122 -157624 174948 -58629 -328291 -45107 -324035 176779 -226588
23230 -142557 -64173 -55435 261329 -126613 132238 71763 -152191 305969 -319184 336313
23219 -131804 271421 -95490 159973 137045 -9303 -222488 -83021 -159683 -233604 -111427 -181812
23208 -181812 -48755 125347 355772 -22490 -430626 83861 -59457 -104854 285576 38253 103574
23197 103574 -107828 -135720 9471 -219021 34376 -108007 100486 -76755 -29472 -146780 9095
23185 -73992 176825 -321341 416931 -4768 178706 -161382 -108457 74331 242660 -42005 247162
23173 96850 -291925 127770 21034 72398 -257432 -104567 145289 283329 261547 -60236
23162 12139 -16902 -132324 139181 -134425 11279 35458 -42906 -195011 56717 -148823 -22288
23150 141181 191361 -83422 -332858 -206612 -276287 -86289 20390 153058 -192612 -53603 -120681
23139 -120681 171928 -23374 153164 477281 -8015 184828 112388 -55114 249153 33902 236803
23128 236803 188515 -229402 -66782 148658 123178 -70439 -227758 -33639 -151444 -100278 -50120
23116 37035 9735 74161 64533 -41851 44086 303977 74633 212275 534778 160484 389392
23105 389392 -211829 155065 -316668 -21154 -153408 -385847 -146680 -228442 75756 -144682
23094 399225 -24311 132668 -235199 99754 -201539 -60054 -132313 -216119 -89260 83404 -96356
23082 -190807 160607 -197373 -428584 -309566 139217 156683 -280205 14102 -202663 -221178
23072 -221178 24461 206919 122024 -71578 189274 -262838 -37793 73666 310553 -111237
23061 269134 -272149 18147 -257256 -161067 89007 -45039 20126 -75512 -251858 -95090 -329897
23050 -329897 -56795 -62560 -171325 319 -556 63773 -59739 -93497 -62208 333621 -90961 -548327
23038 -548327 54322 -8095 129889 348739 -69267 144270 -105992 24118 -65521 54034 -15234
23026 -185179 -195403 116042 129506 -152399 183383 -155354 127976 145394 -211479 -194750
23016 -194750 174790 -123711 36438 29361 161243 82526 108216 -293420 -116810 353084
23005 91105 41984 -18767 -222468 215451 6836 79820 -156775 -157521 -37727 -93596 98796 -54948
22992 125632 167512 208370 -6672 -156796 180158 28881 -362892 -29148 21327 -42443 228381
22980 -163399 155393 179138 -132639 -22247 17376 9896 -296106 -83066 -165836 -545974 -8906
22968 -101960 -167466 -315345 -160920 -96773 139546 -62642 486177 394688 -18949 37481 110466
22957 110466 224486 188205 -88151 7183 -348990 -172896 -233338 -106851 102204 26490 -229192
22945 111284 -237064 -50866 238562 -72266 -40795 290140 -225845 -216625 7773 -212231 -23781
22933 278662 14851 -166107 -158602 -159750 78531 -114371 -223944 -211867 -81598 10789 77078
22922 77078 49524 35245 93046 -40982 -81549 -47588 58850 -80713 57137 164299 -69016
22910 178216 81417 188213 -516638 -293452 17391 148896 -519897 195339 15813 203833
22900 203833 91297 39133 -25970 -111360 93796 -17231 -31651 302653 58800 240601 -250955
22888 17646 -75412 -235671 68672 -101840 -158590 290196 -287783 138138 143933 -100184 -151195
22877 -151195 -58786 -150638 -26493 30774 -229923 -119136 84789 59200 -89426 -248850 -231632
22866 -231632 -44364 -282868 253445 28400 82694 180696 -51098 -287597 -144994 -80489 12327
22854 -87491 -73554 -128076 -257987 -43917 241814 -166710 -237355 -42405 306945 -47709 -217226
22843 -217226 367063 -39096 67991 139554 -449365 23671 106200 -101053 -133796 -77191 -267499
22832 -267499 -110254 -250873 23430 -173916 -322634 -21951 33568 36948 209450 55126 306855
22821 306855 -22831 13618 55180 45646 144175 -134785 -315177 335720 -120623 63300 466784
22810 466784 -168635 -83030 63637 115821 -9284 -18039 -225049 -71662 -242891 98057 -189299
22798 -173669 260615 7804 221109 -126185 -150790 -259626 -889 121742 83757 -229211 -252334
22787 -252334 -5086 -302298 -168742 63900 -189362 -242656 -29182 10180 -184658 -181522 -159106
22776 -159106 -184048 154184 217084 -26333 -205467 -35267 -166300 -93821 135439 -88985 -286815
22765 -286815 -41213 70893 26475 -168300 -156519 -71330 64161 -116471 18259 -61615 -15061
22753 -75015 -18779 64506 277398 175149 11480 69048 233869 -64322 -238567 -150554 -246979
22742 -246979 -408529 -110892 79855 -26469 132877 155721 -84108 -62138 26417 194532 109145
22731 109145 32791 -194743 -7830 16947 -25062 -99423 6217 90678 -68009 38741 -61474 -81016
22719 -81016 -12446 97379 -214221 -146069 75731 -79028 -48846 -483114 -185448 -199707 -194374
22708 -194374 79990 -66775 -17237 -208625 570999 647 -229735 -132739 -111413 -26931 51725
22696 134252 -292552 144859 272071 348519 112614 98575 28942 -283683 73727 37529
22686 37529 268257 -125674 -171224 -67207 -236686 -57591 267599 485136 200673 -120930
22675 193179 226986 309165 -145573 -186915 -314933 19547 -361054 142789 -40125 112795
22664 -134513 77382 52679 316586 227728 -155447 140318 73637 -256172 -115061 -25402
22653 -139574 -127886 267666 389254 -405064 -102399 -278319 58150 252295 -232535 -25765
22642 137129 306730 -75487 73413 17524 96141 122286 -189786 158524 -566556 23872 -182229
22630 -6347 -55849 194042 -192881 -10934 -11093 -251946 -13763 269568 -191085 -99274 -23123
22618 44898 22345 -163452 -790516 7495 48002 138961 -290703 14787 178755 -101890 415211
22606 25746 -402516 18818 153199 -100137 -118373 -127229 156472 229449 -5449 176472 -308544
22594 128220 -78158 -41062 6392 332885 -135611 80939 -570455 172931 -22475 20260 -9237
22582 -224575 -151521 -109770 -162043 102046 -178246 -183389 40973 165772 -35706 38701 -122146
22570 -188023 -430330 -299535 35888 -90863 -54868 -142976 -43889 -87797 -86615 -313252 259553
22558 65044 -207193 -28419 -6933 -238668 -80373 98514 -173152 -96477 -318786 89774 -177369
22546 58027 -15848 231131 90024 93819 65001 -90571 -212794 43040 104491 102840 199643 -21688
22533 169531 -236901 -323535 -256184 112258 207621 -3160 39314 -76522 7424 -50666 -115532
22522 -115532 -285636 -88815 8528 104170 -143646 -261894 -121752 67140 145974 59642 133260
22511 133260 -59628 -172119 139264 -184345 -91757 33401 -48972 -82332 -225782 148098
22500 164838 60436 -337989 -117846 -398810 -158787 -27610 5284 -272004 48413 -120696
22489 -138635 26487 315997 -178872 57184 -9197 -78069 60365 65921 203990 192390 104232
22478 104232 -256601 124403 -158428 98541 44269 -116849 183132 99893 64028 -214621
22467 234104 3574 -158025 217666 96720 -14248 308728 137870 -68911 -200228 -380730
22457 -380730 11398 273946 -285472 5787 129781 -110031 132133 -128131 -8951 84849 70809
22446 70809 137050 150102 82908 70659 -307747 77592 -191378 9899 -155701 -118529 -83833
22435 -83833 -62655 -14207 -75995 -6846 -35360 -285731 -191024 195234 82168 -73202 123438
22423 70277 40378 173275 -64731 -55187 -6543 -218276 -97007 -166889 269862 -312419 -94363
22411 434930 78446 -79271 -139337 -144808 -135788 -486712 117525 247469 35767 -301151 -101370
22399 -226758 74541 -238117 -48699 153932 -74173 -15621 -126658 -71294 23703 95695 58096
22388 58096 -154742 314337 -223797 10593 -217228 -178956 -84676 -216048 198401 -292613
22377 -53577 -164893 59725 -173935 53405 436708 21798 176042 -116884 -90187 12349 -42309
22365 -236739 18147 -126015 -66734 -482076 347498 203876 -20510 223613 112902 36776
22354 15921 139159 -44246 -422807 22521 371958 -304935 17373 -79302 278411 -65526 35718
22342 -61632 -165649 120590 111153 -13528 -412389 91829 140772 -139735 210663 -391106 -356968
22331 -356968 -106976 83320 -137709 -343329 -189334 120607 61039 -176600 28235 -134154
22320 191287 -26329 -7584 -259491 -79603 69512 -146181 -123520 -68769 95323 -112776 141510
22308 88419 -524476 -68781 136335 129816 22406 30260 65165 -253885 122078 191946 267937
22297 267937 68206 -158712 59465 20936 46893 -110710 68784 73989 -160828 -275381 -113910
22285 -60063 -155770 103003 -87835 -167785 -125557 -186848 278195 34496 -206218 -94252 195051
22273 -97917 79470 -63720 -271872 -122933 -197438 223842 258651 -278807 -222545 -233758 -67360
22261 84521 118988 67076 -204884 -142897 -3237 271585 53190 -4491 79734 -121844 -340601
22250 -340601 187222 144509 48760 -266896 175511 176543 -43826 -127670 -52841 -227974 -99007
22238 -169244 237206 -13872 150947 -24475 -90178 -62918 358180 -176709 192279 260869
22228 260869 -84156 -28454 -379006 73216 -385611 -49952 -95849 -195758 -139640 -163528 171464
22216 -148974 125639 -113704 -190849 -108828 -215084 143885 59149 54689 80639 -39141 -86612
22205 -86612 98955 -166068 -286027 -40530 -122529 527462 -110139 -298715 246804 -536373
22194 -118841 256751 -367318 -216051 61924 195767 84120 -403965 -101203 -216452 -236448
22184 -236448 -121253 -132573 -180288 -38671 313184 -98354 -176435 -261302 -208496 -396 -281922
22173 -281922 -100965 -486265 -101541 22936 -104465 242688 -101238 54066 83155 91897
22163 91897 241684 -11701 121090 -132674 5045 264613 -279485 -174136 -538221 -87486
22152 254356 -154771 -205151 -31651 164847 28410 -115177 7102 197764 -168842 144699
22141 -372526 -128336 -249464 -99902 -66391 61846 -228663 -417899 398245 273684 -84796
22130 230117 -200739 71462 2747 173463 -72471 149086 -307889 -395135 58793 217670 41061
22118 -49325 -277872 38188 -78660 305583 173402 65968 -233952 140832 50578 -220793
22107 337643 -200082 27606 -186636 178562 -53850 160047 99402 294630 -306996 -218385
22097 -218385 19527 164451 152103 -171567 -203429 -96877 16602 248564 168105 120672 70682
22086 70682 -158317 -3778 -173953 162606 -61326 -41904 -62220 128413 63473 -152655 108835
22074 -72462 -222786 239751 -199673 296816 -155109 -108005 155100 -121359 -441405 -245335
22064 -245335 -59077 -61404 -338242 187236 -189527 159823 133552 -30084 50762 -92441 -85377
22053 -85377 -277510 14661 149391 68954 -47998 68659 7082 -43809 -320211 -297231 -430552
22042 -430552 148950 -341269 133102 -324130 79261 -205415 140352 111958 13090 191018
22032 191018 -340173 183908 -225661 -71453 -11842 -188893 -63144 -69240 140930 -232300
22021 -213705 450377 -161157 351980 177778 13146 -262158 57814 -14401 96403 13880
22010 98055 47540 -205565 -90085 -60398 -88150 -439265 48258 117019 174644 -158649 -149350
21999 -149350 262888 -150219 105161 15527 -165104 2767 -40540 291134 -26469 -24745 -99382
21988 -99382 -276867 -123293 75950 -59373 -221826 18474 -82315 -246685 -354316 83685 -91128
21976 25062 76852 41634 33861 -93844 -278860 -58280 -37319 178494 -270994 131940 -76873
21964 -2487 96203 -25080 4947 50094 -322513 -79335 -49369 -57774 33093 28189 -249248 124737
21951 239575 173130 63816 -127105 260655 27079 -65554 -82743 -295308 19167 -288530 -137166
21939 139641 -373698 431697 -9906 -56473 -158629 -92124 77096 -307473 -115637 6416 155552
21928 155552 -144466 -133738 -96270 114087 -250718 290492 -153075 -314359 -4026 -72489
21918 -72489 86671 -209097 -42136 -109510 -339716 59986 -384678 -180662 161259 -81616 46463
21906 85776 8344 228653 -108852 -323682 -163486 43110 -130320 123646 -275577 -157782
21896 -157782 -183084 -61614 196112 -25661 135971 -100501 46566 -139910 -153623 -212746 -10331
21884 -238724 -97658 -80357 -146249 -48309 -15135 4220 165408 240227 -67343 -75578 148640
21872 -227724 -53893 83106 -46193 242367 467582 -145684 -381411 -271615 -26560 -164841
21862 -164841 -68616 -82578 72113 -170308 -66476 3597 184031 -121506 -47427 -2494 -143951
21851 -143951 -37772 -35119 22720 -3852 -172399 -77539 -152679 -62071 120349 -50408 162690
21839 -71966 -203007 157092 25364 326060 -28335 207 -196878 4758 74694 -135402 -68592
21828 -68592 6933 261455 -95248 -125524 53823 -350541 87134 18511 33989 33952 -77218 25467
21815 112896 104300 -156590 -68295 -80703 -21984 118887 191120 59928 23833 155309 409175
21804 409175 -256613 198615 371787 32738 -100626 -231245 171697 1475 -254107 -260938
21794 -260938 -68710 -332940 178730 -41956 355191 2076 209927 -59386 -32790 -293599 -47408
21782 -143673 -158938 16343 88423 -224812 -143749 -159252 -32872 -30176 -45879 87729 135935
21771 135935 -169176 244230 139025 -137949 131785 -132567 9694 50504 142743 -37648
21760 27696 -15263 -11839 -32061 -182 -45116 -82740 -308895 87909 -100013 -185542 111591 -70024
21747 45835 87152 -116781 -144350 -257979 120926 223244 -223215 61224 140671 -39054 113936
21735 -2869 -61953 -101081 140257 -238123 -128610 3308 -119326 -465 -140368 -111976 -49931
21723 29856 -80758 44051 -46016 -323640 146808 79422 60812 -221945 -226648 -116146 -9960
21711 -315067 -90477 -16033 265567 -272210 52767 117374 -28867 128874 -22351 -155362 -101915
21700 -101915 64403 -159827 -377329 64471 -422469 -66452 2074 -274326 -442076 -256273
21690 -256273 99938 -246506 -20476 42357 33276 -80493 617615 6800 35834 36512 40603 33475
21678 33475 48958 86608 -207982 -253325 89790 -558858 -275659 -145021 -217565 135975 -404516
21666 262169 84200 106761 -275533 -143383 283291 -41099 -45018 228182 204684 121629 -6565
21654 -331787 -89788 -169099 -181283 104650 -226789 70581 -126931 -115463 -35603 44361 187518
21643 187518 42175 -91715 104805 110315 -11265 -225337 -320975 -114161 95621 161052 -148322
21631 83699 -202462 101615 -204154 10520 182496 186435 87723 149604 -50922 -84595 112080
21619 -344271 -232357 -100338 -154127 -301448 85438 -314700 -116983 -348582 -68115 -378243
21609 -378243 1569 -269784 -149245 -156947 -1386 -92120 18246 214309 201910 175470 -89222
21597 231680 33787 -24801 180430 208040 12548 73471 -286125 237041 -22449 -186151 20178
21585 194 -140424 -6907 -332510 -23622 175399 254683 106703 -116431 -27467 -61604 98113
21573 -220898 110925 -88223 97366 -27281 80543 31946 -13127 103073 -13246 226129 -85959
21561 -249217 12454 16920 177305 -34032 23014 -130363 54238 144818 -160560 -12092 129715
21549 -59866 263296 -72399 -301889 -160172 -109498 101808 4363 275908 163562 -230898
21538 -50035 -179575 -79268 -37953 -59447 60538 -191517 -98760 497348 -35730 244581 58899
21526 -52914 -83757 -277944 -721856 -36036 -16683 152651 -81799 102150 -68331 199271 148531
21515 148531 65510 127572 -148374 -41982 173754 -168876 -85238 -113903 -26916 -5305 -119745
21504 -119745 111144 120020 -13307 79530 -113725 83865 -127066 -48501 -47724 111198 130017
21493 130017 15496 -165173 -242951 173511 -142568 -251837 -160558 -337695 80872 -95489
21482 -41649 10585 106563 -19081 48310 -164721 -524450 -338119 -107474 -96538 138081 -188370
21470 -279629 -252812 8749 -100234 195587 216033 -45184 172257 113995 -214848 43803 100262
21459 100262 -110954 -199894 -13284 -207897 4502 -152692 42568 -74594 15154 -39523 -403173
21448 -403173 -31365 62123 134425 -52444 -163275 -129854 -71192 25619 278127 176769 343585
21437 343585 333692 -244199 5281 -78661 299306 15769 -35756 302141 7711 -116218 -18660
21425 226003 -219511 379835 332455 -4800 71105 -229626 -10903 -49120 -17504 5250 -227562
21413 195418 -240727 49315 71165 69219 -9182 -129731 -7508 -359289 40653 -77660 -61027
21402 -61027 -229088 -163609 -40170 -46688 -34375 -2694 -36341 -116462 302139 -435346 203266
21390 -176056 -189706 -108684 142619 52360 -53310 -38159 41027 -396527 66160 -246679 -398340
21379 -398340 89633 144698 35520 67425 -54723 120692 -149130 16407 112799 -237745 -87658
21367 -269616 222950 -19166 -12502 25496 21893 198527 130065 195726 -157159 -55264 -467882
21356 -467882 -129914 -106340 120173 -32012 -160336 121944 -140332 49347 267926 106331
21345 86818 117357 -163045 -115916 -164505 -38732 26917 18839 -267142 -128545 -14315 -66842
21334 -66842 282840 -206592 -66888 45953 -388757 -110084 -217460 70757 -49879 -45860 -186704
21323 -186704 292202 102482 -23599 -92754 -63108 100886 269211 -14924 -328943 -107923
21312 -74766 -276349 -34581 -76469 -86562 -18551 -298442 68775 -218784 243946 23190 133496
21301 133496 -50224 -32952 -51809 -53912 -4237 -76386 145101 -100770 -172779 -24322 -203416
21290 -203416 -87880 278922 -55948 -174493 43553 109804 -46916 -309956 -194627 109327
21279 -80243 5164 75272 36062 -74526 -313853 209262 -1419 157565 117053 -140837 -266014
21268 -266014 -329118 -103154 -139496 142708 344364 -326341 -183974 -227252 -159551 168278
21257 3303 -38528 92576 196074 172651 -142796 -7812 -107992 188765 -40491 -51876 50999
21245 94859 -300842 -133115 -13731 -27205 -132311 254417 -203756 8381 220247 267214 -97768
21233 -83514 42536 217739 -110082 4779 90107 64938 -255166 -51548 11846 138362 -106683
21221 -11638 -77923 -26939 -94533 -202860 -122055 -146459 -121987 -166926 -10915 -53808 -118119
21210 -118119 -121326 -46761 -50245 148975 -16378 -142925 55801 41948 21153 -175830 -89446
21199 -89446 -172418 -258741 89264 -1731 -140149 55714 47977 -243759 -35303 6824 -131022 -123774
21187 -123774 -249843 262360 21229 -252887 -126072 70889 34363 84010 36292 66212 -351163
21175 42836 228692 58271 -232766 -41951 -80310 76936 -233987 -216732 -142560 -152297 -273244
21164 -273244 -214272 -43794 15818 347106 -116125 -52970 -144831 -21731 -169438 -73496 54728
21152 -185378 -143523 73835 -72989 -144767 -168973 175150 23850 -187400 -67735 -43516 -94654
21141 -94654 -257966 323308 254510 123587 -200886 165155 240924 80312 101640 171216 -6537
21129 51235 54416 -324663 197989 -290509 20266 23794 -184467 -126148 48997 -102305 136176
21117 67452 -263088 -53255 -43337 -170218 399681 -77776 13855 65549 -248868 44550 66628
21106 66628 179136 -11339 243312 -280166 -122231 3078 262729 375026 100327 177522
21096 177522 42936 -179203 -77370 -192949 -162078 -368315 31936 -23439 9956 -96796 -3790
21084 -233727 -230205 -173149 -62729 -232063 -121644 -263439 -88330 -23924 25510 -440291 -108396
21072 -147611 -98683 218786 -64929 -259169 300103 -191431 176117 -534 -44499 -18369 144760
21060 35921 169607 -171722 -2753 36595 -110164 148893 -147574 -127767 183653 -202788
21049 -151138 -246327 2319 -298684 -299151 96726 -216288 224666 -239795 -294441 -72770 -132640
21038 -132640 77958 255898 -114507 -143314 9518 -223715 180181 -357850 -76393 -21212 230366
21026 156160 404160 21100 224535 -122617 478062 -197036 -243452 9217 39553 256028
21016 256028 -148378 -442421 281339 -31378 55385 23481 23604 -227904 -149621 86877 -45451
21004 -92048 10256 -259388 -192609 -398080 228522 -235367 55222 -4828 146507 -181266 -345820
20993 -345820 -129723 -94784 -106151 230906 -267099 -220387 106403 -24556 67315 -188915
20982 -13347 -30226 -118927 78439 -254140 -288825 -488790 76224 105877 -261014 -94852 168892
20970 -133322 -70990 -36238 161978 -120596 -179746 -100475 -64794 -66789 115547 -273009 24999
20958 -8914 -119668 -38392 -166300 -353845 -194446 120481 303812 162747 245498 37392
20947 -182671 -185632 16823 188977 45385 -122803 -103913 -94271 -278338 -230204 165682 28660
20935 8303 -131317 96488 49525 123098 7015 -426572 -226625 -315415 151983 13948 -279382
20923 -102201 1082 261731 61768 123833 71783 293920 -114374 -245813 218576 25067 -189361
20911 -242620 -34106 -14661 203739 -38730 198433 -156974 -111452 -61743 32876 179489 -258004
20899 -76707 -11550 -235100 -103765 270985 -135131 38334 4126 42380 -212259 232868 -215811
20887 -194354 -39442 165776 -222463 -30319 121467 142162 -73511 -96828 -7911 -116731 132853
20875 140045 -311389 110272 -5319 -27916 -40995 -16253 230949 -47160 -182008 103158 -194506
20863 -102885 85645 75006 230720 -111370 10872 70010 6271 62334 -164546 -236796 -210780
20852 -210780 -32853 57612 -34567 -235021 -136843 116130 -193082 1489 166866 16066 -164722
20840 121495 61685 -74244 34233 -106152 24218 -266896 -111832 -157678 -126839 25848 -77378
20828 -47798 -13143 160266 243789 5854 -96852 -145055 195681 117701 210024 -195931 34631
20816 208167 -24125 -35264 -177028 122516 -114369 -199782 -161888 -301118 104608 115852
20806 115852 -16930 -89865 162564 13697 -7007 104982 53423 -199436 -465054 -260605 -158498
20795 -158498 -319947 70032 62323 -151487 -225860 7513 240363 50008 96224 110824 -233603
20783 -45503 310558 -95234 -133283 -371394 -215727 17402 231061 140637 -175442 -91211 91215
20771 -275303 -164704 80388 -44299 37880 -140045 -198384 -322427 -46874 235586 97624 -230898
20759 -337165 -272258 231576 55782 219701 -204939 -38688 -381804 18591 49841 -418653
20748 -76350 131387 -96077 -42896 -381978 -47611 -38918 29156 -216676 6532 96376 -163743
20736 -3904 -103001 -30200 76014 -315558 377331 22989 -265020 -55348 356924 8984 110981
20725 110981 -267563 -62612 -96283 -206864 47546 13710 41313 -255326 240135 7180 -97863
20713 -6481 -137403 69222 98509 -75738 -75169 -28686 -251511 44217 -138622 17513 301615
20702 301615 -314089 -250191 -199007 121709 19690 3834 -150419 -199599 -62667 -125071 238501
20690 153059 -190352 -180653 64272 -99357 187463 170342 51755 -110792 -132647 -51814 -276900
20679 -276900 105931 45114 -837 -36729 -23682 -260585 -122671 -81977 150993 137734 -31029
20667 -303431 -309711 -95466 51666 347084 111138 -2590 -325854 808 -201455 -6256 -173333
20656 -173333 53431 7358 36405 158907 -201792 4011 358402 -124237 -158591 -87366 -81020
20645 -81020 15684 -221591 37684 -166638 -167716 -34788 69307 -189723 96247 -59484 -215228
20634 -215228 -117697 -56032 -54331 13257 -248385 -169703 -22942 -344713 72554 232684 139539
20623 139539 5823 -221881 -49280 -9895 41775 -205545 1695 39449 -33250 -69427 -123693 249073
20610 -202552 164574 15392 25055 -129201 299121 -2602 3514 -126088 -5711 -208889 -45606
20598 128192 -21884 29943 -70603 24391 -207361 -192453 -67693 241398 -192137 -110751 126327
20586 48440 91703 13081 219288 172789 -217895 88279 -103658 157282 -167775 483 -266167
20574 -121832 -27662 133302 -249246 -153477 -157336 -100163 12946 -111620 -167323 122036 -13522
20562 94994 86815 135268 61240 -24866 -252746 145279 -119325 -16064 125606 198869 -195494
20550 180306 -153936 106721 -445913 17992 8101 -142709 -162138 184478 83991 84422 159801
20539 159801 -229731 46934 39253 -149715 -60766 20159 -322000 -104673 94482 57773 -435120
20527 -63537 -115138 -102059 -159969 -37719 -34434 174173 28260 -288957 -164784 282774 98872
20515 176444 243588 -248302 -371865 -53410 -53559 63234 104813 14733 46677 -205894 28103
20503 -84926 399451 -231606 -232499 -15784 -51028 -121257 147084 -38534 62424 28492 84766
20492 84766 -38849 99911 -291643 129309 221775 -236775 26850 158056 -48451 39919 -338333
20480 -93577 -17354 -83311 -246364 -50005 -62341 -14791 263452 138277 306 -115616 -180106
20469 -180106 56593 -108046 132335 -255348 -177210 132006 -257367 -211785 -67873 -272159
20459 -272159 45368 -80496 -9169 43642 -461316 -46591 -140115 49097 -337666 -218374 72784
20447 164847 122320 181278 4596 36258 -36758 -93611 -201821 -246831 -71772 -86943 -18924
20435 -45371 -316103 299635 -163432 332088 154359 123755 -295151 56176 33769 -93553
20424 263357 85629 95562 -108236 129130 424817 68769 -197614 -220523 -13127 -184627 -79591
20412 -189916 -228118 -230386 88580 -163138 -126720 -118226 15320 73243 251352 -168123 -95846
20401 -95846 -141946 207291 -225471 -313794 -328164 207928 -123497 74711 55531 -45447 -57356
20390 -57356 -105729 211526 -72276 -223275 185538 -92624 -110480 -55343 -159025 -94592 -69330
20379 -69330 64282 60909 -234290 267777 212483 116637 -441287 -71765 83406 -328026 -570129
20368 -570129 116127 271983 -10985 -249416 -221805 68281 213006 -50816 -122656 -47583 -154603
20357 -154603 166649 -298615 -265426 411426 -323669 27745 21009 -8734 165130 -63673 -127033
20346 -127033 -43383 38594 -962 161516 -110408 -89486 -6999 -166647 -31496 -270188 -126894
20334 -251075 -185451 -104351 -209640 -76045 -47055 125152 -375096 99787 279500 -578 -101518
20323 -101518 192356 103937 -45601 -117778 -51931 -129187 -45429 -178194 -37812 -98301 -337305
20312 -337305 324397 47391 -171542 244132 -112432 -306824 117935 90118 279951 231228
20302 231228 -396519 -161633 -219846 -85125 126701 97171 57734 313007 13204 63164 -62980
20290 -213055 -15614 32299 243888 83994 218347 158553 -211029 -94135 -88863 -127546 -206376
20279 -206376 71026 -36716 202039 11595 18337 -232200 -5116 -72366 -110532 -421222 -55127
20267 -439994 74914 110785 27263 -197956 -233284 -165102 -163447 -186565 274809 -180127 29923
20255 -227767 -323127 -413007 -181266 -143971 -136840 -185223 32112 107029 304847 44734 -154349
20243 -176298 -135443 -279291 33122 47554 -194214 -340151 23974 -58360 143239 24056 -55260
20231 -10446 -126138 84489 5685 154218 -78159 -167283 -71744 68846 -340494 46196 -14733
20219 79375 -158530 159466 122198 26423 112337 50679 -64573 -42179 -366526 299742 -86589
20207 106800 -23292 37432 -438475 -7252 189371 -71072 36347 -342615 -66091 401996 75991
20195 180494 -121901 59311 69435 25406 6899 -153698 127479 -18207 -529 165001 -8171
20183 164173 56711 -3096 201722 225535 -65682 -87112 2101 -185210 -239508 159647 -24620
20171 -358667 -180530 405874 -99348 -42643 -145332 -6452 -264176 -151367 19152 -73668 -38653
20160 -38653 138452 -151532 -73883 113233 -133929 -257632 -72816 -77147 52668 -114355 43318
20148 164121 -28145 363740 -15987 -67062 -176475 -34440 208888 -81190 -214375 71846 -67132
20136 -202622 -54075 -93098 -71348 -109577 -328670 166260 -61398 -240999 -298709 -178166 -127143
20125 -127143 53165 -251223 107860 127561 201087 -38789 15923 -28401 113133 338508 189144
20114 189144 40607 -266056 36820 -129648 -73504 -250049 10829 -326241 -68703 52325 -181752
20102 -8269 188818 257414 -24939 18861 -145153 131078 -228759 -265954 -78024 -187191 173698
20090 -106048 -136197 434747 358321 -67948 -126224 -65136 730 -73463 205025 292390 -182598
20078 -333627 -106414 -183985 -225704 -13857 13941 -361121 -360722 -152229 -187208 -90196 101428
20066 -283519 -154094 -55626 -249565 -23787 138314 183865 152193 -256747 -290455 -184215
20056 -184215 -58821 -464459 -225346 -227593 -138823 123951 4907 -23265 -29472 -971 -342411 -79495
20043 -305257 89532 233050 211169 -364963 145733 -157083 -5934 95081 -150168 -196043 -1973
20031 -189395 10412 -109681 -74436 -124088 -331997 226633 170678 -235907 84679 104658 143044
20020 143044 -30440 -398511 103243 161555 445723 78042 210877 -3716 -203771 -127146 -268982
20009 -268982 -137149 -293291 -43444 8298 -17511 71755 43358 -31823 187904 -92440 -961
19997 -61518 -27163 111692 121559 -45209 -119609 33440 -237798 -34769 30753 -78983 -187405
19986 -187405 -199430 -5533 -214550 263166 -7343 67105 -377153 181612 184251 114550 43870
19974 167294 58078 154458 92784 -228245 272866 -372634 -131101 252982 569277 185866
19963 176151 195198 -114539 -365051 -107304 167542 77008 134537 -210202 -110868 218224
19952 -65407 -346030 -195370 -24124 110958 97237 -146805 55971 308351 -6461 -21406 -126613
19941 -126613 -121858 589 -520178 -44388 -214483 -384710 -243121 38920 -206293 75614 149591
19930 149591 -34577 -140204 -161142 -94394 -274364 52838 16702 -36877 -253566 215026 -188983
19918 74951 -76129 -133570 103116 -302090 -17158 -109977 61330 -186147 -9571 -246582 -198044
19907 -198044 -403999 224161 67982 -219951 -7037 25077 -342476 12574 -14130 -142408 -52884
19895 106275 -70738 123392 -280248 -22005 -409476 178190 -166161 -47612 -105851 338513
19884 -260474 392161 -295793 -305652 123854 -191096 -21069 -255604 -58910 -239547 -93273
19873 -196771 262267 -226465 -184361 235360 -214588 -69223 -121813 -184848 -137325 281271
19862 -26213 -3036 -151290 107046 3518 -92872 -42511 -47954 108381 -242884 237016 -118894
19850 -195865 -286253 293430 -233705 -142787 72086 245047 -219428 -191027 -54964 56227 -247629
19838 506006 -254019 -159565 86396 72270 166465 -321381 -63667 -75533 -225713 -196820 -107646
19827 -107646 -220620 -172772 294998 -162828 -110315 -114679 -184436 -51786 -117775 81993 -278111
19815 138747 -90995 -214466 -112805 53005 195344 -216689 90617 115765 -581950 27004
19804 -82977 348373 -40080 459165 228172 80840 3721 -24898 260269 -48744 -150 -45472
19793 -45472 28817 44455 -84858 -146057 -209887 -192576 288620 -113076 -168093 17511 212996
19782 212996 -108153 -348377 -248542 288789 -121190 -208178 -260275 -213613 15516 113091 60619
19771 60619 17570 32820 -136707 -154545 -386432 238515 153906 -403946 -57133 136915 -250891
19759 -40001 -143593 -212589 -77649 -112972 -92711 94487 47474 22967 374956 277075 165212
19748 165212 -236580 -391301 27974 212829 -114444 212360 76985 159971 -221795 194115
19737 147336 -235513 -222303 78463 126165 -113644 649 -65574 -88923 -275755 180191 236165
19726 236165 11217 54849 -160677 -374615 58371 68774 138661 109062 135796 -308321 -386184
19715 -386184 128285 -74445 77364 232810 -73667 187781 -26049 231128 531 -82623 -70188
19704 -70188 -431996 -93929 -194540 -86936 -233831 -16382 -256953 -20079 -159527 -102685 -113805
19693 -113805 -76901 -35687 167218 -188405 -104748 -248213 -134325 47561 255177 39021
19682 27707 -298333 142611 -57230 -24197 10644 132534 100676 86068 50940 -266403 -276590
19671 -276590 213767 322924 155121 85589 141017 101832 -430426 -72951 -4804 -76923 -71246
19660 -71246 -355540 -221996 -334295 83829 141246 -176104 -251971 -486917 202068 121736
19650 121736 -140888 -59166 -295212 151635 40033 -65223 -50300 175644 -205660 -114662
19640 -114662 -30740 -456001 -31237 -43051 -123728 294472 160624 -279045 -201099 -154925 56227
19628 -432614 -524313 243073 -171850 46582 78900 -201746 30948 43401 291165 -320916
19617 18834 235190 -165721 274282 265849 1452 122553 320989 414309 -397428 -176789 172495
19605 24341 -106848 288132 74194 31033 -66030 -291723 58578 -27013 -171710 -299067 -142142
19593 -213636 -97324 -87799 -160537 -365673 -186540 298993 -143861 121018 -243062 68328
19582 -38699 -51930 66645 124758 67973 64854 290755 250115 54480 -172334 -35943 -144499
19571 -144499 -146080 126552 240127 -205202 155025 126417 -210343 -404337 212974 -35810
19560 -77277 -388699 59972 57004 -259396 104587 1835 -339015 -197450 165199 84204 -209802
19548 -32520 -27175 -184998 -18164 13110 169644 121021 -212683 -57199 -13841 -150954 -50098
19536 -51729 -39969 200923 94299 -143649 28920 -156921 -61074 -134785 -175664 3480 -166049
19524 -181830 249201 35993 -298565 -121114 229386 -199022 40779 -15467 -52973 88000
19513 29717 270922 50414 -285998 -347392 167786 -125702 81626 76249 -116956 -271211 -86752
19501 -326919 -188062 283869 -128979 -67251 -252558 -270586 -171620 -195658 -60149 6065 -75649
19489 -139870 -134019 -233386 138729 -287788 -11834 17397 -159796 -219060 -221282 -314901 -464404
19478 -464404 11269 -315812 -184861 204316 -74883 78366 -104065 176231 -98203 -154013
19468 -154013 351754 -132312 -172230 -95268 22851 -34650 -279602 235758 -28064 -55985 -197715
19457 -197715 -22959 -65048 -72060 -89484 6663 169234 -172003 -39266 125702 19563 -101717
19445 64988 -243543 28145 -61477 -130609 -234216 -228997 -270332 -286568 -136571 -18636 -207461
19434 -207461 -305962 147348 121257 -334937 -312533 291562 246156 58899 -38460 -68997 159859
19422 -34997 -122277 -7198 139340 77545 59450 -42384 67336 290823 156311 -329519 -203327
19411 -203327 184794 -41596 -127787 -8351 -10434 -208806 1582 -146740 -154944 -5825 -277343 -174472
19399 -174472 -123264 210806 -114192 -34341 -126026 168415 22800 -206990 -215720 -140429 12296
19387 70080 73511 -190907 -403309 -148124 212614 87195 -167669 -324617 -63798 176221
19376 -269099 98679 50306 -9743 -226838 -288348 -132259 -180178 170418 191377 -325168 159460
19364 -164540 26281 176801 90171 -239720 -349403 -209249 228995 -62793 -110905 -215009
19354 -215009 -24353 220926 -144696 -197468 5266 115059 200174 -200868 -259544 137506 -96514
19342 152935 92989 -79963 -148442 -98846 252318 115564 -260748 -228571 192873 23306 -310073
19330 129637 -150866 -74404 17958 37146 68836 62738 -14413 -48489 -91883 141253 -95923
19318 -146153 -109769 -241527 76446 -65725 254918 37228 45769 -215257 81788 -163653 82257
19306 182802 -20791 -54042 34271 128416 -265682 46858 -380975 38528 -234250 40209 224918
19295 224918 166680 100966 38967 -31778 -25551 73473 152798 -76529 54823 -109036 133963
19283 16807 77266 156925 -187016 -130656 -312462 52555 -56637 -225717 -34024 -240883 44179
19271 294067 -56317 -245097 -74914 -185565 27536 -28581 -131030 -158022 -187416 -178410 -81935
19259 -157195 140154 87543 138317 118252 152358 17789 -18856 -195567 193025 -144303 -107109
19248 -107109 -133203 -151632 -129819 -153834 -298795 55622 54668 -86021 -274443 -329122 -266389
19237 -266389 115549 -183630 152410 -291365 -200718 -151673 17333 14658 -115141 -36880 199639
19225 -243770 199767 -44135 36633 -257115 -48105 -453 -108438 -30046 -67217 43865 312574
19214 312574 -384316 175677 -216167 -60269 57896 -194661 -255511 -46129 -110884 -406628
19204 -406628 -440201 -276290 -12267 -5945 7004 134210 -228242 -274858 -212854 -84776 -73771
19193 -73771 -176430 -200378 -4748 83261 -251033 11505 -4942 322118 93425 199370 -152431
19181 -47265 36539 48567 -392560 -196359 -130214 247431 -72392 172123 -21443 134268 108034
19170 108034 -309227 -376111 413479 -194853 -172402 -96190 206039 -265566 -420384 -146384
19159 -270654 -187162 -211746 -229016 -141822 -387377 48369 -199237 201395 75115 -51539 -93173
19148 -93173 -252645 -165580 -277137 -111598 36937 190538 -240338 80480 88543 -49861 -69970
19137 -69970 -12701 -372489 -164147 -146817 -130212 -120525 -67991 -59921 -198868 -42374 248416
19125 -182846 -246145 -28005 29429 -115166 -81101 -255169 -163853 143098 32531 -101967 -43257
19113 -136975 120945 -52151 107375 24788 -140882 100076 197671 -95061 1692 59605 164691
19102 164691 67262 -48392 186731 -100037 -141645 -44383 96303 -214319 -235894 -131233 160955
19090 -245539 290136 67511 37632 -214824 -45583 -25183 -207446 181394 -158977 -113179
19080 -113179 -157888 -71683 -166080 -197350 -34128 69391 145544 150946 93684 -105418 65315
19068 -162610 -32002 -48285 -391724 -60371 -331534 40641 -172313 18980 -427850 -49497 4733
19056 -34830 -276413 155406 -229934 -54954 169505 88783 27115 191073 -170540 124673
19045 338424 11966 -125401 34190 70613 -91628 336126 -30945 -94163 -191897 -228703 38066
19033 -127251 -58042 5476 -41158 86458 -107907 417629 -80001 -7552 184778 -259747 238307
19021 -74296 12849 62264 288670 82969 253496 -93595 -71697 -175047 33801 58726 -187023
19009 141143 -241524 -24423 84685 142068 -177580 -106445 -291430 -47190 -67714 -12240 -299765
18998 -299765 126251 243423 -297794 -110314 -3289 35817 -233031 361767 -169218 -14898
18987 -88904 -160894 509230 66218 -139859 -424190 78497 -121622 -50939 120530 6518 -47741
18975 -131634 -94630 -68274 25859 53543 -143096 -342606 177919 -102553 -347921 183173
18964 275418 -177108 -86537 12145 99651 -232110 -139381 -131123 116388 -136260 199061 3583
18952 -110875 33112 150720 170868 -219613 -353504 -23419 -59733 33639 16489 -56893 39252
18940 96405 388783 101149 -74129 69865 -33189 302455 -98742 63476 9994 -178674 -137770
18929 -137770 -361298 160487 -184807 -495647 -96921 265160 -244301 70895 -190463 -46810
18918 -43158 -245060 -121565 -95425 -160596 -214407 -108255 28114 20300 -27671 85732 156711
18907 156711 -178319 46770 -65422 -28041 31147 -518278 187414 -84850 -148037 25991 177896
18896 177896 -240759 -238021 -335047 357667 186472 73906 -6313 42712 103142 163719 -36237
18884 9716 -76915 61631 -119276 185465 68340 -137008 -58856 -130977 -133596 -197486 -179728
18873 -179728 -27387 -100388 -298971 -216501 -253152 -194084 109707 -314620 177190 -46357 -247118
18862 -247118 138006 -166412 -95422 -330496 -561470 -192946 30984 -37262 356216 -170942
18851 -17240 -153158 -237847 138743 182704 -133267 87959 -71032 -219199 219823 -87184 -138442
18840 -138442 -27651 -381018 43614 -224911 -206631 69123 -351091 -861 -193956 8563 -5190
18828 -213801 19130 -114138 -196969 338760 -19762 -296190 27473 -125905 -67239 63711 199630
18817 199630 -44711 312073 -4886 11718 -12911 -129336 60595 139166 281090 33586 66734
18806 66734 -214035 -62729 44537 -5909 -228244 -376320 -229854 -79588 -235111 -3179 -8979
18795 -8979 -137624 -561166 -218496 -125113 -154553 -132530 -43575 -164005 109654 -207511 46512
18783 -222071 -93710 321986 -85619 -236233 -454485 1824 32447 -125708 70968 -243823 -241451
18772 -241451 -638921 -143913 -185786 -464038 -20818 -685044 -152958 643 -89629 -501488 -97106
18760 -396057 -62431 67253 198184 -195084 9828 -207174 -377317 -13480 315005 94989 209244
18749 209244 310280 -298682 452456 80534 -113653 -88277 -378944 37893 -49852 -163443
18739 -163443 1111 -8272 59811 72792 435423 -294349 -66119 -473743 -171491 220185 -145543
18727 175734 -102409 161893 30159 -72917 -177420 -194716 208223 -18631 -64307 -141145 144168
18715 116939 -162960 -68712 -238512 -156438 193717 -323128 138394 -309636 -100069 26456
18704 283322 -43772 -964 126664 -28652 -19365 -257620 24734 -66680 -161314 179724 69016
18692 -41462 -144666 -186827 -139841 -388954 -90788 -37954 -272553 381001 -13183 250322 -108081
18680 21423 23821 39088 31998 66404 84847 -159079 -6984 -2107 191675 -117430 -113800 -178287
18668 -178287 -106026 162010 15470 101502 -46023 14612 -49515 -432729 -32545 -158195 -100673
18657 -100673 83605 -33845 -201650 117499 12136 198516 -329554 -78410 282217 182943
18647 182943 -142193 9417 211965 -19970 42641 -57851 -175685 -151726 -42393 -78924 110113
18635 124352 -134767 -128141 -174994 137809 24098 -65790 -75797 -23742 219415 139094 -40837
18623 -80912 -303222 -128236 -219633 -133586 77440 -68809 -129010 -41802 -258715 -112577 -112254
18612 -112254 135280 239293 -215044 -111473 115666 -227018 -1532 132544 -107769 -10378
18601 -139081 -340708 -135821 -304918 -338 167409 45330 262059 174439 94805 -34214 143232
18589 -347472 -123106 20814 -278214 -46074 59411 158988 -60597 -70633 217900 1413 -446564
18577 239995 124333 81392 -153698 -25965 -197335 -364399 139861 -345780 -237055 127808
18566 -27976 -386797 -35265 -109198 -24966 -316816 -283933 93011 -272324 -141064 230749 202307
18555 202307 -30330 202950 113166 54556 -113638 -262548 -136152 -158189 56367 77484 148269
18544 148269 -215455 193127 -34177 122907 -146920 -256548 101232 -47137 -225107 -166548
18534 -166548 -70755 -262201 -305652 110285 29386 -112253 -245333 -127090 -106424 -209872
18524 -209872 -268732 -113602 109907 64238 -303113 223580 -33386 -234967 270815 -83256
18513 -11953 -129381 141543 -166401 -132135 -10519 147816 177066 -74708 85983 -183189 -123665
18502 -123665 -87188 7337 -206572 -68056 230549 2021 -186310 -70309 134201 -16306 -92533
18491 -92533 -143559 -130551 32442 -137216 -167243 77753 134092 345811 -243665 -19652 125633
18479 178020 -172599 -163317 194131 -78531 -43162 52791 -106161 200776 40416 -34580 -48383
18468 -48383 56884 -166330 -57937 276175 99469 -116237 70636 75314 -303474 53527 53433 -213740
18455 -140892 -356663 -273213 -172691 -176092 92037 114900 -35110 -205391 -58430 -61820 261914
18443 104813 -3883 59750 -244556 -66277 -127267 50501 -162724 241957 -214274 -165211 116421
18431 -337681 -3177 -162213 103596 28713 -81146 -124346 -209684 50008 -134622 167442 223567
18420 223567 222257 131029 -342914 -166706 -115775 -115255 114454 -179912 -66535 132375 -173883
18408 16056 102678 -49195 202944 -5846 123663 47014 79576 25482 355338 347769 107711
18396 -74557 195408 -162004 5507 -121512 -80063 -134820 32403 -85840 20878 109039 -77048
18384 -166444 -203660 -88541 -58749 -325076 -140747 -67677 202742 171042 -305725 -223985 -49824
18372 -144498 6096 128288 286161 83992 111532 -100155 92200 162037 367841 -273101 38567
18360 -77520 -112487 73367 149467 350562 -232122 50474 -94932 -73906 152131 -27637 -190752
18349 -190752 -180978 -300236 241259 -197721 -55467 -149700 14188 140907 79155 82946 270073
18338 270073 -43748 8165 74626 12343 -111121 6454 -9599 9022 -260407 -94697 -124205 -421089
18326 -421089 -306499 152355 60397 -3758 -138492 -281451 69991 42825 -243871 252936
18315 -213910 81308 -107592 85784 -56712 -151045 -186119 -26184 -295104 -81318 115543 -255061
18303 -165405 262230 103206 -72282 -91927 252086 -52696 72768 208813 108736 -30046
18292 58283 -125809 -187941 13708 -45485 -190253 -90646 -87787 -142618 -144967 -313138 109568
18280 -44757 197415 -216607 -39311 109858 -97640 -219208 -311217 -237880 -24858 -76190 175948
18268 128389 112527 -69001 211439 95356 -300961 69855 -105820 238685 -78981 -275041
18258 -275041 141586 -45593 -55520 282169 15055 -105668 -245603 -32367 -104335 -201263 -68382
18246 -47995 -54835 -99804 -278539 -64795 -139945 -188481 57498 -115997 -272819 64240 -148611
18234 -16159 76081 -227840 407593 -33580 92160 -213395 -155771 -94729 108723 18812 -49767
18222 66909 -33036 -140897 -327044 -150878 49 -18406 -64148 -275574 98727 -153945 -59065
18210 -150853 127306 206883 -89598 -138729 -269444 -13105 -42029 52249 8325 2493 6024 140375
18198 140375 -13020 4038 -128195 -88598 -184288 111366 -57510 -16445 -134899 -163867 -44234
18186 -75324 32775 164333 21346 119313 -86879 15619 -44266 -216051 -444033 -160631 80889
18174 -38932 64666 -112603 -46416 9689 -1356 -291140 43987 -42986 45214 209472 -99997
18162 -288948 64576 -27534 -148004 149787 37213 26782 130199 -173352 -7072 244101 -162818
18150 39434 85505 -44729 -44787 20109 -405550 11590 38967 291512 13170 452791 96641 -105650
18137 -224016 -129461 -253974 -40731 -227758 91080 66601 130972 141702 -241474 160014 74144
18125 -271391 -7704 -248905 -138477 274156 -65459 26436 144155 -194660 -74116 -208240
18115 -208240 -164128 -221320 128886 75828 14099 -110541 -76555 -73046 -55242 358105 65717
18103 31341 -125687 -60100 -169618 127288 146863 -68610 95342 21365 -44415 37206 -172652
18091 -98312 -124156 -395753 -97201 -157137 172544 -202180 49092 -157087 -90918 -114729 121751
18079 -177289 -54157 39497 81438 65645 111912 307686 -340989 -127527 131193 291187
18069 291187 101393 -288433 262590 -11620 52732 -29200 -68203 -151132 132975 178582 -21623
18057 269490 -2207 98311 229557 279205 274475 61418 -215551 -107652 -45615 -425901 58176
18045 148727 -402990 -106920 32628 -73331 -166013 404700 135299 -228667 115082 -330553
18034 382296 125609 162276 54412 -50429 187820 147410 -161860 216241 -132434 -46154
18023 -306747 -283306 -24421 212982 -418544 -140032 3119 -127458 -228064 -145160 40179 -22899
18011 13363 118323 -27928 -95063 100620 102443 68823 -98409 -196731 -126977 -139891 105154
17999 -274912 -122513 75922 -74482 134981 -292775 -485478 -150293 -87628 109780 166196
17989 166196 -123919 13575 -102079 -14568 -122710 -45221 -10004 123235 -168075 71736
17978 94762 -78758 -19094 19989 -286451 -116352 -105493 -101002 326031 -84792 -139480 -99099
17967 -99099 -26573 -229353 -10666 70821 -128844 -157505 -295039 -43175 180172 -216761 -299390
17956 -299390 112806 97554 192004 -32204 -111561 -251752 -21004 -107341 -141406 -36856 137076
17944 -39982 -70885 -254285 93109 -34033 131673 -486173 -27846 18790 102262 36160 123686
17933 123686 -313355 -111057 -201358 99896 43041 137905 166956 -18594 70797 -177196 172777
17921 -88332 203795 -137902 -133724 128483 7205 69270 108204 6667 -48531 -24143 -191439
17910 -191439 242499 -47538 54661 -100630 -280168 395517 -29044 373997 -44177 -239907
17900 -239907 -29641 -93922 176043 -74526 -168839 -301145 -115 -71243 26674 -296560 -220786
17889 -220786 -12871 -28283 -36218 89356 81224 54683 -78111 155951 153674 216621 -439822 58143
17876 219834 83197 -106974 -291947 25270 -238259 -233892 40209 -331935 428299 164627
17865 -89008 -140450 -101542 -56577 -156022 63021 -60765 -29075 -220226 210936 -22256 12076
17853 -21025 -17695 207026 -413204 -8382 193211 36119 -52653 -226921 -128330 -70793 132129
17841 -115089 83293 101377 -407480 -175171 149396 -8214 -107526 -122768 -219956 -122486 -111166
17830 -111166 -146121 -96383 -41603 334991 -338745 -34244 127604 90572 -30432 -269375 119638
17818 -26728 397742 131035 -93127 241681 -95389 156433 -106464 -17498 -24335 -89341 -321927
17807 -321927 269721 37935 -128853 177331 186004 111213 99669 93948 -87091 62966 32415
17796 32415 -33622 143120 132847 38882 54933 -88530 396350 -59770 26704 155704 -318877
17784 289898 -31147 113697 169713 89226 -264955 -170698 272654 -141926 -154447 345174
17773 15956 560514 -188689 204405 63798 -213962 -107249 -108289 9098 -216051 211310 19139
17761 -12593 -177857 -78598 68829 10522 -43310 100408 -36792 36911 -147355 100501 217973
17750 217973 -50070 18814 -141491 90890 47010 -18391 169076 269213 31876 107292 -29798
17738 -189586 31585 109833 -10160 131607 -311782 497222 -38058 -240641 64068 -13219 -85815
17727 -85815 4092 14073 -112655 -236986 -123224 -97609 69164 -69807 -51189 135560 -24989
17715 -129988 -115320 -195469 -6954 -104896 -134813 389187 62449 -198909 404956 -167023 26743
17703 -39650 -338714 -126790 -58386 -11022 -26644 88374 76944 220498 339149 203126 -196230
17691 -75842 -132251 18268 145783 -7601 -72968 40910 -342275 -269253 -115658 -184164 -60667
17679 61760 26122 -20182 20752 -99313 10514 78652 164738 -190666 -312318 31434 172623
17668 172623 79801 -137170 -47179 268091 140572 81331 290411 -149473 227813 -37265
17657 166223 112111 -55130 -81428 -305945 216619 211383 -268134 -290174 252739 -166148 6545
17645 -47248 288698 226816 132987 -25414 26962 -116 258640 13337 183116 -7141 -150355
17634 -150355 -47693 -67289 -53578 89156 -336046 338696 99951 1955 -98027 186638 13916
17622 310088 -48369 161215 242328 -210777 -167742 21077 15836 1552 76319 -120772 6550
17610 -7492 -395027 -65022 -105458 480639 38911 -16859 429945 269139 -195258 72287 75030
17599 75030 -153505 34021 187032 119414 -1283 -76767 146307 28845 -21609 3631 157685
17588 157685 -34355 136424 411042 17693 253981 327310 -136313 426833 63475 -276514
17577 -9264 -52187 -205600 -55337 269616 294656 31865 65347 230477 -144963 -3765 -295549
17566 -295549 -171871 47438 101501 265342 160653 106908 342693 -195729 -231637 -112550
17555 -124454 -30450 212138 -75972 65706 -230636 115719 221920 45609 208334 -265988
17544 211560 -166125 13345 30136 82768 -73428 118176 99712 415250 108007 143565 -19479
17532 154450 98546 -46356 99636 -192418 -136786 -157069 -189679 296433 189369 236842 167180
17521 167180 -20895 -276207 115715 377510 262098 488136 103276 -170237 -126511 -54511
17510 33998 -81864 -143865 189017 118479 18374 228668 84089 -242235 -43176 110397 -9090
17498 141365 348350 -205501 82912 -101760 125278 11743 275437 360795 668262 196846
17487 -81536 33323 33041 66841 -138878 438209 116415 -113624 107953 139839 -49099 207221
17475 298583 445866 -28770 -144132 -129311 190532 -108762 81216 385806 362034 326333
17465 326333 112142 241736 58870 -37205 364939 -27906 130828 147057 155024 126150 87608
17454 87608 52140 340227 398580 166608 323827 70431 310503 79202 -48878 54544 264019
17443 264019 236956 447353 263495 176739 375988 207355 271348 -36702 362965 185787
17433 185787 63261 101915 248027 409012 298885 101967 -156559 263690 406877 108033
17422 184738 64324 352518 391667 120035 -185108 399332 306419 309606 323228 348052 43221
17410 -93961 -114960 72526 212212 23632 143698 97327 175228 -119766 -161667 45459 85920
17399 85920 -99987 1140 -81541 30186 197076 100054 228149 -225298 110192 246808 340616
17388 340616 106503 358086 212355 281855 155097 99632 194773 683530 423733 229669
17378 229669 15534 146295 110899 -21343 -50957 -20553 221677 -170265 -40151 369824 214632
17367 214632 269646 -221554 109377 188653 -178611 70464 160004 156141 -120241 141262 38058
17355 -2695 153120 -90000 -35994 -80419 349105 500480 120348 210654 421764 -94017 413735
17343 96292 135203 152831 -8231 199005 14336 -121901 61369 302228 107964 341324 2268
17331 153904 425196 -38944 251020 -81119 20877 77317 584540 -149675 129027 118767
17321 118767 390233 183261 328332 301444 107033 426496 50939 159476 181023 419529
17311 419529 116827 -100492 10404 214058 182645 -2218 126428 79706 236531 138343 126646
17300 126646 14093 164290 -47751 238504 513222 109857 328421 245164 155559 290583
17290 290583 299267 444166 443569 230472 -22140 209067 -28941 101836 198279 75533 -36904
17278 228634 165173 -310814 -20782 202723 4269 71347 33670 388812 165085 -16656 303828
17266 416278 139230 262197 180635 86132 176788 -74865 92409 543532 400344 -56257 475470
17254 502787 265446 65416 -29794 250446 500866 414075 360310 366255 154479 362746 199246
17243 199246 235205 361445 247926 268636 86636 -328423 147846 217085 -5388 385008 160163
17231 124561 -13660 149044 80486 -253165 -110448 144914 443932 86394 -64196 202443
17220 122203 300762 265970 4897 447009 -17122 286433 104533 185911 103838 482275 67355
17208 115212 215915 -128368 197871 322252 49780 207167 388894 158186 153682 -36789
17197 367484 380645 -51717 383547 625054 285269 83169 338829 21873 282127 437585
17187 437585 37070 445287 -32752 205939 215006 443277 497830 340850 125720 325374
17177 325374 538601 148509 -27608 500199 -48987 98041 383685 286279 433656 95523
17166 205959 108312 339597 41956 360478 262200 417692 305628 130871 366523 185120
17156 185120 389922 291445 432122 165235 304440 11341 350018 296801 567374 344424
17146 344424 128381 266633 -33274 224297 331499 89056 250468 97224 -70565 272421
17135 -77773 400070 426731 316258 157850 412778 400322 227754 118084 91917 345341
17125 345341 204398 487715 214302 522812 554374 423624 406474 115078 413733 221747
17115 221747 328244 498094 31375 352248 94547 176783 172076 500644 228613 660441
17105 660441 368983 191222 265078 282247 392096 472428 203281 495091 372988 297826
17095 297826 450825 307716 515717 418345 635627 232025 507001 689287 241780 490627
17085 490627 134107 612868 735877 468153 334896 618589 641483 358664 464814 469224
17075 469224 570802 260835 425197 339870 445518 203339 318723 244527 195648 294336
17065 294336 379517 49896 482254 475557 666964 669280 375958 425814 915148 337760 603396
17054 603396 243445 533229 428122 555511 276275 496409 546941 459045 357792 650074
17044 650074 532367 770065 497046 407142 500939 552918 545868 226367 254150 498587 593504
17033 593504 772045 253949 478319 435322 593322 332806 756649 557446 612461 875175
17023 875175 465689 845222 355914 915157 809332 532222 137964 531693 536175 709891
17013 709891 566836 686151 666557 787103 895949 676045 651519 796434 787694 533967
17003 533967 753416 629969 505671 870927 744565 813805 848336 604471 663114 475624
16993 475624 902472 886200 603649 562648 782413 1018039 586654 774442 676725 682394
16983 682394 573361 757134 974558 1019299 820804 1123349 646186 725644 787957 903463
16973 903463 882676 901795 748872 678189 909776 1039179 1113473 1128782 1080968 1019876 1065270
16962 1065270 791914 815597 995647 990705 1038221 795738 1487956 1086649 935586 1092808
16952 1092808 889907 1111735 1125942 1071602 1334551 747873 1295948 1017540 958791 947781
16942 947781 1065169 992697 841347 1305846 1164370 1150653 1254825 1239226 1119276 1554157
16932 1554157 1204082 1324466 1355521 1425712 1446693 1051112 981477 1157039 1266632 1106866
16922 1106866 1501737 1351540 1494576 1013977 1386793 1370922 1369048 1589073 1543500 1209121
16912 1209121 1291124 1579455 1194961 1354846 1504478 1726305 1627149 1380018 1926899 1860566
16902 1860566 1711074 1825791 1607752 1812557 1615875 1809610 1698920 2010614 1711596
16893 1711596 2127835 1682747 1917045 2105632 1838308 2067083 1957576 2344369 1952930
16884 1952930 1934619 1922765 2296894 1968591 2057910 2026500 2337395 2167639 2238952 2659073
16874 2659073 2327492 2362816 2316146 1979366 2492591 2557762 2489199 2294329 2700385 2891114
16864 2891114 2892209 2919148 2640093 2764293 2805482 2948596 2934594 3060805 2939317 2915522
16854 2915522 3023281 2976898 3103398 3414733 2980696 2973289 3359616 3427643 3271194 3508719
16844 3508719 3603945 3337854 3537690 3809248 3848139 3678515 3492494 3862746 3995363 3959652
16834 3959652 4068696 4242512 4272600 3997875 4691073 4330987 4487672 4761685 4650303 4785152
16824 4785152 4500172 5020992 5024577 5154488 5314844 5118549 5320183 5431786 5705620 5599026
16814 5599026 5707624 5874387 6114257 6108282 6089761 6507390 6077924 6617086 6813130 7019704
16804 7019704 7417557 7211969 7370156 7552357 7741979 8102441 8375321 8640522 8433536
16795 8433536 8640619 8853158 9307749 9285956 9536851 10307712 10109076 10896246 10999352 11306314
16785 11306314 11641086 11593056 12029236 12544464 12980938 13419780 13933294 13784488 14196769
16776 14196769 15088786 15259968 16095609 16347365 17151414 17525501 18417588 18752010 19216592
16767 19216592 20126132 20613799 21699315 22358071 23518734 24148548 25123466 26213997 27112658
16758 27112658 28171616 29669958 30717374 31828635 33075142 35076761 36395687 37775017
16750 37775017 39825933 41645491 43615591 45945472 48351079 50721866 53412261 55986889
16742 55986889 58964214 62066667 65360313 69548904 73404552 77116017 81479146 86337310
16734 86337310 91230799 96331516 101563291 107242533 112989204 118876992 124794398 131335517
16726 131335517 137046775 143272734 149109109 154878235 159538677 164122814 167284730 170388977
16718 170388977 172147972 173066654 172675963 172011698 169993773 166697763 163134302 158351610
16710 158351610 152952471 148047594 141926445 135953183 129851971 123520689 117278656 111441181
16702 111441181 105495453 100054211 94573597 89465115 84609725 80068679 75747130 71607395
16694 71607395 67788807 64209325 60745012 57520209 54298870 51858096 49503998 46569915
16686 46569915 44520007 42318308 40240016 38751867 36594445 34869777 33674810 32320407
16678 32320407 30607752 29382940 27956963 26860419 25848354 24835126 24014956 22905856
16670 22905856 22145004 21380460 20714102 19628344 18744587 18144105 17962249 16993057 16477287
16661 16477287 16170890 15697375 15126770 14813593 14111552 13579401 13197648 12507138 12676540
16652 12676540 12086638 11861992 11285223 11206520 10851236 10543079 9989258 9956028 9629038 9413452
16642 9413452 9447057 8902484 8471886 8538904 8412136 8105852 8093755 7979467 7592519 7479435
16632 7479435 7385084 7254706 6716352 6746738 6446505 6740309 6361335 6047866 6099530 5684595
16622 5684595 5742767 5800460 5723072 5506213 5545717 5028700 5366734 4828046 4915459 4715775
16612 4715775 4499247 4658062 4315418 4216313 4324776 4125819 4131622 4131436 3914310 3904521 3971662
16601 3971662 3785936 3880911 3544129 3919742 3729387 3505073 3536864 3512962 3549186 3190471
16591 3190471 3262429 3369223 2996968 2943237 2837080 3126035 2837095 2756543 2964249 2842114
16581 2842114 2659049 2833649 2649333 2692934 2723189 2664995 2465099 2316846 2077339 2749990
16571 2749990 2225169 2274113 2261266 2415102 1948629 1860389 2131572 2047956 1862581 1972010
16561 1972010 2158852 1837250 1937281 1946361 2117653 1903925 1999245 1687576 1826328 1623203
16551 1623203 1747139 1291721 1710140 1801183 1667042 1758017 1390743 1738767 1539020 1733715
16541 1733715 1301832 1664693 1714785 1586466 1387275 1627266 1473603 1612831 1387053 1337200
16531 1337200 1235363 1194498 1275910 1396278 1710984 1225692 1792393 1338577 1373201 1405226
16521 1405226 1179445 1446150 1140337 1276175 990639 1483764 1563223 1096539 1059813 1257866
16511 1257866 1342095 977994 1235905 811401 1069162 890657 942467 1162411 1028849 960755
16501 960755 997168 1059482 1062340 886817 812702 1155488 983611 916996 914190 787337 1104031
16490 1104031 1070296 1018312 1334247 763310 921820 910516 956002 593853 801055 743073
16480 743073 539488 674251 1048437 743797 973013 991862 667516 870397 641545 781987
16470 781987 657734 688711 690198 768114 789651 975204 460186 821060 583545 866386
16460 866386 199393 888369 424239 518263 917332 646701 397382 908973 757727 581123
16450 581123 681737 570006 792061 580927 823015 492426 453333 649578 499404 530129
16440 530129 750529 888687 768887 765225 412656 423442 704874 681478 747634 627432
16430 627432 429459 910094 705850 521615 441729 302965 445546 487108 672279 459080
16420 459080 598443 433566 397315 389870 771664 572733 431154 339022 774235 341929
16409 525375 476329 299566 472463 321424 550438 198140 156647 465444 7263 438785
16399 438785 479320 406937 740122 224644 274813 371478 114968 396692 379534 219167
16389 219167 444200 537874 310137 377084 609424 373522 383249 409949 276945 584884
16379 584884 316293 127384 405097 73811 459469 332781 249539 379807 37609 181184
16369 181184 170020 445916 426265 115070 617749 245373 -44657 129327 253601 157838
16359 157838 235471 167708 571754 178207 87458 212439 248134 227826 29789 76903 294020
16348 294020 266041 341650 495548 201381 266036 -142278 379282 346394 243488 233636 696640
16337 696640 -4973 -247266 537390 569258 -74400 621364 180293 257485 338165 183505 134314
16326 134314 156266 449246 129916 46930 322191 549483 18544 355495 360697 133459
16315 -124513 275689 431709 115852 -12598 -64368 226138 -28043 327534 -58808 422275
16304 485115 -10861 357398 511616 153325 -5139 77234 77028 596029 247707 203618 137853
16293 137853 193708 329463 84464 250759 268378 -86402 74900 -169670 410061 324010 273859
16282 273859 170721 109552 127058 -88310 96264 -104806 409141 220654 409050 75862
16271 184465 -14695 233530 358812 263394 161969 1499 220505 -124845 399709 -48479
16260 5527 108901 170338 340255 233839 266016 97723 -11772 -71123 193737 -201388 281909
16248 204420 -168190 436364 129479 340147 290919 55536 222908 51322 -182565 150472
16237 170129 100282 182495 292979 220349 220837 184161 123775 414986 91471 223766 437372
16226 437372 187219 298084 236510 102909 218124 142823 310097 -126120 82386 57133
16216 57133 149773 -63836 185968 161814 -89579 -79628 71211 83821 312694 -72364 281348
16204 189906 210438 -154525 -36606 -17717 101388 -139937 -82847 -103930 -126097 -22625 314487
16192 202409 232306 -30673 37994 -100897 168479 -55489 121365 145111 138333 161429 -57938
16180 209888 -105478 -106315 -58144 -272403 -23834 192093 20592 21508 -86454 472641 -13859
16168 318666 29459 113792 -174246 -266020 216265 104628 153079 74120 -167482 12772 -43082
16156 417625 2214 171878 -409923 95558 -48763 -8142 -402910 90174 189076 339201 6994
16144 182992 18385 351846 42655 198887 -35717 -145213 182073 -102129 158881 58406
16133 -34767 -345982 -342905 -19495 -22795 -98213 76119 -166763 61197 -242970 -221166 261106
16121 -8727 48548 -107705 213864 -59807 296408 -284891 126404 324004 70503 -82875 129404
16109 -315372 -158626 -1765 -104732 167525 -182372 -27817 -183233 283429 71487 184227
16099 184227 13991 247178 -71721 -48779 -125441 -69594 -98427 36458 50953 -29434 -172115
16088 -172115 -194618 22811 246670 28451 -202522 14815 -245054 -228302 -194902 -317285 180915
16076 256309 -165818 -346808 189039 -90875 115535 -50070 97002 33524 357718 215242
16066 215242 -154215 6083 -143774 302326 85188 -142325 45166 274773 218139 65859 231893
16055 231893 -53333 347236 72919 71256 234661 234524 -61515 -47114 -218905 13749 -5562 -173592
16043 -173592 -146535 84361 -106838 -26247 374524 -284920 -159909 -169161 -240970 108931 -78051
16031 -67352 67219 121209 -112551 -68121 -133650 -74530 -357098 50495 -149897 253376 -125827
16019 -81493 161374 -104368 -84093 226504 -228098 -323670 -134675 -135021 252473 141439 -180684
16007 -189265 -49054 15630 276359 -111079 105874 -319006 -191108 -163491 357923 164953
15996 -186827 -11931 -234710 -273957 -301349 -222378 -139220 -16916 -192536 -35285 4295 408123
15985 408123 114341 86119 248018 239487 367980 590100 288470 91580 66365 -119738
15974 132988 117531 142754 86628 -218173 -240519 50007 -381640 -110203 305555 -349402
15963 -130782 73535 -365019 -115909 193149 162043 -30343 -322444 247278 -307721 98405
15952 149042 -144955 134100 -507731 86490 62868 -235956 -87677 -72503 -97232 51835 -39736
15940 -300213 120223 154119 8988 32625 -50931 -206439 13695 -251363 76429 109550 -174566
15928 -92727 437631 29724 -92730 -205409 94038 -69795 -75833 -151142 -334564 14092 45512
15917 45512 72760 -153787 67308 173330 -470074 -9990 -11691 -30720 -140992 69893 -237588
15905 150469 -259356 58882 -167059 -13649 -152199 24273 -234602 8275 187191 10984 -85439
15893 -162633 98376 -74264 -31983 183476 7495 228470 326998 -87546 137162 21576 222262
15882 222262 67328 -31077 57270 89719 -245366 -41549 -57189 -59556 -167913 218320 -31850
15870 -19896 -37417 -196371 -200359 -261390 73661 150152 96990 -549256 127818 108560 -117627
15858 -126020 -231621 -12968 -84291 -53032 -308253 -48001 -59720 163274 75348 71654 -25125
15846 293873 224605 -69949 -322740 -80700 -48533 32833 -305267 85410 291 -205187 -201151
15835 -201151 -207142 -98244 -85178 285288 383354 -9131 43276 -16794 100491 -365164 12648
15823 27346 -127624 31554 -136595 71119 -98865 34576 8708 -207624 -241662 -132086 21741
15811 -151856 -93146 83303 -263217 -116446 174064 278715 115053 -38879 193396 -91719
15800 -320338 14924 268570 -62295 8709 65171 -164195 -106166 -161484 -288920 195114 92534
15788 -275713 105807 -118857 -136368 90777 -77434 190 -38896 -28167 -180431 60239 3696
15776 -186949 -202473 28077 -145600 -318782 -142925 -17366 -413196 122623 -99119 -310200
15766 -310200 -310497 26815 8616 -33048 231861 118543 -331901 24321 95553 -133203 220106
15754 92974 110819 217981 -187570 106523 4980 -111281 225292 205833 -61594 10799 201999
15743 201999 268181 -87033 -6739 -23718 107342 215384 113331 107533 34795 156075 -36438
15731 -294300 191862 115257 -219454 377352 163757 -23145 -181468 -335589 -294743 -245716
15721 -245716 -184022 -276402 -142085 -55761 -408470 -214372 -35476 -198335 10455 -414089
15710 -309453 -370825 136196 -262891 -32815 247204 -62147 147371 -18546 147453 -169366
15699 -115601 -159467 -143283 74995 129884 215974 418526 120944 -21330 132041 124494 258160
15688 258160 45133 -172002 -140230 107403 -178270 96837 -11922 -252585 -125234 -216128
15678 -216128 -225921 -335366 137961 -224425 296814 -85819 62664 44819 -32732 -164387 68124
15666 -91443 16032 30787 -305935 23609 155828 69080 -320796 -184162 205650 -128414
15655 94585 -198922 -136439 236727 120165 -44593 -46329 -45244 -76601 46631 208165 68681
15643 103510 45285 -48080 201025 -70638 41195 -158013 -130446 85191 -19556 222458 -3099
15631 5690 -185998 -261203 -310447 194747 -209737 217464 131127 36701 -297789 74455 30627
15619 83412 -175652 171937 111338 161789 196995 -275531 33925 -279882 -96485 -70846 -6323
15607 254583 -52506 157631 207124 -77429 1397 -231097 -42895 -63456 77524 -170745 102408
15595 -196325 -78828 215911 88377 16203 -84412 -214152 57158 -111195 85040 189533 219420
15584 219420 -179831 31754 361681 -148268 129726 263288 -20498 -70615 -7534 -12679 -193816
15573 -193816 -163548 -95072 -70177 196734 196637 -7089 -52207 -60027 -155756 94472 298456 230191
15561 230191 -83160 -160087 56428 -79391 -127409 -243741 -87449 -184466 -29388 312169 -227920
15549 -16341 -194058 -271853 -232221 -157615 137011 228585 -150934 -82134 336642 -399552 101849
15537 -40204 -135687 11749 -121511 -86068 373358 -372507 -204762 141184 22802 6140 -141105
15525 80694 -258622 -82346 -124599 -162597 -158787 -60202 -62538 -1565 -3736 -285385 440597 350505
15513 350505 139135 223505 15863 27534 80738 122403 -37905 -252869 -237036 5611 -52088
15501 320651 -239500 -66691 -188560 66639 -207462 -151058 211824 334054 -83655 46326
15490 -269809 36628 -26245 72000 -141642 -40450 280436 285441 378573 102871 -127853 7942
15478 -42601 247969 -169227 92607 274538 149637 -202664 -131292 349741 -154868 15074
15467 14431 -214055 275988 171511 49553 -27072 -265900 -150389 -301513 46360 115166
15457 115166 86272 -100011 -97418 113512 158423 13706 -6967 -102332 54875 -25511 305351
15445 -183922 -249360 216773 -200881 63848 237842 -230706 -360818 244762 33288 299875
15435 299875 -535382 7996 -133002 32795 113768 -4207 -413909 -31728 -226049 -176947 189859
15423 -78988 -54663 -85134 992 -49243 310414 -130689 -191235 -113929 219178 550352 -206130
15411 -222837 2554 -84233 169933 -252579 -92708 267424 224763 35 54508 21109 -260300
15399 -165510 -213249 268623 -393126 -183151 -195424 -337071 115818 207809 143650 -173552
15388 179755 -13715 -466545 82629 77080 -36173 12629 -25531 37339 147615 111688 43008
15376 279580 -52293 1547 109935 402221 210378 56268 -1843 117446 -81704 94202 -47627
15364 -1124 253705 281429 262207 329573 221307 -131281 35779 95238 -21935 222070 31823
15352 -85553 156707 -149278 -239631 -166444 228195 43003 -304988 59883 -20713 222513 -328295
15340 198434 -98442 -67639 -69218 -369202 13644 159542 -241993 49826 271523 190739 114182
15329 114182 49465 133211 126420 114823 54821 58329 105892 162108 46619 246106 -8345 -306460
15317 -306460 33385 153205 5635 -169774 -23489 -97516 28987 325123 347921 135792 120742
15306 120742 -135265 25359 254652 303384 -93014 -73164 327617 -36406 58645 -148960 -38100
15294 125004 165733 248454 -83587 134951 -326817 -261619 -340107 -74842 36504 129908 -376456
15282 -12170 -173670 -43840 130225 40923 70288 249261 -135222 78309 200109 -70988 69702
15270 21186 449516 152758 -119955 6241 -202163 42783 91565 -408283 -147934 21244 -54752
15258 12228 -68930 16208 179678 7981 -55914 4293 7605 90647 676076 575293 1451637
15247 1451637 1112103 1362122 1377530 517729 11061 283785 222959 100996 189751 17401
15236 169632 -330862 192630 -204783 348579 -147852 -194528 -95501 -149791 -56331 203137
15225 -85435 -195079 91645 211839 -69430 -211336 87008 235647 69468 -235335 119431
15214 50029 307431 -65994 158406 -74627 -83886 37899 329364 181967 -11431 -226298 -139773
15203 -139773 154769 -153627 133940 -31294 -236803 -286 424625 176107 69091 81295 176746
15192 176746 127510 -149925 83655 -38590 -226995 165569 -74329 233455 13491 -159393
15181 -156597 -14547 186295 -33063 -205178 -175286 -85876 -133477 84166 112793 85882 -37264
15169 311051 143079 219849 78576 -124139 207716 -28642 43490 152093 -137796 128281
15158 221188 185688 202026 -33202 -62740 189940 -233803 -262094 83519 41238 369284 86250
15146 135855 -39533 228113 122412 212241 28576 -8663 249727 -35708 198292 -222087 250255
15134 254096 -61543 -13723 -148860 298077 166511 135072 252690 167605 502690 247087
15123 -37914 -36251 39534 66105 -199422 -125491 272574 221283 79488 -35588 264616 322734
15112 322734 -139497 -84000 -14050 -115573 -152846 140641 86893 -28036 238750 272525 -147646
15100 434280 270091 66412 -91322 -159238 205556 -124616 377287 155504 14964 -84422
15089 129557 -29117 -185677 -113870 -188363 190059 554767 515512 7806 417915 84594 223650
15078 223650 33075 294888 -80580 203595 -241996 -273278 268371 -6473 145246 -60696 -637036
15067 -637036 204072 271760 358262 61426 -7798 285669 -56804 411736 338243 -233527 -49960
15055 34373 225965 165735 172108 74176 382790 151132 46402 55326 446958 198178 177236
15044 177236 220438 57628 232686 134951 230330 26488 305854 289566 325714 -70223 321817
15032 -126326 -25320 12288 454183 -165690 21686 221108 229688 181499 257559 -5853 177859
15020 437573 80173 139654 163719 162980 101528 228584 -124154 33546 275285 18463 40622
15009 40622 27369 180168 -2214 -26029 5153 51579 124886 98146 20992 128783 345190
14998 345190 277454 -44220 139218 -82764 284490 330647 218170 322284 348930 230308
14988 230308 320161 -19542 354653 -76564 118786 64770 336449 325860 96502 383002 89143
14976 237908 267465 537041 63773 382634 194096 70066 141990 294717 100301 235751
14966 235751 -41100 148504 18838 313449 342503 -207855 223147 181942 -46417 126073
14955 147358 87885 -44338 168932 111662 45874 495725 310937 237810 383452 513272
14945 513272 109881 4856 137368 88410 232945 343785 236644 132458 567641 70458
14934 198629 266951 355676 136644 69063 176004 346142 210759 231491 36528 273316
14924 273316 -109044 330521 62155 236345 304980 115684 533038 389160 64556 -41482
14913 -97320 185044 430726 130242 203171 446756 242840 362196 126514 -43692 404607
14902 357826 289027 437460 147057 260688 41185 634061 218235 -44539 402389 148603
14891 423396 633729 152505 375718 349569 340441 129092 481237 205495 458813 391504
14881 391504 158106 186860 308455 186609 298450 430870 411774 443622 548123 378003
14871 378003 279078 321145 513195 599079 276509 524394 601283 464240 102930 445103
14861 445103 252193 410280 366376 350150 430348 514566 150195 163477 143105 134985 532021
14850 532021 635011 354920 345207 122862 276923 184810 465359 311050 426838 236737
14840 236737 302351 539829 454765 554379 478173 467110 298757 414108 409528 389542 263852
14829 263852 366476 424686 385551 579520 218147 392051 302838 278118 268127 644897 500837
14818 500837 412715 139798 761316 623374 291706 296543 491344 618854 470799 80114
14807 485868 730078 423572 280813 197825 438420 618197 881712 444750 369395 518539
14797 518539 397715 522308 302317 465652 215768 596856 765319 509757 233412 383513
14787 383513 616650 637965 667684 655951 577830 807659 315191 727608 637530 526141
14777 526141 395005 535140 293796 368854 360238 460145 403309 283829 495878 619099
14767 619099 694089 228686 642123 854210 264779 524968 555217 729328 444574 459454
14757 459454 750288 682971 691488 700147 717547 407097 323647 661412 589024 453654 330377
14746 330377 460404 564969 698313 684875 868969 410324 751742 513698 584185 681976
14736 681976 638845 651651 963531 623990 657072 787167 875648 679643 450592 794761
14726 794761 626598 899131 831737 1020087 671464 688254 777216 571038 515963 1005093
14716 1005093 810266 543368 751256 633683 868017 733228 770012 740373 473084 441734
14706 441734 776490 895550 1048634 1071598 858396 881249 917513 766072 1092019 696259
14696 696259 1014474 851877 807206 854770 1134195 847131 748043 1052083 787659 989152
14686 989152 758650 824089 966694 684955 1083599 610119 1043279 1103315 728190 879405
14676 879405 823151 909633 1013271 607954 900910 735284 762483 974996 620479 925871
14666 925871 821072 1311863 1052161 943441 1000125 1058750 1105314 758021 875632 1139460
14656 1139460 868774 1082691 821495 1012472 713591 1312472 811486 1015499 1139538
14647 1139538 1163186 1124705 1249320 1188888 903483 1306677 1066009 994130 1031043 1251132
14637 1251132 1315865 973609 1285861 1195629 1371163 1078376 1135014 1359121 1086189 1269196
14627 1269196 1189970 1175165 1070871 1146090 991388 1318032 1348123 1466238 1441167 1391843
14617 1391843 1569287 1458272 1580007 1144924 1470475 1232580 1484773 1532803 1309404 1409655
14607 1409655 1229579 1601981 1702017 1377262 1689898 1367271 1506969 1597781 1428071 1589893
14597 1589893 1679416 1740157 1598977 1475946 1388124 1889768 1576256 1720336 1521643 1577941
14587 1577941 1978318 1539169 2160598 1791451 1740689 1822704 1925007 1926770 1526214 2008742
14577 2008742 2019159 1728729 1957706 2173962 1583305 2131801 2505184 2135060 1955983 2326572
14567 2326572 1850094 2094902 2038113 2222755 2214700 2457181 2083428 2552541 2191379 2360991
14557 2360991 2336785 2876944 2907225 2980969 3516059 3535005 4201285 5430614 7322512 11478523
14547 11478523 19800896 35953796 42507617 22620766 9491883 4751162 2898350 2253780
14539 2253780 2054368 2177096 2067493 1883331 1828830 1845108 1740564 2202277 1794076 1972444
14529 1972444 1757309 2383443 1952751 1885262 2170645 2277906 2281713 2212003 2278270 2320423
14519 2320423 2397560 2238659 2552293 2220064 2657028 2569538 2657286 2530902 2628884 2838707
14509 2838707 2746569 2726486 2606458 2626474 2985785 2689157 2736995 2796727 2804261 3034480 3029320
14498 3029320 3304324 3218476 3024278 3044227 3173806 3090255 3294848 3275924 2765209 2744886
14488 2744886 3254047 3339571 3165840 3458370 3570723 3630427 3556820 3265410 3569441 3983922
14478 3983922 3632671 3763762 3795825 4133786 3933830 3956866 3979065 4064338 3950856 4086748
14468 4086748 4026941 4333885 3968270 4395864 4297975 4449530 4431259 4390019 4110510 4663960
14458 4663960 4844615 4582668 4824982 4616029 4889339 5030344 5068879 5245993 4970072 5120525
14448 5120525 5317017 5068385 5622692 5397190 5557636 5425101 5606817 5656850 5738991 6204006
14438 6204006 5780551 6120758 6130588 6211226 6030498 6487538 6416752 6251721 6862865 6624310
14428 6624310 6729382 6611576 6863916 7041717 6987880 7413620 7475053 7320446 7234785 7207654
14418 7207654 7725866 8052519 7889586 8036671 8123452 8139233 8288974 8230521 8018875 8395493
14408 8395493 8584616 8743011 8687978 9014530 9041975 9557664 9342057 9773351 10181330 10069136
14398 10069136 10200636 10540322 10355048 10673505 10798470 11316615 11161782 11326167 11403545
14389 11403545 11584979 12254339 12013345 12273061 12423300 12386950 12933491 13194091 13387579
14380 13387579 13615685 13815803 14180392 14127559 14759037 14857881 14914291 15675675 15774138 15991280
14370 15991280 16230484 16667455 17145515 17620879 17784606 18242629 18292118 18632075 19357380
14361 19357380 19790070 20305125 20321226 21395805 21433185 21992109 22431399 23359895 23652724
14352 23652724 24535579 24567437 25382501 26276177 26913518 27644490 28053337 28842067 29644810
14343 29644810 30416736 31377281 31955408 32849582 33898380 35033525 35573568 36643839 37811032
14334 37811032 38840002 40269685 41357639 42448381 44029482 45129556 46721232 48330316
14326 48330316 49920749 51100522 53066909 55075352 56577151 58564362 60758158 63110341
14318 63110341 65203706 67588263 69994239 73102085 75461088 78779605 81722640 84893998
14310 84893998 88272752 92123149 95645505 99897526 103913608 108584074 113173152 118784557
14302 118784557 124265238 129649090 135775364 142080194 148912004 156437409 164077148 172238057
14294 172238057 180614680 189985654 199453169 209414006 220284874 231447309 242999320
14287 242999320 255401123 268291424 281542184 295304356 308992847 323139171 337731649
14280 337731649 352109290 366019674 379585706 392544472 404371395 414867749 422901324
14273 422901324 427870859 430137816 431164717 432069013 432899593 431739967 429021118 423548577
14265 423548577 416702604 407986944 398139375 387330111 375987132 362932503 349120827
14258 349120827 334760713 320062852 306166080 292278391 279171052 266231593 253619609
14251 253619609 241051633 229236261 218027774 207327305 197296925 187717204 178834281
14244 178834281 170652421 162340120 154931970 147777613 140856159 134234455 128743913 123604311
14236 123604311 118039717 112341381 107974306 103322047 98848570 95465106 92009239 87993088
14228 87993088 84425629 81232816 78528831 75207820 72238451 69655921 67465499 64725298
14220 64725298 62993211 61003410 58536213 56468604 54923905 53036330 51627391 50384402
14212 50384402 49006430 46775594 45562775 44357354 42919023 42374121 41112576 39926631
14204 39926631 38418321 37461712 36510277 35760407 35421602 34105914 33088085 31900228 31595049
14195 31595049 30451745 29913277 29145009 28561285 27941381 27347748 26399966 25917265 25466176
14186 25466176 24820716 24076185 23630489 22824203 22828200 22208160 21440470 21272609 20426096 20445628
14176 20445628 20082358 19757529 19452017 19023314 18428446 18098497 17638301 17465576 16923977
14167 16923977 16583149 16560555 16282772 15934903 15672821 15144792 14904756 14798498 14377229
14158 14377229 14292696 14362015 13775884 13661983 13204300 13298672 12615389 12235928 12541673 12219836
14148 12219836 12044467 11911840 11607963 11442468 11315310 11070539 10744549 10858908 10571945
14139 10571945 10285020 9944416 10244323 9826294 9577162 9610629 9323750 9085734 9169197 9168436
14129 9168436 8844929 8863387 8549307 8246358 8575349 8352353 8128277 8002388 7976684 7829503
14119 7829503 7851061 7404288 7562046 7472798 7109526 7045976 7030673 6856103 6907437 6466612
14109 6466612 6942707 6792436 6600343 6654032 6486789 6508688 6311107 6164835 6204104 5820879
14099 5820879 5727538 5783866 5989756 5997010 5774066 5759886 5566246 5687350 5511370 5455138
14089 5455138 5659614 5324233 5181871 5234871 5098951 5093890 4775124 4608710 4978517 5103375
14079 5103375 4854797 4515347 4797615 4510327 4351687 4712125 4576272 4326617 4432891
14070 4432891 4554797 4111653 4419378 4378493 4547836 4582943 4198339 3895560 4124738 4235210
14060 4235210 4093634 3968192 4373338 3897470 3840380 3689643 3796169 3781742 3806549 3502361
14050 3502361 3467380 3640897 3847502 3884173 3508851 3314043 3317413 3241620 3232470 3319252 3438255
14039 3438255 3040327 3073500 3263630 3538258 2907699 3345594 3113863 3343677 3266688 2885325
14029 2885325 3082988 3151270 3069767 2972327 3004706 2471078 2970948 2822839 2633988 2859330
14019 2859330 2673836 2688909 2821101 2352972 2293864 2489030 2504950 2469733 2357505 2629397
14009 2629397 2438881 1955820 2157886 2547021 2277842 2569164 2220601 2441658 2245621
14000 2245621 2028848 2155190 2661905 2135493 1931980 1741990 2110582 1787326 2432973
13991 2432973 1990818 2649897 3905155 6315176 13128699 29116661 43490225 27025936
13983 27025936 13619568 8464325 6415759 5193683 4212074 3912922 3295862 3339726 2915161
13974 2915161 3175803 2716938 2717679 2663228 2405093 2796365 2353021 2648681 2566735 2270685
13964 2270685 2107158 2398252 1947169 2262955 2129634 2193596 1793039 1850458 2254889 2305368
13954 2305368 2000974 2027764 2106502 2074719 2082434 2101216 1928390 1779233 1932308 2134514
13944 2134514 1795464 2096267 1636272 1957265 1861561 2064742 1775459 2198561 1741647 1772228
13934 1772228 1927252 1810586 1811605 2015206 1622149 1834243 1647127 1611448 1667333 1908208
13924 1908208 1958397 1752231 1542650 1514887 1764438 1618603 2096795 1574274 1737162 1507014
13914 1507014 1548859 1783788 1425056 1438908 1565541 1542578 1484099 1320387 1496792 1398931
13904 1398931 1587445 1365892 1549493 1360622 1569084 1386870 1560700 1599418 1316167 1204047
13894 1204047 1082438 1345506 1494340 1228170 1341961 1228511 1040095 1288898 1277783 1414070
13884 1414070 766751 1149137 1242437 1229465 1292738 1245359 1260910 1355119 1130045 1430937
13874 1430937 1113355 1113708 968406 1229146 1210076 1212225 1188349 770563 1204299 988163 1349074
13863 1349074 1174894 1178879 1175147 1050484 838306 1059265 1354335 1132200 1206098 1254286
13853 1254286 861887 1029339 1330076 1190646 931672 886397 1196626 907622 1047182 970366
13843 970366 1217999 839905 1049983 918663 1017311 881950 700242 1286090 1079055 774988
13833 774988 1149496 892703 1041934 931539 886014 1055109 859185 840618 931698 927231
13823 927231 755029 671916 932894 1097031 1022189 1008647 1182520 665489 855647 937936
13813 937936 854358 1088305 712612 831482 793432 964886 1153917 517184 585554 481100
13803 481100 573148 684786 877341 1027767 520042 880290 743454 943486 987507 750780
13793 750780 1055273 865212 786864 529459 754270 944004 738893 761146 562100 756914
13783 756914 1053547 699684 685991 990845 1013949 759112 688279 693578 989552 676404
13773 676404 565888 790184 478809 676782 1038026 511942 510986 1001529 576526 624891
13763 624891 763388 872619 561610 837152 818626 819383 685022 844906 934242 496210
13753 496210 387263 509120 598578 743057 638492 677768 634823 708533 658347 615254 615009
13742 615009 528238 929276 517356 139509 884008 578744 516100 898338 593741 876536
13732 876536 758249 857313 650921 297483 573711 405543 925197 611331 644120 439629
13722 439629 306789 304202 589813 883134 729385 618337 430509 469321 713500 841057
13712 841057 761371 361843 227284 611815 323885 633123 718778 562069 564797 399824
13702 399824 725378 563382 277282 622359 292473 584418 740503 431976 332027 411620
13692 411620 535770 399157 119861 507848 880816 348959 740525 363604 995632 586811
13682 586811 323686 528865 443128 262786 463562 426106 238679 647078 409812 249002
13672 249002 494030 762652 664288 763765 310327 511319 427274 371956 618649 757240
13662 757240 100526 493082 795713 416026 497780 317992 520895 380690 226573 295777
13652 295777 335163 582575 273310 466323 430560 337512 486863 302818 401203 367826
13642 367826 554462 484921 694050 374911 319581 639911 624384 483728 342032 592484
13632 592484 571775 625802 358265 798961 525837 349825 395889 571261 487911 165147
13621 431122 705735 218017 381311 218522 723539 640361 35256 641712 625436 477478
13611 477478 210689 252717 291008 104921 148490 594996 374403 596298 236256 75400
13600 220772 388770 544975 473578 364986 475802 132789 320532 594405 482812 455255
13590 455255 460566 357979 183889 523560 -4584 436231 431924 -89378 53299 554715 341990
13579 341990 514215 281824 137039 122950 262829 -11746 487408 225891 153519 558907
13569 558907 495632 226379 245688 323469 340805 312874 684765 74848 320927 316209 530912
13558 530912 324272 198611 595291 29459 455795 359718 158521 144681 143306 207520 340167
13547 340167 398375 400281 414121 497353 331603 287473 328050 317242 304874 243625 324414
13536 324414 453336 103747 171555 200633 210365 -22223 -90188 361604 409800 512562 351474
13525 351474 251765 522804 221008 396259 468338 224525 117363 254611 457640 324078
13515 324078 611558 220602 122735 187604 308649 170780 103137 363512 -19082 175490
13504 341872 274350 421592 214792 272789 280326 9069 89288 269585 281583 177433 124539
13493 124539 340335 414156 260589 357559 369611 219522 330406 136134 116601 -262915
13482 108381 134102 505467 408416 192961 -44996 180389 -71834 476652 -66351 359528
13471 433944 -34420 96524 488290 391292 256130 422300 -41290 55821 350122 223463
13461 223463 193328 28375 313765 161758 426917 322568 96301 367534 144702 195641
13451 195641 303094 559491 57759 288491 441779 31880 93932 264856 218067 59816
13440 381004 -355160 100036 353218 153155 -21005 261852 153607 300421 309408 452359
13430 452359 202502 91087 607142 369350 95164 500814 300064 92390 389948 236106
13420 236106 556034 202352 145672 713811 39669 387487 279850 449271 549887 345961
13410 345961 94680 194911 292145 110085 -20141 322277 -96561 350344 5317 258339 396569
13399 396569 242890 289362 -103112 460232 132080 352465 131219 175489 -234556 531991
13388 136713 217869 -111340 139200 561481 22344 369612 426765 195290 96612 245122
13378 245122 328218 127403 218588 309501 529553 212738 362518 381160 363542 500867
13368 500867 223866 360096 193343 94186 263322 152615 212389 299555 30144 470456
13358 470456 41694 406164 91030 220981 178889 90661 338881 200656 342390 503918
13348 503918 82082 264954 491001 347086 88218 311237 231004 20562 287113 153116
13338 153116 339097 109231 303018 271855 477191 288757 -433645 261605 162763 260871
13328 260871 409271 244918 455564 462147 240829 273227 386126 241217 206094 233566
13318 233566 258483 346607 378512 259136 105357 242781 469180 265716 296475 -230914
13307 314814 172768 200278 256252 79487 510321 -38937 188234 197208 287398 45511 161317
13296 161317 406995 413876 471517 309181 -32031 -182494 -182397 283442 5985 70424 102207 160055
13284 160055 141666 150309 94160 181521 271582 84427 243636 121370 33597 -38420 228571
13272 7547 166164 330047 42623 131491 414837 28648 389173 348472 212139 97191 -27913
13260 -190126 64241 -1360 -74762 166624 74973 35715 -53054 261917 290888 115036 -207357
13248 291996 458636 -46918 -216974 206551 -11203 304823 172649 382269 446722 -116022
13237 -42764 -172570 116480 -159618 64909 169203 53442 -192831 50825 -43600 47385 -105646
13225 -141129 -3956 276823 393536 112757 -106074 297325 312245 173236 294045 96409
13214 492765 -225403 32202 -243584 121598 -13737 -20640 391977 114530 61717 216745
13204 216745 7268 104728 35200 126143 180036 -165341 -49240 18221 410855 56496 295568
13193 295568 341762 -67030 -190325 -58751 177293 88211 126375 281753 162192 209608 -2108
13181 102618 67756 281783 -84149 -163464 28692 198267 333196 -18282 179610 222352 354770
13170 354770 259769 144216 17611 312851 -37343 129793 377804 -190732 -29395 109370
13159 360779 35885 136907 164766 82673 235336 -171292 -76434 -210100 -37656 215927
13148 361081 -86354 135687 193347 378700 549563 267084 -59341 28777 364266 151612
13137 227150 148909 178742 -10383 -134553 -258674 -112247 273509 20112 353174 -40472
13126 167372 161099 137649 149310 390440 -272627 55729 22388 -275664 -20694 73064 43776
13115 43776 -246119 -22977 590438 323820 23675 -219172 -150680 336335 -61292 197721
13104 52883 329169 226088 226426 185624 -190260 158152 -273733 93009 -95110 -131131 184075
13092 138874 383434 -193850 -124223 -64330 236756 92155 -133480 148475 170736 -225289
13081 -135136 203857 36025 -18465 -64089 79585 163698 -140351 -10215 164489 -11144 214199
13069 34290 148995 133910 200811 -47029 59973 184615 -35768 50994 65696 278735 -77153
13057 61587 -26054 277579 514568 357234 -165735 -97779 -210585 16206 -51177 213489
13046 -82763 295496 359918 -22560 47823 125150 317458 397495 61969 80753 109546 46591
13034 141076 253950 518231 322022 -136164 -110236 64373 252354 -74106 59246 121209
13024 121209 511079 32224 -300390 327639 175764 22635 -119092 24415 211829 34237
13013 485632 -95036 -67965 -87561 67926 257134 502651 197374 217595 -128140 -99853 -86505
13002 -86505 -7616 102019 345698 340380 337045 167165 -34084 5053 82494 188729 -25591 108423
12989 -7585 -94421 102377 -27034 -121338 -226272 104655 371954 94747 26665 272305 143878
12978 143878 196892 -81798 -17697 -174417 -48144 11926 -248473 341400 119256 183616 163714
12967 163714 -11220 103393 39673 45941 -74942 344392 287303 65493 186193 -138089 -47530
12955 318339 117830 366038 -217700 367401 65978 -95686 48183 134529 -366646 130426
12944 -28415 217339 -123743 62930 68743 323084 -267081 68971 -155278 207548 -169275
12933 274936 91007 -134479 -16801 -117753 203558 -174017 108356 231494 56180 -80783
12922 -12569 38591 51099 -135232 -211916 -125866 -10848 -119058 209325 -125490 112671 -268182
12910 200058 -172713 60595 176774 138785 4763 231493 244725 188817 -104161 3391 199509
12899 199509 -261382 98179 313352 -104124 -266228 29161 50813 193893 -291201 116076
12888 203060 334868 -141006 346407 -51357 -466904 -172965 49674 -27253 215257 -31239
12877 -50349 283344 188103 -137088 20322 106558 -146216 43060 3835 125626 243089 144292
12866 144292 -509596 -95833 225749 -99759 -5642 45139 -117621 365402 511910 279284
12856 279284 -144938 131782 -166398 15369 -33711 193931 328221 49267 -438698 -233593
12846 -233593 -91812 82602 180738 -32322 147747 71175 147412 -49333 -28108 -217961 -235132
12835 -235132 96318 -22338 113126 65998 -29103 92099 -60421 4064 -168656 101426 -90539
12823 -90492 -250135 139869 -42359 -380017 -227212 20515 -2237 -296442 289914 239014 -62694
12811 154614 -184727 -286433 186537 28643 26051 119610 32641 -124368 129494 143725 55033
12799 -20918 -82051 -80895 54882 148672 -143625 -130539 -79498 183317 65823 79362 511 347171
12787 347171 -167577 68476 977 -202603 177322 -72951 116693 266108 -256027 22548 -136684
12775 25757 -48989 257039 358703 18613 63973 45425 132279 225467 -57375 -72988 112789
12763 22254 19393 -88356 -176258 193513 -38289 277652 292634 -320317 -7971 64182 363061
12752 363061 41790 522 130967 177433 21476 128100 150178 296567 264648 155866 -188285
12740 161510 220992 311800 482246 16578 -35891 -50614 189082 -32446 75240 -94880 224529
12728 191734 8942 161601 206367 -39761 263725 -5542 82786 94017 -145748 -15442 -44764
12717 -44764 144490 141987 53251 122473 -175789 143810 238461 104169 280273 -96208 369098
12705 597636 -6422 388057 -26715 31632 75855 -69357 104417 21968 7525 -52953 -425 60987
12692 45149 -289010 39459 -325 -264184 47258 67339 33847 230832 -234467 132876 -164707
12680 51318 -59355 103051 274592 200450 269151 49391 280909 233019 -177793 342082 72312
12668 118283 193392 -92779 31864 137235 47304 -100619 69874 -127782 207302 138070 204206
12657 204206 28319 -69863 82447 -127103 436935 217144 63546 200146 82461 -134023
12646 201410 -21772 215135 23197 -238592 -186046 48898 102649 12647 364161 425345 -38856
12634 50760 -97000 -2517 -89510 -210074 254021 103125 78217 184790 304793 243699 -358347
12622 -26749 78935 251199 458454 47536 181430 169156 73781 56833 335604 24611 -39144
12610 -137507 196716 35824 131716 192494 350913 413145 74472 393998 385300 -14945 -97161
12599 -97161 118580 -175153 -205679 418943 223250 64013 30744 15403 -4774 95938 2679
12587 -150431 -88446 -21780 -199845 170957 -136307 -119802 66806 256124 109483 241060
12577 241060 348999 79963 112323 148716 -80010 -206589 -170607 216110 -200816 -4603 48909
12565 169169 -135201 74419 3806 152139 128282 -88261 -242305 16280 196107 377534 94942
12553 127950 129162 -237523 267527 82576 312263 -252932 78050 74928 75996 61183 18319
12541 71494 -170171 142460 172435 74661 -36272 29002 79786 -267055 111774 114825 223138
12530 223138 -25178 171861 -63382 -51456 -109848 -35371 -177020 -56721 225197 -235819 211664
12518 24845 143460 110617 -198804 216890 131635 -29222 149150 -23700 317444 -171468
12507 -96572 -152331 340577 149513 -114975 46326 34172 -237 79726 316396 261569 -73029
12495 3194 177602 67119 26910 252358 174091 217052 251076 -76428 235800 -99652 -36455
12483 161288 -324624 -109777 173842 58760 -78670 -39585 -452932 81501 -13074 -239198
12473 -239198 51813 101378 -42310 228706 151286 130211 -119624 -250052 94274 -32324 127024
12461 168750 -105924 -153099 77119 -38431 -43783 -243355 -130077 148298 -52694 -1163 269294
12449 34876 115435 -598 4642 38038 105356 -200261 152543 63267 -52978 83235 -61965 -263738
12437 -263738 64221 177887 -220805 -111206 -148215 -130442 -45988 10788 132886 117766 -107577
12425 51264 107809 142109 -7554 -332205 -99669 145974 -103465 -453559 166670 -58796 -257332
12414 -257332 103989 149537 263372 -18079 -342359 -251541 -250860 154092 -91665 -126771 -279279
12403 -279279 30732 -90693 -321657 227917 -63477 283103 140921 -265744 293076 173910
12393 173910 -175989 -79333 131827 98141 -70194 -106882 -112452 99017 73656 43352 -329446
12381 92930 465185 75817 259822 118865 85966 -7422 -48812 -54651 -35401 245488 335418
12370 335418 -29299 -13614 442114 -58377 -284968 -222655 170826 -217469 -164884 341353
12359 286619 368238 25882 -182378 302574 112004 159568 131390 360754 -31956 -149305
12349 -149305 212596 234852 -13800 6861 246788 61185 310897 153159 -89355 311002 -45375
12337 119552 -230770 -159271 159698 23263 158843 126146 213307 94607 63723 -19682 304771
12325 86855 -10625 70223 -383211 33560 39957 105570 296617 -93499 22922 405223 96697
12313 309954 133358 -185855 216978 -106087 -37445 -103009 93991 162129 -1941 138224 -108672
12301 90648 -251974 169379 139737 -283249 -31475 285271 -52203 -159653 134981 388059
12291 388059 -152994 -143418 -57991 295539 165580 300094 256052 -76279 -12045 -298036 17602
12279 -14771 249020 28409 -73366 381145 269836 614972 88202 261376 -2155 108466 57237
12268 57237 -65238 -30286 -303660 177961 -91818 29587 137475 -229844 -60142 132641 149005
12257 149005 102934 -86199 208031 -67958 353607 183324 -119757 33577 -275804 76727
12246 31837 207214 109836 -68095 -15623 140810 -232527 153050 -77593 80766 412521 -111655
12234 -80351 198299 246393 338437 99714 5004 99635 260054 240245 135058 437587 130575
12222 41579 -25735 202453 539786 310286 386758 -39702 85358 -369101 315820 137128
12211 188235 -382931 321065 -66860 -31925 -84300 162405 -83737 -39686 149009 196812 -138259
12199 79913 108104 -55961 215938 -96851 217450 -112164 88931 507935 58042 -255874 319470
12187 224400 154085 -6048 225891 -186637 113802 -63844 212579 221211 118457 173852 146081
12176 146081 200322 -8041 22377 331950 67856 -45402 146766 161335 3885 413853 180035
12164 -134109 239728 -61556 78279 241677 -43436 107399 94306 -8287 -141491 91133 314541
12153 314541 -35296 87479 320647 -46509 -60938 7651 -132198 174825 68328 -64417 -162374
12142 -162374 -190923 -67850 -103590 -214230 476745 -1512 -103409 8728 59345 361308 176212
12130 -104694 225794 -46729 -87171 27050 87554 34823 -141056 -99696 200494 185291 40430
12118 -60441 -96951 158562 -282979 -59829 -128935 -66200 30956 -46789 27285 192510 -173184
12106 69457 -143841 -22193 144083 31863 -281147 -110848 66293 26834 -15223 -126729 80696
12094 58436 -8446 -24604 -90208 326127 43115 -111761 396623 144610 65767 340310 4738
12082 122072 -60962 -5524 46340 -295718 137898 308812 651539 1960464 1076520 288724
12071 101561 147046 37664 34996 -6656 276140 -34802 -140074 5725 125881 -52188 343848
12059 79909 56557 -54210 -73467 103285 -135486 -41783 116064 -59812 -68944 148125 69941
12047 -157879 131729 -63503 60906 119625 -117483 -70012 -75002 105329 164520 -208417 204916
12035 2127 100370 -177678 179399 177556 246264 -204542 128709 -82870 -367298 178657 -46546
12023 170054 -259296 126563 185781 -235064 96959 -117419 191763 203849 253468 4693 88403
12012 88403 100192 68370 -298017 31671 -80594 -80990 29587 118577 95735 148919 101434 15665
11999 -190572 401444 97877 251684 -116718 -296159 -79520 34902 -60930 -150396 -258174
11989 -258174 -70572 -17630 9024 62689 -2602 -19732 -201473 107004 114553 16727 -179828
11977 127855 75823 -105568 -365603 -11800 67894 -263118 -160321 -79297 197481 -75201
11966 -338299 -49024 301978 -111432 -61071 -8179 51426 -509766 -46643 135587 167632 -11601
11954 22227 -45260 -470498 307083 375610 71355 18240 10331 78210 -337360 -123280 -41692
11942 -82096 157769 20409 -133926 -108438 -984 -123984 243188 134530 80690 -331695 -348476
11931 -348476 127451 -29466 57461 -78220 -63336 -241268 229577 45221 520991 -134671
11920 -109185 122737 212981 -47821 -27476 -78426 -75974 172957 -271704 -18990 28527 66280
11909 66280 28211 -10422 57196 -48961 127597 45251 -43295 74872 -83185 85608 -240479
11897 -263402 110149 237888 59239 -93686 -120194 31325 55883 144154 -379003 -344024 -94158
11885 -52118 310177 -69049 -336903 -161541 10614 90713 -108376 201273 62272 39580 102492
11874 102492 78977 -215472 -105714 -379846 -51643 -62524 -143563 -285948 -218321 -61192 112867
11862 -303513 296969 -182940 103295 93243 -96308 105733 127514 -345930 -34254 312917
11851 -454158 -357718 14494 -68024 231343 -61178 393495 -133414 103416 109811 283828 275794
11840 275794 -62072 116173 -106432 -184988 80245 -20168 6159 -86793 -70154 50486 -301466
11828 -280129 -156033 52665 56310 -308289 -128147 1756 70678 -93407 80494 -16077 -169158
11817 -169158 -22778 110293 -105010 228784 64792 127292 -242341 -85431 -160741 -3187 -55872
11806 -55872 -152146 -99248 -334086 -131798 132064 59325 -230526 -22649 -131199 474147
11795 28468 -45178 -4177 139487 113271 -417032 -58969 35879 -13199 200137 -28279 -104821
11784 -104821 66500 -59975 -21849 -26033 -139767 -245452 -123464 -343514 211556 -172081
11773 -92138 159222 -247337 -67105 -107955 -324112 -46068 -4723 8452 129548 57929 59978
11762 59978 -247825 -36126 -51650 -132505 122338 -295866 -99788 -171766 143858 13649 173633
11751 173633 -157745 48146 -23802 7681 -90137 -23159 159260 47955 74092 91522 -39531
11739 482238 -187267 17477 41371 -15523 253019 -53318 303077 -121544 187004 142837
11729 142837 -64145 226385 -77502 59772 -364763 -270081 -57023 123151 -87622 77384 54809
11718 54809 -65790 -67127 -44558 408896 -176720 150239 -122516 -17090 -27333 169389 -820
11706 335814 46401 71671 -39549 157069 -65858 48050 429551 137917 86573 141984 -40931
11694 242343 -77486 13987 130180 -95663 -175195 343361 -46486 -7213 280491 -21500 63977
11682 162781 135366 209724 5971 180739 -15783 342759 -36083 75414 164335 -155085 -188568
11671 -188568 197278 172304 201432 -3830 116928 142753 -18792 79692 417872 -207086 -53909
11659 139158 229023 -35386 432249 62350 36769 -42129 -69266 60008 345867 -32612 125906
11647 -63248 36098 -6852 162102 115335 -99123 -122174 -193549 -48158 -13895 102648 218017
11636 218017 -168733 -170305 32615 82721 152818 -59581 125262 34454 -80071 -78128 121033
11624 363094 -146232 5674 2541 18392 -90857 198569 256279 -130379 353535 -103603 -263191
11613 -263191 -266151 -88549 -10154 109161 214906 -123463 -200202 37153 103166 -163419 -136907
11602 -136907 92764 216542 -48626 73681 -140955 181869 -78194 57769 223100 -17519 228080
11590 269416 229935 39131 23877 371102 102446 121904 346122 45747 82305 5001 -264988
11578 12435 34338 40703 -363593 152117 -142558 189087 190554 226476 -53327 -170977 351900
11566 -304150 79412 140539 234827 182858 -29096 138566 258364 32945 -120918 164591 79104
11554 -85428 -65557 111921 397238 9922 52839 158855 30444 18411 108921 -126905 243641
11542 -168500 -219812 -86527 215322 -16022 352459 141852 110323 290755 41389 242061
11532 242061 -35433 236165 100596 -17496 -29469 -87718 51456 -178384 44013 -40019 -115683
11521 -115683 -173855 67990 -14899 -54328 -123149 186378 7640 180259 183079 -42880 49367
11509 186645 198675 -55451 -4970 -33107 107892 80265 -294044 11280 271328 106471 72370
11498 72370 109243 309336 343078 -151256 -144020 -141291 90481 618705 -170545 -34599 185036
11486 214522 368669 389208 119227 -126822 103791 124663 202600 -85372 37086 295467
11476 295467 10888 169567 61360 219833 85348 438753 259108 208339 245725 166368 472963
11465 472963 404588 274632 370615 167969 103111 175857 -194838 -71524 794 -16373 198736
11453 -82147 -150226 -17729 -43811 -17227 80531 -147228 500972 90616 30777 72780 -69157
11441 249787 96892 29733 363299 205110 187221 493142 277608 -218906 123772 -102449
11430 51478 232896 149763 -178810 212011 52111 83032 35822 -91499 528370 -112478 350296
11418 -217421 19040 115576 65918 185987 -43148 -8407 183525 -51721 41229 209061 -1075
11406 17853 145712 242108 188718 20390 252078 -19749 134814 37262 -66268 145381 62136
11394 -20461 -42414 -7632 236 -211472 178701 -26000 298007 207691 -175278 190361 -146280
11382 57970 -29981 2576 62900 105226 -228100 137816 11322 -266715 80470 73127 -14992
11370 222733 9896 -152027 -116969 -107653 -226886 85035 186727 2366 32503 -119074 -35590
11358 103037 23938 89599 216946 113712 -62454 63046 72192 -67083 -45296 19029 86818
11347 86818 225178 6360 -46676 53363 68444 135969 -143312 178560 244266 -121631 47180
11335 -13133 -80175 -201370 -66339 -192100 -172874 57223 -169468 -114771 7356 15057 -21105
11323 -117889 112844 -130978 -186254 -14670 68970 -2310 49777 125500 18418 322166 -10570
11311 51000 -138381 310581 261866 124473 92576 16118 48278 98563 16309 -107724 -259546
11300 -259546 380732 99675 -191428 -211107 356737 -160037 245670 172083 130046 37902
11289 -21196 111747 55833 -79228 -134075 114280 -236996 38815 -266151 169581 -577941
11278 294902 -13442 -389780 121314 121766 178197 -111502 113155 -151590 -237206 241972 -225333
11266 248034 208876 259342 -67539 -14183 -213401 -231217 111036 -192894 -272400 -158983 77760
11254 -289779 26311 127172 -33283 -340950 -193486 -72008 82460 60478 10956 -160334 -155589
11243 -155589 -57496 -164631 -64458 46563 -105838 -275533 -287672 153801 -3146 290216 127412
11231 89265 -330530 -26245 185362 -56233 -284840 149634 169755 -112698 -95681 33459 130004
11220 130004 74703 -134869 -389572 245229 81430 -306808 -86936 182878 -176986 -188245
11210 -188245 179968 -94081 -54315 29498 5644 32145 -138639 94155 235711 123909 -192348
11198 -306499 -93622 -53497 -47088 -394806 -78839 -72720 3658 244943 68070 39038 -390985
11186 -146514 54829 -194203 -17669 88974 -229291 -88783 -8780 139164 -110669 -263989 -31510
11174 107479 99272 -20009 118111 189297 -116635 -64243 54950 -20882 -27240 94448 70401
11163 70401 -143141 -221813 -323672 44952 -29864 335488 -451526 127668 268692 468009
11153 468009 23458 -75720 -189562 89061 191759 -44139 248355 82276 -162377 76489 169474
11142 169474 51211 -406835 -133605 -165369 -141874 135014 -157102 19535 196403 143992
11132 143992 61719 64475 21885 -244285 81615 -82763 -20754 -211571 378711 -148630 153551
11120 115527 297234 -28113 -28676 -92015 -15427 182567 128404 -174901 -173572 217814 -82646
11108 23140 -1552 48865 -207753 10247 140753 224676 248100 177058 -271134 -101504 168468
11096 -169874 -390 20210 -251572 17519 -129374 244961 309692 235991 67883 -180648 298945
11084 285247 12360 123979 253696 165881 477935 383734 643822 170473 179662 228462 250867
11073 250867 377705 313416 293689 359305 308807 519586 137449 250852 488435 452619
11063 452619 364212 587033 811944 236389 843701 357425 526071 472083 463536 619319
11053 619319 662070 706190 596545 148559 362381 419558 692507 887607 570188 597466
11043 597466 716183 750325 425144 634969 789702 793420 539680 677477 548412 916784
11033 916784 362350 1033272 820619 672153 457883 538500 924075 789806 609690 497028
11023 497028 470977 765782 810479 633945 599450 582494 838929 550911 360671 544043
11013 544043 461564 524969 322479 636887 595331 522852 692470 528530 417579 727417
11003 727417 428521 602621 460659 787295 559625 540103 435183 749580 549016 633432
10993 633432 469999 583117 752270 649544 762259 955708 751796 738234 979141 923997
10983 923997 758632 1089874 1342837 1062384 1107249 1489097 1515947 1523713 1918913 1870190
10973 1870190 2187648 2583790 2411038 2804063 2452746 2285123 2111554 1775850 1811337 1665152
10963 1665152 1608558 1653139 1817406 1571042 1529533 1719426 1318070 1833401 1702699 1955072
10953 1955072 1609580 1091997 1199653 1237331 615319 478717 619915 535687 573847 587103
10943 587103 570581 642341 185179 552144 9324 75582 444293 -78433 574972 -13131 83804
10931 104179 -13250 -178822 313085 -291813 50120 150814 -103477 9706 69914 46949 21368
10919 188788 -20740 19150 -15795 33230 327258 62223 69337 -42673 -60273 -407584 52582
10907 94531 62127 56380 239147 190314 -273512 -238822 164424 101162 -75861 -114249 -177120
10896 -177120 139415 459502 -212282 17971 -108493 114441 19317 230962 -63227 85496
10885 -287685 -18940 -180924 -258131 -166483 -227764 -12407 359047 98208 -41278 -108754 -371831
10874 -371831 61866 -12569 -179469 32047 -104865 223 324234 50101 161745 113354 -13495
10862 -197438 65648 75742 -179889 2838 -104731 30457 64952 -241679 -85377 -315347 166614
10850 147607 206083 -83334 -41028 -126456 242219 -36037 -64530 12320 56846 281420 -125138
10838 -273522 96508 -5311 17860 -61244 44035 -20650 -362187 -22517 -117436 -17295 -399005
10827 -399005 81188 146823 306878 309304 165719 -183644 37840 121945 12401 -41551 106751
10815 -145584 35470 -528131 -141904 87618 -69773 -100992 -131402 -18543 96696 -307674 18702
10803 26773 -32013 -327832 527445 -216917 -74497 -219964 -102360 20949 4032 50328 30345
10792 30345 154010 49985 83982 72981 -14402 -45498 127178 72872 9660 151431 76612
10781 76612 -24991 -126789 38977 -66629 -260460 -19082 228219 -79933 -338568 -14090 41740
10769 -163844 -109714 -119432 352118 1617 177537 -46067 -524610 -111546 -142178 84574 -223148
10757 148055 -183383 -206257 -177150 377885 -38783 105699 -198598 -137815 22982 -44712 237159
10745 -406886 -100449 -41148 -31136 119115 -320908 109311 -168654 -2953 -172869 -61411
10734 -51393 16587 -56008 -84535 282131 -56674 -173477 5466 -191601 -169747 285110 185239
10723 185239 -269107 21143 82743 2372 -12249 122507 -295956 -199634 -158743 -62088 -242363
10712 -242363 -260895 -250048 -112017 42634 236992 238772 -52587 27130 -201990 14299 -42139
10700 297885 -206673 10610 -35169 9622 302598 35430 -131645 -248853 -205879 242695 -187682
10688 -92201 38405 -13109 227613 203049 -52636 132479 -146848 -274930 -538318 -433257
10678 -433257 -226297 -204013 -160294 -334365 38254 70321 -177657 -236131 -75974 61512 -244471
10666 -175151 23126 172810 142956 -165912 168954 62584 -147691 -313078 170628 -122502
10655 -74877 -122250 77397 44960 103063 -137975 -124868 -79705 110394 -60858 77704 -232160
10643 40633 27508 -152411 71288 117269 59754 -80189 -249676 300464 9235 -156299 -149504
10632 -149504 65204 31892 -24977 80194 42250 -156542 22587 -95450 -298891 -247110 16096
10620 117116 80860 -34018 84174 -209400 -110227 77641 98530 -214588 -182925 -351226 -349037
10609 -349037 -66511 109512 -29345 -120061 198949 268229 -13938 55903 546467 -86146 120493
10597 -102150 -55297 -358136 -213101 -344268 35445 -175007 -161097 -124152 275226 258598
10587 258598 -45068 -233707 -278792 -2936 10444 149212 -37669 -298663 -344654 -54091 126382
10575 35770 -43560 4573 94425 -39630 -165948 -64733 -252598 -233142 -424549 61264 -133209
10563 74919 -120776 -40166 -70482 -178231 -98864 155036 -58337 -21848 129790 32646 267630
10552 267630 -209079 84873 -35813 12091 -125585 -62237 -157322 85130 -143817 83536 -28916
10540 111936 -15634 -237779 346212 -375527 218709 -12242 285367 83940 -190629 -138536
10530 -138536 110254 -256264 -39202 -47633 102458 6451 -30473 87904 -216570 19040 74137
10519 74137 -33798 -231808 101294 -74422 50446 110564 -118671 1158 -112679 -183944 112363
10507 -251582 215725 -300322 87015 -43230 -84751 148317 164474 110249 -88732 33789 -150974
10495 -182003 -11396 -155246 -243274 -283788 -165960 -42427 -130114 -33526 97565 352610 -109748
10483 -113784 71769 191291 203383 340888 264186 594804 58549 -37822 183053 160668 188113
10472 188113 -305211 40731 282820 -174609 -49647 -212739 145830 147474 -31139 149993
10461 -55181 26475 -29135 151811 65885 20509 -316061 259012 19962 96814 38830 -44988
10449 -92358 -63646 -309449 -24612 -154477 -139760 -150473 -23002 -17649 139670 418408 -40802
10437 275217 -96937 168182 208367 -238209 -107316 -180701 67498 -77811 88623 95138 -410272
10425 152453 -17880 56854 -137837 13772 -382638 -94 -122483 -90270 -47554 -47507 -64770 169869
10412 36192 -223400 -162539 75069 -290736 -47569 -124328 -113432 -130674 245803 -98890 389
10400 105672 -101720 124115 104525 -82829 -13266 301453 -189787 -65288 156856 209854
10390 209854 39001 -35144 21815 -168457 195498 37214 310632 -14317 -102687 123159 97694
10379 97694 279687 207806 51973 121978 187311 319523 22944 257953 -21338 234859 419828
10368 419828 64933 601711 75555 157708 237589 407391 89114 263365 374231 257733
10358 257733 237808 475021 72206 279260 345792 300478 141649 394616 771645 299871
10347 527277 468098 312879 176490 146430 287067 508635 9526 280055 197258 238872 191499
10336 191499 278514 194029 281171 302391 -21056 -51387 328957 358449 111473 192433 80507
10324 46500 -38374 132202 238842 164910 219709 226695 134045 231107 45008 -55174 314761
10312 261586 174355 12235 -227263 48559 -338605 141166 -159300 -260806 -282423 -40757
10301 22028 -93542 96016 40751 -245930 105885 238667 -38552 1157 -118876 -16182 74124
10289 -181251 269769 -165276 23223 335971 -170550 210869 203348 -100490 148745 -148299
10278 80979 112862 -304589 -123646 -32198 -140012 413771 155023 -116281 -200513 -159881
10268 -159881 76888 113916 -3663 -96187 232519 53449 213549 -28988 151080 262554 298900
10257 298900 538499 389183 300420 227332 193908 -82734 89437 -448846 19998 -98962 231264
10245 13123 -190844 78306 13759 98895 -260358 -195800 -43170 71424 -418284 77488 -153343
10233 -148758 -71066 -135851 -214742 -140465 203974 -69716 36143 34299 -73378 280447 215856
10222 215856 110207 86000 238855 -183756 300030 -26965 -42714 80625 -190309 -239217
10212 -239217 -144647 330186 81871 -165790 -49315 -328990 -351543 -172631 -117642 144799
10201 233114 69898 -74044 -195250 -15503 43260 129204 -94010 363850 -19844 -277926 -122700
10189 34300 363580 -181977 -50 -30214 -51304 32467 78795 -85331 -99327 -69880 307680 -129385
10176 -302551 -371397 40251 208929 -190718 -199155 -463428 -8770 88043 -42231 4815 -308294
10164 293077 8635 69205 -147050 138258 -291273 -64542 -141163 -10829 351345 21495 -337580
10152 -255293 58652 309027 53333 -12030 -70717 -43734 14553 270103 -122226 -54861 16262
10140 -176785 -159138 -102698 58343 -382928 -178438 -33155 278412 128231 9674 81674 -4597
10128 -479845 -349759 335154 -194479 -51223 -231033 60227 53409 -156149 -15876 -170399
10118 -170399 -42840 -148816 -52741 -34449 -145087 388944 -310933 -384088 31529 -308965
10107 -253296 -135883 -133041 388234 -49326 -57459 -237206 -122460 -92964 279862 -115359 -198396
10096 -198396 245927 -9305 -221292 -14523 -154499 50692 282781 -256691 -429177 70468
10085 130242 -236037 -40148 -112894 246092 -109101 46738 14480 -61164 -126902 136513 31352
10073 24164 -142321 -368270 -89204 156835 -5178 -227219 -28622 168684 140623 -36169 1033
10061 3350 -298164 21670 -157534 131387 103032 -13278 190944 -141149 -34134 -169595 -279981
10050 -279981 56104 9694 -76962 -99597 -79673 -34369 12186 232744 125179 44241 -186259
10038 16637 -142061 -21656 24960 -4562 -112104 112010 -51467 -338685 -309247 122463 -24449
10026 -115069 -315510 -154857 -18590 -148941 -23221 214222 -240210 -110883 -319069 -544030
10016 -544030 -122780 149683 -182453 -168857 -173444 218574 -362829 65012 133598 267872
10006 267872 264733 177748 -500264 -113369 177242 -112566 -245797 157579 294640 -120302
9995 -100519 38975 -103461 -141591 -164253 -163081 -222081 -71093 -148758 -49021 426400 -10985
9983 -348908 63503 128959 116776 -112299 -234420 -96811 -112674 -371628 -72464 -71851 -159051
9972 -159051 -325377 -132817 19636 10444 -8303 -24140 -81280 237273 -111574 -211215 46962
9960 15909 -217315 -76436 4223 -122957 -114440 229796 94651 -33124 81884 261332 -13027
9948 138125 -365593 -306670 -57336 -68241 -55095 21878 -202779 394016 138664 -127325 -148770
9937 -148770 -344464 -202110 -167809 22475 -254980 11816 20350 -135075 156251 -69101 146231
9925 -243098 203063 -136557 132384 -159604 1507 98652 -38397 -84201 -65781 -36975 35303
9913 -167763 217658 -102998 116402 89820 14931 -281410 -112376 106266 -216747 88753
9902 66457 10379 44178 -84256 -108601 -229127 -183351 -95944 -245583 -53748 -260573 -255047
9891 -255047 -56940 131644 73605 -123026 -141369 -262928 110918 43166 -69128 -161350 -379282
9880 -379282 26636 -12257 -321392 4051 464537 -82661 -262576 -4411 -84833 3865 -224248
9868 56365 -209884 57939 -175171 142888 63242 -37694 -215201 -338693 117967 -61349 -79239
9857 -79239 33990 -429797 -31119 53154 151253 158577 -296740 -231413 -232659 226293 -432528
9845 -443438 -322488 -153772 8270 -112993 40222 -145946 27838 -57572 -93175 -66417 -617
9833 -274436 -115256 413494 195039 -111998 11030 -73103 13347 -24742 -113654 -57224 40177
9821 3224 -411457 -9834 -96096 233615 244 301835 -174638 85630 -112935 -122131 -158719 420660
9808 11379 21046 -146929 217085 72821 159600 158014 -384520 -169204 -354639 216887 -176822
9796 -150196 -191678 -250165 -215944 20032 15654 -196514 212985 338160 -39808 166617 -105794
9784 -82882 211445 306689 -267126 -78982 -129194 -177731 170101 -85422 15696 -238307 -75841
9772 -184463 -361958 -460 -256539 75561 -37848 -144342 24043 -6066 -126582 66539 -79102
9760 -94963 -286248 -27295 -5298 -202704 -19718 -112468 45623 -252398 87389 -167820 -354238
9749 -354238 -34552 -178337 70920 -201824 -402562 266495 -104942 -105793 113516 -206229 -117867
9738 -117867 -163659 293704 -211575 304613 -165891 -110626 -54803 72530 153 1059 -122174
9726 -405869 -56164 -317143 203597 -27674 19034 -83638 112190 105117 -153427 -49846 -125283
9715 -125283 -303566 120148 107753 -65847 -89563 -86152 -94982 -182161 -275736 -53099 -70160 -144284
9703 -144284 188099 60490 -127372 -133388 52157 -157465 -45288 108562 51400 -123049 101996
9691 91602 -154689 -151876 53026 -181924 -38559 -341787 -86702 79283 -37396 67242 -179792
9679 198665 -163111 -407766 -86597 -33969 -216417 -100521 140926 109732 -213415 -156048
9669 -156048 -18381 58187 251565 13025 -105577 -324704 -129296 76378 -19515 -38488 -132486
9658 -132486 163414 -494883 -41469 -127736 68066 -348876 -135405 -235337 -506266 -147881
9647 -161521 -318469 -175646 -104044 -228682 -201785 180464 169983 -56120 217351 75587 -185725
9635 -191672 8211 -326172 -146905 -360705 10490 88442 -203479 261485 7388 -347510 -112738
9623 234116 102949 -9589 33700 37121 -223288 -47504 -156147 -6119 -158423 112971 284814
9612 284814 150759 37788 196304 134782 196704 -161872 -37970 120608 -219775 -274029 -38594
9600 -260085 -186224 -68553 -131788 -236486 -79832 132700 -119560 466184 -49363 56102 -9504
9588 -101856 73644 339622 3949 -127173 93866 -40805 158301 -102361 71948 17870 -245794
9576 269759 -235915 -92356 14307 209954 23953 -110722 -11462 -330411 -25884 -98859 -54344
9565 -54344 126297 -305618 101333 127562 -242103 72806 106749 71383 43359 10856 -308752
9553 58558 -38791 -213326 294626 32256 71803 -659926 -69641 -42837 357383 -175216 97990
9541 -148267 74577 -48943 244571 99107 -217922 -275576 -81054 73641 328748 79323 208615
9530 208615 -273380 -157426 -195274 23171 -17536 15881 1332 -212927 205545 5228 -275705
9518 -153034 279997 -266283 -89931 30757 129331 81088 -325289 -229906 30781 -4216 -134319
9507 -134319 -93199 -382845 -174175 -33671 83724 -162682 -296122 -236709 -309929 6057 -93522
9495 -197381 10857 196656 -14545 -57868 -30239 -225499 135627 -136514 35071 170572 9868
9483 -44559 28781 -166549 -65392 -199694 -301560 -69247 -36488 -235134 152435 -128529 -214617
9472 -214617 237389 221878 -103888 -178565 -460154 -1270 -35099 124980 -123143 52838 171912
9461 171912 -150678 -215530 95794 85565 81952 -70448 -82806 -67055 -7061 -76575 -119727 -152774
9449 -152774 20322 -127820 145316 -218548 6893 31366 -121739 -39159 183785 24977 -284475
9437 34046 -122544 -9657 33995 -82259 -84508 -68335 62051 -104254 65738 -165181 -142115 144415
9424 31711 185247 14143 -232192 -138400 114237 -278049 -460872 19653 98805 160437 105681
9413 105681 -40994 75719 -187362 -36588 -237363 -87973 -28742 -31348 -109641 -153379 -49737
9401 -50058 -305835 -87503 140291 -28113 -116175 -131012 -165786 -216535 -180725 -40985 -41612 -159667
9389 -159667 -252216 154717 231471 68392 59021 -56616 -273858 44431 -230083 189240 149751
9378 149751 -110534 16737 -80329 21064 -188647 -28711 16172 -309199 27029 -148252 -156884
9367 -156884 29494 -36271 -70793 194955 -189662 -172667 -207437 46200 -313429 -53469 -391271
9356 -391271 -38791 -143436 -144875 -24227 -258723 27707 -266403 -246848 -68543 -182285 -98957
9345 -98957 -9169 95629 139125 -8878 102197 157563 173168 -167232 -18502 -65823 -144760 -94284
9333 -94284 119339 -127526 -126898 -236292 -179826 239084 123299 -85378 241957 -198492 74096
9321 101863 -161692 -207665 -291905 -64501 -105435 218541 204984 242497 -47692 21477 -175198
9309 -55141 111500 33005 61485 191088 -2334 -204317 -18075 -331211 -35349 54023 -248094
9297 -73748 -81469 -87239 -51449 -63955 -228152 -40842 142660 103145 -44499 -171309 288677
9285 -199140 86695 -58545 66568 54197 109829 -115284 -93992 -235038 -42830 111800 -300588
9273 86255 718 -74831 144985 8980 102598 -123572 51895 201329 -136436 -136060 135530 -204597
9260 -281241 -121066 81876 -87509 -37930 83048 -125967 27868 -46970 30607 149929 -196440
9248 279521 273419 137576 -286426 -304038 -258382 22858 7224 120221 -134510 85406 -271615
9236 -193375 -87177 56913 -206470 -206940 31974 -8182 -195042 -15072 -124578 -79527 -371027
9225 -371027 -76439 -231462 101739 -235578 -93107 181340 -142408 127369 44098 -186064
9214 -181387 -122439 -42937 -124830 -131145 16690 -163083 -59019 -21904 -256283 -119085 -270077
9203 -270077 -112821 141524 380895 327573 210460 189057 -235941 -206013 -125596 -158920 -318111
9192 -318111 -307412 -89858 570076 -53179 -192418 38819 -50994 131968 60553 198559 -146826
9180 -140163 -110595 317575 -99879 169460 -53254 -231524 -187149 -47940 -1289 124973 -81608
9168 -38448 -44919 -104928 -76305 182917 70361 6790 -160145 78314 -56658 92528 -143571 -247830
9156 -247830 259279 -50706 2600 -170894 -3446 -137155 -183813 -314361 21568 -289067 -282183
9145 -282183 -241989 -248096 -213671 39763 40540 79742 80652 -133748 142776 -134747 108225 127773
9133 127773 5354 78725 69604 -278295 123198 68684 -203340 -559764 15688 -24520 -124779
9122 -124779 -12240 11360 -175639 78583 21475 -337109 -171237 -567053 57740 -25081 -96015
9111 -96015 -91154 -169526 -94857 175285 -129587 145283 -193538 74259 -27935 -11775 -74016
9100 -74016 -114186 -231686 248129 -45743 -7754 -37238 -188387 -37804 43225 -72257 -28116
9088 -274184 -40222 55756 48770 192800 -252267 -217476 -51967 -173859 258340 -299207 -85577
9076 4170 -291326 -137865 -275499 -187323 55492 -240766 -217213 231201 -153516 -199096 -2008
9064 199558 53844 -239093 413768 -8462 44267 -71705 -246645 -15993 -169658 -85262 65525
9052 -123668 -155171 -291697 -165461 -147268 -90163 12749 -80219 209054 28283 -27468 -208
9040 -344292 -359404 -210709 -82660 151165 -176975 -417713 18843 205235 -204433 -238849
9030 -238849 -4463 -167612 -37190 -107843 -105600 -84597 65704 -85920 13614 136728 28634 -27866
9017 -810 55269 64540 47987 49900 61143 134461 -211706 -111518 33709 -98141 -160035 -470681
9005 -470681 4854 -114301 -91672 18541 -30033 1820 -265623 100169 -395413 -550716 -137849
8993 24778 3698 10896 73834 26314 200596 -15000 -64768 54723 -107911 144898 -69551 184870
8980 -48035 114163 -319245 43381 -98903 -167658 50944 -488531 119728 -118520 22908 -213854
8968 -184257 -23764 104849 170786 81357 111685 116147 76508 24838 -269765 -47843 -56212 -152879
8956 -152879 -171470 -175931 36097 59597 -160784 121883 6316 -116485 109797 50741 67629
8945 67629 -246603 107912 -182866 59631 -117502 -28988 96823 7549 -26486 77868 -169588
8933 100921 -367100 105159 -18735 -186723 5333 5127 -235703 28871 -106938 -9401 290326
8921 658530 1279539 486819 130476 -343680 273539 -165162 59316 196310 42113 -253802
8910 28510 -84557 53952 114591 93272 330471 176659 87658 97945 137524 96173 -51882
8898 102683 -66388 -23143 114153 151490 -15073 -317917 -52949 -51425 -322365 -181025 66849
8886 -26865 -122328 -119486 -259723 -259318 -210391 -214537 38494 -408473 -59423 -70860 -74833 -179151
8874 -179151 101399 -155106 115349 -169066 -265454 221555 44022 -265872 81001 -439446
8863 4158 -145126 -332097 161427 -35943 184906 106219 -202315 6188 -376415 -297526 -46234
8851 -109903 -19329 -200826 143641 -188759 12603 -33357 -347700 54587 122265 -65918 -22613
8839 -214386 32311 -109647 34270 -391143 -101966 -120553 16321 48734 -93834 72593 -270432
8827 13146 -275806 180964 -18959 12341 302253 -141032 68575 -236691 -52563 90428 15443
8815 -4389 -376456 171440 -150142 -231454 -109441 -36595 -13080 -109917 -27600 152025 -88155
8803 98053 -119881 -64609 -281354 -185782 -275587 91799 -317216 185612 -118720 -176693 -129930
8792 -129930 -8587 4905 -96598 41270 -39964 41506 -92072 79707 219468 -123035 -118445 -9418
8779 30139 -51455 -14267 -24761 -282024 -67245 14607 131362 -42246 -391275 21472 -47017
8767 -230097 211691 327473 -255137 -210717 -436904 -283463 -28413 -293367 -391636 78000
8756 -405857 7991 -195116 18419 -220644 -61038 -361439 88853 -81302 194076 -234377 -52434
8744 -91077 -120308 -391649 -11616 305158 -246130 89985 83217 -38191 -32993 90938 -317670
8732 -323779 56936 -183941 -28240 -237591 -237669 -209770 181427 -2875 -11442 -101855 -42334 -52023
8720 -52023 -155753 -151471 141033 151166 -218766 300884 13428 -91854 91312 -205371 -104246
8709 -104246 7976 -246350 43128 -42834 -63140 258196 11856 94418 -37904 -15427 -125683
8698 -125683 143354 -173670 150608 -148371 -14309 -111248 -62287 134746 -51737 -527 8659
8686 7862 -95662 75612 -16356 -134810 -58065 32775 -257801 144980 178325 232953 -108872
8674 -165929 190656 102580 42163 -90675 -80046 353776 -1130 26027 204110 -163835 65656
8662 69734 -101762 -159805 -30113 -172942 -8797 -55258 -310556 -126844 89522 -113833 -15513
8650 -230875 95994 -33855 -105130 -129868 18023 230754 -121834 -64097 36844 -54959 -102256
8639 -102256 179250 15943 -262606 15022 -8231 88360 -62120 102738 1014 -119791 232973
8627 266418 -141973 -199454 -86273 -61622 -33585 -40059 40139 -120157 140100 -150446 12550
8615 -63023 -289084 3340 -110172 -80401 -158185 -69901 60026 -72581 -95622 -148061 -50145 -41240
8603 -41240 -96878 -112213 -14253 -17980 216792 -111832 -73662 62162 12117 83960 239084
8592 239084 -51605 2368 -382006 219430 134006 -408608 -275257 -202334 -331507 144316 118961
8581 118961 -143191 -308452 96354 -343715 53482 124720 -80508 -73910 -331227 -77382 -83484
8570 -83484 -163865 -138324 -348130 -292715 246770 15872 -430182 -111101 135185 109683 -63506
8558 -167510 -76079 -109911 57777 135300 -855 -48615 82952 -139912 -51575 -184627 -163511 123608
8545 -210398 -171675 -32978 114841 180721 -85712 -135661 157112 -54341 -72274 178162 -42118
8533 -159163 -29528 -229438 -168663 18065 26082 -205002 -159929 -48863 91772 106853 -124037
8521 106271 77364 -174007 44969 -70405 350262 -256527 89045 -383961 -169549 -115627 -253867
8510 -253867 -92429 -108115 -176410 -146287 -114089 -36827 -86064 -85987 -146597 -423984 45364 -24378
8497 256258 -237320 -92766 -40777 277046 -230146 -117287 -270878 -96419 -250943 176329
8486 -204433 -6948 -178044 -88303 -369640 -55370 60031 -61473 45783 -112238 -205776 316631
8474 42790 139649 136705 -309053 -190744 -111645 -136241 -148133 -230890 38336 -175255 -293094
8463 -293094 -19639 -88332 -2749 -53641 89707 62997 -221008 80452 -44530 -135906 84847 -148729
8450 -359594 -214260 52793 -204854 -11405 -579279 25077 313923 -57007 -18020 32182 34062
8439 34062 -104980 182388 -378211 207272 213966 -117625 -201845 -26079 -188499 -255459 210791
8427 132116 -221220 50468 -254658 382698 107288 -154564 12473 157938 -174864 180541
8416 -296078 189481 -63273 229230 -142827 83292 135429 -154995 17894 -56404 -415451 -308062
8405 -308062 28294 77061 -3219 18156 -163884 34018 -147945 -35921 -133764 -69437 -134042
8394 -134042 132436 -33843 -329567 -188067 130347 -81664 -188283 -256358 -78886 -73268 -62919
8383 -62919 48108 90367 -24960 225686 -85973 -261984 -180929 83341 26901 127371 -180908
8371 21910 124902 61054 99420 -75481 -92331 -28610 8873 -208958 -229838 109942 104916 -165755
8358 9878 165246 -14288 -92853 -43524 44694 -330426 -293839 -157098 143531 117477 -45848
8346 140077 33351 355909 -191730 237278 50557 -451667 -67608 129255 230581 102801
8335 163087 -68934 244863 110725 -161839 -274404 18281 2714 -146015 -276942 228388
8324 178350 -145829 -440330 -10838 76751 38573 -217683 40417 35835 157295 8367 -170384
8312 154573 23497 -191715 -155414 9302 184648 20346 -38124 -169 -293286 185911 112358
8301 112358 -273024 -176406 -221484 207217 13372 16396 -219993 190928 128624 -135054 -184517
8290 -184517 -167599 -225239 -158837 -126699 340710 -380630 46417 140959 35414 -60819 171198
8278 40722 113565 -25174 97877 -23125 -27410 30367 138919 -150469 -74683 -31705 -54618 49649
8265 -96786 -446433 -151926 34101 9616 36387 -235019 -84863 -107788 213320 55133 90374
8254 90374 -197866 -183738 -215742 -47837 -123646 186274 26717 67488 -28764 60660 -343506
8242 -80594 -40454 -18782 -252015 -179970 -36745 26783 18611 -388685 90071 -38414 -94095 37626
8229 13874 -80350 -118480 -61552 29864 124356 -7847 -13960 -16254 41410 4365 -372687 -303926
8217 -303926 186714 10627 193795 -94864 242428 -278212 243373 -39334 -204541 -72170
8206 -26456 -173575 -74625 3500 -50042 253779 -150503 136109 138436 -116082 365 -1982 -204087
8194 -204087 75731 27295 -105055 -206310 225018 -41101 281593 -102320 -120079 -150433 -163245
8183 -163245 93924 -71833 -206770 233201 -355364 152486 -5169 -171283 243349 -158460
8172 -142058 -210011 -141221 100825 -40150 92934 -93393 67838 -344726 -235703 -175795 145486
8160 -76544 -346423 157830 -248978 387943 -294852 298902 -134167 -115522 148356 -378048
8149 -129863 -105742 -196047 21098 127271 234660 238483 32130 -218275 105552 87574 -201536
8137 71090 -129270 -76038 -113417 47289 173368 -216 22906 -42340 4795 326939 141527 -375809
8124 35799 -140130 -287018 212189 70268 -63206 -328642 79034 -156009 -28257 54172 -2288
8112 20152 -140183 -351463 -225794 -110824 -145518 68353 -50991 76333 223073 -238118 -218434
8101 -218434 -109852 214564 218289 169166 125966 442915 -51913 -94067 -47369 -172334 100518
8089 196492 -234979 15956 37410 209199 -139948 107521 -52117 39107 51443 -157854 215173
8077 134557 -156994 -40924 266930 -193149 45692 -341916 -23215 135807 174798 -166387
8066 285260 80606 274899 -287687 -149451 179815 88903 -157221 -451655 -145817 -281330
8056 -281330 -224262 -28299 -158821 -74364 -250823 80742 -219377 170998 149899 -283581 42423
8044 91756 -618392 -270886 -17371 -140249 100504 202466 -238482 -31463 -173638 212359
8033 -73476 21342 -391416 76323 -100133 -120975 -73308 30380 127923 -36715 -82548 318427
8021 -260410 25615 -122721 -182495 49296 -25437 222810 115849 107289 -104729 -96093 -20375
8009 -352693 -203973 64207 -269912 -33078 9489 432391 -115631 82113 -4509 49280 47615
7998 47615 -264729 244402 -303874 331673 -236735 -42833 -138414 69394 -131994 -283905
7988 -283905 147516 -250312 -186732 210010 84618 -303603 -88972 -81133 -131184 -81769 48638
7976 -176183 63457 -292081 107272 2981 -322883 121822 30410 -61663 -120258 195728 -263843
7964 -26632 -417227 -235240 309284 -87396 -175159 287217 165616 411310 -141111 -193156
7954 -193156 9474 -294759 -113089 172193 -117045 -171175 312790 60068 10410 -18551 -89564
7943 -89564 -49687 67387 -57783 28717 -319144 124256 -39502 -181894 33308 34972 114912
7932 114912 -80067 -246839 57183 -68627 -51531 -260303 -117416 -132399 112364 -73268 320594
7920 -7407 20206 96988 -199073 -307454 221263 -29439 -37034 47838 42651 7085 49394 129379
7908 129379 -75795 -242612 81687 -204940 -63839 21318 4033 -263229 24007 76290 -9492
7896 124645 -78249 178819 -10698 -229659 209833 -115872 40024 161850 -195122 -192576 -18093
7884 -85137 -249738 -309195 1131 -481825 -258252 94243 -11191 -171294 33912 -306947 155247
7872 -217454 146170 202115 -242607 118438 91759 -135645 89765 -120713 -78543 339259
7861 -25875 -164460 -147651 85656 -89826 15139 96918 23460 460981 -64410 33546 -73666
7849 -177251 885 -34448 23256 15427 51584 292426 -9615 -36359 7525 204276 252949 40432
7836 -180042 -118398 -31515 5224 31855 -61375 -80024 52225 21277 -381121 -245990 -115643
7824 31548 346144 -245247 -143396 -97745 -161348 -110362 324666 -61077 -34492 -122823 -87803
7813 -87803 50667 -238300 88093 -76077 -272084 -233838 -124755 -46970 -154094 -97818 -231885
7802 -231885 -101787 -173830 -168463 -93465 -230092 -94769 180712 148652 68936 223555 -74074
7790 -85177 -21615 -21513 37967 -158932 326421 26966 13938 -27586 -39074 16216 -63348 -164709
7778 -164709 90291 40753 130938 -460151 -171997 -256236 -244700 -279593 -34933 87542 47798
7767 47798 -56439 -159507 19896 -90120 -83637 52290 36097 6965 -244483 -295222 -138117 -210708
7755 -210708 53854 -140929 -420958 118624 210190 -138179 9785 -36405 -123531 -228 -344400
7744 -344400 303406 -97142 -214478 185768 -48994 167759 183740 -309994 -228887 420875
7733 -152996 -66825 71549 -60791 -232301 -88169 32880 -247011 143258 64698 294946 -124836
7721 -84554 -41484 -98890 -109135 59434 -131497 -187604 -291152 212091 107418 -273916 -426500
7710 -426500 -20251 -97339 323073 19790 -47436 -217898 -43589 84691 -185886 -334877 -107235
7698 145677 94713 -315005 -4260 4454 141423 -134330 -7580 26786 -278577 80618 63062
7687 63062 -196000 -2088 66986 307820 -122777 -76205 -94471 -95157 -39091 -237068 191574
7675 -36904 94357 45718 -431178 -59886 -260339 20814 142880 -217283 40141 99275 157778
7664 157778 -260062 -165525 -11926 108753 168758 -249493 110666 -59281 22479 -26842 -105544
7653 -105544 141098 -42669 -24235 212041 23915 49024 -59057 -18480 -82714 147701 -167558
7641 -109742 252513 157328 -226088 294810 282893 59285 -50582 177716 251714 -15658 166565
7629 -23775 286874 49185 -51131 27785 -422551 -157006 -174027 232677 -105929 11287 -284327
7617 -58635 -135593 -149282 -22249 172159 37324 327804 -109470 17891 13493 -102375 -237408
7606 -237408 -203456 -18857 -201889 77257 -90425 -38634 -18556 62025 -74803 -120193 122340
7594 53852 174989 -132275 -78326 -27017 -44955 34833 -161430 264860 -118527 55196 386897
7583 386897 176609 78584 -179631 -173669 447 -513985 -39890 -118950 -63097 -571048 -322813
7572 -322813 -275202 194807 -102931 -247846 -254346 -305082 -53734 -89920 -92073 -101455 -176082 110878
7559 70087 -74595 -104303 -83004 68994 -74843 -8067 -106023 -283716 211259 88685 -57558 19041
7546 -134910 373009 146060 -37821 117747 144587 16998 -200794 -122515 73609 -355316 179200
7534 -193432 110733 33362 24064 -59980 -98119 2972 143674 25964 -211183 -264077 128687
7522 76928 -1418 44937 112769 75312 165545 1229 -192533 167491 -201879 48211 -366173
7510 -156251 130283 -295921 275280 440770 -189004 -61925 181217 -367556 31894 82809
7500 82809 187934 -168092 -446141 -195022 82050 -427031 -25448 131475 89632 -81894 243038
7488 -139076 -109153 -3653 11883 24554 -276148 -233387 -47902 -101745 -41806 -136770 165949
7476 -48827 -25168 5641 311697 35688 458104 -227188 -26301 163024 -65619 -186862 172884
7464 -34844 128953 -41162 -51934 3230 37363 -253548 -144412 82342 -213972 273655 96791
7452 -59121 116849 -56587 89599 -181593 -90936 44907 122355 93723 -4312 -111408 -191687
7441 -191687 145906 -241059 23351 -208605 -13092 347803 -123689 -170040 189128 118977
7431 118977 46147 -86752 -197674 137737 -14110 -310144 206612 -338573 -316824 159664
7420 -391284 151867 169619 14161 -164253 108395 -101971 -309272 -36393 162518 74797
7409 108518 73384 -76273 99994 -346670 -209087 -235389 -257621 30083 -119129 -270569 -410224
7398 -410224 -109531 8275 48832 62290 -72858 155787 -380327 -66942 93251 -82815 -168269
7387 -168269 282661 -81625 -83311 325230 225282 -69620 -6441 -147934 -15290 -138067 142288
7375 -58703 90134 -242568 -525518 47290 -48686 -22741 -205005 35880 159660 -153769 -61483
7363 97929 104115 282389 -313297 -78937 6541 -141504 -258208 83864 -149458 227053 253263
7352 253263 -58677 -121553 10835 23596 -314598 -100270 54596 60502 169324 120237 44862
7340 178639 -359336 -325466 -48579 96989 270655 172147 -121671 80551 262940 -37444 114429
7328 -366196 325894 -91494 -115402 28850 7626 -26322 -16848 89417 59224 -126848 -114954 100473
7315 133903 33566 -46662 -31725 45251 -245781 -216413 -398511 -7838 -27520 -35817 32241 34276
7303 34276 -305595 -260189 229309 305631 -30481 41186 60412 271036 -212958 -56557 -3462
7291 -117548 88828 -23447 190684 -66714 76830 74189 167704 -34892 -267459 -156410 -175637
7280 -175637 -103649 -40718 -14314 -41471 -261407 141856 157573 157906 -120626 -364313 -73888
7268 -238581 -86212 318574 -261385 148906 7856 -177691 -196012 238357 79538 1851 -24817
7256 370441 -5686 -333360 -196789 477615 48062 104367 3784 -29526 -157538 223182 158849
7245 158849 97708 -168048 -22718 71950 -72858 88898 131185 -75585 -132074 -38431 -79195
7234 -79195 225324 23062 -156307 51666 -318063 -85302 -11067 -79772 144949 -235525 -172762
7223 -172762 113437 105214 404949 -110653 69619 200786 122523 -153060 -654671 -153415
7212 215723 -191130 -23071 28418 -243175 331089 -100984 -337600 216082 20631 31945
7202 31945 -4039 111234 -109913 -90486 19273 2675 -62133 -187356 -42149 -5199 106056 -73849
7189 -194144 -93452 -65833 -354320 187594 -154137 -33070 34738 -116016 -302309 114176
7178 235551 261533 -163619 -33976 18937 202965 -162332 8451 -249721 -139890 -233991 180187
7166 -85757 -191143 -42921 312483 198940 292011 -27661 -236857 -11026 -134823 -361176 2094
7154 -48926 166272 -7678 153026 -32513 52219 69185 -90280 -13126 -58618 -96029 -60410 92356
7141 58845 22529 48328 -20777 86963 -260317 54779 -72570 -65322 397194 -43830 -241083
7130 -241083 -17757 -202803 -101195 -257295 -264136 -67716 10225 98124 -13172 20311 -130429
7118 52486 187797 82192 -325846 24485 41007 -246769 202854 -177659 234232 -59470 -354397
7107 -354397 -76907 4852 -72836 -133641 -140047 2769 -142779 183194 188046 350195 -6949 -106579
7095 -106579 302398 159097 -159585 297259 -197551 -10259 210244 15998 -17030 -250384
7085 -250384 -35215 -268236 77618 -274724 -220990 -65681 -115485 -153927 -69924 -119553 -32318
7073 -215583 -268157 -189256 265471 -48790 202202 -36123 -163856 -187085 -230902 -116673 184575
7061 150306 191160 180627 51101 258573 -169197 -163783 -56755 47769 -209095 -169765 312819
7049 177879 -67902 144768 -177917 -127779 68612 20516 -9785 -131151 -130233 -908 -32773 56980
7036 30636 168394 -81038 94196 -32955 90834 101853 -78697 8693 122690 -137848 -100006
7025 -100006 -255679 -66979 -149162 -53703 169337 -67261 -257904 139633 35720 -163278 66825
7013 -221920 -29022 -97357 111037 156434 206436 -371210 117336 -3599 187117 123850 152766
7002 152766 -113055 52756 -209195 -105345 -2951 114137 -113761 -62564 89947 -158251 16403
6990 54120 94225 -365422 -198418 -69818 150412 117555 -329936 -191404 -131137 209063 161900
6979 161900 -207038 -309847 -375208 46936 -37799 -23885 -206578 -14272 3447 -177580 10294
6967 61114 -3780 239375 -28281 249992 11699 -29293 -153641 -149256 -55208 -31911 106785
6955 -75585 -319177 -128425 110745 -85671 162559 -159139 100567 -61723 -272885 -220986
6945 -220986 -26483 -138340 272958 7339 -256263 -7480 -48790 63731 -83858 -63385 -289295
6934 -289295 -3702 -79242 -194164 -100993 -201162 -152642 -383306 -65041 -188799 -93636 168031
6922 -116139 -348458 235752 36598 -4888 502678 -138206 -178429 260839 -93664 74760 212562
6911 212562 -112560 -154960 -37441 -173382 85190 -119110 164991 -136353 -41639 203100
6900 14925 33178 -20686 131699 -266037 -78321 -146929 17690 219105 346337 -27775 -145990
6889 -145990 119517 -110761 173756 -176986 69512 -84923 124975 64473 51801 45011 64906
6878 64906 309797 -296573 -137365 55992 -488112 -80882 123726 35519 -134594 185844
6867 207732 311097 -82521 -95069 69113 -155854 -39958 271797 -166657 -167553 -53451 11799
6855 -5064 -35677 -197860 -55189 -66740 74775 232885 -152912 -163572 -184716 172488 -253369
6843 -75455 -7507 -8304 -14756 93593 -40440 98690 78954 40734 -225439 44093 -219611 -141407
6831 -141407 -98882 164808 -70462 26388 286001 -116670 206 228439 -227210 -276607 -338227
6820 -338227 -48740 32867 97876 178782 157951 -66993 -51105 -39919 -54767 52393 -28176 -278271
6808 -278271 -361147 -144391 72327 -25146 -313085 -86262 -81030 -193271 159368 151691 -45868
6796 -29885 -152146 -110425 49361 -64321 -6202 -167301 142699 217098 143683 -148729 -139776
6785 -139776 -139344 -163727 120972 -116242 -112231 181005 62200 -146354 -207308 196933 147411
6774 147411 -247621 337030 386116 -102368 150593 -494206 113113 -189746 -218149 -246454
6764 -246454 68506 -51702 -33406 335664 257598 60255 -209981 -243154 194752 -32468 -150737
6753 -150737 -200645 98257 9339 86489 -23179 56729 -149339 -16672 361619 -172451 -125039
6742 -125039 61452 320127 -233148 46573 85001 27964 -316923 23304 -70263 71500 -57669
6730 -119585 -2880 -5074 -182421 126771 190282 23706 -51627 -17811 74780 -12270 -292562
6719 -292562 48384 -161837 -247202 -120630 -41560 -121068 -202429 -238201 -142992 -128572 -141139
6708 -141139 -172994 272099 -86078 -94471 -39935 -201023 177548 35189 -176725 5560 -226309
6696 -30630 -122931 106972 -50767 -94555 -79264 149242 76154 319255 -125615 -317733 -31714
6684 -41023 -16440 283149 -131200 -251993 -225264 -53330 37405 -166788 101831 61551 56024
6673 56024 -7935 142761 8408 -86156 95560 -45865 78523 27052 46701 -128424 78129 34616
6660 321687 91470 -163253 258357 122940 104483 110556 -18044 69710 -172683 -23131 166782
6648 104846 122672 160687 43643 -370 94283 149265 5561 8079 73739 -428392 48959 -293920
6635 53055 114181 63227 51540 -86363 -283808 -258351 -55685 -18549 60829 14138 -35726 264785
6622 46966 16322 -85279 -151151 -386870 -66511 -313544 -13410 405247 34159 -52854 117181
6610 304418 -166281 30936 80385 168243 -46775 -172711 -166063 41432 77594 -126814 29766
6598 16661 -18658 55989 -87686 2830 -207249 101732 -5541 -176573 -127998 18642 30920 -9318
6585 258924 354579 -23219 79364 -89155 -53855 121108 -49828 -303023 9271 -143392 -113432
6574 -113432 -173586 103116 -102251 78404 -172709 109830 -210451 -10072 39555 -142968
6563 90837 79228 -31812 -380212 47572 -142711 -59787 -104866 263032 -374769 80346 -52972
6551 -208827 -91629 33967 -114887 -242105 -50515 32626 160523 -18612 -98087 -102468 -72548
6540 -72548 -22923 -294541 -121301 -378948 483280 196772 -110844 -113842 119993 149532 179467
6529 179467 153760 -18283 -279233 -69288 -325258 110853 -75798 -257635 208250 -143794
6518 115367 159670 44104 -233893 -174313 145446 -74758 80438 -67206 -407797 192896 -298736
6506 -66195 185897 44104 35468 32833 8817 33074 230053 -298917 -233534 -165060 -9872 -45848
6494 -45848 -103936 104510 -3242 34053 -133852 28934 -209209 -146351 34416 167327 -22480
6482 36058 65747 264306 -123494 -291321 -78384 211769 158557 -48275 -153379 45624 -173756
6470 -398172 220957 -14808 -89450 159650 -84116 -251895 -67885 37299 62695 -310326 305550
6458 27730 -119830 24343 -160322 -37771 70333 -235431 -105549 -75443 16698 -324420 178438
6446 113762 107922 -90552 149754 114350 95501 96939 287490 -166494 -81602 -6965 -40203 -144875
6434 -144875 497862 196685 70355 557561 -260316 198159 149680 -42603 370388 69878
6423 251916 51770 45858 75020 71745 284425 143697 136764 -16329 13214 43427 133601 247928
6411 247928 -253623 1631 58881 -154452 -64887 -79916 -20445 189223 -172656 -9735 -187081
6400 -187081 -33229 161774 149532 -80416 202008 -111195 -88153 77581 376540 -280569 73889
6388 35201 -47273 23675 24307 119585 -144881 -225259 44819 278220 -33630 -364387 45883 127163
6376 127163 -71133 -160361 -143559 268 160151 -313504 -58436 -224732 129992 -91638 325592
6364 104398 -178696 -11313 -332002 -49163 -358453 8176 10480 -155442 71031 1045 305675
6353 305675 -222451 -124492 198759 -138477 113602 -58816 363476 -98347 -23646 393281
6342 129132 14980 96802 -10505 34814 164036 24425 202044 227612 42450 129199 -115021
6330 120498 -7392 -148913 214795 5287 113939 -84460 -117417 102993 -301439 -159078 -275401
6319 -275401 26215 11577 164900 -207251 58509 -33974 -138670 -51241 269805 36347 -88666
6307 -36497 41857 -122255 -160473 97972 300493 78999 316217 57308 -178148 85021 -156001
6295 235220 282113 26292 -16617 146797 -182657 -461869 -457520 -206527 -52381 7919 54422
6284 54422 18433 100971 -154907 -29543 261918 -213554 -222080 -37795 -253809 344876 20471
6272 78642 -282364 -265416 -70362 145549 -81415 -91409 2235 44413 -273365 124939 328506
6261 328506 -95676 300834 227560 -176441 69769 -153042 -429892 -41874 -88329 -62962 -131330
6250 -131330 -57800 -160592 26185 17023 72293 -310764 195626 -142465 -138845 -294064 -107418
6238 -141752 -3060 -98100 -118805 86008 -26197 -269135 234231 152717 -42590 241199 -287435
6226 -41991 -219729 -368399 -36701 -41542 155607 163197 -205887 -36708 -23607 -17568 180009
6214 64730 -187074 -348302 82460 7817 106754 108392 -26061 -252970 58357 -140220 -271628
6203 -271628 -396385 -98383 -13595 -246051 65956 146707 -140234 31739 169630 -273867 252805
6191 -136017 193689 75322 272049 -25540 -10121 -5530 -11348 -366987 25848 -181010 -64579
6179 -225190 -305800 -29554 -42524 232192 48825 -64543 -289373 -183379 -9808 -1038 170485
6167 81499 -130626 -67480 182476 -258162 207291 187895 56192 -67160 43540 -102953 90296
6155 -66179 -10391 318773 26060 91165 -38995 8402 -144458 31429 -25971 -293378 -45193
6143 221562 64968 42168 544330 228173 378999 -12556 -169158 -430715 -88745 31202 31656
6132 31656 76054 -40983 177061 -67874 -83086 100483 60906 -179691 21363 -523669 40487
6120 -101555 36106 76408 256317 36983 -5688 24700 23490 -116633 -177827 89016 18297 17412
6108 17412 50684 10335 -43636 -38040 -321639 28666 104194 -144776 325447 -124315 223986
6096 207668 -14449 93476 322051 188863 -27448 387175 45342 55549 -113772 316191 127133
6084 233667 -198579 81590 140129 34883 -188172 509449 3784 82864 -65895 8297 -318769
6072 235297 75764 235825 93026 114394 265413 -350984 52766 -42530 -76016 85287 -2901
6060 -112253 29900 -129503 45391 -200330 155290 -20466 87613 62286 -150874 -181042 157548
6048 -41907 -26154 -46417 -135877 -157687 232109 -96693 -69655 159141 -51739 -154169 -80642
6037 -80642 170119 -26477 25775 176379 150271 -11267 -373028 -2663 467138 -403155 157883
6025 -141815 -31201 39763 38818 -249044 -109178 297738 -174567 60141 40575 143177 121127
6014 121127 51877 18757 -205377 12685 127206 7695 -71931 364728 -121677 26356 92611
6003 92611 -64986 56891 185634 31576 -221348 -98469 -206066 -283232 -136882 -65994 314946
5991 -136938 225717 7524 267656 364545 115156 137243 423619 -389096 61942 18452 26583
5980 26583 -15853 -13298 61354 159538 2857 -73518 -308672 99091 77396 142833 92737 -128925
5967 301445 -82641 -232889 -103777 -170060 -232798 180751 -228870 22645 84967 119232 -164045
5955 -137981 -10506 228386 -242964 23747 -30741 -77280 -24431 -7131 227901 57603 67309
5944 67309 -190430 52918 409973 -82132 -236676 87854 84504 160139 120085 165672 235938
5933 235938 -78549 -174045 -69518 92011 -211156 -2187 16087 -255915 244382 236328 -100558
5921 -164404 82146 -228131 99936 -115079 285992 -328641 -25643 -162449 -6015 -146684 19238
5909 -103951 -131664 257628 138939 -327536 164549 -239590 -117392 -25950 -367297 132445
5898 -352893 -337733 -81929 -381744 -76313 3948 114384 54053 -360490 -337121 21197 -309557
5886 32937 -328276 170460 -157086 -36510 356688 33141 -29940 -91849 231702 -162036 15888
5874 30342 6572 38171 67998 125771 -268467 -47284 53850 139808 173798 -122064 220955
5862 -33536 -337717 -5388 29276 -55040 259740 -50306 -142522 -77440 -30500 -106097 -208320
5851 -208320 392533 -242370 -197162 -27559 -31274 389792 -79894 38717 -113949 -43094 -366658
5840 -366658 193068 -3629 -19554 159916 -144101 -41596 121227 -146662 -295580 -25394 14296
5828 -13405 97785 -17855 -72485 128308 -18686 -68251 278603 41945 8029 44792 74132 -73468
5815 -150534 -79857 -601 224590 -12221 47647 -21250 229964 85807 107209 241950 -194989
5803 -13523 25576 -12485 -166884 158065 -148755 98562 221303 -18215 -125866 -27009 -73066
5792 -73066 10748 -81429 112278 -119288 -248600 -393647 2179 151747 -10815 41595 32588
5781 32588 157318 -99172 116747 202357 -171079 51975 -164701 -50301 250770 266591 142884
5770 142884 68508 222462 176879 311450 106311 -148531 321467 -492056 408459 60813
5759 171626 -143255 -165477 -38265 -95213 244035 -28605 -188938 -160182 -171074 -83902 -169824
5748 -169824 -223628 -15202 131945 176830 251291 19346 78720 -331726 -102341 -209578 -359469
5737 -359469 133031 -119947 -249782 -78138 -39288 115571 -72413 -165562 -40075 -84785 146831
5725 -188737 82591 -153334 98502 -37158 55211 -53895 -58733 416466 75612 -158367 388525
5713 81070 68029 -262239 -135588 183056 108130 -240850 -278561 -194744 217201 -115304 -90465
5702 -90465 -74526 92469 300360 28852 171554 -20416 122525 -214050 117807 157288 -216345
5690 -21054 107114 -23081 184964 43384 -93460 66131 65782 32575 228269 326680 -148758
5678 67380 283431 -319553 47022 -200141 -363686 197676 -65108 -29675 81736 -228390 16138
5666 272878 32228 118550 115904 -27854 -4880 241691 -183774 74817 24181 -266624 -383233
5655 -383233 -159793 -2619 -39082 -198745 245953 -143717 20485 291084 324067 174874 -217535
5643 70350 -147744 -26219 -80116 214234 111725 -23422 -157539 -319445 440212 20279 -115377
5631 -310432 -283434 -238592 144211 301160 24231 133201 118838 -132106 -86774 50885 -128059
5619 92206 7837 75730 -115081 62717 56519 251019 -255945 -152988 183210 -147325 -121826
5608 -121826 277101 125294 -84784 -22287 -97820 -23507 -195503 -242285 -74330 145122 -227481
5596 -20092 294768 -151265 -159417 -304362 -57787 -95720 394558 -91858 -10984 57258 196928
5585 196928 182398 331579 7827 -43720 -28246 -149747 68738 -255708 -97459 -350003 -235897
5574 -235897 -157386 132484 237472 66130 133520 -34844 94395 132211 -106637 205795 -125760
5562 125850 -69132 27185 36583 -33600 176895 -289434 -95333 -91050 -91851 95935 -87592 277881
5549 214608 -240666 -122171 -176406 -59821 175674 179231 393324 -287719 177846 248550 9831
5537 -231928 -159329 -47530 22874 -248820 32181 -130267 -211301 -486284 -234158 -340427 -223793
5526 -223793 -242329 -147628 161206 291260 -11819 249607 215457 72091 217031 42035 62983
5515 62983 179970 -10560 166768 -24942 36425 95507 -46718 9786 -358715 96859 -289108
5503 41639 -89005 -25879 142051 205905 -160847 -152945 -122021 25654 -532344 -191680 -5698
5491 -187786 -199713 168698 -233132 -50053 555772 146310 -17984 -198729 226660 104368
5480 180752 -154379 -101976 2141 162669 212301 325518 109931 282187 43015 -32090 281779
5468 -232383 103055 -220953 -333081 37600 61260 -60786 -46352 61206 -80160 174963 672432
5457 672432 120509 171346 -249361 88893 52994 25385 265778 179694 -181055 92218 -187789
5445 -22835 -127798 -22444 -6622 -56483 -244721 -217013 226575 23968 377641 -84847 -64041
5434 -64041 208418 218234 74526 365994 -187923 -217468 -152652 229845 -222779 -110182 6178
5422 48959 -89999 -48275 308042 71437 63177 122682 520363 139543 -359106 115534 -323981
5410 128182 -11396 42992 -223053 324637 -38559 4836 -113308 -29563 56856 -46846 148599
5398 93071 196004 -259918 75181 -39701 -108198 44685 -74826 138125 -26511 -53963 -366016
5387 -366016 -25148 -19368 81403 -21226 -83836 -80947 -307182 149465 91913 81570 -39455 398164
5374 -89732 274442 -269837 -415989 -107213 -133888 -136618 -27021 211460 35014 188784 -136588
5362 -232875 -148635 121123 53709 273076 -84652 199280 284763 -118151 325728 -500094
5351 -105645 160930 -16371 62217 -92125 -74780 -113785 219196 91243 -175906 66103 -14854
5339 138493 -363904 28500 -20669 -344265 -50328 -235809 165580 -151081 -111437 -65588 -10117
5327 168599 61535 -33564 63100 354333 384928 339434 165603 269389 72981 -73735 -125989
5316 -125989 -215709 -11135 -173953 65883 -54253 -357895 -82456 -69072 -428903 -168808 -170003
5305 -170003 112999 294724 -125626 -89218 -130954 103325 -157021 -58605 -188133 -94046
5294 154918 73353 -143141 -196402 -28148 259042 221007 -148517 25403 -69141 243007 -142969
5282 -42698 -35930 -416688 133349 246971 67513 -248595 -7097 170447 236786 129665 -20684
5270 -133765 79732 125505 169973 -99818 35523 -95936 -141530 -60604 -331545 157950 185252
5259 185252 41988 52325 89388 209654 -346816 154817 -29249 -43850 104016 65121 -167119
5247 -97872 169790 -180164 -1754 -25941 -167644 -179567 -92455 -366047 124313 -34340 -25818
5236 -25818 167795 -75348 37753 75098 201804 -41407 -322688 -58409 263714 -158452 354033
5224 74776 84221 145247 -257425 120041 139046 -186035 200787 138924 309528 183205 192982
5213 192982 364851 -130153 52969 -43043 -17552 236117 -195539 90107 -69419 118064 122153
5202 122153 -26927 -221253 -187846 -104263 15346 166108 27537 121240 -167320 82448 -59254
5190 -10130 -124635 -136951 -20394 -51605 106500 46998 -281439 -99829 25349 124765 -89926
5178 -157522 -62517 -95811 13005 63112 -360358 31879 -26397 44429 40907 98186 -271062
5166 -29081 49624 -13754 7492 -167883 20202 -88315 -60859 5487 169994 -24005 302324 235335
5154 235335 64044 -86279 -269699 -175960 -27858 -9305 -242932 -63205 -2436 63693 43811 -174765
5141 82812 -126563 111160 6861 284210 134921 -281273 -5121 -15937 38288 -450922 -177833
5129 26274 46740 69975 175058 217184 212001 -142731 134971 66132 389768 88170 33827
5117 172544 31578 81618 6960 -238069 90708 35943 -128499 163884 388034 -314596 78792
5105 33431 88178 268250 423860 201142 115583 142926 -253382 122061 -133677 -125833 387696
5093 2260 -106994 18740 -89610 175348 -135645 104200 -116403 149130 -260940 -186711 71226
5081 -280440 -238568 -201877 27686 -5424 -38937 -33824 -93110 67918 160286 -164730 52779 -411587
5068 -123235 -108491 20086 162595 -160949 -233739 -302773 224362 55609 114848 -287352 -72981
5056 383045 30048 63126 125876 118359 129020 -114806 -94915 -339826 5725 -131165 -19950
5044 36458 159047 -34529 -316937 227317 -129457 178901 77528 -85368 127670 -57401 -226640
5033 -226640 119784 -88468 32170 4359 77737 40550 -220341 309210 -181793 -72343 79342
5021 116626 6745 -45737 -58348 17409 117739 -384802 -219078 -114399 66902 -9083 -9206 -132842
5009 -132842 39 -113639 -178659 131990 -30248 77261 27829 -50717 -274683 -82618 -296057
4998 -296057 -10458 -41074 -79622 -94686 169028 -77733 -141484 -54554 -139564 -31652 -106472
4987 -106472 -265733 -51109 360377 74529 -99579 -106279 -49518 -133492 126802 152623 -160663
4975 282543 73649 -232280 -64693 260057 -61948 -111759 -67 18720 -62108 -210685 31002 85013
4963 85013 -30420 -435119 38401 -28656 24159 111461 13356 -81458 86691 -277034 -2693 62973
4950 -251198 227756 2599 -150907 -176709 -139499 299405 267281 310416 30639 -165341 -32623
4938 340965 20817 -209215 184144 25748 129806 82376 -85241 86089 -12449 -44277 133904
4926 14279 96146 35970 3226 -57107 -42112 -168796 439063 111903 -380260 -336807 -65551
4914 -136867 -137839 -75779 106412 -213134 5628 85018 10436 -350676 167688 52143 143862
4903 143862 5052 -365264 208838 -34769 5767 217362 86076 -42479 -42911 -81227 24616 239341
4891 239341 5875 50483 92881 254928 -105370 157823 -317670 266511 277208 365916 61955
4879 23220 115647 178748 110127 -105316 214769 -175319 237483 -123125 -212751 219928 200642
4868 200642 -158310 -68523 142773 -33782 -65515 -275365 -10191 -190565 -227767 33557 38428
4857 38428 -27756 -57140 57859 -174575 -294020 -229061 91605 -410715 -109782 17543 -4905
4845 -239139 -47111 -117672 141822 245263 -85381 263267 -174236 313721 -400663 -173126
4834 -109914 136457 169675 -93670 9604 -20822 -290070 -86440 -257507 -48701 167601 -254655
4822 -205436 95259 389839 -102882 -136693 23906 -58011 192007 -126074 60503 -34585 151982
4810 221074 130451 137350 424066 -180139 -267170 -261249 99028 -487324 347671 -66347 -184035
4799 -184035 271975 -217806 22710 215713 226615 -191847 176664 -338868 165275 231414
4789 231414 181517 62306 210423 -56087 286463 -125881 130165 306972 -292996 229488
4778 -66076 224507 -43547 -108030 -87482 -159771 -26874 -61451 304193 -85273 -139374 -31129
4766 178831 144311 371940 235474 144419 1676 134843 50931 -87699 -95181 -194824 69693
4754 -80293 59632 9637 -210775 -75300 -286557 157088 -16130 171349 -281600 -23940 17015
4742 -411271 -1594 247024 -36275 -119243 263320 52291 51472 309365 95345 88109 167077 93446
4730 93446 106 -80241 -170118 50944 82622 -86251 174996 -24226 -15961 -140944 -133399 7275
4717 163560 -183470 -338325 166659 -131487 17424 131021 -108610 -53296 -189657 -287825
4707 -287825 105829 193390 -82011 157673 -95881 -412750 135496 -67592 17195 -212261 344197
4695 206507 -68582 113266 -88668 96682 -84756 -114276 25773 194076 -107727 -176863 -95052
4684 -95052 416546 142733 296221 -134539 127446 -58834 132768 -24669 226717 -206075
4673 -165190 -152883 -205870 518644 -67711 233817 9083 -99174 -65248 19451 -150918 14701
4661 211680 106661 75952 32037 -106173 -170643 -12328 96664 -83400 -100393 -137444 9504
4649 77894 115204 79042 -412472 -14112 -37378 -35152 30170 -191181 177583 -241841 -227001
4638 -227001 -33448 146566 111767 42090 51445 -77080 68457 -161954 224729 -1429 13390
4626 -371321 224922 138002 123083 35341 237571 13322 136989 159718 188837 125036 -240697
4614 172842 54940 -42062 -143114 116776 -139217 9429 -27270 5217 -8283 -82226 8020 186990
4602 186990 -111507 -275037 -4081 108697 145136 26855 -270943 -28485 168621 6628 57444
4591 57444 -18937 -81506 247378 -39078 -230695 116706 -339623 -232721 261283 101873
4580 -233317 -53302 264183 371609 169387 -195771 72785 253840 10181 283191 -21341
4569 -94408 -48119 -22424 -2483 -112258 -131490 -6917 -11027 34959 -228772 2790 38548 -127523
4556 75585 -248028 13571 -75066 181714 114348 6540 -2571 -69592 -175846 -100284 128433
4544 174912 176895 -61450 -16395 -72124 58686 -72374 -166755 -272577 6352 -53489 79994 -200410
4531 59381 89017 -293593 160274 31435 262803 34223 278867 132792 -192259 194127
4520 -38689 -62937 67658 86971 261565 -55659 -142995 -102808 -23177 -154564 -6450 -194247
4509 -194247 -76683 -37265 -99673 119278 135642 -139387 31607 -166664 -223156 -226788 29973
4497 -101483 190771 -9644 -249283 -79523 405871 -56212 -112854 -98138 127728 248247 -116928
4485 -163963 -22999 72154 163997 -22151 -23329 143046 174329 80995 197289 -39041 -244495
4474 -244495 -187467 -75049 -373510 -20134 -30321 137273 71299 155870 -81422 109394 -43824
$$ [...]
##END NTUPLES=NMR SPECTRUM
##END=
