##TITLE=AC1433_HGAAH13242_8011294_Gt3Epax0yJ
##JCAMPDX= 6.0         $$ Bruker NMR JCAMP-DX V2.0
##DATA TYPE= NMR SPECTRUM
##DATA CLASS= NTUPLES
##ORIGIN= BRUKER
##OWNER= Administrator
$$ 1.72 TOPSPIN		Version 2.1
$$ 2013-07-05 15:20:41.649 -0700  Administrator@X
$$ Compression mode = diff/dup
##.OBSERVE FREQUENCY= 400.02188249412
##.OBSERVE NUCLEUS= ^1H
##.ACQUISITION MODE= SIMULTANEOUS (DQD)
##.ACQUISITION SCHEME= undefined
##.AVERAGES= 64
##.DIGITISER RES= 22
##SPECTROMETER/DATA SYSTEM= spect
##.PULSE SEQUENCE= noesygpps1d.comp
##.SOLVENT NAME= COFFEE_meoh
##.SHIFT REFERENCE= INTERNAL, COFFEE_meoh, 1, 14.9611
##AUDIT TRAIL= $$ (NUMBER, WHEN, WHO, WHERE, PROCESS, VERSION, WHAT)
$$ ##TITLE= Audit trail, TOPSPIN		Version 2.1
$$ ##JCAMPDX= 5.01
$$ ##ORIGIN= Bruker BioSpin GmbH
$$ ##OWNER= Administrator
$$ $$ E:\/data/COFFEE/nmr/AC1433_HGAAH13242_8011294_Gt3Epax0yJ/12/pdata/1/auditp.txt
$$ ##AUDIT TRAIL=  $$ (NUMBER, WHEN, WHO, WHERE, PROCESS, VERSION, WHAT)
(   1,<2013-07-05 15:20:36.352 -0700>,<Administrator>,<X>,<go>,<TOPSPIN 2.1>,
      <created by zg
	started at 2013-07-05 15:09:06.587 -0700,
	POWCHK enabled, PULCHK disabled,
       configuration hash MD5:
       C8 4E 4E 5D D3 5C D8 9E 9F 52 82 E0 59 8A DE 15
       data hash MD5: 64K
       CF 04 2D D1 FB E6 08 51 3B 10 C0 A7 10 1F BB FF>)
(   2,<2013-07-05 15:20:39.352 -0700>,<Administrator>,<X>,<proc1d>,<TOPSPIN 2.1>,
      <Start of raw data processing
       efp LB = 0.3 FT_mod = 6 PKNL = 1 PHC0 = 0 PHC1 = 0 SI = 128K 
       data hash MD5: 128K
       59 2F 11 CF 67 EF 40 49 C2 83 B7 53 A8 82 7E F1>)
(   3,<2013-07-05 15:20:40.415 -0700>,<Administrator>,<X>,<proc1d>,<TOPSPIN 2.1>,
      <pk PHC0 = -35.73853 PHC1 = 0 
       data hash MD5: 128K
       D9 FB C2 EE C1 F0 C0 EF BA 45 23 4C 18 59 7E A3>)
(   4,<2013-07-05 15:20:40.883 -0700>,<Administrator>,<X>,<proc1d>,<TOPSPIN 2.1>,
      <abs ABSG = 1 
       data hash MD5: 128K
       94 D6 A2 E4 DC 56 C1 F8 40 DF 76 E7 2C 84 3A D6>)
(   5,<2013-07-05 15:20:40.977 -0700>,<Administrator>,<X>,<proc1d>,<TOPSPIN 2.1>,
      <abs ABSG = 2 
       data hash MD5: 128K
       8D 5A 54 F9 00 4B AA 2D 42 27 D8 C7 F0 9F 71 F5>)
(   6,<2013-07-05 15:20:41.102 -0700>,<Administrator>,<X>,<proc1d>,<TOPSPIN 2.1>,
      <abs ABSG = 3 
       data hash MD5: 128K
       52 CC 89 3A E0 BC DE 86 62 FA C6 A1 EB 4C DE 76>)
(   7,<2013-07-05 15:20:41.243 -0700>,<Administrator>,<X>,<proc1d>,<TOPSPIN 2.1>,
      <abs ABSG = 4 
       data hash MD5: 128K
       B0 0D 21 CE 21 A4 8F 7B 34 A7 59 6B 24 C3 15 CE>)
(   8,<2013-07-05 15:20:41.383 -0700>,<Administrator>,<X>,<proc1d>,<TOPSPIN 2.1>,
      <abs ABSG = 5 
       data hash MD5: 128K
       61 84 0D 85 17 93 5F 3F FB 1A 50 72 99 F7 19 82>)
$$ ##END=
$$ 
$$ $$ hash MD5
$$ $$ 36 50 4A 40 88 4C 44 B3 25 B5 C5 9C FE C0 E0 7E
##$RELAX= 
##$RELAX= 
##$RELAX= 
##$RELAX= 
##$RELAX= 
##$RELAX= 
##$RELAX= 
##$RELAX= 
$$ Bruker specific parameters
$$ --------------------------
##$DU= <E:\>
##$EXPNO= 12
$$ [...]
##$TP07= 0
##$TPNAME0= <>
##$TPNAME1= <>
##$TPNAME2= <>
##$TPNAME3= <>
##$TPNAME4= <>
##$TPNAME5= <>
##$TPNAME6= <>
##$TPNAME7= <>
##$TPOAL= (0..7)
0.5 0.5 0.5 0.5 0.5 0.5 0.5 0.5
##$TPOFFS= (0..7)
0 0 0 0 0 0 0 0
##$TUNHIN= 0
##$TUNHOUT= 0
##$TUNXOUT= 0
##$USERA1= <user>
##$USERA2= <user>
##$USERA3= <user>
##$USERA4= <user>
##$USERA5= <user>
##$V9= 5
##$VALIST= <valist>
##$VCLIST= <CCCCCCCCCCCCCCC>
##$VD= 0
##$VDLIST= <DDDDDDDDDDDDDDD>
##$VPLIST= <PPPPPPPPPPPPPPP>
##$VTLIST= <TTTTTTTTTTTTTTT>
##$WBST= 1024
##$WBSW= 4
##$XGAIN= (0..3)
0 0 0 0
##$XL= 0
##$YL= 0
##$YMAX_a= 6951774
##$YMIN_a= -10589878
##$ZGOPTNS= <>
##$ZL1= 120
##$ZL2= 120
##$ZL3= 120
##$ZL4= 120
##$ABSF1= 14.9611
##$ABSF2= -5.597082
##$ABSG= 5
##$ABSL= 3
##$ALPHA= 0
##$AQORDER= 0
##$ASSFAC= 0
##$ASSFACI= 0
##$ASSFACX= 0
##$ASSWID= 0
##$AUNMP= <proc_prof1d_extract.lims>
##$AXLEFT= 0
##$AXNAME= <>
##$AXNUC= <1H>
##$AXRIGHT= 0
##$AXTYPE= 0
##$AXUNIT= <>
##$AZFE= 0.1
##$AZFW= 0.1
##$BCFW= 0
##$BC_mod= 0
##$BYTORDP= 0
##$COROFFS= 0
##$CY= 15
##$DATMOD= 1
##$DC= 0
##$DFILT= <>
##$DTYPP= 0
##$F1P= 0
##$F2P= 0
##$FCOR= 0.5
##$FTSIZE= 131072
##$FT_mod= 6
##$GAMMA= 0
##$GB= 0
##$INTBC= 1
##$INTSCL= 1
##$ISEN= 128
##$LB= 0.3
##$LEV0= 0
##$LPBIN= 0
##$MAXI= 10000
##$MC2= 0
##$MEAN= 0
##$ME_mod= 0
##$MI= 0
##$NCOEF= 0
##$NC_proc= -2
##$NLEV= 6
##$NOISF1= 0
##$NOISF2= 0
##$NSP= 0
##$NTH_PI= 0
##$NZP= 0
##$OFFSET= 14.9611
##$PC= 1
##$PHC0= -35.73853
##$PHC1= 0
##$PH_mod= 1
##$PKNL= yes
##$PPARMOD= 0
##$PPDIAG= 0
##$PPIPTYP= 0
##$PPMPNUM= 2147483647
##$PPRESOL= 1
##$PSCAL= 4
##$PSIGN= 0
##$PYNMP= <proc.py>
##$REVERSE= no
##$SF= 400.020009598011
##$SI= 131072
##$SIGF1= 0
##$SIGF2= 0
##$SINO= 400
##$SIOLD= 131072
##$SPECTYP= <>
##$SREGLST= <1H.CDCl3>
##$SSB= 0
##$STSI= 131072
##$STSR= 0
##$SW_p= 8223.68421052631
##$SYMM= 0
##$S_DEV= 0
##$TDeff= 65536
##$TDoff= 0
##$TI= <>
##$TILT= no
##$TM1= 0
##$TM2= 0
##$TOPLEV= 0
##$USERP1= <user>
##$USERP2= <user>
##$USERP3= <user>
##$USERP4= <user>
##$USERP5= <user>
##$WDW= 1
##$XDIM= 131072
##$YMAX_p= 354804977
##$YMIN_p= -96436692
##$CURPLOT= <Network HP LaserJet P1505>
##$CURPRIN= <$Network HP LaserJet P1505>
##$DFORMAT= <normdp>
##$LAYOUT= <+/1D_H.xwp>
##$LFORMAT= <normlp>
##$PFORMAT= <normpl>
##$SURQMSG= 1
$$ End of Bruker specific parameters
$$ ---------------------------------
##NTUPLES= NMR SPECTRUM
##VAR_NAME=  FREQUENCY,     SPECTRUM/REAL,   SPECTRUM/IMAG
##SYMBOL=    X,             R,               I
##VAR_TYPE=  INDEPENDENT,   DEPENDENT,       DEPENDENT
##VAR_FORM=  AFFN,          ASDF,            ASDF
##VAR_DIM=   131072,        131072,          131072
##UNITS=     HZ,            ARBITRARY UNITS, ARBITRARY UNITS
##FACTOR=    0.0627417313425164, 1,          1
##FIRST=     8223.62146879497, -433,         -47741
##LAST=      0,             443,             -48441
##MIN=       0,             -96436692,       0
##MAX=       8223.62146879497, 354804977,    0
$$ Real data points
##PAGE= N=1
##DATA TABLE= (X++(R..R)), XYDATA
$$ [...]
63944A999740J83216J96959K09886K20216K27068K30936K32526K31602K27183
63935C959332K18516K05311J87303J64217J36420J05094P1547L6643J073l4339
63925E051117o8859j02035j33292j61642j86223k06707k22741k33369k37753k36428
63915C262068k31187k23600k14162k02825j89808j75536j60373j44816j29641
63906A590120j15483j02400r0159p8783o8585n9877n2750m7027m2212l7740l3460
63895H61644k9712k6663k3939k1284j9284j8728j9248j9306j7880j5643j3983
63884F35974j3261j2623j1317r465p456n275k867o27J013K303L923O044Q170R945
63870F04481J1640J3575J5460J6730J7317J7672J8022J8030J7330J6105J4850
$$ y = [1999740, 2182956, 2379915, 2589801, 2810017, 3037085, 3268021, 3500547, 3732149, 3959332, 4177848, 4383159, 4570462, 4734679, 4871099, 4976193, 5047740, 5084383, 5085456, 5051117, 4982258, 4880223, 4746931, 4585289, 4399066, 4192359, 3969618, 3736249, 3498496, 3262068, 3030881, 2807281, 2593119, 2390294, 2200486, 2024950, 1864577, 1719761, 1590120, 1474637, 1372237, 1282078, 1203295, 1134710, 1074833, 1022083, 975056, 932844, 895104, 861644, 831932, 805269, 781330, 760046, 740762, 722034, 702786, 683480, 665600, 649957, 635974, 622713, 610090, 598773, 589308, 581852, 576577, 573710, 573083, 574096, 576399, 580322, 586366, 594536, 604481, 616121, 629696, 645156, 661886, 679203, 696875, 714897, 732927, 750257, 766362, 781212]
63859G81212J3698J2291J0397Q401O846N602L808Q56k800o128q668j0825j3009
63846H01681j4979j6325j7238j8311j9723k1066k2067k2958k3909k4530k4350
63835E76225k3646k3229k3393k3472k2670k0981j9022j7192j5434j3712j2218
63824C61256j1038j0010r117q694q929r348r229q381p231o163n178m168l265k673
63810B57832k374k181j993j855j794j736j605j416j211r41n88m50j016k286l378
63795B33008l303k164j151j197k046k837l111k889k314j715j641k153k471j936
63781B02080j061p96j021p18L69J231J074L49p6j61m63j241k168k677k280r55
63765A91486O03J469J480J257J222J170R48P75N65j73j360k025j644r65p90p16
$$ y = [781212, 794910, 807201, 817598, 825999, 832845, 838447, 842255, 843111, 840311, 834183, 825515, 814690, 801681, 786702, 770377, 753139, 734828, 715105, 694039, 671972, 649014, 625105, 600575, 576225, 552579, 529350, 505957, 482485, 459815, 438834, 419812, 402620, 387186, 373474, 361256, 350218, 340208, 331091, 322397, 313468, 304120, 294891, 286510, 279279, 273116, 267938, 263770, 260505, 257832, 255458, 253277, 251284, 249429, 247635, 245899, 244294, 242878, 241667, 240726, 240138, 239688, 238672, 236386, 233008, 229705, 227541, 226390, 225193, 223147, 220310, 217199, 214310, 211996, 210281, 208640, 206487, 204016, 202080, 201019, 200223, 199202, 198484, 198853, 200084, 201158, 201507, 201431, 201270, 200807, 199566, 197398, 194721, 192441, 191486, 192089, 193558, 195038, 196295, 197517, 198687, 199635, 200410, 200975, 200802, 199442, 197417, 195773, 194808, 194018, 193302]
63749A93302P4J357K269K656K933K934K095P16j0O01K055L448M189L972K843J462
63733B26896O66N89P73R74J291J572J538J433J780K444K727K447K189K351K752
63718B52422L262L900M221L506J943O70K83J40m02j007j171j183j573k178k491
63703B60342k416k092j425l72O63J250J387J140M04m83n39P41K509L525L584L287
63687B71505K917K328J711J478J489J166M39j12j33J47M54P88J033P86j12j222
63671B84662j848j641q37k5L88N40Q22J183J108L99n12j298k181l229l782l338
63655B70411k526k395k987l436l276k789k227j572j059j028j131n83O13J516J625
63640B49156J502J714J984K021K390L666N244N906N412M741M723N118N277N162
$$ y = [193302, 193376, 194733, 197002, 199658, 202591, 205525, 207620, 208336, 208326, 208927, 210982, 214430, 218619, 222591, 225434, 226896, 227562, 228151, 228924, 229898, 231189, 232761, 234299, 235732, 237512, 239956, 242683, 245130, 247319, 249670, 252422, 255684, 259584, 263805, 267311, 269254, 269924, 270207, 270347, 269945, 268938, 267767, 266584, 265011, 262833, 260342, 257926, 255834, 254409, 254037, 254700, 255950, 257337, 258477, 258881, 258398, 257859, 258600, 261109, 264634, 268218, 271505, 274422, 276750, 278461, 279939, 281428, 282594, 283033, 282921, 282788, 282935, 283389, 284177, 285210, 285996, 285884, 284662, 282814, 281173, 280336, 280311, 280699, 281239, 282061, 283244, 284352, 284751, 284239, 282941, 280760, 277531, 273749, 270411, 267885, 265490, 262503, 259067, 255791, 253002, 250775, 249203, 248144, 247116, 245985, 245402, 246015, 247531, 249156, 250658, 252372, 254356, 256377, 258767, 262433, 267677, 273583, 278995, 283736, 288459, 293577, 298854, 304016]
63626C04016N333O186P578R133J0608J1865J2742J3203J3565J4243J5255J6235
63614D39962J7063J8110J9655K1427K3011K4384K5611K6358K6231K5378K4139
63603F91329K2255J9141J4886J0290N852J434k890o457q793j0196j1089j1484
63591G14278j1503j1839j3040j4701j5974j6665j7261j8037j8686j8865j8596
63580E39111j8044j7227j6052j4517j2727j0828q880o843m798l038j675k67J659
63567D25874L660M630M314L958M846O701Q219Q885R416J0511J2014J3446J4651
63554E31125J5667J6511J7448J8954K1050K3072K4549K5913K7809K9868L0739
63543G82705K9341K5670K0371J4019P096K56n756j0417j3515j5032j5180j4409
$$ y = [304016, 309349, 315535, 323113, 332246, 342854, 354719, 367461, 380664, 394229, 408472, 423727, 439962, 457025, 475135, 494790, 516217, 539228, 563612, 589223, 615581, 641812, 667190, 691329, 713584, 732725, 747611, 757901, 763753, 765187, 762297, 755840, 747047, 736851, 725762, 714278, 702775, 690936, 677896, 663195, 647221, 630556, 613295, 595258, 576572, 557707, 539111, 521067, 503840, 487788, 473271, 460544, 449716, 440836, 433993, 429195, 426157, 424482, 424215, 425874, 429534, 434164, 438478, 442436, 447282, 453983, 462202, 471087, 480503, 491014, 503028, 516474, 531125, 546792, 563303, 580751, 599705, 620755, 643827, 668376, 694289, 722098, 751966, 782705, 812046, 837716, 858087, 872106, 879202, 879458, 873702, 863285, 849770, 834738, 819558, 805149]
63531H05149j3195j1880j0878j0790j2004j4275j7052k0139k3515k6549k8059
63520F16813k7557k5936k4502k3645k2880k1813k0456j8817j6838j4733j2891
63509C86745j1417j0214r422r165q953p964o145m325l122k334j672j421j843k509
63495C06239k787k675k561k439j914q87J79P60P67O19Q50J583K248K165J455R85
63479C04587J251J783J949J823J886K253K674K900K611J424n01k163k740k558
63465C17179k486k664k631k374k385k680k633j937r83j14P93J805K650L185L602
63450C08327L955M075M178M906O465Q215R461J0192J0766J1400J2280J3591J5122
63437D22933J6341J7257J8618K0816K3032K4068K3560K1853J9248J6068J3114
$$ y = [805149, 791954, 780074, 769196, 758406, 746402, 732127, 715075, 694936, 671421, 644872, 616813, 589256, 563320, 538818, 515173, 492293, 470480, 450024, 431207, 414369, 399636, 386745, 375328, 365114, 355692, 346527, 337574, 329610, 323465, 319140, 316018, 313684, 312012, 310591, 308748, 306239, 303452, 300777, 298216, 295777, 293863, 292976, 293155, 293915, 294682, 295301, 296151, 297734, 299982, 302147, 303602, 304587, 305838, 307621, 309570, 311393, 313279, 315532, 318206, 321106, 323717, 325141, 324640, 322477, 319737, 317179, 314693, 312029, 309398, 307024, 304639, 301959, 299326, 297389, 296406, 296292, 297085, 298890, 301540, 304725, 308327, 312282, 316357, 320535, 325441, 331906, 340121, 349582, 359774, 370540, 381940, 394220, 407811, 422933, 439274, 456531, 475149, 495965, 518997, 543065, 566625, 588478, 607726, 623794, 636908]
63426F36908J1136J0021R202Q838R752J2208J5448J8576K1377K3991K6388K8335
63414H32180K9520K9421K7448K3478J8074J2070O143P98l646p246j0346j3101
63402I44793j5303j6689j7194j6891j6112j5670j6566j9130k2649k6011k8494
63391G34084k9878l0217k9707k8484k6381k3255j9712j6969j5587j4731j3186
63380D85977j0773q176n718l190p46R25J747K774M922P654R568J0204J0604J1953
63366E17725J4184J6286J7657J8687J9988K1494K2693K3505K4519K6203K8215
63355G51156K9650K9874K8894K7091K4693K1558J7299J1783N601j49m749q295
63343I34406j1121j3110j4015j4196j4428j5070j5938j7047j8771k1025k3001
$$ y = [636908, 648044, 658065, 667267, 676105, 685857, 698065, 713513, 732089, 753466, 777457, 803845, 832180, 861700, 891121, 918569, 942047, 960121, 972191, 978334, 979132, 975486, 968240, 957894, 944793, 929490, 912801, 895607, 878716, 862604, 846934, 830368, 811238, 788589, 762578, 734084, 704206, 673989, 644282, 615798, 589417, 566162, 546450, 529481, 513894, 499163, 485977, 475204, 467028, 461310, 458120, 457374, 458299, 460046, 462820, 467742, 475396, 484964, 495168, 505772, 517725, 531909, 548195, 565852, 584539, 604527, 626021, 648714, 672219, 696738, 722941, 751156, 780806, 810680, 839574, 866665, 891358, 912916, 930215, 941998, 947599, 947450, 942701, 934406, 923285, 910175, 896160, 881964, 867536, 852466, 836528, 819481, 800710, 779685, 756684]
63332G56684k4114k4789k5690k6526k6259k4412k1642j8976j6825j4885j2663
63321E19903j0055p447n427m336m213n133p237j0212j3060j4795j5164j4512j3251
63308C95061j1821j0765j0219r523q047o189m945m484m005l100k340k215k319
63295C15089k106j785j764j802j433q81p82j225j790k324k921l256k795j724q88
63280B87613n73j73O25J116O02m56j051r22n71k47K55Q44J072R52J140J945K747
63263B94918K826K345K016K119K405K670K907L016K877K666K632K664K647L073
63249C31781M564O721Q303Q793Q925R277R370Q927R028J0760J3302J4825J5109
63236D59685J5735J7534J9366K0097K0351K1301K2753K3726K4255K5206K6490
$$ y = [756684, 732570, 707781, 682091, 655565, 629306, 604894, 583252, 564276, 547451, 532566, 519903, 509848, 502401, 496974, 492638, 488425, 483292, 476055, 465843, 452783, 437988, 422824, 408312, 395061, 383240, 372475, 362256, 352733, 344686, 338497, 333552, 329068, 325063, 321963, 319623, 317408, 315089, 312983, 311198, 309434, 307632, 306199, 305318, 304536, 303311, 301521, 299197, 296276, 293020, 290225, 288501, 287613, 287040, 286867, 287492, 288608, 289210, 288754, 287703, 286781, 286210, 285963, 286218, 287062, 288134, 289086, 290226, 292171, 294918, 297744, 300089, 302105, 304224, 306629, 309299, 312206, 315222, 318099, 320765, 323397, 326061, 328708, 331781, 336345, 343066, 351369, 360162, 369087, 378364, 387734, 396661, 405689, 416449, 429751, 444576, 459685, 475420, 492954, 512320, 532417, 552768, 574069, 596822, 620548, 644803, 670009, 696499]
63225F96499K6796K5431K3413K2306K2567K3396K3732K3044K1527J9877J8732
63214I47320J8124J7554J6636J5371J3705J1198P443K655k421p185j1672j6290
63202A012438k1139k5660k9003l0718l1031l0441k9214k7320k4683k1343j7607
63191G24279j4041j1071q521n748k467R12L918O626R249J1543J3115J4101J5045
63178G56940J6244J7624J9021K0126K0354J9437J8001J6946J6319J5435J4055
63167I50502J2597J1102Q942N905K777J92k436o096j0691j5095j8566k1417k4229
63154H93487k7003k9285l0768l1444l1281l0069k7841k5270k3290k2056k0663
63143E94517j8288j5364j3031j1614j0368q850p546o853o259n192l981l198k538
$$ y = [696499, 723295, 748726, 772139, 794445, 817012, 840408, 864140, 887184, 908711, 928588, 947320, 965444, 982998, 999634, 1015005, 1028710, 1039908, 1047351, 1050006, 1047585, 1040400, 1028728, 1012438, 991299, 965639, 936636, 905918, 874887, 844446, 815232, 787912, 763229, 741886, 724279, 710238, 699167, 690646, 684898, 682431, 683343, 687261, 693887, 703136, 714679, 727794, 741895, 756940, 773184, 790808, 809829, 829955, 850309, 869746, 887747, 904693, 921012, 936447, 950502, 963099, 974201, 983143, 989048, 991825, 992017, 989581, 983485, 972794, 957699, 939133, 917716, 893487, 866484, 837199, 806431, 774987, 743706, 713637, 685796, 660526, 637236, 615180, 594517, 576229, 560865, 547834, 536220, 525852, 517002, 509456, 502603, 496344, 491152, 487171, 483973, 481435]
63130D81435j321K64J280J378J175J274J645K152K915L854M523M744M906N262
63116E15486N391M803L736K844K400K246K332K687K961K601J668R66J089J671
63102E52881J909J540R04K69m25j094j349j027n88o51j240j800j820j231l21M29
63086E46386N62J31p0Q13K597M008M002K903K043K399L795N286O114O329O631
63071E93929P599R084J0467J1368J1932J2442J3027J3834J5111J6879J8840K0765
63059G55277K2751K4913K7145K9468L2216L5569L9157M2499M5586M8619N1470
63048A154670N3872N5908N7776N9221N9827N9767N9638N9467N8586N6694N4460
63037A789886N2658N1264M9786M8087M6357M4518M2221L9285L5706L1269K5615
$$ y = [481435, 480114, 480378, 481658, 483036, 484211, 485485, 487130, 489282, 492197, 496051, 500574, 505318, 510224, 515486, 520877, 525680, 529416, 532260, 534660, 536906, 539238, 541925, 544886, 547487, 549155, 550121, 551210, 552881, 554790, 556330, 557234, 557503, 557078, 555984, 554635, 553608, 553020, 552369, 551129, 549329, 547509, 546278, 545957, 546386, 546948, 547079, 547009, 547822, 550419, 554427, 558429, 561332, 563375, 565774, 569569, 574855, 580969, 587298, 593929, 601528, 610612, 621079, 632447, 644379, 656821, 669848, 683682, 698793, 715672, 734512, 755277, 778028, 802941, 830086, 859554, 891770, 927339, 966496, 1008995, 1054581, 1103200, 1154670, 1208542, 1264450, 1322226, 1381447, 1441274, 1501041, 1560679, 1620146, 1678732, 1735426, 1789886, 1842544, 1893808, 1943594, 1991681, 2038038, 2082556, 2124777, 2164062, 2199768, 2231037, 2256652]
63026B256652J8633J0370O84j0431k2078l2704m1549m9322n6905o3809o8582p0563
63014A870396p0407o8814o5619o0567n4193m7397m0541l3645k7025k0947j4909
63003A366332q171r68N597J0948J5560J9866K3493K5996K7668K9053L0209L0931
62991A576514L1291L1375L0896K9671K8174K7002K5895K3882K0334J5503J0090
62980A850627M631q67o911j3957k1632k8914l5382m1739m8483n4658n8713o0332
62968A483670o0496n9959n8584n6171n3047m9639m6175m2935m0129l7427l4346
62957I44762l1188k8804k7292k5777k3774k1909k0859k0362j9777j9007j8295
62946F87718j7625j6854j6058j5259j4252j3099j2266j1860j1197r713p801o308
$$ y = [2256652, 2275285, 2285655, 2286339, 2275908, 2253830, 2221126, 2179577, 2130255, 2073350, 2009541, 1940959, 1870396, 1799989, 1731175, 1665556, 1604989, 1550796, 1503399, 1462858, 1429213, 1402188, 1381241, 1366332, 1358161, 1357193, 1362790, 1373738, 1389298, 1409164, 1432657, 1458653, 1486321, 1515374, 1545583, 1576514, 1607805, 1639180, 1670076, 1699747, 1727921, 1754923, 1780818, 1804700, 1825034, 1840537, 1850627, 1855258, 1854391, 1847480, 1833523, 1811891, 1782977, 1747595, 1705856, 1657373, 1602715, 1544002, 1483670, 1423174, 1363215, 1304631, 1248460, 1195413, 1145774, 1099599, 1056664, 1016535, 979108, 944762, 913574, 884770, 857478, 831701, 807927, 786018, 765159, 744797, 725020, 706013, 687718, 670093, 653239, 637181, 621922, 607670, 594571, 582305, 570445, 559248, 549535, 541734, 535426]
62934E35426n531n218n103m908m308l423k898k934k758j785p40o62j296j480r56
62919D91426o18j001j655k180k787l489l734l350l062l408l841l528k558j723
62905D54492j442j498j594j666j729j833k049k284k232j799j278q96m20L66J093
62890D35231J207P20J51k33n72r20j044q54n31j49M34J085J253P06R1K46J056
62873D37877J470P68n71j528j730j641j748k011k169k164k055j754j158l99K82
62858D21469Q01J141J184R50Q55J284J939K107J675J340J520J622R11k75q67m67
62842D37189K13M41K21j90q86j884k598k430j707j373j696j899j281j74N31N12
62826D22989K44L18R09J782K505K732K532K388K660L153L479L705M239N102N779
$$ y = [535426, 529895, 524677, 519574, 514666, 510358, 506935, 504037, 501103, 498345, 496560, 495820, 495158, 493862, 492382, 491426, 490808, 489807, 488152, 485972, 483185, 479696, 475962, 472612, 469550, 466142, 462301, 458773, 456215, 454492, 453050, 451552, 449958, 448292, 446563, 444730, 442681, 440397, 438165, 436366, 435088, 434192, 433772, 434138, 435231, 436438, 437158, 437309, 437076, 436504, 435584, 434540, 433686, 433155, 433006, 433440, 434525, 435778, 436484, 436575, 436821, 437877, 439347, 440115, 439544, 438016, 436286, 434645, 432897, 430886, 428717, 426553, 424498, 422744, 421586, 421187, 421469, 422270, 423411, 424595, 425545, 426400, 427684, 429623, 431730, 433405, 434745, 436265, 437887, 438798, 438523, 437656, 437189, 437402, 437843, 438064, 437874, 436988, 435104, 432506, 430076, 428369, 426996, 425300, 423401, 422120, 421946, 422477, 422989, 423233, 423551, 424460, 426242, 428747, 431479, 434011, 436399, 439059, 442212, 445691, 449396, 453635, 458737, 464516]
62811D64516N882N582N253N055N036N315N823O201O226O211O706P876R339J0538
62797E55559J1168J1403J1865J3098J5027J7098J9049K1172K3695K6388K9177
62786G54699L2635L7273M2622M7615N1814N5628N9460O3287O7172P1483P6282
62775A359970Q0861Q4263Q5957Q5884Q4163Q0987P6505P0555O2676N2563M0393
62764B164777K6624J1790l445j8343l2366m5245n6683o6316p4093q0271q4840
62753A741589q7339q7548q6061q3748q0856p7075p2351o7173o2090n7267n2605
62742I27476m7966m3323l8816l4771l1384k8472k5683k2930k0356j7925j5413
62731F00437j2885j0842r608q850p920o614n205l869k419p88N95J262J368J579
$$ y = [464516, 470398, 475980, 481233, 486288, 491324, 496639, 502462, 508663, 514889, 521100, 527806, 535682, 545021, 555559, 566727, 578130, 589995, 603093, 618120, 635218, 654267, 675439, 699134, 725522, 754699, 787334, 824607, 867229, 914844, 966658, 1022286, 1081746, 1145033, 1212205, 1283688, 1359970, 1440831, 1525094, 1611051, 1696935, 1781098, 1862085, 1938590, 2009145, 2071821, 2124384, 2164777, 2191401, 2203191, 2199746, 2181403, 2149037, 2103792, 2047109, 1980793, 1906700, 1826429, 1741589, 1654250, 1566702, 1480641, 1396893, 1316037, 1238962, 1166611, 1099438, 1037348, 980081, 927476, 879510, 836187, 797371, 762600, 731216, 702744, 677061, 654131, 633775, 615850, 600437, 587552, 576710, 567102, 558252, 550332, 543718, 538513, 534644, 532225, 531437, 532032, 533294, 534662, 536241]
62717E36241K303L461M971O960R279J1378J3047J4884J7553K0794K3810K6365
62705F91046K8816L1302L3665L6180L9439M3287M6769M9514N2340N5923N9633
62694A167914O2427O4188O5392O5905O5057O2607N8732N3327M6175L7618K8142
62683A777484J7445M994q496k1229l2266m2177n1469n9386o4964o8378p0418p1258
62671A309882p0649o8802o6247o3040n8968n4336m9843m5730m1714l7729l4113
62660G18711l0997k8165k5552k3346k1432j9333j6936j4860j3729j3364j2993
62649D98004j2078j0706r250p961o893o061n514n178m773m061l258k886l055l161
62635D13169k582j499o79n94j068j729k362k766k717k159j265k49O68J167J063
$$ y = [536241, 538544, 542005, 546976, 553936, 563215, 574593, 587640, 602524, 620077, 640871, 664681, 691046, 719862, 751164, 784829, 821009, 860448, 903735, 950504, 1000018, 1052358, 1108281, 1167914, 1230341, 1294529, 1359921, 1425826, 1490883, 1553490, 1612222, 1665549, 1711724, 1749342, 1777484, 1794929, 1799923, 1791427, 1770198, 1737932, 1695755, 1644286, 1584900, 1519936, 1451558, 1381140, 1309882, 1239233, 1170431, 1104184, 1041144, 982176, 927840, 877997, 832267, 790553, 752824, 718711, 687714, 659549, 633997, 610651, 589219, 569886, 552950, 538090, 524361, 510997, 498004, 485926, 475220, 465970, 458009, 451116, 445055, 439541, 434363, 429590, 425529, 422271, 419385, 416330, 413169, 410587, 409088, 408409, 407815, 406747, 405018, 402656, 399890, 397173, 395014, 393749, 393500, 394168, 395335, 396398]
62620C96398O82O61J276K283L324M225M752M692M342M512N664P259Q369Q710Q832
62605D65981R348J0343J1579J3021J4957J7558K0403K2740K4352K5933K8247L1120
62593F95582L3679L5555L7266L9288M1242M2245M1728L9678L6498L2718K8470
62582A103949K3100J5875P299r96p957j4088k0198k5982l0662l4342l7625m0231
62570I38142m1190m0449l9120l7922l6408l4149l1669k9615k7666k5084k1929
62559E72941j9018j6846j5209j3742j2304j0834r301p906o993o561o085n020l458
62546D39664k095j531j705k083k272k199j789r27O7M93J17l43j42M99Q61R45J433
62529D28993K578L916N131O387P698Q776R733J1155J3123J4973J6445J8278K1106
$$ y = [396398, 397080, 397741, 399017, 401300, 404624, 408849, 413601, 418293, 422635, 427147, 432811, 440070, 448439, 457149, 465981, 475329, 485672, 497251, 510272, 525229, 542787, 563190, 585930, 610282, 636215, 664462, 695582, 729261, 764816, 802082, 841370, 882612, 924857, 966585, 1006263, 1042761, 1075479, 1103949, 1127049, 1142924, 1150223, 1149227, 1141270, 1127182, 1106984, 1081002, 1050340, 1015998, 978373, 938142, 896952, 856503, 817383, 779461, 743053, 708904, 677235, 647620, 619954, 594870, 572941, 553923, 537077, 521868, 508126, 495822, 484988, 475687, 467781, 460788, 454227, 448142, 443122, 439664, 437569, 436038, 434333, 432250, 429978, 427779, 425990, 425063, 425130, 425623, 425740, 425397, 425255, 425754, 426615, 427560, 428993, 431571, 435487, 440618, 447005, 454703, 463479, 473212, 484367, 497490, 512463, 528908, 547186, 568292]
62516E68292K4467K7586L0460L3346L5799L7160L7720L8447L9654M0727M1047
62505I54705M0416L8638L5485L1222K6524K1709J6529J0825M940n16m947p868
62493A167662r238r620r518q618o233k382K088O432J0416J3887J6711J9198K1861
62480A212646K4542K6418K6966K6175K3712J8802J1477L167m559j1402j8050k5026
62468A314868l2313l9546m5947n0517n2933n3911n4209n3612n1634m8646m5500
62457G86100m2231l8162l3329k8855k5575k3060k0392j7309j4137j1045q006n277
62445E18722l340k302j689r30J55J442K768L958M681M591L746K731K155K001J639
62430E40328M90j418l593n521o904p715q259q969r929j0581j0259q982p530o639
$$ y = [568292, 592759, 620345, 650805, 684151, 719950, 757110, 794830, 833277, 872931, 913658, 954705, 995121, 1033759, 1069244, 1100466, 1126990, 1148699, 1165228, 1176053, 1180993, 1180477, 1175530, 1167662, 1158424, 1148804, 1139286, 1130668, 1124435, 1122053, 1124141, 1130573, 1140989, 1154876, 1171587, 1190785, 1212646, 1237188, 1263606, 1290572, 1316747, 1340459, 1359261, 1370738, 1373905, 1369346, 1357944, 1339894, 1314868, 1282555, 1243009, 1197062, 1146545, 1093612, 1039701, 985492, 931880, 880246, 831600, 786100, 743869, 705707, 672378, 643523, 617948, 594888, 574496, 557187, 543050, 532005, 523999, 518722, 515382, 513080, 511391, 510461, 510616, 512058, 514826, 518784, 523465, 528056, 531802, 534533, 536688, 538689, 540328, 540818, 539400, 535807, 530286, 523382, 515667, 507408, 498439, 488510, 477929, 467670, 458688, 451158, 444519]
62416D44519o297n954n298m590m230m202m148l842l375k857k296j866j913k362
62402C91289k465j645l77K90J13q8L58J098J414J257J170J474K002K475K788K948
62386D04101L059L259L534L715L818M161M942N883O574O991P364P722P911Q049
62372D81083Q542R593J0907J2032J2902J3953J5644J7854J9895K1303K2537K4547
62360F70792K7605L0994L3929L6350L8585M0734M2764M4729M6325M6568M4583
62349A103958M0631L5833L0833K5268J8566J0877L027m125j0177j5256j9744k3827
62337A195864k7350l0143l2291l3892l4818l4924l4324l3162l1332k8713k5554
62326H49361k2341j9492j7396j6353j6167j6098j5767j5695j6431j7525j8003
$$ y = [444519, 438222, 432268, 426970, 422380, 418150, 413948, 409800, 405958, 402583, 399726, 397430, 395564, 393651, 391289, 388824, 387179, 386802, 387092, 387205, 387117, 387475, 388573, 389987, 391244, 392414, 393888, 395890, 398365, 401153, 404101, 407160, 410419, 413953, 417668, 421486, 425647, 430589, 436472, 443046, 450037, 457401, 465123, 473034, 481083, 489625, 499218, 510125, 522157, 535059, 549012, 564656, 582510, 602405, 623708, 646245, 670792, 698397, 729391, 763320, 799670, 838255, 878989, 921753, 966482, 1012807, 1059375, 1103958, 1144589, 1180422, 1211255, 1236523, 1255089, 1265966, 1268993, 1264868, 1254691, 1239435, 1219691, 1195864, 1168514, 1138371, 1106080, 1072188, 1037370, 1002446, 968122, 934960, 903628, 874915, 849361, 827020, 807528, 790132, 773779, 757612, 741514, 725747, 710052, 693621, 676096, 658093]
62315F58093j7683j7220j7046j7026j7013j6852j5916j3644j0693q664q272q558
62303D89506q261p162n776m440l310k534j943j071O3P89Q34Q74J505K290K642
62288D64006K933L823M934N235M631M184M690N825O843P431P736Q091Q897J0322
62274E49581J1932J3001J3357J3460J3676J3905J4095J4629J5921J7886K0047
62263G11490K1984K3529K4693K5662K6751K8250L0337L3042L6158L9214M1691
62252A042801M3231M3602M2654M0478L7396L3431K8011K0663J1977L392m078j0553
62240A333005j6670k2649k8263l3376l8121m2475m5928m7777m7891m7030m6149
62229I16676m5298m3640m0591l6619l2554k8666k4934k1828j9893j8692j7023
$$ y = [658093, 640410, 623190, 606144, 589118, 572105, 555253, 539337, 525693, 515000, 506336, 498064, 489506, 481245, 474083, 468307, 463867, 460557, 458023, 456080, 455009, 455072, 455861, 456695, 457569, 459074, 461364, 464006, 466939, 470762, 475696, 480931, 485562, 489746, 494436, 500261, 507104, 514535, 522271, 530362, 539259, 549581, 561513, 574514, 587871, 601331, 615007, 628912, 643007, 657636, 673557, 691443, 711490, 733474, 757003, 781696, 807358, 834109, 862359, 892696, 925738, 961896, 1001110, 1042801, 1086032, 1129634, 1172288, 1212766, 1250162, 1283593, 1311604, 1332267, 1344244, 1347636, 1343558, 1333005, 1316335, 1293686, 1265423, 1232047, 1193926, 1151451, 1105523, 1057746, 1009855, 962825, 916676, 871378, 827738, 787147, 750528, 717974, 689308, 664374, 642546, 622653, 603961, 586938]
62218E86938j4390j1547r384p882o608n552m952m698m452m099l627k865j714n25
62204E04643K04M07L93M30O52J199K043K807L165L324L737M437N019N313N621
62189E43394O277P230Q180Q828R013Q887Q919R424J0063J0215R898R880J0638
62176F60846J1592J1734J0842R750R469J0273J1697J3235J4925J7250K0451K4040
62164H26104K7271K9957L2502L4981L6586L6306L3928L0028K5181J9654J3731
62153A146229P930K612k260o890j1320j5378j8777k1278k2997k4517k6329k8100
62141I78925k8845k7986k5879k3176k0242j7410j5219j3704j1943r130n992m174
62129G75225m159m608m196l196k695k874k965k539j935j388n62Q11K407L776M867
$$ y = [586938, 572548, 561001, 551617, 543735, 537127, 531575, 526623, 521925, 517473, 513374, 509747, 506882, 505168, 504643, 504847, 505254, 505647, 506077, 506729, 507928, 509971, 512778, 515943, 519267, 523004, 527441, 532460, 537773, 543394, 549671, 556901, 565081, 573909, 582922, 591809, 600728, 610152, 620215, 630430, 640328, 650208, 660846, 672438, 684172, 695014, 704764, 714233, 724506, 736203, 749438, 764363, 781613, 802064, 826104, 853375, 883332, 915834, 950815, 987401, 1023707, 1057635, 1087663, 1112844, 1132498, 1146229, 1154159, 1156771, 1154511, 1147621, 1136301, 1120923, 1102146, 1080868, 1057871, 1033354, 1007025, 978925, 950080, 922094, 896215, 873039, 852797, 835387, 820168, 806464, 794521, 785391, 779399, 775225, 771066, 766458, 762262, 759066, 756371, 753497, 750532, 747993, 746058, 744670, 744108, 744919, 747326, 751102, 755969]
62114G55969N690N829M669K099j275m524o871p903p679o649n369m314l919m652
62100G21101o597r037j0690j0696r328p605o181m745k548N00L478N271N617N269
62086F73809N118N398N787O088O538P410Q541R465J0006J0584J1728J3427J5094
62073G88993J6239J6984J7787J8824J9843K0596K1105K1521K1884K2248K2780
62062A008804K3560K4274K4374K3584K2049J9941J7068J3123Q220K922k266p189
62050A178464j1763j5724j8943k1816k4918k8246l1142l3079l4225l5058l5692
62039H87858l5894l5529l4669l3403l1812l0065k8208k5952k3089k0097j7870
62028E71270j6666j5697j4103j2023j0335r538r276q947q316p457o468n528m964
$$ y = [755969, 761659, 767488, 772157, 774256, 772981, 768457, 761586, 753683, 746004, 739355, 733986, 729672, 725753, 721101, 714504, 705467, 694777, 684081, 674753, 667148, 660967, 656222, 653674, 654174, 657652, 662923, 668540, 673809, 678927, 684325, 690112, 696200, 702738, 710148, 718689, 728154, 738160, 748744, 760472, 773899, 788993, 805232, 822216, 840003, 858827, 878670, 899266, 920371, 941892, 963776, 986024, 1008804, 1032364, 1056638, 1081012, 1104596, 1126645, 1146586, 1163654, 1176777, 1184997, 1187919, 1185653, 1178464, 1166701, 1150977, 1132034, 1110218, 1085300, 1057054, 1025912, 992833, 958608, 923550, 887858, 851964, 816435, 781766, 748363, 716551, 686486, 658278, 632326, 609237, 589140, 571270, 554604, 538907, 524804, 512781, 502446, 492908, 483632, 474685, 466369, 458912, 452444, 446916, 441952]
62015D41952m901m893m320l176k173j882k043j914j180j92N85J081J499K012K660
62000D23115L367L936M158M012L599K871J678K24q70j210j123j210j662k266k945
61985D35674l802m710n335n617n881o283o520o283n721n244n016m824m387l586
61971C62465k529j473o51j58n4m84j411k287k347j444l06K35R9j85k49j49L6M44
61953C49552J141J803K020J852J928K818M278N388N501N015M926N754P118Q364
61939D07458R248R886J0343J0586J0690J0807J0989J1184J1352J1425J1200J0478
61927E35646R273P843O454N181L971K810J844J229Q40K70p28j938k958l628l846
61912E62263l199j331J283L548M913N871O992Q047Q443Q094P274O006M210K271
$$ y = [441952, 437051, 432158, 427838, 424662, 422489, 420607, 418564, 416650, 415470, 415278, 415863, 416944, 418443, 420455, 423115, 426482, 430418, 434576, 438588, 442187, 445058, 446736, 446960, 446090, 444880, 443757, 442547, 440885, 438619, 435674, 431872, 427162, 421827, 416210, 410329, 404046, 397526, 391243, 385522, 380278, 375262, 370438, 366051, 362465, 359936, 358463, 357812, 357654, 357600, 357116, 355705, 353418, 351071, 349627, 349321, 349556, 349655, 349470, 349221, 349072, 349108, 349552, 350693, 352496, 354516, 356368, 358296, 361114, 365392, 370780, 376281, 381296, 386222, 391976, 399094, 407458, 416706, 426592, 436935, 447521, 458211, 469018, 480007, 491191, 502543, 513968, 525168, 535646, 544919, 552762, 559216, 564397, 568368, 571178, 573022, 574251, 575091, 575361, 574633, 572695, 569737, 566109, 562263, 559064, 557733, 559016, 562564, 567477, 573348, 580340, 588387, 596830, 604924, 612198, 618204, 622414, 624685]
61898F24685P32m68j857l553n045n989o642p390q242q952r324r265q857q419q197
61883E33217p987p466o871o808p262p455o964o410o532p066p093o291n188m303
61869D39521l606k854j960q75N41K202L613M227M022L606L778M945O853Q808J0232
61854D83053J1070J1781J2831J4258J5714J6877J7761J8471J8856J8663J8037
61843F57372J7433J6850J5591J3166J0078P242M884K618L58j640l538n747p763
61830G26904q233o716m522l064k071l43K208M437N598O061O244N848M519K584
61816G39454N77j516m138p502j1255j4642j6919j7912j8201j8486j8707j8176
61804E92577j6587j4542j2845j1707j0803r856q945q349q168p980p072n326l673
$$ y = [624685, 625417, 624949, 623092, 619539, 614494, 608505, 601863, 594473, 586231, 577279, 567955, 558690, 549833, 541414, 533217, 525230, 517764, 510893, 504085, 496823, 489368, 482404, 475994, 469462, 462396, 455303, 449012, 443824, 439521, 435915, 433061, 431101, 430226, 430767, 432969, 436582, 440809, 444831, 448437, 452215, 457160, 464013, 472821, 483053, 494123, 505904, 518735, 532993, 548707, 565584, 583345, 601816, 620672, 639335, 657372, 674805, 691655, 707246, 720412, 730490, 737732, 742616, 745234, 745592, 743952, 740414, 734667, 726904, 718671, 711955, 707433, 704369, 702298, 701955, 704163, 708600, 714198, 720259, 726503, 732351, 736870, 739454, 740031, 738515, 734377, 726875, 715620, 700978, 684059, 666147, 647946, 629460, 610753, 592577, 575990, 561448, 548603, 536896, 526093, 516237, 507292, 498943, 490775, 482795, 475723, 470397, 466724]
61791D66724l153l596l887l477k888k603k327j770j285j239j324j180j080j359
61777D35556j661j480j050r26j014q66n89n88o34j92M87N88J92L45J424K467K613
61760D34672K307K402K828K947K671K378K073J486P81M53N29N35K01l93j331k781
61744D51758m270m746l822k472j960k327k505j804p63l39o68j021p90j80J79O
61728D24276l82m64kP30J161R23L27R9N71J289J653J672J804K272K852L259L254
61711D45294K528J023o32j559j664j737k334l070l266k897k528k658l368m331
61697D18801m903m553l479k474k018j846j698j889k706l677m046l762l404l309
61683C75037l252k918k269j546j157j370j835j774j002l21m40r91j248j313j728
$$ y = [466724, 463571, 459975, 456088, 452611, 449723, 447120, 444793, 443023, 441738, 440499, 439175, 437995, 436915, 435556, 433895, 432415, 431365, 430439, 429425, 428559, 427970, 427382, 426748, 426556, 427043, 427631, 427823, 428168, 429592, 432059, 434672, 436979, 439381, 442209, 445156, 447827, 450205, 452278, 453764, 454545, 454998, 455527, 456062, 456263, 455870, 454539, 451758, 447488, 442742, 438920, 436448, 434488, 432161, 429656, 427852, 427089, 426750, 426082, 425061, 424271, 424091, 424270, 424276, 423894, 423430, 423428, 424158, 425319, 426242, 426569, 426668, 427239, 428528, 430181, 431853, 433657, 435929, 438781, 442040, 445294, 447822, 448845, 448213, 446654, 444990, 443253, 440919, 437849, 434583, 431686, 429158, 426500, 423132, 418801, 413898, 409345, 405866, 403392, 401374, 399528, 397830, 395941, 393235, 389558, 385512, 381750, 378346, 375037, 371785, 368867, 366598, 365052, 363895, 362525, 360690, 358916, 357914, 357593, 357153, 356162, 354914, 353601, 351873]
61668C51873k265k212j636j314j281o92O87J855J969J474J225J308J360J416J701
61653C55468K010J970J613J146M94l84r84p05M01J662K470K560J938R93M31O13
61637C71696J107J258J013P63N58J06o03j177j435j664k200l009l736l985l595
61622C55097k846k285k156k145j904j570j413j283q67l78m00j005j527j426j013
61607C32879j077j931l037l562l222k570k352k662k901k610k012j610j598j889
61593B99846k385k914l229l384l740m251m191l110j716j104j331j448q34J83R69
61578B67361J199P12m70j742k195j584o30j00j1M9K82O19R90J312J421J244R16
61561B69373O73P13J087J464J257M14j50M41J649J993J001j39k23M74R20Q16O82
$$ y = [351873, 349608, 347396, 345760, 344446, 343165, 342473, 343160, 345015, 346984, 348458, 349683, 350991, 352351, 353767, 355468, 357478, 359448, 361061, 362207, 362701, 362317, 361333, 360628, 361029, 362691, 365161, 367721, 369659, 370652, 371083, 371696, 372803, 374061, 375074, 375837, 376395, 376501, 375898, 374721, 373286, 371622, 369422, 366413, 362677, 358692, 355097, 352251, 349966, 347810, 345665, 343761, 342191, 340778, 339495, 338628, 338250, 337850, 336845, 335318, 333892, 332879, 331802, 329871, 326834, 323272, 320050, 317480, 315128, 312466, 309565, 306955, 304943, 303333, 301735, 299846, 297461, 294547, 291318, 287934, 284194, 279943, 275752, 272642, 270926, 269822, 268491, 267043, 266209, 266392, 267361, 268560, 269272, 268802, 267060, 264865, 263281, 262651, 262551, 262540, 262589, 262871, 263490, 264480, 265792, 267213, 268457, 269373, 270046, 270759, 271846, 273310, 274567, 274981, 274831, 275272, 276921, 278914, 279915, 279776, 279553, 280027, 280947, 281763, 282445]
61544B82445Q56J169J426J569J465J041N57L71M92O87Q56J013J041Q14M21K9l04
61527B95948m56k91r2m55j322j690r60n7k73j269j394k9J488J684P12k83p26q20
61509B89715p76p23j006j743k251j737m85L73L89K76O36J002O90j0k28J62M74
61492B84758L90M57J119J906K034J481R48Q59R21O52L2n04m78K42J316K200K552
61475C00885K506K395K293J969J259L36l85n84l13J1M6l9J35L54j27j411k333
61458C06997j677K38J872K258J757J117O26L36L44M58K83o2O0P00J017N37j7J46
61440C16990N98M72rJ24R32J383R33K98L14Q21J176J220J242J395J625J894K069
61423C33477J793R20m1l06K91J115J475J299R73P43N91M82M37K54l32j077j225
$$ y = [282445, 283301, 284470, 285896, 287465, 288930, 289971, 290528, 290899, 291391, 292078, 292934, 293947, 294988, 295802, 296223, 296252, 295948, 295492, 295201, 295109, 294654, 293332, 291642, 290682, 290625, 290352, 289083, 287689, 287660, 289148, 290832, 291544, 291261, 290535, 289715, 288939, 288216, 287210, 285467, 283216, 281479, 280994, 281367, 281756, 282032, 282668, 283670, 284360, 284350, 284122, 284284, 284758, 285148, 285605, 286724, 288630, 290664, 292145, 293093, 293952, 294873, 295525, 295557, 295053, 294575, 294817, 296133, 298333, 300885, 303391, 305786, 308079, 310048, 311307, 311643, 311258, 310674, 310361, 310372, 310418, 310379, 310514, 310868, 310741, 309330, 306997, 305320, 305558, 307430, 309688, 311445, 312562, 313188, 313524, 313868, 314326, 314609, 314547, 314607, 315307, 316324, 316861, 316844, 316990, 317588, 318060, 318051, 318175, 319107, 320490, 321423, 321721, 322035, 322856, 324032, 325252, 326494, 327889, 329514, 331408, 333477, 335270, 336190, 336149, 335843, 336134, 337249, 338724, 340023, 340996, 341739, 342330, 342812, 343249, 343503, 343171, 342094, 340869]
61406C40869n27J19k90j401j896j287m71l11n99q14r54j023n41N91J446J233M92
61389C34636K08K73l1m96k35P13J379J475J687K185K218J581J242J834K663K828
61373C54160K411J853J148M21M06J319K058J602N91M25J204J820J833K011K853
61358C76115L780M084L952M034M570N256N698N787N828O317P209P661O870N107
61344D52268L364K098R71j92r17q61m46k94m37m41l7O54J321J544R61l45j644
61327D57567k112j665j081j201k015k647k280j019L28J195J647J848J756J628
61313D51949K225L857N666O577O798P447Q810R904J0036R794J0018J0532J0636
61300E54249J0238R640Q626O625L846J373p4q74j790k983m089m899n539o118o572
$$ y = [340869, 340342, 340461, 340171, 338770, 336874, 335587, 335116, 334805, 334206, 333392, 332438, 331415, 330874, 331465, 332911, 334144, 334636, 334844, 335117, 335086, 334590, 334355, 335068, 336447, 337922, 339609, 341794, 344012, 345593, 346835, 348669, 351332, 354160, 356571, 358424, 359572, 359993, 360399, 361718, 363776, 365378, 365969, 366394, 367598, 369418, 371251, 373262, 376115, 379895, 383979, 387931, 391965, 396535, 401791, 407489, 413276, 419104, 425421, 432630, 440291, 447161, 452268, 455632, 457730, 458701, 458509, 457592, 456731, 456285, 455991, 455554, 455113, 455076, 455730, 457051, 458595, 459556, 459211, 457567, 455455, 453790, 452709, 451508, 449493, 446846, 444566, 443547, 443875, 445070, 446717, 448565, 450321, 451949, 454174, 458031, 463697, 470274, 477072, 484519, 493329, 503233, 513269, 523063, 533081, 543613, 554249, 564487, 574127, 582753, 589378, 593224, 594597, 594523, 593649, 591859, 588876, 584787, 579888, 574349, 568231, 561659]
61285E61659o818o861o688o281n758n360n175m987m457l469k173q60J77P00O70
61270E04319M19M92J113J922K361K258J953J889K272L077M099M949N256M977M460
61255E45816M035L671L101K293J592J315J282Q86k38j699k675k732k246j889j875
61240E50637j911j768j644j835k219k284j779j100q21q45m05R18K447L189L088
61225E43668L011L471M101M538N085O014O805O809O276O019O295O643O770O805
61211F22310O719O236N478N033N137N281M936M260L805L890M490N439O569P800
61197F97383R240J0850J2119J2553J2481J2756J3453J3521J2147R794P468N412
61185H29177L206P87j287k550l087l404m074n345o788p629p783q160r512j1300
$$ y = [561659, 554841, 547980, 541292, 535011, 529253, 523893, 518718, 513731, 509274, 505805, 503632, 502772, 502949, 503649, 504319, 504738, 505230, 506343, 508265, 510626, 512884, 514837, 516726, 518998, 522075, 526174, 531123, 536379, 541356, 545816, 549851, 553522, 556623, 558916, 560508, 561823, 563105, 563991, 563753, 562054, 559379, 556647, 554401, 552512, 550637, 548726, 546958, 545314, 543479, 541260, 538976, 537197, 536097, 535276, 534431, 534026, 534944, 537391, 540580, 543668, 546679, 550150, 554251, 558789, 563874, 569888, 576693, 583502, 589778, 595797, 602092, 608735, 615505, 622310, 629029, 635265, 640743, 645776, 650913, 656194, 661130, 665390, 669195, 673085, 677575, 683014, 689583, 697383, 706623, 717473, 729592, 742145, 754626, 767382, 780835, 794356, 806503, 816297, 823765, 829177, 832383, 833170, 831883, 829333, 826246, 822842, 818768, 813423, 806635, 799006, 791223, 783063, 773551, 762251]
61171G62251j2376j2459j2262j2261j2231j2028j1988j2265j2395j1980j1249
61160F28757j0611j0066r426q809q386p890o845n223l521k163j159l92N3L3l34
61145E54018p28j008j425k261l402m394m935n103n022m509l357j734j08J236K374
61130E19642L465M561N681O840P947Q859R622J0530J1807J3338J4763J5846J6763
61117F49664J7967J9654K1377K2387K2492K2269K2338K2646K2649K1981K0596
61106H86020J8612J6365J4416J2976J1479R130N819K084j629n129q095j0286j2096
61093I39666j4213j6525j8105j8528j8464j8632j8888j8832j8616j8448j7853
61082G42562j6308j4275j2730j1839j0880r465p976o752n591m345l311k601j724
$$ y = [762251, 749875, 737416, 725154, 712893, 700662, 688634, 676646, 664381, 651986, 640006, 628757, 618146, 608080, 598654, 589845, 581459, 573569, 566724, 561501, 557980, 555817, 554658, 554266, 554319, 554352, 554018, 553290, 552282, 550857, 548596, 545194, 540800, 535865, 530762, 525740, 521231, 517874, 516140, 516032, 517268, 519642, 523107, 527668, 533349, 540189, 548136, 556995, 566617, 577147, 588954, 602292, 617055, 632901, 649664, 667631, 687285, 708662, 731049, 753541, 775810, 798148, 820794, 843443, 865424, 886020, 904632, 920997, 935413, 948389, 959868, 968998, 974817, 976901, 975272, 970143, 962048, 951762, 939666, 925453, 908928, 890823, 872295, 853831, 835199, 816311, 797479, 778863, 760415, 742562, 726254, 711979, 699249, 687410, 676530, 667065, 659089, 652337, 646746, 642401, 639090, 636489, 634765]
61069F34765k95J238K093K167K124K626L891N770P824R351R832R550R432J0196
61055G10564J1808J3756J5546J6878J7712J8368J9269K0413K1424K2301K3643
61044I11682K5773K8054K9636L0534L1343L2139L2597L3090L4571L6947L8742
61033A265108L9023L8872L9984M2389M4579M5560M5827M6382M7756M9999N2753
61022A758232N5271N7176N9328O3275O9763P8513Q9475J03241J19904J38468J58039
61011B750685J79047K03043K31905K67520L11268L63296M22897M90068N66059
61002E785788O52295P49601Q58300R77145J101970J228019J353726J475064J567650
60993A5749558J576783J440274J137230P19679K91829m7439k48036l09279k58862
$$ y = [634765, 634470, 635708, 637801, 639968, 642092, 644718, 648609, 654379, 662203, 671554, 681386, 690936, 700368, 710564, 722372, 736128, 751674, 768552, 786264, 804632, 823901, 844314, 865738, 888039, 911682, 937455, 965509, 995145, 1025679, 1057022, 1089161, 1121758, 1154848, 1189419, 1226366, 1265108, 1304131, 1343003, 1382987, 1425376, 1469955, 1515515, 1561342, 1607724, 1655480, 1705479, 1758232, 1813503, 1870679, 1930007, 1993282, 2063045, 2141558, 2231033, 2334274, 2454178, 2592646, 2750685, 2929732, 3132775, 3364680, 3632200, 3943468, 4306764, 4729661, 5219729, 5785788, 6438083, 7187684, 8045984, 9023129, 10125099, 11353118, 12706844, 14181908, 15749558, 17326341, 18766615, 19903845, 20623524, 20915353, 20867914, 20619878, 20310599, 20051737]
60984B0051737j45590m5930n2074k27077n59597r63690j328291j574413j678257
60975A3476818j657647j547770j385711j203590j024488q61080p18272n96961
60967D481299m95935m12582l44086k88284k43344k07355j78710j56245j38605
60958B016153j24143j11715j00862r1023q1456p2274o4511n8471n3048m7426m2502
60947A168722l9595l8381l7257l5326l3022l0998k9405k8175k7204k6171k4861
60936H18327k3577k2666k1829k0560j9067j8004j7362j6420j4842j3089j1598
60925F19313j0286r067q223p900p756p434p014o665o243n514m514l432k342j357
60911E31566p93q42j152j087m73J58K63QK7M51O20qr60j325j033q87j304j743
$$ y = [20051737, 19906147, 19860217, 19808143, 19581066, 19021469, 18057779, 16729488, 15155075, 13476818, 11819171, 10271401, 8885690, 7682100, 6657612, 5796532, 5078260, 4481299, 3985364, 3572782, 3228696, 2940412, 2697068, 2489713, 2311003, 2154758, 2016153, 1892010, 1780295, 1679433, 1588410, 1506954, 1434680, 1370169, 1311698, 1258650, 1211224, 1168722, 1129127, 1090746, 1053489, 1018163, 985141, 954143, 924738, 896563, 869359, 843188, 818327, 794750, 772084, 750255, 729695, 710628, 692624, 675262, 658842, 644000, 630911, 619313, 609027, 599960, 591737, 583837, 576081, 568647, 561633, 554968, 548725, 543211, 538697, 535265, 532923, 531566, 530773, 529931, 528779, 527692, 527219, 527377, 527640, 527648, 527675, 528126, 528746, 528738, 527778, 526453, 525420, 524533, 523229, 521486]
60893E21486j691j518j870k712l578m327n018n343m946m150l735m034m757n566
60879D68241o279o577o199n459n003n025n106m871m287l489k688k205k007j449
60865D07597j61J022J022L30P13K777M915N357M282L111K440J856J288J308J958
60850D39815K326J748Q15N95J206J721J398N63rk33p68j947l146l592l407l300
60834D33785l445l320k716k212k331k794l028l030l204l512l340k260p27J94j30
60819C97930j195j873j773j737k651m107m917m711m269m148l954l283k610k607
60805C54095l159l609l570l052k225j511j471k011k191j372j62M38L74L04L67
60790C31245J70k31k57J22K31k29o71n45o6L48P46J302J738J662J226R77J161
$$ y = [521486, 519795, 518277, 516407, 513695, 510117, 505790, 500772, 495429, 490483, 486333, 482598, 478564, 473807, 468241, 461962, 455385, 449186, 443727, 438724, 433699, 428593, 423722, 419435, 415946, 413258, 411053, 409046, 407597, 407436, 408458, 409480, 409810, 410523, 413300, 418215, 423572, 427854, 430965, 433405, 435261, 436549, 437857, 439815, 442141, 443889, 444704, 445299, 446505, 448226, 449624, 450187, 450178, 449945, 449177, 447230, 444084, 440492, 437085, 433785, 430340, 427020, 424304, 422092, 419761, 416967, 413939, 410909, 407705, 404193, 400853, 398593, 397866, 398060, 397930, 396735, 394862, 393089, 391352, 388701, 384594, 379677, 374966, 370697, 366549, 362595, 359312, 356702, 354095, 350936, 347327, 343757, 340705, 338480, 336969, 335498, 333487, 331296, 329924, 329762, 330200, 330574, 330878, 331245, 331415, 331184, 330927, 331049, 331280, 331051, 330380, 329835, 329769, 330117, 330863, 332165, 333903, 335565, 336791, 337768, 338929]
60773C38929J494J554J200O61M11Q23J770K648K971K802K531K296J845R75o8p22
60757C62120o74k14L3k22p43j233j706k200k436k173j713j522j424p59M98J397
60741C47029J133L5r91j702k548l675m573m804m557m158l561k764k307k707l496
60726C06354l523k383r85l01j75J96R66J543J579J325J005O05L33O03J253J484
60710C09879R33K45J45M85O96O78O29M62J37K06J193K582L172K516J362O22N46
60693C26488R79J737K451K555J798O00l16n30j16N14R48J109J178J176Q85L70
60677C41826J70N69J121J387J580J865J588K63j120j069K19R70K39j150k232k997
60661C43229l368k664j047j25q82k049j888o81N5N3L15R97J081K62m08j11P56
$$ y = [338929, 340423, 341977, 343177, 343838, 344249, 345072, 346842, 349490, 352461, 355263, 357794, 360090, 361935, 362910, 362842, 362120, 361446, 361232, 361265, 361043, 360300, 359067, 357361, 355161, 352725, 350552, 348839, 347317, 345893, 345134, 345632, 347029, 348162, 348197, 347206, 345504, 342956, 339281, 334708, 329904, 325347, 321189, 317628, 314864, 312557, 309850, 306354, 302831, 300448, 299463, 299162, 298987, 299183, 300149, 301692, 303271, 304596, 305601, 306206, 306539, 307142, 308395, 309879, 310812, 311057, 311202, 311687, 312383, 313061, 313690, 314152, 314289, 314495, 315688, 318270, 321442, 323958, 325320, 325942, 326488, 327467, 329204, 331655, 334210, 336008, 336608, 336292, 335762, 335646, 336160, 337108, 338217, 339395, 340571, 341456, 341826, 341996, 342565, 343686, 345073, 346653, 348518, 350106, 350369, 349249, 348180, 348399, 349369, 349608, 348458, 346226, 343229, 339861, 337197, 336150, 336025, 335143, 333094, 331206, 330525, 330580, 330633, 330948, 331945, 333026, 333288, 332880, 332769, 333525]
60644C33525J596K383K942K583J173k99r60j171j752k679l254l161k666k078j496
60629C24686r89n64j45K49N23P91J227J495J003l2n06R4Q18O05j19j15Q14J630
60611C31465J593J032N01J07j13J05P77J376J335N50o69j750j927q48P79J681
60595C35994J424P84O05R17J475K309L223L500K880K244K435K851K271P92j89
60580C63515K5N83N83L98Q99K053L087L599L887M345N144O380Q004R620J0664
60565D22786J0863J0415R821R582R770R783Q851O955M833K859N45k390n008o056
60551D93609n568m709m132l332j794Q0J595K659L639M727N897P197Q702J0328
60537E18898J1982J3722J5574J7317J8610J9218J9082J8297J6948J4777J1171
$$ y = [333525, 335121, 337504, 340446, 343029, 344202, 343903, 342943, 341772, 340020, 337341, 334087, 330926, 328260, 326182, 324686, 323697, 323133, 322988, 323237, 323760, 324551, 325778, 327273, 328276, 328244, 327738, 327832, 328650, 329255, 329136, 329021, 329835, 331465, 333058, 334090, 334591, 334698, 334585, 334690, 335467, 336843, 338178, 338728, 338059, 336309, 334382, 333534, 334313, 335994, 337418, 338202, 338807, 339724, 341199, 343508, 346731, 350231, 353111, 355355, 357790, 360641, 362912, 363704, 363515, 363540, 364123, 364706, 365104, 366003, 368056, 371143, 374742, 378629, 382974, 388118, 394498, 402502, 412122, 422786, 433649, 444064, 453885, 463467, 473237, 483020, 491871, 498826, 503659, 506518, 507063, 504673, 499665, 493609, 488041, 483332, 479200, 475868, 474074, 474154, 475749, 478408, 482047, 486774, 492671, 499868, 508570, 518898, 530880, 544602, 560176, 577493, 596103, 615321, 634403, 652700, 669648, 684425, 695596]
60526F95596O022M73l835o463q404j0373j1678j1406j0040q950q621q273p228
60513F06820n737m339l023j400P25L199N590P379Q418R332J1051J3788J6874J9763
60499F88440K2810K6638L1121L5389L8796M1466M3875M6166M7915M8406M7093
60488A118115M3957L9446L4060K7925K0816J2553L321o351j5831k4641l2557l9578
60476A181235m5721n0832n4531n6444n6476n4842n1883m7955m3545l9236l5292
60465F44478l1435k7327k3239j9875j7428j5324j3089j1152j0228j0187j0006
60454D55188q922p160n487m372l820l657l706l740l574l266l066l093l159l005
60440C95161k695k544k648k685k384j982j860j873j545q99n66q22j154j076r02
$$ y = [695596, 701618, 702091, 698256, 691793, 683389, 673016, 661338, 649932, 639892, 630942, 622321, 614048, 606820, 601083, 596744, 593721, 592321, 593046, 596245, 601835, 609214, 617632, 626964, 638015, 651803, 668677, 688440, 711250, 737888, 769009, 804398, 843194, 884660, 928535, 974701, 1022616, 1071022, 1118115, 1162072, 1201518, 1235578, 1263503, 1284319, 1296872, 1300193, 1293842, 1278011, 1253370, 1220813, 1181235, 1135514, 1084682, 1030151, 973707, 917231, 862389, 810506, 762551, 719006, 679770, 644478, 613043, 585716, 562477, 542602, 525174, 509850, 496761, 485609, 475381, 465194, 455188, 446266, 439106, 433619, 429247, 425427, 421770, 418064, 414324, 410750, 407484, 404418, 401325, 398166, 395161, 392466, 389922, 387274, 384589, 382205, 380223, 378363, 376490, 374945, 374046, 373480, 372658, 371504, 370428, 369526]
60425C69526j116j479j353p12r0L24Q21J421J711J586J490J706J891J685J271
60410C78682J033J047J165J343J506J407R32L90K27N90J298K044K504K456K021
60395C98645J557J284J194J326J707J983J689J081J073J939K721K511J813J825
60381D22348K689L367L184K640K516K883L349L715L947L934L607L140K757K473
60367D66549K209J983J834J689J465J170Q67P73J312K705M379N240M897M294M668
60352E06034O138P670Q426Q604Q839R234R197Q120N867K766o25l723o043p375
60338E63129p882p988q115q412q661q403p299n521l803k898k979l589m235m770
60324D78574n089m858l880k577j556p84L35J938L315L851L923M416N658P299R006
$$ y = [369526, 368410, 366931, 365578, 364866, 364776, 365100, 365921, 367342, 369053, 370639, 372129, 373835, 375726, 377411, 378682, 379715, 380762, 381927, 383270, 384776, 386183, 387115, 387505, 387732, 388322, 389620, 391664, 394168, 396624, 398645, 400202, 401486, 402680, 404006, 405713, 407696, 409385, 410466, 411539, 413478, 416199, 418710, 420523, 422348, 425037, 428404, 431588, 434228, 436744, 439627, 442976, 446691, 450638, 454572, 458179, 461319, 464076, 466549, 468758, 470741, 472575, 474264, 475729, 476899, 477766, 478539, 479851, 482556, 486935, 492175, 497072, 501366, 506034, 512172, 519842, 528268, 536872, 545711, 554945, 564142, 572262, 578129, 580895, 580270, 576547, 570504, 563129, 555247, 547259, 539144, 530732, 522071, 513668, 506369, 500848, 497045, 494147, 491168, 487579, 483344, 478574, 473485, 468627, 464747, 462170, 460614, 459830, 460165, 462103, 465418, 469269, 473192, 477608, 483266, 490565, 499571]
60309D99571J0686J2132J3028J3476J3930J4433J4316J3076J1225R789R011P958
60297F42631N519J607k745o347q886j0997j3370j5876j7621j7813j6436j4104
60285E25562j1558r398p941p121o607o194n879n559m941m041l440l586m073m053
60271D41171l361k690k658l130l553l528k934j913r41n40o63p51n56m76p94j077
60255D11606p91j38L17M86O78Q08N13m1j04O46J669K313K531K555K330J711Q31
60238D27920p6r45j613j599o10Q78K016K420K292J815J056M32O56J868L275L991
60222D43776L996L895M019M175M161M057L970L925M103M734N603O113O083O111
60208E08721O722P470P448O510N412M860M906N337N881O026N257L842K716K286
$$ y = [499571, 510257, 522389, 535417, 548893, 562823, 577256, 591572, 604648, 615873, 625662, 634673, 642631, 648150, 649757, 647012, 640665, 631779, 620782, 607412, 591536, 573915, 556102, 539666, 525562, 514004, 504606, 496665, 489544, 482937, 476743, 470864, 465305, 460364, 456323, 452883, 449297, 445224, 441171, 437810, 435120, 432462, 429332, 425779, 422251, 419317, 417404, 416463, 415923, 415260, 414509, 413953, 413477, 412683, 411606, 410815, 410677, 410994, 411480, 412158, 412966, 413479, 413438, 413334, 413980, 415649, 417962, 420493, 423048, 425378, 427089, 427920, 427844, 426899, 425286, 423687, 423077, 423955, 425971, 428391, 430683, 432498, 433554, 433986, 434642, 436510, 439785, 443776, 447772, 451667, 455686, 459861, 464022, 468079, 472049, 475974, 480077, 484811, 490414, 496527, 502610, 508721, 515443, 522913, 530361, 536871, 542283, 547143, 552049, 557386, 563267, 569293, 574550, 578392, 581108, 583394]
60194E83394J985J429J155J506J559K39j875l170l248l295m092m884m793m181
60180E61729l913m040m133m210m517m736m342l480k760k327j859j337j141j321
60166E17613j437j211q20m95k77j67j69j58o8j76p44j457j724j414q14L7J210
60149E07729K151J994R06K37Q52K012K534K406K448K840K977K675K540K991L619
60134E40911L897L950M269M990N790O244O041N079L652K439J941J988J973J592
60120E94756J168J240J924K757L054K508J520Q62R23J283J238O78J64Q3R4l21
60104F13931j049j612k019k735l709m139l595k803k659k841k271q58J81L0n99
60089E83253n57O6K43l59q92n71L04Q61P13J44m64j010j538k081k700l518m559
$$ y = [583394, 585379, 586808, 587963, 589469, 591028, 591267, 589392, 586222, 582974, 579679, 575587, 570703, 565910, 561729, 557816, 553776, 549643, 545433, 540916, 536180, 531838, 528358, 525598, 523271, 521412, 520075, 518934, 517613, 516176, 514965, 514145, 513650, 513373, 513206, 513037, 512879, 512811, 512635, 511891, 510434, 508710, 507296, 506482, 506519, 507729, 509880, 511874, 512780, 513017, 513869, 515881, 518415, 520821, 523269, 526109, 529086, 531761, 534301, 537292, 540911, 544808, 548758, 553027, 558017, 563807, 570051, 576092, 581171, 584823, 587262, 589203, 591191, 593164, 594756, 595924, 597164, 599088, 601845, 604899, 607407, 608927, 609789, 610712, 611995, 613233, 613911, 614075, 614158, 614252, 613931, 612882, 611270, 609251, 606516, 602807, 598668, 595073, 592270, 589611, 586770, 584499, 583641, 583822, 583852, 583253, 582696, 582762, 583005, 582646, 581754, 581183, 581487, 582348, 583061, 583205, 582741, 581731, 580193, 578112, 575412, 571894, 567335]
60072E67335n597o272o459o429o534o758o794o629o693p125p259o305m496k986
60058D80999k502k573k388j898j636j717j618r35R0R19J385J777K414L255L987
60043D79559M473M958N643O134N715M364L053K656K868K695J811P26k95j635l421
60028E19304m883n246m748m245m134m247m518n085n762o161o366o851p560p644
60014D41854o578n010m003l777l661l168k553k219k093j798j213n66q9K17M31
59999D05774M91K70j61m83m67k34J8M29J328K545L318L160K545K322K592K659
59983D26106K121J447J224J254Q57j50j258k010k444k675k520j864j199j341k501
59968D15047l864m154k707o5K387L471L092K144J494J235J019Q49J085J752K289
$$ y = [567335, 561738, 555466, 549007, 542578, 536044, 529286, 522492, 515863, 509170, 502045, 494786, 488481, 483985, 480999, 478497, 475924, 473536, 471638, 470002, 468285, 466667, 465732, 465822, 466741, 468126, 469903, 472317, 475572, 479559, 484032, 488990, 494633, 500767, 506482, 510846, 513899, 516555, 519423, 522118, 523929, 524655, 524360, 522725, 519304, 514421, 509175, 504427, 500182, 496048, 491801, 487283, 482198, 476436, 470275, 463909, 457058, 449498, 441854, 435276, 430266, 426263, 422486, 418825, 415657, 413104, 410885, 408792, 406994, 405781, 405215, 405126, 405343, 405774, 406265, 406535, 406374, 405891, 405424, 405190, 405208, 405637, 406965, 409510, 412828, 415988, 418533, 420855, 423447, 426106, 428227, 429674, 430898, 432152, 433009, 432859, 431601, 429591, 427147, 424472, 421952, 420088, 418889, 417548, 415047, 411183, 407029, 404322, 404257, 406644, 410115, 413207, 415351, 416845, 418080, 419099, 419948, 421033, 422785, 425074]
59953D25074K155J375L65m41o72j45P79J298J028M43J66Q6k66q26j091j099j449
59936D26780k299k994k963k352j486k97J216K445K768K400K098K178K349K438
59922D32281K667L159L617L721L453K953K287J577J071R05R40R78J022J200J517
59907D63348J851K173K576L035L257K913K151J625J778K232K167J412P02P34J294
59892D93248J698J802K055K717L491M043M502N169O007O610O654O214N713N531
59878E55454N676N799N547M822L692K253P60k98n97l93l12p48j667k875m157n133
59862E67823n364m717l478k058q33k17n09j445k131j747l07J376K483K903L226
59847E55005M007N126N911N907N295M447L391K070Q12R2q2j7L04J110K030K121
$$ y = [425074, 427229, 428604, 428969, 428528, 427856, 427711, 428490, 429788, 430816, 431259, 431425, 431511, 431245, 430419, 429328, 428229, 426780, 424481, 421487, 418524, 416172, 414686, 414389, 415605, 418050, 420818, 423218, 425316, 427494, 429843, 432281, 434948, 438107, 441724, 445445, 448898, 451851, 454138, 455715, 456786, 457691, 458631, 459609, 460631, 461831, 463348, 465199, 467372, 469948, 472983, 476240, 479153, 481304, 482929, 484707, 486939, 489106, 490518, 491220, 491954, 493248, 494946, 496748, 498803, 501520, 505011, 509054, 513556, 518725, 524732, 531342, 537996, 544210, 549923, 555454, 561130, 566929, 572476, 577298, 580990, 583243, 584003, 583705, 583108, 582715, 582403, 581655, 579988, 577113, 572956, 567823, 562459, 557742, 554264, 552206, 551373, 551156, 550647, 549202, 547071, 545324, 545017, 546393, 548876, 551779, 555005, 559012, 564138, 570049, 575956, 581251, 585698, 589089, 591159, 591971, 592063, 591981, 591964, 592268, 593378, 595408, 597529]
59831E97529R99o42k021l189m477n542n743n244m968n383n956n998n530n102n100
59816E33633n455n808n723m975l837k925k610k697k825k940l138l240k854j928
59802D82678j020p69j176j544j268n67l01r82k085k589k064j043l23j75l61o38
59786D65773r38j169j155q19k69L47R03J224J181Q62N33L26J94K03N91J380K125
59769D71292K348K095J861J980K393K892L352L698L899M063M286M386M064L394
59755E16003K878K996L852N273O886Q016P962O715N191M414M604N233N717N790
59741E91530N434M842M363M163L995L546K897K344J916J406P85K86M0l9l5J2l4
59724F27451l21p65j130j369j598j814j917j941k025k120k075j935j899j976j975
$$ y = [597529, 598528, 597886, 595865, 592676, 588199, 582657, 576914, 571670, 566702, 561319, 555363, 549365, 543835, 538733, 533633, 528178, 522370, 516647, 511672, 507835, 504910, 502300, 499603, 496778, 493838, 490700, 487460, 484606, 482678, 481658, 480889, 479713, 478169, 476901, 476334, 476033, 475051, 472966, 470377, 468313, 467270, 466947, 466772, 466411, 465773, 464835, 463666, 462511, 461692, 461423, 461770, 462673, 463897, 465078, 465940, 466473, 466799, 466993, 467196, 467787, 469167, 471292, 473640, 475735, 477596, 479576, 481969, 484861, 488213, 491911, 495810, 499873, 504159, 508545, 512609, 516003, 518881, 521877, 525729, 531002, 537888, 545904, 553866, 560581, 565772, 570186, 574790, 580023, 585740, 591530, 596964, 601806, 606169, 610332, 614327, 617873, 620770, 623114, 625030, 626436, 627221, 627507, 627547, 627508, 627473, 627485, 627451, 627130, 626365, 625235, 623866, 622268, 620454, 618537, 616596, 614571, 612451, 610376, 608441, 606542, 604566, 602591]
59709F02591j835j631j316p60m7N86J064J440J613J463J187J067R86O98N05R69
59693F08580J872K147J205k75j202j244q08l28o9l06j143k281l207l550l210k442
59677E93739j920k249l227m037m403m922n901o579o129m914l946l401k561j179
59663E38371j1J72m95j249j515j147k74Q46J882K540K697K549K590L148L861L892
59647E57857K938J602N14m84j784l128l934m252m710n550o360o721o557n869m796
59632E08766l930l859m293m303l596k872k671k582k094j542j651k461l350l872
59618D65690m048m002l778l446l007k267j214m13n06j259j639r88J80R39J126
59603D41368J311J766K000J522O26J1j07q4j19j3L18N53M57K89L90O83Q55Q10
$$ y = [602591, 600756, 599125, 597809, 597049, 597002, 597588, 598652, 600092, 601705, 603168, 604355, 605422, 606408, 607106, 607611, 608580, 610452, 612599, 613804, 613529, 612327, 611083, 610275, 609947, 609878, 609572, 608429, 606148, 602941, 599391, 596181, 593739, 591819, 589570, 586343, 582306, 577903, 572981, 567080, 560501, 554372, 549458, 545512, 542111, 539550, 538371, 538360, 538532, 538037, 536788, 535273, 534126, 533852, 534698, 536580, 539120, 541817, 544366, 546956, 550104, 553965, 557857, 560795, 562397, 562911, 562427, 560643, 557515, 553581, 549329, 544619, 539069, 532709, 525988, 519431, 513562, 508766, 504836, 500977, 496684, 492381, 488785, 485913, 483242, 480660, 478566, 477024, 475373, 472912, 469562, 465690, 461642, 457640, 453862, 450416, 447409, 445142, 443928, 443515, 443009, 441750, 440111, 439123, 439303, 440242, 441368, 442679, 444445, 446445, 447967, 448593, 448604, 448497, 448413, 448294, 448281, 448599, 449152, 449609, 449898, 450288, 450971, 451826, 452636]
59585D52636O18K54k44n90o13o45j059j638j824j520j151r81r13r42j266j776
59569D38346j995j694j178p58l24K36O49N42o7q15j357j479j070k42O36J163J149
59552D31742O56K6j85L92J512K556L277L983M937N998O909P645Q228Q608Q987
59537D95271R913J1655J3633J4691J3863J0830N997M51m405p570q799q277o246
59524E41007l259m52R79P37l69j211j289r53q97j425k235k899l423m131n041n789
59508E09350o152o343o610o860o878o629o131n300m173l072k277j707j192p58
59494D45268m59j37L10N97L63k88q37q44k16R18K267L392L909L754L165K543K355
59477D66060K866L743M201L859L211K971L165L288L141L006L045K958K407J437
$$ y = [452636, 453254, 453508, 453264, 452674, 452061, 451416, 450357, 448719, 446895, 445375, 444224, 443243, 442330, 441388, 440122, 438346, 436351, 434657, 433479, 432721, 432397, 432633, 433282, 433824, 433757, 432942, 431585, 430106, 429036, 428794, 429430, 430593, 431742, 432398, 432424, 432239, 432631, 434143, 436699, 439976, 443959, 448896, 454894, 461803, 469448, 477676, 486284, 495271, 505184, 516839, 530472, 545163, 559026, 569856, 575853, 576304, 571899, 564329, 555530, 547253, 541007, 537748, 537296, 538275, 539012, 538643, 537432, 536143, 535190, 534293, 532868, 530633, 527734, 524311, 520180, 515139, 509350, 503198, 496855, 490245, 483385, 476507, 469878, 463747, 458447, 454274, 451202, 448925, 447218, 446026, 445268, 444809, 444672, 444982, 445579, 445942, 445654, 444817, 443973, 443757, 444675, 446942, 450334, 454243, 457997, 461162, 463705, 466060, 468926, 472669, 476870, 480729, 483940, 486911, 490076, 493364, 496505, 499511, 502556, 505514, 507921, 509358]
59463E09358M44j38o9N33J240J735K165K884L894M802N287N376N275N141N048
59448E52975M926M489L534K280J272Q01N88N0j152k838m427n416n769n738n322
59433E40253m188k373o68P9k8r4N07J568K596L463M415N721P448R417J1322J2950
59417E92388J4305J5414J6173J6580J6897J7339J7750J7869J7601J6565J3739
59406G72620Q385J378n082r286j1033j0841r040n991k473Q08L501M944L789o91
59392G40988p172j2952j6225j7142j6724j5536j3655j1351r126p239n502l598
59380F04766j502L63J389J345P18K78L53O29O83M58J88R1J81L14L44L86Q42J956
59362F13782L342M294M566M562M709N028N474O240P372Q427Q961R153R515J0147
$$ y = [509358, 509802, 509664, 509595, 510128, 511368, 513103, 515268, 518152, 522046, 526848, 532135, 537511, 542786, 547927, 552975, 557901, 562390, 565924, 568204, 569476, 570277, 570865, 570915, 569763, 566925, 562498, 557082, 551313, 545575, 540253, 536065, 533692, 533024, 533103, 533075, 532981, 533488, 535056, 537652, 541115, 545530, 551251, 558699, 568116, 579438, 592388, 606693, 622107, 638280, 654860, 671757, 689096, 706846, 724715, 742316, 758881, 772620, 781005, 782383, 777301, 768015, 756982, 746141, 737101, 731110, 728637, 729445, 732946, 737890, 741679, 740988, 733816, 720864, 704639, 687497, 670773, 655237, 641582, 630231, 621105, 613866, 608364, 604766, 603264, 603627, 605016, 606361, 607079, 607357, 607710, 608339, 609022, 609480, 609668, 609759, 609940, 610254, 610598, 610984, 611826, 613782, 617124, 621418, 625984, 630546, 635255, 640283, 645757, 651997, 659369, 667796, 676757, 685910, 695425, 705572]
59348G05572J0774J1418J2378J3486J3972J3397J2238J1214J0402R427Q093O388
59336H38759M132J295j448l226m096n125p064r441j1244j2124j2478j2717j2920
59323G52303j3048j3114j3052j2747j2157j1277j0111q888q130q073q145p537
59311F26024o340n512n544n671m927l449k181j466o88O46K174L350M303N562P146
59296F13427Q404Q597P296M341om786q663j0854j1538j1304j0465r103p462n872
59282E62012m409k915j380n2Q69J527K398L961O238Q605J0274J1101J1643J2264
59268F22136J2530J1886J0674R839R720R605Q632O659M137J586o49k401l734m780
59254F95840n488n737n702n691n589m944l755k656k018j443n15M18Q36J001J595
$$ y = [705572, 716346, 727764, 740142, 753628, 767600, 780997, 793235, 804449, 814851, 824278, 832371, 838759, 842891, 844186, 842738, 839512, 835416, 830291, 823227, 813786, 802542, 790418, 777940, 765223, 752303, 739255, 726141, 713089, 700342, 688185, 676908, 666797, 657909, 649779, 641706, 633561, 626024, 619684, 614172, 608628, 602957, 598030, 594581, 592400, 590934, 590246, 590892, 593066, 596416, 600719, 606281, 613427, 621831, 630428, 637724, 642065, 642059, 637273, 628610, 617756, 606218, 594914, 584449, 575346, 567884, 562012, 557603, 554688, 553308, 553256, 554125, 555652, 558050, 562011, 568249, 576854, 587128, 598229, 609872, 622136, 634666, 646552, 657226, 667065, 676785, 686390, 695022, 701681, 705818, 707404, 706755, 704354, 700620, 695840, 690352, 684615, 678913, 673222, 667633, 662689, 658934, 656278, 654260, 652817, 652302, 652720, 653556, 654557, 656152]
59239F56152K560L066K735K229K338K939L282L016K479K044J544N59q80k223l149
59224F78691m086n603p392q448q399q133q645r727j0297r833q790p764o827n805
59210E68942m683l565k628k252k703l528l713k752j237p4N43J042J650K179K454
59195E49675K453K023J031j5j1J524L572M530M054L395L735M690M987M237L341
59180E93221L175L557L762L506L032K546K125J885J922K093K174K152K072J794
59166F29016J184M83J08J43L14M04L20j25j117k453l678m668n707o856p642p701
59150E92025p353p183p277p234o898o599o588o619o365n966n768n636n034l922
59136E03583l057l067l542l540k824k007j557j243o78J65J190K393L590M378M716
$$ y = [656152, 658712, 661778, 664513, 666742, 669080, 672019, 675301, 678317, 680796, 682840, 684384, 684943, 684063, 681840, 678691, 674605, 669002, 661610, 653162, 644763, 636630, 627985, 618258, 607961, 598128, 589338, 581574, 574747, 568942, 564259, 560694, 558066, 555814, 553111, 549583, 545870, 543118, 541881, 541807, 542350, 543392, 545042, 547221, 549675, 552128, 554151, 555182, 555167, 555156, 556680, 560252, 564782, 568836, 572231, 575966, 580656, 585643, 589880, 593221, 596396, 599953, 603715, 607221, 610253, 612799, 614924, 616809, 618731, 620824, 622998, 625150, 627222, 629016, 630200, 630683, 630791, 630934, 631248, 631652, 631972, 631847, 630730, 628277, 624599, 619931, 614224, 607368, 599726, 592025, 584672, 577489, 570212, 562978, 556080, 549481, 542893, 536274, 529909, 523943, 518175, 512539, 507505, 503583, 500526, 497459, 493917, 490377, 487553, 485546, 483989, 482746, 482068, 482233, 483423, 485816, 489406, 493784, 498500]
59121D98500N070N665O067N968N930O773Q471J0152J1017J0859R947Q817P934
59108F01170P194O106M740L915L870L513J899j01p97p6N27M8r46j806k790l993
59092F22473m548l820k568j920j801j380o41m53j233k356l104l497l989m745n468
59077E80950n754n460m865m412m303m396m508m662m895n034m814m120l108k213
59063E18406j964k479l141l112k297j430j166j383j539j332r00n60n59q18r48
59048D94778p94p99j413k227k322j558q16p96j123j019k98O41J380J668J512J313
59032D88127J542K099K396K292K310K779L437M172N337O907Q117Q578Q938R749
59018E56780J0382R953Q687P441O338M902L212J775N13j128l026m346m624m112
$$ y = [498500, 503570, 509235, 515302, 521270, 527200, 533973, 542444, 552596, 563613, 574472, 584419, 593236, 601170, 608364, 614470, 619210, 623125, 626995, 630508, 632407, 632306, 631509, 631433, 631960, 632008, 631062, 629256, 626466, 622473, 617925, 614105, 611537, 609617, 607816, 606436, 605795, 605342, 604109, 601753, 598649, 595152, 591163, 586418, 580950, 575196, 569736, 564871, 560459, 556156, 551760, 547252, 542590, 537695, 532661, 527847, 523727, 520619, 518406, 516442, 513963, 510822, 507710, 505413, 503983, 502817, 501434, 499895, 498563, 497663, 497103, 496544, 495726, 494778, 493984, 493185, 491772, 489545, 487223, 485665, 484849, 484053, 482930, 481911, 481613, 482254, 483634, 485302, 486814, 488127, 489669, 491768, 494164, 496456, 498766, 501545, 504982, 509154, 514491, 521398, 529515, 538093, 547031, 556780, 567162, 577115, 585802, 593243, 599581, 604483, 607695, 609470, 609983, 608855, 605829, 601483, 596859, 592747]
59004E92747l081j646k36N86R31J356J905K202K488L479M981N729N048L754K858
58989F23101K300J649J175J298J540J071L2n65k73K67L53K05O94K346M835P236
58973F47264Q734R229R338R698J0363J0990J1372J1572J1520J0900R660Q400P940
58960G76980Q360Q733P934N740K861N8k475m823o936q764j0481j2173j3553j4329
58946G37132j4675j4970j5157j4829j3816j2336j0554q524o532n073m306l853
58934F12507l280k496j657r56n66n25n73l31K92J044J577J578Q31m80j635j968
58918F03362j574j077q17o89o40p26o78o0R91J844K267K684L343L998M683O041
58902F22952Q271J0438J1515J1738J2154J3110J3943J4067J3610J2980J2387J2068
$$ y = [592747, 589666, 588020, 587784, 588370, 589301, 590657, 592562, 594764, 597252, 600731, 605712, 611441, 616489, 620243, 623101, 625401, 627050, 628225, 629523, 631063, 632134, 632166, 631601, 631328, 631595, 631948, 632153, 632847, 635193, 640028, 647264, 655998, 665227, 674565, 684263, 694626, 705616, 716988, 728560, 740080, 750980, 760640, 769040, 776980, 785340, 794073, 802007, 807747, 810608, 810666, 808191, 803368, 796432, 787668, 777187, 765014, 751461, 737132, 722457, 707487, 692330, 677501, 663685, 651349, 640795, 632271, 625739, 620666, 616360, 612507, 609227, 606731, 605074, 604118, 603552, 603027, 602454, 602123, 602415, 603459, 605036, 606614, 607445, 606965, 605330, 603362, 601788, 600711, 599894, 599205, 598565, 597839, 597161, 597101, 598092, 599936, 602203, 604887, 608230, 612228, 616911, 622952, 631223, 641661, 653176, 664914, 677068, 690178, 704121, 718188, 731798, 744778, 757165, 769233]
58890G69233J2386J3398J4578J5252J5196J4669J4054J3552J3062J2207J0560
58879I18147P984M760J402j591l876n370o407p571r172j0813j1681j1399j0487
58866H53926r850r883j0194j0165r481q241o873o006o018o557o848o767p007p900
58852G42136q633q369p674p877r097r916r260p739o733o779p356p742p559o869
58838F30533o232o344p159p681p044n590m354l750l345k825k501k679k946k531
58824E65552j234K72J136J291J495K397L721M641M819M589M246L640K691J766
58810F01022J223R91R02R67J025N49o09j748k242k576l666n367o531o620o309
58795E71011o206n875m746l357k794l155l398k811j919j603j839j728o61J058
$$ y = [769233, 781619, 795017, 809595, 824847, 840043, 854712, 868766, 882318, 895380, 907587, 918147, 926131, 930891, 932293, 930702, 926826, 921456, 915049, 907478, 898306, 887493, 875812, 864413, 853926, 844076, 834193, 823999, 813834, 804353, 796112, 789239, 783233, 777215, 770658, 763810, 757043, 750036, 742136, 733503, 725134, 717460, 709583, 700486, 690570, 681310, 673571, 666838, 660059, 652703, 644961, 637402, 630533, 624301, 617957, 610798, 603117, 596073, 590483, 586129, 582379, 579034, 576209, 573708, 571029, 568083, 565552, 564318, 564590, 565726, 567017, 568512, 570909, 574630, 579271, 584090, 588679, 592925, 596565, 599256, 601022, 602245, 603236, 604138, 605105, 606130, 606679, 606070, 604322, 602080, 599504, 595838, 590471, 583940, 577320, 571011, 564805, 558930, 554184, 550827, 548033, 544878, 541480, 538669, 536750, 535147, 533308, 531580, 530919, 531977]
58781E31977K639L555L737L453L178L421M233M887M362K366k54k244l125l548
58767E58637m510o273q063q837q360p417o904o821o333m804k520l50J138K049
58753D90632K778L463L835L594K853K182K112K659L418M042M429M554M362M036
58739E38949M063M768N813O407O124N374M887M858M833M460M030M000M240M215
58725F07021L876L746L978L879K814J188ml28q7M57J382K602L617L962L616K874
58709F44593K078J451R34J33j272l144n086o850q267r085r361r795j0940j2267
58695E73122j2709j2158j1610j1618j1486j0403q668p254o553o141n557m762m001
58682D60202l496l252l046k709k396k289k102j365k28O30J003J473K453L533M193
$$ y = [531977, 534616, 538171, 541908, 545361, 548539, 551960, 556193, 561080, 565442, 567808, 567554, 565310, 562185, 558637, 554127, 547854, 539791, 530954, 522594, 515177, 508273, 501452, 495119, 490315, 487795, 487445, 488583, 490632, 493410, 496873, 500708, 504302, 507155, 509337, 511449, 514108, 517526, 521568, 525997, 530551, 534913, 538949, 543012, 547780, 553593, 560000, 566124, 571498, 576385, 581243, 586076, 590536, 594566, 598566, 602806, 607021, 610897, 614643, 618621, 622500, 625314, 626502, 626498, 626170, 626083, 626540, 627922, 630524, 634141, 638103, 641719, 644593, 646671, 648122, 649056, 649189, 647917, 644773, 639687, 632837, 624570, 615485, 606124, 596329, 585389, 573122, 560413, 548255, 536645, 525027, 513541, 503138, 494470, 487216, 480663, 474522, 468965, 464203, 460202, 456706, 453454, 450408, 447699, 445303, 443014, 440912, 439547, 439319, 439949, 440952, 442425, 444878, 448411, 452604]
58667D52604M602N275O349P564Q702R564R868R512Q654P269N072K096j030l706
58653E32395n808p222p649p256o982p427p921p426o034m789m263m034l508k573
58639D49503j439m01J82J70j7K90J233K206K504J975J140O98Q30J009O92J40l1
58622D60684K5n04j636k206j453j33O80J141J985L048L564L558L780M301M353
58607D81187L591K599J958J604J316J116R57O36K45J77N57J081J542J993K412
58592E02971K602K453K007J433J307K528N252Q189R787R984R969J0404J0835J0863
58578E90584J0771J0691J0147Q935P701P160P243P505P833Q362R079R899J0934
58565G06844J2344J4149J6186J8039J9191J9632K0083K0987K1513K0373J7530
$$ y = [452604, 457206, 462481, 468830, 476394, 485096, 494660, 504528, 514040, 522694, 529963, 535035, 537131, 536101, 532395, 526587, 519365, 511716, 504460, 497478, 490051, 482130, 474704, 468670, 463881, 459618, 455584, 452076, 449503, 448064, 447663, 447845, 448015, 447998, 448288, 449521, 451727, 454231, 456206, 457346, 458044, 458874, 459883, 460575, 460715, 460684, 460709, 460205, 458569, 456363, 454910, 454777, 455457, 456598, 458583, 461631, 465195, 468753, 472533, 476834, 481187, 484778, 487377, 489335, 490939, 492255, 493371, 494328, 494964, 495209, 495386, 495943, 497024, 498566, 500559, 502971, 505573, 508026, 510033, 511466, 512773, 515301, 520553, 528742, 538529, 548513, 558482, 568886, 579721, 590584, 601355, 612046, 622193, 631128, 638829, 645989, 653232, 660737, 668570, 676932, 686011, 695910, 706844, 719188, 733337, 749523, 767562, 786753, 806385, 826468, 847455, 868968, 889341, 906871]
58554I06871J4145J0779O850K137k301n334o999p863p987p357o631o576p085p586
58540H75063q140r379j1473j3813j5723j7018j7916j8707j9474j9879j9409j7928
58528F86204j5779j3282j0527p828n827m777m169l466k746k254j820j242q10q56
58514F10821j095j043q28r59j443j726j500j025p08p41j135j676j933j666j175
58499E92168r12q58p04m85n17p12n36K36J181J853K336K937L679M418N241O349
58483F15674P618Q629R172R508J0050J0952J2071J3139J3760J3458J2042R887
58471G45960P576N219K476p03l680n726o683o865o555n859m803l286j243R57K642
58456G19427L707M880O652Q348Q993Q742Q575Q745Q346O547L526P5l112n596p296
$$ y = [906871, 921016, 931795, 938645, 940782, 938481, 933147, 926148, 918285, 910298, 902941, 896310, 889734, 882649, 875063, 866923, 857544, 846071, 832258, 816535, 799517, 781601, 762894, 743420, 723541, 704132, 686204, 670425, 657143, 646616, 638788, 632961, 628184, 624015, 620549, 617803, 615549, 613729, 612487, 611677, 610821, 609726, 608683, 607855, 606896, 605453, 603727, 602227, 601202, 600494, 599753, 598618, 596942, 595009, 593343, 592168, 591256, 590398, 589694, 589209, 588692, 587980, 587444, 587680, 588861, 590714, 593050, 595987, 599666, 604084, 609325, 615674, 623292, 631921, 641093, 650601, 660651, 671603, 683674, 696813, 710573, 724031, 736073, 745960, 753536, 758755, 761231, 760528, 756848, 751122, 744439, 737574, 731019, 725160, 720357, 717071, 715828, 716785, 719427, 723134, 728014, 734666, 743014, 752007, 760749, 769324, 778069, 786415, 792962, 796488, 796563, 793451, 787855, 780559]
58441G80559q572r710j0338r900q661p449o387m734k327k44N06L09M34J553L285
58426G18324M809N586N682N686O062O508O303N279L920K462N88j843m337o376
58412G58653p820q550q326p412o671o561o620o295n684m995l922k214m32N67P03
58397F84421P05J170J993K652K788K578K591L081L620L669L389L269L166K548
58383G21640J680J590K653M060N020N630O189O603O882P383Q011Q121P717P826
58369H01005Q948J0014R781Q535P488P165P291P804Q894J0265J1217J1417J1014
58356I20838J0253R378Q616P804O414M412K564J502J008P51R80J949L259M437
58342I84165N522O505O961O971P570R316J1153J1805J1654J2062J3215J3985J3734
$$ y = [780559, 771987, 762277, 751939, 742039, 733378, 725929, 719542, 714808, 712481, 712237, 712743, 713052, 713486, 715039, 718324, 723133, 728719, 734401, 740087, 746149, 752657, 758960, 764239, 768159, 770621, 771209, 769366, 765029, 758653, 750833, 742283, 733957, 726545, 719874, 713313, 706693, 700398, 694714, 689719, 685797, 683583, 683151, 683718, 684421, 685126, 686296, 688289, 690941, 693729, 696307, 698898, 701979, 705599, 709268, 712657, 715926, 719092, 721640, 723320, 724910, 727563, 731623, 736643, 742273, 748462, 755065, 761947, 769330, 777341, 785462, 793179, 801005, 809953, 819967, 829748, 838283, 845771, 852936, 860227, 868031, 876925, 887190, 898407, 909824, 920838, 931091, 940469, 949085, 956889, 963303, 967715, 970279, 971781, 972789, 973540, 974520, 976469, 979728, 984165, 989687, 996192, 1003153, 1010124, 1017694, 1027010, 1038163, 1049968, 1061622, 1073684, 1086899, 1100884, 1114618]
58329A114618J3019J2425J1776J0787R671Q763P972O893N277L427K107J751J829
58316A210315J517J102J786L840N994P228Q134R649J1409J2379J2419J2231J2233
58303A310236J2475J3172J4432J5863J7098J8184J8922J8641J7393J6481J6875
58292A489772J7953J8715J9309K0295K1306K1742K2033K2945K4224K5096K5528
58281A728918K5964K6450K7042K8247L0012L1178L1160L1217L2751L5345L7816
58270B066100M0159M2830M5188M6466M7437M9311N1662N3342N4648N6687N9199
58259B613029O1004O2058O3142O4043O4016O3525O3687O4457O5176O6343O8872
58248C319352P2219P5269P8500Q3147Q8884R4466J00094J06898J14637J22231
$$ y = [1114618, 1127637, 1140062, 1151838, 1162625, 1172296, 1181059, 1189031, 1195924, 1201201, 1204628, 1206735, 1208486, 1210315, 1211832, 1212934, 1214720, 1218560, 1224554, 1231782, 1239916, 1249565, 1260974, 1273353, 1285772, 1298003, 1310236, 1322711, 1335883, 1350315, 1366178, 1383276, 1401460, 1420382, 1439023, 1456416, 1472897, 1489772, 1507725, 1526440, 1545749, 1566044, 1587350, 1609092, 1631125, 1654070, 1678294, 1703390, 1728918, 1754882, 1781332, 1808374, 1836621, 1866633, 1897811, 1928971, 1960188, 1992939, 2028284, 2066100, 2106259, 2149089, 2194277, 2240743, 2288180, 2337491, 2389153, 2442495, 2497143, 2553830, 2613029, 2674033, 2736091, 2799233, 2863276, 2927292, 2990817, 3054504, 3118961, 3184137, 3250480, 3319352, 3391571, 3466840, 3545340, 3628487, 3717371, 3811837, 3911931, 4018829, 4133466, 4255697]
58238D255697J30032J39221J49437J59310J68947J79621J91538K04138K17853
58229E795794K33324K49783K66617K85391L07698L32394L57945L85965M19086
58220H633997M56901M97843N43640N97700O60356P30241Q09385R02500J012264
58211A4844827J140269J291873J475247J696291J958861K268464K630721L048510
58203C0355063L526471M075955M709117N431496O248166P173083Q222289R401516
58195G9143156J0712532J2169125J3792478J5586714J7519528J9512035K1439478
58188A89875046K3172868K4640866K5768279K6204372K5088190K1296679J4232025
58181C50278325M526652o061711j5556426k2692571k7174464k9310401k9567269
$$ y = [4255697, 4385729, 4524950, 4674387, 4833697, 5002644, 5182265, 5373803, 5577941, 5795794, 6029118, 6278901, 6545518, 6830909, 7138607, 7471001, 7828946, 8214911, 8633997, 9090898, 9588741, 10132381, 10730081, 11390437, 12120678, 12930063, 13832563, 14844827, 15985096, 17276969, 18752216, 20448507, 22407368, 24675832, 27306553, 30355063, 33881534, 37957489, 42666606, 48098102, 54346268, 61519351, 69741640, 79143156, 89855688, 102024813, 115817291, 131404005, 148923533, 168435568, 189875046, 213047914, 237688780, 263457059, 289661431, 314749621, 336046300, 350278325, 354804977, 348743266, 333186840, 310494269, 283319805, 254009404, 224442135]
58174B24442135k8392674k6223975k3486187k0540708j7650408j4982113j2621614
58167H0544456j0592354q881079p458760o287711n325437m533242l880647l341161
58159C0244065k890173k509788k190204j923353j699200j509456j349720j215653
58151A4956518j101131j001689r15546q39769p69369p01689o38029n79664n25693
58142G883939m75786m31198l91824l55610l22133k93559k70983k52841k37768
58133D852237k25815k15864k05229j93165j81773j72162j62612j51841j41250
58124C202526j32468j25030j17995j11568j05813r9797r3227q7073q1609p5842
58114B172104o9722o4757o1501n8616n5375n2925n1940n1075m9096m6651m4687
$$ y = [224442135, 196049461, 169825486, 146339299, 125798591, 108148183, 93166070, 80544456, 69952102, 61071023, 53612263, 47324552, 41999115, 37465873, 33585226, 30244065, 27353892, 24844104, 22653900, 20730547, 19031347, 17521891, 16172171, 14956518, 13855387, 12853698, 11938152, 11098383, 10329014, 9627325, 8989296, 8409632, 7883939, 7408153, 6976955, 6585131, 6229521, 5907388, 5613829, 5342846, 5090005, 4852237, 4626422, 4410558, 4205329, 4012164, 3830391, 3658229, 3495617, 3343776, 3202526, 3070058, 2945028, 2827033, 2715465, 2609652, 2509855, 2416628, 2329555, 2247946, 2172104, 2102382, 2037625, 1976124, 1917508, 1862133, 1809208, 1757268, 1706193, 1657097, 1610446, 1565759]
58103A565759m2851m0672l8670l7134l5347l3039l1050k9655k7862k5404k3619
58092A200456k3175k2727k1162j9547j9323j9929j9844j8940j8253j8232j8509
58081I80815j8757j8723j8095j7217j7091j7839j8172j7217j5917j5568j5887
58070G90332j5694j4771j3925j3636j3592j3262j2308j0765r215q315p925p406
58058F49518o886p197q355r271r404r419r736r709q992q368q357q237p447o798
58044E31342p110p682p383o421n754n487n132m923n616p145q474q712p728o070
58030D37705m824n027o443p530p259o424o401p288q095q149p415n922l986k545
58016C50397k404l261m147m471m056k807j109m7k77j031j137n84j97j54J17P32
$$ y = [1565759, 1522908, 1482236, 1443566, 1406432, 1371085, 1338046, 1306996, 1277341, 1249479, 1224075, 1200456, 1177281, 1154554, 1133392, 1113845, 1094522, 1074593, 1054749, 1035809, 1017556, 999324, 980815, 962058, 943335, 925240, 908023, 890932, 873093, 854921, 837704, 821787, 806219, 790332, 774638, 759867, 745942, 732306, 718714, 705452, 693144, 682379, 673164, 664849, 656924, 649518, 642632, 635435, 627080, 617809, 608405, 598986, 589250, 579541, 570549, 562181, 553824, 545587, 538140, 531342, 524232, 516550, 509167, 502746, 496992, 491505, 486373, 481450, 475834, 468689, 460215, 451503, 443775, 437705, 432881, 427854, 421411, 413881, 406622, 400198, 393797, 386509, 378414, 370265, 362850, 356928, 352942, 350397, 347993, 344732, 340585, 336114, 332058, 329251, 328142, 328095, 327818, 326787, 325650, 325066, 324869, 324715, 324832, 325564]
58000C25564J129R54M31j34m17J23J693L458M281M129L935L987L412J565q33k452
57984C50825k835k726l056l959m727m653l829k993k647k676k776k866k901k759
57970C05422k580k669k839k405j283m24n95j205j059J22J525K314K206J308Q3
57955B97921p20q17q51j523k475k750k156j411r75n51J09O81Q44P88Q88J243J869
57938B90114K912M368N789O617O746O576O484O408N961M935L518J968L13j438
57924C51271k999m201n397o941q291q409p221n922n522n764n825n440m741l747
57910B70851k606j823j552j175k17P35R37P56J108J852J937J118M82R09J863K252
57894B77427J836J308J291J801K506L105L364L080K231J182N49N70P30L13o44
$$ y = [325564, 326693, 327647, 328078, 327944, 327527, 327650, 329343, 332801, 337082, 341211, 345146, 349133, 352545, 354110, 353277, 350825, 347990, 345264, 342208, 338249, 333522, 328869, 325040, 322047, 319400, 316724, 313948, 311082, 308181, 305422, 302842, 300173, 297334, 294929, 293646, 293222, 292627, 291422, 290363, 290485, 292010, 294324, 296530, 297838, 297921, 297201, 296384, 295533, 294010, 291535, 288785, 286629, 285218, 284243, 283692, 283801, 284482, 285326, 286114, 287002, 288245, 290114, 293026, 297394, 303183, 309800, 316546, 323122, 329606, 336014, 341975, 346910, 350428, 352396, 352709, 351271, 348272, 344071, 338674, 331733, 323442, 315033, 307812, 301890, 296368, 290604, 284779, 279339, 274598, 270851, 268245, 266422, 264870, 263695, 263478, 264213, 265150, 265906, 267014, 268866, 270803, 271921, 272403, 273312, 275175, 277427, 279263, 280571, 281862, 283663, 286169, 289274, 292638, 295718, 297949, 299131, 299680, 300250, 300980, 301293, 300649]
57879C00649j390j512j451j733k293k865l540m341m730m299l547l266l262k559
57865B59861r14O21J001N15L89J306K756L783M087M114M266M385M238M133M524
57850B99065N167N321M756L920L043J852L89o86j016j073j327j595j700j969k465
57835C11682k535j862j290j639k296k128j279r33j476k086k147j941j837j717
57821B86516j513j511j796j949j591q19p3J40o06k196l822m697m970n411o352
57806B49350p458q356q857q665p528n781m209l334l156l428l692l282j917j65
57792A79522J211K089K682K835K438K157K690L566L749L381L698N136O695P491
57778B29340P792Q113Q242P843P235O930O894O744O202M986K912M93j107j298
$$ y = [300649, 299259, 297747, 296296, 294563, 292270, 289405, 285865, 281524, 276794, 272495, 268948, 265682, 262420, 259861, 258947, 259568, 260569, 261084, 261473, 262779, 265535, 269318, 273405, 277519, 281785, 286170, 290408, 294541, 299065, 304232, 309553, 314309, 318229, 321272, 323124, 323513, 322827, 321811, 320738, 319411, 317816, 316116, 314147, 311682, 309147, 307285, 305995, 304356, 302060, 299932, 298653, 297720, 296244, 294158, 292011, 290070, 288233, 286516, 285003, 283492, 281696, 279747, 278156, 277337, 277264, 277404, 276798, 274602, 270780, 266083, 261113, 255702, 249350, 241892, 233536, 224679, 216014, 208486, 202705, 198496, 195162, 192006, 188578, 184886, 181604, 179687, 179522, 180733, 182822, 185504, 188339, 190777, 192934, 195624, 199190, 202939, 206320, 210018, 215154, 221849, 229340, 237132, 245245, 253487, 261330, 268565, 275495, 282389, 289133, 295335, 300321, 303233, 303726, 302619, 301321]
57764C01321r17j360l061n138o301n964m663l496l017k827k431k148k540l275
57750B54183l409k736j996j684j549j360j289j278r16k98j44o53j052o85J32P51
57734B36017R94R04M61MK07J071J610J195N36P00J687K651L117L250L231L056
57718B60691K717K160J234Q9o33m98J48N94N29L3p87j795k688l259l632l946m063
57701B46894l801l208k458j777j453j566j685j303o69n48j202k208l282m375m936
57686B12423m150k262o36k6K80J123K358L716N617Q218J0646J2279J3960J6819
57672B80365K0601K4301K7825L1675L5485L8334M0359M2635M5166M5916M2111
57661F74773L1918J5311n489k6231m2491n2094n5590n4610n0481m4388l7740l1731
$$ y = [301321, 300404, 299044, 295983, 290845, 284544, 278580, 273917, 270421, 267404, 264577, 262146, 259998, 257458, 254183, 250774, 248038, 246042, 244358, 242809, 241449, 240160, 238882, 237966, 237668, 237524, 236871, 235819, 235134, 235266, 236017, 237011, 237915, 238376, 238380, 238587, 239658, 241268, 242463, 242999, 243699, 245386, 248037, 251154, 254404, 257635, 260691, 263408, 265568, 266802, 266891, 266258, 265760, 265908, 266502, 267031, 267064, 266277, 264482, 261794, 258535, 254903, 250957, 246894, 243093, 239885, 237427, 235650, 234197, 232631, 230946, 229643, 228974, 228426, 227224, 225016, 221734, 217359, 212423, 208273, 206011, 205375, 205349, 205629, 206752, 209110, 212826, 218443, 226661, 237307, 249586, 263546, 280365, 300966, 325267, 353092, 384767, 420252, 458586, 498945, 541580, 586746, 632662, 674773, 706691, 722002, 716513, 690282, 647791, 595697, 540107, 485497, 435016, 390628, 352888, 321157]
57649C21157k6762k2579j8818j5396j2614j0791r657q396o654n029m197l958l678
57636A72628l222k774k210j339n09j85k05k14m55j278k169k229j483q18o88q60
57620A51990j225j933k649k718k178j723j544j151m07J29J53K1J9j1j70l65p51
57603A35487j515k177k030j334j086j349j127j48M78o3j103j784k349l199l696
57588A13005l126k161k017k579k617j726q26o81r72j131j202j395j497j238r60
57573H8877j352k517l653l782k771j515j021j350j699j465q97n44m43j87L72Q86
57557F6939R55N25j78q78j342j401j111q25q61r39l04J241K607K356N25j177j355
57540F4777m56J51J8k33j40J63N37R02Q44J0j082j485j099o63m99k77p2m99j432
$$ y = [321157, 294395, 271816, 252998, 237602, 224988, 214197, 204540, 196144, 189490, 184461, 180264, 176306, 172628, 169406, 166632, 164422, 163083, 162574, 162389, 162184, 161970, 161515, 160237, 158068, 155839, 154356, 153538, 152850, 151990, 150765, 148832, 146183, 143465, 141287, 139564, 138020, 136869, 136462, 136591, 136744, 136765, 136784, 136773, 136603, 136238, 135487, 133972, 131795, 129765, 128431, 127345, 125996, 124869, 124721, 125199, 125136, 124033, 122249, 119900, 116701, 113005, 109879, 107718, 105701, 103122, 100505, 98779, 97953, 97272, 96300, 95169, 93967, 92572, 91075, 89837, 88877, 87525, 85008, 81355, 77573, 74802, 73287, 72266, 70916, 69217, 67752, 66855, 66311, 65868, 65681, 66053, 66939, 67894, 68419, 68241, 67363, 66021, 64620, 63509, 62684, 61823, 60884, 60580, 61821, 64428, 66784, 67309, 66132, 64777, 64321, 64472, 64490, 64257, 64117, 64280, 64817, 65719, 66563, 66573, 65491, 64006, 62907, 62244, 61745, 61468, 61396, 60897, 59465]
57521E9465j743q70K81O69M91M67O29O68P74J187J435R92K55p5k30r45k011k369
57503E9070j768j179j293j492r45n0pj170k498k802k060j206q87q93q50q82j216
57486C7872j526j282n74P6N86J263J837J487J28j165j481j112q02o78n44n26p21
57469C2838p01k69r7p40j501j298l79N3k22j69O31J122L85r40j609j478j386j710
57451B2530j903j392k96Q35J496J422O90j89n92l82k4L7j30k18k76o47j372j968
57433A7621j993j523r41m45m7K04K84L51N09M98L8o53j065j102j093j117r12m98
57415H116l16n33p01m51o9Nj54j39J69N04N08mq93j621j659j134p12A69g38q58
57395a596p34p19o76m46j10L52J143g15A750K039J285P21L05J2J57O06M68n66
$$ y = [59465, 57722, 56852, 57133, 57802, 58293, 58760, 59389, 60057, 60831, 62018, 63453, 64445, 64700, 64625, 64395, 63450, 61439, 59070, 57302, 56123, 54830, 53338, 52393, 52343, 52336, 51166, 48668, 45866, 43806, 42600, 41713, 40820, 39970, 39088, 37872, 36346, 35064, 34490, 34566, 35152, 36415, 38252, 39739, 39867, 38702, 37221, 36109, 35307, 34629, 34085, 33559, 32838, 32137, 31868, 31771, 31031, 29530, 28232, 27853, 27906, 27684, 27515, 28146, 29268, 29653, 28713, 27104, 25626, 24240, 22530, 20627, 19235, 18939, 19774, 21270, 22692, 23382, 23193, 22601, 22219, 22195, 22232, 22102, 21884, 21608, 20961, 19589, 17621, 15628, 14105, 13164, 12719, 12672, 12876, 13160, 13511, 14020, 14518, 14556, 13903, 12838, 11736, 10643, 9526, 8614, 8116, 7800, 7267, 6566, 6115, 6046, 6051, 5897, 5758, 5927, 6431, 6939, 6935, 6042, 4421, 2762, 1628, 916, 169, -738, -1596, -2330, -3049, -3725, -4171, -4281, -3929, -2786, -715, 1750, 3789, 5074, 5795, 6100, 6112, 6269, 6875, 7343, 6777]
57377F777j377q79K65N25l50j268j627B19a879j878j097o04r84j734k102k030
57361a2308j815j389n29N90J422J466O04o48j242m92R87J767J188k3q42j029q96
57344a3189o17k26N3j21q30j813k582k673k047j255q59p74n73l29n47j239j773
57327c1394j859j989k552l117l105k673k359k212j897j456j332j651j974j955
57313f1525j792j785j805j499r64p44j005j120n03L77M38m93j307j045p7O00O47
57296g3602L06l90j449k290k246j607j293j512j680j643j972k795l347l113k572
57281a01205k294k113j804j859k755l948m384l821k931k290j842j381r88q91j151
57266a35657j558j660j115j75L71Rr12j665j987k105k133j901j346p36m49o62
$$ y = [6777, 5400, 4521, 4786, 5311, 4961, 3693, 2066, 219, -1879, -3757, -4854, -5458, -6442, -8176, -10278, -12308, -14123, -15512, -16041, -15451, -14029, -12563, -11959, -12607, -13849, -14341, -13354, -11587, -10399, -10422, -11264, -12293, -13189, -13806, -14032, -13979, -14100, -14930, -16743, -19325, -21998, -24045, -25300, -26159, -26933, -27506, -27835, -28382, -29621, -31394, -33253, -35242, -37794, -40911, -44016, -46689, -49048, -51260, -53157, -54613, -55945, -57596, -59570, -61525, -63317, -65102, -66907, -68406, -69370, -70114, -71119, -72239, -72742, -72365, -71927, -72420, -73727, -74772, -74849, -74249, -73602, -73296, -73686, -75135, -77425, -79671, -81278, -82571, -84083, -85763, -87406, -89378, -92173, -95520, -98633, -101205, -103499, -105612, -107416, -109275, -112030, -115978, -120362, -124183, -127114, -129404, -131246, -132627, -133615, -134506, -135657, -137215, -138875, -139990, -140165, -139794, -139785, -140697, -142362, -144349, -146454, -148587, -150488, -151834, -152570, -153019, -153681]
57250a53681j217j624j336l44N82N45m69j476j520p48k17p33k061l339l995m050
57234a75683l697l015k208j674j609j787j917j944j848j516j112j135j718k256
57220b03119k154j639j321j321j339j308j305j093m23L28N68L49J77P0l49r23
57204b14802j008n37j91l47n92n49m34m86n35m07k76l20m69o65r88j418j858k368
57186b28250k903l064k677k400k961l971m467m394m531m924m686l538k294j478
57172b76538o40N09J386J544J416J416J202L85q53k286m038n982p628q989j0560
57157c09656j2178j2967j2921j3239j4548j5986j6836j7713j9345k1369k3335
57146d90093k5590k8140k9819k9912k9547l0196l1698l3017l4109l5683l7868
$$ y = [-153681, -154898, -156522, -157858, -158202, -157620, -157075, -157544, -159020, -160540, -161288, -161505, -162238, -164299, -167638, -171633, -175683, -179380, -182395, -184603, -186277, -187886, -189673, -191590, -193534, -195382, -196898, -198010, -199145, -200863, -203119, -205273, -206912, -208233, -209554, -210893, -212201, -213506, -214599, -215022, -214694, -214126, -213777, -213600, -213530, -213879, -214802, -215810, -216347, -216538, -216885, -217477, -218026, -218460, -218946, -219481, -219888, -220164, -220484, -220953, -221618, -222606, -224024, -225882, -228250, -231153, -234217, -236894, -239294, -242255, -246226, -250693, -255087, -259618, -264542, -269228, -272766, -275060, -276538, -277178, -276669, -275283, -273739, -272323, -270907, -269705, -269320, -270173, -272459, -276497, -282479, -290107, -299096, -309656, -321834, -334801, -347722, -360961, -375509, -391495, -408331, -426044, -445389, -466758, -490093, -515683, -543823, -573642, -603554, -633101, -663297, -694995, -728012, -762121, -797804, -835672]
57135h35672m0373m3335m6791m9949n2214n4349n7531o1857o6716p1885p7331
57124a458003q2828q8740r6186j05376j14961j24173j34304j46806j61309j77100
57114b689786j95115k16641k41476k69317l01739l40679l86275m38370m98896
57105e578294n70216o52164p43193q43686r56099j083340j229373j399360j595238
57096a4650963j811627k038839k269414k500414k732609k970615l218996l470819
57088c5664296l701351l879906l989083m031944m030487m029264m090491m255121
57080f7671943m490399m685464m713210m495755m009778l249723k211178r09242
57072i6436692O05443K251018L918165N466356O739763P613645Q036570Q033131
$$ y = [-835672, -876045, -919380, -966171, -1016120, -1068334, -1122683, -1180214, -1242071, -1308787, -1380672, -1458003, -1540831, -1629571, -1725757, -1831133, -1946094, -2070267, -2204571, -2351377, -2512686, -2689786, -2884901, -3101542, -3343018, -3612335, -3914074, -4254753, -4641028, -5079398, -5578294, -6148510, -6800674, -7543867, -8387553, -9343652, -10426992, -11656365, -13055725, -14650963, -16462590, -18501429, -20770843, -23271257, -26003866, -28974481, -32193477, -35664296, -39365647, -43245553, -47234636, -51266580, -55297067, -59326331, -63416822, -67671943, -72162342, -76847806, -81561016, -86056771, -90066549, -93316272, -95527450, -96436692, -95831249, -93580231, -89662066, -84195710, -77455947, -69842302, -61805732, -53772601]
57064e3772601P676557P062525O293471N463680M645374L885432L211274K635346
57056a2898942K156499J764582J447586J194482R93569Q32525P01049N91639M98114
57047b718897M15624L41951K76898K20358J72285J33640J05165Q5396P1496O1780
57037h34304N5885N2942N1264M9819M8508M7160M5557M4104M3128M1827L9259
57026c14851L6135L4175L3887L4153L3873L2698L0356K6610K2003a3410A68R804
57014I972O250L269P50j502k885k670j402m74l97n09l72j98R4R33K090K622K135
56997A7706J149J72o35q04J76J793K814L112L985O260R040J0991J1911J2406J2814
56982I2890J3188J3659J3937J2910R512M010k076p130j0242j1258j0550q796o735
$$ y = [-53772601, -46096044, -39033519, -32740048, -27276368, -22630994, -18745562, -15534288, -12898942, -10742443, -8977861, -7530275, -6335793, -5342224, -4509699, -3808650, -3217011, -2718897, -2303273, -1961322, -1684424, -1464066, -1291781, -1158141, -1052976, -967580, -896084, -834304, -778419, -725477, -674213, -624394, -575886, -528726, -483169, -439065, -395937, -354110, -314851, -278716, -244541, -210654, -176501, -142628, -109930, -79574, -52964, -30961, -13410, 168, 9972, 16222, 19491, 20241, 18739, 15854, 13184, 11782, 11308, 10911, 10402, 10030, 9832, 9926, 10859, 12949, 15571, 17706, 18855, 19027, 18392, 17588, 17764, 19557, 22371, 25483, 29468, 35728, 44768, 55759, 67670, 80076, 92890, 106078, 119737, 133674, 146584, 156096, 160106, 158030, 150900, 140658, 129400, 118850, 110054, 103319]
56969A03319n019l993l372k240M7K953N296O651P713R197J1059J2891J4445J5453
56955A74400J5456J4182J1612P602K054m250r674j3041j4455j4522j3437j1336
56943A44591q901o775m678j874J637N007P655R887J2281J4893J7283J9132K0612
56930B30750K2031K3049K2357J8494J1270K207o541j3596j8666k1948k3588k3635
56918B22184k2169j9543j6482j3781j1714r885p833n601l600k154j333j050j120
56905A05919j249j172o93L24J766L153M042M620N488O782P997Q813R588J0654
56891A66032J1727J2458J3148J4304J5771J6934J7573J7830J7371J5277J1074
56880C29499N417m94n809j0089j2850j3602j2382r997p377m811j988J245M516
$$ y = [103319, 98300, 94307, 90935, 88695, 88742, 91695, 96991, 103642, 111355, 120552, 131611, 144502, 158947, 174400, 189856, 204038, 215650, 223252, 225306, 221056, 211382, 198341, 183886, 169364, 155927, 144591, 135690, 128915, 124237, 122363, 124000, 129007, 136662, 146549, 158830, 173723, 191006, 210138, 230750, 252781, 275830, 298187, 316681, 327951, 330158, 323617, 310021, 291355, 269407, 245819, 222184, 200015, 180472, 163990, 150209, 138495, 128610, 120777, 115176, 111576, 109422, 108089, 107039, 105919, 104670, 103498, 102805, 103129, 104895, 108048, 112090, 116710, 122198, 128980, 136977, 145790, 155378, 166032, 177759, 190217, 203365, 217669, 233440, 250374, 267947, 285777, 303148, 318425, 329499, 334916, 334422, 328613, 318524, 305674, 292072, 279690, 269693, 262316, 257505, 255517, 256762, 261278]
56867B61278P599J1018J5515K0949K6312L0874L4732L8107M0723M2077M1632L8275
56855F09091L0488J7974K865j1403k2338k9108l1667l0292k5994k0340j4385q215
56843D66676j657N160J2026J8924K5787L2519L9374M6769N4418O1225O6233O9010
56831H96464O8503O2237M7833K5624p01k6141m6855o0952o7997o8582o4272n7180
56819G07981m8980m0253l0880k1028j1482k947M636J1795J8719K5074L0634L5670
56807F78939M0432M4402M6079M3468L4907J9985K97k0719l9062n1901n8435n9436
56795F78956n6191m9965m2165l4334k7464k1435j5593r872m775l26M269R367J4077
56782D44549J7321J9324K1051K2394K1797J7859J0513O10j0759k1974l0902l6031
$$ y = [261278, 268877, 279895, 295410, 316359, 342671, 373545, 408277, 446384, 487107, 529184, 570816, 609091, 639579, 657553, 660418, 649015, 626677, 597569, 565902, 535610, 509616, 489276, 474891, 466676, 465019, 470179, 482205, 501129, 526916, 559435, 598809, 645578, 699996, 761221, 827454, 896464, 964967, 1027204, 1075037, 1100661, 1099960, 1073819, 1026964, 966012, 898015, 829433, 765161, 707981, 659001, 618748, 587868, 566840, 555358, 552411, 557047, 568842, 587561, 612635, 643269, 678939, 719371, 763773, 809852, 853320, 888227, 908212, 908509, 887790, 848728, 796827, 738392, 678956, 622765, 572800, 530635, 496301, 468837, 447402, 431809, 421937, 417162, 416836, 421105, 430472, 444549, 461870, 481194, 502245, 524639, 546436, 564295, 574808, 575418, 564659, 542685, 511783, 475752]
56770D75752l7515l6634l4452l1413k7820k4078k0507j7280j4583j2496j0811
56759B08163r227p702o405n392m571l887l358k967k718k650k659k496k118j889
56745A50124k083k355k063j137k73j29n90j007r81p10n62n88n87n40o76r90j023
56728A33830m00N36J023P73K43J8K36O66J033J099Q18M92N53J048J588J866J915
56711A47337J797J490J159J082J129Q49K90J38O79J212J017M02J47L31M27K63
56695A59749J22lm28j095j525j560j516j512j257p41m83p78j168j024l55L24O79
56678A47429Q19R79J276J701K181K596K769K487J705Q62P56J757L147L658K779
56663A76901J271L13L70R37J207Q14O7m33l49K07R84J759K152J744P00j03j07
$$ y = [475752, 438237, 401603, 367151, 335738, 307918, 283840, 263333, 246053, 231470, 218974, 208163, 198936, 191234, 184829, 179437, 174866, 170979, 167621, 164654, 161936, 159286, 156627, 154131, 152013, 150124, 148041, 145686, 143623, 142486, 142213, 142084, 141494, 140487, 139506, 138796, 138234, 137646, 137059, 136519, 135843, 134853, 133830, 133430, 133966, 134989, 135762, 136005, 136023, 136259, 136925, 137958, 139057, 139875, 140367, 140920, 141968, 143556, 145422, 147337, 149134, 150624, 151783, 152865, 153994, 154843, 155133, 155271, 155950, 157162, 158179, 158581, 158728, 159059, 159486, 159749, 159871, 159868, 159440, 158345, 156820, 155260, 153744, 152232, 150975, 150234, 149751, 148973, 147805, 146781, 146426, 146750, 147429, 148248, 149227, 150503, 152204, 154385, 156981, 159750, 162237, 163942, 164804, 165560, 167317, 170464, 174122, 176901, 178172, 178485, 178855, 179792, 180999, 181813, 181880, 181447, 181098, 181305, 182289, 184048, 186200, 187944, 188644, 188541, 188434]
56646A88434J17l50j380j945j574q77n14m68n50q61j294j306o90j15k32o98o90
56629A75007j14L74L82J43p0k94n58p27q51j194j741j992j535n60L93R91J174
56612A68828Q90J49o92j032o87j64j25o22j132j254j097r09p63o73p54q78m85
56595A58600P71K313L046K505J221n7r90j411j080p6R07J187Q59O13Q65J396J819
56578A72488J980J875J489R01M03K57M30P34J188J988L087M020M411M474M722
56563B04447N305N985O746P826R022R542R008Q097P581P104N719L455J486O16
56549B91939L64j63j121k029k532k567k215j777j721k213k868l347l863m703n476
56534B55708n387m270k902k195k346k905l402l669l669l333k703k092j822j785
$$ y = [188434, 188551, 188201, 186821, 184876, 183302, 182425, 181911, 181443, 180893, 180032, 178738, 177432, 176742, 176627, 176395, 175697, 175007, 174893, 175267, 175649, 175792, 175722, 175428, 174870, 174143, 173292, 172098, 170357, 168365, 166830, 166270, 166663, 167654, 168828, 169718, 169867, 169175, 168143, 167456, 167292, 167167, 166545, 165413, 164159, 163062, 162153, 161390, 160717, 159963, 159085, 158600, 159371, 161684, 164730, 167235, 168456, 168399, 167409, 165998, 164918, 164842, 165749, 166936, 167795, 168408, 169273, 170669, 172488, 174468, 176343, 177832, 178733, 179136, 179393, 179823, 180557, 181745, 183733, 186820, 190840, 195251, 199725, 204447, 209752, 215737, 222483, 230309, 239331, 248873, 257881, 265978, 273559, 280663, 286382, 289837, 291323, 291939, 292303, 292140, 291019, 288990, 286458, 283891, 281676, 279899, 278178, 275965, 273097, 269750, 265887, 261184, 255708, 250321, 246051, 243149, 240954, 238608, 235703, 232301, 228632, 224963, 221630, 218927, 216835, 215013, 213228]
56520B13228j530r63n82p30r44n38K83N13l64j735k671k926k816k547k083j516
56504A92079j187j377j973k402k065j015q9q9q04j294j079n72k83j59R5M87Q19
56487A79092R74Q69M74J00K33Q43J213P91o8n49k65N24J323J695J433P35N8l29
56469A89146m76l66J50Q69J149O20k91q53p87l43K3p9o79j218j003p8P88J123
56451A87695J214J382J467J371J422J730J807J308O40K41o8m85o29k27K43K98
56435A99409L12P29J083P86L99R00J982K336J556N64N1l17q72j163o84M03J595
56418B09069K447K480J472J18m24K8M21k3q03j139j184j523k005j888r26L08J125
56401B07553J308J054O97M44K94K17L77R17J482J462Q32L81P50J580J969J530
$$ y = [213228, 211698, 210735, 210153, 209423, 208479, 207941, 208224, 208737, 208373, 206638, 203967, 201041, 198225, 195678, 193595, 192079, 190892, 189515, 187542, 185140, 183075, 182060, 181971, 181882, 181078, 179784, 178705, 178133, 177850, 177691, 177786, 178273, 179092, 180066, 180935, 181409, 181509, 181742, 182585, 183798, 184589, 184521, 183972, 183707, 184231, 185554, 187249, 188682, 189417, 189475, 189146, 188670, 188304, 188454, 189323, 190472, 191092, 190801, 189948, 189161, 188818, 188841, 188762, 188083, 186865, 185862, 185784, 186572, 187695, 188909, 190291, 191758, 193129, 194551, 196281, 198088, 199396, 200036, 200277, 200209, 199724, 199095, 198868, 199111, 199409, 199721, 200450, 201533, 202319, 202718, 203618, 205600, 207936, 209492, 210056, 210107, 209790, 208918, 207755, 207071, 207474, 209069, 211516, 213996, 215468, 215586, 215162, 215190, 215611, 215588, 214785, 213646, 212462, 210939, 208934, 207046, 206120, 206428, 207553, 208861, 209915, 210612, 211056, 211350, 211567, 211944, 212861, 214343, 215805, 216637, 217018, 217768, 219348, 221317, 222847]
56385B22847P12J53K7O5m4k86m32m07m19n91o47k42M64R62J058J023J093J101
56367B26437P64M3q28j474j531r85l24r4k78l87j25L60Q54J329J803K269K772
56350B30605L298L640L668L629L811L963L517K414J267O79P42J223J838K309K515
56335B69118K655K979L385L594L604L572L458L212L129L379L437K707J618J210
56321C11057J629J953J626J130R75R24P84R36J492J672Q78j86l96K52Q07Q22P51
56304C27106J010J449J882K432L135L724M067M447N085N697N816N461N096N032
56290C81439N113N168N430O218P279P948Q000P985Q457R261R920J0328J0607J0645
56276D93798J0365J0243J0936J2395J4003J5509J7224J9235K1126K2656K4144
$$ y = [222847, 223559, 223712, 223739, 223804, 223760, 223474, 223042, 222635, 222216, 221625, 220978, 220736, 221200, 222162, 223220, 224243, 225336, 226437, 227201, 227244, 226416, 224942, 223411, 222426, 222102, 222008, 221730, 221343, 221218, 221578, 222432, 223761, 225564, 227833, 230605, 233903, 237543, 241211, 244840, 248651, 252614, 256131, 258545, 259812, 260491, 261233, 262456, 264294, 266603, 269118, 271773, 274752, 278137, 281731, 285335, 288907, 292365, 295577, 298706, 302085, 305522, 308229, 309847, 311057, 312686, 314639, 316265, 317395, 318370, 319294, 320078, 321014, 322506, 324178, 325056, 324870, 324474, 324726, 325533, 326355, 327106, 328116, 329565, 331447, 333879, 337014, 340738, 344805, 349252, 354337, 360034, 365850, 371311, 376407, 381439, 386552, 391720, 397150, 403368, 410647, 418595, 426595, 434580, 443037, 452298, 462218, 472546, 483153, 493798, 504163, 514406, 525342, 537737, 551740, 567249, 584473, 603708, 624834, 647490, 671634]
56265F71634K5938K8031L0404L3342L7067M1438M6215N1347N6837O2640O8870
56254A153763P5849Q3766R2510J01749J11022J19841J28058J35959J43563J50051
56244B296131J54459J56768J57532J56453J52133J43518J30936J15362R7171P5986
56234C636449N1546K4526l305k9857n3933p5531r4820j11220j24017j33375j39917
56223B946546j43767j44904j44088j42224j38985j33340j25528j17291j09967
56214A746452j03461r7216r0993q4459p7275p0030o3921n9138n4658m9957m5603
56203I49741m1827l7922l3742l0310k8119k6218k3865k1702k0258j8660j6127
56192F50991j3541j2072j1281j0037q455p412o842o049n172m799m610l872k911
$$ y = [671634, 697572, 725603, 756007, 789349, 826416, 867854, 914069, 965416, 1022253, 1084893, 1153763, 1229612, 1313378, 1405888, 1507637, 1618659, 1738500, 1866558, 2002517, 2146080, 2296131, 2450590, 2607358, 2764890, 2921343, 3073476, 3216994, 3347930, 3463292, 3560463, 3636449, 3687995, 3712521, 3709216, 3679359, 3625426, 3549895, 3455075, 3343855, 3219838, 3086463, 2946546, 2802779, 2657875, 2513787, 2371563, 2232578, 2099238, 1973710, 1856419, 1746452, 1642991, 1545775, 1454782, 1370323, 1293048, 1223018, 1159097, 1099959, 1045301, 995344, 949741, 907914, 869992, 836250, 805940, 777821, 751603, 727738, 706036, 685778, 667118, 650991, 637450, 625378, 614097, 604060, 595605, 588193, 581351, 575302, 570130, 565331, 560721, 556849, 553938]
56179E53938k601k682k145j068n65q59q74m4Q94J256J380J752K146K218K283K938
56163E57967M299N972P419Q260Q503Q619R200J0512J2472J4735J6725J8068J9299
56150G02050K1519K4956K8542L1412L4121L7651M2080M7076N2957O0104O7764
56139A150232P4703Q0719Q6373R1275R3739R2203Q6296P6719O4997N3308M3517
56128A994081L6197L0874K6917K3519J9290J2960M558m715j3586k1199k7041l1446
56116B050409l5877m1854m9644n8573o8019p7173q4348q7815q7339q3906p8190
56105A297671p0329o1083n1974m4020l7204l1233k5992k1200j6502j2093q675
56094I17366o558n259m035k524j001j83m59j037m68J574L811N070N610O070O293
$$ y = [553938, 551337, 548655, 546510, 545442, 544877, 544018, 543144, 543100, 543994, 545250, 546630, 548382, 550528, 552746, 555029, 557967, 562266, 568238, 575657, 583917, 592420, 601039, 610239, 620751, 633223, 647958, 664683, 682751, 702050, 723569, 748525, 777067, 808479, 842600, 880251, 922331, 969407, 1022364, 1082468, 1150232, 1224935, 1305654, 1392027, 1483302, 1577041, 1669244, 1755540, 1832259, 1897256, 1950564, 1994081, 2030278, 2061152, 2088069, 2111588, 2130878, 2143838, 2148396, 2143681, 2130095, 2108896, 2081855, 2050409, 2014532, 1972678, 1923034, 1864461, 1796442, 1719269, 1634921, 1547106, 1459767, 1375861, 1297671, 1227342, 1166259, 1114285, 1070265, 1033061, 1001828, 975836, 954636, 938134, 926041, 917366, 910808, 905549, 901514, 898990, 897989, 897806, 897347, 896310, 895842, 897416, 901227, 906297, 911907, 917977, 924270]
56079I24270O116O301P424Q668R034R040R802J1163J2121J2560J3100J3714J3961
56066A057274J4139J4814J5616J5869J5922J6451J6964J6580J5741J5578J5953
56055A230901J5821J5184J4896J4903J4400J3544J3281J3628J3829J4017J5077
56044A389481J6937J8658K0002K1333K2327K2526K2825K4484K7009K8881L0048
56033A644511L1614L3428L4314L4575L5814L8207M0263M1434M2656M4099M4797
56022B065712M4893M5875M8086N0166N1500N3042N5226N7169N8576O0310O2643
56011B653198O4852O7022P0218P4436P8378Q1626Q5145Q9346R3676R8276J03970
56000C560143J10477J16775J23208J31082J40275J49608J59262J70260J81936
$$ y = [924270, 930386, 936687, 944111, 952779, 961813, 970853, 980655, 991818, 1003939, 1016499, 1029599, 1043313, 1057274, 1071413, 1086227, 1101843, 1117712, 1133634, 1150085, 1167049, 1183629, 1199370, 1214948, 1230901, 1246722, 1261906, 1276802, 1291705, 1306105, 1319649, 1332930, 1346558, 1360387, 1374404, 1389481, 1406418, 1425076, 1445078, 1466411, 1488738, 1511264, 1534089, 1558573, 1585582, 1614463, 1644511, 1676125, 1709553, 1743867, 1778442, 1814256, 1852463, 1892726, 1934160, 1976816, 2020915, 2065712, 2110605, 2156480, 2204566, 2254732, 2306232, 2359274, 2414500, 2471669, 2530245, 2590555, 2653198, 2718050, 2785072, 2855290, 2929726, 3008104, 3089730, 3174875, 3264221, 3357897, 3456173, 3560143, 3670620, 3787395, 3910603, 4041685, 4181960, 4331568, 4490830, 4661090, 4843026]
55991D843026J92767K03456K16189K31213K47338K65246K86728L10984L35706
55982G132653L61578L91652M26429M64041N05217N53428O09883O73352P45262
55973A1863495Q30003R30081J046363J183657J350613J553671J796525K085159
55965B2639567K426882K824665L279641L798995M393574N068641N826719O678998
55957E6937682P642598Q726497R933566J1278997J2793218J4500217J6394426
55950A38207201J8423749K0476270K2404505K4097043K5472531K6253597K5673339
55943C01008235K2565587J6056623O396382m853007j5518806k3833010k9000706
55936B72821298l1116275l0774349k8739412k5752525k2414077j9129515j6127497
$$ y = [4843026, 5035793, 5239249, 5455438, 5686651, 5933989, 6199235, 6485963, 6796947, 7132653, 7494231, 7885883, 8312312, 8776353, 9281570, 9834998, 10444881, 11118233, 11863495, 12693498, 13623579, 14669942, 15853599, 17204212, 18757883, 20554408, 22639567, 25066449, 27891114, 31170755, 34969750, 39363324, 44431965, 50258684, 56937682, 64580280, 73306777, 83240343, 94519340, 107312558, 121812775, 138207201, 156630950, 177107220, 199511725, 223608768, 249081299, 275334896, 301008235, 323573822, 339630445, 346026827, 341173820, 325655014, 301822004, 272821298, 241705023, 210930674, 182191262, 156438737, 134024660, 114895145, 98767648]
55929I8767648j3511794j1302166r465217p947835o700013n676540m833975m136383
55921C5193725l558769l080109k678696k337711k048689j805312j598659j421359
55913A6664421j270573j143389j033838r37236q52876p79701p13577o51334n93645
55904H688252n41654m94367m51159m13087l79774l48535l18360k91404k68943
55895E180969k49216k30748k14403k00532j87408j74141j62075j51810j41827
55886C468809j31541j22596j15679j09014j01503r4447q8742q3435p8604p6440
55876B466808p7506p8768p7465p4469p1864o9660o6976o4274o2171n9796n6316
55865A707543n2551m9415m6369m2891l9760l7492l5183l2368l0195k9322k8470
$$ y = [98767648, 85255854, 73953688, 64488471, 56540636, 49840623, 44164083, 39330108, 35193725, 31634956, 28554847, 25876151, 23538440, 21489751, 19684439, 18085780, 16664421, 15393848, 14250459, 13216621, 12279385, 11426509, 10646808, 9933231, 9281897, 8688252, 8146598, 7652231, 7201072, 6787985, 6408211, 6059676, 5741316, 5449912, 5180969, 4931753, 4701005, 4486602, 4286070, 4098662, 3924521, 3762446, 3610636, 3468809, 3337268, 3214672, 3098993, 2989979, 2888476, 2794029, 2705287, 2621852, 2543248, 2466808, 2389302, 2310534, 2233069, 2158600, 2086736, 2017076, 1950100, 1885826, 1823655, 1763859, 1707543, 1654992, 1605577, 1559208, 1516317, 1476557, 1439065, 1403882, 1371514, 1341319, 1311997, 1283527]
55854A283527k6657k5053k4844k4985k4026k2639k2281k2661k2552k2170k2703
55843A022956k4032k4754k4129k2650k0977j9444j8273j7405j6467j5438j4776
55832H04611j4465j3842j2815j2127j1993j1589j0528r477q756p700o273n730
55820F79316o698p991q484q772r663j0366r737q337p633p848p949p301o080m571
55806E67886l009j762q51K50J718K970L673M270M867M658L293J713O71n41k830
55791E86976n609p577q367q470q190p739p597p792p473o208m966m920o018p559
55777D88491r244j0619j0533q462n601l394j705L46K552L989M471M121K238j655
55763D54995o019q448q537q058q282q662q376p603o747n674m381l475l349l570
$$ y = [1283527, 1256870, 1231817, 1206973, 1181988, 1157962, 1135323, 1113042, 1090381, 1067829, 1045659, 1022956, 998924, 974170, 950041, 927391, 906414, 886970, 868697, 851292, 834825, 819387, 804611, 790146, 776304, 763489, 751362, 739369, 727780, 717252, 707775, 699019, 691319, 685046, 679316, 672618, 664627, 656143, 647371, 637708, 627342, 617605, 609268, 601635, 593787, 585838, 578537, 572457, 567886, 564877, 563115, 562264, 562514, 564232, 567202, 570875, 575145, 580012, 584670, 587963, 589676, 590347, 589806, 586976, 581367, 573790, 565423, 556953, 548763, 541024, 533427, 525635, 518162, 511954, 506988, 502068, 496050, 488491, 479247, 468628, 458095, 449633, 444032, 440638, 438933, 439279, 441831, 445820, 450291, 454412, 456650, 454995, 448976, 440528, 431991, 423933, 415651, 406989, 398613, 391010, 384263, 378589, 374208, 370733, 367384, 363814]
55749C63814l580l507l823m601n398n739n572n334n402n400m462k530r02q33j996
55734C04735k971k980k442k068k116k450k813l002l136l577m313m743m407l585
55720B60132k776k112j655j648j909j598l30J070J686J803K275L082L494L239
55706B64753K571J572L15n86o12k98o39j701k757l530m349n170n504n282m874
55691B33909m231k997j460m36o3L28J036J569J627J674K218L153M009M332L827
55676B48495K788K232K780L453K604K09j881k313j824j858k538k850k283j403
55662B45611q98p09k25Q47J936K034R32k44k34P08J094J83j122j647j466j496
55646B45304k116k847l185l192l289l806m693n476n614n047m365m233m756n378
$$ y = [363814, 360234, 356727, 352904, 348303, 342905, 337166, 331594, 326260, 320858, 315458, 310996, 308466, 307564, 306731, 304735, 301764, 298784, 296342, 294274, 292158, 289708, 286895, 283893, 280757, 277180, 272867, 268124, 263717, 260132, 257356, 255244, 253589, 251941, 250032, 248434, 248104, 249174, 250860, 252663, 254938, 258020, 261514, 264753, 267324, 268896, 269211, 268625, 268013, 267715, 267076, 265375, 262618, 259088, 254739, 249569, 244065, 238783, 233909, 229678, 226681, 225221, 224785, 224722, 225050, 226086, 227655, 229282, 230956, 233174, 236327, 240336, 244668, 248495, 251283, 253515, 256295, 259748, 262352, 262561, 260680, 258367, 256543, 254685, 252147, 249297, 247014, 245611, 244713, 244004, 243779, 244626, 246562, 248596, 249528, 249284, 249050, 249758, 250852, 251035, 249913, 248266, 246800, 245304, 243188, 240341, 237156, 233964, 230675, 226869, 222176, 216700, 211086, 206039, 201674, 197441, 192685, 187307]
55632A87307n345m294k609j183o96j041j542j659j314p22j88K7m9j69k81o93j460
55615A64089j952j581p45m34r40j622j897j834j597r89N8J025J239N54n93j619
55599A51162k105j942j382q22n19n28q77j511k175k629k796k540j585j35Q21N37
55583A30974k55m7J428K719K560J454Q24J201J970K521K921L483M207M844N164
55568A65968N134M898M630M254L440J939o4k065l590m433m711m721m664m491m096
55553A57428l576l134k766k247j464n55K43P43Q98Q86J020J320J412J069O66O85
55537A52628J047J431J987L054M176M304L189J886J402J494J281N51k34q57j585
55522A75754k503l244l535l578l703l866l741l199k570k314k506k703k440j805
$$ y = [187307, 181962, 177668, 175059, 173876, 173180, 172139, 170597, 168938, 167624, 166902, 166714, 166741, 166692, 166523, 166242, 165549, 164089, 162137, 160556, 159811, 159377, 158437, 156815, 154918, 153084, 151487, 150498, 150556, 151581, 152820, 153374, 152781, 151162, 149057, 147115, 145733, 144911, 144392, 143864, 142987, 141476, 139301, 136672, 133876, 131336, 129751, 129616, 130437, 130974, 130719, 130672, 132100, 134819, 137379, 138833, 139657, 140858, 142828, 145349, 148270, 151753, 155960, 160804, 165968, 171102, 176000, 180630, 184884, 188324, 190263, 190199, 188134, 184544, 180111, 175400, 170679, 166015, 161524, 157428, 153852, 150718, 147952, 145705, 144241, 143686, 143929, 144672, 145570, 146456, 147476, 148796, 150208, 151277, 151943, 152628, 153675, 155106, 157093, 160147, 164323, 168627, 171816, 173702, 175104, 176598, 177879, 178430, 178196, 177339, 175754, 173251, 170007, 166472, 162894, 159191, 155325, 151584, 148385, 145815, 143501, 140995, 138292, 135852, 134047]
55508A34047j359j482j988k406k420k003j282m55K51O38N67Lq77j661k013j959
55492A15601j711j313o93k5K97J40j62j81J63N76O71K99k22l06K51Q43O27m83
55474A14372j650j997j400l83L81M51j64r37j222q65k74J07J85P0j33l20m15m84
55456A05322n69m71m1L98L48k6l4M49N72l10j576k033j351k47M75N63J45m45o77
55437A00492k24N22Q35O25N11P55O87k84j563j913j043kJ23n40j020p23R6Q54
55419I8188J179J012O14N16J064J892K164J534N53o7k56l98o03o60n04l40k79
55402A05609k07q2n7k60n62p25o26l89k87m55o56m87M7M70M42K20K43N06O85O61
55382A04090N41L73J31j02l21p53j449j960j819j198n68J1P17J277J230P98P22
$$ y = [134047, 132688, 131206, 129218, 126812, 124392, 122389, 121107, 120652, 120903, 121541, 122108, 122111, 121234, 119573, 117560, 115601, 113890, 112577, 111884, 111859, 112156, 112296, 112134, 111953, 112116, 112692, 113363, 113662, 113440, 113134, 113385, 114228, 114855, 114372, 112722, 110725, 109325, 108942, 109323, 109774, 109610, 108673, 107451, 106586, 106312, 106419, 106604, 106674, 106541, 106221, 105806, 105322, 104753, 104282, 104241, 104639, 104987, 104961, 104927, 105376, 105948, 105638, 104062, 102029, 100678, 100431, 100906, 101469, 101614, 101169, 100492, 100268, 100790, 101625, 102250, 102761, 103516, 104203, 103919, 102356, 100443, 99400, 99398, 99521, 98981, 97961, 97238, 97334, 98188, 99367, 100379, 100993, 101509, 102573, 104465, 106629, 108163, 108716, 108649, 108393, 107995, 107392, 106732, 106228, 105888, 105609, 105402, 105320, 105263, 105003, 104441, 103716, 103090, 102701, 102414, 101959, 101303, 100816, 100863, 101333, 101775, 101995, 102238, 102744, 103429, 104090, 104631, 105004, 105135, 105033, 104712, 103959, 102510, 100550, 98731, 97533, 96965, 96976, 97693, 98970, 100200, 100998, 101720]
55365A01720J171J533J443J247J140P40r0o77m32K15L70j52q20j235j400j353
55349A03420j121r74j163j442j193j53J232K227K384J798R66L86J22j29n60r70
55333A04830j114j037q95o49k22J73K15r7m20m90l81l54n23p05n78o4M85O57N36
55314I9367N99J027J378J131L20n76j143j272j040o46l55l78p28j171j291p42
55298I4480K95J070J010M82L46Q00J189J063Q19R82J381J447R64J35p47j367j439
55281A02910j106r04j007q65j07O51O32J30J14P04R55L68l46l56J04K34j07l61
55263A01643k56j83n34j127j438j159l31P69J631J637O19p24j323q65j22K9k89
55246I7977l12K15P62Q98Q32Q65Q12M09p6j97p6k67q89j385j319r52p43n72N4
$$ y = [101720, 102891, 104424, 105867, 107114, 108254, 108994, 108904, 108227, 107795, 108010, 108380, 108228, 107408, 106173, 104773, 103420, 102299, 101325, 100162, 98720, 97527, 97374, 98606, 100833, 103217, 105015, 105981, 106367, 106489, 106360, 105800, 104830, 103716, 102679, 101784, 101135, 100913, 101086, 101301, 101204, 100784, 100294, 99913, 99559, 99036, 98331, 97753, 97689, 98174, 98831, 99367, 99966, 100993, 102371, 103502, 103822, 103246, 102103, 100831, 99791, 99145, 98790, 98412, 97684, 96513, 95222, 94480, 94775, 95845, 96855, 97337, 97683, 98483, 99672, 100735, 101554, 102536, 103917, 105364, 106328, 106463, 105716, 104349, 102910, 101804, 100900, 99893, 99028, 98921, 99572, 100204, 100334, 100448, 101152, 102107, 102475, 102129, 101773, 101877, 102111, 102004, 101643, 101387, 101204, 100670, 99543, 98105, 96946, 96615, 97384, 99015, 100652, 101271, 100547, 99224, 98359, 98237, 98266, 97977, 97665, 97880, 98642, 99540, 100372, 101237, 102049, 102458, 102382, 102185, 102109, 101842, 100953, 99568, 98249, 97297, 96554, 95982, 96036]
55227I6036J047J523Q49l50p51P4J147J329O23j72o04p48n89k9N22M28j65m06
55209I9764m9J30l14o27j4J024J449J289J382J733J295l40k037k438j560m33L09
55192A00563Q38J316J449R81J94m16p19r23j186j476j734j843j452k59J396K605
55176I9334K833K455K003J334J01j236j677r51J14O65O17L07n7k98k68k25o13
55159A04438j225j197j91R87J402J058M73j39o60o28J25Q78Q31K41p4m1k32o76
55141A05370p55l66j70n00p73m17L13P97Q61P30O15N71N51L29l00j105j499j189
55123A03063m79J04K30k17j075j781j741j011k66M6J69N01J000J407J657J751
55107A03358J529Q79R4l29j80L44R05J261J309J101P90N53N35P61J022R46L88
$$ y = [96036, 97083, 98606, 99455, 99105, 98354, 98428, 99575, 100904, 101527, 101355, 100751, 100003, 99414, 99385, 99907, 100335, 100170, 99764, 99715, 99845, 99531, 98904, 98890, 99914, 101363, 102652, 104034, 105767, 107062, 106722, 104685, 102247, 100687, 100254, 100563, 101401, 102717, 104166, 105147, 105341, 104925, 104206, 103283, 102097, 100621, 98887, 97044, 95592, 95333, 96729, 99334, 102167, 104622, 106625, 107959, 108060, 106824, 105147, 104196, 104310, 104975, 105592, 105899, 105842, 105544, 105276, 105051, 104438, 103213, 102016, 101825, 102812, 104214, 105272, 105745, 105606, 104946, 104318, 104443, 105321, 106152, 106393, 106319, 106278, 106046, 105370, 104615, 104249, 104079, 103579, 102806, 102389, 102702, 103499, 104360, 105090, 105705, 106276, 106827, 107156, 106856, 105751, 104252, 103063, 102584, 102688, 102918, 102701, 101626, 99845, 98104, 97093, 96827, 96873, 97042, 97543, 98543, 99950, 101607, 103358, 104887, 105766, 105860, 105531, 105351, 105695, 106600, 107861, 109170, 110271, 111061, 111614, 112149, 112910, 113932, 114878, 115266]
55090A15266l27p03n70j13M69J005J195Q62L63L26Q90J509J634J269P35J90l43
55073A23657p96j122j362j470j201m40M54Q38L80n96j391j536j152o69k27L51
55057A13718R63R77J2j269j711j007n8J31n18j368j880j919j469n59N35J220J020
55040A06818J23n94l74N77J265J063L66o6k0K68O74J142J307Q80K16r1p6k25n49
55021A12704n94l72m23p79q16m12l44r86j528j177m15j95m47l37K88P72Q10Q05
55003A06554R60R09M94J10k1k94r56j455j166l69J18J35L31J099J908K026J435
54986A11818O95K01l7k9K29M02K9o95q27J95J640K226J557L95l95n50j61N99J249
54967A18541J177M35m8M49J393J554M80r30j383m95Q65J419O56o93j402r84l3
$$ y = [115266, 114939, 114236, 113666, 113553, 114022, 115027, 116222, 117084, 117447, 117773, 118663, 120172, 121806, 123075, 123810, 124000, 123657, 122861, 121739, 120377, 118907, 117706, 117266, 117720, 118558, 118938, 118342, 116951, 115415, 114263, 113594, 113367, 113718, 114681, 115658, 115670, 114401, 112690, 111683, 111625, 111756, 111238, 109870, 107990, 106071, 104602, 104043, 104578, 105798, 106818, 106941, 106347, 105973, 106550, 107815, 108878, 109244, 109178, 109158, 109426, 110100, 111242, 112549, 113429, 113645, 113554, 113478, 113253, 112704, 112110, 111738, 111315, 110536, 109720, 109308, 108964, 107978, 106450, 105273, 104858, 104663, 104216, 103879, 104167, 104939, 105749, 106554, 107514, 108423, 108917, 109027, 109006, 108712, 107756, 106301, 105135, 104766, 104884, 105019, 105350, 106449, 108357, 110383, 111818, 112513, 112714, 112677, 112648, 112877, 113279, 113308, 112613, 111786, 111981, 113621, 115847, 117404, 117799, 117404, 116854, 116693, 117292, 118541, 119718, 120153, 120105, 120554, 121947, 123501, 123981, 123051, 121668, 121173, 122038, 123457, 124113, 123420, 122018, 121034, 121001]
54950A21001O17P18M62l0o76j117r92m64p3j7K1K61M23J91k72n68o01m84q8Q54
54930A19166K127L002L120L014L376M075M366L964L356L038L021L271L990N080
54916A67966N765N303L878K269Q76n13k097l665m814n242m901m210l865m155m533
54901A48062m346l712l247l056k631j716o27K77Q78R96M79k24k69N80J641K257
54885A35342K499K646K580K186J904K259L079L650L617L382L589M379N168N183
54871A81463M249K901J598J32j772l630m663m949n230n636n515m730m123m204
54857A45891m353l890l160k806k659k172j432r13o34l72l11o94j120r88m32l8
54841A19917J12L03L45k26j119j467j067o55p18q98p60m42k07mK08K89L00N57
$$ y = [121001, 121618, 122336, 122798, 122768, 122092, 120975, 119983, 119519, 119446, 119429, 119450, 119711, 120134, 120325, 120053, 119485, 118884, 118400, 118312, 119166, 121293, 124295, 127415, 130429, 133805, 137880, 142246, 146210, 149566, 152604, 155625, 158896, 162886, 167966, 173731, 179034, 182912, 185181, 186057, 185544, 183447, 179782, 174968, 169726, 164825, 160615, 156750, 152595, 148062, 143716, 140004, 136757, 133701, 131070, 129354, 128727, 129004, 129882, 130878, 131357, 131133, 130864, 131444, 133085, 135342, 137841, 140487, 143067, 145253, 147157, 149416, 152495, 156145, 159762, 163144, 166733, 171112, 176280, 181463, 185712, 188613, 190211, 190343, 188571, 184941, 180278, 175329, 170099, 164463, 158948, 154218, 150095, 145891, 141538, 137648, 134488, 131682, 129023, 126851, 125419, 124506, 123872, 123500, 123189, 122495, 121375, 120387, 119955, 119917, 120029, 120332, 120677, 120451, 119332, 117865, 116798, 116143, 115425, 114527, 113767, 113325, 113118, 113114, 113322, 113611, 113911, 114468]
54823A14468R46P97j43j164j455j074n84j21N54J298J564J108L40j36k4N36J053
54806A17963R44Q1r04j193p09j30Q0K92J022J980K249J442K39l71j46L45M56K8
54788A23668o55j155j134n23M45J411K069K215J822J205R18J160J492J378Q91
54773A35207N97Q80J716K922M192N046N233N101N089N057M613L963L704L817L629
54758A90766K846J755M26j382l257m237m275m542n649o530o022m612l580l156
54744A48551k662k005j748j920j894j455j017p61m03J53O53J012J337J493J310
54729A40644J141J496K246K815L102L506M085M492M646M779M854M638M204L636
54715A90284K439J83k426m142m789n254n809n703m688l725l636m013m093l804
$$ y = [114468, 115414, 116211, 116068, 114904, 113449, 112375, 111791, 111670, 112224, 113522, 115086, 116194, 116534, 116398, 116374, 116910, 117963, 118907, 118988, 118084, 116891, 116182, 116052, 116132, 116424, 117446, 119426, 121675, 123117, 123356, 122985, 122839, 123184, 123640, 123668, 123013, 121858, 120724, 120201, 120646, 122057, 124126, 126341, 128163, 129368, 130286, 131446, 132938, 134316, 135207, 135804, 136684, 138400, 141322, 145514, 150560, 155793, 160894, 165983, 171040, 175653, 179616, 183320, 187137, 190766, 193612, 195367, 195793, 194411, 191154, 186917, 182642, 178100, 172451, 165921, 159899, 155287, 151707, 148551, 145889, 143884, 142136, 140216, 138322, 136867, 135850, 135089, 134686, 134839, 135492, 136504, 137841, 139334, 140644, 141785, 143281, 145527, 148342, 151444, 154950, 159035, 163527, 168173, 172952, 177806, 182444, 186648, 190284, 192723, 192906, 190480, 186338, 181549, 176295, 170486, 164783, 160095, 156370, 152734, 148721, 144628, 140824]
54701A40824l397k786j921j157o65j51M00L76m84j371j378o96k20l27o22o15j81
54684A25629L51L86k99r94o97M28J082N77l19p62j020j549j875j434p66p24r95
54667A17019o39K90Q63P93O81P54N02k41q29p24j12N92J106J059J88r90j427q19
54649A18066pK05o3k99m33n34l42L24R66Q92K42o7N67J680K226J612J96j121j670
54630A22440j495j096q70q49q50o97l45M5J76o4l47k09L67R16J007O99L98M12
54612A19638P75J296J678J656J172M19l08p91r58q25m39Q7N49P29N93L42J40j48
54594A25605p95j719k382k248j326j61O22Q23P36P58Q90Q36O04O49J099J284O07
54577A25882l97o29k5L25j97q52p08O2O28O61M49K62K04L74O46N82O2l73k59R5
$$ y = [140824, 137427, 134641, 132720, 131563, 130898, 130747, 131147, 131523, 131039, 129668, 128290, 127594, 127374, 127047, 126425, 125810, 125629, 125980, 126366, 126067, 125073, 124376, 124804, 125886, 126463, 126144, 125382, 124362, 122813, 120938, 119504, 118738, 118014, 117019, 116380, 116670, 117533, 118326, 119007, 119761, 120263, 120022, 119193, 118469, 118357, 118949, 120055, 121114, 121302, 120312, 118885, 118066, 118059, 118264, 118201, 117902, 117469, 116935, 116593, 116917, 117883, 118775, 119017, 118950, 119517, 121197, 123423, 125035, 125231, 124110, 122440, 120945, 119849, 118979, 118130, 117280, 116583, 116238, 116283, 116459, 116395, 116048, 115839, 116206, 117122, 118129, 118828, 119226, 119638, 120413, 121709, 123387, 125043, 126215, 126634, 126326, 125535, 124577, 123752, 123313, 123400, 123949, 124678, 125271, 125613, 125753, 125605, 124810, 123091, 120709, 118461, 117135, 116974, 117596, 118419, 119155, 119913, 120803, 121639, 122243, 122892, 123991, 125275, 125882, 125485, 124856, 124831, 125156, 124959, 124107, 123399, 123461, 124089, 124750, 125199, 125461, 125665, 126039, 126685, 127267, 127329, 126956, 126697, 126792]
54557A26792K44M19J017J563J139k21j367j408n90K56O08M85K72M05R22J344J301
54540A33181J116J279J627J572J006L06m07j264j967j991j444r92q20m96jM3n13
54523A30235q74n05J4j16p79j321j514j424q52K79J280J227J50r74j350j032m89
54506A21955J2M47Q52J120R67K31o38p67N9Q63N39o86j468r68K82J254J520J328
54488A26902R89O24K94M6j47l00l81m11n03o83p34l93L52J221J887K151J966J460
54470A34340J004J063J735K446K396J467M15k0Jj34m54l77J67L81k15q58m46Q67
54452A43778J747J309O5r11j152q74m08l7r4o59j230j156m67R8K7l85n66m67m58
54433A38160o00n57k09R0O8j9K24P00J006J080J222J467J388P58K8j84J10K96
$$ y = [126792, 127036, 127455, 128472, 130035, 131174, 130953, 129586, 128178, 127588, 127844, 128452, 128937, 129209, 129614, 130536, 131880, 133181, 134297, 135576, 137203, 138775, 139781, 140087, 139680, 138416, 136449, 134458, 133014, 132022, 131202, 130706, 130705, 130748, 130235, 129361, 128856, 128870, 128754, 127975, 126654, 125140, 123716, 122864, 123143, 124423, 125650, 125800, 124826, 123476, 122444, 121955, 121967, 122414, 123266, 124386, 125353, 125584, 124946, 124179, 124238, 125101, 125640, 124954, 123486, 122518, 122800, 124054, 125574, 126902, 127891, 128515, 128809, 128855, 128708, 128408, 128027, 127616, 127113, 126430, 125696, 125303, 125655, 126876, 128763, 130914, 132880, 134340, 135344, 136407, 138142, 140588, 142984, 144451, 144866, 144846, 144847, 144713, 144259, 143882, 144049, 144430, 144215, 143357, 142911, 143778, 145525, 146834, 146899, 145988, 144836, 143962, 143554, 143517, 143423, 142764, 141534, 140378, 139911, 140009, 140036, 139651, 139085, 138618, 138160, 137560, 137003, 136794, 136884, 136952, 136933, 137157, 137857, 138863, 139943, 141165, 142632, 144020, 144778, 144806, 144622, 144732, 145028]
54415A45028j7n16o28j87M92J059J411J561J472J178R16Q84Q65L82o47j625j843
54398A49785j222l09L90Q23J170J459J467R73O3p98j095p82l11q1K3K73N57N04
54380A52889P2m16p54r21o94K30J523K191J710P79N47J227K055K406K417K449
54364A67710K489K308J928J592J432J402J401J312R46J85q07j638k051k165k319
54349A73725k660k938k776k160j568j495j920k399k614k623k457j858p05M60Q08
54334A46820J91o39r14o54l32q2L06P74R07N87K93N23J145J531J256M77k97o68
54316A51224o53n28m15j49K91M83%r00j506j549j411j329j012l08K75J80m23r02
54298A41368r20n19J87R32J182O90k8k52L1K57J63jj6J35N69J330J972J869J106
$$ y = [145028, 145011, 144495, 143867, 143680, 144172, 145231, 146642, 148203, 149675, 150853, 151769, 152653, 153518, 153900, 153253, 151628, 149785, 148563, 148254, 148644, 149467, 150637, 152096, 153563, 154536, 154599, 153801, 152706, 151924, 151613, 151532, 151555, 151828, 152385, 152889, 152961, 152545, 151791, 150870, 150176, 150406, 151929, 154120, 155830, 156609, 157156, 158383, 160438, 162844, 165261, 167710, 170199, 172507, 174435, 176027, 177459, 178861, 180262, 181574, 182520, 182705, 181898, 180260, 178209, 176044, 173725, 171065, 168127, 165351, 163191, 161623, 160128, 158208, 155809, 153195, 150572, 148115, 146257, 145552, 146012, 146820, 147011, 146372, 145458, 144804, 144472, 144390, 144696, 145470, 146377, 146964, 147257, 147780, 148925, 150456, 151712, 152189, 151892, 151224, 150571, 150043, 149628, 149479, 149770, 150253, 150253, 149353, 147847, 146298, 144887, 143558, 142546, 142238, 142513, 142693, 142270, 141368, 140448, 139929, 140116, 141048, 142230, 142920, 142892, 142640, 142671, 142928, 143091, 143090, 143074, 143209, 143778, 145108, 147080, 148949, 150055]
54279A50055M53K97K16k38p97r17n82k57k56l93k42L58J035J257J023R54J383
54262A53349J735J310M16K7M72J136J433J349R57K70l49l51J24L37R1J3L49M22
54244A63090k11r57j193j276j766k266k002j098m09k85l63l23j94l7P5n5l41j99
54226A50190O06J322J141N06M93J187J562J064K36l08o50r53r56n04J0J72J9k81
54208A54856p50j278j447j070n15j45J53O02J050J207J077P76K71l84p64n26k0
54191A53093L9m94r62p53n9M50N54P14J251J687J320L53j62L39J184J486J311
54174A61351J295J402R75j21j148j455j139o22j13K40K26j28m48m86l58j79J26
54157A59418M53M05j46p66r21n54M8N52O51K12l88n11r8J28l35j010j100n95j68
$$ y = [150055, 150508, 150805, 151021, 150783, 149986, 149069, 148487, 148230, 147974, 147581, 147339, 147697, 148732, 149989, 151012, 151966, 153349, 155084, 156394, 156810, 156837, 157309, 158445, 159878, 161227, 162184, 162454, 162105, 161754, 161878, 162215, 162306, 162319, 162668, 163090, 162879, 161922, 160729, 159453, 157687, 155421, 153419, 152321, 151912, 151627, 151264, 150941, 150747, 150710, 150785, 150730, 150389, 150190, 150796, 152118, 153259, 153765, 154258, 155445, 157007, 158071, 158307, 157999, 157349, 156396, 155440, 154936, 154946, 155118, 155137, 154856, 154106, 152828, 151381, 150311, 149796, 149651, 149804, 150406, 151456, 152663, 153740, 154516, 154787, 154403, 153639, 153113, 153093, 153132, 152638, 151676, 150923, 150864, 151314, 151868, 152582, 153833, 155520, 156840, 157193, 157031, 157370, 158554, 160040, 161351, 162646, 164048, 165023, 164902, 163754, 162299, 161160, 160538, 160425, 160665, 160891, 160763, 160315, 159829, 159471, 159292, 159418, 159871, 160276, 160130, 159364, 158443, 157889, 157937, 158489, 159140, 159352, 158964, 158453, 158355, 158483, 158148, 157138, 156038, 155443, 155275]
54138A55275k25n45q15j004j163j191r40m18J61N29O61Q41J229J457J051K92K5
54121A55220M54P98M72J1J79P60R92Q59R70J376J421Q85M45P05J433K037K262
54104A71279K050J327L33k56j0O53J039J112J449K333L332L835L721L274K636
54089A98107J569j11k050l474l927l725l496l358k848j686k69P32J042R11O79
54074A78096M96L69M18Q90J893L038L552L011J859R61O54N27J38m43r58j421j938
54057A91142k375k525k441k264j906j233m84o6Q8N40J677L190M429M986M859M313
54041B01930L769L603L802L960L789L555L746M422N134N493N518N350M892L937
54027B62900K659J674J538K212L030L279K713J655O41R1J46N45O38j75j757l165
$$ y = [155275, 155050, 154505, 153690, 152686, 151523, 150332, 149392, 148974, 149135, 149664, 150325, 151166, 152395, 153852, 154903, 155195, 155220, 155674, 156472, 156944, 156955, 157134, 157894, 158886, 159745, 160715, 162091, 163512, 164397, 164842, 165547, 166980, 169017, 171279, 173329, 174656, 174989, 174733, 174723, 175376, 176415, 177527, 178976, 181309, 184641, 188476, 192197, 195471, 198107, 199676, 199565, 197515, 194041, 190114, 186389, 182893, 179535, 176687, 175001, 174732, 175464, 176506, 177417, 178096, 178592, 178961, 179379, 180269, 182162, 185200, 188752, 191763, 193622, 194583, 195237, 195764, 195902, 195459, 194501, 193080, 191142, 188767, 186242, 183801, 181537, 179631, 178398, 177914, 177848, 177936, 178476, 180153, 183343, 187772, 192758, 197617, 201930, 205699, 209302, 213104, 217064, 220853, 224408, 228154, 232576, 237710, 243203, 248721, 254071, 258963, 262900, 265559, 267233, 268771, 270983, 274013, 277292, 280005, 281660, 282301, 282392, 282538, 283083, 283721, 283546, 281789, 278624]
54011B78624l609l370l411m043m547m310l804l941m672m961m158k868k132k182
53997B26616k368k104j501j070j114j483j770j647j198q77j072j610j884j554
53983B05364r79q09j212j691j674j135n21j95p4J45N50Q88Q60M68K9r3K58J012
53965B01191J953K813L442M009M877O073O940O761N800N316O130P454P684O203
53951B76646L863J623m83k725m652n409m859l748k766j977j197m16L22J045J595
53936B56862J632J188R33J473K526L170K918K168J580J400J587K246L413M549
53922B87645M806M066L282L454M506N538N957N896N664N466N624O374P173O944
53908C62395N497M012L535L507K666R50m69r43j056j443j922k161k409k995l710
$$ y = [278624, 275015, 271645, 268234, 264191, 259644, 255334, 251530, 247589, 242917, 237956, 233798, 230930, 228798, 226616, 224248, 222144, 220643, 219573, 218459, 216976, 215206, 213559, 212361, 211484, 210412, 208802, 206918, 205364, 204385, 203576, 202364, 200673, 198999, 197864, 197343, 197148, 197074, 197219, 197769, 198657, 199517, 199985, 200014, 199921, 200179, 201191, 203144, 205957, 209399, 213408, 218285, 224358, 231298, 238059, 243859, 249175, 255305, 262759, 270443, 276646, 280509, 282132, 281649, 278924, 274272, 268863, 264004, 260256, 257490, 255513, 254316, 253900, 254222, 255267, 256862, 258494, 259682, 260615, 262088, 264614, 267784, 270702, 272870, 274450, 275850, 277437, 279683, 283096, 287645, 292451, 296517, 299799, 303253, 307759, 313297, 319254, 325150, 330814, 336280, 341904, 348278, 355451, 362395, 367892, 371904, 375439, 378946, 381612, 382562, 382093, 381150, 380094, 378651, 376729, 374568, 372159, 369164, 365454]
53893C65454m241m709n259n591n543n673o560p708p980p093n974n499n519n396
53879B82709m955m466m045l595l243l313l787m095l806l297l329l944m236l441
53865B29157j912o56j80k33n36j089j760k178k201k069j849j317n60j96n51j105
53849B10765j192q77o92q01r76j081j086q36l46o2l03o69n39kL70M74O98J023
53831B03868R04K02m94p28p08p09n37KO30J051J405J843J985J401L87l03m05l22
53813B09472l26j29N95J632K474K891L018K956K696K450K717L670M692M993M646
53798B48447M531N053N521N205M450M052L909L214J928J091J319J858J641O74
53784B92893k73r06j577k397k948k927k641k606k982l533l918l936l592l097k759
$$ y = [365454, 361213, 356504, 351245, 345654, 340111, 334438, 327878, 320170, 312190, 305097, 299123, 293624, 288105, 282709, 277754, 273288, 269243, 265648, 262405, 259092, 255305, 251210, 247404, 244107, 240778, 236834, 232598, 229157, 227245, 226589, 226409, 226176, 225640, 224551, 222791, 220613, 218412, 216343, 214494, 213177, 212617, 212421, 211870, 210765, 209573, 208696, 208004, 207203, 206227, 205146, 204060, 203224, 202878, 202816, 202513, 201844, 201305, 201303, 201673, 202147, 202845, 203868, 204772, 204974, 204480, 203752, 203044, 202335, 201798, 201800, 202430, 203481, 204886, 206729, 208714, 210115, 210502, 210199, 209794, 209472, 209146, 209017, 209612, 211244, 213718, 216609, 219627, 222583, 225279, 227729, 230446, 234116, 238808, 243801, 248447, 252978, 258031, 263552, 268757, 273207, 277259, 281168, 284382, 286310, 287401, 288720, 290578, 292219, 292893, 292620, 291714, 290137, 287740, 284792, 281865, 279224, 276618, 273636, 270103, 266185, 262249, 258657, 255560, 252801]
53769B52801k830l344m000m270l871l161k783k873k848k246j371q93j056j558
53755B15697k061k406k446k030j201k27N31P05J33p99j274q47m3K97J06N5M91
53738B04681R55Q90L61j91n10n26j60M95R87R05M58L24Q86J782K373K402K134
53721B18246J905J727J369P82K83J89M24O56P45Q71J200J674K241K967L727M092
53705B43098L763K969K131J333N43J42O58J888K874L019K781K878L294L521L454
53690B78346L399L290K660J482M09p7k45n57r52j118j070j024r53p07m24l99o09
53673B81451p61o88m09Q7P08J113J089R55J060J086M81m76q64n55n39j422k369
53656B79947k268j359p44o55k33R20J948J945J227P73Q19O33k93j384j562m01
$$ y = [252801, 249971, 246627, 242627, 238357, 234486, 231325, 228542, 225669, 222821, 220575, 219204, 218311, 217255, 215697, 213636, 211230, 208784, 206754, 205553, 205326, 205857, 206562, 206695, 205896, 204622, 203775, 203732, 204029, 204135, 204190, 204681, 205636, 206526, 206887, 206696, 206186, 205660, 205500, 205995, 206982, 207887, 208345, 208669, 209555, 211337, 213710, 216112, 218246, 220151, 221878, 223247, 224029, 224312, 224501, 224925, 225581, 226326, 227197, 228397, 230071, 232312, 235279, 239006, 243098, 246861, 249830, 251961, 253294, 253837, 253979, 254637, 256525, 259399, 262418, 265199, 268077, 271371, 274892, 278346, 281745, 285035, 287695, 289177, 289586, 289509, 289264, 288707, 287755, 286637, 285567, 284543, 283590, 282883, 282459, 282060, 281451, 280690, 280002, 279593, 279680, 280388, 281501, 282590, 283545, 284605, 285691, 286172, 285696, 284832, 284277, 283738, 282316, 279947, 277679, 276320, 275576, 274921, 274688, 275608, 277556, 279501, 280728, 281501, 282320, 282953, 282660, 281276, 279714, 279313]
53640B79313J419K761K992K389J767J742K247K682K533J924J516J804K596L227
53626C10912L257K835K468K589L274M107M394L762K711K253K823L743M003L431
53612C56562K779K721L092L274L047K709K435J961J162O61J253K721L772L459
53598C91608K225J087L05m38q94l80Q35J302J16j770k662k079r90l95m14o64q83
53581C85909r96r94r76j134j602k250k672k364j266j36kr83k017k125j551j203
53565C63638j246r21K21J530J936J172N7l58J81R84J318J223J184J226R74O26
53549C73745J009K229L083K557J266O03Q42J102R35Q98J472K360L069L467L625
53534D02262L749M369N804P339P721O795N892O187P288Q016P994P877Q319R278
$$ y = [279313, 280732, 283493, 286485, 288874, 290641, 292383, 294630, 297312, 299845, 301769, 303285, 305089, 307685, 310912, 314169, 317004, 319472, 322061, 325335, 329442, 333836, 337598, 340309, 342562, 345385, 349128, 353131, 356562, 359341, 362062, 365154, 368428, 371475, 374184, 376619, 378580, 379742, 380403, 381656, 384377, 388149, 391608, 393833, 394920, 395225, 394787, 393893, 393513, 394348, 395650, 395766, 393996, 391334, 389255, 388265, 387870, 387456, 386792, 385909, 384913, 383919, 382943, 381809, 380207, 377957, 375285, 372921, 371655, 371519, 371517, 370534, 368517, 366392, 364841, 363638, 362392, 361471, 361692, 363222, 365158, 366330, 366387, 366029, 366210, 367194, 368512, 369735, 370919, 372145, 373119, 373745, 374754, 376983, 380066, 382623, 383889, 384492, 385334, 386436, 387371, 388269, 389741, 392101, 395170, 398637, 402262, 406011, 410380, 416184, 423523, 431244, 438039, 443931, 450118, 457406, 465422, 473416, 481293, 489612, 498890]
53520D98890J0287J1050J1772J2902J4461J5832J6509J6811J7321J7940J8269
53509F62044J8647J9777K1204K1551K0562J9701K0037K0689K0357J9321J8710
53498H82600J8590J8127J7198J6540J6423J6381J6245J6319J6508J6333J5960
53487A067224J6167J7022J7483J6765J5393J4468J4449J4971J5378J5109J4070
53476A238499J2847J2188J2002J1333R518O938M431K450R88k40j799m177p085
53463A297893r534j0959j1819j2686j3287j3048j2248j1884j2408j3258j3726
53452A163036j3853j4200j5033j5958j6370j6140j5749j5766j6208j6534j6172
53441I91053j4896j2807j0290p978o340n169l769j926l72J1p35j597j534k56J705
$$ y = [498890, 509177, 520227, 531999, 544901, 559362, 575194, 591703, 608514, 625835, 643775, 662044, 680691, 700468, 721672, 743223, 763785, 783486, 803523, 824212, 844569, 863890, 882600, 901190, 919317, 936515, 953055, 969478, 985859, 1002104, 1018423, 1034931, 1051264, 1067224, 1083391, 1100413, 1117896, 1134661, 1150054, 1164522, 1178971, 1193942, 1209320, 1224429, 1238499, 1251346, 1263534, 1275536, 1286869, 1296387, 1303325, 1307756, 1310206, 1311194, 1310954, 1309155, 1304978, 1297893, 1288359, 1277400, 1265581, 1252895, 1239608, 1226560, 1214312, 1202428, 1190020, 1176762, 1163036, 1149183, 1134983, 1119950, 1103992, 1087622, 1071482, 1055733, 1039967, 1023759, 1007225, 991053, 976157, 963350, 953060, 945082, 938742, 933573, 929804, 927878, 927506, 927517, 926782, 925185, 923651, 923395, 925100]
53426I25100L487M539N027N582O580P835R114J0577J2420J4266J5481J6061J6778
53413A052847J8242K0132K1648K2508K3170K4125K5352K6590K7838K9253L0734
53402A322439L2037L3250L4720L6374L7696L8609L9878M2065M4468M5879M6185
53391A753600M6441M7303M8243M8529M8245M7779M6941M5254M2846M0426L8432
53380B254039L6674L4740L2371K9532K6378K3151J9873J6231J2013P531L350l80
53368B495503m022q034j2587j7546k2574k7313l1671l5769l9482m2183m3315m3056
53356B167951m2226m1624m1600m2019m2267m1555l9683l7444l5840l4986l4242
53345A734465l3325l2636l2410l2177l1430l0419k9772k9553k9097k7746k5511
$$ y = [925100, 928587, 933126, 938153, 943735, 950315, 958150, 967264, 977841, 990261, 1004527, 1020008, 1036069, 1052847, 1071089, 1091221, 1112869, 1135377, 1158547, 1182672, 1208024, 1234614, 1262452, 1291705, 1322439, 1354476, 1387726, 1422446, 1458820, 1496516, 1535125, 1575003, 1617068, 1661536, 1707415, 1753600, 1800041, 1847344, 1895587, 1944116, 1992361, 2040140, 2087081, 2132335, 2175181, 2215607, 2254039, 2290713, 2325453, 2357824, 2387356, 2413734, 2436885, 2456758, 2472989, 2485002, 2492533, 2495883, 2495503, 2491481, 2483447, 2470860, 2453314, 2430740, 2403427, 2371756, 2335987, 2296505, 2254322, 2211007, 2167951, 2125725, 2084101, 2042501, 2000482, 1958215, 1916660, 1876977, 1839533, 1803693, 1768707, 1734465, 1701140, 1668504, 1636094, 1603917, 1572487, 1542068, 1512296, 1482743, 1453646, 1425900, 1400389]
53334A400389k2972k0756j9076j7689j6181j4398j2573j1101j0263j0111j0493
53323A234776j1179j2003j2896j3726j4258j4352j4062j3365j2033j0065q102
53312A098735o988o778o631n755m190k589j449o81K60J938M357O796Q427R203
53298A094655R799J0724J1909J3236J4859J6644J7922J8267J8206J8585J9514
53287A264320K0480K1208K1668K1457K0002J7528J5049J3082J1047Q354N486L376
53275A443057K076O76j504m189o679q679j0420j2242j4269j6319j8064j9236j9874
53262A314334k0317k0947k1833k2621k2894k2693k2551k2835k3230k3238k3017
53251A068158k3143k3557k3398k2245k0874k0234k0179j9882j9180j8610j8349
$$ y = [1400389, 1377417, 1356661, 1337585, 1319896, 1303715, 1289317, 1276744, 1265643, 1255380, 1245269, 1234776, 1223597, 1211594, 1198698, 1184972, 1170714, 1156362, 1142300, 1128935, 1116902, 1106837, 1098735, 1091747, 1084969, 1078338, 1072583, 1068393, 1065804, 1064355, 1063674, 1063934, 1065872, 1070229, 1077025, 1085452, 1094655, 1104454, 1115178, 1127087, 1140323, 1155182, 1171826, 1189748, 1208015, 1226221, 1244806, 1264320, 1284800, 1306008, 1327676, 1349133, 1369135, 1386663, 1401712, 1414794, 1425841, 1434195, 1439681, 1443057, 1445133, 1445809, 1444305, 1440116, 1433437, 1424758, 1414338, 1402096, 1387827, 1371508, 1353444, 1334208, 1314334, 1294017, 1273070, 1251237, 1228616, 1205722, 1183029, 1160478, 1137643, 1114413, 1091175, 1068158, 1045015, 1021458, 998060, 975815, 954941, 934707, 914528, 894646, 875466, 856856, 838507]
53240H38507j7981j7422j7181j7413j7488j6892j5839j4604j2978j1014r655r761
53228F60279j0775j1223j0403q908p652p075p282q162r124r459r239r367j0499
53215E41111j2268j3811j4585j4417j3289j1535r933r053q693q310p829p626p776
53202D01986p822p402o770o519o863p367p387o778o077n931o381o857o828o262
53188C06742n455m694m165l948l903l728l312k887k720k729k613k265j947j991
53174B60385k395k710k475j844j534j930k448k218j235l22j4j31m39r22j216o87
53158B37865M19P34n09k165k535j568p03p23r86q21n69p20q92l88O94J513J425
53141B30071N41n20j104r59l92L8J62L12P29J166J189P55K49J12M63R30R44L95
$$ y = [838507, 820526, 803104, 785923, 768510, 751022, 734130, 718291, 703687, 690709, 679695, 670040, 660279, 649504, 638281, 627878, 618970, 611318, 604243, 596961, 588799, 579675, 570216, 560977, 551610, 541111, 528843, 515032, 500447, 486030, 472741, 461206, 451273, 442220, 433527, 425217, 417388, 409762, 401986, 394164, 386762, 379992, 373473, 366610, 359243, 351856, 345078, 339001, 333070, 326689, 319832, 313004, 306742, 301287, 296593, 292428, 288480, 284577, 280849, 277537, 274650, 271930, 269201, 266588, 264323, 262376, 260385, 257990, 255280, 252805, 250961, 249427, 247497, 245049, 242831, 241596, 241274, 241260, 241129, 240690, 239768, 238552, 237865, 238284, 239018, 238509, 236344, 233809, 232241, 231538, 230815, 229829, 229008, 228439, 227719, 226827, 226439, 227133, 228646, 230071, 230612, 230092, 228988, 228029, 227637, 227675, 227837, 228149, 228878, 230044, 231233, 231988, 232237, 232349, 232812, 233742, 234686, 235081]
53123B35081r9P4O32P60L69K49Q07J308R85K51Q0M73L88p54k196k710j920m94
53105B33284O34R94P54M26L70M33J73n96j518k014j771q81K48J097J290Q66K36
53088B34025k86p91j470k107k176j549p35k58k5L33P74Q76N45J08l10q98j451
53071B24605j215L0J219J094j61j127r82l45j15j98P3Q06J386J292O01k31p97
53054B25935q88n00J35O91R66J000R99J107J244J189Q93N81M14K08k46p25p44
53037B32259k04M50P90Q02P00O30O30O00K91m29j181j348q30k18l3j97l38k92
53019B32082l4N02J208J698J702J424J200J046Q04N28L88L45J82j80o63j199j717
53002B39316k007j815j097k4J098J917K167J852J225N10j33m72k75L48J004J518
$$ y = [235081, 234982, 235056, 235688, 236448, 236817, 237066, 237873, 239181, 240166, 240417, 240497, 240970, 241358, 240604, 238408, 235698, 233778, 233284, 233918, 234912, 235666, 236092, 236462, 236895, 237068, 236472, 234954, 232940, 231169, 230288, 230536, 231633, 232923, 233789, 234025, 233739, 232948, 231478, 229371, 227195, 225646, 224911, 224653, 224628, 224961, 225735, 226611, 227156, 227264, 226954, 226056, 224605, 223390, 223420, 224639, 225733, 225572, 224445, 223463, 223118, 223003, 222805, 222878, 223684, 225070, 226362, 226963, 226732, 225935, 225047, 224547, 224682, 225373, 226339, 227339, 228338, 229445, 230689, 231878, 232771, 233352, 233766, 233974, 233728, 233003, 232259, 232055, 232505, 233295, 234097, 234797, 235427, 236057, 236657, 236948, 236519, 235338, 233990, 233160, 232942, 232909, 232712, 232374, 232082, 232048, 232550, 233758, 235456, 237158, 238582, 239782, 240828, 241632, 242160, 242548, 242893, 243075, 242895, 242232, 241033, 239316, 237309, 235494, 234397, 234373, 235471, 237388, 239555, 241407, 242632, 243142, 243009, 242537, 242262, 242610, 243614, 245132]
52986B45132K023K467K432J714P19O9N0O14J509K235K285J782J457J671J863J392
52970B69414N05r0k43l28m80m79k98j34K6L31N96M56m6m97p60j096j565j795j532
52951B61985j018o92p34r97j216j249j249j506j965k083j454l54O11J164J351
52936B50594J110M19l50p39p73p53o74l41K7j7l53l74J46P63J046R99O99Q4p26
52917B50787j411j840k090k009j293j64O04N22r1n93o36j98M89R35P20O1m23n30
52899B42840o36r10j000o52j64Q4J23J60K56M43P64J033R65O62N38O68O86M70
52881B46330L08K60Lm45n46j01L28L01J74L91P49Q38P49Q16J067J430K003K595
52863B57250K540J587N57L90Q31P35m48k095l176l203k490j841j827k202k314
$$ y = [245132, 247155, 249622, 252054, 253768, 254487, 254556, 254606, 255220, 256729, 258964, 261249, 263031, 264488, 266159, 268022, 269414, 269919, 269829, 269586, 269258, 268778, 268299, 268001, 267867, 267893, 268224, 268820, 269276, 269230, 268733, 267973, 266877, 265312, 263517, 261985, 260967, 260275, 259541, 258544, 257328, 256079, 254830, 253324, 251359, 249276, 247822, 247468, 248079, 249243, 250594, 251704, 252123, 251773, 251034, 250261, 249508, 248834, 248493, 248520, 248503, 248150, 247776, 247922, 248685, 249731, 250730, 251429, 251513, 250787, 249376, 247536, 245446, 243437, 242144, 241980, 242584, 243106, 243015, 242422, 241786, 241588, 242077, 243012, 243732, 243793, 243370, 242840, 242204, 241294, 240294, 239642, 239478, 239562, 239685, 239845, 240101, 240544, 241308, 242341, 243306, 243968, 244506, 245174, 245860, 246330, 246638, 246898, 246901, 246456, 245910, 245809, 246137, 246438, 246612, 247003, 247752, 248590, 249339, 250155, 251222, 252652, 254655, 257250, 259790, 261377, 261934, 262324, 263155, 263890, 263442, 261347, 258171, 254968, 252478, 250637, 248810, 246608, 244294]
52848B44294k154k413l275l901l599k754k001j310o59p20j794k701k060k71J010
52833B15692J159J008J160J215R15O94P48O11J13k35j73j17k46j25K68J05r90
52816B21802k036j845n30Q78J810K357K540K256J783J589J680J592J076L27m18
52801B34861j104j747k281k561k371j624o89k08l98p68p67m34j55k1K34P39J279
52784B21985J531J316O90l5m45l23K02P82J007N94k51q33o77j77r1m41n75k97
52766B23962j90n50q16n37j71l31p82q38l83J60N44P22N37N3j36M11J166J282
52748B24103Q67Q20J518K427L037L334L309K798K061J690J682J360N39J1L74J061
52732B50991J183P45L62J85n4k56j04J62q3q08j192p79r6J09k66r01j554k000
$$ y = [244294, 242140, 239727, 236452, 232551, 228952, 226198, 224197, 222887, 222228, 221508, 219714, 217013, 214953, 214682, 215692, 216851, 217859, 219019, 220234, 221149, 221843, 222591, 223202, 223315, 223080, 222907, 222790, 222544, 222419, 222687, 222792, 221802, 219766, 217921, 217391, 218269, 220079, 222436, 224976, 227232, 229015, 230604, 232284, 233876, 234952, 235279, 234861, 233757, 232010, 229729, 227168, 224797, 223173, 222484, 222276, 221878, 221110, 220343, 219909, 219754, 219733, 219967, 220706, 221985, 223516, 224832, 225522, 225487, 225042, 224719, 224921, 225703, 226710, 227304, 227053, 226220, 225543, 225366, 225275, 224834, 224259, 223962, 223772, 223222, 222406, 221869, 221698, 221367, 220585, 219747, 219364, 219524, 220068, 220790, 221327, 221380, 221244, 221655, 222821, 224103, 224970, 225790, 227308, 229735, 232772, 236106, 239415, 242213, 244274, 245964, 247646, 249006, 249545, 249556, 249930, 250991, 252174, 252919, 253281, 253466, 253412, 253156, 253052, 253214, 253131, 252323, 251131, 250352, 250256, 250365, 250099, 249198, 247644, 245644]
52714B45644j906j288p14o20p06n17k41l07m05J17R70R90r2r44l64J013J629J166
52696B43425P28J035J495J301N71o7l55l82j89J31J46m45j304j737j504r94p04
52679B41151p04o72k94K77M18k87j336j725j185n35n18p99o48r8K86M82Q83J308
52661B36004J072L01J45J167K362K522J900J619J886J887J400J268J919K396J696
52646B59544L13m62m29o26j596k595k801k506k407k396j826o45N16J299J933K542
52630B47858K803K595K317K299K285J880J210P04M76K15l40j120j875k365k486
52615B56456k255j760j109n44m25q01j086o25L74R93Q11M05L88N13L11kJ10N11
52597B52265N74K13jK04M59N29P30J263J611J098j84j383j732j205l64K37M64
$$ y = [245644, 243738, 242450, 241736, 241116, 240410, 239893, 239652, 239345, 238940, 239057, 240027, 241017, 240925, 239981, 239617, 240630, 242259, 243425, 244153, 245188, 246683, 247984, 248555, 248488, 248133, 247751, 247562, 247693, 247839, 247394, 246090, 244353, 242849, 241855, 241151, 240447, 239775, 239481, 239758, 240176, 239889, 238553, 236828, 235643, 235108, 234590, 233791, 233143, 233045, 233331, 233813, 234696, 236004, 237076, 237377, 237522, 238689, 241051, 243573, 245473, 247092, 248978, 250865, 252265, 253533, 255452, 257848, 259544, 259857, 259395, 258966, 258340, 256744, 254149, 251348, 248842, 246435, 244039, 242213, 241568, 242084, 243383, 245316, 247858, 250661, 253256, 255573, 257872, 260157, 262037, 263247, 263951, 264427, 264642, 264302, 263182, 261307, 258942, 256456, 254201, 252441, 251332, 250788, 250363, 249562, 248476, 247851, 248225, 249218, 250029, 250434, 250822, 251335, 251646, 251644, 251754, 252265, 252839, 253052, 253051, 253255, 253714, 254243, 254973, 256236, 257847, 258945, 258761, 257378, 255646, 254441, 254077, 254314, 254778]
52580B54778M97L98J2o23j043q56k60J97K97K26J62J64L29N54L16p01j798j808
52562B50841o85K44k7r19j181n49K18N21L92On29q96p12j36K33J29j29k52l18
52543B46251l84k24K29O02O25N76P72R50O87K11J67O28R39P00K69Q2Pj25N7Q67
52523B53886J706J648P98L01P82J553J709J364J180J254J166Q73P73R41J032J011
52507B71977J341K106K541J839J97j326j924j726j446j563j962k278k422k603
52493B62751k788k568j817j171j280j757j500k74P61M77o90j244m00J099J900
52478B51499J407J96o32m45M02J029J032Q85J248K086K732K763K433K206K164
52463B71005K053J778J580J663J803J574R22K83j4j99p28j651k637l447l981l991
$$ y = [254778, 255275, 255673, 255685, 255062, 254019, 253163, 252903, 253100, 253397, 253623, 253785, 253949, 254278, 254832, 255148, 254447, 252649, 250841, 250156, 250400, 250373, 249454, 248273, 247724, 247942, 248463, 248855, 248861, 248332, 247436, 246724, 246588, 246821, 246950, 246821, 246569, 246251, 245867, 245643, 245872, 246474, 247099, 247675, 248447, 249397, 250084, 250295, 250462, 251090, 252029, 252729, 252998, 253080, 253087, 252962, 253019, 253886, 255592, 257240, 258038, 258339, 259121, 260674, 262383, 263747, 264927, 266181, 267347, 268220, 268993, 269934, 270966, 271977, 273318, 275424, 277965, 279804, 280001, 278675, 276751, 275025, 273579, 272016, 270054, 267776, 265354, 262751, 259963, 257395, 255578, 254407, 253127, 251370, 249870, 249596, 250357, 250834, 250144, 248900, 248500, 249599, 251499, 252906, 253102, 252470, 252025, 252427, 253456, 254488, 255373, 256621, 258707, 261439, 264202, 266635, 268841, 271005, 273058, 274836, 276416, 278079, 279882, 281456, 282378, 282661, 282647, 282448, 281720, 280069, 277432, 273985, 270004, 266013]
52447B66013l301k373k023k367k522j803o48M0J14J45L93M63L9o06r75r23o90
52430B48976n45n51n90n32l73j72J29N67R40R79Q58J030J482J643J347J259J899
52413B58346K762L134L297M053N303O085O061N933O270O720O789O526O012M886
52399C32177K907N00j762l767n507o608o796o423n984n433m525l506k837k440
52385B79996j826q53J88J122J932K331J997J262R71J463K272K975L734M688N295
52370C07547M897L724K804K852L478L680K936J712Q44N64L23l08r63j005n14k53
52354C32318o40j200j193m51N85J390J683J543J372J550J966K134J951K030K976
52339C48014M516N724O043N844N893O516P306P634P444P440Q330R895J1155J1598
$$ y = [266013, 262712, 260339, 258316, 255949, 253427, 251624, 250976, 251016, 251130, 251275, 251668, 252131, 252170, 251564, 250589, 249666, 248976, 248431, 247880, 247290, 246758, 246385, 246213, 246342, 246909, 247849, 248828, 249686, 250716, 252198, 253841, 255188, 256447, 258346, 261108, 264242, 267539, 271592, 276895, 282980, 289041, 294974, 301244, 307964, 314753, 321279, 327291, 332177, 335084, 335584, 333822, 330055, 324548, 317940, 311144, 304721, 298737, 293304, 288779, 285273, 282436, 279996, 278170, 277317, 277505, 278627, 280559, 282890, 284887, 286149, 287120, 288583, 290855, 293830, 297564, 302252, 307547, 312444, 316168, 318972, 321824, 325302, 328982, 331918, 333630, 334474, 335038, 335361, 335053, 334090, 333085, 332571, 332318, 331678, 330478, 329285, 328834, 329419, 330809, 332492, 334035, 335407, 336957, 338923, 341057, 343008, 345038, 348014, 352530, 358254, 364297, 370141, 376034, 382550, 389856, 397490, 404934, 412374, 420704, 430599, 441754, 453352]
52325D53352J1840J2787J4456J6083J7139J7700J7891J7606J6955J6472J6556
52314F28837J7014J7419J7731J8240J9027J9754K0001J9673J9070J8599J8321
52303H33686J7860J6937J5911J5466J5622J5510J4404J2575J0741Q961O785M303
52291I88761K290J082j1j761l942n681o551o785o699o431o194o184o166n642m535
52276I25551l232j853o8K093L767M221L914M061N202O824Q298R627J1044J2318
52262I91767J2907J2609J1926J1707J2400J3558J4190J3829J3079J2847J3128
52251A133947J3109J2365J1286J0090Q219N285K076j81j390k622m556o620q007
52238A173001q909j0136j1817j3081j3096j2048j0858j0150r818r538r336r406
$$ y = [453352, 465192, 477979, 492435, 508518, 525657, 543357, 561248, 578854, 595809, 612281, 628837, 645851, 663270, 681001, 699241, 718268, 738022, 758023, 777696, 796766, 815365, 833686, 851546, 868483, 884394, 899860, 915482, 930992, 945396, 957971, 968712, 977673, 984458, 988761, 991051, 992133, 992122, 990361, 986419, 980738, 974187, 967402, 960703, 954272, 948078, 941894, 935728, 930086, 925551, 922319, 920466, 920398, 922491, 926258, 930479, 934393, 938454, 943656, 950480, 958778, 968405, 979449, 991767, 1004674, 1017283, 1029209, 1040916, 1053316, 1066874, 1081064, 1094893, 1107972, 1120819, 1133947, 1147056, 1159421, 1170707, 1180797, 1189016, 1194301, 1196377, 1196196, 1194806, 1192184, 1187628, 1181008, 1173001, 1164092, 1153956, 1142139, 1129058, 1115962, 1103914, 1093056, 1082906, 1073088, 1063550, 1054214, 1044808]
52226A044808r630r592r128q468p755o793n462m129l289k947k658k088j353p86
52212I70730n41l89J32J263K627L532L778L844M068M111L592K857K546K701K948
52197A007799L326M170N184N484M786L924L868M642N462N488M348K380N00o19
52183A060742j350k567m266n555o091o600p476p907p169n962n446n533n179m092
52169I85549l021k496k263k002j733j378o91K11R45J497K199K959L264K974K476
52154I88490J960J270N84L67M85J99o11j067o08J85N82Q01J337J888J787J131
52138I98780O18N14N50O84J234K278L539M910O549Q431J0242J1762J3076J4410
52124A077577J6056J8236K0712K2754K3880K4490K5288K6276K6840K6673K5998
$$ y = [1044808, 1035178, 1025586, 1016458, 1007990, 1000235, 993442, 987980, 983851, 980562, 977615, 974957, 972869, 971516, 970730, 970189, 969800, 969932, 971195, 973822, 977354, 981132, 984976, 989044, 993155, 996747, 999604, 1002150, 1004851, 1007799, 1011125, 1015295, 1020479, 1025963, 1030749, 1034673, 1038541, 1043183, 1048645, 1054133, 1058481, 1060861, 1061361, 1060742, 1059392, 1056825, 1052559, 1047004, 1040913, 1034313, 1026837, 1018930, 1011761, 1005799, 1000353, 994820, 989641, 985549, 982528, 980032, 977769, 975767, 974034, 972656, 971965, 972176, 973121, 974618, 976817, 979776, 983040, 986014, 988490, 990450, 991720, 992304, 992671, 993156, 993355, 992744, 991677, 991069, 991254, 991836, 992637, 993974, 995862, 997649, 998780, 999398, 999912, 1000462, 1001146, 1002380, 1004658, 1008197, 1013107, 1019656, 1028087, 1038329, 1050091, 1063167, 1077577, 1093633, 1111869, 1132581, 1155335, 1179215, 1203705, 1228993, 1255269, 1282109, 1308782, 1334780]
52113A334780K4998K3674K2263K1190K0442J9531J8210J6745J5333J3813J2103
52102A543082J0471R119P898O603N163L416J198j178l111m613o523r361j2460
52089A549704j4749j6019j6862j7658j8170j8118j7556j6636j5351j3658j1662
52078A373265r640p922o591n234l258o18K001L967N408O824Q336R696J0832J1855
52064A398921J2703J3279J3811J4547J5163J5078J4381J3770J3473J2862J1480
52053A549468R851Q692P791O272L823J028j569m086o771r271j1017j2144j3534
52040A528533j5639j7646j8349j7748j7217j7783j8787j8821j7665j6510j6309
$$ y = [1334780, 1359778, 1383452, 1405715, 1426905, 1447347, 1466878, 1485088, 1501833, 1517166, 1530979, 1543082, 1553553, 1562672, 1570570, 1577173, 1582336, 1585752, 1586950, 1585772, 1582661, 1578048, 1571525, 1562164, 1549704, 1534955, 1518936, 1502074, 1484416, 1466246, 1448128, 1430572, 1413936, 1398585, 1384927, 1373265, 1363625, 1355703, 1349112, 1343878, 1340620, 1340002, 1342003, 1345970, 1351378, 1358202, 1366538, 1376234, 1387066, 1398921, 1411624, 1424903, 1438714, 1453261, 1468424, 1483502, 1497883, 1511653, 1525126, 1537988, 1549468, 1559319, 1568011, 1575802, 1582074, 1585897, 1586925, 1585356, 1581270, 1574499, 1565228, 1554211, 1542067, 1528533, 1512894, 1495248, 1476899, 1459151, 1441934, 1424151, 1405364, 1386543, 1368878, 1352368, 1336059]
$$ [...]
##END NTUPLES=NMR SPECTRUM
##END=
