##TITLE=AC1434_HUIAH13243_8011756_eZ3t3bxX5X
##JCAMPDX= 6.0         $$ Bruker NMR JCAMP-DX V2.0
##DATA TYPE= NMR SPECTRUM
##DATA CLASS= NTUPLES
##ORIGIN= BRUKER
##OWNER= Administrator
$$ 1.72 TOPSPIN		Version 2.1
$$ 2013-07-05 21:35:49.982 -0700  Administrator@X
$$ Compression mode = diff/dup
##.OBSERVE FREQUENCY= 400.02188249412
##.OBSERVE NUCLEUS= ^1H
##.ACQUISITION MODE= SIMULTANEOUS (DQD)
##.ACQUISITION SCHEME= undefined
##.AVERAGES= 8
##.DIGITISER RES= 22
##SPECTROMETER/DATA SYSTEM= spect
##.PULSE SEQUENCE= zg30
##.SOLVENT NAME= COFFEE_meoh
##.SHIFT REFERENCE= INTERNAL, COFFEE_meoh, 1, 14.98509
##AUDIT TRAIL= $$ (NUMBER, WHEN, WHO, WHERE, PROCESS, VERSION, WHAT)
$$ ##TITLE= Audit trail, TOPSPIN		Version 2.1
$$ ##JCAMPDX= 5.01
$$ ##ORIGIN= Bruker BioSpin GmbH
$$ ##OWNER= Administrator
$$ $$ E:\/data/COFFEE/nmr/AC1434_HUIAH13243_8011756_eZ3t3bxX5X/10/pdata/1/auditp.txt
$$ ##AUDIT TRAIL=  $$ (NUMBER, WHEN, WHO, WHERE, PROCESS, VERSION, WHAT)
(   1,<2013-07-05 21:35:42.982 -0700>,<Administrator>,<X>,<go>,<TOPSPIN 2.1>,
      <created by zg
	started at 2013-07-05 21:34:37.248 -0700,
	POWCHK enabled, PULCHK disabled,
       configuration hash MD5:
       C8 4E 4E 5D D3 5C D8 9E 9F 52 82 E0 59 8A DE 15
       data hash MD5: 64K
       4C AD 77 D5 89 4D 91 5E 86 60 42 8A 46 40 60 C2>)
(   2,<2013-07-05 21:35:45.982 -0700>,<Administrator>,<X>,<proc1d>,<TOPSPIN 2.1>,
      <Start of raw data processing
       efp LB = 0 FT_mod = 6 PKNL = 1 PHC0 = 0 PHC1 = 0 SI = 32K 
       data hash MD5: 32K
       E1 91 CA 4F 7B 04 1F 82 04 1F 20 9E 0F 32 AF F4>)
(   3,<2013-07-05 21:35:46.357 -0700>,<Administrator>,<X>,<proc1d>,<TOPSPIN 2.1>,
      <pk PHC0 = 97.37183 PHC1 = 0 
       data hash MD5: 32K
       7D 1C 55 AE 26 25 92 B3 5F 24 2E B5 66 E7 E1 73>)
(   4,<2013-07-05 21:35:46.529 -0700>,<Administrator>,<X>,<proc1d>,<TOPSPIN 2.1>,
      <abs ABSG = 1 
       data hash MD5: 32K
       B8 3D B0 1C 04 D2 61 11 0F 11 1A 3F 57 73 38 0E>)
(   5,<2013-07-05 21:35:46.732 -0700>,<Administrator>,<X>,<proc1d>,<TOPSPIN 2.1>,
      <abs ABSG = 2 
       data hash MD5: 32K
       BF EB 84 E5 7B 0D C8 40 65 3F 1F 3D EE BA C0 72>)
(   6,<2013-07-05 21:35:46.811 -0700>,<Administrator>,<X>,<proc1d>,<TOPSPIN 2.1>,
      <abs ABSG = 3 
       data hash MD5: 32K
       03 51 6A 1B EB B1 30 E0 F2 A8 25 B1 D4 C7 63 80>)
(   7,<2013-07-05 21:35:46.873 -0700>,<Administrator>,<X>,<proc1d>,<TOPSPIN 2.1>,
      <abs ABSG = 4 
       data hash MD5: 32K
       60 DA 63 D2 13 DD CA 60 16 F6 67 38 24 9C 67 2A>)
(   8,<2013-07-05 21:35:46.936 -0700>,<Administrator>,<X>,<proc1d>,<TOPSPIN 2.1>,
      <abs ABSG = 5 
       data hash MD5: 32K
       4A 3B 8B D0 DB 8F 91 54 C5 B4 7E 61 E3 3A 60 24>)
$$ ##END=
$$ 
$$ $$ hash MD5
$$ $$ 5C A0 E9 42 75 9B 1D 44 0B 00 57 EC 7D BA 8B 1E
##$RELAX= 
##$RELAX= 
##$RELAX= 
##$RELAX= 
##$RELAX= 
##$RELAX= 
##$RELAX= 
$$ Bruker specific parameters
$$ --------------------------
##$DU= <E:\>
##$EXPNO= 10
##$NAME= <AC1434_HUIAH13243_8011756_eZ3t3bxX5X>
$$ [...]
##$TP= (0..7)
150 150 150 150 150 150 150 150
##$TP07= 0
##$TPNAME0= <>
##$TPNAME1= <>
##$TPNAME2= <>
##$TPNAME3= <>
##$TPNAME4= <>
##$TPNAME5= <>
##$TPNAME6= <>
##$TPNAME7= <>
##$TPOAL= (0..7)
0.5 0.5 0.5 0.5 0.5 0.5 0.5 0.5
##$TPOFFS= (0..7)
0 0 0 0 0 0 0 0
##$TUNHIN= 0
##$TUNHOUT= 0
##$TUNXOUT= 0
##$USERA1= <user>
##$USERA2= <user>
##$USERA3= <user>
##$USERA4= <user>
##$USERA5= <user>
##$V9= 5
##$VALIST= <valist>
##$VCLIST= <CCCCCCCCCCCCCCC>
##$VD= 0
##$VDLIST= <DDDDDDDDDDDDDDD>
##$VPLIST= <PPPPPPPPPPPPPPP>
##$VTLIST= <TTTTTTTTTTTTTTT>
##$WBST= 1024
##$WBSW= 4
##$XGAIN= (0..3)
0 0 0 0
##$XL= 0
##$YL= 0
##$YMAX_a= 647596
##$YMIN_a= -549944
##$ZGOPTNS= <>
##$ZL1= 120
##$ZL2= 120
##$ZL3= 120
##$ZL4= 120
##$ABSF1= 14.98509
##$ABSF2= -5.573092
##$ABSG= 5
##$ABSL= 3
##$ALPHA= 0
##$AQORDER= 0
##$ASSFAC= 0
##$ASSFACI= 0
##$ASSFACX= 0
##$ASSWID= 0
##$AUNMP= <proc_prof1d_extract_pilot.lims>
##$AXLEFT= 0
##$AXNAME= <>
##$AXNUC= <1H>
##$AXRIGHT= 0
##$AXTYPE= 0
##$AXUNIT= <>
##$AZFE= 0.1
##$AZFW= 0.1
##$BCFW= 0
##$BC_mod= 0
##$BYTORDP= 0
##$COROFFS= 0
##$CY= 15
##$DATMOD= 1
##$DC= 0
##$DFILT= <>
##$DTYPP= 0
##$F1P= 0
##$F2P= 0
##$FCOR= 0.5
##$FTSIZE= 32768
##$FT_mod= 6
##$GAMMA= 0
##$GB= 0
##$INTBC= 1
##$INTSCL= 1
##$ISEN= 128
##$LB= 0
##$LEV0= 0
##$LPBIN= 0
##$MAXI= 10000
##$MC2= 0
##$MEAN= 0
##$ME_mod= 0
##$MI= 0
##$NCOEF= 0
##$NC_proc= -8
##$NLEV= 6
##$NOISF1= 0
##$NOISF2= 0
##$NSP= 0
##$NTH_PI= 0
##$NZP= 0
##$OFFSET= 14.98509
##$PC= 1
##$PHC0= 97.37183
##$PHC1= 0
##$PH_mod= 1
##$PKNL= yes
##$PPARMOD= 0
##$PPDIAG= 0
##$PPIPTYP= 0
##$PPMPNUM= 2147483647
##$PPRESOL= 1
##$PSCAL= 4
##$PSIGN= 0
##$PYNMP= <proc.py>
##$REVERSE= no
##$SF= 400.02
##$SI= 32768
##$SIGF1= 0
##$SIGF2= 0
##$SINO= 400
##$SIOLD= 32768
##$SPECTYP= <>
##$SREGLST= <1H.CDCl3>
##$SSB= 0
##$STSI= 32768
##$STSR= 0
##$SW_p= 8223.68421052631
##$SYMM= 0
##$S_DEV= 0
##$TDeff= 65536
##$TDoff= 0
##$TI= <>
##$TILT= no
##$TM1= 0
##$TM2= 0
##$TOPLEV= 0
##$USERP1= <user>
##$USERP2= <user>
##$USERP3= <user>
##$USERP4= <user>
##$USERP5= <user>
##$WDW= 1
##$XDIM= 32768
##$YMAX_p= 469968095
##$YMIN_p= -706170
##$CURPLOT= <Network HP LaserJet P1505>
##$CURPRIN= <$Network HP LaserJet P1505>
##$DFORMAT= <normdp>
##$LAYOUT= <+/1D_H.xwp>
##$LFORMAT= <normlp>
##$PFORMAT= <normpl>
##$SURQMSG= 1
$$ End of Bruker specific parameters
$$ ---------------------------------
##NTUPLES= NMR SPECTRUM
##VAR_NAME=  FREQUENCY,     SPECTRUM/REAL,   SPECTRUM/IMAG
##SYMBOL=    X,             R,               I
##VAR_TYPE=  INDEPENDENT,   DEPENDENT,       DEPENDENT
##VAR_FORM=  AFFN,          ASDF,            ASDF
##VAR_DIM=   32768,         32768,           32768
##UNITS=     HZ,            ARBITRARY UNITS, ARBITRARY UNITS
##FACTOR=    0.250966925370066, 1,           1
##FIRST=     8223.43324360094, -190105,      -112999
##LAST=      0,             23936,           10591
##MIN=       0,             -706170,         0
##MAX=       8223.43324360094, 469968095,    0
$$ Real data points
##PAGE= N=1
##DATA TABLE= (X++(R..R)), XYDATA
$$ [...]
19553a48104a1036l26A9858a72580A27477a56371q398G0482H218M2241a49031
19541E2955c56408i3980r7534r8497O9834Q297c7966a5082j06045A48030M9672
19530A97702E9758J56669a5642j72079B26178b01347B42822d97089K33763B06976
19519D5461f0539A40696a46671P1003q2934l5883N9561H0400a48798B70882e456
19507G5885b00472B10020d9821E6028a6846A24725e296m26490a2519k271n31385
19496e46175A29420J8070e5171B8365L5321i3255B6738N2933i7892a1301D0846
19484a77881n6400h2248D4088a95807c325o0777K7607j96033E4637g3119k53175
19473c26294F2860N28P0952d06707A5968J43516d1802j50508G7750g3961k70673
$$ y = [-148104, -11036, -11362, 19858, -172580, 127477, -156371, -164769, 70482, 8218, 50459, -149031, 52955, -356408, -93980, -191514, -290011, -220177, -211880, -37966, -15082, -121127, 148030, 197702, 59758, 216427, -15642, -187721, 226178, -201347, 242822, -497089, -263326, 206976, 45461, -60539, 140696, -146671, -75668, -158602, -194485, -134924, 80400, -148798, 270882, -5456, 75885, -200472, 210020, -49821, 56028, -16846, 124725, -5296, -431786, -12519, -14790, -546175, 129420, 147490, -55171, 28365, 63686, -93255, 26738, 79671, -97892, -11301, 40846, -177881, -234281, -82248, 44088, -195807, -3325, -64102, -36495, -232528, 54637, -73119, -326294, 62860, 63388, 134340, -406707, 15968, 159484, -41802, -192310, 77750, -73961, -344634]
19462c44634h5043B70602a11731m9371A59788a65192H9802d2003o5432H6267a53171
19450A47249a41046D7845b02298N9678B96797h0559H0969b11097O3003D510a20823
19438a82116j03541l7199B85045C9429A0524d3960D7160a43719k74632a68102
19427C4212b17899I8301a33850A3112f5327j24030A36334c389C1726c28034J26565
19416b01469f6868I1036O7219B5757r846f7870G2383b11923I3781B8416e7127
19404F1795a66344n5172f7123q9107F2350e3831o4228C42413a8863L896l26325
19393c41292J25260a00052r0098H7882h6638j7066A1341J76409E9945J14535b72111
19381e7061B00443B3363a8281B74337d49113b07053e6201p1276J9232A25829b49024
$$ y = [-344634, -85043, 270602, -111731, -161102, 159788, -165192, 89802, -42003, -107435, 86267, -153171, 147249, -141046, 47845, -202298, -142620, 296797, -80559, 80969, -211097, -148094, 4510, -120823, -182116, -285657, -322856, 285045, 39429, 10524, -43960, 47160, -143719, -418351, -168102, 34212, -217899, 98301, -133850, 13112, -65327, -189357, 136334, -3389, 31726, -328034, -201469, -66868, 91036, 158255, 25757, 15911, -67870, 72383, -211923, 93781, 28416, -57127, 61795, -166344, -221516, -67123, -156230, 62350, -53831, -118059, 342413, -18863, -14967, -341292, -216032, -100052, -190150, 87882, -86638, -103704, 11341, 187750, 59945, 174480, -272111, -57061, 200443, 23363, -18281, 274337, -449113, -207053, -56201, -127477, -108245, 125829, -249024]
19369a43599b655B45308a35099l0854d6143A147b73178g2103F4939b7421J57B09304
19356a54005j57951c8935j86595A4918K03419b71247J8195A3707b82627h4413
19345A35858b62528O1409a9111m6033m312F3042N1760P5933c93745a45693B58928
19333C04280m9791a14666Q618j30066B07089c50970A32960R1331n1523a76426
19322h4434L3924j95688a8305o2884I2569a0507l03158a6370j37369o3741N683
19311b11797a1j29517m7966F1978b81079R270k01601J38783F0126N2003a12775
19299c78114a53457I2822K18403g0079q9014A9648a6059j56302K0831B0708d34283
19287b27251i420m31511O4771A97254i8886I3587N9032a5830B9502J9411j2718
$$ y = [-143599, -2655, 245308, -135099, -165953, -46143, 1147, -273178, -72103, 64939, -27421, -27264, 209304, -154005, -311956, -38935, -225530, 14918, 218337, -271247, -253052, 13707, -282627, -84413, 135858, -262528, -201119, -19111, -65144, -69456, 63042, 114802, 190735, -393745, -145693, 258928, 304280, 254489, -114666, -106048, -236114, 207089, -350970, 132960, 224291, 172768, -176426, -84434, -50510, -246198, -18305, -81189, 92569, -10507, -313665, -16370, -153739, -217480, -211797, -11, -129528, -177494, 61978, -281079, -271809, -473410, -334627, 60126, 112129, -112775, -378114, -153457, 92822, 311225, -70079, -159093, 19648, -16059, -172361, -151530, 20708, -434283, -227251, -9420, -440931, -376160, 197254, -98886, 93587, 152619, -15830, 29502, 48913, 36195]
19276C6195b21923a10879A14109b11836N0631p8714e6447H3796b13414o3856A01053
19264c4661n9752H2650a53922j01366H560J7549b88710h0282k4333a147j08287
19253a09434D5394c83937B8622c16250d2763A62665a27864A27172f3390K0174
19243d3216J0714m4580F7434L9608b17764B52022J1936b11936A0997J21661n7480
19232G5178K80813a04781p0139j6656a4245D0052c19776J25112e6067K1682l46121
19221c80506G2120k0535a31396k44031B46881b7828l5309o5684l9371A57056j9378
19210A37678b07118A33709f040j65601l83942a91807j9519A89555e7186H5217
19199b69094P7664f4536j42448a9705o3348J1641k81859A32267e5221j59232f1351
$$ y = [36195, -221923, -110879, 114109, -211836, -161205, -239919, -56447, 83796, -213414, -277270, 101053, -34661, -94413, 82650, -153922, -255288, 8560, 26109, -288710, -80282, -104615, -1147, -109434, 45394, -383937, 28622, -316250, -42763, 162665, -127864, 127172, -63390, -43216, -32502, -77082, 67434, 107042, -217764, 252022, 263958, -211936, 10997, 132658, 75178, 355991, -104781, -174920, -191576, -14245, 40052, -319776, -194664, -56067, -34385, -380506, 72120, 51585, -131396, -375427, 246881, -27828, -63137, -128821, -168192, 157056, 137678, -207118, 133709, -6040, -171641, -555583, -191807, -211326, 189555, -57186, 85217, -269094, -191430, -64536, -206984, -19705, -83053, -71412, -353271, 132267, -55221, -214453, -61351]
19187a42591A1892J88636L8247C6771a05500E1251a67846E7019J6115i2042B17809
19175b34132J5056B54345a45647O8884j06497m774E7516k4443b64779a5369B8262
19163a28821j786a6094E4893j612b69122d3004J2152k35117K4973F6383M111h5488
19150a17952k58545h5703E6344i6447o7090f6445j8540I8578d7263C622f006m37530
19138d43536i0328B30041G2340k9675a1767j14885l6437e056j04429j58698G2061
19126A79515g3738k72408A30437b42705C2443G508O1849g1051b9088n33007i2892
19114B31892f8899k36924E2663f0842E8840J45552f7425I7670h3244A18307a62693
19102C9766c9306D5119c64582A27077F1874c12717d0210r6685C8979B933O0526
$$ y = [-142591, 11892, 200528, 238775, 36771, -105500, 51251, -167846, 57019, 73134, -92042, 217809, -234132, -219076, 254345, -145647, -76763, -183260, -188034, 57516, 33073, -264779, -15369, 28262, -128821, -130607, -16094, 54893, 53281, -269122, -43004, -30852, -265969, -240996, 66383, 70494, -85488, -117952, -376497, -85703, 56344, -96447, -163537, -66445, -84985, 98578, -47263, 3622, -6006, -443536, -90328, 230041, 72340, 42665, -11767, -126652, -163089, -5056, -109485, -268183, 72061, 179515, -73738, -346146, 130437, -242705, 32443, 7508, 69357, -71051, -29088, -562095, -92892, 231892, -68899, -305823, 52663, -60842, 58840, 204392, -67425, 97670, -83244, 118307, -162693, 39766, -39306, 45119, -364582, 127077, 61874, -312717, -40210, -136895, 38979, 2933, 63459]
19091F3459h6723A36062d9802l96385a06829A2868M3993a37833B26310b23730
19080H3370e0822a5193B87044F8962h4069J1448a9976n9530B81838j38659c31627
19068B1762K393a79037f5951A8759h1256j83587f4442A7563R83K53601A0250a14003
19055i1342A16112f15686a28223j25773L2401c4706k14308D7225h4049l49493
19045d33542A00109N4419a62378A08110C6488b1519B64949o2391a34823A484a90035
19033D9305b70175f7996c1100C0879Q1592k1580J54493e7525A44528a65333A99632
19021A28262a98236A27815E1239k2179L6417K577M581g4921k703A51669b24941
19009c2075H84K60759K93987a80791O3151p814B0408J6602g5930j10111n54k5253
$$ y = [63459, -86723, 136062, -49802, -446187, -106829, 12868, 56861, -137833, 226310, -223730, 83370, -50822, -15193, 287044, 68962, -84069, -72621, -19976, -79506, 281838, 143179, -331627, 21762, 24155, -179037, -65951, 18759, -81256, -264843, -64442, 17563, 18546, 272147, 10250, -114003, -91342, 116112, -615686, -128223, -253996, -221595, -34706, -249014, 47225, -84049, -433542, 100109, 154528, -162378, 108110, 36488, -21519, 264949, 202558, -134823, 1484, -190035, 49305, -270175, -67996, -31100, 30879, 112471, 90891, 245384, -57525, 144528, -165333, 199632, 128262, -198236, 127815, 51239, 29060, 65477, 68054, 72635, -74921, -77624, 151669, -224941, -32075, 884, 261643, 555630, -180791, -117640, -125454, 20408, 37010, -75930, -186041, -186595, -211848]
18997b11848L3744f0404D2739b34665K0161b0602l0446j77326A95647a81820e2259
18985a19373Q239A9062a34860l9553f9704m7560C3976b6292o7458l1750N1556
18974g3944A85523E3610a61584N15B32878a76956P6426H3292i5280e543j37702
18963a43245C2447K19176d13197h0464B2265a31094A77747c04507a22584F3402
18952a60199G8083B3570b5595k1233B82351A18642i1159I8786M3054l4423J6260
18941A23677f9169r869r6147f6290A11205b10066j5124j35854C4980a50557K4800
18930a25757j00051o0906P6126L8322A49014i355A17508b09935a623A31794K8800
18919A60594a41927A65959b90222P6770Q8906o3196j43853i6939F9742b55256
$$ y = [-211848, -178104, -60404, 42739, -234665, -214504, -20602, -51048, -228374, 195647, -181820, -52259, -119373, -111134, 19062, -134860, -174413, -69704, -117264, 33976, -26292, -93750, -125500, -73944, 185523, 53610, -161584, -161069, 232878, -176956, -100530, 83292, -95280, -5543, -143245, 32447, 251623, -413197, -80464, 22265, -131094, 177747, -304507, -122584, 63402, -160199, 78083, 23570, -25595, -46828, 282351, 118642, -91159, 98786, 141840, 107417, 123677, -69169, -79038, -175185, -66290, 111205, -210066, -225190, -361044, 34980, -150557, -125757, -225808, -286714, -210588, -172266, 149014, -9355, 117508, -209935, -1623, 131794, 160594, -141927, 165959, -290222, -213452, -124546, -187742, -331595, -96939, 69742, -255256]
18908h6400J3690C29538a26786j46595C3421e5064r628j22976g1344j3431j23412
18897b08187F2508O1445b90480B65726c9020k21606j895n5519C3587a77250k79550
18886d56800h9759A23401a35079A01471i8297H4212F678f3172O729C3873b43411
18874b90410J29778d0681E7910b80580d8766A2277a3620o1341a1061D7942b96344
18862a2431C9219N8078j7609a8449j47368A2397K33889G1252N8491Q1183a07684
18850E4327o786M01332g112A71307b0877p7386C11825c04445f3236A87350a58005
18838d67811K18651m2457a22983d727k5378A1445J81728G9697b76015A91472a8787
18826d301j4207o3534p6870A79708b9274A56133O4071b41493B88210C7074a88668
$$ y = [-86400, -72710, 329538, -126786, -273381, 33421, -55064, -64692, -187668, -71344, -84775, -208187, 62508, 123953, -290480, 265726, -39020, -260626, -262521, -318040, 33587, -177250, -456800, -89759, 123401, -135079, 101471, -98297, 84212, 6678, -63172, -56443, 33873, -243411, -290410, -160632, -40681, 57910, -280580, -48766, 12277, -13620, -74961, -11061, 47942, -296344, -12431, 39219, 97297, 79688, -18449, -165817, 12397, 246286, 71252, 129743, 210926, -107684, 54327, 47541, 448873, -7112, 171307, -20877, -98263, 311825, -304445, -63236, 187350, -158005, -467811, -249160, -291617, -122983, -4727, -30105, 11445, 193173, 79697, -276015, 191472, -18787, -4301, -18508, -82042, -158912, 179708, -29274, 156133, 220204, -241493, 288210, 37074, -188668]
18814h9833C5442J93654b9551A27610a87452M1971B12744K26242r1375A35830
18803B12322o5920b50564D9188d9982B8378a15794J8209c2793q0065F238K93007
18792B99245I4769J31848J54235A7350b60781B9631a55362f0816E748h6155G4440
18780a43919I6784m4525a71559c473G6448g5692q8869f8786E6915a0410Q30l3496
18768d3076m7131B56622b44033e913G9386k0724a23107B3388h335k24600j99394
18757d32329b09656J6089r4081a06987j33356i707j04840D0955M750e915j91581
18746a97496j9342G4495b59759i3398G1180f231k96923a1485B59440a3908G108
18734d49411g5831A62095a17524I3382b11186J4318C374b22027R041D593c34563
$$ y = [-89833, 35442, 229096, -29551, 127610, -187452, -145481, 212744, 438986, 347611, 135830, 212322, 146402, -250564, 49188, -49982, 28378, -115794, -97585, -32793, -112858, 6238, 299245, 94769, 226617, 380852, 17350, -260781, 29631, -155362, -60816, 5748, -86155, 74440, -143919, 96784, 52259, -171559, -3473, 76448, -75692, -164561, -68786, 56915, -10410, -9580, -43076, -90207, 256622, -244033, -5913, 79386, 58662, -123107, 23388, -8335, -232935, -432329, -209656, -193567, -287648, -106987, -240343, -9707, -114547, 40955, 45705, -5915, -197496, -216838, 74495, -259759, -93398, 71180, -6231, -303154, -11485, 259440, -13908, 7108, -449411, -75831, 162095, -117524, 93382, -211186, -196868, 3374, -222027, -212986, 4593, -334563]
18722b37869a04074j934g223C6654A6600d0440j26961d401j10010C04195h9872
18710A16571k0415a06011K891B81411b69744j42091K02765H2768a44088l64536
18700e08624a910l68004Q9595G9804f685A45403l755b37860B69296b37080M4711
18689a92369A83648n9227K4066d8108r3026j41114b5626A14562D7030b52675A02851
18677I1999e9914A49876R8737a19571A39290a25796A16429m6043B228J64253E1640
18665C1148R215F267b2890l71445J71588B30154b13175A24979M3147L226a39756
18653F807K40249h241D7286A103K73343j28940E2689K2457i413k11707a1370l3107
18641d4477A0994a13649d4696o6349e283j66231g895j39058B2562O4316b83191
$$ y = [-237869, -104074, -106008, -7223, 36654, 16600, -40440, -167401, -4401, -114411, 304195, -89872, 116571, 96156, -106011, -103120, 281411, -269744, -411835, -209070, 82768, -144088, -508624, -1910, -369914, -280319, 79804, -6685, 145403, 141648, -237860, 269296, -237080, -192369, 183648, 124421, 148487, -48108, -141134, -282248, -25626, 114562, 47030, -252675, 102851, 91999, -59914, 149876, 248613, -119571, 139290, -125796, 116429, 70386, 2228, 166481, 51640, 31148, 40363, 6267, -22890, -394335, -222747, 230154, -213175, 124979, 168126, 171352, -139756, 6807, 247056, -8241, 47286, 1103, 274446, 145506, 52689, 75146, -9413, -221120, -11370, -44477, 10994, -113649, -44696, -111045, -5283, -171514, -7895, -146953, 22562, 86878, -283191]
18629c1436m9560p8587k18430a84840l63629b46183C3498M9247b42400C3393a10806
18617c52029a17909O501i760A60436e68497c8666l5405k5849A52792J04381j00013
18606A57160K807P2791N1176a41938p0099A04120c47445N1457B5205K4994b64015
18594E6785d0628j20562h0118A39605D7809b21816E5780a98490f3836A21569c32348
18582A37970L6176a8282j19573a2220n7694l3007g626B74362a03373A55335D8245
18570E8279d8383B7965a57588j4420j52n6246A34650g126l37970c1326j3j43110
18558a74449d8935A79920a68534m4655j03698d7502A8463b48034C29205d0029
18547h6650C00797e19402I0699a33101I3642J11374l7752C6295o699I627i1359
$$ y = [-31436, -80996, -159583, -378013, -184840, -548469, -246183, 33498, 82745, -242400, 33393, -110806, -352029, -117909, -111408, -9760, 160436, -568497, -38666, -74071, -99920, 152792, 257173, 157160, 159967, 232758, 283934, -141938, -212037, 104120, -347445, -295988, 25205, 50199, -264015, 56785, -40628, -161190, -80118, 139605, 47809, -221816, 55780, -198490, -63836, 121569, -332348, 137970, 174146, -18282, -137855, -12220, -69914, -102921, -7626, 274362, -103373, 155335, 48245, 58279, -48383, 27965, -157588, -172008, -172160, -228406, 134650, -7126, -345096, -31326, -31339, -174449, -48935, 179920, -168534, -213189, -316887, -47502, 18463, -248034, 329205, -40029, -86650, 300797, -519402, 90699, -133101, 93642, 205016, 167264, 36295, 29596, 9627, -91359]
18535b90957c4293C41967a09525C5389b41603A49693J3088b57196M6884A47573
18524I9612b50435F6639e9254J1660C3697A1848K4572a54602L8338A50711F7316
18512a92387A3248a66530d2497A67820b9719j21458A05517c31475p1740a01704
18501A18119K30812A27538a90728E4938i2121k78516J65108B7788a4925G1194
18490a56381c1273o6954j8696j82291a7100j46351B51719d18174a10341q5182
18480a95523A78703l8413i0670j79928N8078R4939J075C82095E1669J2060J93649
18469B57378j14269a58618j51874h2135k09339a1783m9713G5245c6111F6361a60111
18457a26241A03398a58928c7447G2276j8200K28184d7432j04273j77468B51927
$$ y = [-290957, -34293, 341967, -109525, 35389, -241603, 149693, 162781, -257196, -210312, 147573, 99612, -250435, 66639, -59254, -47594, 33697, 11848, 36420, -154602, -116264, 150711, 67316, -192387, 13248, -166530, -42497, 167820, -29719, -151177, 105517, -331475, -403215, -101704, 118119, 348931, 127538, -190728, 54938, -92121, -370637, -205529, 27788, -14925, 71194, -156381, -31273, -98227, -116923, -299214, -17100, -163451, 251719, -418174, -110341, -195523, 178703, 140290, -90670, -270598, -212520, -117581, -116506, 382095, 51669, 63729, 257378, 143109, -158618, -310492, -82135, -291474, -11783, -61496, 75245, -36111, 66361, -160111, -126241, 103398, -158928, -37447, 72276, 54076, 282260, -47432, -151705, -329173, 251927]
18446c9008j06403e8367B2341i7971I4543b25597P3467A72497a97785A49267b9117
18434B63335A5877K02839D4599b42492k39727a7085K330k57343C0988f354l07263
18423c13617A33407f0302E6462J31833A2900c20922O8393N015g3090C07231a02759
18411G7064l4767b04519A04297m1369K31814a49454o5418k8552D5818R6849o9272
18400G3395a85479o3306B20886k5943a11024j02065b6934B37966a6064A20546
18389G3502J07117a22455C09a89412J743B0011b09111j6519E2941e2945D4719
18377a77619B20736o7296g8156p8157L462A20982a85210A47774f6522d221j92187
18366a96408c4531n2382A7073N3329L49419a0708D0903J66940c14873a54893A3328
$$ y = [-39008, -145411, -58367, 22341, -97971, 94543, -225597, -152130, 172497, -197785, 149267, -29117, 263335, 15877, 218716, 44599, -242492, -482219, -17085, -14755, -272098, 30988, -6354, -313617, 133407, -60302, 56462, 188295, 12900, -320922, -252529, -247514, -73090, 307231, -102759, 77064, 42297, -204519, 104297, 62928, 294742, -149454, -214872, -243424, 45818, 142667, 73395, -185479, -248785, 220886, 194943, -111024, -213089, -26934, 237966, -16064, 120546, 73502, 180619, -122455, 309, -189412, -187669, 20011, -209111, -225630, 52941, -52945, 44719, -177619, 220736, 153440, -78156, -156313, -152851, 120982, -185210, 147774, -66522, -4221, -196408, -34531, -86913, 17073, 70402, 419821, -10708, 40903, 207843, -314873, -154893, 13328]
18354a86296n465E6183p802a20238G3355P6475b4282j73904D2684f3505o5870
18343a29375O0399F8038P4757l7715a55754R921a4310o1990j66527P8506c6633
18331G6150K41243a06377n6188P1414B25319B1953J14531g4431F1267a4668j48244
18320a62912j8671k681E8991b08206C0788J8112J83904I8123N1688b20579h9760
18308g1076C57092A38301g3486j58800i3223j61309A06643B9143d8502A80716
18297a19116J7292j4595A20805b72582b2923C52135e4041n0908q6670b0146j90506
18286b10652p3424F7827J53445a9843l40204a8330j16218C4482b10773q7131a33774
18274G9129h5829p8362O4507c5309o2780j64591G930J87779e6417A99489o8409
$$ y = [-186296, -191761, 56183, 48381, -120238, 73355, 149830, -24282, -198186, 42684, -63505, -129375, -68976, 68038, 142795, 105080, -155754, -145833, -14310, -76300, -242827, -164321, -36633, 76150, 317393, -106377, -162565, -91151, 225319, 21953, 136484, -74431, 61267, -14668, -162912, -181583, -184264, 58991, -208206, 30788, 48900, 232804, 98123, 149811, -220579, -89760, -71076, 357092, 138301, -73486, -232286, -93223, -254532, 106643, 29143, -48502, 180716, -119116, -101824, -116419, 120805, -272582, -22923, 352135, -54041, -104949, -191619, -20146, -210652, -284076, 67827, 221272, -19843, -360047, -18330, -134548, 34482, -210773, -297904, -133774, 79129, -85829, -164191, -99684, -35309, -98089, -262680, 7930, 195709, -56417, 199489, 131080]
18263A31080q9C4449b00977C95181C4354i2267A21841n6812g163j36403B03238
18251b99306e5023I8238c63613J18834f5484E895K64292g560r0726C21214A00260
18239b27172G5449B3024O9678J0699a42841d8004D8445b86399a01522k77895a04
18227a99259Q8243B87255a18702k22069G9125d11542f196A58899D9024O8800h7977
18215a06153j31042j07758e4995o2054m6845H2K06627b76971A73239E1484h953
18203a20297e2084D4281a75128Q1260b7952j13651n431d4474A10311k0792e025
18191f9733m2874r1252e940j87095e4571G0222b00086D7437e2230A44720c10785
18179c61488i9300p8644d7007j59880N2377C6836b07994a5240M594j17738j1069
$$ y = [131080, 130991, 34449, -200977, 395181, 34354, -92267, 121841, 65029, -7163, -143566, 203238, -299306, -55023, 98238, -363613, -244779, -65484, 5895, 270187, -7560, -98286, 321214, 100260, -227172, 75449, 23024, 92702, 103401, -142841, -48004, 48445, -286399, -101522, -379417, -104, -199259, -111016, 287255, -118702, -340771, 79125, -411542, -6196, 158899, 49024, 117824, -87977, -106153, -237195, -344953, -54995, -117049, -163894, 82, 206709, -276971, 173239, 51484, -8953, -120297, -52084, 44281, -175128, -93868, -27952, -141603, -147034, -44474, 110311, 89519, -5025, -69733, -112607, -203859, -5940, -193035, -54571, 70222, -200086, 47437, -52230, 144720, -310785, -361488, -99300, -177944, -47007, -206887, -154510, 36836, -207994, -15240, -10646, -128384, -139453]
18168a39453B26238H2502i9700j9555q7535i1323j20501P5540B10220c29848F6139
18156B27594F8906g8924k47170L0078P8926B6704b41392M8376a5569l07358A23675
18144A91251J09164a51627k86636e5270A91691N097h8780J9413C56771a54706
18133e9835j07202a4420A79473N9908p8059a81731Q1346B44647c8175B49427q3586
18122A65841n5640a6807F2097J0393M7241e1223B00067L3000b59363A9938o792
18111A3146e103k83598c9210j44298I9980k5241b00913G426e7320p4312E9551
18099b4640o9391C42423d0634m01768A31940c59071B1082a11723C03894m0070
18089B63824n9656b42018E5701b41962a20667l25848H1427l5802a4060B18287
$$ y = [-139453, 226238, 82502, -99700, -119255, -206790, -91323, -211824, -136284, 210220, -329848, 66139, 227594, 68906, -78924, -326094, -296016, -217090, 26704, -241392, -193016, -15569, -322927, 123675, 191251, 300415, -151627, -438263, -55270, 191691, 196788, -88780, -69367, 356771, -154706, -59835, -167037, -14420, 179473, 239381, 161322, -181731, -100385, 244647, -38175, 249427, 165841, 110201, -16807, 62097, 72490, 119731, -51223, 200067, 233067, -259363, 19938, 13146, -5103, -288701, -39210, -183508, 99980, 74739, -200913, 7426, -57320, -131632, 59551, -24640, -94031, 342423, -40634, -442402, 131940, -359071, 21082, -111723, 303894, 263824, 204168, -242018, 55701, -241962, -120667, -446515, 81427, 45625, -14060, 218287]
18078F2325P949a27604A62663c26683b8514k35936I5875N8424a61128k19364a951
18066a35584B08668A3410N8089e0100B33272b6742F2844K2651c01840R1671e833
18054B8733b50078A48794m0609B1264r352L3373h4517E0586a0409r4623F2804
18042A30151b25835J05244E5323j6760c04251b1379r769H7123e4628j35069B41002
18030c05296A61977a41883f3102q9429A89194a64162p1187C34268i5875n8592
18020a54467A23209K54286c53743H4266A439J70933L4602E9256b54018p117m8099
18009c09234A56596M57146a60027C045a3785H6383B4513a90856e8944j49008G4682
17997e6791I9611K0439B70J72148b05941j59648a65110R601q0273a05353r8362
$$ y = [62325, 70274, -127604, 162663, -326683, -28514, -264450, 95875, 154299, -161128, -380492, -1951, -135584, 208668, 13410, 71499, -50100, 233272, -26742, 62844, 85495, -301840, -210169, -5833, 28733, -250078, 148794, 108185, 21264, 11912, 45285, -84517, 50586, -10409, -105032, 62804, 130151, -225835, -120591, 55323, 38563, -304251, -21379, -31148, 87123, -54628, -189697, 241002, -305296, 161977, -141883, -63102, -152531, 189194, -164162, -235349, 334268, -95875, -154467, 123209, 377495, -353743, 84266, 1439, 172372, 206974, 59256, -254018, -261135, -309234, 156596, 613742, -160027, 3045, -13785, 86383, 24513, -190856, -58944, -207952, 74682, -56791, 99611, 120050, 270, 172418, -205941, -365589, -165110, -155509, -235782, -105353, -203715]
17986b03715R0074A76782a66552n5788B95353b81441a23116A00067K92548C585
17975a68914F0544a79348O0502F5209Q2885A2872K48278H8311c1704E661P4567
17964H0228b32362a09441c589I9516a11620b7471B56945a55265O0601I3469b37932
17952b21148Q4815O3776j57658D7922K88636g3251A13490M6589b7485j87977a8285
17940a26570d9259B113e6574k62471B7611K51677a59470j24536G3078i5383A18291
17928f1325k35946a26279l16886A60166J84114a37655b9306j6504p4897j00120
17918b20827d5094B11732b72316A82986F3449O5758a62553H2718c2348r6974A1105
17906d772p6567j55723N3999n0788N8793L9338j22867B24684e8179a7418C02589
$$ y = [-203715, -113641, 176782, -166552, -222340, 295353, -281441, -123116, 100067, 392615, 3585, -168914, 60544, -179348, -118846, 65209, 148094, 12872, 261150, 88311, -31704, 5661, 80228, -232362, -109441, -3589, 99516, -111620, -27471, 256945, -155265, -94664, 93469, -237932, -221148, -136333, -72557, -230215, 47922, 336558, -73251, 113490, 160079, -27485, -215462, -18285, -126570, -49259, 2113, -56574, -319045, 27611, 279288, -159470, -284006, 73078, -95383, 118291, -61325, -297271, -126279, -443165, 160166, 344280, -137655, -29306, -45810, -120707, -220827, -45094, 211732, -272316, 182986, 63449, 129207, -162553, 82718, -32348, -129322, 11105, -4772, -81339, -237062, -183063, -233851, -175058, -135720, -258587, 224684, -58179, -17418, 302589]
17894a5832k01822I1269C8423a36910E6636L9856b04410a4909m12509B66482Q4504
17883C50986G856K1486L838g6565C7157f1915l51565A04947N2166B5191a21853
17871a0778l2818F9652O0023E9370h4114k292k05771A17727J40443j12304E9373
17859A06694a38441A17695B0952N1092A9497L6913b06185A59678c4831C7809f4462
17847b16595I1074J14837a92890C5941c940A9509K1840c05885e9659K3665k15802
17836b51796K5149M5164B73060f7282B17540A05356c58452h2998A23332a45210
17825A17816P0277a87083m1759A34298e6931D9363b34921a05562o3259A29952
17814a87439I6363K57100c35775A72078f0368k2109k3747F4344k2314b0234D1441
$$ y = [-15832, -217654, 91269, 38423, -136910, 56636, 96492, -204410, -14909, -427418, 266482, 350986, 7856, 29342, 33180, -76565, 37157, -61915, -413480, 104947, 157113, 25191, -121853, -10778, -43596, 69652, 129675, 59370, -84114, -86406, -292177, 117727, 258170, 145866, 59373, 106694, -138441, 117695, 20952, 72044, 19497, 56410, -206185, 159678, -34831, 37809, -64462, -216595, 91074, 205911, -192890, 35941, -3940, 19509, 41349, -305885, -59659, -35994, -251796, -226647, -181483, 273060, -67282, 217540, 105356, -358452, -82998, 123332, -145210, 117816, 188093, -187083, -228842, 134298, -56931, 49363, -234921, -105562, -168821, 129952, -187439, 96363, 353463, -335775, 172078, -60368, -82477, -106224, 64344, 42030, -20234, 41441]
17802F9192a20553j91803A42556b91755A80062K02264a15931n666B7476K26105
17792B53581j23922a24134o3445j68720a1880p0543j2072k8618B50262b1370A39966
17780I5468m5016d1891q3953j37776A73349H4839e755n7133G9911b05253C30709
17768a62021l0694c0113E0827A2440a20476I8671a37683H1144a75262A43277j7210
17757A26067a44175L7639j7276M9188r9021A33863D1893f8125B67511F5189K84035
17746C49224b64915B19251a06419k9284F019c24599A9570a10934A3018d8901o0078
17735a08979j0998A2681a39929A35994e8156j94045g4140F1209Q347b96383a45742
17723b54929c7675G5098O6466i8141B76833F5457J56650b48934B00676p4958d60383
$$ y = [69192, -120553, -312356, 142556, -291755, 180062, 382326, -115931, -121597, 27476, 253581, 129659, -124134, -187579, -356299, -11880, -82423, -94495, -123113, 250262, -21370, 139966, 95468, 50452, -41891, -125844, -263620, 173349, 84839, -5755, -62888, 79911, -205253, 330709, -162021, -192715, -30113, 50827, 12440, -120476, 98671, -137683, 81144, -175262, 143277, 126067, -144175, -106536, -123812, -74624, -173645, 133863, 41893, -68125, 267511, 65189, 349224, -264915, 219251, -106419, -135703, 6019, -324599, 19570, -110934, 13018, -48901, -108979, -119977, 12681, -139929, 135994, -58156, -252201, -74140, 61209, 69556, -296383, -145742, -254929, -37675, 75098, 141564, -98141, 276833, 65457, 222107, -248934, 200676, 125718, -460383]
17711b8656B16806b66633B56006a8073H4020a76089r5322j6977B8156J14040a29869
17699D477a53685g272E4195a03039c1444n0780A33655h7448j26185J03654J3819
17688i6160H242b0930n1911B3391J9965a16966B47191L2025j05687l8834j6933
17677A17762g0222A61045f0784A24469m2191a02934r3347k5747A64476c2133p0549
17666a02682A77096A5303c50501B10976D1208J19749J0377K2323G4645L5560a5663
17654A72342A6534J31887a72680h300B60564b32674B7509g0270J9924A08418L623
17643A12041a13899b1622j15808B35332q4939o8575a68474E2743a92342A35234
17632B05594i7717j08313e5735B81953f8703a8852B5624N1784K2155J95838a47590
$$ y = [-28656, 216806, -266633, 256006, -18073, 84020, -176089, -271411, -288388, 28156, 142196, -129869, 4477, -153685, -7272, 54195, -103039, -31444, -82224, 133655, -87448, -213633, -109979, -96160, 8242, -20930, -72841, 23391, 43356, -116966, 247191, 279216, 173529, 134695, 117762, -70222, 161045, -60784, 124469, 82278, -102934, -196281, -222028, 164476, -32133, -102682, 177096, 15303, -350501, 210976, 41208, 160957, 171334, 193657, 74645, 110205, -15663, 172342, 16534, 148421, -172680, -8300, 260564, -232674, 27509, -70270, -50346, 108418, 112041, -113899, -21622, -137430, 235332, 150393, 81818, -168474, 52743, -192342, 135234, 205594, -97717, -206030, -55735, 281953, -68703, -18852, 25624, 77408, 99563, 295401, -147590]
17620D9440J91421b981k60623R0828B12633b05346A78318g452k39818E9842f14
17608a69809g339E2614R0592j6060a71718A71149J73112A31628a7304n1352C6662
17596e1432A19950a50854m7619b4134r0926A483K7871e0261G4808i0494O148A47224
17583B0590e4740l34j0433H2070c5169I8617J21810I7475a4459B0669O6360a72865
17570A00787K7754K2184j2736a32819A58181i1790A42558a64734P5785k71654
17560c60603A22961C4197K16781P0636D3086e9025C807b38697A40243c405J95
17549c210A03525n1513h002A84742f9610j87276b379k37764B48344b78901J20716
17538a58185D1743a15828o733a337n6247H8343J24795f3898k34745b2571D5985
$$ y = [49440, 240861, -2981, -263604, -172776, 212633, -205346, 178318, -7452, -247270, 59842, -614, -169809, -7339, 52614, 143206, 127146, -171718, 171149, 344261, 131628, -17304, -68656, 36662, -51432, 119950, -150854, -198473, -24134, -115060, 1483, 29354, -50261, 74808, -90494, -84346, 147224, 20590, -54740, -55074, -65507, 82070, -35169, 98617, 220427, 97475, -14459, 20669, 87029, -172865, 100787, 128541, 150725, 137989, -132819, 158181, -91790, 142558, -164734, -88949, -360603, 122961, 34197, 250978, 321614, 43086, -59025, 3807, -238697, 140243, -3405, -3210, 103525, 52012, -8002, 184742, -69610, -256886, -2379, -240143, 248344, -278901, -158185, 41743, -115828, -122561, -1337, -57584, 88343, 213138, -63898, -298643, -22571, 45985]
17526a12432L2350C07550F3949j9349J6244J25385P9576A8075K54568E5430N8576
17515A14006O6560m8989a13292A69218B6977h7490E3764J64817F9936K32735I3668
17503C80749A11265L54405B12875k5425o6101O6537C3738J31873q1838M2613f4052
17491B42210k799r4080B0498J71234f4044A77915J12125b24668i2080k8658r6959
17480b17697A9757K28079a39397F2505a32657B12635e5294A23823N7741b3780
17469F1518f3275A35862L17605j20437I2313a53353C64626A46994C3485A5752
17458a84506K6486A94014a52978j08084C73596N559A24584J96145M2536A1064
17447C48150j18297J58589I9417P7853L07694j63927G7923J09571R4933n9339
$$ y = [-112432, -80082, 307550, 63949, 44600, 60844, 186229, 265805, 18075, 272643, 55430, 114006, 180566, 131577, -113292, 169218, 26977, -87490, 53764, 218581, 69936, 302671, 93668, 380749, 111265, 465670, 212875, 187450, 121349, 187886, 33738, 165611, 83773, 126386, -64052, 242210, 239411, 145331, 20498, 191732, -64044, 177915, 290040, -224668, -92080, -120738, -217697, 19757, 247836, -139397, 62505, -132657, 212635, -55294, 123823, 181564, -23780, 61518, -63275, 135862, 453467, 333030, 92313, -153353, 364626, 146994, 33485, 15752, -184506, -158020, 194014, -152978, -261062, 373596, 379155, 124584, 320729, 363265, 11064, 348150, 229853, 388442, 99417, 177270, 484964, 321037, 77923, 187494, 282427, 223088]
17437B23088L738K83163B28466J35804A04246K08214J12847A32389K3394J59891
17427C15674P3638j92835I5073R9831H5433K70021j09581M1851R5895r3709n929
17416B83981A24481K07601r6647A6163a24416D21859A00146J93125B9046f6428
17405B15333Q4962I806J78414n4792A907K11281o264Q6997a86714G911a54277
17393A22182p758O6501J15118B903K72942L0255e3509l0545G9433K2490R7575
17382A99498b07523D5710A6495L06998A21141K06154H7168P3537c1178D7270J75221
17371B22491K3619I5523a56546C24377b03154D33310B0338K05553l9210r0437
17361I6244a06908J6275A72514m6457K6901Q9351k1861M1358g0051A52302b4178
$$ y = [223088, 226826, 509989, 228466, 364270, 104246, 312460, 425307, 132389, 155783, 315674, 389312, 196477, 95073, 194904, 85433, 355454, 245873, 287724, 383619, 289910, 283981, 124481, 332082, 235435, 16163, -124416, 421859, 100146, 293271, 29046, -66428, 215333, 300295, 9806, 188220, 133428, 1907, 213188, 206924, 293921, -186714, 7911, -154277, 122182, 114424, 180925, 296043, 2903, 275845, 306100, -53509, -84054, 79433, 101923, 199498, -207523, 45710, 16495, 323493, 121141, 327295, 87168, 160705, -31178, 47270, 222491, 246110, 95523, -156546, 324377, -203154, 433310, 20338, 225891, 186681, 96244, -106908, -90633, 172514, 126057, 152958, 242309, 220448, 261806, -70051, 152302, -24178]
17349A30336J874L20556A34381l7276K14461p2704o9304R7643j10821o1148K40123
17338C35355r5705i4648G2377L03130E0645a32852A85610E4715J33789C0120J4326
17327D4446J7755N7132m6749l0472h9807B47145J77617I6296b10226B98045Q9396
17316C87441k3810A07891k6732a98444A54171L29455A94854c45938G2097R970
17306H2067L50913G8629A8745K12826A0902J38205n9452j2900J17716M9428f9667
17294B66554H0261L31694B3600J50633d0290A83712J14886n6785j2882L0488A0390
17282a50503A72899E9202N68254e2642B83496j15174J59312K3210a92474C06375
17271B38036p6438q0171K27179p0543R5087B1909J11780L36610b7478A41163o8048
$$ y = [130336, 132210, 452766, 134381, 97105, 311566, 238862, 169558, 267201, 156380, 95232, 335355, 239650, -94648, 72377, 375507, 50645, -132852, 185610, 54715, 188504, 30120, 44446, 62201, 119333, 72584, 42112, -89807, 247145, 424762, 96296, -210226, 298045, 387441, 363631, 107891, 81159, -198444, 154171, 483626, 194854, -345938, 72097, 82067, 432980, 78629, 18745, 231571, 10902, 149107, 89655, 76755, 194471, 243899, -69667, 266554, 80261, 411955, 23600, 174233, -40290, 183712, 298598, 241813, 228931, 259419, 10390, -150503, 172899, 59202, 627456, -52642, 283496, 168322, 327634, 350844, -192474, 306375, 238036, 161598, 81427, 308606, 238063, 333150, 21909, 133689, 470299, -27478, 141163, 73115]
17260G3115P5063N0736R7858H0065K9785R1999o0384J43861l7289H9090J53701
17249B42791a68782B51863K15045A06567L71302A47794R0603j18211J65725I7393
17238b41211B99839c2486A46175L49731A29651L8224K22556H3482J37369j10196
17228A10655C6410K35379h6386B75595B4039J1155R1895J16460E6442L86513a24397
17216B31628B7159f8374B68095o1508j1109J03275A7535J86143J67179j54298
17206B16559j5348L0880n0424e222C19433N5100A71014R6877L76269B64612j04009
17195A60603l629K10567r3402k348K88910k04215d469B67981L9729p7523L49753
17184E79940A62199N5142a45335C45128k2727j46481P0410E3849m584L46738A39463
$$ y = [73115, 148178, 198914, 296772, 80065, 109850, 201849, 141465, 285326, 248037, 89090, 242791, -168782, 251863, 466908, 106567, 477869, 147794, 238397, 120186, 285911, 97393, -241211, 299839, -32486, 146175, 495906, 129651, 167875, 390431, 83482, 220851, 110655, 36410, 271789, -86386, 275595, 24039, 35194, 127089, 243549, 56442, 442955, -124397, 231628, 27159, -68374, 268095, 206587, 195478, 298753, 17535, 203678, 370857, 216559, 201211, 232091, 181667, -5222, 319433, 374533, 171014, 267891, 644160, 264612, 160603, 156974, 367541, 274139, 271791, 560701, 356486, -4469, 267981, 307710, 230187, 579940, 162199, 217341, -145335, 345128, 322401, 175920, 246330, 53849, 49265, 396003, 139463]
17172A32089N34434P6193l35791b8039B79595B4456d4304B23637N1679K99956
17162E75272B45854J02769j57546J93110Q060j22221J39752B03583N4422k65J53564
17151D11304p4412A58245O5428K41878A22679R8997J40922l1885j04036P1294
17141B97971I6836O3821L98117B8233M0975C3427M21451A29548o688J62492R834
17130B95186A47065J03107F9312M89066j02901j63227r7307J87616K58448A87218
17119F28582l09776L44664k2696B96394J93327j51169J1715q232L38550k33916
17109D46669L6483D013Q5379K73736l4553L19186B21203J47938K10337j82477
17099C97001o7018L4076J04715Q5098r996r5217J29631B56148J87533q1524L0420
$$ y = [132089, 666523, 742716, 406925, -28039, 279595, 24456, -44304, 223637, 275316, 575272, 245854, 348623, 191077, 384187, 392247, 270026, 409778, 203583, 258005, 257740, 411304, 336892, 158245, 223673, 465551, 122679, 221676, 362598, 330713, 226677, 297971, 96836, 160657, 558774, 28233, 69208, 33427, 454878, 129548, 122860, 285352, 295186, 147065, 250172, 69312, 558378, 455477, 292250, 194943, 382559, 641007, 187218, 628582, 318806, 663470, 640774, 296394, 489721, 338552, 350267, 342035, 680585, 446669, 483152, 4013, 89392, 363128, 328575, 647761, 221203, 369141, 579478, 397001, 329983, 364059, 468774, 553872, 543876, 448659, 578290, 256148, 443681, 362157, 392577]
17088C92577o3301m1625J47476J52339k67783Q5830j16783p6456N42205B03014
17077B20913I8815K54582K233J61388q4713J46853k86663L08089k76359N26002
17067H50227j7406j55808B30744N24540l71169m6771J37499K26576j82918P8657
17057E97158K6023N178k9650j9077l5792Q2388L7265j81110l5122N3871M5194
17046E46326J99742m3437j94086L6393J69598q6558L48058m35445K49765j22456
17036F67900k19592J80256M31456E26077m2550N0767o9308Q9564N8005j01725
17026E10830l8358r3899J61988N4006K5142R607r6823K06948j65178j41822n9959
17015C72482L24001J29830j74853k5420k1591O8934A95792M87100j19177J12347
$$ y = [392577, 329276, 287651, 435127, 587466, 319683, 405513, 288730, 212274, 754479, 203014, 220913, 98815, 353397, 355630, 517018, 432305, 579158, 292495, 600584, 324225, 850227, 832821, 677013, 230744, 755284, 384115, 337344, 474843, 701419, 518501, 597158, 623181, 628359, 598709, 579632, 543840, 626228, 663493, 482383, 447261, 501132, 546326, 746068, 702631, 508545, 544938, 714536, 627978, 976036, 540591, 790356, 667900, 448308, 628564, 1060020, 526077, 483527, 534294, 464986, 554550, 612555, 510830, 472472, 378573, 540561, 594567, 619709, 629316, 532493, 739441, 574263, 432441, 372482, 696483, 826313, 651460, 626040, 604449, 673383, 195792, 682892, 563715, 676062]
17005F76062K9900K59034k87183n9488L84650k45660J17428J48375k38933l868
16995G80317j7971k5421P3827l8665K47823k15790k73346L99756k69067J22341
16985G83804m2078J77627k90482K22193j79911J53828p4405K47588j46736K96183
16975A147611k36200K88085m8135k62479J35001k03553J81599J63781o6257o5378
16965A034075j13288J61974J73171r0170j65181R2198L60453n52907r617L45654
16955A236362k51408k2861J95842j2818k4292K96722m31595L39579k27952j86646
16945I10933L22951q8040j93857M81869K1764m80397j8502J91247j81187k59257
16935G07524K55834L34291K22178j23051K76354l10013K70398n54907M09857k9544
$$ y = [676062, 705962, 964996, 677813, 618325, 1002975, 757315, 874743, 1023118, 784185, 780317, 762346, 736925, 810752, 772087, 1019910, 804120, 530774, 930530, 661463, 783804, 741726, 919353, 628871, 851064, 671153, 824981, 750576, 998164, 851428, 1147611, 911411, 1199496, 1151361, 888882, 1023883, 820330, 1001929, 1165710, 1099453, 1034075, 920787, 1082761, 1255932, 1165762, 1000581, 1092779, 1453232, 900325, 890708, 1236362, 984954, 962093, 1157935, 1145117, 1120825, 1417547, 985952, 1325531, 1097579, 910933, 1233884, 1145844, 951987, 1433856, 1455620, 975223, 956721, 1147968, 966781, 707524, 963358, 1297649, 1519827, 1396776, 1673130, 1363117, 1633515, 1078608, 1488465, 1458921]
16925A458921K3677k72772Q233M30192j234J31845k59841J8235j02201k942K16548
16914A648661k2691k37169N3709J53746J91279k29334M7155J53102J39462k27240
16904A670680J249k8399p0224J84534J23729k30027L93565o4202k98392J81642
16894A864155r550N34101o42831K82444O9246M2144O6020k02506j32685L98797
16884B269335m7113K30466k96387j54653R2663K67023J0506N8251N698J00739
16874B536528M0167J29242k88007M28217k42075J86001L0808l7843J30774j61120
16864B752692m3369L70731p3478j31346j63793K10452L92416j85602K46701l15236
16854C060168K14684O9464J11458q1519q3921K19544k30148K73388J92934L25911
$$ y = [1458921, 1482598, 1209826, 1218059, 1648251, 1647017, 1778862, 1519021, 1537256, 1435055, 1432113, 1648661, 1625970, 1388801, 1442510, 1596256, 1787535, 1558201, 1605356, 1758458, 1897920, 1670680, 1671929, 1643530, 1573306, 1757840, 1881569, 1651542, 2045107, 1980905, 1682513, 1864155, 1854605, 2388706, 1745875, 2028319, 2097565, 2139709, 2205729, 2003223, 1870538, 2269335, 2222222, 2452688, 2156301, 2001648, 2094311, 2361334, 2371840, 2430091, 2435789, 2536528, 2576695, 2705937, 2417930, 2846147, 2604072, 2790073, 2820881, 2783038, 2913812, 2752692, 2709323, 3080054, 3006576, 2875230, 2711437, 2921889, 3314305, 3128703, 3375404, 3060168, 3274852, 3344316, 3455774, 3374255, 3290334, 3509878, 3279730, 3553118, 3746052, 4071963]
16844D071963k84517K45558o4128p364J82797J98878L480m41255N92907r9381
16834D398938J21926M0249M2452k79368K73848M19961l73623K97553K33830j61199
16824E014567O37471m11733L46731R3070M7187J27168J59188k22779J45743K70209
16814F206822M61792j26384J33631o0823N72853K03239J7894k88719P03052j01604
16804G721753J4360M32268j99958K55486R40461m25232L06163p1847M96755P7249
16794I547458L18349J33570p2824O10112K31515L76305K29447J12974L63626M66187
16784A2316719M36444m0473M96196M16841P04169J19348P03202J41863L62213
16775A5656522N93968P32663O89639K498J137864P66167O48166N19109N22579
$$ y = [4071963, 3787446, 4033004, 3968876, 3961512, 4144309, 4343187, 4346667, 3905412, 4498319, 4398938, 4520864, 4561113, 4603565, 4324197, 4598045, 5018006, 4644383, 4941936, 5175766, 5014567, 5652038, 5240305, 5587036, 5680106, 5727293, 5854461, 6013649, 5790870, 5936613, 6206822, 6668614, 6542230, 6675861, 6615038, 7187891, 7391130, 7409024, 7120305, 7823357, 7721753, 7736113, 8168381, 7968423, 8223909, 9164370, 8739138, 9045301, 8973454, 9470209, 9547458, 9865807, 9999377, 9926553, 10536665, 10768180, 11144485, 11373932, 11486906, 11850532, 12316719, 12753163, 12712690, 13208886, 13625727, 14329896, 14449244, 15152446, 15294309, 15656522, 16250490, 16983153, 17672792, 17675290, 18813154, 19579321, 20227487, 20746596, 21269175]
16766B1269175Q33048P56819Q02141R33388O20389J517224O20462J049243J245511
16757B9647400J297370J019512J676152J384357J682105J479756J570033J677469
16749D1434154J834213K574402K151098K191404K291484K293713K865153L312672
16741F0948293K868115L782640L516661L796159M003083M552434M115411M920672
16733I2503468N185346N185541N823832N756552N830650O024399O036180O344143
16725A38690111N917334O105134N918862N133368M659097M012033L424192K591310
16717A76451441J401979N58919k82972j748418k438120l377989l740082m882234
16709A61942524m973659n906035o030967o125879o689820n756124o523456n663613
$$ y = [21269175, 22102223, 22859042, 23661183, 24594571, 25214960, 26732184, 27352646, 28401889, 29647400, 30944770, 31964282, 33640434, 35024791, 36706896, 38186652, 39756685, 41434154, 43268367, 45842769, 47993867, 50185271, 52476755, 54770468, 57635621, 60948293, 63816408, 67599048, 71115709, 74911868, 78914951, 83467385, 87582796, 92503468, 97688814, 102874355, 108698187, 114454739, 120285389, 126309788, 132345968, 138690111, 144607445, 150712579, 156631441, 161764809, 166423906, 170435939, 173860131, 176451441, 177853420, 178412339, 178129367, 176380949, 173942829, 170564840, 166824758, 161942524, 156968865, 151062830, 145031863, 138905984, 132216164, 126460040, 119936584, 114272971]
16701A14272971o286802n519291n477352n494511m741605m421120m450310m009859
16693G3872121l965383l707855l499788l205365k991790k876438k740415k870799
16685D8014288j871879k466221k084139j380384k123221j399369j954131j059818
16677C3675126j779355j305822j219470j051188j153207j202705j048543r09502
16669B4005334j239730n60939p61718q06344o76185q42073n84285l17997j050214
16660A7165849l05931m98223n12126q40526l89781o81507j35097k74832l09931
16651A3217895n23659n91540m5209m79717o20539j14115n19097J87378m42332
16642A0069065j84128m60136j24297l36936k9488n45619P5367l07728K71692n78457
$$ y = [114272971, 107986169, 102466878, 96989526, 91495015, 86753410, 82332290, 77881980, 73872121, 69906738, 66198883, 62699095, 59493730, 56501940, 53625502, 50885087, 48014288, 46142409, 43676188, 41592049, 40211665, 38088444, 36689075, 34734944, 33675126, 31895771, 30589949, 29370479, 28319291, 27166084, 25963379, 24914836, 24005334, 22765604, 22204665, 21442947, 20636603, 19960418, 19118345, 18534060, 18216063, 17165849, 16859918, 16361695, 15849569, 15009043, 14619262, 13937755, 13802658, 13527826, 13217895, 12694236, 12102696, 12057487, 11577770, 10957231, 10843116, 10324019, 10511397, 10069065, 9884937, 9424801, 9300504, 8963568, 8934080, 8388461, 8463828, 8156100, 8427792, 7849335]
16632G849335l07722j84041j43669K44985n47229p5334m35723k7569j91572l9883
16622F141578j26649N6869k42713Q7836k14328l08118j6359m7564l40999J16934
16612E106487J06927l4775l00805l42848L3245o5763l7282k81464J45936k52736
16602D076922K44098J8970o23154K32920j63482K18736O9097m33927J17593M9640
16592C807413k53699J17248n47278M40295j05401j40426m28437L01295j5941j51990
16582C023079k23395K18758j24279Q6192l18988K08792m42136J48409l3129P9001
16572B622304K10229m53255J73643j31721j23878k6837m4735k24435L80104n693
16562B375726r7036k90753K77433n0117P9097k06434q7455k55666M42363l8391
$$ y = [7849335, 7541613, 7357572, 7213903, 7458888, 6911659, 6836325, 6400602, 6373033, 6181461, 6141578, 6014929, 6071798, 5829085, 5916921, 5702593, 5394475, 5378116, 5330552, 4989553, 5106487, 5213414, 5178639, 4877834, 4534986, 4568231, 4502468, 4465186, 4183722, 4329658, 4076922, 4321020, 4339990, 3716836, 3949756, 3786274, 4005010, 4074107, 3640180, 3757773, 3807413, 3553714, 3670962, 3123684, 3563979, 3458578, 3318152, 2889715, 3191010, 3175069, 3023079, 2799684, 3018442, 2894163, 2980355, 2661367, 2870159, 2428023, 2576432, 2543303, 2622304, 2832533, 2379278, 2552921, 2421200, 2297322, 2270485, 2225750, 2001315, 2381419, 2375726, 2278690, 1987937, 2265370, 2215253, 2294350, 2087916, 2000461, 1744795, 2187158, 2148767]
16552B148767k57236Q6652o6427k00993K94775n71534K56400j10411J71282L0396
16542A781671K30341m09006L02566l25795l55545O71447k62030o4480l64427N17919
16532A722661l37216J47515j78949P624O8523o0958l09891N11835J1881l13548
16522A269477l29414M24867K13040l89419q6428K14854m6646P3756K1998m6562
16512A319523k15981J7425j45605J64737k3126l4213K79102l25468R5869j67838
16502I64425J54030M00863n86426q4591K58441k27014Q9900J93859l27866J96325
16492A031946r7425p1721l80253P28524m31300L34847L8132k53797J5560J07624
16482A022137n5199O5273n6144p4205j88682K31924M3324k08258L72204l94717
$$ y = [2148767, 1891531, 1978183, 1911756, 1710763, 2005538, 1434004, 1690404, 1579993, 1751275, 1781671, 2012012, 1603006, 1905572, 1579777, 1224232, 1895679, 1633649, 1569169, 1204742, 1722661, 1385445, 1532960, 1354011, 1361635, 1430158, 1369200, 1059309, 1571144, 1583025, 1269477, 940063, 1364930, 1577970, 1188551, 1102123, 1316977, 1270331, 1344087, 1366085, 1319523, 1103542, 1120967, 975362, 1140099, 1116973, 1082760, 1361862, 1036394, 1132263, 964425, 1118455, 1519318, 932892, 848301, 1106742, 879728, 969628, 1163487, 835621, 1031946, 934521, 862800, 482547, 1211071, 779771, 1114618, 1152750, 898953, 914513, 1022137, 966938, 1032211, 976067, 901862, 713180, 945104, 988428, 780170, 1152374, 757657]
16472G57657K40332k62362K82888l57072k86116J48099O06184D89793j6727J36672
16462F09738M8890K19324m6015K1814k84192l4208m8256K99568j57443l3617k66055
16451C29548M64577k67681j25286K73054C12152L25566j45534L5831k56839K52222
16441E23398J09621j9257Q5019p7913j95289M5797A50276N64798j62098J19112
16431F72088p6943k11209J43019A24463L33127Q103K85835k35327j77225J14027
16421D53003K51483j48100j21751J41192q1072j73235L81509j28155K49553l11249
16411E13178l1429K03903A44323J21276J250Q4585K37317j69322L3184B07254
16400C74079m3862J62762j8804I7277L94186q0861q5257J33344q3831l0251J4173
$$ y = [757657, 997989, 735627, 1018515, 661443, 375327, 523426, 1129610, 489793, 473066, 609738, 658628, 877952, 831937, 853751, 569559, 535351, 487095, 786663, 629220, 595603, 329548, 794125, 526444, 401158, 674212, 312152, 637718, 492184, 528015, 271176, 523398, 633019, 613762, 698781, 620868, 425579, 471376, 150276, 715074, 552976, 672088, 595145, 383936, 526955, 124463, 457590, 465693, 751528, 516201, 338976, 453003, 704486, 556386, 434635, 575827, 494755, 321520, 703029, 574874, 824427, 513178, 481749, 685652, 144323, 265599, 266849, 351434, 588751, 419429, 452613, 207254, 374079, 330217, 492979, 474175, 97277, 491463, 410602, 325345, 458689, 374858, 344607, 358780]
16389C58780K40389R1607A48242L67792A15252J66472J08499p365m7306m3805
16379B91747K38438P85j45522r4687p9358l8717J61528O8482J22978B40418r4666
16368A45752M27113k00616M84279l94375j75785F3216A7170M28713j31343N2100
16358C66640j62270L71142j69211r8111O3837j63358K04465A84543K26989A24577
16347C44967J21487j02834K1683A57866o923K01499a9973C40117L4198o065D9310
16335a11995A54621i0366j66559A92779M2639m1351J0882l9320K14891A63223
16324B22417K07489j90096J17446J44518k20887E5111K83020j15618K1812j18095
16314A26230k4621j3264K87107j49759K87029b451A76301m5690K6248A292M36597
$$ y = [358780, 599169, 690776, 148242, 516034, 115252, 281724, 390223, 382858, 335552, 291747, 530185, 530970, 385448, 290761, 211403, 172686, 334214, 402696, 525674, 240418, 145752, 572865, 372249, 856528, 462153, 286368, 63216, 17170, 445883, 314540, 366640, 204370, 575512, 406301, 308190, 372027, 208669, 413134, 184543, 411532, 124577, 344967, 466454, 363620, 385303, 157866, 150943, 352442, -19973, 340117, 374315, 368250, 49310, -111995, 154621, -90366, -256925, 192779, 235418, 194067, 204949, 165629, 380520, 163223, 222417, 429906, 239810, 357256, 501774, 280887, 55111, 338131, 222513, 244325, 126230, 101609, 88345, 375452, 225693, 512722, -2451, 176301, 130611, 156859, 1292, 437889]
16303D37889j62690Q2733j19390r3293c7012A44075J16021D1910K18278l1595
16293B28593p1255o9187b205D9988b8459q1493A03709h0860G771K62317b6420
16281E52563A0819J05415D8074O6416m2394K49709I6191K3413b9260B02792a18317
16269E45240c9421B48794K53730A46110D4924b79D35965a63683n3381D720J31992
16258A36712K1279j2259J03441m1108C4616K38448j33715a25955A9235b3875B77466
16246A19741j7711J85013f9519A46008J27378C3803M3390A4292O7182g5877A79751
16234f1711j11407A35973C9351M5116Q3790H1839k4040a64215l9067A7801F063
16222H2955f3423C09537H7190J54425a57434B00633b63927a16241M2572E8252
$$ y = [437889, 275199, 357932, 238542, 145249, -37012, 144075, 260096, 41910, 260188, 228593, 157338, 88151, -2205, 49988, -28459, -109952, 103709, -80860, 7771, 270088, -26420, 552563, 10819, 116234, 48074, 114490, 72096, 321805, 96191, 119604, -29260, 202792, -118317, 545240, -39421, 248794, 502524, 146110, 44924, -279, 435965, -163683, -217064, 4720, 136712, 157991, 145732, 249173, 208065, 34616, 273064, 139349, -125955, 19235, -23875, 277466, 119741, 102030, 287043, -69519, 146008, 273386, 33803, 77193, 14292, 81474, -75877, 179751, -61711, -173118, 135973, 39351, 84467, 168257, 81839, 57799, -164215, -203282, 17801, 6063, 82955, -63423, 309537, 87190, 241615, -157434, 200633, -263927, -116241, -73669, 58252]
16211B75349D3104e9529n3777B40186M4086j37264a19527A86978q3124h2388A94283
16199c6845I4190O853K29717d3479C42778b3145C1497b43025B3191b13094c310
16187a4815k9157p5450e24D3001J56236I7069c40122A30982R8822j05098f7951
16175a82133B7343i9361A10223J6946a23842B89488a97248f2398A47258a20939
16164f0064C36323B7806K72727A45959n5728R8590k9539M5793K25461a13479n005
16153a18484A03122J75537h6019C37671A00552O9094Q8743l6530a40412d2507
16142c6579A37888N8434b56998b9867A6816R3786c9425A8148I73g6869A84307
16130a01572m5870A08844a51864A03242H072f1515j2736B62767f7344j8222A33040
$$ y = [275349, 43104, -59529, -113306, 240186, 284272, 147008, -119527, 186978, 103854, -82388, 194283, -36845, 94190, 101043, 330760, -43479, 342778, -23145, 31497, -243025, 23191, -213094, -3310, -14815, -43972, -119422, -524, 43001, 199237, 97069, -340122, 130982, 229804, 124706, -67951, -182133, 27343, -99361, 110223, 127169, -123842, 289488, -197248, -62398, 147258, -120939, -60064, 336323, 27806, 300533, 145959, 90231, 188821, 159282, 205075, 430536, -113479, -118484, 103122, 278659, -86019, 337671, 100552, 169646, 258389, 221859, -140412, -42507, -36579, 137888, 196322, -256998, -29867, 16816, 110602, -39425, 18148, 973, -76869, 184307, -101572, -147442, 108844, -151864, 103242, 8072, -61515, -74251, 262767, -67344, -85566, 133040]
16118C3367f1888b428A69950g0491B09937a46223I5384K6959b13219e6182B01589
16106c5196C4535a07432r9394B3610a15761N7482D72553b31284F5382i5045b7088
16094d0034k87616B33541h7496D9915J18543e6077j09051j29876d0138j50963
16084a91101H7220N5372b3593j4503a2473j09304D6116J42402F7958h432k75607
16073b84039B03066J66722F9799a65600p4493H675Q3519L21064a12305E0772a25981
16061A17798N5754e9445B12904e2122k50543J47487A30368K2961n3469a14656
16050C38747j55346A3489a29513B253P5505L49860E5716a10836B05691c806k07622
16039b11428D70828A49580b73369g7616A40285d81653A14285a14946L7763l24078
$$ y = [33367, -61888, -2428, 169950, -70491, 209937, -146223, 95384, 122343, -213219, -56182, 201589, -35196, 34535, -107432, -206826, 23610, -115761, -58279, 472553, -231284, 65382, -95045, -27088, -40034, -327650, 233541, -87496, 49915, 168458, -56077, -165128, -295004, -40138, -191101, 87220, 142592, -23593, -38096, -12473, -121777, 46116, 188518, 67958, -8432, -284039, 203066, 369788, 69799, -165600, -240093, 8675, 92194, 413258, -112305, 50772, -125981, 117798, 173552, -59445, 212904, -52122, -302665, -155178, 130368, 153329, 99860, -114656, 338747, 183401, 13489, -129513, 2253, 77758, 427618, 55716, -110836, 205691, -3806, -211428, 470828, 149580, -273369, -77616, 140285, -481653, 114285, -114946, -77183, -401261]
16029d01261J95722c4864m0201J7641J0951A10980a97531G7099N722c613A98446
16017F1626a94142B19366h1467l9085B50269f1444k97144A08922e1437G5148a52850
16005B90180I6240J36807F1860g597q7325c9948A69777A9178a05112B01917b1556
15993a52389l4134L3434G0839d13134A24914E4299b4245A99245p4096C3718O0837
15982I4555K05383P1132Q0947b3197j0227j5760q8122B7178a631B61244a05320
15970f2644A94982K2474a82532o5828I999e840j99872d2625n5096F2211N9861
15959A22072J35731a18162B50561b02695F612h4243j05408G3193J10387d20792
15948a66030C9820g7620A36379g2908C3324j974d0564m8793L5559B1688J00472
$$ y = [-401261, -205539, -34864, -75065, -57424, -46473, 110980, -197531, 77099, 82821, -3613, 198446, 61626, -194142, 219366, -81467, -120552, 250269, -61444, -358588, 108922, -51437, 75148, -152850, 290180, 96240, 233047, 61860, -7597, -94922, -39948, 169777, 19178, -105112, 201917, -21556, -152389, -186523, -153089, 70839, -413134, 124914, 54299, -24245, 199245, 125149, 33718, 94555, 299938, 371070, 452017, -23197, -33424, -49184, -137306, 27178, -1631, 261244, -105320, -62644, 194982, 217456, -182532, -248360, 9999, -5840, -205712, -42625, -97721, 62211, 122072, 257803, -118162, 250561, -202695, 6612, -84243, -189651, 73193, 183580, -420792, -166030, 39820, -77620, 136379, -72908, 33324, 31350, -40564, -89357, -53798, 21688, 122160]
15937A22160b54949e0402j37823G5771c15282a41563b1744o3029j22670f7310
15926e3382k04285a25169b4707F0922b67270D67690A33594d02089A56347b58011
15915B01144a41643C2803c4913M867E3449J73464a08315B8000c6724D3082K97283
15904C40365e8944A71942b30944j18382b0479C3870L38434a24955c6653B19329
15893a34545O790C27259A59436a58124G9200h2239C7908c86912c8750D9345b38307
15881F7718J1320C5789a30340B4126J40685b99944E331K64237G3829a81175j62677
15870c43852L6180C0225b5951E0040K09655H1245A0638e0553D5628k058h6033
15858b83233C29968E8230c4010c935j79088b0726l4831m07651D8967c2079k37723
$$ y = [122160, -254949, -50402, -188225, 75771, -315282, -141563, -21744, -84773, -207443, -67310, -53382, -257667, -125169, -24707, 60922, -267270, 467690, 133594, -402089, 156347, -258011, 201144, -141643, 32803, -34913, -30046, 53449, 226913, -108315, 28000, -36724, 43082, 340365, -58944, 171942, -230944, -349326, -20479, 33870, 372304, -124955, -36653, 219329, -134545, -127755, 327259, 159436, -158124, 79200, -82239, 37908, -386912, -38750, 49345, -238307, 67718, 79038, 35789, -130340, 24126, 164811, -299944, 5331, 269568, 73829, -181175, -343852, -307672, 30225, -25951, 50040, 259695, 81245, 10638, -50553, 45628, 43570, -86033, -283233, 329968, 58230, -34010, -3935, -183023, -20726, -55557, -463208, 48967, -32079, -269802]
15847b69802f3962D78492a26984j20979j0807B13982J14984E2762g1167C34023
15836a75316A32411b2933j70039C8519a02140B25753C1097a14695k63227e2035
15825a6610B21540d06332J62008c2753j03985B11196P066r1089c6805E0932c80546
15813d5606j28531M4349N8974f636G332g2781l362A72899q4753a41319N3984K7749
15801e9586K3177m6960B03527C3290K46430b5221j21233p2506C323J17158i697
15789c7022a3660j99119e5209J8439F0604c20125F4531C812L49744H5440k3615
15778F1825b10779a1414j96833M5159I4928k2417N1540a53496l1099g8893p0987
15767a49880A733M6442L16799j3998d62683A98322K72750f8985C2952f8413B59632
$$ y = [-269802, -63962, 478492, -126984, -247963, -258770, 213982, 328966, 52762, -71167, 334023, -175316, 132411, -22933, -192972, 38519, -102140, 225753, 31097, -114695, -377922, -52035, -16610, 221540, -406332, -244324, -32753, -136738, 211196, 218262, 127173, -36805, 50932, -380546, -45606, -174137, -129788, -70814, -6636, 7332, -72781, -76143, 172899, 88146, -141319, -87335, -59586, -36409, -83369, 203527, 33290, 279720, -25221, -146454, -218960, 3323, 120481, -9697, -37022, -13660, -212779, -55209, -36770, 60604, -320125, 64531, 3812, 353556, 85440, 61825, -210779, -11414, -208247, -163088, 94928, 72511, 124051, -153496, -184595, -78893, -149880, 1733, 48175, 364974, 350976, -462683, 198322, 471072, -68985, 32952, -68413, 259632]
15755c26978A50254n8795b06625H3074k5098J06976b03259g8463E2457J37270
15745A89727J26895a01571a2573D5606b82595C473b26673h6491J2620r3969f9849
15733g5083B11762a31656k70081A01601a22473j9557p5501c2304j35641l1575
15723a99520A32425b11361F8777c21010N8277J5793B31774A14058R7403a38171
15712f920m2325k69128J30260A19415a17232o9204P1790D5612J1719G1a88009
15700a80853j1893G4570b97344a32963f4524q1248O4352B5264A1965a01001B09960
15688F1369M9274f4349L1294A65630b3990A53979a74044E2579a16552j29502E295
15676A5593K3977a62553d3501k30439E4734J38722c1516F2275B278e09290c2771
$$ y = [-326978, 150254, 91459, -206625, 83074, 57976, 164952, -203259, -78463, 52457, 189727, 316622, -101571, -12573, 45606, -282595, 3473, -226673, -86491, -73871, -167840, -69849, -75083, 211762, -131656, -401737, 101601, -122473, -142030, -217531, -32304, -167945, -199520, 132425, -211361, 68777, -321010, -262733, -246940, 231774, 114058, 211461, -138171, -6920, -49245, -318373, -188113, 119415, -117232, -186436, -114646, 45612, 57331, 71, -188009, -180853, -192746, 74570, -297344, -132963, -64524, -145772, -81420, 25264, 11965, -101001, 209960, 61369, 110643, -64349, -33055, 165630, -23990, 153979, -174044, 52579, -116552, -246054, 5295, 15593, 39570, -162553, -43501, -273940, 54734, 193456, -31516, 62275, 2278, -509290, -32771]
15664A87285E0965q262b4575H7995J21005b87328e7740B7723J26393l3516a63882
15652a12421I1620L1512b58604A11544a62713B71915a40816d5538A03762I474
15641A9075a72832g8848l2165b7132j83608l1191b5991A22934E8778K8414J2150
15630I9342b67351A19563R697a64108D2632a24934p7499R4961A41635J41192g2466
15618C81076b39005L6034A89156k8754j8275J05079h3604C0766f5368k00138L4946
15607b30560O5208c0552A41970d33939A54083b53457q3146E3798i5231B42793
15596C07524a49960H9112h5514E9313b16313B5509C729J91452D5618b22116G4218
15584a11746B7327N5154L8229g6624n9231c5796B9308L8922M6046a22409k6423
$$ y = [187285, 50965, 42703, -24575, 87995, 209000, -287328, -57740, 27723, 154116, 120600, -163882, -112421, 91620, 123132, -258604, 111544, -162713, 271915, -140816, -45538, 103762, 9474, 19075, -172832, -78848, -111013, -27132, -210740, -241931, -25991, 122934, 58778, 87192, 99342, -267351, 119563, 129260, -164108, 42632, -124934, -202433, -107472, 141635, 282827, -72466, 381076, -239005, -202971, 189156, 160402, 142127, 247206, -83604, 30766, -65368, -265506, -230560, -165352, -30552, 141970, -433939, 154083, -253457, -336603, 53798, -95231, 242793, 307524, -149960, 89112, -85514, 59313, -216313, 25509, 3729, 195181, 45618, -222116, 74218, -111746, 27327, 82481, 120710, -76624, -135855, -35796, 29308, 68230, 114276, -122409, -148832]
15573a48832A30154C9738L9427a60934M5887D449a62941g0375r1143A0447a3993
15561A21737E7861a690k25199f2218B60002a01268b491H5758b65122c5452a0756
15549b66834q4139J74864E8506J01235d08202A87415a14348a14A90874D8935A1287
15537c2619m5067A5745a30781g862j88861I1481a35489j39824c3719l05215l4005
15526c72939d7733j61219D412f7808A13493q146O2891E3500d1662A2844b34339
15514E1997J89859p7735d7108D863J80323a56268N139B38229A10995a10413B74286
15502A51941a0387A10591b2017A83296b7093A35739K67584G6259J19375k177L9231
15491B32688a26589k61481B42049o3566g4139F6726k1158J23833c5393l07481
$$ y = [-148832, 130154, 39738, 79165, -160934, -115047, 4449, -162941, -70375, -161518, 10447, -13993, 121737, 57861, -1690, -226889, -62218, 260002, -101268, -2491, 85758, -265122, -35452, -10756, -266834, -350973, -176109, 58506, 159741, -408202, 187415, -114348, -114, 190874, 48935, 11287, -32619, -77686, 15745, -130781, -7862, -196723, 91481, -135489, -275313, -33719, -338934, -372939, -47733, -208952, 4412, -67808, 113493, 105347, 168238, 53500, -41662, 12844, -234339, 51997, 241856, 164121, -47108, 4863, 185186, -156268, -151129, 238229, 110995, -110413, 274286, 151941, -10387, 110591, -22017, 183296, -27093, 135739, 403323, 76259, 195634, 193457, 232688, -126589, -388070, 242049, 178483, -74139, 66726, 45568, 169401, -35393, -342874]
15481c42874d541k82797F9459k2087g7962j3238a6782p3041f001k84496D9465
15469a12895A01336A1326g5696I0308j9762k6015J99901c42416C10774h8265F6860
15457h9272I7430a6661p8205j21336B52539j24840a8511F0980a19520F1798K3889
15446H5687a62494B34728h6976A71184a10952a2109E4895a68040A59379p0481
15436H8898b85665A64848J58551b0452k81286E1175O9311a28589o4199j57743
15426c50531E8590J0761a40488d1650J8625A0702J6599E010a59684c5082A80374
15414D2128e894B15387j01807L7189J07114f2204m406G7239i3935l4215E52899
15402a46374e5280A9131J79222d0333B5456J8579c13969d3297q942A0030O2713
$$ y = [-342874, -4541, -287338, 69459, 47372, -77962, -91200, -16782, -89823, -6001, -290497, 49465, -112895, 101336, 11326, -75696, 90308, 70546, 44531, 244432, -342416, 310774, -88265, 66860, -89272, 97430, -16661, -94866, -216202, 252539, 127699, -18511, 60980, -119520, 61798, 85687, -162494, 234728, -86976, 171184, -110952, -12109, 54895, -168040, 159379, 88898, -285665, 164848, 323399, -20452, -301738, 51175, 120486, -128589, -192788, -350531, 58590, 69351, -140488, -41650, -23025, 10702, 27301, 5010, -159684, -35082, 180374, 42128, -5894, 215387, 113580, 150769, 257883, -62204, -66610, 77239, -93935, -128150, 552899, -146374, -55280, 19131, 198353, -40333, 25456, 44035, -313969, -43297, -52239, 10030, 72743]
15391G2743b43011b8274B56199E0242K65503b86648A58172K17890a67707a9594
15380a41271C86367a21119n4466j3725Q3063H5799i2980j30107A27390J62145
15370B89535a54521J6176K3978A73209I791J22h2453H8174a63676A03587C841
15358B298J67442n8423d0918k9179D6279f9729j0230B2301k707a67588g1174C69637
15345A20799c08377A11923K7892J9768b81985A63967f0920a0903D05531A11449
15334G1014a56706j25106A35508J83214C2704J89078a82888A71795O3038g3110
15323b91299a06984j15859a04227B33115a82739D8248h5267A20903g0922b1171
15312c07760A37490a29722j37211J01119o3810b409G6326C3070a64165A30288
$$ y = [72743, -243011, -28274, 256199, 50242, 315745, -286648, 158172, 376062, -167707, -19594, -141271, 386367, -121119, -175585, -189310, -106247, 85799, -92980, -223087, 127390, 289535, -154521, -138345, -114367, 173209, 9791, 9913, -82453, 88174, -163676, 103587, 3841, 2298, 169740, 111317, -40918, -70097, 46279, -69729, -79959, 22301, 19594, -167588, -71174, 369637, 120799, -308377, 111923, 139815, 159583, -281985, 163967, -60920, -10903, 405531, 111449, 71014, -156706, -281812, 135508, 318722, 32704, 221782, -182888, 171795, 234833, -73110, -291299, -106984, -222843, -104227, 233115, -182739, 48248, -85267, 120903, -70922, -21171, -307760, 137490, -129722, -266933, -165814, -229624, -2409, 76326, 33070, -164165, 130288]
15301G6364c21487i1948m4733D9264a90885C47210b27048p6345f7422F7364Q1079
15290A48443k5282f333C44906B8382P9481L2494K4871F5386A1028J89166p5755
15279A24439M3547a2954A58627a56671I3187J01236a83535H3222c9316D6780N884
15268E2664J87513n7209L03355k35224l9370e348H861J91838d5482E1592M1880
15257I3472Q8798J28312a00580B67425K5486a24723B92899O7967M05523M67106
15247A233495o9661K73914k44857n08869A01287e5658p815E8820A0208a55189
15236E66023D1157j8403h205j2021C36332b3734k84155a12406C34193g6158A70467
15224f1004A68618h5265A27667k6819d0655m4700j05744a9482o1061A58680L9970
$$ y = [76364, -321487, -91948, -136681, 49264, -190885, 347210, -227048, -303393, -67422, 67364, 148443, 123161, -6333, 344906, 28382, 107863, 140357, 165228, 65386, 11028, 200194, 124439, 167986, -12954, 158627, -156671, 93187, 194423, -183535, 83222, -39316, 46780, 52664, 240177, 182968, 486323, 251099, 211729, -5348, 8861, 200699, -45482, 51592, 93472, 182270, 310582, -100580, 267425, 292911, -124723, 292899, 360866, 766389, 1233495, 1163834, 1437748, 1192891, 684022, 101287, -55658, -63473, 58820, 10208, -155189, 566023, 41157, 22754, -8205, -20226, 336332, -23734, -307889, -112406, 334193, -76158, 170467, -61004, 168618, -85265, 127667, 100848, -40655, -85355, -191099, -19482, -80543, 158680, 198650]
15213A98650K98772a76586b1504j5646A00262D4112a20003B42615A19185a60993
15202B61055a03217A82949a25448b3403B26178M0463g154H2984C3643e4699I7571
15190B31192a99001D9969M7610M7365d1906H2193c1048A93456L40376h712A84840
15178f8269D11248C0893j0176L89293f2866D5080J70266o3655J67851A30089j6884
15167A13205N6112d4108e775B05001i8475B52682E6533a71426a48A13125J63875
15156B77000r4504h7163C21J31071i1309B02758G3020K10778b74007P1653A75939
15144e2948p2528A76449q5814R4179l6834K32631a20058D27858h4434A33488b04210
15132E7035g2772E35310A63298a3382B38868j0698a76914A56729k108e652C67058
$$ y = [198650, 497422, -176586, -21504, -37150, 100262, 44112, -120003, 242615, 119185, -160993, 261055, -103217, 182949, -125448, -23403, 226178, 266641, -7154, 82984, 33643, -54699, 97571, 231192, -199001, 49969, 97579, 144944, -41906, 82193, -31048, 193456, 533832, -8712, 184840, -68269, 411248, 30893, 20717, 410010, -62866, 45080, 215346, 151691, 319542, 130089, 113205, 169317, -44108, -5775, 205001, -98475, 252682, 56533, -171426, -148, 113125, 277000, 182496, -87163, 321, 131392, -91309, 202758, 73020, 283798, -274007, -202354, 175939, -52948, -125476, 176449, 90635, 184814, 147980, 380611, -120058, 427858, -84434, 133488, -204210, 57035, -72772, 535310, 163298, -13382, 238868, 228170, -176914, 156729, 154621, -5652, 367058]
15120C5233K67304d7617h011C44182n7158A21954l0042m5896J11568o5537g3236
15108C16506i4114d1618m2317A61965d6798A46909K6412c2523D3220J57058G6761
15096B5263J29494K4023K19495j66401J8904j21954P999e4281A22220i9736C53911
15084A52902J28846j16941J62087q829r6860A7133C69K54519K91353I2137J63988
15073B56125Q625a06764A71281J61226R6199q4916j08202f1858D48197b5971A9368
15061B12479J365J71454A36471J48092j6045j01830Q6976p155r9615F0409J44425
15050B04834M4349F3801L7905g8588j61480a18535A48980a36374A56246K25929
15040C82175J62527c3709A20483k8817e0459B06027J68653j32750F3985K47454
$$ y = [35233, 302537, -47617, -8011, 344182, 287024, 121954, 91912, 46016, 157584, 92047, -73236, 316506, -94114, -41618, -83935, 161965, -46798, 146909, 173321, -32523, 43220, 200278, 76761, 25263, 154757, 178780, 398275, 231874, 250778, 128824, 136823, -54281, 122220, -99736, 353911, 152902, 281748, 164807, 326894, 318065, 221205, 17133, 369, 254888, 546241, 92137, 256125, 264750, -106764, 171281, 332507, 428706, 343790, 235588, -61858, 448197, -25971, 19368, 212479, 213844, 385298, 136471, 284563, 268518, 166688, 253664, 246509, 146894, 60409, 204834, 249183, 63801, 101706, -78588, -240068, -118535, 148980, -136374, 156246, 382175, 544702, -33709, 120483, 91666, -50459, 206027, 374680, 241930, 63985, 311439]
15030C11439q6579F8032a21323A56107J48534a76891A10434j5926J0950D7968
15019D31881j69008n7723J28441n4534J59250k04577P3706A09392L2345d6122
15008A72176J03719j15679K46518H5026J26627n3824K8254J13687o4146L30326
14998E65950l7225G4834K30860c1295B25258m8698m6562b10640A0720J1380K39879
14987B61979L1779J7391p3002K09196B14067D8013f3306B74425M1281A8553L24587
14976C43140f1027A33075Q2650K8535J41656A79444m766K75866p6606a15311A34472
14964C39477H4986M71589g8240C3864M3109R4235K65587j32379J06980N00q804
14953D03092J66099B22124I7521K45821i5821C19356j59609J92983j13939l538
$$ y = [311439, 224860, 68032, -121323, 156107, 304641, -176891, 110434, 94508, 105458, 47968, 431881, 262873, 205150, 333591, 279057, 438307, 233730, 307436, 109392, 141737, -46122, 172176, 275895, 160216, 406734, 85026, 211653, 157829, 186083, 299770, 235624, 565950, 528725, 74834, 305694, -31295, 225258, 176560, 129998, -210640, 10720, 22100, 261979, 293758, 311149, 238147, 447343, 214067, 48013, -63306, 274425, 315706, 18553, 343140, -61027, 133075, 215725, 244260, 385916, 179444, 174678, 450544, 373938, -115311, 134472, 339477, 84986, 556575, -78240, 33864, 76973, 171208, 436795, 304416, 411396, 411896, 403092, 569191, 222124, 97521, 343342, -95821, 319356, 159747, 352730, 238791, 235253]
14943B35253J4032D2822c4988A80264K06012j11729J4344k7730J3964k4438A05464
14931C66757A30745K86792j54185A9509K56223K76537k67438R8522A21075b25128
14920D41393j05832k5564N2506D0632O25059i3235I0063K9486K71861K22390B56956
14908B69887B9535N61508k40783J01986f5569D13745j63325j00151J45905q0760
14898B15414K32989L1100k3279k05039J27860n3912H5291L68964j26060q9265
14888B38930J03937j32601J53651A25094J56585L81499k46413B00740E4213M84520
14878E38733J02996B04365N2979A5982J63682M98998B99067J40212M4719k4804
14868D59194j67108j17280O7735J0203J84164l4759o009j68688k4848K97876k10474
$$ y = [235253, 249285, 42822, -34988, 180264, 386276, 274547, 288891, 261161, 275125, 250687, 105464, 366757, 130745, 417537, 263352, 19509, 275732, 552269, 284831, 383353, 121075, -225128, 441393, 335561, 309997, 362503, 40632, 665691, -93235, 90063, 119549, 391410, 613800, 256956, 269887, 29535, 591043, 350260, 452246, -65569, 413745, 250420, 150269, 296174, 215414, 448403, 479503, 456224, 251185, 379045, 325133, 85291, 454255, 328195, 238930, 342867, 210266, 363917, 125094, 281679, 663178, 416765, 200740, 54213, 538733, 641729, 204365, 257344, 15982, 179664, 678662, 299067, 439279, 483998, 459194, 292086, 174806, 242541, 252744, 436908, 402149, 396140, 227452, 202604, 500480, 290006]
14857B90006m41J36066B04221a95772E42894P4831A78358Q9620K04471r8110K79635
14846F53974k48505J6117K7615M86328k97900A78755Q7461N64251C78767j0046
14836C68721K00869k78808L63526J51242B82277K10562o5647j26161K65226j12498
14826D53759B1249K62263K55978K47378k93922J65992k65130K57144j12015j31644
14816D07293O743j50045K71047k03002L81369M8368k67407K40646j54041P4470
14806F55441j45584K47999k1698C34118K15877o6400B11163M62808C20418L59877
14796F80295l36356J65993K03923j62003j88164J18397q1160K60094j91469M25988
14786H95538C05511K910j46233M29440N8226j25071k3500M1976L61924l36242
$$ y = [290006, 289565, 425631, 204221, -195772, 542894, 617725, 178358, 267978, 472449, 374339, 653974, 405469, 421586, 449201, 935529, 637629, 178755, 266216, 830467, 378767, 368721, 569590, 290782, 654308, 805550, 282277, 492839, 427192, 301031, 566257, 453759, 21249, 283512, 539490, 786868, 492946, 658938, 393808, 650952, 538937, 407293, 414036, 263991, 535038, 332036, 713405, 761773, 494366, 735012, 580971, 655441, 509857, 757856, 736158, 334118, 549995, 483595, 211163, 673971, 320418, 680295, 343939, 509932, 713855, 551852, 363688, 482085, 400925, 661019, 469550, 895538, 305511, 308421, 162188, 591628, 649854, 524783, 501283, 543259, 905183, 568941]
14776E68941n8424M6943j7405o8076J11737j87696M13640j67319m6861O0045Q7722
14765G43247j55269k8380L1945Q9722q1421J54707o378C24304K63032k64094K30101
14754E53343L12034D28150Q3666J02145B47643P99232C18848L22614j54528J64936
14744F51870p3413K25371k37480L30013k94281J74379k06252k17202M43781j11634
14734F85152L3447L8910J04856j31162M123k86594K06855r8326L12511k14081
14724F55691p2133J78871j00753J78169o560p5588l1887J21775k60305K43804
14714H31084j66826M05264J67279m43967j58118K88918N6858j50627n8349J4675
14704G86191K97257j79762m5902m3104k61107O3907O2751N4683j3646K73472J3870
$$ y = [568941, 510517, 557460, 540055, 471979, 583716, 396020, 809660, 642341, 595480, 655525, 743247, 587978, 559598, 591543, 681265, 599844, 754551, 748173, 324304, 587336, 323242, 553343, 865377, 428150, 511816, 613961, 247643, 1046875, 318848, 641462, 486934, 651870, 578457, 803828, 566348, 896361, 602080, 776459, 570207, 353005, 796786, 685152, 718599, 757509, 862365, 731203, 735326, 448732, 655587, 557261, 869772, 655691, 583558, 762429, 661676, 839845, 833285, 757697, 725810, 847585, 587280, 831084, 664258, 1069522, 1236801, 792834, 634716, 923634, 980492, 829865, 771516, 786191, 1083448, 903686, 857784, 814680, 553573, 617480, 680231, 734914, 721268, 994740, 1008610]
14693A008610l8406j45887l26266J77807K17119O7781M6881q2487r5549o2412
14683G67191R8367j40875O3689N5475n909J09669J14510l90694L48746k86896
14673G33273K60912K301J76198m11165M50437l62409L88847j84272J71647o5185
14663A160584O1392m8742q4321j2946P3366N6174q8657j77841J45602Q109k85928
14652H06792O29219F76146N87168k57621L30408j8642J8192M00504n87603J81727
14642A330279k4828l8452O394l2334P2437l55514M38025l75964K43665J01933
14632A365641n1725R6168k52663J52086j20728K5243Q5255L38055l39584M0891
14622A338639K4212Q9294m74475N90034m2845j21728J85119r3358j74390M342
$$ y = [1008610, 970204, 824317, 498051, 675858, 892977, 960758, 1007639, 925152, 829603, 767191, 865558, 724683, 788372, 843847, 837938, 947607, 1062117, 671423, 1020169, 733273, 994185, 996486, 1172684, 761519, 1211956, 849547, 1238394, 1054122, 1225769, 1160584, 1221976, 1173234, 1088913, 1075967, 1149333, 1205507, 1116850, 939009, 1084611, 1092720, 806792, 1436011, 676146, 1263314, 1005693, 1336101, 1317459, 1335651, 1736155, 1148552, 1330279, 1305451, 1266999, 1273393, 1241059, 1313496, 957982, 1396007, 1020043, 1263708, 1365641, 1313916, 1410084, 1157421, 1309507, 1188779, 1214022, 1299277, 1637332, 1297748, 1338639, 1362851, 1452145, 977670, 1567704, 1524859, 1403131, 1588250, 1494892, 1320502, 1324844]
14612A324844k04576L70297L14870k13367m01298M93001L8974o0005m4974k12001
14602A405765L47711j03669J39923l26165J86310p5395K5911j2275k4522o0968
14592A502626L59341k71011J78929m7977J19575q380q2874J86161k36197J74758
14582A874951J98941m26680K31452k49810R3905J65021k2473K77343O300k39182
14572A909768j34571O04459l14661K60190m00628K82199J05512j65260R7211J24105
14562B368324O0878Q6147L76454k94224p4004L05373J65168k48183N56549L84948
14552C687430J28951P75752O99444J474931L196718J0563293K5692777m124482
14544D2094814k0627299A0320036E135446j993667o84988n99118J32111J668J12028
$$ y = [1324844, 1120268, 1490565, 1805435, 1592068, 1190770, 1683771, 1722745, 1662740, 1617766, 1405765, 1753476, 1649807, 1789730, 1463565, 1649875, 1574480, 1600391, 1588116, 1563594, 1502626, 1861967, 1590956, 1769885, 1721908, 1841483, 1833103, 1750229, 1936390, 1700193, 1874951, 2073892, 1647212, 1878664, 1628854, 1722759, 1887780, 1865307, 2142650, 2148950, 1909768, 1775197, 2379656, 2064995, 2325185, 1924557, 2206756, 2312268, 2147008, 2244219, 2368324, 2429202, 2515349, 2891803, 2597579, 2523575, 2828948, 2994116, 2745933, 3302482, 3687430, 3816381, 4592133, 5291577, 6766508, 9963226, 20526519, 46219296, 42094814, 21467515, 10320036, 5135446, 3141779, 2456791, 1857673, 1989784, 1991452, 2103480]
14535B103480r0781r1395J37444j59580J29393k91121L28171K01833J68290l8021
14525B397713m47594J26041K98709k7403j38811L43222p6763J4932k12424M64176
14515B741798m28713M68852q3353m2788N0331J91425n37406N89156k19037K60167
14505B990432k81983J18420J32231l90863L90030M50148m81565J43364K77033
14496C347247o4994J7845O9043j97527Q1667j68639J0219J82723J47618O3033
14486C488235P1298j92328J75702q9250K96107j35533m1523N87234m14737M7087
14476C792292J68801k54091L19651O2793m4202K689j45744K54523K34010j5125
14466D375597k83479K82704K8441J9656K53630J24430k69025K30521J09993r7020
$$ y = [2103480, 2012699, 1921304, 2058748, 1899168, 2028561, 1737440, 2065611, 2267444, 2435734, 2397713, 1950119, 2076160, 2374869, 2347466, 2208655, 2551877, 2475114, 2490046, 2277622, 2741798, 2313085, 2781937, 2698584, 2655796, 2706127, 2897552, 2360146, 2949302, 2730265, 2990432, 2708449, 2826869, 2959100, 2568237, 2958267, 3408415, 2926850, 3070214, 3347247, 3282253, 3300098, 3369141, 3171614, 3253281, 3084642, 3094861, 3277584, 3425202, 3488235, 3559533, 3367205, 3542907, 3453657, 3749764, 3614231, 3572708, 4159942, 3745205, 3792292, 3961093, 3707002, 4026653, 4089446, 4045244, 4047933, 3902189, 4156712, 4390722, 4375597, 4092118, 4374822, 4403263, 4422919, 4676549, 4800979, 4531954, 4762475, 4872468, 4775448]
14456D775448Q4184p9090N73143k89433L385k40606P98520j56268j91983J49375
14446E426675k45540K75686K90860l357O7250K50569l6817K49277l62881M62681
14436F374403r421j61343K94005m1207K75909P2451l93271J72954J65026J58893
14426F908399r922J11348m728L70506L51202P1752k94802K72260J58393K77914
14416H212322l9729J87454q0214L86846j47504K90289K42587J19682p1713j04167
14406H995853L26091L64310K4333M5224L265O67164j22995P3405K69732j2419
14396A0633963L70097J75491J60102J68672O19815L2259q6335K39397K17859K11177
14386A2742497J6511J84040N47155K50587M1651K93844R3850M23529N38172j6373
$$ y = [4775448, 4859632, 4780542, 5353685, 5064252, 5067637, 4827031, 5625551, 5469283, 5277300, 5426675, 5181135, 5456821, 5747681, 5744324, 5811574, 6062143, 6025326, 6274603, 5911722, 6374403, 6364982, 6203639, 6497644, 6456437, 6732346, 6804797, 6411526, 6584480, 6749506, 6908399, 6898477, 7009825, 7005097, 7375603, 7726805, 7798557, 7503755, 7776015, 7934408, 8212322, 8172593, 8360047, 8279833, 8666679, 8519175, 8809464, 9052051, 9171733, 9100020, 8995853, 9321944, 9686254, 9710587, 9755811, 9759076, 10426240, 10303245, 10376650, 10646382, 10633963, 11004060, 11179551, 11339653, 11508325, 12128140, 12160399, 12074064, 12313461, 12531320, 12742497, 12759008, 12943048, 13490203, 13740790, 13782441, 14076285, 14170135, 14593664, 15131836, 15115463]
14376A5115463L79118K99376J30261K25858R01431j3999L95104N84752K85543
14367A8302907L40942N10061K43446K34882P76112J47952O72933L36958N13544
14358B2079737P17508K68119R25860K37201M68566N86495P45918N70976N36876
14349B7137256Q26359M13729J061056N22273J101863O54370Q32754J017536M15747
14340C3982943R17919J091100J187653O76053J088017J343969J353366J291882
14332D2932902J108797J005767J592197J624064J339222J632642J671883J717269
14324E4624743J835076J688752K192860J944075K620084K199428K316189K362733
14316G1783940L188369K733214K831857L045911L522135L682599L476068L945380
$$ y = [15115463, 15494581, 15793957, 15924218, 16150076, 17051507, 17037508, 17432612, 18017364, 18302907, 18643849, 19153910, 19397356, 19632238, 20408350, 20556302, 21229235, 21566193, 22079737, 22797245, 23065364, 23991224, 24228425, 24696991, 25283486, 26029404, 26600380, 27137256, 27963615, 28377344, 29438400, 29960673, 31062536, 31716906, 32549660, 33567196, 33982943, 34900862, 35991962, 37179615, 37855668, 38943685, 40287654, 41641020, 42932902, 44041699, 45047466, 46639663, 48263727, 49602949, 51235591, 52907474, 54624743, 56459819, 58148571, 60341431, 62285506, 64905590, 67105018, 69421207, 71783940, 74972309, 77705523, 80537380, 83583291, 87105426, 90788025, 94264093, 98209473]
14308I8209473M450535M298806M636399N126152N120337N590762N743094O164215
14300A39339773O878378O961850P510076Q069153Q606823Q835496R673938J0117984
14292B05993471J0563395J1343888J1484154J2571979J3158875J3554454J4380958
14285B93051174J4448918J4838277J5391632J5394474J5370347J5462155J4807529
14278C98764506J4352659J3488242J2381508J0755884R003931P159568M061797
14271D69968095n11780n000630m730525l424942l397527n793898p928398r733356
14263D29447039j1346027j3102991j4349954j5966001j5692868j6383457j6061062
14256C26544679j5758502j4399853j4341467j3869252j3607640j2661512j2371453
$$ y = [98209473, 102660008, 106958814, 111595213, 116721365, 121841702, 127432464, 133175558, 139339773, 146218151, 153180001, 160690077, 168759230, 177366053, 186201549, 195875487, 205993471, 216556866, 227900754, 239384908, 251956887, 265115762, 278670216, 293051174, 307500092, 322338369, 337730001, 353124475, 368494822, 383956977, 398764506, 413117165, 426605407, 438986915, 449742799, 458746730, 465906298, 469968095, 469456315, 464455685, 459725160, 456300218, 452902691, 447108793, 439180395, 429447039, 418101012, 404998021, 390648067, 374682066, 358989198, 342605741, 326544679, 310786177, 296386324, 282044857, 268175605, 254567965, 241906453, 229535000]
14249B29535000j1106552j1317325j0344926r683644q585287q729230q272374
14242A61495662p487461p420520o959418o239788n789080n467566n176550n271704
14234A11683575m946335m301531m215602l844872l743736l469987l268590l361027
14226H0531895l234318k718979k705141l055175k295635k548792j780783k085357
14218F0107715j931049k141901j654510j939788j092557j584327j507116j871784
14210D6384683j065981j655015j393163k01099j418532j030615j484349j034226
14202C7101703q34542j079967o48269r80323j113474q47224j008727n71823p57363
14193B9259991m26481n60851j149027m95763n88744n77853q66080m93865n16803
$$ y = [229535000, 218428448, 207111123, 196766197, 187082553, 178497266, 169768036, 161495662, 154008201, 146587681, 139628263, 133388475, 127599395, 122131829, 116955279, 111683575, 106737240, 102435709, 98220107, 94375235, 90631499, 87161512, 83892922, 80531895, 77297577, 74578598, 71873457, 68818282, 66522647, 63973855, 62193072, 60107715, 58176666, 56034765, 54380255, 52440467, 51347910, 49763583, 48256467, 46384683, 45318702, 43663687, 42270524, 42069425, 40650893, 39620278, 38135929, 37101703, 36267161, 35187194, 34538925, 33558602, 32445128, 31597904, 30589177, 30017354, 29259991, 28833510, 28272659, 27123632, 26627869, 26039125, 25461272, 24595192, 24101327, 23584524]
14184B3584524m43133p91782l26728k70643p79723l6411o35680n37605p3940m28272
14174A9260607o16796j47362n00579j41331r77462K67453m67062l16669m89934
14165A5870865p1724k12322m91763l44138J09171l67170k84408m78028J07974
14156A3838457o25696m5517q2722m6812p48357J7038l9301l24749J49239m05867
14146A1685713l25703p0287k46680j43686o7977l54385M5104Q3161p54881O7797
14136I918176R7100k52674k67745j04115p4491k015j20132N2699m36592n9820
14126H750391k38624j75574k2545J74218k97252j85842j22642k29929j86953O6638
14116G531886N1269j37174k51892n06643L81961J2064j21486j01400l49552P1750
$$ y = [23584524, 23141391, 22349609, 22022881, 21752238, 20972515, 20936104, 20300424, 19762819, 19688879, 19260607, 18643811, 18496449, 17995870, 17854539, 16877077, 17144530, 16677468, 16360799, 15870865, 15799141, 15586819, 15095056, 14750918, 14860089, 14492919, 14208511, 13730483, 13838457, 13212761, 13167244, 13084522, 13037710, 12289353, 12306391, 12267090, 11942341, 12091580, 11685713, 11360010, 11289723, 11043043, 10899357, 10831380, 10476995, 10522099, 10605260, 9850379, 9918176, 10015276, 9762602, 9494857, 9390742, 9316251, 9314236, 9194104, 9246803, 8810211, 8750391, 8511767, 8336193, 8313648, 8487866, 8190614, 8004772, 7882130, 7652201, 7465248, 7531886, 7583155, 7445981, 7194089, 6687446, 7069407, 7081471, 6959985, 6858585, 6509033, 6580783]
14106F580783j43525p5479J17057m23289j06851M34348l86045j43815L1922K14081
14096F099187l87083j17626L08858k84187l4577l0246O5487k51561q7616k39343
14086E041293J39966o0188j20676m17134K88973r1968K09148k00496j89742K59025
14076D858201l51554L87111k90828k4319j39887j94480N40558k51423k90792J51838
14066D394425j12245N6390q5749k03699k39139M09902N2056n55142Q22988l84832
14056D154955l44304O4295k18927r670K77735k30968o6635r4536R3433m98277
14046C127101L11815J74603j31699j88570R9163j67676K06809o63070M58853K20115
14036C447444m71470K99335r7342O7285m9087p472j45823J51366l11820m526J40289
$$ y = [6580783, 6437258, 6361779, 6478836, 6055547, 5948696, 6383044, 5996999, 5853184, 5885106, 6099187, 5712104, 5594478, 5903336, 5619149, 5584572, 5554326, 5619813, 5368252, 5280636, 5041293, 5181259, 5121071, 5000395, 4583261, 4872234, 4780266, 4989414, 4788918, 4599176, 4858201, 4506647, 4893758, 4602930, 4578611, 4438724, 4244244, 4784802, 4533379, 4242587, 4394425, 4282180, 4338570, 4252821, 4049122, 3809983, 4219885, 4271941, 3716799, 4539787, 4154955, 3810651, 3874946, 3656019, 3646349, 3924084, 3693116, 3626481, 3531945, 3625378, 3127101, 3438916, 3613519, 3481820, 3293250, 3392413, 3224737, 3431546, 2768476, 3227329, 3447444, 2975974, 3275309, 3177967, 3245252, 3196165, 3188693, 3042870, 3194236, 2882416, 2877890, 3018179]
14025C018179n67747M56758j44425K9562k06414J57247J14587l60096J48312l82977
14015B262986L87508j31944o4886j95694P3970L43975k77344N7350j74111J90777
14005B472587m7308j52328q5860L14791j45712l45642r5238M89128j37060J94589
13995B461947l87694R638J28685k51455L0490N14811N27606J769249P288160K6604990
13985C8696427M689645j7801730j0698911n927285k435519j772577m93038p45103
13977C511909R9978n54108q5072k34565k83332J57205J46180o38412K71791K18430
13967B610004k53251k53497L58052r6983p1704o6740M344n22956M69715j41245
13957B035739J59711p5069j08641j69221P365L6615K82262n89199K41106J95328
$$ y = [3018179, 2450432, 2907190, 2762765, 2792327, 2585913, 2743160, 2857747, 2497651, 2645963, 2262986, 2650494, 2518550, 2453664, 2257970, 2331940, 2675915, 2398571, 2455921, 2281810, 2472587, 2425279, 2272951, 2187091, 2501882, 2356170, 2010528, 1915290, 2404418, 2267358, 2461947, 2074253, 2083891, 2212576, 1961121, 1991611, 2506422, 3034028, 4803277, 12091437, 38696427, 43386072, 25584342, 14885431, 8958146, 6522627, 4750050, 4257012, 3511909, 3611887, 3057779, 2972707, 2738142, 2454810, 2612015, 2758195, 2119783, 2391574, 2610004, 2356753, 2103256, 2461308, 2364325, 2292621, 2225881, 2230225, 1707269, 2176984, 2035739, 2195450, 2120381, 2011740, 1842519, 1849884, 1886499, 2168761, 1579562, 1820668, 2015996]
13947B015996J59302j70162l67588K73402Q8394l38436L17631p8833l00746K88423
13937A887383N173O7407j22212j78421J2997o0124p7596o0358J7992L45356k93509
13926A544088q7703K47383n5797j3402k34396M33598o71935O4648O93401l56548
13916A563337J24565j91417k6584k17054L5989K93037k95413K37720l77640K98099
13906A444639j46470P6410L38335k53725l77544O20250n16583Q8866J1996K15475
13896A501649J2644p394k47725q156L64105m26532M08117J27260m40401q7259
13886A196308J29522O3856J76572j99936M6609k90898q0439J75138M402P568Q9014
13875A317716J74007m64228J14623J55296r1822k33967J49825j9324K91520l64968
$$ y = [2015996, 2175298, 2005136, 1637548, 1910950, 1999344, 1660908, 1978539, 1899706, 1598960, 1887383, 1892556, 1959963, 1837751, 1659330, 1672327, 1612203, 1534607, 1474249, 1492241, 1837597, 1544088, 1456385, 1703768, 1647971, 1634569, 1400173, 1833771, 1161836, 1226484, 1919885, 1563337, 1687902, 1496485, 1469901, 1252847, 1288836, 1581873, 1286460, 1524180, 1146540, 1444639, 1298169, 1374579, 1712914, 1459189, 1081645, 1701895, 1185312, 1274178, 1286174, 1501649, 1514293, 1506899, 1259174, 1251018, 1615123, 1188591, 1596708, 1723968, 1283567, 1196308, 1325830, 1389686, 1566258, 1366322, 1412931, 1122033, 1041594, 1216732, 1221134, 1228702, 1317716, 1491723, 1027495, 1142118, 1297414, 1205592, 971625, 1121450, 1102126, 1393646, 1028678]
13865A028678K42582j09466k66578L28861m9680J7815p6751J97264m55822J53565
13855A010468M6085j26830M9861L7048n02265J57563K85287J47571k24703K48920
13845A129005O8876l76245K61095j15524K42683l21834N9002L51803j56585M6309
13835A188585l23711j45441j40769L89810j93087J0523Q8615J07402o0368k06237
13825G15322L87747k09692J37046j69768L37066k69997K1504J00905j57937O6803
13815I58999j99976J36357P8957J03500k56277j30099Q3075J9532j35828K23887
13805H82127k07569K0282K30175j05270j32103O66577l84466j29937k48713K08152
13795G99255j69432m4286K00558m2184l53286M57289o4939p4682M8636j00228
$$ y = [1028678, 1271260, 1161794, 895216, 1224077, 1174397, 1192212, 1115461, 1312725, 856903, 1010468, 1056553, 929723, 979584, 1016632, 514367, 671930, 957217, 1104788, 880085, 1129005, 1197881, 821636, 1082731, 967207, 1209890, 888056, 947058, 1298861, 1142276, 1188585, 864874, 719433, 578664, 968474, 775387, 785910, 874525, 981927, 921559, 715322, 1103069, 893377, 1030423, 860655, 1197721, 927724, 949228, 1050133, 892196, 958999, 759023, 895380, 974337, 1077837, 821560, 691461, 774536, 794068, 658240, 882127, 674558, 694840, 925015, 819745, 687642, 1354219, 969753, 839816, 591103, 799255, 629823, 585537, 786095, 743911, 390625, 847914, 782975, 708293, 756929, 656701]
13785F56701n7962J08193K01500l0198r0021B95407Q71524k02457j81502j8463
13775G64509K48072l23725K67799k10918j32299j354p0767n3208L0338K54878
13765G73325j23603K70046k41380k62271Q2977j0241K68549C44491J40346K8747
13755E13584o5846O0584K12163k95945J10027L48281k69018J14273J83084l84191
13745E26996K35434M298j36400M6217J73723K8778k78706j75461q519K47295m2359
13734F21296k33378J26132J2310o2654j07811M51567j54908o2909K60159j11851
13724G37953k23244Q616k41715K53822j44401J7490J65185j04087L53802C24925
13713F27505R987j96971J75476q0938P090o6499J46458j09453A54419Q68137C30582
$$ y = [656701, 598739, 706932, 908432, 878234, 788213, 295407, 1166931, 964474, 782972, 764509, 1012581, 688856, 956655, 745737, 613438, 612084, 541317, 488109, 518447, 773325, 649722, 919768, 678388, 416117, 499094, 488853, 757402, 344491, 484837, 513584, 447738, 508322, 720485, 424540, 534567, 882848, 613830, 728103, 911187, 526996, 762430, 766728, 630328, 676545, 850268, 879046, 600340, 424879, 416360, 663655, 621296, 387918, 514050, 526360, 463706, 355895, 807462, 652554, 589645, 849804, 737953, 514709, 523325, 281610, 535432, 391031, 408521, 573706, 469619, 823421, 324925, 627505, 637492, 440521, 615997, 535059, 542149, 475650, 622108, 512655, 154419, 1022556, 330582]
13701C19530K71149B53594J52289o4297L55687l32919R2334J40413m0422L0513
13691E87192j04405j66853N03491k62396k16304J18439j63254Q1758j74183O3361
13681B66846p9682J51679K49135k49740K40657j69041J6847K63519k84143K97034
13671G03111j47355L65999m24512A97363J23833q2571L91553A76334L88229j75822
13661C88741Q1956J738j95123K78279B53901L18701k02030A81743J43438Q2102
13651D07283K14212k04736K25292B41757J34866n6450J35622p1240K5465j0472
13641C99548N4769A44517K90994J91618L3403k51200J11329n2620m4370q1700
13631C41971K53844B34540L4730L30320k79649N3757J57263p7099O2989B19053
$$ y = [319530, 590679, 253594, 405883, 341586, 697273, 364354, 456688, 597101, 556679, 587192, 482787, 315934, 819425, 557029, 340725, 459164, 295910, 377668, 203485, 266846, 187164, 338843, 587978, 338238, 578895, 409854, 426701, 690220, 406077, 703111, 555756, 921755, 497243, 197363, 321196, 238625, 630178, 176334, 564563, 388741, 470697, 472435, 277312, 555591, 253901, 572602, 370572, 181743, 325181, 407283, 621495, 416759, 642051, 241757, 376623, 320173, 455795, 384555, 410020, 399548, 454317, 144517, 435511, 627129, 660532, 409332, 520661, 468041, 423671, 341971, 595815, 234540, 269270, 599590, 319941, 373698, 530961, 453862, 516851, 219053]
13620A55405J17383M20699k06714n8442J92400C07031j145K6075j50096J71253
13610C53118L71528B62164K58951j28653j34494P1291P0083J3707j41935K13305
13600D84419M8664A05778J03176L37360j56650K09937A2931K46285l217L4306
13590B90305r2617P9956L18400k82411N6911J13160A31239Q7254M97767O2881
13580G79141A06937M69284A34333N31049l6554k41123C6791K17915j03203N56030
13570G07533B94260K13859A51121n8035K74477L4430o7137L4931l778f9122D4352
13558D83345c5318B78864n6228J2944O4409J30062j48743J04891j14909k37q7715
13547A83338G6663K80208j44188J10441O2905j32165n5972P8767L2382j1916J62869
$$ y = [155405, 272788, 693487, 486773, 428331, 620731, 307031, 305886, 331961, 181865, 353118, 724646, 262164, 521115, 392462, 257968, 329259, 399342, 413049, 271114, 484419, 533083, 105778, 208954, 546314, 389664, 599601, 12931, 259216, 255999, 290305, 197688, 277644, 596044, 313633, 370544, 483704, 131239, 218493, 716260, 779141, 106937, 576221, 134333, 665382, 628828, 387705, 36791, 254706, 151503, 707533, 294260, 508119, 151121, 93086, 367563, 401993, 334856, 369787, 366009, -69122, 44352, 483345, -35318, 278864, 222636, 235580, 299989, 430051, 281308, 386199, 271290, 271053, 183338, 76663, 356871, 212683, 323124, 386029, 253864, 197892, 276659, 309041, 297125, 459994]
13536D59994B23727J57075j2654j81949m0582R8544p0490J3732J33399j19213
13526B01589o5763K11833A36304n1913J44042K09217j28453A28012K08322J34976
13516D71310H7882L9736g4572E82441B81166A17686R7039P7881H993L62272A51045
13504D18657O3556A13467C5219R3744K31558j48227M2292D3393K99442o9266g1747
13492B46797L9619F3252J69166A12032J48170K1945K09817j3860d4430B46343
13481C31595D8970J31565M162J95644r7975f8729E6412K79947a55070A39449L40255
13470D79704Q7871k37379H121J87426K19110K76008A34377B0642J17922J33020
13460B71584A11424K97562O9711k29721J11044a4556A41131n4047J88402p4900
$$ y = [459994, 223727, 380802, 368148, 186199, 145617, 244161, 173671, 187403, 320802, 201589, 135826, 347659, 136304, 84391, 228433, 437650, 309197, 128012, 336334, 471310, 87882, 127618, -74572, 582441, 281166, 117686, 214725, 292606, 8993, 371265, 151045, 418657, 482213, 113467, 35219, 128963, 360521, 212294, 254586, 43393, 342835, 273569, -71747, 246797, 286416, 63252, 232418, 112032, 260202, 282147, 491964, 478104, -44430, 246343, 331595, 48970, 180535, 184697, 380341, 282366, -68729, 56412, 336359, -155070, 139449, 479704, 567575, 330196, 8121, 195547, 414657, 690665, 134377, 20642, 138564, 271584, 111424, 408986, 478697, 248976, 360020, -14556, 141131, 87084, 275486, 200586]
13450B00586P0243r4020K36143K19477a845C69539M8305a13588C68418J86344
13440E54762B44035J52214E5019J46630J03050J9851J12408j86324A15049K77166
13430C92215H8087K22407c2181C80100j78131J94137j74202o1601K94857a83193
13419D52552k22613M8547R9690A75017p9228M6540c3862A37795e2131I4644K76751
13408C71395A5330J38276K4061N56442C50289J31795A98507H6590b58325A24400
13397C38004g9221B30353d48072D16404j93701k8425B31K15705j00223J64016
13387B79729O0518a14103A55248J46601l2982J22504o9967p101m9204c2684B98100
13375B92900d3795G06245A58897a63620C98837H2521c2105D32197A51941K03776
$$ y = [200586, 270829, 176809, 412952, 632429, -1845, 369539, 417844, -113588, 368418, 554762, 244035, 396249, 55019, 201649, 304699, 324550, 436958, 250634, 115049, 392215, 88087, 310494, -32181, 380100, 201969, 396106, 221904, 160303, 455160, -183193, 452552, 229939, 278486, 378176, 175017, 95789, 142329, -33862, 137795, -52131, 94644, 371395, 15330, 153606, 177667, 734109, 350289, 482084, 198507, 86590, -258325, 124400, 338004, -79221, 230353, -448072, 416404, 222703, 194278, 231, 215936, 115713, 279729, 340247, -114103, 155248, 301849, 268867, 391371, 321404, 314303, 265099, -32684, 298100, 292900, -43795, 706245, 158897, -163620, 398837, 82521, -32105, 432197, 151941, 355717]
13365C55717j73563J48988J19726L6790A47456J06556G9690K20518k8676A28718
13354B72135Q397J27570A52184K75014j90667M941J17095r6767J34261J75377
13344E71438A87420J68564A21716K05663R3114N1259J43268k81637K7866J94641
13334E55890A55694E7428J90557e9571F40117k45960M394j48217K79763A50047
13323C38981F5155J78345j19984J32166J31222A48476R4475l6160H4771j7982
13313F6789L4343J03982a83261B79230C1319a76986B37011E3386L4575N2006n3144
13302H6823J31796C9669K12305j9029F8273h8982P919J2041A21896f6720B25894
13290A12770m2425J6656J57821e9089A88544d7762j18355A07206J42749p5743
$$ y = [355717, 182154, 331142, 450868, 487658, 147456, 254012, 79690, 300208, 271532, 128718, 272135, 280532, 408102, 152184, 427198, 236531, 241472, 358567, 261800, 396061, 571438, 187420, 355984, 121716, 327379, 420493, 471752, 615020, 333383, 361249, 555890, 155694, 57428, 247985, -59571, 640117, 394157, 398551, 250334, 530097, 150047, 338981, 65155, 243500, 123516, 255682, 386904, 148476, 242951, 206791, 84771, 66789, 101132, 205114, -183261, 279230, 31319, -176986, 237011, 53386, 87961, 139967, 86823, 218619, 39669, 251974, 232945, 68273, -88982, -81063, -69022, 121896, -66720, 225894, 112770, 70345, 87001, 244822, -59089, 188544, -47762, -166117, 107206, 249955, 174212]
13280A74212J29747b26403D70009O082j60432c80163c4957C24678b7766E2868
13269C34657a348B35924q8794a93496E48328B32692k8324F4051k7840J23203J05106
13258B64520A3345L5515a83815E7866A2945J75460H017J47618o3576c8553j03391
13247a41944A36663M8711p6076E0046O7533L5943m6709P797g2171A15733K52405
13236C68138A3367a02759A47781J75508K2205m1854A0117a85985C1679J03044
13226A34723b11330a8821j14816B78760M6002a53678D20160e2407l08479C13362
13215f0103C80410h8979r5848a356B38542h4273B16807O6930e4826A25387D7738
13203B40469F0899J47576P0231h3107A19937L67842A19681b89290A37042J11882
$$ y = [174212, 303959, -226403, 470009, 476091, 315659, -380163, -34957, 324678, -27766, 52868, 334657, -1348, 235924, 147130, -193496, 548328, 232692, 204368, 64051, 36211, 159414, 264520, 13345, 48860, -183815, 57866, 12945, 188405, 8017, 155635, 92059, -38553, -141944, 136663, 185374, 109298, 50046, 117579, 153522, 106813, 114610, -72171, 115733, 368138, 13367, -102759, 147781, 323289, 345494, 303640, 10117, -185985, 31679, 134723, -211330, -18821, -133637, 278760, 324762, -153678, 420160, -52407, -360886, 313362, -60103, 380410, -88979, -184827, -1356, 238542, -84273, 216807, 283737, -54826, 125387, 47738, 240469, 60899, 208475, 278706, -83107, 119937, 487779, 119681, -289290, 137042, 248924]
13193B48924b20033B22306d412j41945G3050J23385k3287E012Q0455J38788a48842
13181b53575B34536G3179f6217b6457B29940b29775B83896j16519H2341Q4622
13171A66963G2130h9251C3059K40990l9837p803j4946n487P6307E6334b5776G4774
13158B08402k5822e1174j8880D63764F6896F752f3672C53503a09895A92859c43623
13146B27843F9321J76266b0826A48086f5751B33723A6972c6046A07861l1633k3031
13135E3197J64661m618k4023J7560Q9435A00320K38220I4274m326e1531D15212
13123A7063J24235K4328J57554q0907A28J791h2988o1537C08772a19669B22348
13111a10418e927A63327A1658Q0838g6515j49327j4438B11970I9980R2679e60
$$ y = [248924, -220033, 222306, -4412, -146357, 73050, 196435, 173148, 5012, 85467, 224255, -148842, -253575, 234536, 73179, -66217, -26457, 229940, -229775, 283896, 167377, 82341, 166963, 72130, -89251, 33059, 274049, 234212, 226409, 211463, 205976, 282283, 56334, -25776, 74774, 208402, 182580, -51174, -70054, 463764, 66896, 6752, -63672, 353503, -109895, 192859, -343623, 227843, 69321, 245587, -20826, 148086, -65751, 233723, 16972, -36046, 107861, 76228, 53197, 217858, 213240, 189217, 206777, 296212, 100320, 338540, 94274, 89948, -51531, 415212, 17063, 141298, 165626, 323180, 242273, 128, 1919, -82988, -144525, 308772, -119669, 222348, -110418, -5927, 163327, 11658, 92496, -76515, -225842, -240280, 211970, 99980, 192659, -560]
13099D98642k17466D5836a80200o9183E4463R1536p2879R4517n5378d7439B48784
13087A96588A6369K58413m1175A4353g6647L6188O143C8058K89447D3720a50292
13075h7872G5405J76527b3761l5488K3827F8347D9J63874h373C52282c435A25793
13062e9878B79137n1255q0492G010K02508b1444r6789A48467a22095e5938j8264
13051g4202A7096a11939B24256o3514K34n5638f1982j67118a03251A82826b43215
13039a16747A06214M6419J5859n075K1305A5453L7279J3169P7437L51427c7448
13027B71357F2463J40286a3273A75444E9841K18229A0791J00236K2012e1948K0677
13016c1271A43655J3751J65785a4623I3104C4085R315J83256a92073D74786k37372
$$ y = [498642, 281176, 45836, -180200, -249383, 54463, 145999, 73120, 167637, 112259, -47439, 248784, 196588, 16369, 274782, 233607, 14353, -76647, -40459, -34316, 38058, 327505, 43720, -150292, -87872, 75405, 251932, -23761, -59249, -35422, 68347, 49, 163923, -8373, 352282, -3435, 125793, -59878, 279137, 227882, 147390, 7010, 209518, -21444, -118233, 148467, -122095, -55938, -74202, 17096, -111939, 224256, 160742, 160976, 105338, -61982, -229100, -103251, 182826, -243215, -116747, 106214, 152633, 168492, 163417, 184722, 15453, 52732, 65901, 143338, 494765, -37448, 271357, 62463, 202749, -13273, 175444, 59841, 278070, 10791, 111027, 133039, -51948, -31271, 143655, 157406, 323191, -14623, 93104, 34085, 43400, 226656, -192073, 474786, 237414]
13005B37414J71261A46678C6730i3457A29170l7605J73261f7629B17238C6954
12994a05838A06011K7429a60742B20380a0157A00805b87915J28780j616C06337
12983a43691A96174M4995L8089A29659A4100J432J40378b56197a1395C32185N0285
12972C82470c55393f0627j14305A01115a27723C970a4208n1118H4617j1382d555
12960A3498a92420C42542j24034J36308j02438H0278d1745B65603I7580Q0076
12950A77656b2299A16305i3121B08023i6261J5660B21740g389A89363b33641k189
12939b35830b0445E7828a0022C81315a03063l67218A56177J8542d9411I0164d6882
12927h299E84610B64914b11133b9005B49300j1092D1841J15840I601K38139a32047
$$ y = [237414, 408675, 146678, 36730, -93457, 129170, 91565, 264826, -67629, 217238, 36954, -105838, 106011, 133440, -160742, 220380, -10157, 100805, -287915, -159135, -160751, 306337, -143691, 196174, 241169, 279258, 129659, 14100, 15532, 155910, -256197, -11395, 332185, 382470, -355393, -60627, -174932, 101115, -127723, 3970, -14208, -65326, 84617, 73235, -4555, 13498, -192420, 342542, 218508, 354816, 252378, 80278, -41745, 265603, 97580, 177656, -22299, 116305, -93121, 208023, -96261, -80601, 221740, -7389, 189363, -233641, -235830, -20445, 57828, -10022, 381315, -103063, -470281, 156177, 174719, -49411, 90164, -46882, -8299, 584610, 264914, -211133, -29005, 249300, 238208, 41841, 157681, 9601, 247740, -132047]
12915A42729b18155B62389c4822B40248a71152M246F7842K2520Q9119C9815a22375
12903F517M10922G5423b61196d1329e014j20082e1905F3414K17688E7426a13848
12891B66204e7664n8747A33045a02146B07292b2770A81005b57307H6620a45611
12880A76318B9732J73467O845b01695A28307k4551M3018B1072b96195B70697l6622
12869B34075J31659a23413a2356k27129G2160a50599b982q285N633E9780a97302
12857C6576K04877a33938A75551J34151g2287J5920B2604K35470d8707j36950
12847a85657M9854H3793b6008a598j99938B94091F4082L07433a83122I8924K29683
12836C28607i2877B24025I2304a50363H3663d19564D637I2a1369B9462N0629C0146
$$ y = [142729, -218155, 262389, -34822, 240248, -171152, -166906, 67842, 90362, 179481, 39815, -122375, 6517, 417439, 75423, -261196, -41329, -5014, -125096, -51905, 63414, 281102, 57426, -113848, 266204, -57664, -116411, 133045, -102146, 207292, -22770, 181005, -257307, 86620, -145611, 176318, 29732, 203199, 210044, -201695, 128307, 103756, 146774, 21072, -296195, 270697, 234075, 365734, -123413, -12356, -239485, 72160, -150599, -2982, -11267, -5634, 59780, -197302, 36576, 241453, -133938, 175551, 309702, -72287, -56367, 22604, 258074, -48707, -185657, -135803, 83793, -26008, -1598, -201536, 294091, 64082, 371515, -183122, 98924, 328607, -92877, 224025, 92304, -150363, 83663, -419564, 4637, 92, -11369, 29462, 80091, 30146]
12823B56923C382J14621a5867j64717M9062B91138J13709i6674F3348a8835j12014
12812a30849f5176b4711p3794J8989A07980i1630b2803j66055H7653J16548b85274
12800a61737D320O8376M7893a7251m1951A10326a19154A19648j8198d7670C07119
12788b05490j14894B22795m3327k0721G2582a63388A3312f3609C7758J09863f6316
12776A18122E7323a14893A24508F06a97721J3905A0050M7128A3047L13421A093
12764D05025c8885k61797d1265D7822O7017A5289J75717b35779P6670e3886B12385
12752B21657l0594G3555L885d8173j0578F1310O9794b05455g3694A52088k7613
12741A24475K394M9299J99887A14744a28126B80224E6699J91700J82939e0030
$$ y = [256923, 3382, 118003, -15867, -180584, -131522, 291138, 404847, -96674, 63348, -18835, -130849, -65176, -24711, -98505, -79516, 107980, -91630, -22803, -188858, 87653, 204201, -285274, -161737, 4320, 72696, 120589, -17251, -59202, 110326, -119154, 119648, 101450, -47670, 307119, -205490, -320384, 222795, 179468, 158747, 72582, -163388, 13312, -63609, 37758, 147621, -66316, 118122, 57323, -114893, 124508, 606, -197721, -183816, 10050, 57178, 13047, 326468, 1093, 405025, -38885, -300682, -41265, 47822, 114839, 15289, 191006, -235779, -159109, -53886, 212385, 221657, 191063, 73555, 77440, -48173, -58751, 61310, 131104, -205455, -73694, 152088, 124475, 126869, 176168, 376055, 114744, -128126, 280224, 56699, 248399, 431338, -50030]
12730B19358E1330j9844O8169P9386C8884A6662K56343b98895i0892a600q6465
12719h8065A86307p7071a39750o862A62810J15834K0784o6638a93230C42799A17755
12707A55243J65814E9916J37032P468a4815H5123L15078a37380A41979c22331
12696A3898e13522F6430J4137a50653c7652E48M9142a61314B17517G0911K3480
12685I4391K20296F4999P5014o4166i5513q8256D0329A3503J73171D1308K08154
12674B49462e2089B03743j9172h4679k2136A68343P400G2723R8779R9573f834
12662b70128l4519h1835k258b3223I3553K07302a20116B18115L655j1480J07973
12651C18263R6763b4565l2077B88908b6015C12330r0211f4818p9877A99257l8039
$$ y = [219358, 51330, 31486, 99655, 179041, 38884, 16662, 273005, -298895, -90892, -1600, -88065, 186307, 109236, -139750, -146612, 162810, 278644, 299428, 232790, -193230, 342799, 117755, 155243, 321057, 59916, 196948, 204416, -14815, 85123, 400201, -137380, 141979, -322331, 13898, -513522, 66430, 80567, -150653, -37652, 548, 49690, -161314, 217517, 70911, 94391, 314687, 64999, 140013, 75847, -95513, -183769, 40329, 13503, 186674, 41308, 249462, -52089, 203743, 184571, -84679, -106815, 168343, 175743, 72723, 171502, 271075, -6834, -270128, -304647, -81835, -84093, -23223, 93553, 300855, -120116, 218115, 221770, 210290, 318263, 415026, -24565, -56642, 288908, -26015, 312330, 222119, -64818, -144695, 199257, 161218]
12640A61218J7777B52a09645B68316A03378f90r607B45523e6854C33407q3557
12629B49850d672C17417e1642A61108e1381k9073F5283J0453a18279D65492n7629
12618D07863f4323C70646k7285f7634d164A14262a95253b8192B71589a85175K0780
12607a64395D74310C9079K85894A40998n9737a99432A31667a06262C37772A43420
12596A67617o844g9288A8670P5862J84051b07534a6868j41753A1822R8580e32150
12584B16199h1424j9473A53930p5735c2612j15347g2417B659h5673D7441b23507
12572D1410b92510B30484A6083J20761a17939c3467j6437r0362k2518A32528A5853
12560b0873p0981G6598L1963a20569c2253j22982A17982O1001F3937K4698l5159
$$ y = [161218, 178995, 252, -109645, 268316, 103378, -690, -10297, 245523, -56854, 333407, 249850, -4672, 317417, -51642, 161108, -51381, -80454, 65283, 75736, -118279, 465492, 407863, -64323, 370646, 343361, -67634, -4164, 114262, -195253, -28192, 271589, -185175, -164395, 474310, 39079, 324973, 140998, 81261, -199432, 131667, -106262, 337772, 143420, 167617, 160773, -79288, 18670, 94532, 278583, -207534, -16868, -158621, 11822, 110402, -532150, 216199, -81424, -100897, 153930, 78195, -32612, -147959, -72417, 2659, -85673, 47441, -223507, 41410, -292510, 230484, 16083, 136844, -117939, -33467, -49904, -140266, -162784, 132528, 15853, -20873, -91854, 76598, 108561, -120569, -32253, -155235, 117982, 178983, 63937, 88635, 53476]
12549E3476a7706B4387J0950g2653C19150j06037i5983B38782l6226D9867K00452
12538B50319h4567J0232N415H3776N1892k7862b47531I957a43162B2021L35828
12527C57849n6403E5156k5566b47308B09208L22857A33743J58879c57749C2100
12516A77055e5537a8098B94566B6983L6157a66432B13610b88992B9797c36229
12505A97603J21621c00783a9868G8601g6053D7746g0073F2034Q2280b15857A42981
12493E1384a05107A87217J11322B8690b18788G6976e6001D5948L25753A66364
12482F5077b15605l0095C52395G2461c10861F1726J57076B3405a57992B27427
12471C65372b5623A96175O5353A15201b05506i1247M5267j06496O7447c7396A70690
$$ y = [53476, -17706, 24387, 35337, -72653, 319150, 213113, -95983, 238782, 202556, 49867, 250319, -84567, -74335, -68920, 83776, 135668, 107806, -247531, 9957, -143162, 22021, 357849, 301446, 55156, 29590, -247308, 209208, 532065, 133743, 292622, -357749, 32100, 177055, -55537, -18098, 294566, 26983, 63140, -166432, 213610, -288992, 29797, -336229, 197603, 319224, -300783, -19868, 78601, -76053, 47746, -70073, 62034, 144314, -215857, 142981, 51384, -105107, 187217, 298539, 28690, -218788, 76976, -56001, 45948, 371701, 166364, 65077, -215605, -245700, 352395, 72461, -310861, 61726, 218802, 23405, -157992, 227427, 365372, -25623, 196175, 261528, 115201, -205506, -91247, -45980, -152476, -85029, -37396, 170690]
12459c03409D9104a5410C4435a56338A49581B2593K26700J74465C4783b6347B10516
12447A23887O7048G6936J54764b61725J14442c812k03496j01466Q4052B35995
12436B08317D4710d11721A4366h3548c9169A76686b59609C1334d4663D738b8422
12424E5959K00023j15400D0674b86742B51132J07015d9136k86259B90831E3821
12413D086a20970j3552N6757A29037b37292b2263p2882a0719k2452l04115b3599
12401i1603M3535j5682j59995c2401j17453B658J39433b41635H1773e6772I81
12389a01652j90580J12003G7441k5071a56755A5866c5586A92511a73343M7526
12379a25817e4440A8861J85752d2456A39595a99501A66092J04635a09316k2820
$$ y = [-303409, 49104, -15410, 34435, -156338, 149581, 22593, 249293, 423758, 34783, -26347, 210516, 123887, 190935, 76936, 231700, -261725, -147283, -3812, -207308, -308774, -224722, 235995, 208317, 44710, -411721, 14366, -83548, -39169, 176686, -259609, 31334, -44663, 4738, -28422, 55959, 255982, 140582, 40674, -286742, 251132, 358147, -49136, -335395, 290831, 53821, 4086, -120970, -134522, -77765, 129037, -237292, -22263, -95145, -10719, -33171, -337286, -23599, -91603, -48068, -63750, -223745, -32401, -149854, 2658, 142091, -241635, 81773, -56772, 981, -101652, -292232, -180229, 77441, 52370, -156755, 15866, -35586, 192511, -173343, -125817, -54440, 18861, 204613, -42456, 139595, -199501, 166092, 270727, -109316, -132136]
12369a32136L3406I1132K718a01777a8310k61166J26605m2923B27179e0534j21668
12358a72202A5504M67649C1767c77630C7494m483f0804j43242A61185J75374c48928
12346A64679a74331A81907J59659A06968l4894K9640R429J3998c4196p3672M7294
12335f0574A60562f8878D1335L09523g5290m0424L767A24269n4872a42062j4109
12324a56171K1359A22248n0288f676I7712e1143j06258C10950j14793r0394a69755
12312B082a26205C20347j56957O3642I8064b1514F3859J54579p6817l831a8548
12300a67237E3569J44236A2200a49555A56496k2087D502K11373o0126b46293i4122
12288B8708j3611a05033k74441A19118j3074a96024B50098p5022L61044a2465
$$ y = [-132136, -98730, 91132, 93850, -101777, -18310, -279476, -152871, -195794, 227179, -50534, -172202, 15504, 483153, 31767, -377630, 37494, 33011, -60804, -204046, 161185, 336559, -348928, 164679, -174331, 181907, 341566, 106968, 72074, 101714, 111143, 125141, -34196, -107868, -60574, 160562, -68878, 41335, 350858, -75290, -115714, -111947, 124269, 69397, -142062, -156171, -134812, 122248, 71960, -6676, 97712, -51143, -157401, 310950, 196157, 105763, -169755, 2082, -126205, 320347, 163390, 227032, 98064, -21514, 63859, 218438, 141621, 137790, -18548, -167237, 53569, 197805, 12200, -149555, 156496, 134409, 4502, 215875, 155749, -246293, -94122, 28708, 15097, -105033, -379474, 119118, 106044, -196024, 250098, 175076, 536120, -12465]
12277i7986A46297C5754K33610i009C85626c9007j8612K5667F5134K77019H1212
12265A80502q1080o322R885a14605N3033C55790a87494B08467p0538J65082d3724
12253I4426b23962B28202e7380l0317m3762F0050M3771b60059a18196C64840a04900
12241H8304c0412B98786j24791d4174F6624K93776A46394k350c29061I7603a00150
12229I3270K129J17914D5809M4145J75909C9894K20153H9177K22915J3336n8884
12218B66544M4693J8358m3696J66627A01744a47220B1335e8677A71971i630B6744
12206b137H5035J83876j03402P3211O828k5136f9656B41966R0022A09736L1770
12195A41506J06071l5171k0700a62242E13548a50354A8404J44885J46272j27859
$$ y = [-97986, 146297, 35754, 269364, -9009, 385626, -39007, -57619, -31952, 65134, 342153, 81212, 180502, 99422, 93100, 102985, -114605, -61572, 355790, -187494, 208467, 137929, 303011, -43724, 94426, -223962, 228202, -57380, -87697, -131459, 60050, 103821, -260059, -118196, 364840, -104900, 88304, -30412, 298786, 173995, -44174, 66624, 360400, 146394, 144044, -329061, 97603, -100150, 93270, 95399, 213313, 45809, 89954, 265863, 39894, 260047, 89177, 312092, 325428, 266544, 311237, 329595, 285899, 452526, 101744, -147220, 21335, -58677, 171971, -9630, 26744, -2137, 85035, 268911, 165509, 238720, 245548, 220412, -69656, 241966, 331988, 109736, 141506, 247577, 212406, 191706, -162242, 513548, -150354, 18404, 163289, 309561, 181702]
12185A81702a31156B90511h0401A99832k2726L9240m5899k153a86851B64790j6845
12174B47945L1292J84114H3260K5074i8153I4562i278C35020a1212C96691j74909
12163B21782a27970A17878P4112h4065C29568c5887k70410c2095C00409A45152
12152B01336l6630a48661f9104A69736b88973J33382I5043J53693a48217C32293
12141B286a20319C55761k0355i6316j29796M0187N4433M3201B0562d3051D0652
12129c18739d6968a2552j14104k83119a55053A74770j9281b51678m743D4888e3934
12117a14933B95132j08398n9642A1222c1728j90260R9688A75271i883n6794C58902
12105H2429M4148b8923i856m56195a12851K5202l9724B75346n1404a4755l5715
$$ y = [181702, -131156, 290511, -80401, 199832, 177106, 216346, 170447, 168294, -186851, 264790, 247945, 279237, 463351, 83260, 108334, -98153, 94562, -9278, 335020, -11212, 396691, 221782, -127970, 117878, 191990, -84065, 329568, -35887, -306297, -32095, 300409, 145152, 201336, 164706, -148661, -69104, 169736, -288973, -155591, 95043, 248736, -148217, 332293, 2286, -120319, 355761, 335406, -96316, -226112, -185925, -131492, -88291, 20562, -43051, 40652, -318739, -46968, -12552, -126656, -409775, -155053, 174770, 155489, -251678, -256421, 44888, -53934, -114933, 295132, 186734, 127092, 11222, -31728, -221988, -122300, 175271, -9883, -66677, 358902, 82429, 126577, -28923, -9856, -466051, -112851, -87649, -127373, 275346, 223942, -14755, -50470]
12094e0470k67635f7065l53704A83413k7936o7589C8822a55216B20473I245c69085
12082f0922A21557a4813C11159J188468O82763j072289l99136b83008J5460B18704
12071F4978e0733j67385C0236M5392J39419a83066B18393n2622e0745A24467Q7184
12060B11651F9081J72276b0377A51012M4342g1906m4300A08546a64164A86102
12049A48808a09422B00196a20247M7171j35154B8723M0784a1744B44099G1170
12038B0765a1098A12900m4585J07075n492D5636b64965A93064a25620B26270B4912
12026a34113a6146A13296b65580C43123c9318F3167c04022J51990M0548O517q286
12015a13253H4261d5638B17356G5317a7394C0291a38359b3961E026K2133c27675
$$ y = [-50470, -318105, -67065, -420769, 183413, 155477, 87888, 38822, -155216, 220473, 9245, -369085, -60922, 121557, -14813, 311159, 1499627, 2182390, 1110101, 710965, -283008, -267548, 218704, 64978, -50733, -218118, 30236, 75628, 215047, -183066, 218393, 165771, -50745, 124467, 211651, 69081, 241357, -20377, 151012, 195354, -71906, -116206, 108546, -164164, 186102, 148808, -109422, 200196, -120247, -73076, -208230, 28723, 69507, -11744, 244099, 71170, 20765, -11098, 112900, 68315, 175390, 169898, 45636, -264965, 193064, -125620, 226270, 24912, -134113, -16146, 113296, -265580, 343123, -39318, 63167, -304022, -152032, -111484, -104967, -113253, 84261, -45638, 217356, 75317, -17394, 30291, -138359, -23961, 5026, 27159, -327675]
12003g6734c4494A41996a8943o561j25502k7138B9374N3426j1368K16251G3507
11991F6347c3313a1885j1298A89163q7383h6230B10988b07749k4931i3781b1640
11979e8577m1591A07785J04595a1970B00255i5953C9392a30817B25141q4397D7330
11967h8096o7470A92224I0658b76331J25418A18040d08896A63873b1344m58118
11957d79462A49956A6603a75051j6108J6952B821J03271b53776M7072c5330j75129
11946b10459B36150n8459c51083A58471d5003B8804L6936B7858K63126G1111a39632
11934I1534J8072k9070E82i7980D8005J32435b81447f8460C7024a12580J1785
11923a00795r6711P9284M8343A7920a25637c2118k66428n7307i3034A97609j833
$$ y = [-76734, -34494, 141996, -18943, -25504, -151006, -178144, 29374, 82800, 71432, 287683, 73507, 66347, -33313, -11885, -23183, 189163, 101780, -86230, 210988, -207749, -232680, -93781, -21640, -58577, -100168, 107785, 212380, -11970, 200255, -95953, 39392, -130817, 225141, 140744, 47330, -88096, -155566, 192224, 90658, -276331, -150913, 118040, -408896, 163873, -21344, -479462, 149956, 16603, -175051, -191159, -174207, 2821, 106092, -253776, -206704, -35330, -210459, 236150, 177691, -351083, 158471, -45003, 28804, 65740, 27858, 290984, 71111, -139632, 91534, 109606, 80536, 582, -97980, 48005, 180440, -281447, -68460, 37024, -112580, -100795, -197506, -118222, -69879, 17920, -125637, -32118, -298546, -355853, -93034, 197609, 195776]
11912A95776I1331Q9966m3820Q3593m8323n7454b48156A03230a10437k6445A25269
11900D53176a62881H7584k9401a12605B62762a24921B988d9662B61633a12783
11889f9656J30f193j78091A51668b04328N3040j26746R4788k6760c5570j2313
11878d7883B6893K87389a26393A63691f629H131K39397b26140h474m21341G5137
11866F352d19235K00878B45845B814a83717H8982a20858L3936j6294L5822B63642
11854G1119b1846o5001A92537b5181H6404l6689J13167i2560l5824k03530i2197
11842c40793a36232a6061G6122a94374E5670b11598j744J02108K7450j7027A503
11830B06157a13954j17760A69253l4364O3949E8997P3058L5381A6209F787a27077
$$ y = [195776, 91331, 181297, 137477, 221070, 172747, 115293, -248156, 103230, -110437, -136882, 125269, 453176, -162881, 87584, 58183, -112605, 262762, -124921, 2988, -49662, 261633, -112783, -69656, -69526, -6193, -184284, 151668, -204328, -151288, -278034, -183246, -210006, -35570, -47883, 26893, 314282, -126393, 163691, -6629, 8131, 247528, -226140, -8474, -429815, 75137, 6352, -419235, -218357, 245845, 2814, -183717, 88982, -120858, -86922, -103216, -67394, 263642, 71119, -21846, -86847, 192537, -25181, 86404, 49715, 162882, -92560, -128384, -331914, -92197, -340793, -136232, -16061, 76122, -194374, 55670, -211598, -213342, -111234, -83784, -100811, 1503, 206157, -113954, -231714, 169253, 134889, 198838, 58997, 132055, 167436, 16209, 6787, -127077]
11818b3455A3514a25763K4010q9565B09228G6186e19802C876J87378d3997J8683
11807b5314E2226f1878j36614R9167j64289J28798j03787g9638L0965F3465c09681
11795a2012A46659c02732Q2794B55060d01812D54241a17146F8467N3631a11070
11784a35218b0061q8826H40a47931B93369C9781K4042J30930r5650N937C9490
11772b27079i9392f767r6668l2321C45133a52925A87849n5612e6639A35875B373
11760A40940o7604c05095b4681B50363N8412b15952C662L4570j918j2442Q0279
11749A04151b2530A00622f6970o699C03836d5812A51557k5459a24379k7250H6637
11737G5670Q199a963j2275m4562r2719A12251b31065N4509a9950A19362A8862
$$ y = [-23455, 13514, -125763, -101753, -191318, 209228, 76186, -519802, 3876, 191254, -43997, -25314, 52226, -61878, -198492, -99325, -263614, -134816, -238603, -79638, -48673, 63465, -309681, -12012, 146659, -302732, -219938, 255060, -401812, 454241, -117146, 68467, 122098, -111070, -135218, -20061, -108887, 840, -147931, 293369, 39781, 63823, 194753, 99103, 105040, 39490, -227079, -99392, -6767, -103435, -135756, 345133, -152925, 187849, 132237, -56639, 135875, 2373, 140940, 73336, -305095, -24681, 250363, 308775, -215952, 3662, 38232, 36314, 23872, 104151, -22530, 100622, -66970, -73669, 303836, -45812, 151557, 126098, -124379, -151629, 86637, 75670, 83869, -1963, -14238, -58800, -151519, 112251, -231065, -176556, -19950, 119362, 18862]
11725A41510a03781F6655k4780a73779A80800B1596b25872B72016j26368a27213
11714a36743e3388o1992E084K91260D4168i3109a6550A39282a94392C3522L4702
11703F8224M9238J18886r9761o6868L8991J11836b1019j46453c6704B96833D1029
11691F4680J60992h7325F6576G242b63338a02748G9484l0775J61708J54160A67315
11679A66570i3542j07077B01367b70790E2950N5212E346K04537r8523A8587K015
11668B0602d4321A09143c3301n6813A49181a26250k36770I7005b9318A05360G142
11656a68805L1587B21419r5582n6788J9358P175K12242C2095A0514K34060A15701
11644a55433B39491C5542a7229j31182j19708G1621N4419b15727H3235J16533
$$ y = [141510, -103781, 66655, 41875, -173779, 180800, 21596, -225872, 272016, 145648, -127213, -136743, -53388, -115380, 5084, 296344, 44168, -93109, -16550, 139282, -194392, 33522, 68224, 117462, 236348, 136587, 69719, 108710, 220546, -21019, -167472, -36704, 296833, 41029, 64680, 225672, -87325, 66576, 7242, -263338, -102748, 79484, 48709, 210417, 364577, 167315, 166570, -93542, -200619, 201367, -270790, 52950, 108162, 5346, 209883, 111360, 18587, 20602, -44321, 109143, -33301, -90114, 149181, -126250, -363020, 97005, -29318, 105360, 7142, -168805, -137218, 221419, 125837, 69049, 88407, 95582, 307824, 32095, 10514, 244574, 115701, -155433, 239491, 35542, -17229, -148411, -268119, 71621, 126040, -215727, 83235, 199768]
11634A99768N8261e3873B44363a98675E8633J10754g6920F2383N0246R7935A0525
11622B53822a8102C840J61982g2861G3866C093a58375C0154a04949p8671j10075
11611b93695A74511h8030j13742e5457G5371e5712J9192E7507a92456g897k66600
11600b74497f1032j13834A92855a82074c9644l0644D9009a87643i2810c4825A50098
11588A58590f6027H6659c4904r7812A72101g1473J3803b7578A19034J01474f208
11576c2805q6440k45385K1967C59022A41706J74884a59082D44806G5286B1016
11565g4714A84859a6920k2628r2647G4123f765k82958B36184b52346b2441A43603
11553C9749K57387A27162a94353R4079A05170B5893a13752R97p059C75740I9650
$$ y = [199768, 258029, -53873, 244363, -198675, 58633, 169387, -76920, 62383, 112629, 210564, 10525, 253822, -18102, 3840, 165822, -72861, 73866, 3093, -158375, 30154, -104949, -183620, -293695, 174511, -88030, -201772, -55457, 75371, -55712, -36520, 57507, -192456, -7897, -274497, -61032, -174866, 192855, -182074, -39644, -70288, 49009, -187643, -92810, -34825, 150098, 158590, -66027, 86659, -34904, -132716, 172101, -71473, -57670, -27578, 119034, 220508, -6208, -32805, -119245, -364630, -342663, 359022, 141706, 316590, -159082, 444806, 75286, 21016, -74714, 184859, -16920, -39548, -132195, 74123, -6765, -289723, 236184, -252346, -22441, 143603, 39749, 297136, 127162, -194353, -100274, 105170, 25893, -113752, -112755, -119814, 375740, 99650]
11541C48292H6537e4094A49291J63605A0434e937B94566L0994n9746G9065a34235
11529a2587j1154j36908C16783j33171H7975b29081A07053k1417l7543L26640
11519C74733m6316G8047O0252A4508M5029L7646b2144B02589E7587b35389B7146
11507A30966o086O0004a64254e5013k80844c2906A69712F3581c0378B20981A3971
11495C93063F1759K6207N7764j4924o2785l3921J49481a51063I246a5222A63674
11483d3441E6122J07474a54462e4349A12737h1617B95588m2304J46042j81926
11473B17400P4298e2370A13374H979J85668J82345q1911e1905A52011L8831q5699
11462A05143l2551J03089F4276g9223j15715B09050d1164A84621Q8457d3451A71962
$$ y = [348292, 86537, -54094, 149291, 312896, 10434, -5937, 294566, 325560, 265814, 79065, -134235, -12587, -23741, -160649, 316783, 183612, 87975, -229081, 107053, 85636, 48093, 374733, 328417, 78047, 138299, 14508, 59537, 97183, -22144, 202589, 57587, -235389, 27146, 130966, 124880, 184884, -164254, -55013, -335857, -32906, 169712, 63581, -30378, 220981, 13971, 393063, 61759, 87966, 145730, 130806, 68021, 34100, 183581, -151063, 9246, -15222, 163674, -43441, 56122, 163596, -154462, -54349, 112737, -81617, 295588, 253284, 399326, 217400, 291698, -52370, 113374, 8979, 194647, 376992, 295081, -51905, 152011, 190842, 105143, 72592, 175681, 64276, -79223, -194938, 209050, -41164, 184621, 273078, -43451, 171962]
11450g5989j1822B71586I5679R602K834L5754p713D5347K08119c3643C35475j53277
11438A82198K2135a31108B01080q7974J43438a95949D4895J29101R0381n2465
11428B11912h0481B79418F3720e1893j12315A22072i4359j93670B00008Q8482
11418B88490a6985C7118M2084J11087l3503o2909d078A79565J24076l411E3163
11406G8048K58595B6992a7506A90754a0303l0703j48804B34204c5084B98073j29985
11395A68088J27464c01639c2055A53294k3148b3922j58909E7689b7383A89010
11384F8347a30210l591q6291g8777a7574B60861L7845c57784d0143E2571A3555
11372D9079c88139A79021P5802a66692A17259a19679b7219j73165A72268a20013
$$ y = [-75989, -87811, 271586, 95679, 105281, 108115, 143869, 136156, 45347, 253466, -33643, 335475, 182198, 204333, -131108, 201080, 113106, 256544, -195949, 44895, 173996, 264377, 211912, -80481, 279418, 63720, -51893, -164208, 122072, -94359, -288029, 200008, 288490, -16985, 37118, 79202, 190289, 156786, 93877, -4078, 179565, 303641, 300230, 53163, 78048, 336643, 26992, -17506, 190754, -10303, -41006, -189810, 234204, -35084, 298073, 168088, 295552, -301639, -32055, 153294, 130146, -23922, -182831, 57689, -27383, 189010, 68347, -130210, -133801, -220092, -78777, -17574, 260861, 298706, -357784, -40143, 52571, 13555, 49079, -388139, 179021, 254823, -166692, 117259, -119679, -27219, -200384, 172268, -120013]
11361a65827D0771K04840D791J34733b17733b741l72468a36001G5240a87720C4094
11349b26240d7840m369m08394B5909e9480b0473m66894B86632b37801a06164i704
11337e771A84273e5565A27725c1157B99406n8737f4475B8929b4154A01675M4971
11326A46646b30895B08139i8157j21747C57664H8975a51500B39010I6488a72240
11315b09363q4314B09657B0165b08765c9840j34844g9148A38078b62020A25667
11304b74274a26997I0253B7105b08240c2990G0693b25228H9526N6476c87421h5353
11292a12344C7888b07702H3144J5293Q5787J4580c08909h2464A72341q1916b75191
11280A5869a26511J0872j47216m525i2886L1871A43746b86322I2113a17431M6329
$$ y = [-165827, 40771, 245611, 4791, 139524, -217733, -2741, -375209, -136001, 75240, -187720, 34094, -226240, -47840, -52209, -460603, 25909, -59480, -20473, -487367, 286632, -237801, -106164, -9704, -5771, 184273, -55565, 127725, -31157, 299406, 240669, -64475, 28929, -24154, 101675, 146646, -230895, 208139, -98157, -219904, 357664, 88975, -151500, 239010, 96488, -172240, -209363, -293677, 209657, 20165, -208765, -39840, -174684, -79148, 138078, -262020, 125667, -274274, -126997, 90253, 27105, -208240, -32990, 70693, -225228, 89526, 146002, -387421, -85353, -112344, 37888, -207702, 83144, 98437, 184224, 198804, -308909, -82464, 172341, 90425, -275191, 15869, -126511, -115639, -262855, -267380, -92886, -61015, 143746, -286322, 92113, -117431, -71102]
11269g1102C68963b94790m0675B65227a88812I3586d9048q9689e0950A93469a23813
11257a78333k8048p4042b0372k9892l03621A43223R2904I7606b55679I6416K4397
11246A20813b52682G4078a21712o0730L2178A23989c86821B000g3236A7717J31729
11235A49446M9738a70856H0817g2521C45013R3701j82225I0355a56109k41365
11225c97474J74623A39072h2627o9400H7580J21020b13428C17382a62471k2530
11215a85001B0118d10919H8323D3136g7721G929J2348a65401F9912i1340A43724
11203a29629B20873c921j2470B1074g8058K5376F9632K72537g7872a6379A78214
11191g5708j12765p4800a17761j12384B70982C7182a09295l75404K07263h5145
$$ y = [-71102, 368963, -294790, -335465, 265227, -188812, 93586, -49048, -138737, -50950, 193469, -123813, -178333, -206381, -280423, -20372, -50264, -353885, 143223, 236127, 97606, -255679, 96416, 120813, -252682, 74078, -121712, -182442, -150264, 123989, -386821, 2000, -73236, 17717, 149446, 199184, -170856, 80817, -72521, 345013, 438714, 256489, 90355, -156109, -397474, -222851, 139072, -82627, -152027, 87580, 208600, -213428, 317382, -162471, -185001, 20118, -410919, 88323, 43136, -77721, 7929, 20277, -165401, 69912, -91340, 143724, -129629, 220873, -3921, -16391, 21074, -78058, -52682, 69632, 342169, -77872, -16379, 178214, -75708, -188473, -263273, -117761, -230145, 270982, 37182, -109295, -484699, -277436, -85145]
11180a33310d6056g260B03535a80326D7846c1292F4066A3291J12786a09084k01135
11169c10219d8069j17694j49535J00046G9389A3780a02783C9517a60935D0446
11158A9640Q7630g8659k30787A61928a72105K8547b3977p3996A36034Q9598g4624
11146B44210b41172F4911c13356J6614E6583p868a09378J1121A67672a54377p4739
11135b29116F5028K11153a77707e3799B54502b45760E0535J48749Q955q0771c1350
11123h1886C46570b05373C2597J45171J98055B0844P4909b65253B28826a30831
11112a41656b5473B4538e2963B35149D0838b7340r2052A96230h0731J3285D6891
11100B45969A10244O8311P0788J5446K4624A44308L6010F9940d8116l09823a77795
$$ y = [-133310, -46056, -7260, 203535, -180326, 47846, -31292, 64066, 13291, 126077, -109084, -310219, -48069, -165763, -315298, -215252, 79389, 13780, -102783, 39517, -160935, 40446, 19640, 107270, -78659, -309446, 161928, -172105, -143558, -23977, -97973, 136034, 225632, -74624, 244210, -241172, 64911, -313356, -296742, 56583, 48715, -109378, -98257, 167672, -154377, -229116, 65028, 276181, -177707, -53799, 254502, -245760, 50535, 199284, 208239, 127468, -31350, -81886, 346570, -205373, 32597, 177768, 375823, 20844, 95753, -265253, 228826, -130831, -141656, -25473, 24538, -52963, 235149, 40838, -27340, -119392, 196230, -80731, -67446, 46891, 245969, 110244, 178555, 249343, 264789, 289413, 144308, 180318, 69940, -48116, -357939, -177795]
11088D07832A9814L0828M6284k6346f1017B14271k9122K988K07615A05485b11456
11076A46142P3892Q6130q8821R4591o7033O338L02555B55698n0780M8521J10394
11065C63833J34649A73452L89568k14464J90845l8618j99006L21647J7172B75689
11054F46086k49633J18945L00658C30573L95657j71761K30714k50621L68723L0007
11044I33292C95106M57410j55360o3313j54674J85450k45213J24459K83713k83046
11034E44532J44106k05551M06k19216L23440k74203J5710J97080L99442l90317
11024E35429M2389J01180j55325Q131j36192o9437J56924J17497k74933L71584
11014F97247j19876j4154r3286m4515J47053j25590K72582k4393J60657l93409
$$ y = [407832, 19814, 50642, 96926, 70580, -61017, 214271, 185149, 188137, 395752, 105485, -211456, 146142, 220034, 306164, 217343, 311934, 244901, 251239, 553794, 255698, 204918, 253439, 363833, 498482, 173452, 563020, 348556, 539401, 500783, 301777, 623424, 640596, 275689, 646086, 396453, 515398, 816056, 330573, 726230, 554469, 785183, 534562, 903285, 933292, 395106, 852516, 697156, 633843, 479169, 664619, 419406, 543865, 827578, 544532, 688638, 483087, 483493, 264277, 587717, 313514, 329224, 526304, 925746, 535429, 577818, 678998, 523673, 531804, 395612, 326175, 483099, 600596, 325663, 697247, 577371, 563217, 469931, 425416, 572469, 446879, 719461, 695068, 855725, 462316]
11004D62316K73143n7086j30491L09091A90739R0654M02150j31731j23290N10537
10994I39059B85633J82342L39106p4205L8781o5422n3902K68249j69617J64515
10984I15480K254n5771O1032J94568n5600K24922q5576L69594O7163K20144J57145
10973B015355R2822O37099k21466p9932l06093J76260n68615P9288J43332l57662
10963A610388k31332k61259P7274L74715k65677K92714J84596q3705k98818K03205
10953A602101j46381r3763k26302l74410M6574C50996J58505O9292A95145K46796
10943D41941A58638N57I6K29144J59547A56958N62642A94566c3946D3428b1254
10931f6816j0184B64140a68999A75946d990j48367C04266l3771E8276a01007C74842
$$ y = [462316, 735459, 678373, 547882, 856973, 190739, 281393, 683543, 551812, 428522, 939059, 285633, 467975, 807081, 732876, 771657, 706235, 652333, 920582, 750965, 915480, 917734, 861963, 922995, 1117563, 1061963, 1286885, 1201309, 1570903, 1638066, 1858210, 2015355, 2108177, 2745276, 2523810, 2443878, 2137785, 2314045, 1745430, 1824718, 1968050, 1610388, 1379056, 1117797, 1195071, 1569786, 1304109, 1596823, 1781419, 1697714, 1398896, 1602101, 1455720, 1361957, 1135655, 761245, 807819, 350996, 509501, 578793, 195145, 441941, 158638, 159195, 96, 229240, 388787, 156958, 719600, 194566, -33946, 43428, -21254, -66816, -77000, 264140, -168999, 175946, -4990, -153357, 304266, 270495, 58276, -101007, 374842]
10919e0358k81258J56845B22664e8170o6264E6742b50335O3815H5a46185M1339
10908a04846m7849B05195o9840F7077b63408A82729J1767g0267I5548a37077n19
10897a37596Q412o5545C56662j02036n0469a37547p9795c9938k50104F2178a1476
10885b7208n2505E3223b57260E7482a08768A74838a91432c2303j18251E8213g2475
10873d2518I1977Q9052j1083e6853H491c908l6094D66480a53852j59321A51432
10861d3192j09362O8770j75796i2704k0271k63701A16248e23306a18618B15712
10850B41327E0340a25803j33926a15868A99950c34727A54751b74282H6963i5172
10839f0013j39030b4153C5839L07542j71474l6063g6209A98498f4071i074H5923
$$ y = [-50358, -331616, -174771, 222664, -58170, -124434, 56742, -250335, -186520, 85, -146185, -104846, -152695, 205195, 135355, 67077, -263408, 182729, 194496, -70267, 95548, -137077, -137596, -129184, -194729, 356662, 254626, 204157, -137547, -217342, -39938, -290042, 62178, -11476, -27208, -79713, 53223, -257260, 57482, -108768, 174838, -191432, -32303, -150554, 58213, -72475, -42518, 91977, 181029, 169946, -56853, 8491, -3908, -40002, 466480, -153852, -313173, 151432, -43192, -152554, -83784, -259580, -92704, -112975, -376676, 116248, -523306, -118618, 215712, 241327, 50340, -125803, -259729, -115868, 199950, -334727, 154751, -274282, 86963, -95172, -60013, -199043, -24153, 35839, 343381, 171907, 135844, -76209, 198498, -64071, -9074, 85923]
10827F8475k9803O851c5727B56968b06704M0538M43j10465A93471m1432k5287
10816A26752b37280H9609a61121j97829d4514j25905l8658A40445d34008H5837
10805b05770C7840a86469d2821C77141C4849J30418a16892B59371F4377h0535
10794D6622a52921A07979a67941o3866l8537E9167e0773q8154E9646M544g2984
10782b2336j70227A6300M2641b63885J8435A24136m6369A7702O7453K07281b99064
10770B5678c0773j04211q4374g7505j03554Q2628K8772G2051L25424c62999a38970
10758a53282A69332J02703b86735G375a41022A09348l864a99805j239B8343c46362
10746A87785F8941a17178F6447a37301F8580a17006A12516Q6937b76899a14092
$$ y = [68475, 38672, 45523, -35727, 256968, -206704, -166166, -165723, -276188, 193471, 152039, 126752, -237280, 89609, -161121, -358950, -44514, -170419, -209077, 140445, -434008, 85837, -205770, 37840, -186469, -42821, 377141, 34849, 165267, -116892, 259371, 64377, -80535, 46622, -152921, 107979, -167941, -231807, -270344, 59167, -50773, -138927, 59646, 64190, -72984, -22336, -192563, 16300, 58941, -263885, -245450, 124136, 77767, 17702, 85155, 292436, -299064, 25678, -30773, -134984, -219358, -77505, -181059, -98431, -69659, 72051, 397475, -362999, -138970, -153282, 169332, 272035, -286735, 7375, -141022, 109348, 105484, -199805, -201044, 28343, -346362, 187785, 68941, -117178, 66447, -137301, 68580, -117006, 112516, 199453, -276899, -114092]
10735B86558F1884L21437G2807J42123J22608j8769H0184b08176Q8014A9458b12179
10723g7155A3949a13699C5052c3193p4658L5987j02280c3125j6026j70817A37020
10711b8222p0792r5115c5459q3774B10298c7680j74482i7443B7348b06055B56346
10699c20081a22152r8487E6127O09J9057a11604G5075a44370A61899d93018A39976
10687b15032c4545A82496a28329B48948c07486A54997b55877a25452B08190R5487
10677C03677d98456a12239b3066j64874A6227J83109a33009e6791j05217k07376
10667c69384J80416e1697A17126O118a93509k31456f731B77828a65506K8475c3315
10655a92593o0903h119m7636n5795l9917c5922B77973H3298J11206b01578e8623
$$ y = [286558, 61884, 383321, 72807, 214930, 337538, 318769, 80184, -208176, -120162, 19458, -212179, -77155, 13949, -113699, 35052, -33193, -107851, -71864, -174144, -33125, -49151, -219968, 137020, -28222, -99014, -194129, -35459, -119233, 210298, -37680, -212162, -97443, 27348, -206055, 256346, -320081, -122152, -220639, 56127, 56736, 75793, -111604, 75075, -144370, 161899, -493018, 139976, -215032, -34545, 182496, -128329, 248948, -307486, 154997, -255877, -125452, 208190, 303677, -498456, -112239, -23066, -187940, 16227, 199336, -133009, -56791, -162008, -369384, -188968, -51697, 117126, 123244, -193509, -424965, -6731, 277828, -165506, -137031, -33315, -192593, -253496, -8119, -55755, -111550, -151467, -35922, 277973, 83298, 194504, -201578, -58623]
10643C6325M861j1979J84591a19367B63589o5830e3919j65159J03748j46922f4144
10631a06676n4482l47766G2100c716E2336J47013a35733e1811o1911j34599j73058
10620d21379b00072B5194L7771c9296l25622h4821l7690f0561l95520B0976a66423
10608A11000a78383k09356a51010r07C68272E8333J99276I3082c8996j27738j50949
10597c17683j02898c8025j70506H3695b09192A6154a69411A73732e9798k82011
10587c41809I1606M299k5995K54808j56776a12471M3992b273j13952A85797j6351
10576A69446b12640h4698F3302c90211C4818c54042c170A67852a39248f4645K9382
10565c5263K722n9102C37213A39537L1859a81213j7103b5495A89732e6238n9320
$$ y = [36325, 41186, 29207, 213798, -119367, 263589, 197759, -53919, -219078, -115330, -262252, -64144, -106676, -161158, -508924, 72100, -3716, 52336, 199349, -135733, -51811, -113722, -248321, -421379, -200072, 25194, 62965, -39296, -364918, -84821, -122511, -60561, -456081, 20976, -166423, 111000, -178383, -387739, -151010, -151917, 368272, 58333, 257609, 93082, -38996, -166734, -317683, -420581, -38025, -208531, 83695, -209192, 16154, -169411, 173732, -59798, -341809, 91606, 95905, 69910, 324718, 167942, -112471, -68479, -2273, -116225, 185797, 169446, -212640, -84698, 63302, -390211, 34818, -354042, -3170, 167852, -139248, -64645, -35263, -32541, -91643, 337213, 139537, 171396, -181213, -198316, -25495, 189732, -56238, -115558]
10554a15558B3193J0136i1990B71697c26045B5333b22311C02199d10116J36647
10544b73469m715D82745d21393e6642b1319k46708F8289h2660A1234g6674I3065
10532C38326A02138J81967I5495P3209K6782E120J40062b83339A3672a5743j06704
10521a22447b9319a4607c708n3808j50751A98668D4856b14110H9973a25293A38596
10509b87550D3527a17987I8323c75478a81592C30212b84168B12913a13035a3850
10498a56516j42874a9548A33131d723D51g5042b30k32156M713A31007a97141M0645
10486a56496k40556F0416a31247B05569c5604F1075L21541L02628B50232k9162
10476B21070j8074K006b07350C7312d35808B73267e6659g669G7663J8537c0291
$$ y = [-115558, 23193, 33329, -91990, 271697, -326045, 25333, -222311, 302199, -410116, -273469, -278184, 482745, -421393, -56642, -21319, -268027, 68289, -82660, 11234, -76674, 93065, 338326, 102138, 284105, 95495, 168704, 195486, 5120, 145182, -283339, 13672, -15743, -122447, -29319, -14607, -3708, -57516, -208267, 198668, 44856, -214110, 89973, -125293, 138596, -287550, 43527, -117987, 98323, -375478, -181592, 330212, -284168, 212913, -113035, -13850, -156516, -299390, -19548, 133131, -4723, 451, -75042, -230, -232386, -227673, 131007, -197141, -156496, -397052, 60416, -131247, 205569, -35604, 61075, 382616, 685244, 250232, 221070, 202996, 205002, -207350, 37312, -435808, 273267, -56659, -7669, 77663, 96200, -30291]
10464D4906O671a9218B76366b86450A22766K01571a82541g95k5202l15878J50783
10453a91092I5603J8693a72241P679A96634h1567p219q1059d6713C1389b46788
10441F0241A1635a5091q7080A47572a04861A89038a11878E7641O9571N6585a84558
10429a38535j38885G7009R1757B4982N3080f5287j51736R5272l01323A87375a18693
10417a03935b207A09942f2878r5155e1513j52785B69027F1912a96614k43649b6787
10405A21381a66011A85999q0716M954c66876N5889A28142a8246j05789A9710J3246
10394C2956a36354G7588g0705A02049J5060J5387l820j6542g5477A22331k8473
10383I3858f0974B8191L63966A44306J29597c28533C72185j56429H6327K07260
$$ y = [44906, 51577, -19218, 276366, -286450, 122766, 324337, -182541, -795, -25997, -341875, -191092, 95603, 114296, -172241, -164562, 196634, -81567, -88786, -169845, -46713, 31389, -246788, 60241, 11635, -15091, -102171, 147572, -104861, 189038, -111878, 57641, 127212, 183797, -184558, -138535, -277420, 77009, 168766, 24982, 78062, -65287, -217023, -121751, -423074, 187375, -118693, -103935, -2207, 109942, -62878, -158033, -51513, -204298, 269027, 61912, -196614, -440263, -26787, 121381, -166011, 185999, 105283, 110237, -366876, -310987, 128142, -18246, -124035, 19710, 32956, -136354, 77588, -70705, 102049, 117109, 132496, 128676, 112134, -75477, 122331, 93858, -60974, 28191, 392157, 144306, 273903, -328533, 372185, 215756, 86327, 293587]
10373B93587A40005B2797J27194K14641D6032O08126B83268K17874A71225K92850
10363D64075A65139P8789R6277j31902J26815A27781J19459k679K27336j54224
10353C17673j20601j170K4145L00627J77495l14735j45426M75710k45493E4988
10342C94699k1971b241L53E08609A15651q851R1761J99467m3031j6528a94562
10330C81551G4087j2857a77339A27548B1287J1451K03558b5590A79357L356J26997
10319C09710J96346E9986J62161J1845M2468b8686D0818J95977K3433m0451a79504
10307G5434a17218h639r467A09587h7196L4067D7740b3058l4543p181p2395j1517
10295a48694C3766a58924N3698M2945l0328B33836p1887n2854L5420b12387I3919
$$ y = [293587, 140005, 22797, 149991, 364632, 46032, 654158, 283268, 501142, 171225, 464075, 165139, 243928, 340205, 208303, 335118, 127781, 247240, 244561, 471897, 317673, 197072, 195902, 220047, 520674, 698169, 383434, 238008, 713718, 468225, 54988, 394699, 372728, -2241, -1888, 508609, 115651, 106800, 198561, 398028, 354997, 338469, -194562, 381551, 74087, 61230, -177339, 127548, 21287, 32738, 236296, -25590, 179357, 182713, 309710, 506056, 59986, 222147, 233992, 276460, -28686, 40818, 236795, 260228, 219777, -179504, 75434, -117218, -8639, -18106, 109587, -87196, -53129, 47740, -23058, -57601, -64782, -137177, -148694, 33766, -158924, -105226, -62281, -92609, 233836, 161949, 109095, 144515, -212387, 93919]
10283i6896k00761a26704E3981c9099F8348K61832j43763G198P915O6028C7942
10271d39091C53001c9105j15529J7368M2963A72126n8449K0578b38705I0758m0661
10260E0097K02161K05205r7657K08950B51921j02259o5961B5379J23218a8188
10249a11458c7147m9509F0728b78851g4005F196i066A02531P2448G0482N2845
10238A23327P8688a14265N2921A51876b25780B89093o9253c20712a49624G4019
10227f8088B4618a53177C1410h6301D7289f1205r4843n9714A78481c03431C67265
10215b7246o9226k126E1945J07487d1276A19486D8403K7937J60677f9304j93856
10204b63160J18650a6107p327j38241A23212c5695m92983b55630K6344o524o4653
$$ y = [-96896, -297657, -126704, 53981, -39099, 68348, 330180, 186417, 7198, 15113, 81141, 37942, -439091, 353001, -39105, -154634, -137266, -94303, 172126, 113677, 134255, -238705, 90758, 50097, 252258, 457463, 359806, 568756, 251921, 149662, 83701, 25379, 148597, -18188, -111458, -37147, -86656, 60728, -278851, -74005, 6196, -9066, 102531, 174979, 70482, 123327, 202015, -114265, -61344, 151876, -225780, 289093, 219840, -320712, -149624, 74019, -68088, 24618, -153177, 31410, -86301, 47289, -61205, -156048, -215762, 178481, -303431, 367265, -27246, -96472, -98598, 51945, 159432, -41276, 119486, 48403, 76340, 237017, -69304, -263160, -144510, -16107, -23434, -161675, 123212, -35695, -528678, -255630, -229286, -235810, -300463]
10193c00463B3184a62464A52601a28951B27746a11572k85987a70349r0879A28408
10182A03034a37508j4890B91873a69668l49482a52751B74686e6092B73803j10703
10172A63100F1671M4253e3097B07202b18576k01536A35712f8471k28250j37567
10162d34288J12953b1919q5696k95490J28188P5414L8028J8337N6634E8846a84718
10150A98649h4626k46259a54117k17302J11637L6660j91740d8871A31794B4046
10139B2555b33350J0058e1424A11352K604a98761H429J04371A1853d41045J881
10128d39164a94818e8007i750j50112j19357I3762B0417b92415F9491M4099n5331
10117E8259J3638b01936A97809a94293A344c43380a3624m35582a17377o4640B02314
$$ y = [-300463, 23184, -162464, 152601, -128951, 227746, -111572, -397559, -170349, -261228, 128408, 103034, -137508, -152398, 291873, -169668, -519150, -152751, 274686, -56092, 273803, 163100, 61671, 105924, -53097, 207202, -218576, -420112, 135712, -68471, -296721, -434288, -321335, -21919, -107615, -403105, -274917, -199503, -161475, -143138, -86504, 58846, -184718, 198649, -84626, -330885, -154117, -371419, -259782, -223122, -414862, -48871, 131794, 24046, 22555, -233350, -223292, -51424, 111352, 113956, -198761, 8429, 112800, 11853, -441045, -439164, -194818, -58007, -9750, -159862, -279219, 93762, 20417, -292415, 69491, 113590, 58259, 71897, -201936, 197809, -194293, 1344, -343380, -13624, -449206, -117377, -182017, 202314]
10105G6037b18653D21926b27014A68124L1114o4011a09661E5851P5635C7265b50383
10093h4168j03051I2488J54086d4009j10121j00167B4470a07849d5801a6912A82378
10081b26736C0794a51521A57881c4241A24136J53068a57361J6538p0028e0351
10070h5756G733a18983F5467b34653A16347d6994C64312A56657b57492e9546A35890
10058A39578j9223c56679J13420j15182a24819N1560A77075a08730K3736M0004
10048d4990K848E6702J72f2827A54490b77051A34315g7303A25943C5652C112L51296
10036C54408e5795C04732e8931j4428J610k3670d6648j61980l8869D8437a72689
10024d6220O451j06800A27150h8711F4717k1471Q5168c39218B6728b06106n9114
$$ y = [76037, -218653, 421926, -227014, 168124, 199238, 135227, -109661, 55851, 131486, 37265, -250383, -84168, -187219, 92488, 246574, -44009, -154130, -254297, 24470, -107849, -45801, -16912, 182378, -226736, 30794, -151521, 157881, -34241, 124136, 277204, -157361, -140823, -210851, -50351, -85756, 7733, -118983, 65467, -234653, 116347, -46994, 364312, 156657, -257492, -59546, 135890, 139578, 120355, -356679, -243259, -358441, -124819, -73259, 177075, -108730, -84994, -44990, -42142, 56702, 56874, -62827, 154490, -277051, 134315, -77303, 125943, 35652, 3112, 354408, -55795, 304732, -58931, -73359, -71749, -95419, -46648, -208628, -247497, 48437, -172689, -46220, -39769, -146569, 127150, -88711, 64717, 43246, 128414, -339218, 26728, -206106, -265220]
10013b65220R8358I655c39245a30283A06434k2823c30482R7224Q3464i734j75865
10002a85599m5830O0201d7880m93173a28651G3097c7930j6189j16446C71911b70930
9990a92892c8725N432A4457b8153j13600e7883l15201A15012c95473A8799b39880
9978F4042c26931Q0862a7205H6074a72766H9468C866K07661J7504b45153c5026
9966i719k62163J18425m77j28334b6214D072b72083a07794j1443j58502J14567
9955a63172G8119J01535c2640l5077K1608I2817c14160A62015f3754k52874A00790
9943c00168B88377a02555A9514M0702R5397b0380l49111J04611D1039b1708A54031
9931A28532d55268b9939n3503L0698j19986K2045d9248m3162J4263n7049j40427
$$ y = [-265220, -166862, 9655, -339245, -130283, 106434, 83611, -330482, -233258, -149794, -9734, -185599, -231429, -171228, -47880, -541053, -128651, 73097, -37930, -54119, -170565, 371911, -270930, -192892, -38725, -33293, 14457, -28153, -141753, -57883, -373084, 115012, -395473, 18799, -239880, 64042, -326931, -246069, -17205, 86074, -172766, 89468, 3866, 211527, 229031, -245153, -35026, -9719, -271882, -153457, -153934, -282268, -26214, 4072, -272083, -107794, -119237, -277739, -163172, 78119, 179654, -32640, -67717, -46109, 92817, -314160, 162015, -63754, -316628, 100790, -300168, 288377, -102555, 19514, 60216, 155613, -20380, -369491, -264880, 41039, -21708, 154031, 128532, -455268, -29939, -83442, -52744, -172730, -150685, -49248, -92410, -78147, -135196, -275623]
9920b75623h7240A28171e7711l21201e1309r2945J3060I3565b70037B27254h6428
9908b21178k048I8372a99951K4466d5475A75617f54682F2996J23728I490J21841
9897A31331a95400g6936B43703f0859r796A70740O4145b23181e2435k02857R0381
9886a64911A35163F3776K9412J10879L887b62533B07715E1871g3673B27864f6475
9874A05597B196a14971k21589A37679a3486j4723J0296l41723k941J06180A84313
9862A47454L2791e09328A3976J16028b22115k2108H7941c40142B06233D1633C225
9850b87541B8747a43822k11344A14224a53069P2975L8661q3246B10984c43171
9839g5187A02387h5236k30395l0294M8405a15714A34360b54158A98740m3273f2971
$$ y = [-275623, -87240, 128171, -57711, -378912, -51309, -144254, -131194, 93565, -270037, 227254, -86428, -221178, -223226, 98372, -199951, -175485, -45475, 175617, -654682, 62996, 186724, 9490, 131331, -195400, -76936, 243703, -60859, -70655, 170740, 234885, -223181, -52435, -255292, -164911, 135163, 63776, 93188, 204067, 207954, -262533, 207715, 51871, -73673, 227864, -66475, 105597, 2196, -114971, -336560, 137679, -13486, -28209, -17913, -359636, -362577, -256397, 184313, 147454, 180245, -509328, 13976, 130004, -222115, -244223, 87941, -340142, 206233, 41633, 3225, -287541, 28747, -143822, -355166, 114224, -153069, -80094, -41433, -124679, 210984, -343171, -75187, 102387, -85236, -315631, -345925, -297520, -115714, 134360, -254158, 198740, 155467, -62971]
9827c5760A3381a96293A2021a68497j52463F0065k5371Q9695a95267B2505a31434
9815B53620d30272a12053A23473a03375N0544a6896A80090c2162l6348A02876
9804G7411d7814j2338k27282a42734b1992B48891b22656Q0161H7527A694a61687
9792b42073a6404A13412c69035A54682D6290i4428F670b4599m99881I0296a43078
9780D8844a94375H5425a53023Q203a953k2288k11536k8897C17575c06470B25743
9768d8737j1781m37957g5767h889j50530j04083P8344b3412n3475j15171b6261
9756a92353k6017l2882A27595d25535F2997i7536B04305C4098Q6782c8489j17009
9745a55498c5953G6199d36624C4259J09963d9598k09961B486P6761J32223b7910
$$ y = [-35760, 13381, -196293, 12021, -168497, -320960, 60065, 34694, 124389, -195267, 22505, -131434, 253620, -430272, -112053, 123473, -103375, -52831, -16896, 180090, -32162, -68510, 102876, 77411, -47814, -60152, -287434, -142734, -21992, 248891, -222656, -142495, 87527, 1694, -161687, -242073, -16404, 113412, -369035, 154682, 46290, -94428, 6670, -24599, -524480, 90296, -143078, 48844, -194375, 85425, -153023, -144820, -1953, -24241, -235777, -264674, 317575, -306470, 225743, -48737, -60518, -498475, -75767, -8889, -159419, -263502, -185158, -23412, -76887, -192058, -26261, -192353, -218370, -251252, 127595, -425535, 62997, -97536, 204305, 34098, 120880, -38489, -155498, -35953, 76199, -436624, 34259, 144222, -49598, -259559, 2486, 79247, 211470, -27910]
9733G5355a65629Q538j9275C32519b80264a25414j4338n1547E5035a58738O2911
9722i5827D59534b12108f9274k20291a8671B5812J74206D7485j6172b1569k08934
9711b30503K3925i1730o779K4508C9506e11737B25199b2539I804L35585I019J65295
9699A74314p5380e8729o1989l1108f9260r9566C73L50873i7963E706P925a35493
9686a24967l6388C15880h6611j17297J01843L5117A21588L14605i6474a1441j14560
9675a26001d3518I9265b38895p5488a05412G86d45959H3568a09182A21396a38994
9663b52580C446a9689o2016C50335a78240M3018e6993k5793j83308J19553P005
9652a39536k819o4199G5128b36691j34870C3779i7758A12397m0812a38953l23139
$$ y = [75355, -165629, -157091, -176366, 332519, -280264, -125414, -139752, -191299, 55035, -158738, -95827, 459534, -212108, -69274, -289565, -18671, 25812, 200018, 47485, 31313, -21569, -230503, -206578, -91730, -98509, -74001, 39506, -511737, 225199, -22539, 9804, 345389, 9019, 174314, 98934, -58729, -120718, -151826, -69260, -168826, 373, 351246, -97963, 5706, 13631, -135493, -124967, -161355, 315880, -86611, -203908, -102065, -66948, 121588, 436193, -96474, -11441, -126001, -43518, 99265, -238895, -314383, -105412, 786, -445959, 83568, -109182, 121396, -138994, -252580, 3446, -19689, -81705, 350335, -178240, -135222, -56993, -82786, -266094, -146541, -139536, -142355, -206554, 75128, -236691, -371561, 33779, -97758, 112397, 71585, -138953, -462092]
9641d62092b18353H2913J41647c29512A02396b88392d600A69596b96892N2086
9631b44806G7465a92372E7585b27875A65125D4988d89982C84898H2545b03647
9620C28819A46615b47205D6644J97252b44319j1570A8204J11337E8767b90667
9609A31555D7196j9334a47267k52116a57646B98702e9145A65986a65473F301b93659
9597b26733B1127e34586i3850B44999b45287l8283j00211a14739j03153B10598
9586B04730d03074C01137E8687a16746A47474k8164b52598D9242K90776j54821
9576A85197a22083B7003b33333O5892G5531c25924a38404j36169a36108b9320
9565A33499j0397b32412A61303c20222K9921P8681G2726d1101C85732a13068j30582
$$ y = [-462092, -218353, 82913, 224560, -329512, 102396, -288392, -4600, 169596, -296892, -244806, 77465, -192372, 57585, -227875, 165125, 44988, -489982, 384898, 82545, -203647, 328819, 146615, -247205, 46644, 243896, -244319, -255889, 18204, 129541, 58767, -290667, 131555, 47196, 27862, -147267, -399383, -157646, 298702, -59145, 165986, -165473, 6301, -293659, -226733, 21127, -534586, -93850, 244999, -245287, -283570, -383781, -114739, -217892, 210598, 204730, -403074, 301137, 58687, -116746, 147474, 119310, -252598, 49242, 340018, 185197, -122083, 27003, -233333, -167441, 75531, -325924, -138404, -274573, -136108, -29320, 133499, 123102, -232412, 161303, -320222, -290301, -211620, 72726, -41101, 385732, -113068, -243650]
9554b43650d0912A61741e25875a8346A10275a4827j02709E353a04711j50466O803
9543b48374A93818A47e9589j11627J6956j61709F406a04515A14981c8425P34j32767
9531a70458j39523a5155j34507d9294J4599r5911m0966f0063p6110H5687L0400
9520A16087c51401a43549A52492F722i2073A46667a35576I7316j4588J32569a34066
9508a04113A93340c6042j3963q3884c6776o1044A7252f1696B0658h0009k4129
9497a04138j95461F4248f5838A01015b96097a18711h722j12014N6250r232c3876
9485d56519A43067e2095C6786a73925O8673m8365B47293M624j10313G910a73043
9473c37011b9080l31765A17615h1292r3052j57016K9856j02947a06802c6315k89250
$$ y = [-243650, -40912, 161741, -525875, -18346, 110275, -14827, -117536, 5353, -104711, -255177, -248374, 193818, 147, -59589, -171216, -154260, -315969, 6406, -104515, 114981, -38425, -37691, -170458, -309981, -15155, -149662, -49294, -34695, -130606, -171572, -60063, -136173, 85687, 116087, -351401, -143549, 152492, 6722, -92073, 146667, -135576, 97316, 82728, 215297, -134066, -104113, 193340, -36042, -50005, -133889, -36776, -97820, 17252, -61696, 20658, -80009, -104138, -299599, 64248, -65838, 101015, -296097, -118711, -8722, -120736, -64486, -73718, -33876, -456519, 143067, -52095, 36786, -173925, -105252, -153617, 247293, 251917, 141604, 7910, -173043, -337011, -29080, -360845, 117615, -81292, -174344, -331360, -301504, -404451, -106802, -36315, -325565]
9462c25565C62243b41600D8923J56855E4988a75915D32779a43004a6407l20992
9452c37399J45675r5399J28857c7828j98071o4653D684a14411d621E0839q97r488
9440D0454a61268C11936D8719c21443i4492d1245E4370b2687C22467C6061b1358
9428C76663a68502q243L7054o0349h5039j5269k9586d9488K186r7374c7694E0868
9415a30195c8169C3259f7681B0355h1584D8556J39380A7514Q8593J03975a54045
9403f6042E4864K60776B8224R0739d41498A87020a52756o0162A07218a19818e1394
9391G7948b73480a19943d3669m2383B4711a13426C9848O0041K7062J90292a4234
9379a21804G4968o175a29788C2738c28692J10779h5125k000q1692c5022j03544
$$ y = [-325565, 362243, -241600, 48923, 205778, 54988, -175915, 432779, -143004, -16407, -337399, -191724, -287123, -158266, -37828, -235899, -300552, 4684, -114411, -4621, 50839, 49942, 40454, -161268, 311936, 48719, -321443, -94492, -41245, 54370, -22687, 322467, 36061, -21358, 376663, -168502, -176745, -139691, -200040, -85039, -100308, -129894, -49488, -47302, -144676, -37694, 50868, -130195, -38169, 33259, -67681, 20355, -81584, 48556, 187936, 17514, 106107, 210082, -154045, -66042, 54864, 315640, 28224, 118963, -441498, 187020, -152756, -212918, 107218, -119818, -51394, 77948, -273480, -119943, -43669, -86052, 24711, -113426, 39848, 99889, 126951, 317243, -14234, -121804, 74968, 68793, -129788, 32738, -328692, -217913, -85125, -87125, -168817, -35022, -138566]
9368a38566E7791a21225h121A53986E5250e1071k49062B15562b20272C51276a48125
9356b7117q8752j03793A06232a59606N1189A14894n5762c5504A81985c29786a40438
9344B00199o6714N3236G4a1168F9616J5106c22256F6321P5416a16161G0466K02442
9332B72908i9750k43355G8085e8660I6752b42301J17480L6015l50462J22335C42060
9320h3673j53689i470G1143A8976Q1845h6866h716r3650A61913d56721i916j87990
9308a97906i4508H66i7252A13193k0783d03293e1626A6549a51439N8385B31175
9296d27327F0121a2152B25874b4072j79277P6584n8790A53277D922d0179D5038
9284A54611O415Q615L7256a97200b2842A50012e1129j74333K8211h7990P867A03382
$$ y = [-138566, 57791, -121225, -8121, 153986, 55250, -51071, -300133, 215562, -220272, 351276, -148125, -27117, -115869, -219662, 106232, -159606, -108417, 114894, 59132, -35504, 181985, -329786, -140438, 200199, 133485, 186721, 74, -11168, 69616, 84722, -322256, 66321, 141737, -116161, 70466, 272908, -99750, -343105, 78085, -58660, 96752, -242301, -124821, -88806, -439268, -316933, 342060, -83673, -237362, -9470, 71143, 18976, 100821, -86866, -8716, -102366, 161913, -456721, -9916, -197906, -94508, 866, -97252, 113193, 92410, -403293, -51626, 16549, -151439, -93054, 231175, -427327, 60121, -12152, 225874, -24072, -203349, -126765, -185555, 153277, 4922, -40179, 45038, 154611, 161026, 169641, 206897, -197200, -22842, 150012, -51129, -225462, -197251, -87990, -80123, 103382]
9271D4488L6709C0565K8131i4802a8026p675l05744A65493f1968k79162R6845
9260b44285Q6250B58130i0305R97B19166c45345E1566R0810J23499b8976j53347
9249a82323A21117a71392c7436j53758a7677j51763E0515L1050J39555h3496l18403
9238d01899h9235A63780b52820o6318a15434A18237c54158a72723E3226A2448
9227a35292c6131r5762A71018a41777c1720G8548c66859J3313R7533H4313a59923
9215B13983c49174b2388D5532c1714j48205P9933k65408A55282a48010A34133
9204g4227k55427a56438I6864e8967G9847a65988B19769E5427b37910A42192a98013
9192E3371K16646c72731J06315B34254b81509B72989H4648a31845K5732A69234
$$ y = [44488, 81197, 30565, 58696, -94802, -18026, -25701, -331445, 165493, -61968, -341130, -244285, -158035, 258130, -90305, -89308, 219166, -345345, 51566, 142376, 265875, -28976, -182323, 121117, -171392, -37436, -191194, -17677, -169440, 50515, 81565, 221120, -83496, -401899, -89235, 163780, -252820, -319138, -115434, 118237, -354158, -172723, 53226, 12448, -135292, -36131, -131893, 171018, -141777, -31720, 78548, -366859, -353546, -256013, 84313, -159923, 213983, -349174, -22388, 45532, -31714, -179919, -99986, -365394, 155282, -148010, 134133, -74227, -329654, -156438, 96864, -58967, 79847, -165988, 219769, 55427, -237910, 142192, -198013, 53371, 270017, -372731, -266416, 234254, -281509, 272989, 84648, -131845, -106113, 169234]
9181C3121c33058e3117D82K4048b49532j25493a2440A16083g9415o1094j23068
9170b63577N5236C3765a35265M1574j75947a15933b6220n864B2301a35577a8510
9158c97655C64777c1569n2703A9777B636P8647C2590J44301a04587G3052J07072
9147A80124a63525G2974b19535n74C16392a72267H3763K9393a61899J2535A59117
9135e06906B3802q009a82441b3942G6568a62114L6046j97678R2112j664A7504
9123a71273k8582L3370j15579A57219b32852C7600a11391A7872g06170B54956
9112c95294C2597K4510b09419A88856J1609f9730B73405h3379A575J3952d3870
9100D2520a36272J513e4064l462J7981B3961J79578a22647M5206p7551C4943J45364
$$ y = [33121, -333058, -53117, 482, 24530, -249532, -375025, -12440, 116083, -79415, -140509, -263577, -208341, 33765, -135265, -93691, -269638, -115933, -26220, -32084, 22301, -135577, -18510, -397655, 364777, -31569, -84272, 19777, 2636, 81283, 32590, 176891, -104587, 73052, 180124, -163525, 72974, -219535, -220109, 316392, -172267, 83763, 113156, -161899, -149364, 159117, -506906, 23802, 15793, -182441, -23942, 76568, -162114, -126068, -323746, -231634, -233298, 17504, -171273, -199855, -166485, -282064, 157219, -232852, 37600, -111391, 17872, -706170, 254956, -395294, 32597, 57107, -209419, 188856, 200465, -69730, 273405, -83379, 1575, 15527, -43870, 42520, -136272, -134759, -54064, -57526, -39545, 23961, 203539, -122647, -77441, -154992, 34943, 180307]
9088A80307C2795j985d7791l867A14343b55784a14130l13875a90672J8148Q4064
9077h8460k51238F4927M7781g3395j90851N9686A11678b50380g3753R756A50957
9065d2853r4151A2925d3171j26414a3710m22555A29614a33968j13970I2183l3765
9054E8418a34722g803p3399A68642b42015A73911M0325d5077l79650J86637a05190
9042D2326a59778A27445B1577K00241a64630A9102P1271J95681d9771j75185B99877
9030c47351J17878h9575k73509a29432C11M6756e2920A33566L1599b18384L2124
9019a86260A43493a1252I1088k1424b21528l5359f5419k30559J18042b4459o7304
9008i1763j14852J6590M4738A74892e6526k6382G782b44078C9899g5583b3001
$$ y = [180307, 32795, 30810, -47791, -51658, 114343, -255784, -114130, -428005, -190672, -172524, -88460, -339698, 64927, 112708, -73395, -264246, -204560, 111678, -250380, -73753, -63997, 150957, -42853, -137004, 12925, -43171, -169585, -13710, -436265, 129614, -133968, -247938, 92183, 58418, -134722, -7803, -81202, 168642, -242015, 173911, 214236, -45077, -424727, -238090, -105190, 42326, -159778, 127445, 21577, 221818, -164630, 19102, 90373, 286054, -49771, -224956, 299877, -347351, -229473, -89575, -363084, -129432, 311, 47067, -52920, 133566, 165165, -218384, -186260, 143493, -11252, 91088, 69664, -221528, -256887, -65419, -295978, -177936, -24459, -91763, -206615, -190025, -145287, 174892, -56526, -82908, 7782, -244078, 39899, -75583, -23001]
8996a05367k7448l84181A56186b31721E0008c19179A66675h03j49231a2399k11501
8985b23900B51063b15410a04653F3023K58299c2756j44299B0848c90484P9281
8975c11203a23894j71467I5977b93199M2714q390I6433a87180A2782L1122a33463
8963b9545p6545M1975Q242q758A95611F6999C2062g5884b2723j08551M5909o1515
8951a46880c9205J3196C8040a8761o9468j18330q9570h2826f897m0780H2006L4018
8939A16024A4336a88324e3769m6161I3232b27653r3391A54344a85315A20471h2518
8927F5606c80701h4867j21571C4096a57225A354654J44858B12430H3284J22050
8917B05334k4195G3533m252e8364a7743o9841l373I363K25199C4039i5796j53701
$$ y = [-105367, -132815, -516996, 156186, -231721, 50008, -319179, 166675, -803, -150034, -12399, -223900, 251063, -215410, -104653, 63023, 321322, -32756, -177055, 20848, -390484, -311203, -123894, -295361, 95977, -293199, -250485, -258875, 96433, -187180, 12782, 43904, -133463, -29545, -106090, -64115, -55873, -64631, 195611, 66999, 32062, -75884, -22723, -131274, -85365, -146880, -39205, -26009, 38040, -18761, -88229, -206559, -296129, -82826, -6897, -47677, 82006, 116024, 14336, -188324, -53769, -99930, 93232, -227653, -321044, 154344, -185315, 120471, -82518, 65606, -380701, -84867, -206438, 34096, -157225, 1354654, 1499512, 212430, 83284, 205334, 181139, 73533, 69281, -58364, -17743, -87584, -90957, 9363, 234562, 34039, -95796, -249497]
8905b49497D9358K1863a81724f5686l1302C0493j3128K1723M4205g6428J8516
8894e7912m6428j8809k8167e6603j99737A90265C1465d0421D093a79451I3808
8882H5982a43276j35765P7336L2959N4661B40370N9229b76378B04780m1527E9049
8870c6653k62309d5850j26740a7078k42853i6854j33055O9368f4577D36166A82101
$$ y = [-249497, 49358, 71221, -181724, -65686, -96988, 30493, 17365, 39088, 83293, -76428, -57912, -104340, -123149, -151316, -56603, -256340, 190265, 31465, -40421, 4093, -179451, 93808, 85982, -143276, -279041, -201705, -168746, -114085, 240370, 299599, -276378, 204780, 163253, 59049, -36653, -298962, -45850, -172590, -17078, -259931, -96854, -229909, -160541, -64577, 436166, 182101]
$$ [...]
##END NTUPLES=NMR SPECTRUM
##END=
