##TITLE=AC1434_HUIAH13243_8011756_eZ3t3bxX5X
##JCAMPDX= 6.0         $$ Bruker NMR JCAMP-DX V2.0
##DATA TYPE= NMR SPECTRUM
##DATA CLASS= NTUPLES
##ORIGIN= BRUKER
##OWNER= Administrator
$$ 1.72 TOPSPIN		Version 2.1
$$ 2013-07-05 21:48:50.420 -0700  Administrator@X
$$ Compression mode = diff/dup
##.OBSERVE FREQUENCY= 400.02188249412
##.OBSERVE NUCLEUS= ^1H
##.ACQUISITION MODE= SIMULTANEOUS (DQD)
##.ACQUISITION SCHEME= undefined
##.AVERAGES= 64
##.DIGITISER RES= 22
##SPECTROMETER/DATA SYSTEM= spect
##.PULSE SEQUENCE= noesygpps1d.comp
##.SOLVENT NAME= COFFEE_meoh
##.SHIFT REFERENCE= INTERNAL, COFFEE_meoh, 1, 14.96098
##AUDIT TRAIL= $$ (NUMBER, WHEN, WHO, WHERE, PROCESS, VERSION, WHAT)
$$ ##TITLE= Audit trail, TOPSPIN		Version 2.1
$$ ##JCAMPDX= 5.01
$$ ##ORIGIN= Bruker BioSpin GmbH
$$ ##OWNER= Administrator
$$ $$ E:\/data/COFFEE/nmr/AC1434_HUIAH13243_8011756_eZ3t3bxX5X/12/pdata/1/auditp.txt
$$ ##AUDIT TRAIL=  $$ (NUMBER, WHEN, WHO, WHERE, PROCESS, VERSION, WHAT)
(   1,<2013-07-05 21:48:45.170 -0700>,<Administrator>,<X>,<go>,<TOPSPIN 2.1>,
      <created by zg
	started at 2013-07-05 21:37:15.139 -0700,
	POWCHK enabled, PULCHK disabled,
       configuration hash MD5:
       C8 4E 4E 5D D3 5C D8 9E 9F 52 82 E0 59 8A DE 15
       data hash MD5: 64K
       EE DE BB A1 6F 07 2B 90 BF C1 FC 57 4F CE 75 46>)
(   2,<2013-07-05 21:48:48.248 -0700>,<Administrator>,<X>,<proc1d>,<TOPSPIN 2.1>,
      <Start of raw data processing
       efp LB = 0.3 FT_mod = 6 PKNL = 1 PHC0 = 0 PHC1 = 0 SI = 128K 
       data hash MD5: 128K
       B9 9B F8 50 66 24 CD A9 D8 88 82 DA 4C E7 E7 F0>)
(   3,<2013-07-05 21:48:49.311 -0700>,<Administrator>,<X>,<proc1d>,<TOPSPIN 2.1>,
      <pk PHC0 = -80.32104 PHC1 = 0 
       data hash MD5: 128K
       C7 5D 9A 02 8A 32 B3 AC 4F C8 62 BA 57 CA A3 59>)
(   4,<2013-07-05 21:48:49.748 -0700>,<Administrator>,<X>,<proc1d>,<TOPSPIN 2.1>,
      <abs ABSG = 1 
       data hash MD5: 128K
       7C B1 E7 CA 51 48 5E 64 DF AC F0 F8 D1 39 D4 17>)
(   5,<2013-07-05 21:48:49.904 -0700>,<Administrator>,<X>,<proc1d>,<TOPSPIN 2.1>,
      <abs ABSG = 2 
       data hash MD5: 128K
       B7 C8 36 48 B3 32 01 39 0C E2 5C 8E 31 2B 48 A2>)
(   6,<2013-07-05 21:48:49.982 -0700>,<Administrator>,<X>,<proc1d>,<TOPSPIN 2.1>,
      <abs ABSG = 3 
       data hash MD5: 128K
       56 A3 E5 5A C1 32 B2 DE A5 0E FB 6D 8E 90 75 E4>)
(   7,<2013-07-05 21:48:50.107 -0700>,<Administrator>,<X>,<proc1d>,<TOPSPIN 2.1>,
      <abs ABSG = 4 
       data hash MD5: 128K
       05 E5 46 2C AE 7A 77 9A DF 8A E9 C3 F9 4C 7B A1>)
(   8,<2013-07-05 21:48:50.217 -0700>,<Administrator>,<X>,<proc1d>,<TOPSPIN 2.1>,
      <abs ABSG = 5 
       data hash MD5: 128K
       2C 44 B2 F1 FA 71 C3 42 D6 EA 27 4A 6F 7D 2B 7F>)
$$ ##END=
$$ 
$$ $$ hash MD5
$$ $$ B0 6E 40 92 72 74 51 18 91 33 B8 2A 89 9F 82 80
##$RELAX= 
##$RELAX= 
##$RELAX= 
##$RELAX= 
##$RELAX= 
##$RELAX= 
##$RELAX= 
##$RELAX= 
$$ Bruker specific parameters
$$ --------------------------
##$DU= <E:\>
##$EXPNO= 12
$$ [...]
##$TP07= 0
##$TPNAME0= <>
##$TPNAME1= <>
##$TPNAME2= <>
##$TPNAME3= <>
##$TPNAME4= <>
##$TPNAME5= <>
##$TPNAME6= <>
##$TPNAME7= <>
##$TPOAL= (0..7)
0.5 0.5 0.5 0.5 0.5 0.5 0.5 0.5
##$TPOFFS= (0..7)
0 0 0 0 0 0 0 0
##$TUNHIN= 0
##$TUNHOUT= 0
##$TUNXOUT= 0
##$USERA1= <user>
##$USERA2= <user>
##$USERA3= <user>
##$USERA4= <user>
##$USERA5= <user>
##$V9= 5
##$VALIST= <valist>
##$VCLIST= <CCCCCCCCCCCCCCC>
##$VD= 0
##$VDLIST= <DDDDDDDDDDDDDDD>
##$VPLIST= <PPPPPPPPPPPPPPP>
##$VTLIST= <TTTTTTTTTTTTTTT>
##$WBST= 1024
##$WBSW= 4
##$XGAIN= (0..3)
0 0 0 0
##$XL= 0
##$YL= 0
##$YMAX_a= 6021709
##$YMIN_a= -12436796
##$ZGOPTNS= <>
##$ZL1= 120
##$ZL2= 120
##$ZL3= 120
##$ZL4= 120
##$ABSF1= 14.96098
##$ABSF2= -5.597201
##$ABSG= 5
##$ABSL= 3
##$ALPHA= 0
##$AQORDER= 0
##$ASSFAC= 0
##$ASSFACI= 0
##$ASSFACX= 0
##$ASSWID= 0
##$AUNMP= <proc_prof1d_extract.lims>
##$AXLEFT= 0
##$AXNAME= <>
##$AXNUC= <1H>
##$AXRIGHT= 0
##$AXTYPE= 0
##$AXUNIT= <>
##$AZFE= 0.1
##$AZFW= 0.1
##$BCFW= 0
##$BC_mod= 0
##$BYTORDP= 0
##$COROFFS= 0
##$CY= 15
##$DATMOD= 1
##$DC= 0
##$DFILT= <>
##$DTYPP= 0
##$F1P= 0
##$F2P= 0
##$FCOR= 0.5
##$FTSIZE= 131072
##$FT_mod= 6
##$GAMMA= 0
##$GB= 0
##$INTBC= 1
##$INTSCL= 1
##$ISEN= 128
##$LB= 0.3
##$LEV0= 0
##$LPBIN= 0
##$MAXI= 10000
##$MC2= 0
##$MEAN= 0
##$ME_mod= 0
##$MI= 0
##$NCOEF= 0
##$NC_proc= -2
##$NLEV= 6
##$NOISF1= 0
##$NOISF2= 0
##$NSP= 0
##$NTH_PI= 0
##$NZP= 0
##$OFFSET= 14.96098
##$PC= 1
##$PHC0= -80.32104
##$PHC1= 0
##$PH_mod= 1
##$PKNL= yes
##$PPARMOD= 0
##$PPDIAG= 0
##$PPIPTYP= 0
##$PPMPNUM= 2147483647
##$PPRESOL= 1
##$PSCAL= 4
##$PSIGN= 0
##$PYNMP= <proc.py>
##$REVERSE= no
##$SF= 400.020009646537
##$SI= 131072
##$SIGF1= 0
##$SIGF2= 0
##$SINO= 400
##$SIOLD= 131072
##$SPECTYP= <>
##$SREGLST= <1H.CDCl3>
##$SSB= 0
##$STSI= 131072
##$STSR= 0
##$SW_p= 8223.68421052631
##$SYMM= 0
##$S_DEV= 0
##$TDeff= 65536
##$TDoff= 0
##$TI= <>
##$TILT= no
##$TM1= 0
##$TM2= 0
##$TOPLEV= 0
##$USERP1= <user>
##$USERP2= <user>
##$USERP3= <user>
##$USERP4= <user>
##$USERP5= <user>
##$WDW= 1
##$XDIM= 131072
##$YMAX_p= 467663789
##$YMIN_p= -11451
##$CURPLOT= <Network HP LaserJet P1505>
##$CURPRIN= <$Network HP LaserJet P1505>
##$DFORMAT= <normdp>
##$LAYOUT= <+/1D_H.xwp>
##$LFORMAT= <normlp>
##$PFORMAT= <normpl>
##$SURQMSG= 1
$$ End of Bruker specific parameters
$$ ---------------------------------
##NTUPLES= NMR SPECTRUM
##VAR_NAME=  FREQUENCY,     SPECTRUM/REAL,   SPECTRUM/IMAG
##SYMBOL=    X,             R,               I
##VAR_TYPE=  INDEPENDENT,   DEPENDENT,       DEPENDENT
##VAR_FORM=  AFFN,          ASDF,            ASDF
##VAR_DIM=   131072,        131072,          131072
##UNITS=     HZ,            ARBITRARY UNITS, ARBITRARY UNITS
##FACTOR=    0.0627417313425164, 1,          1
##FIRST=     8223.62146879497, 662,          -52298
##LAST=      0,             2593,            -52398
##MIN=       0,             -11451,          0
##MAX=       8223.62146879497, 467663789,    0
$$ Real data points
##PAGE= N=1
##DATA TABLE= (X++(R..R)), XYDATA
$$ [...]
$$ plain form
63936 4360032 4637816 4896259 5128990 5330337 5495651 5621358 5704673 5743492 5736663 5684248
63926 5684248 5587374 5448156 5270124 5058712 4820883 4563903 4294399 4018299 3741036 3467302
63916 3467302 3200827 2944807 2702546 2477266 2271160 2084892 1918090 1770035 1639673
63907 1639673 1525270 1424485 1334988 1255076 1183846 1120941 1066004 1018184 976084 938303 904045
63896 904045 873154 845522 820533 797137 774440 752079 730072 708512 687621 667875 649639
63885 649639 632656 616314 600692 586886 575915 567589 560988 555836 552821 552553 554903 559536 566461
63872 566461 575610 586327 597794 609776 622544 636212 650571 665469 680847 696277 710944 724409
63860 724409 737084 749499 761086 770176 775535 777628 777939 777167 774667 769785 762973 755111 746246 735759
$$ packed form
63936D360032K77784K58443K32731K01347J65314J25707Q3315L8819o829n2415
63926E684248r6874j39218j78032k11412k37829k56980k69504k76100k77263k73734
63916C467302k66475k56020k42261k25280k06106j86268j66802j48055j30362
63907A639673j14403j00785q9497p9912p1230o2905n4937m7820m2100l7781l4258
63896I04045l0891k7632k4989k3396k2697k2361k2007k1560k0891j9746j8236
63885F49639j6983j6342j5622j3806j0971q326o601n152l015k68K350M633O925
63872E66461R149J0717J1467J1982J2768J3668J4359J4898J5378J5430J4667J3465
63860G24409J2675J2415J1587R090N359K093L11p72k500m882o812p862q865j0487
$$ plain form
63846 735759 723484 709828 694837 678024 659359 639679 619752 599515 578634 557293 536000
63835 536000 515126 495143 476845 460616 445684 430758 415416 400427 386741 374574 363522
63824 363522 353158 343381 334353 326205 318804 311927 305639 300203 295543 291234 287235 284134 282246 280939
63810 280939 279433 277941 277308 277707 278365 278479 277713 275840 272703 268765 265017 262002 259351 256547 253626
63795 253626 250843 248207 245788 244058 243329 243078 242363 240876 239087 237317 235200 232311 229014 226286 224689
63780 224689 223840 223052 222261 221990 222427 223044 223393 223856 225096 226947 228442 228934 228601 227733 226195 224023 221982
63763 221982 220865 220497 220070 219370 219024 219416 220012 220100 219765 219677 220200 221210 222649 224651 227029 229147 230650
63746 230650 231944 233643 235809 238124 240538 243229 246039 248578 250929 253606 256575 258947 260097 260593
$$ packed form
63846G35759j2275j3656j4991j6813j8665j9680j9927k0237k0881k1341k1293
63835E36000k0874j9983j8298j6229j4932j4926j5342j4989j3686j2167j1052
63824C63522j0364r777r028q148p401o877o288n436m660m309l999l101j888j307
63810B80939j506j492o33L99O58J14p66j873l137l938l748l015k651k804k921
63795B53626k783k636k419j730p29k51p15j487j789j770k117k889l297k728j597
63780B24689q49p88p91k71M37O17L49M63J240J851J495M92l33q68j538k172k041
63763B21982j117l68m27p00l46L92N96Q8l35q8N23J010J439K002K378K118J503
63746B30650J294J699K166K315K414K691K810K539K351K677K969K372J150M96
$$ plain form
63732 260593 261414 262621 263476 263734 264094 265324 267566 270698 274790 279830 285344 290696 295599 300116 304297
63717 304297 308085 311392 313953 315198 314570 312146 308764 305401 302442 299651 296840 294388 292929 292589 292749
63702 292749 292672 292159 291504 291091 291303 292592 295150 298477 301674 304356 307034 310410 314420 318206 320935 322505
63686 322505 323425 324139 324635 324715 324468 324224 324098 323859 323373 322860 322461 321859 320698 319249 318237 318045 318427 318968
63668 318968 319447 319711 319618 319308 319239 319738 320623 321338 321300 320118 317742 314565 311177 307917 304785 301782 299031
63651 299031 296518 294069 291735 289906 288775 287972 287053 286177 285955 286670 287954 289309 290679 292325 294278
63636 294278 296203 297875 299629 302053 305279 308912 312798 317510 323683 331101 338979 347094 356105 366598
63622 366598 378285 390448 402847 415949 430502 447143 466144 487288 510127 534616 561298
$$ packed form
63732B60593Q21J207Q55K58L60J230K242L132M092N040N514N352M903M517M181
63717C04297L788L307K561J245o28k424l382l363k959k791k811k452j459l40J60
63702B92749p7n13o55m13K12J289K558L327L197K682K678L376M010L786K729J570
63686C22505R20P14M96Q0k47k44j26k39m86n13l99o02j161j449j012j92L82N41
63668C18968M79K64r3l10o9M99Q85P15l8j182k376l177l388l260l132l003k751
63651B99031k513k449k334j829j131q03r19q76k22P15J284J355J370J646J953
63636B94278J925J672J754K424L226L633L886M712O173P418P878Q115R011J0493
63622C66598J1687J2163J2399J3102J4553J6641J9001K1144K2839K4489K6682
$$ plain form
63611 561298 590670 622521 656066 690473 724832 757714 787094 810852 827460 836595 839463 838288
63599 838288 835002 830389 824684 818620 813258 808775 804143 798215 790512 780581 767273 749541 727798
63586 727798 703710 678531 652353 625287 598628 574143 552512 533276 516282 502318 491948
63575 491948 484409 478358 473419 470319 469516 470429 472249 475001 479270 485090 491615 497987 504238 511123 519101
63560 519101 527720 536155 544291 553020 563461 576175 591424 609925 632877 661189 695050 734229
63548 734229 778121 824966 871256 912477 944746 966002 976150 976631 969818 958381 944823 931346
63536 931346 919721 910845 904438 899548 895452 891731 887375 880271 868128 849984 826583 799362 769400
63523 769400 737404 704313 671389 639669 609552 581045 554265 529555 507152 486937 468633
$$ packed form
63611E61298K9372L1851L3545L4407L4359L2882K9380K3758J6608R135K868j175
63599H38288l286m613n705o064n362m483m632n928p703r931j3308j7732k1743
63586G27798k4088k5179k6178k7066k6659k4485k1631j9236j6994j3964j0370
63575D91948p539o051m939l100q03R13J820K752M269N820O525O372O251O885P978
63560E19101Q619Q435Q136Q729J0441J2714J5249J8501K2952K8312L3861L9179
63548G34229M3892M6845M6290M1221L2269K1256J0148M81o813j1437j3558j3477
63536I31346j1625q876o407m890m096l721m356p104j2143j8144k3401k7221k9962
63523G69400l1996l3091l2924l1720l0117k8507k6780k4710k2403k0215j8304
$$ plain form
63512 468633 452189 437812 425459 414508 404198 394460 385976 379257 373947 369282 364952 361119 357872
63499 357872 355197 353343 352534 352235 351429 349874 348454 347943 347999 347901 347602 347438 347238 346604 345856 345849 346901 348620
63481 348620 350790 353644 357128 360616 363673 366553 369647 372856 375727 377750 378320 376937 373788 369825
63467 369825 365925 362253 358613 354996 351433 347716 343715 339854 336945 335551 335664 336790 338250 339660
63453 339660 341266 343586 346657 349971 353283 357030 361742 367475 374133 381911 391016 401309 412824 426400
63439 426400 443366 464622 490284 519769 551579 583060 611109 633545 649876 660989 668501 674200
63427 674200 679527 685321 692220 701281 713951 731402 754142 782218 815419 853135 894127 936474
63415 936474 977681 1014992 1046002 1069203 1084047 1090702 1090026 1083676 1073881 1062863 1052376 1043504 1036470
$$ packed form
63512D68633j6444j4377j2353j0951j0310r738q484o719n310m665m330l833l247
63499C57872k675j854q09k99q06j555j420n11N6r8k99j64k00o34p48pJ052J719
63481C48620K170K854L484L488L057K880L094L209K871K023N70j383l149l963
63467C69825l900l672l640l617l563l717m001l861k909j394J13J126J460J410
63453C39660J606K320L071L314L312L747M712N733O658P778R105J0293J1515J3576
63439D26400J6966K1256K5662K9485L1810L1481K8049K2436J6331J1113P512N699
63427F74200N327N794O899R061J2670J7451K2740K8076L3201L7716M0992M2347
63415I36474M1207L7311L1010K3201J4844O655o76o350r795j1018j0487q872p034
$$ plain form
63402 1036470 1030448 1023681 1013980 999364 978674 951994 920564 886090 850023 813372 776960 741585
63390 741585 707920 676364 647057 620092 595745 574368 555869 539473 524467 511224 500985
63379 500985 494474 491199 490369 491885 495937 502112 509594 518100 528020 539662 552840 567141 582153
63366 582153 597576 613624 631327 651878 675640 702180 731255 763190 798147 835494 874035
63355 874035 912368 948752 981072 1007353 1026303 1037416 1040995 1038330 1031526 1022712 1013335 1004151 995552
63342 995552 987621 979962 971566 960886 946259 926651 902130 873497 841571 807170 771690 737046
63330 737046 704768 675445 649188 626226 606883 591448 580428 574382 572783 573143 571883 566327 555809
63317 555809 541193 523888 505364 486931 469460 453344 438826 426157 415296 405760 397166 389814
$$ packed form
63402A036470o022o767r701j4616k0690k6680l1430l4474l6067l6651l6412l5375
63390G41585l3665l1556k9307k6965k4347k1377j8499j6396j5006j3243j0239
63379E00985o511l275q30J516M052O175P482Q506R920J1642J3178J4301J5012
63366E82153J5423J6048J7703K0551K3762K6540K9075L1935L4957L7347L8541
63355H74035L8333L6384L2320K6281J8950J1113L579k665o804q814r377r184q599
63342I95552p931p659q396j0680j4627j9608k4521k8633l1926l4401l5480l4644
63330G37046l2278k9323k6257k2962j9343j5435j1020o046j599L60j260n556j0518
63317E55809j4616j7305j8524j8433j7471j6116j4518j2669j0861r536q594p352
$$ plain form
63305 389814 384390 380983 378699 376429 373809 371276 369389 368388 368210 368485 368492 367570 365746 363599 361277 358096
63289 358096 353498 348108 343280 339735 337126 334882 332883 331232 329932 329023 328594 328323 327442 325610 323564
63274 323564 322420 322366 322470 321806 320416 319095 318523 318836 319788 320990 322040 322689 323060 323574 324565 325988 327632
63257 327632 329523 331953 335079 338623 342098 345277 348412 352007 356367 361312 366370 371324 376488 382357
63243 382357 389109 396644 405007 414387 424755 435907 447980 461525 476897 493947 512449 532351
63231 532351 553287 574403 595182 616058 637669 659733 681313 701994 722200 742410 762719
63220 762719 783164 803855 824686 845432 866217 887345 908545 928920 947737 964633 978831
63209 978831 988842 993446 992594 986947 976942 962750 944822 923914 900707 875823 850100 824534
$$ packed form
63305C89814n424l407k284k270k620k533j887j001j78K75Pr22j824k147k322l181
63289C58096m598n390m828l545k609k244j999j651j300r09m29k71q81j832k046
63274C23564j144n4J04o64j390j321n72L13R52J202J050O49L71N14R91J423J644
63257C27632J891K430L126L544L475L179L135L595M360M945N058M954N164N869
63243C82357O752P535Q363R380J0368J1152J2073J3545J5372J7050J8502J9902
63231E32351K0936K1116K0779K0876K1611K2064K1580K0681K0206K0210K0309
63220G62719K0445K0691K0831K0746K0785K1128K1200K0375J8817J6896J4198
63209I78831J0011M604q52n647j0005j4192j7928k0908k3207k4884k5723k5566
$$ plain form
63197 824534 799996 777237 756974 739559 724641 711516 699920 690309 683406 679690 679306 682208 688225
63184 688225 697055 708286 721496 736477 753324 772105 792382 813194 833712 853805 873898 894363
63172 894363 915141 935820 955906 974999 992823 1009141 1023678 1036092 1045849 1052057 1053642 1049918
63160 1049918 1040890 1026859 1007996 984572 957351 927280 894998 861234 827470 795351 765325
63149 765325 736640 708944 683103 660027 639512 620857 603995 589218 576301 564833 555105 547708
63137 547708 542277 537499 532557 527804 523845 520690 518196 516744 516883 518547 521089 524015 527430 531827
63123 531827 537546 544311 551160 557007 561486 565149 568762 572537 576193 579531 582625 585449 587642 588876
63109 588876 589371 589781 590482 591161 591286 590888 590526 590459 590211 589156 587296 585110 582832 580287 577463 574866 573125
$$ packed form
63197H24534k4538k2759k0263j7415j4918j3125j1596r611o903l716l84K902O017
63184F88225Q830J1231J3210J4981J6847J8781K0277K0812K0518K0093K0093K0465
63172H94363K0778K0679K0086J9093J7824J6318J4537J2414R757O208J585l724
63160A049918r028j4031j8863k3424k7221l0071l2282l3764l3764l2119l0026
63149G65325k8685k7696k5841k3076k0515j8655j6862j4777j2917j1468r728p397
63137E47708n431m778m942m753l959l155k494j452J39J664K542K926L415M397
63123E31827N719O765O849N847M479L663L613L775L656L338L094K824K193J234
63109E88876M95M10P01O79J25l98l62o7k48j055j860k186k278k545k824k597j741
$$ plain form
63092 573125 572394 572271 572214 571929 571480 571109 571034 571341 572046 573176 574778 576921 579717 583230 587314 591601 595689
63075 595689 599338 602600 605880 609815 614786 620558 626693 633319 641084 650230 660224 670616 681829 694638
63061 694638 709251 725460 743475 763891 786852 811893 838804 868085 900368 935857 974603
63050 974603 1016858 1062632 1111148 1161208 1212043 1263484 1315311 1366789 1417037 1465728 1513219
63039 1513219 1560036 1606339 1651936 1696739 1741040 1785325 1829899 1874646 1918857 1961065 1999268
63028 1999268 2031550 2056490 2072868 2079319 2074699 2058731 2031918 1994910 1948440 1893978 1833899 1770708
63016 1770708 1706339 1642321 1580155 1521212 1466532 1417071 1373889 1337721 1308554 1286017 1270018
63005 1270018 1260595 1257326 1259474 1266767 1279472 1297498 1319865 1345403 1373616 1404492 1437694 1472386
$$ packed form
63092E73125p31j23n7k85m49l71p5L07P05J130J602K143K796L513M084M287M088
63075E95689L649L262L280L935M971N772O135O626P765R146R994J0392J1213J2809
63061F94638J4613J6209J8015K0416K2961K5041K6911K9281L2283L5489L8746
63050I74603M2255M5774M8516N0060N0835N1441N1827N1478N0248M8691M7491
63039A513219M6817M6303M5597M4803M4301M4285M4574M4747M4211M2208L8203
63028A999268L2282K4940J6378O451m620j5968k6813l7008m6470n4462o0079o3191
63016A770708o4369o4018o2166n8943n4680m9461m3182l6168k9167k2537j5999
63005A270018r423l269K148P293J2705J8026K2367K5538K8213L0876L3202L4692
$$ plain form
62993 1472386 1507776 1543466 1579258 1615010 1650748 1686580 1722265 1757029 1789935 1820218 1847083
62982 1847083 1869362 1885609 1894507 1895111 1886822 1869368 1842822 1807548 1764203 1713855 1657997 1598286
62970 1598286 1536366 1473905 1412445 1352871 1295307 1239918 1187591 1139285 1094844 1053123 1013445
62959 1013445 976289 942322 911372 882737 855966 830794 806740 783473 761394 741191 722873
62948 722873 705725 689200 673326 658185 643529 629107 615034 601684 589460 578718 569587 561761
62936 561761 554719 548159 541990 536015 530109 524696 520476 517485 514948 512347 510084 508725 508039 507330 506426
62921 506426 505727 505383 504966 503952 502123 499497 496295 492983 489990 487276 484467 481435 478388 475379 472133
62906 472133 468556 465040 462050 459668 457770 456395 455605 455177 454785 454460 454576 455288 456164 456463 455772 454377
$$ packed form
62993A472386L5390L5690L5792L5752L5738L5832L5685L4764L2906L0283K6865
62982A847083K2279J6247Q898O04q289j7454k6546l5274m3345n0348n5858n9711
62970A598286o1920o2461o1460n9574n7564n5389n2327m8306m4441m1721l9678
62959A013445l7156l3967l0950k8635k6771k5172k4054k3267k2079k0203j8318
62948G22873j7148j6525j5874j5141j4656j4422j4073j3350j2224j0742r131p826
62936E61761p042o560o169n975n906n413m220k991k537k601k263j359o86p09r04
62921E06426o99l44m17j014j829k626l202l312k993k714k809l032l047l009l246
62906D72133l577l516k990k382j898j375p90m28l92l25J16P12Q76K99o91j395
$$ plain form
62890 454377 452985 451977 450995 449463 447510 446047 445769 446383 447075 447471 447758 448112 448481 448939 449726 450859 451977
62873 451977 452660 452610 451637 449901 448171 447326 447419 447713 447729 447689 447678 447138 445805 444565 444576 445883 447630 449381
62855 449381 451284 452990 453545 452744 451866 452414 454530 457096 459010 459948 460221 460370 460772 461241 461068 459753 457589
62838 457589 455266 453085 450857 448493 446255 444405 442928 441760 441080 441168 442024 443258 444476 445699 447259
62823 447259 449200 451009 452213 453105 454490 456711 459305 461747 464138 466897 470110 473494 476825 480126
62809 480126 483523 487158 491114 495340 499739 504392 509434 514638 519514 524052 528995 535015 541933 549203
62795 549203 556956 566020 576998 589757 603929 619559 637171 657465 681024 708155 738936 773512
62783 773512 812234 855478 903543 956898 1016222 1081791 1152976 1228617 1307719 1389371 1472166
$$ packed form
62890D54377j392j008r82j532j953j463k78O14O92L96K87L54L69M58P87J133J118
62873D51977O83n0r73j736j730q45R3K94J6m0j1n40j333j240J1J307J747J751
62855D49381J903J706N55q01q78N48K116K566J914R38K73J49M02M69j73j315k164
62838D57589k323k181k228k364k238j850j477j168o80Q8Q56J234J218J223J560
62823D47259J941J809J204Q92J385K221K594K442K391K759L213L384L331L301
62809D80126L397L635L956M226M399M653N042N204M876M538M943O020O918P270
62795E49203P753R064J0978J2759J4172J5630J7612K0294K3559K7131L0781L4576
62783G73512L8722M3244M8065N3355N9324O5569P1185P5641P9102Q1652Q2795
$$ plain form
62772 1472166 1554255 1633964 1709885 1780262 1842703 1894663 1933998 1959183 1969539 1965443 1947947
62761 1947947 1917982 1876190 1823549 1761727 1692692 1618392 1541043 1463166 1386759 1312613 1240826
62750 1240826 1171866 1106741 1046164 990009 937692 888879 843700 802483 765406 732313 702798
62739 702798 676490 653294 633238 616093 601234 587950 575826 564750 554638 545356 536948 529756
62727 529756 524123 520033 517193 515377 514492 514334 514624 515400 517155 520419 525314 531619 539117 547722 557404
62712 557404 568204 580243 593724 609057 627034 648531 673846 702541 734122 768648 806472
62701 806472 847706 892346 940749 993622 1051586 1114944 1183635 1257057 1333988 1412929 1492357
62690 1492357 1570415 1644713 1712825 1772714 1822213 1858616 1879703 1885178 1876325 1854202 1819005 1771461
$$ packed form
62772A472166Q2089P9709P5921P0377O2441N1960L9335K5185J0356m096j7496
62761A947947k9965m1792n2641o1822o9035p4300p7349p7877p6407p4146p1787
62750A240826o8960o5125o0577n6155n2317m8813m5179m1217l7077l3093k9515
62739G02798k6308k3196k0056j7145j4859j3284j2124j1076j0112r282q408p192
62727E29756n633m090k840j816q85j58K90P76J755L264M895O305P498Q605R682
62712E57404J0800J2039J3481J5333J7977K1497K5315K8695L1581L4526L7824
62701H06472M1234M4640M8403N2873N7964O3358O8691P3422P6931P8941P9428
62690A492357P8058P4298O8112N9889M9499L6403K1087N475q853k2123l5197m7544
$$ plain form
62678 1771461 1713962 1649687 1580994 1509166 1435302 1360852 1287372 1216136 1147902 1082862 1020998
62667 1020998 962741 909074 860768 817704 779194 744668 713713 685696 659902 636070 614492
62656 614492 595452 578753 563805 550035 537191 525305 514340 503874 493369 482890 473374 465899
62644 465899 460670 456870 453464 450024 446841 444461 443150 442670 442437 441859 440593 438573 435927 432900 429752
62629 429752 426660 423712 420953 418391 416040 414070 412891 412870 413896 415324 416504 417386 418582 420753 423910
62614 423910 427399 430666 433863 437432 441193 444398 446872 449641 454018 460434 468540 478072 489074 501539
62600 501539 515501 531394 549738 570548 593650 619480 648893 682085 718359 757040 797824
62589 797824 839986 881946 922066 959338 992860 1021242 1043159 1058186 1066508 1068023 1062260 1049098
$$ packed form
62678A771461n7499o4275o8693p1828p3864p4450p3480p1236o8234o5040o1864
62667A020998n8257n3667m8306m3064l8510l4526l0955k8017k5794k3832k1578
62656F14492j9040j6699j4948j3770j2844j1886j0965j0466j0505j0479r516p475
62644D65899n229l800l406l440l183k380j311m80k33n78j266k020k646l027l148
62629D29752l092k948k759k562k351j970j179k1J026J428J180Q82J196K171L157
62614D23910L489L267L197L569L761L205K474K769M377O416Q106R532J1002J2465
62600E01539J3962J5893J8344K0810K3102K5830K9413L3192L6274L8681M0784
62589G97824M2162M1960M0120L7272L3522K8382K1917J5027Q322J515n763j3162
$$ plain form
62577 1049098 1029251 1004115 975365 944462 912174 878598 843847 808591 773798 740263 708618
62566 708618 679503 653290 629719 608119 588013 569388 552493 537557 524598 513381 503569 494908
62554 494908 487178 480162 473920 468961 465657 463587 461996 460815 460477 460689 460352 459072 457882 457796 458430 458775
62538 458775 458693 458670 458567 457714 456115 454671 454184 454894 456974 460614 465463 470694 475960 481856 489281 498750
62522 498750 510385 524092 539571 556648 575779 597945 623911 653849 687606 724917 765288
62511 765288 808133 853132 900125 948575 997473 1045707 1092026 1134675 1171703 1201980 1225544
62500 1225544 1242726 1253352 1257101 1254310 1246231 1234790 1222245 1210696 1201519 1195398 1192974 1195196 1202885
62487 1202885 1216325 1235517 1260588 1291761 1329175 1372694 1421112 1471019 1517081 1554639 1582373
$$ packed form
62577A049098j9847k5136k8750l0903l2288l3576l4751l5256l4793l3535l1645
62566G08618k9115k6213k3571k1600k0106j8625j6895j4936j2959j1217r812q661
62554D94908p730p016o242m959l304k070j591j181l38K12l37j280j190q6O34L45
62538D58775q2k3j03q53j599j444m87P10K080L640M849N231N266N896P425R469
62522D98750J1635J3707J5479J7077J9131K2166K5966K9938L3757L7311M0371
62511G65288M2845M4999M6993M8450M8898M8234M6319M2649L7028L0277K3564
62500A225544J7182J0626L749k791q079j1441j2545j1549r177o121k424K222P689
62487A202885J3440J9192K5071L1173L7414M3519M8418M9907M6062L7558K7734
$$ plain form
62476 1582373 1602068 1615663 1622855 1621342 1608545 1582815 1543865 1493129 1433722 1369224 1302029 1233046
62464 1233046 1163048 1093800 1027523 965618 908451 856171 809107 767287 730214 697485 669293
62453 669293 645916 626912 611143 597555 585726 575772 567933 562220 558327 555928 555078 556169 559452
62440 559452 564835 572098 580860 590147 598508 604941 609381 612018 612665 611269 608522 605117 600667 594217
62426 594217 585778 576510 567329 558177 548919 540097 532258 525147 518170 511284 504879 499039 493409 487706
62412 487706 481966 476378 471186 466658 462883 459672 456836 454348 452014 449350 446262 443669 442803 443801 445549
62397 445549 447145 449001 452069 456332 460661 464093 466655 468804 470627 472051 473465 475540 478430 481704
62383 481704 485216 489612 495689 503447 512048 520577 528694 536705 545150 554232 563588 572777 581996 591943
$$ packed form
62476A582373J9695J3595P192j513j2797k5730l8950n0736n9407o4498o7195o8983
62464A233046o9998o9248o6277o1905n7167n2280m7064m1820l7073l2729k8192
62453F69293k3377j9004j5769j3588j1829r954p839n713l893k399q50J091L283
62440E59452N383P263Q762R287Q361O433M440K637O47j396k747l405m450o450
62426E94217q439r268r181r152r258q822p839p111o977o886o405n840n630n703
62412D87706n740n588n192m528l775l211k836k488k334k664l088k593q66R98J748
62397D45549J596J856L068M263M329L432K562K149J823J424J414K075K890L274
62383D81704L512M396O077P758Q601Q529Q117Q011Q445R082R356R189R219R947
$$ plain form
62369 591943 602887 614389 626272 639406 655059 673792 695584 720762 750133 784222 823015
62358 823015 866563 915156 968619 1025844 1085218 1145147 1203874 1259114 1308306 1349348 1381187
62347 1381187 1403937 1418524 1425975 1426921 1421710 1410689 1394027 1371398 1342424 1307592 1268464 1226957
62335 1226957 1184747 1143364 1104232 1068265 1035637 1006176 979807 956537 936330 919219 905177
62324 905177 893597 883119 872272 860296 847297 833837 820448 807217 793627 779042 763544
62313 763544 748074 733525 719853 706275 692146 677442 662661 648601 636105 625564 616532 608016
62301 608016 599306 590481 582104 574564 567877 562064 557460 554358 552395 550711 548961 547815 548125 549807
62287 549807 552059 554443 557148 560210 563233 566140 569507 573682 578078 581838 584909 587941 591383 595256
$$ packed form
62369E91943J0944J1502J1883J3134J5653J8733K1792K5178K9371L4089L8793
62358H23015M3548M8593N3463N7225N9374N9929N8727N5240M9192M1042L1839
62347A381187K2750J4587P451R46n211j1021j6662k2629k8974l4832l9128m1507
62335A226957m2210m1383l9132l5967l2628k9461k6369k3270k0207j7111j4042
62324I05177j1580j0478j0847j1976j2999j3460j3389j3231j3590j4585j5498
62313G63544j5470j4549j3672j3578j4129j4704j4781j4060j2496j0541r032q516
62301F08016q710q825q377p540o687n813m604l102j963j684j750j146L10J682
62287E49807K252K384K705L062L023K907L367M175M396L760L071L032L442L873
$$ plain form
62273 595256 599667 605000 611550 619441 628976 640571 654154 669037 684703 701585 720827 743427
62261 743427 769926 800831 836944 879048 927383 981571 1040869 1104173 1169744 1235239 1298162
62250 1298162 1356250 1407474 1450136 1483336 1507293 1522879 1530786 1531107 1523493 1507455 1482711 1449564
62238 1449564 1408960 1362135 1310352 1255114 1198243 1141377 1085629 1032102 982346 937643 898010
62227 898010 862558 830768 802747 778316 756734 737575 721034 707021 694638 683070 672439
62216 672439 663226 655345 648372 642305 637475 633888 631203 629221 627905 627124 626852 627580 629974 634114 639362
62201 639362 644986 650627 656230 661874 667755 674056 680793 687872 695257 702908 710660 718364 726076 733966
62187 733966 742163 750789 759998 769806 780038 790556 801254 811612 820584 827362 832177 836051 839854
$$ packed form
62273E95256M411N333O550P891R535J1595J3583J4883J5666J6882J9242K2600
62261G43427K6499L0905L6113M2104M8335N4188N9298O3304O5571O5495O2923
62250A298162N8088N1224M2662L3200K3957J5586P907L21p614j6038k4744l3147
62238A449564m0604m6825n1783n5238n6871n6866n5748n3527m9756m4703l9633
62227H98010l5452l1790k8021k4431k1582j9159j6541j4013j2383j1568j0631
62216F72439r213p881o973o067m830l587k685j982j316p81k72P28K394M140N248
62201F39362N624N641N603N644N881O301O737P079P385P651P752P704P712P890
62187G33966Q197Q626R209R808J0232J0518J0698J0358Q972O778M815L874L803
$$ plain form
62174 839854 843956 848726 854964 863708 875789 891706 911815 936543 966306 1001082 1040049 1081833
62162 1081833 1125121 1168692 1210721 1248497 1279339 1301870 1316359 1324103 1326646 1325197 1320187 1311222
62150 1311222 1297588 1278756 1254427 1224580 1189903 1152069 1113177 1074890 1038205 1003752 971932
62139 971932 942933 916963 894387 875291 859076 844868 832281 821379 811981 803466 795304 787400
62127 787400 779814 772569 765909 760461 756868 755364 755823 758179 762693 769754 779166 789481 798254 803390
62113 803390 804388 802226 798242 793456 788784 785160 782935 781229 778187 772029 762047 748862 733888 718474
62099 718474 703494 689575 677405 667541 660043 654616 651112 649626 650021 651691 654017 656875 660449 664644
62085 664644 669022 673439 678467 684842 692561 700937 709693 719662 732104 747573 765755 786081 807963
$$ packed form
62174H39854M102M770O238Q744J2081J5917K0109K4728K9763L4776L8967M1784
62162A081833M3288M3571M2029L7776L0842K2531J4489P744K543j449n010q965
62150A311222j3634j8832k4329k9847l4677l7834l8892l8287l6685l4453l1820
62139I71932k8999k5970k2576j9096j6215j4208j2587j0902r398q515q162p904
62127G87400p586p245o660n448l593j504M59K356M514P061R412J0315Q773N136
62113H03390R98k162l984m786m672l624k225j706l042o158r982j3185j4974j5414
62099G18474j4980j3919j2170r864p498n427l504j486L95J670K326K858L574M195
62085F64644M378M417N028O375P719Q376Q756R969J2442J5469J8182K0326K1882
$$ plain form
62072 807963 830655 853660 877381 902705 929759 957686 985929 1015097 1046143 1079200 1113522
62061 1113522 1147862 1180311 1208438 1230552 1246679 1257669 1263689 1264353 1260041 1252002 1240934 1226178
62049 1226178 1206616 1181845 1152300 1118736 1081929 1042620 1001607 960004 919230 880341 843415
62038 843415 808008 774120 742232 712508 684652 658652 635074 614368 596372 580695 567099
62027 567099 555286 544748 535138 526436 518460 510658 502677 494799 487366 480046 472154 463648 455399 448373
62013 448373 442731 437831 433007 428294 424410 422092 421541 422452 424352 426848 429768 433283 437629 442513 447064
61998 447064 450745 453957 457304 460574 463089 464870 466627 468556 469867 469737 468075 465128 461018 456038
61984 456038 450834 445791 440646 435076 429353 424045 419418 415432 411952 408592 404819 400674 397079 394855
$$ packed form
62072H07963K2692K3005K3721K5324K7054K7927K8243K9168L1046L3057L4322
62061A113522L4340L2449K8127K2114J6127J0990O020O64m312q039j1068j4756
62049A226178j9562k4771k9545l3564l6807l9309m1013m1603m0774l8889l6926
62038H43415l5407l3888l1888k9724k7856k6000k3578k0706j7996j5677j3596
62027E67099j1813j0538r610q702p976p802p981p878p433p320p892q506q249p026
62013D48373n642m900m824m713l884k318n51R11J900K496K920L515M346M884M551
61998D47064L681L212L347L270K515J781J757J929J311j30j662k947m110m980
61984D56038n204n043n145n570n723n308m627l986l480l360l773m145l595k224
$$ plain form
61970 394855 393716 392735 391618 390893 390867 390999 390468 389034 387177 385630 384813 384493 383977 382846 381553 381094 382024
61953 382024 383936 385936 387508 388863 390578 392982 396001 399565 403988 409754 417025 425664 435721 447463
61939 447463 460768 474877 489064 503285 517876 532786 547443 561244 573907 585406 595860
61928 595860 605380 613803 620636 625451 628244 629244 628536 626123 622226 617220 611354 604829 598159 592148
61914 592148 587536 584868 584638 587183 592379 599705 608748 619460 631794 645217 658656 670877 680986
61901 680986 688752 694445 698212 699632 698127 693797 687552 680325 672414 663793 654696 645542 636420 627161
61887 627161 617998 609772 603188 598009 593241 587943 581644 574126 565265 555257 544714 534311 524428
61874 524428 515237 506858 499224 492064 485420 480101 477162 476831 478191 480014 481673 483245 485128 487810
$$ packed form
61970C94855j139r81j117p25k6J32n31j434j857j547q17l20n16j131j293m59R30
61953C82024J912K000J572J355J715K404L019L564M423N766P271Q639J0057J1742
61939D47463J3305J4109J4187J4221J4591J4910J4657J3801J2663J1499J0454
61928E95860R520Q423O833M815K793J000p08k413l897n006n866o525o670o011
61914E92148m612k668k30K545N196P326R043J0712J2334J3423J3439J2221J0109
61901F80986P766N693L767J420j505m330o245p227p911q621r097r154r122r259
61887F27161r163q226o584n179m768n298o299p518q861j0008j0543j0403r883
61874E24428r191q379p634p160o644n319k939l31J360J823J659J572J883K682
$$ plain form
61860 487810 491812 497575 505357 515236 527041 540290 554531 569939 587319 607265 629470 653083
61848 653083 677569 702863 728730 754335 778533 800378 819311 835075 847524 856303 860663 859947
61836 859947 854549 846203 836936 827715 818447 809304 801552 796770 795569 797572 802489 810568 821841 835359
61822 835359 849491 862663 873586 881214 884999 885095 881865 875192 864656 850397 833469 815219 796512
61809 796512 777616 758577 739494 720492 701611 682855 664472 647087 631266 616904 603406
61798 603406 590656 579376 570196 562708 555983 549685 544111 539285 534774 530364 526286 522615 519111 515829
61784 515829 513259 511585 510300 508875 507315 505767 504071 502139 500361 499218 498739 498663 498817 498965 498724 498030
61768 498030 497399 497244 497304 497312 497941 500270 504321 508804 512611 516047 520286 525914 532347 538501 543719 547937
$$ packed form
61860D87810M002N763P782R879J1805J3249J4241J5408J7380J9946K2205K3613
61848F53083K4486K5294K5867K5605K4198K1845J8933J5764J2449Q779M360p16
61836H59947n398q346r267r221r268r143p752m782j201K003M917Q079J1273J3518
61822H35359J4132J3172J0923P628L785R6l230o673j0536j4259j6928j8250j8707
61809G96512j8896j9039j9083j9002j8881j8756j8383j7385j5821j4362j3498
61798F03406j2750j1280r180p488o725o298n574m826m511m410m078l671l504l282
61784E15829k570j674j285j425j560j548j696j932j778j143m79p6J54J48k41o94
61768D98030o31j55O0QO29K329M051M483L807L436M239N628O433O154N218M218
$$ plain form
61752 547937 551132 552815 552362 549831 546163 542307 538271 533318 527027 519897 512931 506848 501721 497134
61738 497134 492604 488031 483860 480710 478783 477671 476762 475767 474868 474440 474714 475642 476964 478335 479428 480098
61722 480098 480575 481351 482712 484406 485963 487285 488779 490902 493681 496559 498577 498934 497706 495893 494281
61707 494281 492407 489141 484256 478780 473666 468828 463862 459034 454946 451610 448545 445599 443025 440721
61693 440721 437904 433742 428174 422091 416829 413315 411467 410455 409582 408682 407593 405831 403212 400455 398544
61678 398544 397595 396849 395709 394279 392891 391601 390293 388908 387432 385923 384588 383629 383053 382923 383655 385613
61662 385613 388364 390849 392498 393792 395432 397295 398584 398837 398418 397996 397795 397567 397167 396992 397656 399242
61646 399242 401065 402428 403549 405458 408851 413256 417542 421128 424407 427972 431683 434769 436678 437436
$$ packed form
61752E47937L195J683m53k531l668l856m036m953o291p130o966o083n127m587
61738D97134m530m573m171l150j927j112r09r95q99m28K74R28J322J371J093O70
61722D80098M77P76J361J694J557J322J494K123K779K878K018L57j228j813j612
61707D94281j874l266m885n476n114m838m966m828m088l336l065k946k574k304
61693D40721k817m162n568o083n262l514j848j012q73r00j089j762k619k757j911
61678C98544r49p46j140j430j388j290j308j385j476j509j335r59n76j30P32J958
61662C85613K751K485J649J294J640J863J289K53m19m22k01k28m00j75O64J586
61646C99242J823J363J121J909L393M405M286L586L279L565L711L086J909P58
$$ plain form
61632 437436 437140 435522 432439 428486 424597 421023 417200 412733 408030 403766 400198 397378 395646 395314 395959
61617 395959 396527 396251 395278 394318 393839 393634 393064 391716 389760 387542 384945 381535 377372 373190 369442 365602
61601 365602 360874 355349 349956 345379 341560 338295 335796 334368 333731 332955 331162 328322 325282 322913 321249
61586 321249 319708 318062 316795 316344 316422 316425 316166 315848 315556 315138 314417 313243 311570 309775 308588 308346 308633
61569 308633 308998 309645 310887 312336 313366 314130 315349 317121 318746 319844 320930 322656 325016 327523 329723
61554 329723 331371 332499 333464 334570 335594 336024 335726 334873 333400 331291 329433 329209 330831 332876 334028
61539 334028 334637 335949 338379 341256 343816 345667 346611 346881 347447 349223 351838 353862 354401 353863 353016 351966
61523 351966 350447 348563 346690 344913 343084 341279 339734 338423 337099 335775 334750 334106 333596 333206 333448
$$ packed form
61632D37436k96j618l083l953l889l574l823m467m703m264l568k820j732l32O45
61617C95959N68k76r73r60m79k05n70j348j956k218k597l410m163m182l748l840
61601C65602m728n525n393m577l819l265k499j428o37p76j793k840l040k369j664
61586C21249j541j646j267m51P8Lk59l18k92m18p21j174j673j795j187k42K87
61569C08633L65O47J242J449J030P64J219J772J625J098J086J726K360K507K200
61554C29723J648J128R65J106J024M30k98q53j473k109j858k24J622K045J152
61539C34028O09J312K430K877K560J851R44K70N66J776K615K024N39n38q47j050
61523C51966j519j884j873j777j829j805j545j311j324j324j025o44n10l90K42
$$ plain form
61508 333448 334791 337001 339360 341379 343031 344475 345856 347254 348472 349012 348710 348283 348720 350096 351591
61493 351591 352741 353964 355567 356988 357616 357782 358214 358930 359486 360070 361428 363680 366013 367761 369135 370538
61477 370538 371718 371983 370892 368516 365401 362565 361137 361521 363000 364403 365069 365079 364797 364427 363869 362804
61461 362804 361031 358861 356976 355654 354381 352544 350437 349166 349444 350807 352175 353021 353641 354408 355186
61446 355186 355711 356243 357422 359497 362054 364563 366906 369347 372278 376034 380520 384928 388270 390509 392708
61431 392708 395751 399300 402390 404603 406087 406842 406757 406264 406192 406921 408179 409704 411550 413660 415721 417657
61415 417657 419758 422071 424041 425062 425144 424864 424774 424973 425058 424495 423209 421780 420848 420469 420396 420749 421865 423454
61397 423454 424527 424392 423394 422443 422080 422149 422183 421975 421857 422274 422941 422732 420863 417974 415501 414122 413414 412942
$$ packed form
61508C33448J343K210K359K019J652J444J381J398J218N40l02m27M37J376J495
61493C51591J150J223J603J421O28J66M32P16N56N84J358K252K333J748J374J403
61477C70538J180K65j091k376l115k836j428L84J479J403O66J0k82l70n58j065
61461C62804j773k170j885j322j273j837k107j271K78J363J368Q46O20P67P78
61446C55186N25N32J179K075K557K509K343K441K931L756M486M408L342K239K199
61431C92708L043L549L090K213J484P55q5m93p2P29J258J525J846K110K061J936
61415D17657K101K313J970J021Q2k80r0J99Q5n63j286j429r32l79p3L53J116J589
61397D23454J073j35r98r51l63O9L4k08j18M17O67k09j869k889k473j379p08m72
$$ plain form
61379 412942 412843 413259 413924 414618 415391 416091 416252 415819 415435 415650 416317 417056 417831 418728 419668 420711 422141 423835
61361 423835 425068 425442 425634 426646 428686 431371 434696 439154 444979 451896 459617 468034 476766 484922 491537
61346 491537 496174 499129 501200 503156 505230 507175 508835 510506 512617 515241 518095 520757 522701 523377
61332 523377 522648 521081 519560 518557 517895 517109 515876 514169 512175 510137 508340 507207 507186 508243 509691
61317 509691 510957 512411 514940 518722 523058 527563 532841 539670 548119 557978 569517 583099 598167
61304 598167 613223 626796 638158 647220 654163 659255 662726 664649 664958 663487 660064 654806 648371 641620
61290 641620 634906 627937 620353 612096 603221 593880 584729 576784 570475 565244 560439 556254 553375 552041
61276 552041 551884 552415 553209 553901 554515 555623 557691 560340 562615 563957 564637 565428 567221 570779 576428 583906
$$ packed form
61379D12942r9M16O65O94P73P00J61m33l84K15O67P39P75Q97R40J043J430J694
61361D23835J233L74J92J012K040K685L325M458N825O917P721Q417Q732Q156O615
61346D91537M637K955K071J956K074J945J660J671K111K624K854K662J944O76
61332E23377p29j567j521j003o62p86j233j707j994k038j797j133k1J057J448
61317E09691J266J454K529L782M336M505N278O829Q449R859J1539J3582J5068
61304E98167J5056J3573J1362R062O943N092L471J923L09j471l423n258o435o751
61290F41620o714o969p584q257q875r341r151p945o309n231m805m185k879j334
61276E52041j57N31P94O92O14J108K068K649K275J342O80P91J793L558N649P478
$$ plain form
61260 583906 592703 602353 612195 621076 627777 631712 633016 632165 629806 626798 623911 621385 618970 616369
61246 616369 613474 610327 607136 604321 602306 601210 600773 600508 599952 598975 597914 597202 596901 596867 597295 598629
61230 598629 600836 603314 605689 608216 611161 614351 617670 621459 626067 631520 637979 645827 654736 663350
61216 663350 670718 677533 685072 693252 700701 706543 711098 714785 717387 718779 719606 720732 722475 724807
61202 724807 727994 732672 739405 748393 759581 772922 788533 806449 826088 846033 864497 880027
61190 880027 891858 899960 904974 907853 909326 909785 909648 909298 908510 906475 902728 897574 891292 883581 874326
61175 874326 864322 854461 844702 834622 824565 815262 806486 797057 786242 774372 762006 749334
61163 749334 736565 724154 712291 700735 689504 679386 671488 666462 664185 664001 665353 668424 673998
$$ packed form
61260E83906Q797R650R842Q881O701L935J304q51k359l008k887k526k415k601
61246F16369k895l147l191k815k015j096m37k65n56r77j061p12l01l4M28J334
61230E98629K207K478K375K527K945L190L319L789M608N453O459P848Q909Q614
61216F63350P368O815P539Q180P449N842M555L687K602J392Q27J126J743K332
61202G24807L187M678O733Q988J1188J3341J5611J7916J9639J9945J8464J5530
61190H80027J1831Q102N014K879J473M59j37l50p88k035l747n154o282p711r255
61175H74326j0004r861r759j0080j0057r303q776r429j0815j1870j2366j2672
61163G49334j2769j2411j1863j1556j1231j0118p898n026k277j84J352L071N574
$$ plain form
61150 673998 682297 692176 701791 709778 715361 717816 716760 712903 707687 702112 696525 691419 687580 685321
61136 685321 684393 684883 687490 692615 699804 708348 717917 728376 739655 752124 766585 783450 802264
61123 802264 822351 843615 866477 891368 918457 947590 978294 1010110 1042969 1076894 1111352
61112 1111352 1145450 1178897 1212271 1246058 1279884 1312905 1344530 1374379 1401801 1425798 1445414
61101 1445414 1460110 1469936 1475353 1476730 1474061 1467410 1457453 1445146 1430904 1414476 1395629 1374588
61089 1374588 1351811 1327772 1302995 1278003 1253167 1228830 1205331 1182599 1160037 1137338 1115141
61078 1115141 1094263 1074585 1055436 1036828 1019366 1003051 987203 971752 957616 945473 934976
61067 934976 925461 916647 908274 899918 891666 884337 878518 873881 869863 866508 864209 863142 863351 864966
$$ packed form
61150F73998Q299R879R615P987N583K455j056l857n216n575n587n106l839k259
61136F85321r28M90K607N125P189Q544R569J0459J1279J2469J4461J6865J8814
61123H02264K0087K1264K2862K4891K7089K9133L0704L1816L2859L3925L4458
61112A111352L4098L3447L3374L3787L3826L3021L1625K9849K7422K3997J9616
61101A445414J4696R826N417J377k669o651r957j2307j4242j6428j8847k1041
61089A374588k2777k4039k4777k4992k4836k4337k3499k2732k2562k2699k2197
61078A115141k0878j9678j9149j8608j7462j6315j5848j5451j4136j2143j0497
61067I34976r515q814q373q356q252p329n819m637m018l355k299j067K09J615
$$ plain form
61053 864966 867937 871979 877088 883699 892029 901684 912190 923494 935711 948832 962884 978041 994378
61040 994378 1011933 1030974 1051641 1073377 1095432 1118050 1142355 1168928 1197349 1227346 1259429
61029 1259429 1293965 1330479 1368276 1406941 1445846 1484072 1521524 1559542 1600148 1645486 1698129
61018 1698129 1760584 1833609 1915797 2005375 2101743 2205453 2318626 2446407 2596634 2777322
61008 2777322 2996127 3263247 3592975 4001711 4508128 5139054 5934989 6950418 8253784
60999 8253784 9924307 12020692 14506495 17176530 19671326 21613726 22785945 23216187
60991 23216187 23126984 22818522 22580990 22645606 23123914 23932254 24777608 25266353 25087298 24143211
60981 24143211 22550801 20541455 18353319 16172174 14118723 12257172 10610676 9178398
$$ packed form
61053H64966K971M042N109O611Q330R655J0506J1304J2217J3121J4052J5157J6337
61040I94378J7555J9041K0667K1736K2055K2618K4305K6573K8421K9997L2083
61029A259429L4536L6514L7797L8665L8905L8226L7452L8018M0606M5338N2643
61018A698129O2455P3025Q2188Q9578R6368J03710J13173J27781J50227J80688
61008B777322K18805K67120L29728M08736N06417O30926P95935J015429J303366
60999H253784J670523K096385K485803K670035K494796J942400J172219M30242
60991B3216187q9203l08462k37532O4616M78308Q08340Q45354M88745j79055r44087
60981B4143211j592410k009346k188136k181145k053451j861551j646496j432278
$$ plain form
60973 9178398 7948450 6903533 6022862 5284690 4668771 4156562 3730346 3373474 3071428
60964 3071428 2812425 2587577 2390802 2217901 2065162 1929180 1807856 1700558 1606842 1525733
60954 1525733 1456429 1398501 1350567 1309507 1271842 1235540 1199998 1164911 1129973 1095362 1061769
60943 1061769 1030004 1000858 974826 951415 929058 906368 883265 860473 838337 816870 796571
60932 796571 778300 762214 747506 733312 719352 705622 692135 679291 667987 658867 651565 644982
60920 644982 638225 631134 624071 617482 611631 606525 601962 597731 593805 590275 587097 584051 581013 578212
60906 578212 576006 574444 573157 571754 570130 568361 566497 564592 562708 560671 557986 554303 549870 545217
60892 545217 540467 535287 529545 523669 518222 513432 509307 506001 503764 502534 501724 500441 497889 493683
$$ packed form
60973I178398j229948j044917q80671p38172o15919n12209m26216l56872l02046
60964C071428k59003k24848j96775j72901j52739j35982j21324j07298r3716q1109
60954A525733o9304n7928m7934m1060l7665l6302l5542l5087l4938l4611l3593
60943A061769l1765k9146k6032k3411k2357k2690k3103k2792k2136k1467k0299
60932G96571j8271j6086j4708j4194j3960j3730j3487j2844j1304r120p302o583
60920F44982o757p091p063o589n851n106m563m231l926l530l178l046l038k801
60906E78212k206j562j287j403j624j769j864j905j884k037k685l683m433m653
60892E45217m750n180n742n876n447m790m125l306k237j230q10j283k552m206
$$ plain form
60878 493683 487957 481309 474628 468799 464351 461268 459255 458238 458458 460003 462436 465089 467651 470321
60864 470321 473433 477138 481406 486220 491680 497855 504437 510571 515278 518157 519485 519687 519088 518299 518312
60849 518312 519677 521788 523386 523615 522312 519580 515675 511169 506607 501883 496392 489883 482722 475217
60835 475217 467250 458822 450519 443007 436287 429855 423544 417890 413558 410606 408370 405998 403004 399418
60821 399418 395608 392025 388994 386492 384135 381589 378948 376546 374430 372311 370018 367637 365167 362554
60807 362554 360230 359015 359088 359533 359435 359052 359375 360851 363214 366245 369859 373442 375977 377120 377634 378465
60791 378465 379762 380964 381518 381320 380728 380232 379909 379237 377738 375717 373955 372755 371809 370963 370452 370208 369593
60774 369593 368199 366488 365237 364696 364558 364464 364207 363720 363230 363253 364124 365631 367267 368685 369718 370264 370448
$$ packed form
60878D93683n726o648o681n829m448l083k013j017K20J545K433K653K562K670
60864D70321L112L705M268M814N460O175O582O134M707K879J328K02n99p89J3
60849E18312J365K111J598K29j303k732l905m506m562m724n491o509p161p505
60835D75217p967q428q303p512o720o432o311n654m332k952k236k372k994l586
60821C99418l810l583l031k502k357k546k641k402k116k119k293k381k470k613
60807C62554k324j215P3M45r8l83L23J476K363L031L614L583K535J143N14Q31
60791C78465J297J202N54j98n92m96l23o72j499k021j762j200r46q46n11k44o15
60774C69593j394j711j251n41j38r4k57m87m90K3Q71J507J636J418J033N46J84
$$ plain form
60757 370448 370720 371434 372351 372815 372455 371532 370584 369911 369497 369348 369776 371214 373726 376787 379622 381631 382460
60740 382460 381935 380249 378018 375771 373424 370596 367377 364296 361553 358793 355897 353525 352521 353040 354498
60725 354498 356119 357262 357555 357201 357077 358109 360394 363120 365349 366738 367496 367922 368123 368069 367706 367012 366046
60708 366046 365030 364239 363678 362947 361627 359802 357984 356498 355174 353634 351545 348639 345033 341830 340691
60693 340691 342146 344675 346181 346141 345619 345379 345068 344400 344082 344872 346374 347583 348328 349502 351921 355553
60677 355553 359897 364625 369626 374727 379664 384219 388154 391010 392183 391391 389040 385961 382769 379644
60663 379644 376723 374309 372494 370857 368983 367128 366029 366049 366839 367830 368755 369696 370941 372828 375471 378609
60647 378609 381846 384964 387781 389857 390668 389999 387919 384566 380365 376239 372986 370495 368085 365708 364190
$$ packed form
60757C70448K72P14R17M64l60r23r48o73m14j49M28J438K512L061K835K009Q29
60740C82460n25j686k231k247k347k828l219l081k743k760k896k372j004N19J458
60725C54498J621J143K93l54j24J032K285K726K229J389P58M26K01n4l63o94r66
60708C66046j016p91n61p31j320j825j818j486j324j540k089k906l606l203j139
60693C40691J455K529J506m0n22k40l11o68l18P90J502J209P45J174K419L632
60677C55553M344M728N001N101M937M555L935K856J173p92k351l079l192l125
60663C79644k921k414j815j637j874j855j099K0P90R91R25R41J245J887K643L138
60647C78609L237L118K817K076Q11o69k080l353m201m126l253k491k410k377j518
$$ plain form
60632 364190 364150 365235 366674 368103 369573 371148 372871 374838 376934 378667 379509 379343 378492 377487 376759 376310
60616 376310 375636 374359 372946 372411 373139 374424 375324 375586 375492 375239 374843 374454 374378 374817 375702 376699 377299 377130
60598 377130 376303 375343 374741 374762 375599 377345 379726 382121 383966 385032 385433 385660 386419 387945 389529 390228 390023
60581 390023 389713 389736 389762 389627 389845 390855 392394 394054 395945 398392 401455 405179 409931 416043 423504 432398
60565 432398 443172 455878 469389 481954 492442 500718 506974 511086 512550 510865 506183 499744 493325
60552 493325 487981 483615 479938 477294 476123 476107 476472 476957 477994 480129 483728 489044 496120 504718 514734
60537 514734 526554 540700 557343 576472 598184 622201 647235 671239 692259 708801 719744
60526 719744 724600 723898 718850 710586 699966 687913 675401 663050 651121 639916 629839 621069 613518
$$ packed form
60632C64190m0J085J439J429J470J575J723J967K096J733Q42j66q51j005p28m49
60616C76310o74j277j413n35P28J285R00K62r4k53l96l89p6M39Q85R97O00j69
60598C77130q27r60o02K1Q37J746K381K395J845J066M01K27P59J526J584O99k05
60581C90023l10K3K6j35K18J010J539J660J891K447L063L724M752O112P461Q894
60565D32398J0774J2706J3511J2565J0488Q276O256M112J464j685m682o439o419
60552D93325n344m366l677k644j171j6L65M85J037K135L599N316P076Q598J0016
60537E14734J1820J4146J6643J9129K1712K4017K5034K4004K1020J6542J0943
60526G19744M856p02n048q264j0620j2053j2512j2351j1929j1205j0077q770p551
$$ plain form
60513 613518 607153 602019 597924 594440 591365 589006 587899 588361 590416 594168 600312 610126 624699 644087
60499 644087 667572 694797 726276 762607 803615 848419 895826 944277 991909 1037275 1079809
60488 1079809 1119274 1155173 1187097 1215044 1238608 1256169 1265683 1266077 1257053 1237820 1207193 1165388
60476 1165388 1114904 1059199 1001041 942430 885400 832040 783765 740965 703390 670588 642002
60465 642002 616928 594617 574561 556664 541008 527385 515222 504104 494117 485458 477883 470855
60453 470855 464105 457819 452351 447944 444553 441680 438605 435138 431973 429980 429250 429121 428912 428271 427043
60438 427043 425293 423375 421572 419717 417549 415259 413257 411575 410030 408852 408520 409007 409725 410295 410893
60423 410893 411815 413105 414604 415858 416077 414833 412905 411813 412310 413878 415832 418250 421490 425360 429224
$$ packed form
60513F13518o365n134m095l484l075k359j107M62K055L752O144R814J4573J9388
60499F44087K3485K7225L1479L6331M1008M4804M7407M8451M7632M5366M2534
60488A079809L9465L5899L1924K7947K3564J7561R514L94r024j9233l0627m1805
60476A165388n0484n5705n8158n8611n7030n3360m8275m2800l7575l2802k8586
60465F42002k5074k2311k0056j7897j5656j3623j2163j1118r987q659p575p028
60453D70855o750o286n468m407l391k873l075l467l165j993p30j29k09o41j228
60438D27043j750j918j803j855k168k290k002j682j545j178l32M87P18N70N98
60423D10893R22J290J499J254K19j244j928j092M97J568J954K418L240L870L864
$$ plain form
60408 429224 432557 435021 436407 436907 437176 437751 438584 439432 440430 441956 444098 446594 449160 451660 454106 456684
60392 456684 459703 463250 466993 470463 473493 476300 479218 482416 485776 489010 491977 494794 497501 499880
60378 499880 501962 504522 508459 513595 518657 522645 525743 528667 531639 534387 536736 538725 540480 542323
60364 542323 544756 547885 551142 553986 556708 560136 564843 571064 579126 589301 601284 614429 628484
60351 628484 643475 658742 672745 684108 692409 697635 699319 696741 689813 679438 667139 654584
60339 654584 643120 633217 624316 615600 606924 598747 591314 584437 578127 572814 568630 564880 560640 555613
60325 555613 550052 544132 537914 531848 526759 523241 521456 521517 523721 528334 535538 545647 558855 574510
60311 574510 591019 606786 620988 633260 643075 649935 654053 656467 658497 661190 664968 669358 673093
$$ packed form
60408D29224L333K464J386N00K69N75Q33Q48R98J526K142K496K566K500K446K578
60392D56684L019L547L743L470L030K807K918L198L360L234K967K817K707K379
60378D99880K082K560L937N136N062L988L098K924K972K748K349J989J755J843
60364E42323K433L129L257K844K722L428M707O221Q062J0175J1983J3145J4055
60351F28484J4991J5267J4003J1363Q301N226J684k578o928j0375j2299j2555
60339F54584j1464r903q901q716q676q177p433o877o310n313m184l750m240n027
60325E55613n561n920o218o066n089l518j785O1K204M613P204J0109J3208J5655
60311E74510J6509J5767J4202J2272R815O860M118K414K030K693L778M390L735
$$ plain form
60298 673093 674834 673889 670191 663784 654582 642606 628368 613153 598869 587158 578260 571034 564357
60285 564357 558213 553044 548586 544059 539312 534987 531436 528172 524527 520290 515477 510051 504250 498766
60271 498766 494169 490360 486906 483656 480724 478075 475575 473329 471581 470212 468694 466757 464895 463981
60257 463981 464456 466060 468291 470848 473516 475985 478109 480235 482866 485990 489093 491831 494228 496073
60243 496073 496707 495769 493800 491722 490035 488873 488412 488609 488810 488315 487295 486578 486534 486801 487173 488118 490130
60226 490130 493016 496148 499160 502155 505438 509247 513590 518275 523265 528977 535932 544087 552834 561694
60212 561694 570688 579956 589400 598874 608386 617844 626901 635313 643272 651140 658933 666290 672871 678624
60198 678624 683692 688133 691689 693843 694252 693188 691365 689198 686323 681999 675961 668881 661981 656180
$$ packed form
60298F73093J741r45l698o407r202j1976j4238j5215j4284j1711q898p226o677
60285E64357o144n169m458m527m747m325l551l264l645m237m813n426n801n484
60271D98766m597l809l454l250k932k649k500k246j748j369j518j937j862r14
60257D63981M75J604K231K557K668K469K124K126K631L124L103K738K397J845
60243D96073O34r38j969k078j687j162m61J97K01m95j020p17m4K67L72R45K012
60226D90130K886L132L012K995L283L809M343M685M990N712O955Q155Q747Q860
60212E61694Q994R268R444R474R512R458R057Q412P959P868P793P357O581N753
60198F78624N068M441L556K154M09j064j823k167k875m324o038p080o900n801
$$ plain form
60184 656180 651483 647131 642326 636842 631036 625511 620849 617373 614865 612533 609549 605723 601596 597891
60170 597891 594905 592335 589622 586521 583398 580818 578866 577139 575390 573807 572490 571154 569682 568619
60156 568619 568602 569539 570717 571563 571906 571777 571446 571489 572302 573648 575085 576664 578685 580973 583049 584971 587379
60139 587379 590659 594675 599373 604998 611505 618343 625132 632096 639472 646844 653343 658332 661727 663900
60125 663900 665473 667002 668752 670833 673397 676343 679027 680825 682077 683873 686681 689674 691733 692690
60111 692690 693220 693857 694552 695032 695120 694674 693566 691874 689962 688143 686209 683458 679410 674511 669883 666306
60095 666306 663726 661767 660233 658851 657098 654833 652751 651573 651058 650375 649231 647914 646374 644071 640806
60080 640806 637033 633239 629565 626085 622808 619251 614625 608711 602117 595516 589103 582914 577140 571847
$$ packed form
60184F56180m697m352m805n484n806n525m662l476k508k332k984l826m127l705
60170E97891k986k570k713l101l123k580j952j727j749j583j317j336j472j063
60156E68619j7R37J178Q46L43j29l31M3Q13J346J437J579K021K288K076J922K408
60139E87379L280M016M698N625O507O838O789O964P376P372O499M989L395K173
60125F63900J573J529J750K081K564K946K684J798J252J796K808K993K059R57
60111F92690N30O37O95M80Q8m46j108j692j912j819j934k751m048m899m628l577
60095F66306k580j959j534j382j753k265k082j178n15o83j144j317j540k303l265
60080F40806l773l794l674l480l277l557m626n914o594o601o413o189n774n293
$$ plain form
60066 571847 566811 561845 557012 552407 548066 544142 540802 537913 535183 532596 530339 528415 526851 526132
60052 526132 526777 528507 530483 532484 535167 539053 543879 549128 554617 560369 566392 572692 579004 584604
60038 584604 588963 592505 595927 598873 600245 599904 598995 598286 597227 595066 591860 587830 582628 576009 568449
60023 568449 560383 551470 541324 530445 519751 509718 500579 492807 486672 481720 477389 473824 471448
60010 471448 470088 469087 468017 466723 464971 462653 460171 458163 456914 456284 456006 455898 456070 456976 458792
59995 458792 460741 461756 461895 462279 463399 464518 465245 466592 469594 473731 477638 480773 483465 485898 487903
59980 487903 489366 490078 489643 488215 486703 485433 483354 479561 475001 471444 469222 467247 464988 463063 461940
59965 461940 461387 461478 462939 466011 469807 473243 476030 478442 480657 482619 484112 484808 484659 484275 484502 485510
$$ packed form
60066E71847n036m966m833m605m341l924l340k889k730k587k257j924j564p19
60052E26132O45J730J976K001K683L886M826N249N489N752O023O300O312N600
60038E84604M359L542L422K946J372l41r09p09j059k161l206m030n202o619p560
60023E68449q066q913j0146j0879j0694j0033r139p772o135m952m331l565k376
60010D71448j360j001j070j294j752k318k482k008j249o30k78j08J72R06J816
59995D58792J949J015J39L84J120J119P27J347L002M137L907L135K692K433K005
59980D87903J463P12m35j428j512j270k079l793m560l557k222j975k259j925j123
59965D61940n53R1J461L072L796L436K787K412K215J962J493O96j49l84K27J008
$$ plain form
59949 485510 486711 487566 488110 488690 489535 490544 491146 490550 488538 485920 483791 482451 481438 480386 479450 479085
59933 479085 479818 482029 485503 489497 493651 498435 504116 509712 513699 515516 515658 514599 512410 509339 505952
59918 505952 502683 499780 497553 496139 495294 495083 496401 499964 505021 509912 513734 516624 518656 519712 520456
59903 520456 522162 525084 527910 529307 529311 528813 528352 527923 527483 527136 527075 527576 528841 530774 533182 536082 539410
59886 539410 542642 545316 547803 550908 554837 559318 564600 571250 578819 585779 591272 596062 601141 606107
59872 606107 609613 610946 610533 609180 607453 605631 603733 601554 598934 595987 592990 590157 587621 585476
59858 585476 583761 582597 582343 583413 585884 589444 593785 598942 605363 613797 624762 637744 651008 662541
59844 662541 671179 676725 679495 680307 680607 681863 684677 688699 693155 696986 698860 697828 694037 688387 681637
$$ packed form
59949D85510J201Q55N44N80Q45J009O02n96k012k618k129j340j013j052r36l65
59933D79085P33K211L474L994M154M784N681N596L987J817J42j059k189l071l387
59918E05952l269k903k227j414q45k11J318L563N057M891L822K890K032J056P44
59903E20456J706K922K826J397Mm98m61m29m40l47o1N01J265J933K408K900L328
59886E39410L232K674K487L105L929M481N282O650P569O960N493M790N079M966
59872F06107L506J333m13j353j727j822j898k179k620k947k997k833k536k145
59858E85476j715j164k54J070K471L560M341N157O421Q434J0965J2982J3264J1533
59844F62541Q638N546K770Q12L00J256K814M022M456L831J874j032l791n650o750
$$ plain form
59829 681637 674278 666963 660277 654150 648061 641743 635188 628226 620808 613537 607188 601823 597052 592952
59815 592952 589901 587600 585155 582142 578863 575600 572409 569543 567246 565259 563427 562566 563581 565745
59801 565745 567153 567072 566598 566700 566967 566832 566739 567228 567853 567912 567551 567277 566962 566116 564686 562868 560509 557397
59783 557397 553911 550801 548426 546492 544353 541435 537745 534116 531592 530499 530450 531050 531893 532146 531249 530186
59767 530186 530872 533867 537737 541161 544550 548869 553916 558772 563219 567726 572527 577611 583261 589828
59753 589828 597257 605385 614245 623507 632168 639517 646062 652843 660186 667663 674759 680941 685644 689027
59739 689027 692361 696801 701990 706560 709697 711532 712336 712251 711703 711241 710900 710371 709729 709343 709111 708452 707195
59722 707195 705908 705166 704817 704149 702537 699955 697057 694603 692683 690728 688516 686753 686226 686738 687469 688190
$$ packed form
59829F81637p359p315o686o127o089o318o555o962p418p271o349n365m771m100
59815E92952l051k301k445l013l279l263l191k866k297j987j832q61J015K164
59801E65745J408q1m74J02K67j35r3M89O25N9l61k74l15q46j430j818k359l112
59783E57397l486l110k375j934k139k918l690l629k524j093m9O00Q43K53q97j063
59767E30186O86K995L870L424L389M319N047M856M447M507M801N084N650O567
59753E89828P429Q128Q860R262Q661P349O545O781P343P477P096O182M703L383
59739F89027L334M440N189M570L137J835Q04q5n48m62l41n29o42l86k32o59j257
59722G07195j287p42l49o68j612k582k898k454j920j955k212j763n27N12P31P21
$$ plain form
59706 688190 689511 691893 695005 698223 701456 705263 710219 716216 722469 728418 734610 742173 751234 760234
59692 760234 767145 771059 772369 771935 770609 769214 768239 767471 766267 764206 761268 757531 753064 748024 742622
59677 742622 736942 730897 724255 716677 708017 698622 689123 679882 671012 662925 656303 651289 647219 643407
59663 643407 639817 636804 634746 634202 635808 639487 644163 648709 652869 656936 661003 665029 669214 673753
59649 673753 678367 682446 685424 686730 685746 682217 676520 669254 660823 651611 642184 633083 624683 617368
59635 617368 611353 606245 601377 596742 592860 589512 585599 580737 576001 572283 568784 564114 558247 552278
59621 552278 546759 541391 536156 531570 527738 524080 520166 516172 512393 508943 506103 504450 504375 505693 507719
59606 507719 509637 510966 511882 512901 514091 514997 515481 516038 516970 517856 518358 518959 520282 522228 524377 526705
$$ packed form
59706F88190J321K382L112L218L233L807M956N997O253N949O192P563R061R000
59692G60234O911L914J310m34j326j395r75p68j204k061k938l737m467n040n402
59677G42622n680o045o642p578q660r395r499r241q870q087o622n014m070l812
59663F43407l590l013k058n44J606L679M676M546M160M067M067M026M185M539
59649F73753M614M079K978J306r84l529n697p266q431r212r427r101q400p315
59635F17368o015n108m868m635l882l348l913m862m736l718l499m670n867n969
59621E52278n519n368n235m586l832l658l914l994l779l450k840j653p5J318K026
59606E07719J918J329R16J019J190R06M84N57R32Q86N02O01J323J946K149K328
$$ plain form
59590 526705 529197 531250 532306 532666 532887 532750 531682 529873 528062 526467 524822 523228 521982 520671 518497
59575 518497 515551 512857 511011 509620 508275 507291 507125 507638 508276 508614 508563 508364 508424 508893 509490 509981 510544 511247
59557 511247 511545 510959 509979 509609 510149 511099 512092 513168 514220 514957 515478 516284 517715 519971 523577 529175 537040
59540 537040 547602 562352 582991 608997 636448 659667 674088 678162 673629 664331 654021 644631
59528 644631 636501 629847 625326 623241 623072 624075 625841 628055 630227 631925 632867 632593 630444 626067 619713
59513 619713 612028 603898 596342 589926 584130 577760 570254 562286 554987 548904 543800 539122 534544 530301
59499 530301 527005 524959 523698 522489 521183 520275 520234 521016 522108 522802 522697 522213 522311 523393 524902 526403
59483 526403 528444 531747 536124 541033 546753 553872 561813 569039 574858 580027 585310 590378 594491 597528
$$ packed form
59590E26705K492K053J056L60K21j37j068j809j811j595j645j594j246j311k174
59575E18497k946k694j846j391j345r84j66N13O38L38n1j99O0M69N97M91N63P03
59557E11247K98n86r80l70N40R50R93J076J052P37N21Q06J431K256L606N598P865
59540E37040J0562J4750K0639K6006K7451K3219J4421M074m533r298j0310r390
59528F44631q130o654m521k085j69J003J766K214K172J698R42k74k149m377o354
59513F19713p685q130p556o416n796o370p506p968p299o083n104m678m578m243
59499E30301l296k046j261j209j306r08m1P82J092O94j05m84R8J082J509J501
59483E26403K041L303M377M909N720P119P941P226N819N169N283N068M113L037
$$ plain form
59469 597528 599835 601567 602640 603094 603276 603766 605025 606829 608314 609061 609901 612059 615755 620342 625598
59454 625598 631933 639289 646767 653599 659793 665700 671623 677913 684587 690616 694291 694654 692068 687328
59440 687328 681055 674171 668055 663572 660408 657765 655206 652528 649429 645890 642515 640039 638746 638696 640180
59425 640180 643541 648731 655443 663568 673338 685195 699668 717162 737641 760718 786414 815798
59413 815798 850269 889356 928749 961073 979843 983450 975310 960439 942602 924612 909709 901312
59401 901312 901780 911784 929681 950393 966081 970141 961110 942114 917117 888854 859549 831387
59389 831387 805714 783011 763927 749106 737836 728297 719600 712373 707008 702686 698731 695592 693680
59376 693680 692397 691227 690801 691850 693811 695419 696161 696385 696490 696802 697777 699624 702016 704756 708328 713240
$$ packed form
59469E97528K307J732J073M54J82M90J259J804J485P47Q40K158L696M587N256
59454F25598O335P356P478O832O194N907N923O290O674O029L675L63k586m740
59440F87328o273o884o116m483l164k643k559k678l099l539l375k476j293n0J484
59425F40180L361N190O712Q125R770J1857J4473J7494K0479K3077K5696K9384
59413H15798L4471L9087L9393L2324J8770L607q140j4871j7837j7990j4903q397
59401I01312M68J0004J7897K0712J5688M060r031j8996k4997k8263k9305k8162
59389H31387k5673k2703j9084j4821j1270r539q697p227n365m322l955l139j912
59376F93680j283j170m26J049J961J608P42K24J05L12R75J847K392K740L572M912
$$ plain form
59360 713240 719193 725559 732380 740344 749868 760602 771780 782910 794344 807168 822130 838617
59348 838617 855189 871145 886940 902971 918733 933490 947051 959402 970126 978541 983989 985762
59336 985762 983384 977291 968587 957803 944490 928425 910525 892074 873602 855078 836701 818959
59324 818959 802128 786170 770934 756296 742410 729856 719097 709696 700641 691505 682692 674448
59312 674448 666437 658508 651107 644612 638981 634421 631670 631166 632619 635910 641900 651902 666635 685635
59298 685635 706807 726279 739655 744423 741094 732042 719750 706145 692461 679109 666176 654388
59286 654388 644957 638325 633895 631232 630542 631654 633665 636265 640443 647117 655837 665551 675923 687192
59272 687192 699483 712986 728106 744608 761211 776726 791113 804806 817676 829272 839432
$$ packed form
59360G13240N953O366O821P964R524J0734J1178J1130J1434J2824J4962J6487
59348H38617J6572J5956J5795J6031J5762J4757J3561J2351J0724Q415N448J773
59336I85762k378o093q704j0784j3313j6065j7900j8451j8472j8524j8377j7742
59324H18959j6831j5958j5236j4638j3886j2554j0759r401r055r136q813q244
59312F74448q011p929p401o495n631m560k751n04J453L291N990J0002J4733J9000
59298F85635K1172J9472J3376M768l329r052j2292j3605j3684j3352j2933j1788
59286F54388r431o632m430k663o90J112K011K600M178O674Q720R714J0372J1269
59272F87192J2291J3503J5120J6502J6603J5515J4387J3693J2870J1596J0160
$$ plain form
59261 839432 847893 853942 857130 857835 856528 853201 848180 842674 837623 832633 826954 820895 815359 810493
59247 810493 805755 800927 796188 791546 787047 783214 780415 778098 775394 772193 768940 765790 762716 760088
59233 760088 758284 756876 754893 751707 747195 741411 734685 727662 720644 713233 705090 696569 688094 679555
59219 679555 670990 663238 657062 652116 647594 643435 640089 637573 635601 634224 633486 632881 632054 631594 632219
59204 632219 633508 634431 634854 635542 636879 638517 640192 641960 643640 644824 645491 645966 646330 646385 646061 645344 644069
59187 644069 642403 641200 641232 642305 643694 645053 646277 646860 646258 644658 642737 640902 639359 638478 638333 638256
59171 638256 637653 636936 636914 637602 638488 639657 641745 644899 648560 652124 655151 657136 657748 657106 655248 651750
59155 651750 646487 640285 634055 627750 621040 614478 608962 604391 599892 595106 590279 585359 580059 574643
$$ packed form
59261H39432Q461O049L188P05j307l327n021n506n051m990n679o059n536m866
59247H10493m738m828m739m642m499l833k799k317k704l201l253l150l074k628
59233G60088j804j408j983l186m512n784o726p023p018p411q143q521q475q539
59219F79555q565p752o176m946m522m159l346k516j972j377p38o05q27m60O25
59204F32219J289R23M23O88J337J638J675J768J680J184O67M75L64N5l24p17j275
59187F44069j666j203L2J073J389J359J224N83o02j600j921j835j543q81j45p7
59171F38256o03p17k2O88Q86J169K088L154L661L564L027J985O12o42j858l498
59155F51750n263o202o230o305o710o562n516m571m499m786m827m920n300n416
$$ plain form
59141 574643 569609 564683 559073 552643 546013 539620 533593 528387 524577 522068 520341 519408 519658 520946 522712
59126 522712 524912 527910 531591 535516 539811 544997 550981 557186 563654 571106 579905 589845 600854 612970
59112 612970 625622 637891 649551 660981 672050 682006 690587 698325 705573 711988 717078 720558 722118
59099 722118 721613 719546 716703 713263 708950 704004 699246 695158 691627 688633 686530 685582 685710 686570 687372
59084 687372 686927 684579 680869 676669 672025 666541 660401 654073 647435 640248 633190 627279 622520 618136
59070 618136 613951 610407 607444 604491 601459 598539 595195 590638 585351 580864 577847 575514 573043 570473
59056 570473 568066 565873 564158 563225 562684 561809 560723 560251 560569 561025 561342 561876 562529 562517 561501 560033 558701
59039 558701 557648 556977 556758 556604 556114 555614 555575 555557 554889 554132 554603 556634 559698 564067 570777 579843 590094
$$ packed form
59141E74643n034m926n610o430o630o393o027n206l810k509j727r33K50J288J766
59126E22712K200K998L681L925M295N186N984O205O468P452Q799R940J1009J2116
59112F12970J2652J2269J1660J1430J1069R956Q581P738P248O415N090L480J560
59099G22118n05k067k843l440m313m946m758m088l531k994k103r48J28Q60Q02
59084F87372m45k348l710m200m644n484o140o328o638p187p058n911m759m384
59070F18136m185l544k963k953l032k920l344m557n287m487l017k333k471k570
59056E70473k407k193j715r33n41q75j086m72L18M56L17N34O53j2j016j468j332
59039E58701j053o71k19j54m90n00l9j8o68p57M71K031L064M369O710R066J0251
$$ plain form
59022 590094 600955 612904 625931 639073 651712 663766 674298 681645 685485 687169 687503 685835 681990
59009 681990 677336 673008 668600 663684 659202 656242 654648 653959 654621 657195 661338 666496 672596 679071 684305
58994 684305 687192 688481 689518 690506 690939 690905 690803 690466 689634 688741 688252 687768 686708 685413 684694 684813 685718
58977 685718 687902 692150 698696 707183 717105 727836 738727 749677 761139 773193 785218 796819
58965 796819 808260 819549 829997 839322 848287 857453 866014 872649 876852 878647 877618 873083 864847
58952 864847 853238 838859 822816 806536 790639 774474 757359 739802 723092 708249 695849
58941 695849 686151 678815 673045 668432 665057 662525 659924 657219 655603 655681 656287 655979 654874 654016 653751 653724
58925 653724 653870 654233 654238 653214 651440 649842 648860 648239 647625 646707 645145 643086 641491 641299 642489 644426 646834
$$ packed form
59022E90094J0861J1949J3027J3142J2639J2054J0532P347L840J684L34j668l845
59009F81990m654m328m408m916m482k960j594o89O62K574M143N158O100O475N234
58994F84305K887J289J037R88M33l4j02l37q32q93m89m84j060j295p19J19R05
58977F85718K184M248O546Q487R922J0731J0891J0950J1462J2054J2025J1601
58965G96819J1441J1289J0448R325Q965R166Q561O635M203J795j029m535q236
58952H64847j1609j4379j6043j6280j5897j6165j7115j7557j6710j4843j2400
58941F95849r698p336n770m613l375k532k601k705j616P8O06l08j105q58k65k7
58925F53724J46L63Nj024j774j598r82o21o14r18j562k059j595j92J190J937K408
$$ plain form
58908 646834 649899 653784 658613 664705 672392 681766 692840 705536 719288 733099 746302 758833 770600
58895 770600 781229 790706 799717 809152 819843 832837 848932 867597 887204 906658 925966 944826
58883 944826 961749 975289 985446 993189 999225 1003633 1006075 1005880 1002575 996645 989119 980319 970000
58870 970000 958884 948797 940763 934075 927783 921966 916930 912317 907720 903139 898124 891498 882688 872372
58856 872372 861216 849015 835717 822109 808751 795423 782336 770689 761110 752648 744157 735484
58844 735484 726576 716826 706284 696149 686928 677515 667263 657541 649849 643733 638063 633037 629243
58831 629243 625972 622317 618938 616835 615286 612988 610611 610123 611956 614708 617427 620475 624238 628603
58817 628603 633642 639371 644939 649327 652749 656107 659305 661388 662110 662050 661351 659621 657005 654154 651226
$$ packed form
58908F46834L065L885M829O092P687R374J1074J2696J3752J3811J3203J2531J1767
58895G70600J0629R477R011R435J0691J2994J6095J8665J9607J9454J9308J8860
58883I44826J6923J3540J0157P743O036M408K442j95l305n930p526q800j0319
58870I70000j1116j0087q034o688o292n817n036m613m597m581n015o626q810j0316
58856H72372j1156j2201j3298j3608j3358j3328j3087j1647r579q462q491q673
58844G35484q908r750j0542j0135r221r413j0252r722p692o116n670n026l794
58831F29243l271l655l379k103j549k298k377m88J833K752K719L048L763M365
58817F28603N039N729N568M388L422L358L198K083P22o0o99j730k616k851k928
$$ plain form
58802 651226 647911 644215 640276 635762 630471 625081 620244 615389 609593 603213 597403 592495 588096 584346
58788 584346 581784 580244 579196 578918 580136 582825 586447 590987 596594 602723 608940 616040 624947 634884
58774 634884 643966 651115 656000 657743 655549 650394 644302 637978 630724 622492 614243 606233 597721 588694
58760 588694 580272 573099 566761 561125 556820 553979 551821 549928 548813 548799 549428 550329 551684 553548 555620
58745 555620 557969 561056 564838 568734 572651 577150 582389 587711 592468 596625 600563 604967 610755 618328
58731 618328 626964 635625 644027 652189 659400 664747 668443 671571 674704 677694 680541 683541 686893 691136
58717 691136 697481 706520 716998 727022 736069 744625 752402 758473 762808 766055 767927 767274 763737 757872
58703 757872 749745 738891 725688 711270 695926 678954 660269 640841 621448 602421 584777 570103
$$ packed form
58802F51226l315l696l939m514n291n390m837m855n796o380n810m908m399l750
58788E84346k562j540j048k78J218K689L622M540N607O129O217P100Q907R937
58774F34884R082P149M885J743k194n155o092o324p254q232q249q010q512r027
58760E88694q422p173o338n636m305k841k158j893j115j4O29R01J355J864K072
58745E55620K349L087L782L896L917M499N239N322M757M157L938M404N788P573
58731F18328Q636Q661Q402Q162P211N347L696L128L133K990K847L000L352M243
58717F91136O345R039J0478J0024R047Q556P777O071M335L247J872o53l537n865
58703G57872q127j0854j3203j4418j5344j6972j8685j9428j9393j9027j7644j4674
$$ plain form
58691 570103 558856 549881 542018 535117 529211 523716 517858 511241 503906 496554 490503 486556 484065 481918
58677 481918 480002 478708 477559 475775 473901 473445 475004 478006 482140 487713 494743 503053 513184 525916
58663 525916 540894 556768 572324 586258 596436 601083 600598 596738 590341 581400 571039 561423 553539
58650 553539 546615 539782 532839 525552 517895 510963 505992 502457 498772 494870 492344 491995 492989 494526 496595
58635 496595 498881 500639 501884 503171 504122 503848 502809 502434 502756 502303 500576 498732 497520 496346 494797
58620 494797 493410 492579 492318 493285 496277 500542 504396 507771 512235 518197 524053 528479 531690 534104 535719
58605 535719 537246 539884 543404 546303 548212 550203 552369 553265 552310 550584 548649 545772 542085 539294 538355
58590 538355 538477 539322 542087 547389 554121 561533 570473 581413 593097 604303 615279 626321 636663
$$ packed form
58691E70103j1247q975p863o901n906n495n858o617p335p352o051l947k491k147
58677D81918j916j294j149j784j874m56J559L002M134N573P030Q310J0131J2732
58663E25916J4978J5874J5556J3934J0178M647m85l860o397q941j0361r616p884
58650E53539o924o833o943p287p657o932m971l535l685l902k526l49R94J537K069
58635D96595K286J758J245J287R51k74j039l75L22m53j727j844j212j174j549
58620D94797j387q31k61R67K992M265L854L375M464N962N856M426L211K414J615
58605E35719J527K638L520K899J909J991K166Q96r55j726j935k877l687k791r39
58590E38355J22Q45K765N302O732P412Q940J0940J1684J1206J0976J1042J0342
$$ plain form
58577 636663 645870 654605 662964 669769 674696 679446 685623 693029 701174 710886 723277 738533 756808
58564 756808 778864 804740 833221 863486 895754 929373 961850 990774 1015203 1034415 1047091
58553 1047091 1052940 1053566 1050667 1044814 1036764 1028266 1020522 1013444 1007183 1002549 998888 993456 984082 970821
58539 970821 954136 933523 909222 883363 857921 833116 808965 786558 766545 748145 730997
58528 730997 716245 704474 694377 684876 676746 670734 665844 661032 656874 653993 651474 648399 645368
58515 645368 643008 640487 637024 633396 630535 628126 625878 624513 624138 623348 621395 619536 618816 618259 616786
58500 616786 615158 614406 614026 613308 612817 613023 613179 613056 613998 616731 620000 622977 627015 633270 640661 648131
58484 648131 656902 668341 681448 694714 708800 725157 743576 763213 784332 806635 827291 842978
$$ packed form
58577F36663R207Q735Q359O805M927M750O177P406Q145R712J2391J5256J8275
58564G56808K2056K5876K8481L0265L2268L3619L2477K8924K4429J9212J2676
58553A047091N849O26k899n853q050q498p744p078o261m634l661n432r374j3261
58539I70821j6685k0613k4301k5859k5442k4805k4151k2407k0013j8400j7148
58528G30997j4752j1771j0097r501q130o012m890m812m158k881k519l075l031
58515F45368k360k521l463l628k861k409k248j365l75p90j953j859p20n57j473
58500F16786j628p52l80p18m91K06J56j23R42K733L269K977M038O255P391P470
58484F48131Q771J1439J3107J3266J4086J6357J8419J9637K1119K2303K0656J5687
$$ plain form
58472 842978 852747 857013 855430 848074 837281 825768 813951 801219 788591 777877 769325 762347 757617
58459 757617 756386 758603 763570 771494 782668 796190 811078 827272 843922 858194 867657 872470 873535
58446 873535 870216 861846 849924 836675 822844 808730 795691 784626 774609 765041 757421 752931
58434 752931 750131 747314 745328 745746 748073 751175 755689 762499 770583 778897 788579 800584 812924 822960
58420 822960 830736 837211 841017 840102 835185 828559 820751 811212 800926 791342 781982 771889 762198 754459
58406 754459 747810 740666 733781 728802 725259 721944 719799 720374 722759 725093 727682 731641 735924 738891
58392 738891 741303 744607 747795 749357 750747 754301 759039 762187 763686 765567 767958 769378 770027 771246
58378 771246 772630 773078 773698 776312 780217 783837 788203 795168 803532 810811 817659 826560 837292 847776
$$ packed form
58472H42978R769M266j583p356j0793j1513j1817j2732j2628j0714q552o978m730
58459G57617j231K217M967P924J1174J3522J4888J6194J6650J4272R463M813J065
58446H73535l319q370j1922j3249j3831j4114j3039j1065j0017r568p620m490
58434G52931k800k817j986M18K327L102M514O810Q084Q314R682J2005J2340J0036
58420H22960P776O475L806r15m917o626p808r539j0286r584r360j0093r691p739
58406G54459o649p144o885m979l543l315k145N75K385K334K589L959M283K967
58392G38891K412L304L188J562J390L554M738L148J499J881K391J420O49J219
58378G71246J384M48O20K614L905L620M366O965Q364P279O848Q901J0732J0484
$$ plain form
58364 847776 858434 871406 886206 900285 913415 927473 942354 955949 967725 978585 987803 993793
58352 993793 997258 999964 1001283 999726 996869 995784 996472 996886 997404 1000107 1004645 1009245 1014938 1024314 1036806
58337 1036806 1049707 1063147 1079531 1098672 1117987 1136965 1156860 1176560 1193343 1207235 1220166
58326 1220166 1231427 1238539 1242002 1244591 1246668 1246784 1246035 1246929 1248748 1249060 1248949 1251630 1256739 1261405 1266100
58311 1266100 1273822 1284180 1294024 1303390 1314992 1328359 1340464 1351806 1365790 1382248 1397677 1411802
58299 1411802 1427767 1445822 1462943 1478782 1495915 1514175 1530884 1546668 1564908 1585508 1605416
58288 1605416 1624948 1647061 1670808 1692431 1712615 1735467 1760569 1783611 1804874 1829192 1857231
58277 1857231 1884856 1911660 1941947 1976373 2010798 2044582 2081950 2123875 2166519 2208958 2254532
$$ packed form
58364H47776J0658J2972J4800J4079J3130J4058J4881J3595J1776J0860R218N990
58352I93793L465K706J319j557k857j085O88M14N18K703M538M600N693R376J2492
58337A036806J2901J3440J6384J9141J9315J8978J9895J9700J6783J3892J2931
58326A220166J1261P112L463K589K077J16p49Q94J819L12j11K681N109M666M695
58311A266100P722J0358R844R366J1602J3367J2105J1342J3984J6458J5429J4125
58299A411802J5965J8055J7121J5839J7133J8260J6709J5784J8240K0600J9908
58288A605416J9532K2113K3747K1623K0184K2852K5102K3042K1263K4318K8039
58277A857231K7625K6804L0287L4426L4425L3784L7368M1925M2644M2439M5574
$$ plain form
58266 2254532 2303478 2352254 2401204 2454745 2512990 2571468 2629744 2691578 2755986 2817558 2876447
58255 2876447 2938342 3003633 3066765 3127477 3192079 3262022 3332092 3401790 3477435 3560882 3647329
58244 3647329 3736444 3834140 3941004 4050899 4163555 4286294 4420617 4559798 4702630 4856377
58234 4856377 5022952 5195889 5374611 5567652 5777903 5999004 6230309 6480485 6752158
58225 6752158 7038527 7339545 7665319 8019027 8393713 8790835 9224024 9699426 10211411
58216 10211411 10763201 11371329 12043709 12775127 13571313 14454702 15439508 16526265 17729400
58207 17729400 19083929 20616314 22337552 24274999 26481165 29003781 31885998 35212264
58199 35212264 39120766 43765460 49319440 56040810 64297677 74531557 87282994 103303789
$$ packed form
58266B254532M8946M8776M8950N3541N8245N8478N8276O1834O4408O1572N8889
58255B876447O1895O5291O3132O0712O4602O9943P0070O9698P5645Q3447Q6447
58244C647329Q9115R7696J06864J09895J12656J22739J34323J39181J42832J53747
58234D856377J66575J72937J78722J93041K10251K21101K31305K50176K71673
58225F752158K86369L01018L25774L53708L74686L97122M33189M75402N11985
58216A0211411N51790O08128O72380P31418P96186Q83389R84806J086757J203135
58207A7729400J354529J532385J721238J937447K206166K522616K882217L326266
58199C5212264L908502M644694N553980O721370Q256867J0233880J2751437J6020795
$$ plain form
58191 103303789 123610240 149441081 182208817 223210871 272578739 327645714 382170251
58184 382170251 427822985 457427489 467663789 459467406 436511795 403406049 364592419
58177 364592419 323818627 283854424 246457056 212593695 182698905 156810505 134672527
58170 134672527 115889404 100045402 86723159 75504155 66017807 57976308 51145336
58163 51145336 45312820 40305317 36001095 32299849 29098099 26307634 23871687 21743551
58155 21743551 19868305 18199545 16713460 15390987 14203317 13127507 12158508 11292252
58147 11292252 10512191 9803928 9167282 8601815 8094594 7633415 7218391 6849199 6513336
58138 6513336 6197760 5900868 5623343 5358505 5101569 4858120 4633883 4425194 4227530
$$ packed form
58191A03303789K0306451K5830841L2767736M1002054M9367868N5066975N4524537
58184C82170251M5652734K9604504J0236300q196383k2955611l3105746l8813630
58177C64592419m0773792l9964203l7397368l3863361k9894790k5888400k2137978
58170A34672527j8783123j5844002j3322243j1219004r486348q041499o830972
58163E1145336n832516n007503m304222l701246l201750k790465k435947k128136
58155B1743551j875246j668760j486085j322473j187670j075810r68999q66256
58147A1292252p80061p08263o36646n65467n07221m61179m15024l69192l35863
58138F513336l15576k96892k77525k64838k56936k43449k24237k08689j97664
$$ plain form
58129 4227530 4043871 3876585 3720246 3570312 3430212 3302573 3182104 3064334 2952951
58120 2952951 2851487 2755963 2662509 2574177 2493490 2416176 2338969 2265954 2200609 2138983 2077241
58109 2077241 2018577 1966075 1915833 1863818 1812785 1765918 1720176 1672518 1626525 1586232 1549174
58098 1549174 1511772 1476013 1444542 1414523 1382647 1351293 1323836 1298584 1272998 1249134 1229317
58087 1229317 1210977 1191234 1172195 1156416 1141450 1124056 1105619 1088414 1070756 1050788 1030872
58076 1030872 1013205 995156 973920 951870 932451 914579 895843 877500 861557 846547 830873
58065 830873 816746 806253 797042 786353 775806 767757 760524 751704 742669 735284 727598 717371 706525
58052 706525 697516 688692 677833 666943 658716 651404 642119 632304 625007 619366 612704 605606 600073 594845
$$ packed form
58129D227530j83659j67286j56339j49934j40100j27639j20469j17770j11383
58120B952951j01464r5524r3454q8332q0687p7314p7207p3015o5345o1626o1742
58109B077241n8664n2502n0242n2015n1033m6867m5742m7658m5993m0293l7058
58098A549174l7402l5759l1471l0019l1876l1354k7457k5252k5586k3864j9817
58087A229317j8340j9743j9039j5779j4966j7394j8437j7205j7658j9968j9916
58076A030872j7667j8049k1236k2050j9419j7872j8736j8343j5943j5010j5674
58065H30873j4127j0493r211j0689j0547q049p233q820r035p385p686j0227j0846
58052G06525r009q824j0859j0890q227p312r285r815p297n641o662p098n533n228
$$ plain form
58038 594845 587403 578716 571500 565604 559317 553327 549067 544958 538553 530769 523995 517694 509839 501069
58024 501069 493496 486919 479973 473434 468721 464706 459678 454865 452384 451240 448969 445757 443361 441422
58010 441422 438458 435142 433122 431880 430018 428279 428049 428347 427561 426682 427508 429205 430033 430964 434006 438199
57994 438199 440718 440884 439869 437607 433205 427376 421372 414713 406794 399321 394105 389932 384743 379308
57980 379308 375405 372016 367014 361239 357146 354530 351355 347857 345978 345488 344393 342729 342311 343057 343051 342133
57964 342133 342117 343475 344826 345673 346905 348662 350236 351797 353754 354898 353683 350764 347867 344880 340712
57949 340712 336118 332876 330881 328924 327657 328859 332290 336192 340383 346028 352868 359604 366618 375405
57935 375405 385616 395469 404784 414773 425036 433526 439309 442816 443664 440894 435096 427749 418803 407496
$$ packed form
58038E94845p442q687p216n896o287n990m260m109o405p784o774o301p855q770
58024E01069p573o577o946o539m713m015n028m813k481j144k271l212k396j939
58010D41422k964l316k020j242j862j739k30K98p86q79Q26J697Q28R31L042M193
57994D38199K519J66j015k262m402n829o004o659p919p473n216m173n189n435
57980C79308l903l389n002n775m093k616l175l498j879m90j095j664m18P46or18
57964C42133j6J358J351Q47J232J757J574J561J957J144j215k919k897k987m168
57949C40712m594l242j995j957j267J202L431L902M191N645O840O736P014Q787
57935C75405J0211R853R315R989J0263Q490N783L507Q48k770n798p347q946j1307
$$ plain form
57921 407496 395076 383867 373945 363501 352263 341822 332837 324771 318119 313983 311491 308554 305212
57908 305212 303443 303645 304177 304435 305412 306958 307354 306096 304449 302789 300001 296044 292616 290721 289779 289486
57892 289486 290310 291889 293207 294641 297523 301529 304810 306904 309112 311837 314031 315574 317531 319680
57878 319680 320324 319152 317806 317062 315951 314313 313694 314796 316379 317671 319725 323351 327649 331585 335312
57863 335312 339172 343023 347195 352467 358600 364525 370256 376709 383378 388305 390843 392344 393633 393926
57849 393926 392862 391331 389449 385893 380311 374487 370014 366442 362633 358389 353914 349283 345188 342637
57835 342637 341226 339392 337008 335906 336994 338675 339169 338797 338942 340215 342692 346554 351410 356074 359927
57820 359927 363544 367457 371533 376051 381926 389113 395953 400760 402900 401943 397239 389092 379115 368765
$$ packed form
57921D07496j2420j1209r922j0444j1238j0441q985q066o652m136k492k937l342
57908C05212j769K02N32K58R77J546L96j258j647j660k788l957l428j895r42k93
57892B89486Q24J579J318J434K882M006L281K094K208K725K194J543J957K149
57878C19680O44j172j346p44j111j638o19J102J583J292K054L626M298L936L727
57863C35312L860L851M172N272O133N925N731O453O669M927K538J501J289K93
57849C93926j064j531j882l556n582n824m473l572l809m244m475m631m095k551
57835C42637j411j834k384j102J088J681M94l72J45J273K477L862M856M664L853
57820C59927L617L913M076M518N875P187O840M807K140r57m704q147r977j0350
$$ plain form
57806 368765 358484 348625 339839 332078 324529 317018 310300 304626 299362 294259 289668 285201 279876 274051
57792 274051 269581 267420 266539 265807 265355 265477 265733 265991 267024 269348 272630 276702 281810 287484 292605 297111
57776 297111 302145 308013 313489 317637 320705 322730 323050 321933 320909 320507 319196 315554 310058 303838 297136
57761 297136 290008 283222 277408 272405 268199 265290 263404 261235 258321 255910 255105 255469 256307 258049 261376
57746 261376 266011 271237 276617 281600 285561 288890 292800 297503 301841 305291 308882 313396 318081 321951
57732 321951 324959 327134 327988 327656 327227 327090 326313 324477 322663 321724 321097 320240 319660 319459 318487 316186 313837
57715 313837 312634 311827 310135 307786 305755 304079 302234 300218 298061 295213 291612 288363 286327 285047
57701 285047 284037 283929 285173 286900 288378 290415 293873 297756 300254 300818 299954 297904 294969 292322 290988
$$ packed form
57806C68765j0281r859q786p761p549p511o718n674n264n103m591m467n325n825
57792B74051m470k161q81p32m52J22K56K58J033K324L282M072N108N674N121M506
57776B97111N034N868N476M148L068K025L20j117j024m02j311l642n496o220o702
57761B97136p128o786n814n003m206k909j886k169k914k411q05L64Q38J742L327
57746B61376M635N226N380M983L961L329L910M703M338L450L591M514M685L870
57732C21951L008K175Q54l32m29j37p77j836j814r39o27q57n80k01r72k301k349
57715C13837j203q07j692k349k031j676j845k016k157k848l601l249k036j280
57701B85047j010j08J244J727J478K037L458L883K498N64q64k050k935k647j334
$$ plain form
57686 290988 290534 289885 288882 288009 287411 287295 288508 291482 295342 299217 303771 310370 319522 331334 346822
57671 346822 367631 395160 431091 477988 537773 609261 687152 762404 823373 859062 864112 841159
57659 841159 797825 742045 680476 618976 561806 510431 464662 424805 391583 364514 341912
57648 341912 322471 305860 292000 280703 271782 264787 258962 254054 250512 248293 246300 243727 241040
57635 241040 238813 236618 234094 232078 231505 231972 232485 232726 232596 231558 229590 227731 226445 224546 221212
57620 221212 217926 216698 217297 218003 218254 218693 219220 219033 218255 217613 216630 213900 209198 203804 198760 194226
57604 194226 190481 188052 186760 185902 185442 185838 186719 186910 185814 183825 181427 178874 176559 174713 172868
57589 172868 170523 168017 165865 163687 160859 157803 155480 154000 152829 151975 151762 151828 151549 151068 150768 150106
$$ packed form
57686B90988m54o49j003q73n98j16J213K974L860L875M554O599R152J1812J5488
57671C46822K0809K7529L5931M6897N9785P1488P7891P5252O0969L5689N050k2953
57659H41159m3334n5780o1569o1500n7170n1375m5769l9857l3222k7069k2602
57648C41912j9441j6611j3860j1297q921o995n825m908l542k219j993k573k687
57635B41040k227k195k524k016n73M67N13K41j30j038j968j859j286j899l334
57620B21212l286j228N99P06K51M39N27j87p78o42r83k730m702n394n044m534
57604A94226l745k429j292q58m60L96Q81J91j096j989k398k553k315j846j845
57589A72868k345k506k152k178k828l056k323j480j171q54k13O6k79m81l00o62
$$ plain form
57573 150106 148265 145575 143014 140685 138087 135438 133338 131442 128936 126091 123893 122338 120568 118534
57559 118534 117032 116207 115494 115004 115421 116454 116899 116408 115793 115482 115120 114972 116165 118999 122176 124299 125241
57542 125241 125759 126620 128413 131347 134876 138092 140575 142318 143119 142866 142116 141511 140887 139905 139101 139159 139527
57525 139527 139060 137789 136797 136588 136931 138010 140170 142588 143786 143641 143495 144184 145266 146308 147497 148781
57509 148781 149775 150734 152329 154321 155792 156769 158148 159771 160134 158523 155996 153691 151424 148531 144970
57494 144970 141019 136926 133360 131227 130568 130445 130127 129535 128493 126711 124654 123218 122351 121126 119316
57479 119316 117581 116019 114040 112007 111339 112396 113641 113573 112210 110079 107192 103831 101063 99511 98568
57464 98568 97586 96828 96576 96442 96336 97034 98887 100915 102048 102405 102568 102482 101923 101272 100956 100765 100459 100415 101002
$$ packed form
57573A50106j841k690k561k329k598k649k100j896k506k845k198j555j770k034
57559A18534j502q25p13m90M17J033M45m91o15l11l62j48J193K834L177K123R42
57542A25241N18Q61J793K934L529L216K483J743Q01k53p50o05o24r82q04N8L68
57525A39527m67j271r92k09L43J079K160K418J198j45j46O89J082J042J189J284
57509A48781R94R59J595J992J471R77J379J623L63j611k527k305k267k893l561
57494A44970l951m093l566k133o59j23l18n92j042j782k057j436q67j225j810
57479A19316j735j562j979k033o68J057J245o8j363k131k887l361k768j552r43
57464I8568r82p58k52j34j06O98J853K028J133L57J63q6n59o51l16j91l06m4N87
$$ plain form
57445 101002 101921 102765 103580 104369 104867 105315 106564 108689 110404 110632 109919 109508 109729 110143 110595 111222 111830 112144
57427 112144 112401 113072 114227 115601 116906 117756 117770 117118 116484 116209 116054 115999 116431 117150 117091 115670 113759 112691
57409 112691 112875 113864 115145 116269 116791 116684 116413 116197 115688 114703 113699 113142 112951 112880 112880 112838 112656 112812 114048
57390 114048 116164 117970 118765 119046 119443 119975 120794 122577 125412 128186 129874 130725 131497 132278 132773 133080 133390
57373 133390 133448 132968 132064 130835 129168 127419 126474 126506 126492 125689 124796 124833 125599 126140 126177 126106 125987 125418 124261
57354 124261 122831 121542 120789 120927 122017 123868 126454 129697 132717 134225 134117 133791 134310 135022 134644 133015
57338 133015 131077 129791 129690 130873 132700 133974 134045 133334 132440 131451 130535 130327 131010 131723 131607 130865 130247
57321 130247 130134 130630 131772 133069 133594 133191 132872 133453 134568 135576 136466 137172 137058 135975 134950 134861 135283
$$ packed form
57445A01002R19Q44Q15P89M98M48J249K125J715K28p13m11K21M14M52O27O08L14
57427A12144K57O71J155J374J305Q50J4o52o34k75j55n5M32P19n9j421j911j068
57409A12691J84R89J281J124N22j07k71k16n09r85j004n57j91p1%m2j82J56J236
57390A14048K116J806P95K81L97N32Q19J783K835K774J688Q51P72P81M95L07L10
57373A33390N8m80r04j229j667j749r45L2j4q03q93L7P66N41L7p1j19n69j157
57354A24261j430j289p53J38J090J851K586L243L020J508j08l26N19P12l78j629
57338A33015j938j286j01J183J827J274P1p11q94r89r16k08O83P13j16p42o18
57321A30247j13M96J142J297N25m03l19N81J115J008Q90P06j14j083j025q9M22
$$ plain form
57304 135283 135534 135943 137004 138155 138591 138563 138748 139019 139055 139479 141073 143336 145067 145996 146652 147050 146775 146090
57286 146090 145740 145820 145914 146172 147181 148930 150916 153123 155964 159403 163099 167222 172209 177799 183193 188045
57270 188045 192528 196712 200729 205259 210906 217208 223125 228347 233224 237599 240724 242354 243167 243999 245272
57255 245272 247067 249135 250906 251971 252443 252537 252280 252091 252995 255490 258736 261588 263931 266288 268791 271472
57239 271472 274919 279487 284262 287917 290398 292801 295871 299492 303345 307183 310736 314216 318511 324026
57225 324026 329869 335085 340140 346009 352398 358168 363159 368240 373817 379666 386037 393510 401672 409282
57211 409282 415949 422564 429932 437952 446277 454803 463396 471936 480690 489925 499337 508662 518548 529832
57197 529832 542243 554895 567838 581958 597443 613566 629932 646789 664047 681096 697726
$$ packed form
57304A35283K51M09J061J151M36k8J85K71L6M24J594K263J731R29O56L98k75o85
57286A46090l50Q0R4K58J009J749J986K207K841L439L696M123M987N590N394M852
57270A88045M483M184M017M530N647O302N917N222M877M375L125J630Q13Q32J273
57255B45272J795K068J771J065M72R4k57j89R04K495L246K852K343K357K503K681
57239B71472L447M568M775L655K481K403L070L621L853L838L553L480M295N515
57225C24026N843N216N055N869O389N770M991N081N577N849O371P473Q162P610
57211D09282O667O615P368Q020Q325Q526Q593Q540Q754R235R412R325R886J1284
57197E29832J2411J2652J2943J4120J5485J6123J6366J6857J7258J7049J6630
$$ plain form
57186 697726 714293 730956 747646 764643 782145 799409 815476 830779 846897 864663 883516
57175 883516 902690 921906 940860 959221 977381 996304 1016404 1037347 1058815 1080637 1102376
57164 1102376 1123886 1146084 1170048 1195512 1221414 1247784 1275823 1306174 1338496 1372755 1409507
57153 1409507 1448617 1488892 1529333 1569719 1609884 1649417 1688188 1726173 1762781 1797427 1830639
57142 1830639 1863470 1895972 1927472 1958174 1989119 2020761 2053092 2087047 2124056 2164114 2205916
57131 2205916 2249081 2294674 2343379 2394884 2449395 2508048 2571301 2638279 2708009 2779830 2852410
57120 2852410 2924153 2995091 3066985 3141327 3218871 3301323 3391615 3491950 3603155 3726218 3862710
57109 3862710 4013486 4179024 4361603 4565372 4794153 5051653 5344614 5683748 6081378
$$ packed form
57186F97726J6567J6663J6690J6997J7502J7264J6067J5303J6118J7766J8853
57175H83516J9174J9216J8954J8361J8160J8923K0100K0943K1468K1822K1739
57164A102376K1510K2198K3964K5464K5902K6370K8039L0351L2322L4259L6752
57153A409507L9110M0275M0441M0386M0165L9533L8771L7985L6608L4646L3212
57142A830639L2831L2502L1500L0702L0945L1642L2331L3955L7009M0058M1802
57131B205916M3165M5593M8705N1505N4511N8653O3253O6978O9730P1821P2580
57120B852410P1743P0938P1894P4342P7544Q2452R0292J00335J11205J23063J36492
57109C862710J50776J65538J82579K03769K28781K57500K92961L39134L97630
$$ plain form
57100 6081378 6551125 7111442 7787871 8611759 9619856 10856349 12372493 14222426 16459962
57091 16459962 19136976 22297679 25969367 30157831 34846712 39989437 45493461 51212262
57083 51212262 56948079 62446151 67378569 71360285 74035743 75201952 74878560 73274473
57075 73274473 70689188 67422820 63729394 59801415 55768605 51708271 47665659 43674849
57067 43674849 39772229 36001745 32413055 29053609 25959181 23149038 20627050 18385002
57059 18385002 16405770 14666897 13144336 11814516 10654581 9642408 8756916 7977937
57051 7977937 7286173 6664483 6099932 5584443 5113504 4684402 4295135 3943744 3627744
57042 3627744 3344043 3089468 2861362 2657687 2476678 2316544 2175456 2051597 1943037
$$ packed form
57100F081378M69747N60317O76429Q23888J008097J236493J516144J849933K237536
57091A6459962K677014L160703L671688M188464M688881N142725N504024N718801
57083E1212262N735817N498072M932418L981716K675458J166209l23392j604087
57075G3274473k585285l266368l693426l927979m032810m060334m042612l990810
57067D3674849l902620l770484l588690l359446l094428k810143k521988k242048
57059A8385002j979232j738873j522561j329820j159935j012173q85492p78979
57051G977937o91764o21690n64551n15489m70939m29102l89267l51391l16000
57042C627744k83701k54575k28106k03675j81009j60134j41088j23859j08560
$$ plain form
57033 1943037 1847770 1764417 1693090 1635269 1592882 1567990 1562872 1578164 1608803 1642133 1662112
57022 1662112 1657008 1623848 1566900 1493579 1411611 1327648 1246175 1169229 1097438 1031270 971213
57011 971213 917355 869366 826773 788972 755156 724559 696740 671492 648523 627258 606985
57000 606985 587299 568501 551400 536489 523460 511650 500776 490979 482444 475342 469988 466727
56988 466727 465801 467639 473041 482627 496099 512161 528810 543423 553124 555934 551700 541683 527425
56975 527425 510333 491939 473734 456594 440752 426356 413762 403324 395268 389745 386735 385992
56963 385992 387375 391193 398050 408593 423548 443605 468644 496903 524871 547988 561965 564565
56951 564565 556711 541526 521966 499703 476141 453298 432870 415112 399445 385717 374243 365239
$$ packed form
57033A943037r5267q3353p1327n7821m2387k4892n118J5292L0639L3330J9979
57022A662112n104l3160n6948p3321q1968q3963q1473p6946p1791o6168o0057
57011I71213n3858m7989m2593l7801l3816l0597k7819k5248k2969k1265k0273
57000F06985j9686j8798j7101j4911j3029j1810j0874r797q535p102n354l261
56988D66727r26J838N402R586J3472J6062J6649J4613R701K810m234j0017j4258
56975E27425j7092j8394j8205j7140j5842j4396j2594j0438q056n523l010p43
56963C85992J383L818O857J0543J4955K0057K5039K8259K7968K3117J3977K600
56951E64565p854j5185j9560k2263k3562k2843k0428j7758j5667j3728j1474r004
$$ plain form
56939 365239 359064 356580 358469 364577 374699 389683 410946 439045 473088 510776 548029 579107
56927 579107 598573 603693 594914 574709 546565 514310 481003 448373 417727 390688 368020 348446
56915 348446 330058 312662 297522 285108 274588 265432 257935 251928 246407 240938 236218 232716 229821
56902 229821 226903 224284 222605 222013 222440 223978 226521 229735 233754 239356 247177 257473 270877 288559
56888 288559 311194 338487 369862 404517 440032 471817 495099 507519 509566 503189 490760 474852
56876 474852 457861 441321 425855 411843 399952 391010 385620 384004 386247 392703 404111 421273
56864 421273 444870 475842 515800 566619 629125 701482 777956 849062 904091 935235 940417 922862
56852 922862 888645 844530 796560 748955 703949 663009 627874 599967 579489 566105 560206 562759
$$ packed form
56939C65239o175k484J889O108J0122J4984K1263K8099L4043L7688L7253L1078
56927E79107J9466N120q779k0205k8144l2255l3307l2630l0646k7039k2668j9574
56915C48446j8388j7396j5140j2414j0520r156p497o007n521n469m720l502k895
56902B29821k918k619j679n92M27J538K543L214M019N602P821J0296J3404J7682
56888B88559K2635K7293L1375L4655L5515L1785K3282J2420K047o377j2429j5908
56876D74852j6991j6540j5466j4012j1891q942n390j616K243O456J1408J7162
56864D21273K3597L0972L9958N0819O2506P2357P6474P1106N5029L1144N182j7555
56852I22862l4217m4115m7970m7605m5006m0940l5135k7907k0478j3384n899K553
$$ plain form
56840 562759 574365 595588 627989 673957 735846 816079 916863 1036873 1166924 1290102 1387775
56829 1387775 1446507 1461197 1434622 1375506 1295534 1205707 1113983 1025382 943205 869701 806163
56818 806163 753072 710216 676992 653182 639454 636605 644661 663655 695296 742793 808364 890688
56806 890688 983667 1076142 1153399 1201806 1214476 1193134 1144921 1078219 1001011 920727 843324
56795 843324 772217 708564 652465 603885 563100 530724 506964 490890 481204 477837 482085 495098
56783 495098 517251 548990 590592 639797 690253 733372 761818 771515 761840 735211 696215 650018
56771 650018 601029 552636 507278 466181 429430 396713 367822 342441 320157 300935 284920
56760 284920 271568 259750 249056 240201 233628 228440 223278 217680 212042 206775 202139 198464 195890
$$ packed form
56840E62759J1606K1223L2401M5968O1889Q0233J00784J20010J30051J23178R7673
56829A387775N8732J4690k6575n9116p9972q9827r1724q8601q2177p3504o3538
56818H06163n3091m2856l3224k3810j3728k849Q056J8994L1641M7497O5571Q2324
56806H90688R2979R2475P7257M8407J2670k1342m8213o6702p7208q0284p7403
56795H43324p1107o3653n6099m8580m0785l2376k3760j6074r686l367M248J3013
56783D95098K2153L1739M1602M9205N0456M3119K8446R697r675k6629l8996m6197
56771F50018m8989m8393m5358m1097l6751l2717k8891k5381k2284j9222j6015
56760B84920j3352j1818j0694q855o573n188n162n598n638n267m636l675k574
$$ plain form
56747 195890 194038 192302 190257 187729 184872 182308 180705 180056 179845 179933 180539 181294 181199 179877 178114 176774
56731 176774 175880 175154 174736 174877 175441 176141 176862 177560 178363 179789 182149 184691 186249 186929 188144 190695 193790
56714 193790 196319 198070 199229 199708 199609 199487 199568 199475 199269 199782 201381 203256 204564 205385 205975 206081 205718 205645
56696 205645 206203 206577 206068 205254 204996 205070 204785 204278 204182 204618 205394 206606 208181 209434 209963 210322 210886 210776
56678 210776 209053 206409 204441 203593 202971 201997 201116 200870 201141 201435 201253 200242 198537 196850 195804 195377
56662 195377 195322 195668 196330 196702 196225 195045 193689 192553 192017 192376 193097 192918 191361 189527 188727 189004 189691
56645 189691 190648 192036 193483 194466 195111 195761 196128 195684 194518 193119 191721 190528 190027 190349 190789 190670 190167
56628 190167 189657 188917 187690 186397 185397 184249 182553 180910 180018 179439 178256 176498 174920 173874 173334
$$ packed form
56747A95890j852j736k045k528k857k564j603o49k11Q8O06P55r5j322j763j340
56731A76774q94p26m18J41N64P00P21O98Q03J426K360K542J558O80J215K551L095
56714A93790K529J751J159M79r9j22Q1r3k06N13J599J875J308Q21N90J06l63p3
56696B05645N58L74n09q14k58P4k85n07r6M36P76J212J575J253N29L59N64j10
56678B10776j723k644j968q48o22r74q81k46K71K94j82j011j705j687j046m27
56662A95377n5L46O62L72m77j180j356j136n36L59P21j79j557j834q00K77O87
56645A89691R57J388J447R83O45O50L67m44j166j399j398j193n01L22M40j19n03
56628A90167n10p40j227j293j000j148j696j643q92n79j183j758j578j046n40
$$ plain form
56613 173334 173519 174433 175175 174716 173115 171254 169850 169425 170484 172713 174624 175118 174925 175537 177299 179542
56597 179542 181873 184118 185591 185778 185361 185419 186004 186581 187250 188314 189266 189571 189923 191275 193120 194291 195045
56580 195045 196662 199267 201760 203774 205919 208008 208885 208392 207922 208524 209807 211193 213025 215839 219519
56565 219519 223651 227958 232201 236512 241932 249727 259958 271444 283039 293983 303162 309279 312043
56552 312043 312361 311284 309519 307737 306283 304628 302162 299387 297254 295525 293117 289973 287178 285126
56538 285126 282964 280102 276994 274088 271236 268492 266324 264638 262660 260185 257936 256389 255166 253847
56524 253847 252474 250990 249128 247010 244973 242690 239459 235436 231553 228175 225021 222454 221458 222024 222843
56509 222843 223045 223052 223203 222791 221150 218782 216736 215597 215480 216170 216852 216558 215442 214888 215854 217727 219160
$$ packed form
56613A73334J85R14P42m59j601j861j404m25J059K229J911M94j93O12J762K243
56597A79542K331K245J473J87m17N8N85N77O69J064R52L05L52J352J845J171P54
56580A95045J617K605K493K014K145K089Q77m93m70O02J283J386J832K814L680
56565B19519M132M307M243M311N420P795J0231J1486J1595J0944R179O117K764
56552C12043L18j077j765j782j454j655k466k775k133j729k408l144k795k052
56538B85126k162k862l108k906k852k744k168j686j978k475k249j547j223j319
56524B53847j373j484j862k118k037k283l231m023l883l378l154k567r96N66Q19
56509B22843K02PJ51m12j641k368k046j139j17O90O82k94j116n54R66J873J433
$$ plain form
56492 219160 219430 218705 217575 216670 216262 216088 215895 215968 216569 217219 217357 217358 217910 218694 218883 218742 219408 221007 222310
56473 222310 222449 221869 221377 221352 221993 223253 224335 224340 223493 222797 222506 222075 221544 221696 222798 224355 226053 227734
56455 227734 228624 228084 227063 227228 228585 229577 229564 229487 229921 230305 230487 231172 232361 233099 233301 234065 235563 236418
56437 236418 235893 234950 234378 233630 232463 231912 232512 233183 233048 232864 233433 234026 233746 233128 232982 232803 231792 230568
56419 230568 230490 231904 234160 236721 239279 241351 242697 243656 244505 245162 245872 247237 249031 250063 249833 249348
56403 249348 249696 250813 252198 253731 255233 256317 257229 258670 260365 261173 261078 261526 263160 264882 265959 267335
56387 267335 269768 272293 273783 274501 274909 274423 272809 271406 271423 272093 272018 271254 270655 270169 269278 268351 268100 268327
56369 268327 268422 268443 268694 268919 268950 269336 270451 271789 273016 274676 276998 279074 280200 280934 281879 282600 282757
$$ packed form
56492B19160K70p25j130r05m08j74j93P3O01O50J38JN52P84J89j41O66J599J303
56473B22310J39n80m92k5O41J260J082Nq47o96k91m31n31J52J102J557J698J681
56455B27734Q90n40j021J65J357R92j3p7M34L84J82O85J189P38K02P64J498Q55
56437B36418n25r43n72p48j167n51O00O71j35j84N69N93k80o18j46j79j011j224
56419B30568p8J414K256K561K558K072J346R59Q49O57P10J365J794J032k30m85
56403B49348L48J117J385J533J502J084R12J441J695Q08r5M48J634J722J077J376
56387B67335K433K525J490P18M08m86j614j403J7O70p5p64n99m86q91r27k51K27
56369B68327R5K1K51K25L1L86J115J338J227J660K322K076J126P34R45P21J57
$$ plain form
56352 282757 283055 283958 284681 284644 284655 285468 286426 286843 287432 288935 290630 291712 292984 295569 298976 301983 304467
56335 304467 306885 308987 310551 312391 315106 317787 319473 320877 323083 325610 327473 329220 332117 336049
56321 336049 339889 343214 346099 348023 348600 348647 349003 349087 348138 347005 347048 348097 349171 350343 352229 354445
56305 354445 356352 358542 361943 366217 370770 376386 384003 392661 400567 407423 413834 419352 423300 426785
56291 426785 431619 437625 443236 448324 454233 461183 467920 474007 480510 488203 496763 505748 514871 523442
56277 523442 531119 539087 548990 560926 573824 587327 601757 616743 631674 647189 664564 683947
56265 683947 704742 727276 752407 779951 809264 840986 876537 916371 960515 1010343 1067928
56254 1067928 1134008 1208400 1291973 1386246 1491415 1606698 1732247 1868672 2014918 2168559
$$ packed form
56352B82757K98R03P23l7J1Q13R58M17N89J503J695J082J272K585L407L007K484
56335C04467K418K102J564J840K715K681J686J404K206K527J863J747K897L932
56321C36049L840L325K885J924N77M7L56Q4r49j133M3J049J074J172J886K216
56305C54445J907K190L401M274M553N616P617Q658P906O856O411N518L948L485
56291D26785M834O006N611N088N909O950O737O087O503P693Q560Q985R123Q571
56277E23442P677P968R903J1936J2898J3503J4430J4986J4931J5515J7375J9383
56265F83947K0795K2534K5131K7544K9313L1722L5551L9834M4144M9828N7585
56254A067928O6080P4392Q3573R4273J05169J15283J25549J36425J46246J53641
$$ plain form
56244 2168559 2327787 2491003 2654705 2814007 2965223 3105871 3232253 3339321 3423240 3482296
56234 3482296 3515306 3521254 3500790 3456258 3390015 3304313 3202760 3089833 2968601 2840478 2707334
56223 2707334 2572229 2438030 2306825 2180589 2060694 1946780 1837754 1733859 1636321 1545300
56213 1545300 1459942 1380219 1306898 1239854 1178189 1121778 1070909 1024642 981371 940860 903969
56202 903969 870695 840305 812955 789158 768047 748313 730533 716255 704936 694101 682632
56191 682632 671766 662681 655138 648652 643146 638304 633869 630437 628426 626725 624131 621385 619879 619174
56177 619174 618095 617390 618683 621440 623716 625420 627981 631190 633364 634545 636616 640241 644524 649631
56163 649631 656813 665723 674622 683412 693650 705400 717018 728305 741003 755855 771963 789292
$$ packed form
56244B168559J59228J63216J63702J59302J51216J40648J26382J07068Q3919N9056
56234C482296L3010N948k0464m4532o6243q5702j01553j12927j21232j28123j33144
56223B707334j35105j34199j31205j26236j19895j13914j09026j03895r7538r1021
56213A545300q5358p9723p3321o7044o1665n6411n0869m6267m3271m0511l6891
56202I03969l3274l0390k7350k3797k1111j9734j7780j4278j1319j0835j1469
56191F82632j0866r085p543o486n506m842m435l432k011j701k594k746j506p05
56177F19174j079p05J293K757K276J704K561L209K174J181K071L625M283N107
56163F49631P182Q910Q899Q790J0238J1750J1618J1287J2698J4852J6108J7329
$$ plain form
56151 789292 808953 830803 853746 878796 908930 945653 988689 1039417 1101454 1177190 1266512
56140 1266512 1369118 1484644 1609480 1736345 1857974 1969198 2065933 2146059 2212357 2271494
56130 2271494 2328721 2385286 2440334 2491714 2534719 2564097 2578896 2582874 2579882 2571709 2560033 2545913
56118 2545913 2526118 2493634 2443316 2374363 2287228 2182461 2063973 1939557 1816250 1697789
56108 1697789 1587263 1488372 1402596 1328338 1264281 1210661 1166499 1129087 1097290 1072036 1052734
56097 1052734 1036714 1023052 1013148 1006682 1000958 995249 991751 991158 991441 992070 994983 1000053 1004204 1006677
56083 1006677 1010633 1017651 1025107 1030982 1036861 1044059 1051216 1057903 1066340 1077266 1088369 1098870 1111315
56070 1111315 1126605 1141779 1155110 1168912 1184865 1201109 1216540 1233337 1252497 1271308 1288018
$$ packed form
56151G89292J9661K1850K2943K5050L0134L6723M3036N0728O2037P5736Q9322
56140A266512J02606J15526J24836J26865J21629J11224R6735Q0126O6298N9137
56130B271494N7227N6565N5048N1380M3005K9378J4799L978k992q173j1676j4120
56118B545913j9795l2484n0318o8953q7135j04767j18488j24416j23307j18461
56108A697789j10526r8891q5776p4258o4057n3620m4162l7412l1797k5254j9302
56097A052734j6020j3662r904o466n724n709l498n93K83O29K913N070M151K473
56083A006677L956P018P456N875N879P198P157O687Q437J0926J1103J0501J2445
56070A111315J5290J5174J3331J3802J5953J6244J5431J6797J9160J8811J6710
$$ plain form
56059 1288018 1304603 1322232 1338583 1352381 1365934 1380335 1393039 1403189 1414421 1429116 1444762
56048 1444762 1459358 1475503 1495468 1516991 1537649 1558809 1581679 1604144 1625168 1647702 1673600
56037 1673600 1700328 1726180 1753851 1785266 1817913 1849941 1883742 1920906 1959005 1997033 2038220
56026 2038220 2083522 2128277 2169616 2211193 2256212 2302123 2346941 2394313 2447067 2501996 2556508
56015 2556508 2614121 2677859 2744492 2811034 2880512 2955520 3032633 3109303 3189652 3277210 3368621
56004 3368621 3460934 3558192 3664207 3775949 3890896 4013548 4147454 4288275 4432157 4583335
55994 4583335 4745947 4916308 5091235 5275802 5474706 5684548 5903090 6137086 6392024
55985 6392024 6663524 6948133 7252731 7583716 7937609 8312735 8718868 9164319 9645510
$$ packed form
56059A288018J6585J7629J6351J3798J3553J4401J2704J0150J1232J4695J5646
56048A444762J4596J6145J9965K1523K0658K1160K2870K2465K1024K2534K5898
56037A673600K6728K5852K7671L1415L2647L2028L3801L7164L8099L8028M1187
56026B038220M5302M4755M1339M1577M5019M5911M4818M7372N2754N4929N4512
56015B556508N7613O3738O6633O6542O9478P5008P7113P6670Q0349Q7558R1411
56004C368621R2313R7258J06015J11742J14947J22652J33906J40821J43882J51178
55994D583335J62612J70361J74927J84567J98904K09842K18542K33996K54938
55985F392024K71500K84609L04598L30985L53893L75126M06133M45451M81191
$$ plain form
55976 9645510 10161072 10723534 11344548 12022548 12758859 13571336 14477090 15477861 16579545
55967 16579545 17809921 19199546 20763872 22524949 24532316 26842341 29501092 32575333
55959 32575333 36181082 40460937 45569393 51721993 59240329 68530809 80081000 94548417
55951 94548417 112843049 136114102 165712647 203031519 248731587 301182988 355169279
55944 355169279 402523781 435048719 447895356 441048289 418291364 384994555 346307040
55937 346307040 306277503 267630234 231909195 199832266 171642446 147290657 126508216
55930 126508216 108901459 94055937 81571694 71058207 62162159 54604938 48169772
55923 48169772 42665745 37928774 33840053 30310977 27254182 24587928 22255913 20218594
$$ packed form
55976I645510N15562N62462O21014O78000P36311Q12477R05754J000771J101684
55967A6579545J230376J389625J564326J761077K007367K310025K658751L074241
55959C2575333L605749M279855N108456O152600P518336R290480J1550191J4467417
55951I4548417J8294632K3271053K9598545L7318872M5700068N2451401N3986291
55944C55169279M7354502L2524938J2846637o847067k2756925l3296809l8687515
55937C46307040m0029537l8647269l5721039l2076929k8189820k4351789k0782441
55930A26508216j7606757j4845522j2484243j0513487q896048p557221o435166
55923D8169772n504027m736971m088721l529076l056795k666254k332015k037319
$$ plain form
55915 20218594 18431628 16850982 15449920 14211404 13110407 12120331 11229304 10433286
55907 10433286 9719161 9069582 8478156 7944945 7462354 7019088 6612676 6244864 5909495
55898 5909495 5597228 5307516 5043995 4802587 4575530 4362801 4168505 3990033 3821366
55889 3821366 3663266 3519957 3389322 3266116 3151381 3049320 2958006 2871825 2789445 2710901
55879 2710901 2630903 2544289 2454897 2370330 2290992 2212487 2135280 2063129 1994823 1926347 1859090
55868 1859090 1797731 1742077 1688702 1638506 1594867 1556202 1517842 1479518 1443867 1409437 1372484
55857 1372484 1334132 1298771 1266729 1235177 1204717 1178325 1155009 1131014 1106166 1082888 1060221
55846 1060221 1034995 1007813 981906 957204 931342 905290 882138 861405 840337 819729 802738
$$ packed form
55915B0218594j786966j580646j401062j238516j100997r90076q91027p96018
55907A0433286p14125o49579n91426n33211m82591m43266m06412l67812l35369
55898E909495l12267k89712k63521k41408k27057k12729j94296j78472j68667
55889C821366j58100j43309j30635j23206j14735j02061r1314q6181q2380p8544
55879B710901p9998q6614q9392q4567p9338p8505p7207p2151o8306o8476o7257
55868A859090o1359n5654n3375n0196m3639l8665l8360l8324l5651l4430l6953
55857A372484l8352l5361l2042l1552l0460k6392k3316k3995k4848k3278k2667
55846A060221k5226k7182k5907k4702k5862k6052k3152k0733k1068k0608j6991
$$ plain form
55835 802738 788895 774963 760770 748624 737871 725731 712836 702448 694764 687240 679855 674635
55823 674635 670502 663938 654501 644641 634527 622227 608690 597367 588788 580272 571049 563055 556722
55810 556722 550551 544866 541633 540645 540097 540696 544851 552105 559793 567940 578831 591782 602936 610545
55796 610545 616013 619476 618786 613500 605698 596270 584311 570829 559177 550994 544977 539993 535954 531398
55782 531398 523902 513551 502854 493084 483996 477170 476026 482202 495270 515996 545833 582279 618013
55769 618013 645603 660710 661226 647303 623050 594751 566155 537649 509862 484873 463615 445323
55757 445323 430037 418693 410409 402691 394664 387203 379708 370002 357802 345230 333417 321676 310394
55744 310394 301540 295799 292225 291116 293850 299105 302560 301572 297455 292249 286109 278907 271741 265600
$$ packed form
55835H02738j3843j3932j4193j2146j0753j2140j2895j0388p684p524p385n220
55823F74635m133o564r437r860j0114j2300j3537j1323q579q516r223p994o333
55810E56722o171n685l233r88n48N99M155P254P688Q147J0891J2951J1154P609
55796F10545N468L463o90n286p802r428j1959j3482j1652q183o017m984m039m556
55782E31398p496j0351j0697r770r088o826j144O176J3068K0726K9837L6446L5734
55769F18013K7590J5107N16j3923k4253k8299k8596k8506k7787k4989k1258j8292
55757D45323j5286j1344q284p718q027p461p495r706j2200j2572j1813j1741j1282
55744C10394q854n741l574j109K734N255L455r88m117n206o140p202p166o141
$$ plain form
55730 265600 260558 256953 255148 253737 250455 245384 240850 237841 235156 232398 230842 230690 230416 229768 230723
55715 230723 234437 239800 245964 253753 263394 273020 280581 285314 286722 284365 279489 274707 271146 267662
55701 267662 263291 258377 252905 246096 238285 230994 224612 218182 211872 207181 204227 201378 198243 196428
55687 196428 196533 196986 196763 196783 197676 198691 199903 203007 208681 215368 221765 228212 234533 238914 240402 240405
55671 240405 240331 239683 237789 235415 233316 231054 228594 227277 227796 228895 229391 229939 231532 233773 235900 238100
55655 238100 240714 243434 246259 249856 254057 257452 259294 260378 261242 261044 259059 255756 251592 246269 239937
55640 239937 233542 227191 219761 210922 201999 194095 186936 180268 174703 170411 166617 163143 160800 159622
55626 159622 158485 157111 156531 156822 156447 154792 153312 153067 153085 152257 150972 149679 147721 144895 142330 140479
$$ packed form
55730B65600n042l605j805j411l282n071m534l009k685k758j556j52k74o48R55
55715B30723L714N363O164P789R641R626P561M733J408k357m876m782l561l484
55701B67662m371m914n472o809p811p291o382o430o310m691k954k849l135j815
55687A96428J05M53k23K0Q93J015J212L104N674O687O397O447O321M381J488L
55671B40405p4o48j894k374k099k262k460j317N19J099M96N48J593K241K127K200
55655B38100K614K720K825L597M201L395J842J084Q64j98j985l303m164n323o332
55640B39937o395o351p430q839q923p904p159o668n565m292l794l474k343j178
55626A59622j137j374n80K91l75j655j480k45J8q28j285j293j958k826k565j851
$$ plain form
55610 140479 137962 133815 129307 126157 124424 123445 123267 123766 123799 122682 121339 120802 120793 120751 120864 121077 120546 119122
55592 119122 117874 117169 115898 113625 111757 111368 111623 111685 112362 114328 116391 117222 117446 118432 120314 122603
55576 122603 125429 128760 131803 134581 138649 144781 151440 157057 162262 168183 174071 178529 181739 184489
55562 184489 186121 185476 182856 179229 174509 168534 162753 158786 155984 152394 147678 143282 140181 138163
55548 138163 136936 136296 135492 133975 132462 131986 132339 132769 133570 135533 138314 140864 143062 145453 147639 148432
55532 148432 147525 145818 144133 142650 141397 140330 139071 137336 135375 133338 130763 127367 123726 120395
55518 120395 117094 113586 110564 108676 107332 105510 103162 100987 99421 98603 98600 98865 98259 96446 94488 93380
55502 93380 92956 92914 93678 95236 96332 96039 95088 94551 94249 93639 93065 92851 92282 90928 89872 90127 90860 90782
$$ packed form
55610A40479k517m147m508l150j733r79j78M99L3j117j343n37rm2J13K13n31j424
55592A19122j248p05j271k273j868l89K55O2O77J966K063Q31K24R86J882K289
55576A22603K826L331L043K778M068O132O659N617N205N921N888M458L210K750
55562A84489J632o45k620l627m720n975n781l967k802l590m716m396l101k018
55548A38163j227o40q04j517j513m76L53M30Q01J963K781K550K198K391K186P93
55532A48432r07j707j685j483j253j067j259j735j961k037k575l396l641l331
55518A20395l301l508l022j888j344j822k348k175j566q18lK65o06j813j958j108
55502I3380m24m2P64J558J096k93r51n37l02o10n74k14n69j354j056K55P33p8
$$ plain form
55484 90782 90327 90790 92115 93202 93733 94052 93950 93224 92823 93747 95267 95832 95333 94958 95260 95775 96145 96187
55466 96187 95379 93644 92124 91823 92110 91942 91704 92272 93036 92799 92012 92117 93067 93489 93089 92905 93280 93497
55448 93497 93480 93941 94638 94280 92529 90564 89330 88717 88718 89817 91746 93194 93360 92767 92175 91683 91231 91101
55430 91101 91535 92556 94171 96061 97268 97084 96055 95167 94394 93161 91927 91974 93662 96147 98836 101922
55414 101922 105403 108699 111414 113541 114920 115345 115147 114714 113639 111301 108106 105038 102272 99374 96629
55399 96629 94890 94190 93782 93509 93881 94786 95385 95403 95418 95752 96124 96463 97011 97616 97944 98343 99435 100951 102090
55380 102090 102931 104289 106235 107963 109095 109892 110195 109515 108240 107422 107083 106018 103600 100602 97911 95487
55364 95487 92989 90498 88286 86649 86060 86615 87338 87012 85788 84965 85178 85837 86339 86674 86702 86019 84765
$$ packed form
55484I0782m55M63J325J087N31L19j02p26m01R24J520N65m99l75L02N15L70M2
55466I6187q08j735j520l01K87j68k38N68P64k37p87J05R50M22m00j84L75K17
55448I3497j7M61O97l58j751j965j234o13JJ099J929J448J66n93n92m92m52j30
55430I1101M34J021J615J890J207j84j029q88p73j233j234M7J688K485K689L086
55414A01922L481L296K715K127J379M25j98m33j075k338l195l068k766k898k745
55399I6629j739p00m08k73L72R05N99J8J5L34L72L39N48O05L28L99J092J516J139
55380A02090Q41J358J946J728J132P97L03o80j275q18l39j065k418k998k691k424
55364I5487k498k491k212j637n89N55P23l26j224q23K13O59N02L35K8o83j254
$$ plain form
55347 84765 83583 82624 81586 80724 80673 81175 81188 80492 80016 80359 81115 81914 82936 84032 84496 84206 84011 84468
55329 84468 85029 84899 83965 82574 81133 80180 80082 80483 80674 80557 80552 80706 80755 80889 81431 81949 81754 81163 81018 81147
55309 81147 80714 80033 80438 82137 83770 84473 84888 85639 86284 86434 86505 86690 86452 85814 85926 87462 89511 90842
55291 90842 91279 91086 90072 88271 86679 86306 87009 87984 88826 89494 89816 89735 89611 89771 90184 90824 91734 92483
55273 92483 92349 91420 90749 90971 91508 91568 91172 90719 90266 89752 89388 89316 89356 89377 89386 89175 88517 87821 87824 88488 89051 89332
55251 89332 90022 91468 93086 94274 94939 94925 93954 92500 91617 91423 90839 89327 87839 87456 88067 88965 89836
55234 89836 90476 90476 89896 89462 89435 89107 88030 86908 86606 87009 87570 88214 89044 89789 90266 90800 91610 92340 92662
55215 92662 92729 92614 92043 91097 90420 90295 90334 90470 91252 92615 93445 93157 92737 93347 94668 95507 95376 94619 93607
$$ packed form
55347H4765j182r59j038q62n1N02J3o96m76L43P56P99J022J096M64k90j95M57
55329H4468N61j30r34j391j441r53r8M01J91j17nJ54M9J34N42N18j95n91j45J29
55309H1147m33o81M05J699J633P03M15P51O45J50P1J85k38o38J12J536K049J331
55291I0842M37j93j014j801j592l73P03R75Q42O68L22q1j24J60M13O40R10P49
55273I2483j34r29o71K22N37O0l96m53m53n14l64p2M0K1Rk11o58o96LO64N63K81
55251H9332O90J446J618J188O65j4r71j454q83j94n84j512j488l83O11Q98Q71
55234H9836O40%n80m34k7l28j077j122l02M03N61O44Q30P45M77N34Q10P30L22
55215I2662O7j15n71r46o77j25L9J36P82J363Q30k88m20O10J321Q39j31p57j012
$$ plain form
55196 93607 92636 92087 91909 91471 90545 89907 90314 91492 92700 93649 94204 93930 92760 91558 91231 91729 92529 93565
55178 93565 94988 96554 97926 99123 100113 100498 100141 99559 99169 98778 98314 98283 98869 99361 99190 98822 98862 99094
55160 99094 99199 99665 100966 102469 103183 103126 102980 102807 102051 100537 98602 96522 94565 93276 92972 93155 93099
55143 93099 92723 92340 91948 91374 90824 90721 91322 92812 95217 97785 99193 98976 98087 97444 96752 95491 94204
55126 94204 93785 94143 94626 95172 95997 96590 96187 95004 94074 94009 94704 95936 97453 98791 99750 100763 102104
55109 102104 103200 103494 103485 104007 104886 105295 105072 104838 105039 105699 106793 108041 108741 108628 108500 109125 110013 110258
55091 110258 110087 110442 111364 112037 112196 112339 112660 112962 113530 114843 116341 116698 115602 114235 113682 113794 113937
55074 113937 114026 114363 115091 116188 117501 118579 118849 118154 116821 115248 113746 112582 111755 110949 110133 109867 110446
$$ packed form
55196I3607r71n49j78m38r26o38M07J178J208R49N55k74j170j202l27M98Q00J036
55178I3565J423J566J372J197R90L85l57n82l90l91m64l1N86M92j71l68M0K32
55160I9094J05M66J301J503P14n7j46j73p56j514j935k080j957j289l04J83n6
55143I3099l76l83l92n74n50j03O01J490K405K568J408k17q89o43o92j261j287
55126I4204m19L58M83N46Q25N93m03j183r30o5O95J232J517J338R59J013J341
55109A02104J096K94rN22Q79M09k23k34K01O60J094J248P00j13j28O25Q88K45
55091A10258j71L55R22O73J59J43L21L02N68J313J498L57j096j367n53J12J43
55074A13937Q9L37P28J097J313J078K70o95j333j573j502j164q27q06q16k66N79
$$ plain form
55057 110446 111137 111032 110329 109965 110217 110531 110521 110255 109683 108725 107934 108104 109103 109872 109706 108857 107810 106742
55039 106742 105810 105304 105241 105336 105456 105672 105894 106002 106235 106872 107631 107931 107689 107289 106923 106614 106678 107414 108443
55020 108443 109121 109502 110141 110977 111289 110766 109814 108710 107256 105451 103752 102439 101390 100709 100956 102406
55004 102406 104498 106249 106953 106451 105175 103957 103466 103785 104718 106234 108231 110222 111768 112962 113973
54989 113973 114478 114180 113534 113211 113169 112972 112701 112730 112938 113043 113420 114550 115846 116142 115266 114132 113360 112871
54971 112871 112732 113196 113844 113953 113862 114698 116505 117918 118178 118251 119304 121156 122992 124593 126007 126751 126315
54954 126315 125050 123770 122786 121876 120976 120356 120274 120663 121002 120531 119067 117605 117436 118557 119662 119903 119852
54937 119852 120395 121456 122359 122838 123144 123571 124297 125339 126418 127311 128532 131102 135365 140626 146225 152319
$$ packed form
55057A10446O91j05p03l64K52L14j0k66n72r58p91J70R99P69j66q49j047j068
55039A06742r32n06o3R5J20K16K22J08K33O37P59L00k42m00l66l09O4P36J029
55020A08443O78L81O39Q36L12n23r52j104j454j805j699j313j049o81K47J450
55004A02406K092J751P04n02j276j218m91L19R33J516J997J991J546J194J011
54989A13973N05k98o46l23m2j97k71K9K08J05L77J130J296K96q76j134p72m89
54971A12871j39M64O48J09r1Q36J807J413K60P3J053J852J836J601J414P44m36
54954A26315j265j280r84r10r00o20q2L89L39m71j464j462j69J121J105K41n1
54937A19852N43J061R03M79L06M27P26J042J079Q93J221K570M263N261N599O094
$$ plain form
54921 152319 159242 166678 173877 180162 184899 187555 188233 187576 185795 182397 177295 171461 165874 160438 154615
54906 154615 148605 143174 138688 135091 132553 131356 131196 131225 130885 130264 129729 129530 129709 130013 129999 129562 129261
54889 129261 129831 131429 133610 135925 138256 140698 143369 146355 149707 153531 158108 163749 170370 177361
54875 177361 183920 189442 193601 196319 197685 197674 195940 192145 186516 179827 172881 166231 160257 155065 150424
54860 150424 146266 143096 141286 140114 138343 135828 133676 132555 131768 130475 128945 127838 126912 125296 122788
54845 122788 120069 117773 115960 114446 113158 112171 111687 111866 112437 112727 112455 112220 112777 114038 115268 116109
54829 116109 116816 117512 117782 117239 116074 114803 113676 112600 111535 110698 110375 110666 111487 112714 114140 115345
54813 115345 115868 115709 115500 115921 116976 118076 118759 119109 119458 119915 120283 120322 120097 120060 120635 121666 122540 123010
$$ packed form
54921A52319O923P436P199O285M737K656O78o57j781l398n102n834n587n436n823
54906A54615o010n431m486l597k538j197j60K9l40o21n35j99J79L04j4m37l01
54889A29261N70J598K181K315K331K442K671K986L352L824M577N641O621O991
54875A77361O559N522M159K718J366j1j734l795n629o689o946o650n974n192m641
54860A50424m158l170j810j172j771k515k152j121p87j293j530j107r26j616k508
54845A22788k719k296j813j514j288r87m84J79N71K90k72k35N57J261J230Q41
54829A16109P07O96K70n43j165j271j127j076j065q37l23K91Q21J227J426J205
54813A15345N23j59k09M21J055J100O83L50L49M57L68L9k25l7N75J031Q74M70
$$ plain form
54795 123010 123527 124395 125000 124490 123067 121974 122170 123447 124896 125743 125728 125182 124848 125301 126432 127756 129132
54778 129132 130772 132681 134654 136849 139785 143611 147817 151868 155735 159735 164243 169644 176137 183337
54764 183337 190351 196412 201220 204732 206859 207417 206122 202799 197856 192329 186963 181445 175065 168008
54750 168008 161363 155954 151800 148625 146219 144175 142024 139847 138285 137750 137999 138477 138665 138192 137203 136557
54734 136557 137046 138435 139850 141011 142374 144177 146216 148603 151861 156128 161046 166603 173162 180378
54720 180378 186883 191415 193642 193722 191861 188591 184701 180519 175823 170662 165591 160912 156464 152322 148899
54705 148899 146149 143567 141227 139832 139417 139035 138217 137695 138079 138770 138874 138358 137581 136491 135026 133590
54689 133590 132350 130691 128086 125019 122461 120958 120695 121652 123143 124030 124066 124224 125083 125793 125468 124637 124263
$$ packed form
54795A23010N17Q68O05n10j423j093J96J277J449Q47j5n46l34M53J131J324J376
54778A29132J640J909J973K195K936L826M206M051L867M000M508N401O493P200
54764A83337P014O061M808L512K127N58j295l323m943n527n366n518o380p057
54750A68008o645n409m154l175k406k044k151k177j562n35K49M78J88m73r89o46
54734A36557M89J389J415J161J363J803K039K387L258M267M918N557O559P216
54720A80378O505M532K227Q0j861l270l890m182m696n161n071m679m448m142l423
54705A48899k750k582k340j395m15l82q18n22L84O91J04n16p77j090j465j436
54689A33590j240j659k605l067k558j503k63R57J491Q87L6J58Q59P10l25q31l74
$$ plain form
54672 124263 124171 123650 122946 122843 123183 123051 122193 121164 120268 119404 118812 118932 119556 120008 120137 120338 120687 120808 120516
54653 120516 119940 119183 118550 118801 120391 122615 124306 125138 125486 125366 124564 123662 123790 125095 126382 126524 125535
54636 125535 124072 122565 121179 120067 119356 119121 119412 120027 120410 120218 119847 119939 120498 120982 121079 120882 120439 119747
54618 119747 119067 118684 118439 118047 117772 118190 119300 120441 121091 121306 121450 121892 122823 123949 124538 124255 123728 123803
54600 123803 124518 125359 126193 127211 128107 128155 127190 125887 125009 124828 125232 125963 126742 127486 128237 128631 127920 126060
54582 126060 124286 123876 124697 125664 126260 126725 127099 127112 126900 126845 126756 126085 125001 124315 124313 124558 124981 126215 128509
54563 128509 131078 132846 133343 132692 131353 130011 129186 128813 128609 128768 129722 131298 132837 134104 135340 136460
54547 136460 137049 137245 137778 138913 140130 140999 141703 142470 143183 143752 144208 144318 143781 142915 142429 142367 142005 140929
$$ packed form
54672A24263r2n21p04j03L40j32q58j029q96q64n92J20O24M52J29K01L49J21k92
54653A20516n76p57o33K51J590K224J691Q32L48j20q02r02J28J305J287J42r89
54636A25535j463j507j386j112p11k35K91O15L83j92l71R2N59M84R7j97m43o92
54618A19747o80l83k45l92k75M18J110J141O50K15J44M42R31J126N89k83n27P5
54600A23803P15Q41Q34J018Q96M8r65j303q78j81M04P31P79P44P51L94p11j860
54582A26060j774m10Q21R67N96M65L74J3k12n5q9o71j084o86kK45M23J234K294
54563A28509K569J768M97o51j339j342q25l73k04J59R54J576J539J267J236J120
54547A36460N89J96N33J135J217Q69P04P67P13N69M56J10n37q66m86o2l62j076
$$ plain form
54529 140929 139448 137826 135994 134217 133109 132639 131978 130789 129825 129814 130467 131093 131478 131721 131880 132190 132976
54512 132976 133928 134267 134077 134589 136490 138748 139860 139572 138564 137221 135716 134767 135070 136135 136722 136502
54496 136502 136421 137322 138878 140130 140610 140716 141217 142391 143533 143550 142265 140775 140198 140466 140831 141091 141580
54479 141580 142210 142404 142030 141656 141734 142126 142665 143595 145093 146784 148132 149099 150026 151036 151896 152480 153052 153895
54461 153895 154805 155179 154661 153519 152240 150910 149277 147395 145796 144859 144286 143502 142404 141462 141152 141496
54445 141496 142142 142700 142981 143043 143028 142959 142732 142308 141787 141257 140766 140495 140752 141573 142501 143077 143513 144489 146079
54426 146079 147240 146828 145105 143742 144128 145990 147985 149281 150034 150545 150706 150482 150265 150357 150498 150299 149826
54409 149826 149455 149400 149626 149933 149880 149061 147794 147100 147623 148960 150461 152137 154184 156131 157277 157720 158146
$$ packed form
54529A40929j481j622j832j777j108m70o61j189r64j1O53O26L85K43J59L10P86
54512A32976R52L39j90N12J901K258J112k88j008j343j505r49L03J065N87k20
54496A36502q1R01J556J252M80J06N01J174J142J7j285j490n77K68L65K60M89
54479A41580O30J94l74l74P8L92N39R30J498J691J348R67R27J010Q60N84N72Q43
54461A53895R10L74n18j142j279j330j633j882j599r37n73p84j098r42l10L44
54445A41496O46N58K81O2j5o9k27m24n21n30m91k71K57Q21R28N76M36R76J590
54426A46079J161m12j723j363L86J862J995J296P53N11J61k24k17R2J41j99m73
54409A49826l71n5K26L07n3q19j267o94N23J337J501J676K047J947J146M43M26
$$ plain form
54392 158146 158762 159176 159188 158916 158263 157063 155724 154945 154733 154475 154019 153871 154207 154579 154828 155435 156591 157708
54374 157708 158333 158921 160157 162073 164398 167256 170861 174764 178031 180206 181695 183123 184513 185219 184723
54359 184723 183411 182279 181752 181206 180039 178672 177801 177032 175302 172579 170120 168803 168201 167603 167040 166704
54343 166704 166165 164874 162989 161092 159495 158284 157623 157469 157321 156783 156108 155800 155931 156223 156546 156916 157239
54326 157239 157457 157790 158522 159669 161047 162459 163620 164114 163715 162637 161405 160564 160451 160855 160926 159858 157782
54309 157782 155622 154041 152964 152080 151188 150048 148590 147494 147765 149380 151020 151542 151067 150263 149308 148194
54293 148194 147437 147658 148729 149964 150971 151845 152764 153811 154973 155956 156289 155923 155449 155359 155454 155299 154861 154349
54275 154349 153876 153724 154435 156062 157694 158396 158355 158508 159235 160071 160598 161021 161750 162888 164256 165679 167129
$$ packed form
54392A58146O16M14J2k72o53j200j339p79k12k58m56j48L36L72K49O07J156J117
54374A57708O25N88J236J916K325K858L605L903L267K175J489J428J390P06m96
54359A84723j312j132n27n46j167j367q71p69j730k723k459j317o02n98n63l36
54343A66704n39j291j885j897j597j211o61j54j48n38o75l08J31K92L23L70L23
54326A57239K18L33P32J147J378J412J161M94l99j078j232q41j13M04P1j068k076
54309A57782k160j581j077q84q92j140j458j096K71J615J640N22m75q04r55j114
54293A48194p57K21J071J235J007Q74R19J047J162R83L33l66m74r0R5j55m38n12
54275A54349m73j52P11J627J632P02m1J53P27Q36N27M23P29J138J368J423J450
$$ plain form
54258 167129 168670 170227 171445 172034 172245 172626 173299 173897 174258 174570 174676 174040 172767 171869 171904 172031 171216 169800
54240 169800 168973 169009 169004 168272 167141 166262 165812 165530 165020 163926 162263 160680 159992 160299 160852 160930 160625 160669 161585
54221 161585 163072 164220 164408 163901 163358 162933 162257 161233 160198 159235 158098 157029 156842 157707 158598 158597 158121
54204 158121 158092 158492 158570 158122 157637 157408 157349 157568 158337 159452 160295 160526 160230 159472 158339 157345 157131 157722 158571
54185 158571 159341 160134 161002 161795 162578 163656 165063 166399 167300 167817 168301 169075 170107 170816 170473 169038 167326
54168 167326 166077 165222 164437 163889 163839 163968 163814 163563 163647 163863 163752 163640 164282 165469 165996 165244 163901 162778
54150 162778 161809 160724 159986 160289 161490 162678 163166 162952 162355 161643 161060 160830 160917 160892 160258 158914 157288 155963
54132 155963 155313 155547 156834 159023 161362 163040 164084 165251 166942 168761 170348 172038 174310 177217 180792
$$ packed form
54258A67129J541J557J218N89K11L81O73N98L61L12J06o36j273q98L5J27q15j416
54240A69800q27L6np32j131q79m50k82n10j094j663j583o88L07N53P8l05M4R16
54221A61585J487J148J88n07n43m25o76j024j035r63j137j069j87Q65Q91jm76
54204A58121k9M00P8m48m85k29n9K19P69J115Q43K31k96p58j133r94k14N91Q49
54185A58571P70P93Q68P93P83J078J407J336R01N17M84P74J032P09l43j435j712
54168A67326j249q55p85n48n0J29j54k51Q4K16j11j12O42J187N27p52j343j123
54150A62778r69j085p38L03J201J188M88k14n97p12n83k30Q7k5o34j344j626j325
54132A55963o50K34J287K189K339J678J044J167J691J819J587J690K272K907L575
$$ plain form
54117 180792 185411 191132 197156 202653 207727 212802 217342 219973 219858 217312 213228 208465 203700 199248
54103 199248 194978 190803 187091 184187 181845 179683 177874 176749 175978 174884 173424 172143 171267 170517 169731
54088 169731 169021 168374 167746 167485 167991 169048 170087 170981 171972 173001 173831 174695 176035 177709 179258 180794
54072 180794 182714 184613 185522 185343 185109 185594 186556 187506 188329 188835 188570 187475 186033 184482 182627 180658
54056 180658 179332 178987 179121 179343 179978 181334 183100 184967 187166 189905 192902 196004 199589 203860 208327
54041 208327 212566 216943 221986 227536 233112 238638 244219 249634 254761 260171 266598 273930 281247 287740
54027 287740 293166 297624 301340 304557 307234 308993 309673 309713 309590 309140 307900 306004 304205 302967 301829
54012 301829 299746 295932 290458 284242 278421 273546 269361 265305 261080 256750 252509 248469 244516 240424
$$ packed form
54117A80792M619N721O024N497N074N075M540K631j15k546m084m763m765m452
54103A99248m270m175l712k904k342k162j809j125p71j094j460j281q76p50p86
54088A69731p10o47o28k61N06J057J039Q94R91J029Q30Q64J340J674J549J536
54072A80794J920J899R09j79k34M85R62R50Q23N06k65j095j442j551j855j969
54056A80658j326l45J34K22O35J356J766J867K199K739K997L102L585M271M467
54041B08327M239M377N043N550N576N526N581N415N127N410O427P332P317O493
54027B87740N426M458L716L217K677J759O80M0j23m50j240j896j799j238j138
54012C01829k083l814n474o216n821m875m185m056m225m330m241m040l953m092
$$ plain form
53998 240424 236340 233076 231435 231209 231266 230730 229659 228470 227260 226023 225111 225033 225955 227653 229803 232181
53982 232181 234797 238011 242366 248201 255410 263341 270575 275149 275754 272827 267964 262222 255683 248650
53968 248650 242218 237122 232821 228461 224296 221421 220295 220160 219874 218890 217520 216516 216354 216770 217106 217191
53952 217191 217556 218647 220240 221842 223296 224716 226210 227976 230357 233446 236899 240412 244111 248254
53938 248254 252830 257683 262715 267699 272225 276149 279730 283098 285916 287882 289253 290527 291996 293902
53924 293902 296605 300134 303927 307527 311339 316196 322355 329349 336711 344455 352867 362096 371816 381069
53910 381069 388681 394219 398470 402624 407043 411059 413791 414878 414529 413246 411551 409756 407863 405678
53896 405678 402990 399670 395701 391126 385853 379668 372612 365216 358021 350971 343616 335782 327656 319412
$$ packed form
53998B40424m084l264j641k26N7n36j071j189j210j237r12p8R22J698K150K378
53982B32181K616L214M355N835P209P931P234M574O05k927m863n742o539p033
53968B48650o432n096m301m360m165k875j126j35k86r84j370j004j62M16L36Q5
53952B17191L65J091J593J602J454J420J494J766K381L089L453L513L699M143
53938B48254M576M853N032M984M526L924L581L368K818J966J371J274J469J906
53924B93902K703L529L793L600L812M857O159O994P362P744Q412R229R720R253
53910C81069P612N538M251M154M419M016K732J087l49j283j695j795j893k185
53896D05678k688l320l969m575n273o185p056p396p195p050p355p834q126q244
$$ plain form
53882 319412 311349 304209 298583 293971 289219 284045 279357 275852 273168 270724 268490 266382 263768 260268
53868 260268 256438 252938 249593 245968 242373 239500 237409 235631 233980 232592 231310 229678 227446 224739
53854 224739 221967 219869 219124 219447 219618 219004 218470 218999 219962 219846 218388 216881 216337 216381 216090 215087 213481
53837 213481 211491 209555 208277 207881 207985 208124 208256 208648 209484 210617 211553 211801 211470 211313 211892 212919 213774
53820 213774 214352 214852 215088 214764 214363 214918 216764 219154 221342 223409 225761 228331 230783 233214 236143 239858
53804 239858 244106 248529 253225 258637 264845 271229 277086 282461 287902 293481 298606 302952 306911 310800
53790 310800 314267 317030 319540 322119 323967 323967 322310 320415 319234 318432 317340 315869 314208 312202 309429
53775 309429 305601 300744 295286 289909 284925 279823 273931 267587 262065 258202 255570 253175 250562 247929
$$ packed form
53882C19412q063p140n626m612m752n174m688l505k684k444k234k108k614l500
53868B60268l830l500l345l625l595k873k091j778j651j388j282j632k232k707
53854B24739k772k098p45L23J71o14n34N29R63j16j458j507n44M4k91j003j606
53837B13481j990j936j278l96J04J39J32L92Q36J133R36K48l31j57N79J027Q55
53820B13774N78N00K36l24m01N55J846K390K188K067K352K570K452K431K929L715
53804B39858M248M423M696N412O208O384N857N375N441N579N125M346L959L889
53790C10800L467K763K510K579J848%j657j895j181q02j092j471j661k006k773
53775C09429l828m857n458n377m984n102n892o344n522l863k632k395k613k633
$$ plain form
53761 247929 245560 243478 241488 239312 236791 234099 231709 230080 229358 229274 229245 228761 227826 226864 226046 224997
53745 224997 223418 221681 220414 219753 219420 219277 219343 219432 219332 219240 219538 220180 220732 220882 220512 219514 218166 217444
53727 217444 218184 219919 221306 221792 222125 223069 224436 225797 227416 229819 232773 235369 237013 237931 238708 239599
53711 239599 240411 240973 241635 243196 246151 250063 253865 256791 258901 260807 263102 266011 269391 273077 277253
53696 277253 282280 288002 293543 298085 301561 304303 306341 307497 307885 307836 307516 307030 306627 306307 305491 303709
53680 303709 301428 299679 299045 299518 300916 302725 303869 303636 302645 301977 301502 300203 298061 296344 295717 295336
53664 295336 294368 293298 293003 293449 294086 294759 295406 295517 294819 294056 294184 295107 295955 296391 296842 297564 298216 298418
53646 298418 298199 297843 297697 298104 299184 300677 302290 304044 306078 308349 310840 313772 317163 320371 322577
$$ packed form
53761B47929k369k082j990k176k521k692k390j629p22q4k9m84r35r62q18j049
53745B24997j579j737j267o61l33j43O6Q9j00r2K98O42N52J50l70r98j348p22
53727B17444P40J735J387M86L33R44J367J361J619K403K954K596J644R18P77Q91
53711B39599Q12N62O62J561K955L912L802K926K110J906K295K909L380L686M176
53696B77253N027N722N541M542L476K742K038J156L88m9l20m86m03l20q16j782
53680C03709k281j749o34M73J398J809J144k33r91o68m75j299k142j717o27l81
53664B95336r68j070k95M46O37O73O47J11o98p63J28R23Q48M36M51P22O52K02
53646B98418k19l56j46M07J080J493J613J754K034K271K491K932L391L208K206
$$ plain form
53631 322577 323629 324013 324191 324419 325053 326377 328050 329328 330029 330835 332328 334170 335684 336987 338924 341845
53615 341845 344969 347411 349480 352352 356461 360844 364393 367213 370172 373505 376643 379404 382495 386540
53601 386540 391169 395447 398836 401375 403300 404839 406141 407070 407256 406622 405626 404736 403860 402608 400954 399322
53585 399322 398107 397338 396744 395961 394763 393277 391830 390502 389035 387366 385903 384915 383886 381998 379286
53570 379286 376805 375437 374905 374283 373266 372440 372267 372288 371694 370426 369249 368774 368928 369465 370430 371764 372893
53553 372893 373183 372589 371484 370210 369219 369251 370573 372262 373054 372946 373219 374787 377292 380037 382967 386333
53537 386333 390043 393928 398172 402946 407999 413124 418708 425322 432977 441242 449912 459082 468745 478755
53523 478755 489153 500139 511739 523814 536349 549364 562586 575631 588631 602437 617921
$$ packed form
53631C22577J052L84J78K28O34J324J673J278P01Q06J493J842J514J303J937K921
53615C41845L124K442K069K872M109M383L549K820K959L333L138K761L091M045
53601C86540M629M278L389K539J925J539J302R29J86o34r96q90q76j252j654j632
53585C99322j215p69n94p83j198j486j447j328j467j669j463r88j029j888k712
53570C79286k481j368n32o22j017q26j73K1n94j268j177m75J54N37R65J334J129
53553C72893K90n94j105j274r91L2J322J689P92j08K73J568K505K745K930L366
53537C86333L710L885M244M774N053N125N584O614P655Q265Q670R170R663J0010
53523D78755J0398J0986J1600J2075J2535J3015J3222J3045J3000J3806J5484
$$ plain form
53512 617921 635249 654012 674023 695681 719419 744931 771211 797329 822902 847817 871899
53501 871899 895075 917486 939116 959694 979311 998777 1018800 1039098 1058895 1077999 1096724
53490 1096724 1115067 1132861 1150646 1169320 1188809 1208055 1226611 1245250 1264619 1284244 1303432
53479 1303432 1322242 1340813 1358500 1374575 1389228 1403033 1415852 1427095 1436665 1444668 1450449 1452853
53467 1452853 1451527 1447183 1440521 1431620 1420483 1407477 1393021 1377364 1361008 1344898 1329845 1315906
53455 1315906 1302395 1288344 1272913 1255730 1237005 1217264 1196904 1176138 1155223 1134473 1113975
53444 1113975 1093524 1072986 1052748 1033767 1017103 1003217 991731 982014 973958 967851 963502 959974
53432 959974 956428 952948 950323 949290 950203 953067 957501 962911 969001 975915 983792 992543 1002280 1013507
$$ packed form
53512F17921J7328J8763K0011K1658K3738K5512K6280K6118K5573K4915K4082
53501H71899K3176K2411K1630K0578J9617J9466K0023K0298J9797J9104J8725
53490A096724J8343J7794J7785J8674J9489J9246J8556J8639J9369J9625J9188
53479A303432J8810J8571J7687J6075J4653J3805J2819J1243R570Q003N781K404
53467A452853j326m344o662q901j1137j3006j4456j5657j6356j6110j5053j3939
53455A315906j3511j4051j5431j7183j8725j9741k0360k0766k0915k0750k0498
53444A113975k0451k0538k0238j8981j6664j3886j1486r717q056o107m349l528
53432I59974l546l480k625j033R13K864M434N410O090O914P877Q751R737J1227
$$ plain form
53418 1013507 1026527 1041110 1057180 1075300 1095819 1117919 1140296 1162606 1185530 1209544 1234470
53407 1234470 1260347 1287890 1317644 1349231 1381927 1415735 1451501 1490063 1531536 1575395 1621126
53396 1621126 1668722 1718505 1770480 1824014 1878262 1932761 1987475 2042483 2097848 2153536 2209178
53385 2209178 2264035 2317540 2369767 2421006 2470963 2518753 2563692 2605774 2645279 2682114 2715613
53374 2715613 2744851 2769164 2788485 2803180 2813505 2819304 2820209 2815803 2805406 2787970 2762594 2729183
53362 2729183 2688661 2642793 2593796 2543508 2492477 2440172 2386374 2332006 2278181 2224967 2171823
53351 2171823 2118970 2067532 2018348 1971344 1926124 1882440 1839915 1797973 1756391 1715449 1675260
53340 1675260 1635381 1595521 1556336 1519144 1484948 1453980 1425998 1400650 1377494 1355940 1335506
$$ packed form
53418A013507J3020J4583J6070J8120K0519K2100K2377K2310K2924K4014K4926
53407A234470K5877K7543K9754L1587L2696L3808L5766L8562M1473M3859M5731
53396A621126M7596M9783N1975N3534N4248N4499N4714N5008N5365N5688N5642
53385B209178N4857N3505N2227N1239M9957M7790M4939M2082L9505L6835L3499
53374B715613K9238K4313J9321J4695J0325N799R05m406j0397j7436k5376l3411
53362B729183m0522m5868m8997n0288n1031n2305n3798n4368n3825n3214n3144
53351B171823n2853n1438m9184m7004m5220m3684m2525m1942m1582m0942m0189
53340A675260l9879l9860l9185l7192l4196l0968k7982k5348k3156k1554k0434
$$ plain form
53329 1335506 1316226 1298756 1283771 1271102 1259514 1247504 1234260 1219852 1204793 1189693 1175149
53318 1175149 1161543 1148877 1137022 1126101 1116425 1108106 1100976 1094888 1089916 1086247 1084030 1083270 1083704
53305 1083704 1084887 1086606 1089178 1093166 1098884 1106366 1115648 1126862 1140084 1155332 1172657 1192077 1213469
53292 1213469 1236613 1261272 1287144 1313980 1341781 1370487 1399326 1426879 1452223 1475698 1498116
53281 1498116 1519535 1539274 1556813 1572054 1584866 1594999 1602399 1607028 1608415 1605993 1599956 1591198
53269 1591198 1580298 1567136 1551618 1534151 1515057 1494029 1470682 1445392 1419188 1392896 1366663
53258 1366663 1340203 1313248 1285734 1257665 1228938 1199436 1169398 1139603 1110950 1083840 1058056
53247 1058056 1033155 1008806 984788 960861 936700 911969 886694 861633 837922 816057 795491
$$ packed form
53329A335506j9280j7470j4985j2669j1588j2010j3244j4408j5059j5100j4544
53318A175149j3606j2666j1855j0921r676q319p130o088m972l669k217p60M34
53305A083704J183J719K572L988N718P482R282J1214J3222J5248J7325J9420K1392
53292A213469K3144K4659K5872K6836K7801K8706K8839K7553K5344K3475K2418
53281A498116K1419J9739J7539J5241J2812J0133P400M629J387k422o037q758
53269A591198j0900j3162j5518j7467j9094k1028k3347k5290k6204k6292k6233
53258A366663k6460k6955k7514k8069k8727k9502l0038k9795k8653k7110k5784
53247A058056k4901k4349k4018k3927k4161k4731k5275k5061k3711k1865k0566
$$ plain form
53236 795491 775556 756426 738690 722220 706200 690322 675366 662397 651789 643182 635999 629732
53224 629732 623933 618042 611198 602454 591596 579681 568239 557795 547478 536161 523598 510358
53212 510358 497135 484453 472719 462133 452500 443337 434346 425800 418381 412396 407157 401446 394753
53199 394753 387676 380897 374240 367236 360113 353467 347202 340612 333515 326497 319967 313692 307536 301930
53185 301930 297271 293361 289767 286220 282375 277750 272487 267762 264865 263890 263683 263033 261727 260544 260346
53170 260346 261111 261861 261724 260936 260400 260328 259920 258551 256629 254913 253542 252236 251028 250176 249557 248818 248086
53153 248086 247956 248564 249109 248591 246873 244766 243096 241927 240835 239736 239102 239272 239945 240613 241208 241918 242603
53136 242603 242948 243125 243660 244587 245336 245716 246397 248015 250254 252292 253828 255101 256142 256644 256692 257025 258267
$$ packed form
53236G95491j9935j9130j7736j6470j6020j5878j4956j2969j0608q607p183o267
53224F29732n799n891o844q744j0858j1915j1442j0444j0317j1317j2563j3240
53212E10358j3223j2682j1734j0586r633r163q991q546p419n985n239n711o693
53199C94753p077o779o657p004p123o646o265o590p097p018o530o275o156n606
53185C01930m659l910l594l547l845m625n263m725k897r75k07o50j306j183j98
53170B60346P65P50j37p88n36p2m08j369j922j716j371j306j208q52o19p39p32
53153B48086j30O08N45n18j718k107j670j169j092j099o34J70O73O68N95P10O85
53136B42603L45J77N35R27P49L80O81J618K239K038J536J273J041N02M8L33J242
$$ plain form
53119 258267 260125 261675 262390 262644 263136 264004 264771 265082 265131 265239 265339 265159 264681 264041 263175 261975 260691 259685
53101 259685 258778 257398 255444 253572 252447 252127 252337 252854 253357 253360 252751 252119 252103 252542 252631 251846 250370 248642
53083 248642 246891 245244 243989 243435 243503 243657 243353 242491 241391 240458 240033 240363 241339 242198 241941 240296 238011
53066 238011 236034 234665 233722 233089 232751 232608 232651 233027 233586 233775 233379 232954 232967 233039 232750 232687 233714 235569 237247
53047 237247 238610 240402 242632 244231 244605 244360 244046 243382 242336 241821 242336 242858 242165 240707 240040 240710 241730
53030 241730 242048 241630 241065 240863 241251 242093 242825 242890 242388 241993 242215 242990 243939 244728 245162 245193 244873 244285 243588
53011 243588 243204 243617 244811 246114 246797 246678 246012 245133 244437 244320 244800 245385 245680 245895 246467 247333 247931 247868
52993 247868 247376 247116 247628 248812 249975 250602 251134 252630 255540 259172 262474 264912 266403 266990 267016 267197
$$ packed form
53119B58267J858J550P15K54M92Q68P67L11M9J08J00j80m78o40q66j200j284j006
53101B59685r07j380j954j872j125l20K10N17N03Lo09o32j6M39Q9p85j476j728
53083B48642j751j647j255n54O8J54l04q62j100r33m25L30R76Q59k57j645k285
53066B38011j977j369r43o33l38j43M3L76N59J89l96m25J3P2k89o3J027J855J678
53047B37247J363J792K230J599L74k45l14o64j046n15N15N22o93j458o67O70J020
53030B41730L18m18n65k02L88Q42P32O5n02l95K22P75R49P89M34L1l20n88o97
53011B43588l84M13J194J303O83j19o66q79o96j17M80N85K95K15N72Q66N98o3
52993B47868m92k60N12J184J163O27N32J496K910L632L302K438J491N87K6J81
$$ plain form
52977 267197 268002 269179 270230 271062 271812 272336 272379 272126 272080 272432 272893 273113 273019 272725 272371 272078 271979 272220 272771
52958 272771 273122 272398 270266 267628 265895 265484 265524 265100 264149 263018 261841 260717 259880 259294 258568 257602 256744
52941 256744 256000 254794 252994 251457 250932 251011 250906 250635 250648 250758 250483 250160 250698 252218 253745 254390 254183 253629
52923 253629 253004 252256 251265 250055 248921 248268 248208 248550 249237 250340 251436 251705 251082 250648 251233 252266 252741
52906 252741 252698 252785 252901 252364 251115 249689 248194 246486 245240 245548 247322 249202 250292 250965 251690 252241 252546
52889 252546 253306 255040 257156 258620 259022 258545 257452 256131 255109 254496 253862 253091 252884 253909 255856 257890
52873 257890 259738 261764 264217 266939 269682 272257 274450 276117 277335 278195 278570 278318 277514 276231 274321
52858 274321 271764 269047 266727 264686 262246 259092 255699 252658 249938 247136 244252 241747 239798 237967
$$ packed form
52977B67197Q05J177J051Q32P50N24M3k53m6L52M61K20r4k94l54k93r9K41N51
52958B72771L51p24k132k638j733m11M0m24r51j131j177j124q37n86p26r66q58
52941B56744p44j206j800j537n25P9j05k71J3J10k75l23N38J520J527O45k07n54
52923B53629o25p48r91j210j134o53o0L42O87J103J096K69o23m34N85J033M75
52906B52741m3Q7J16n37j249j426j495j708j246L08J774J880J090O73P25N51L05
52889B52546P60J734K116J464M02m77j093j321j022o13o34p71k07J025J947K034
52873B57890J848K026K453K722K743K575K193J667J218Q60L75k52q04j283j910
52858B74321k557k717k320k041k440l154l393l041k720k802k884k505j949j831
$$ plain form
52844 237967 235855 233748 232172 231085 230100 229409 229714 231037 232323 232662 232315 232039 231981 231946 232295 233639 235801
52827 235801 237905 239478 240689 241530 241608 240977 240448 240680 241431 241972 241857 241124 240223 239947 241011 243379 246286
52810 246286 248971 251019 252013 251517 249694 247371 245133 242781 240029 237240 234994 233314 231857 230613 229841
52795 229841 229453 229075 228769 229185 230698 232736 234282 234998 235522 236602 238127 239254 239454 239108 238919 239001 238821
52778 238821 237954 236568 235224 234419 234282 234438 234232 233346 232245 231732 232047 232618 232719 232155 231230 230261 229269 228128
52760 228128 226982 226413 226982 228524 230196 231415 232486 234037 236070 237992 239400 240471 241638 243211 245322
52745 245322 247921 250800 253712 256413 258576 259954 260786 261694 262983 264437 265976 267858 269886 271088 270927
52730 270927 270268 270302 270879 270803 269507 267522 265405 263164 260776 258478 256420 254675 253597 253506 254085 254805 255766
$$ packed form
52844B37967k112k107j576j087r85o91L05J323J286L39l47k76n8l5L49J344K162
52827B35801K104J573J211Q41P8o31n29K32P51N41j15p33r01k76J064K368K907
52810B46286K685K048R94m96j823k323k238k352k752k789k246j680j457j244p72
52795B29841l88l78l06M16J513K038J546P16N24J080J525J127K00l46j89Q2j80
52778B38821q67j386j344q05j37J56k06q86j101n13L15N71J01n64r25r69r92j141
52760B28128j146n69N69J542J672J219J071J551K033J922J408J071J167J573K111
52745B45322K599K879K912K701K163J378Q32R08J289J454J539J882K028J202j61
52730B70927o59L4N77p6j296j985k117k241k388k298k058j745j078r1N79P20R61
$$ plain form
52713 255766 257297 258897 259582 259258 258674 258009 256725 255032 254212 254900 256135 256765 256813 256788 256501 255452 253744
52696 253744 251869 250070 248550 247801 248055 248802 249399 249718 249846 249692 249361 249326 249654 249704 249080 248279 247769 247158
52678 247158 246015 244822 244190 243690 242548 241133 240673 241607 243213 244829 246501 248295 249819 250686 250935 250777
52662 250777 250427 250279 250838 252344 254705 257746 261190 264590 267638 270407 272862 274380 274314 272910 271089
52647 271089 269365 267494 265202 262701 260401 258576 257378 256811 256577 256326 256046 255889 255708 255200 254587 254724
52631 254724 256450 260034 265168 271034 276375 280008 281516 281243 279669 277166 274307 271781 269713 267476
52617 267476 264596 261597 259589 259069 259404 259455 258529 256757 254869 253698 253713 254730 256036 256955 257389 257719 258191
52600 258191 258627 258858 259111 259603 259982 259612 258385 256839 255523 254707 254700 255787 257618 259233 260098 260785 262241
$$ packed form
52713B55766J531J600O85l24n84o65j284j693q20O88J235O30M8k5k87j049j708
52696B53744j875j799j520p49K54P47N97L19J28j54l31l5L28N0o24q01n10o11
52678B47158j143j193o32n00j142j415m60R34J606J616J672J794J524Q67K49j58
52662B50777l50j48N59J506K361L041L444L400L048K769K455J518o6j404j821
52647B71089j724j871k292k501k300j825j198n67k34k51k80j57j81n08o13J37
52631B54724J726L584N134N866N341L633J508k73j574k503k859k526k068k237
52617B67476k880k999k008n20L35N1r26j772j888j171J5J017J306R19M34L30M72
52600B58191M36K31K53M92L79l70j227j546j316q16pJ087J831J615Q65O87J456
$$ plain form
52583 262241 264708 267661 270496 272839 274360 274772 274087 272730 271321 270281 269522 268605 267475 266861 267404 268488
52567 268488 268606 267105 264864 263026 261786 260843 260269 260230 260323 259964 259193 258455 257831 257017 255930 254860 254124
52550 254124 253885 254094 254371 254307 254180 254806 256327 257710 258014 257541 257059 256623 256050 255930 256898 258236 258545 257820
52532 257820 257558 258595 260041 260712 260475 259649 258156 256144 254622 254472 255276 255972 256486 257810 260557 264149
52516 264149 267521 270038 271508 271973 271939 272487 274609 278308 282664 286808 290491 293571 295337 294949 292524
52501 292524 289260 286271 283660 280967 278151 275690 273861 272358 270653 268541 266277 264306 262849 261769
52487 261769 260889 260357 260455 261112 261996 263069 264571 266335 267640 268091 268223 268927 270577 272963 275580 277728
52471 277728 278764 278792 278765 279542 281127 283115 285416 288119 291130 294373 297904 301345 303776 304764 305003 305257
$$ packed form
52583B62241K467K953K835K343J521M12o85j357j409j040p59r17j130o14N43J084
52567B68488J18j501k241j838j240r43n74l9R3l59p71p38o24q14j087j070p36
52550B54124k39K09K77o4j27O26J521J383L04m73m82m36n73j20R68J338L09p25
52532B57820k62J037J446O71k37q26j493k012j522j50Q04O96N14J324K747L592
52516B64149L372K517J470M65l4N48K122L699M356M144L683L080J766l88k425
52501B92524l264k989k611k693k816k461j829j503j705k112k264j971j457j080
52487B61769q80n32R8O57Q84J073J502J764J305M51J32P04J650K386K617K148
52471B77728J036K8k7P77J585J988K301K703L011L243L531L441K431R88K39K54
$$ plain form
52455 305257 305175 303888 301337 298139 294573 290614 286717 283513 280856 278097 275260 273059 271730 270716 269607
52440 269607 268591 267840 267177 266479 265782 264953 263877 262900 262421 262145 261507 260744 260659 261354 262101 262562 263199 264311
52422 264311 265571 266749 268024 269347 270335 271016 271885 273064 274303 275979 278954 283084 287096 290591 295142
52407 295142 302529 312645 323845 334584 343818 350476 353637 353125 349392 343129 335371 327435 320173 313723
52393 313723 308411 305074 303857 303421 302269 300343 298472 296831 295058 293474 292953 293598 294567 295293 296006 296975
52377 296975 298083 299308 300813 302426 303769 305164 307629 311650 316570 321564 326544 331640 336366 339927
52363 339927 342052 342930 342615 341210 339549 338898 339609 340574 340503 339487 338768 339116 340034 340738 341267 342145 343344
52346 343344 344256 344661 345100 346204 348098 350591 353535 356763 360046 363294 366643 370255 374319 379236 385357
$$ packed form
52455C05257q2j287k551l198l566l959l897l204k657k759k837k201j329j014j109
52440B69607j016p51o63o98o97q29j076r77m79k76o38p63q5O95P47M61O37J112
52422B64311J260J178J275J323R88O81Q69J179J239J676K975M130M012L495M551
52407B95142P387J0116J1200J0739R234O658L161n12l733o263p758p936p262o450
52393C13723n312l337j217m36j152j926j871j641j773j584n21O45R69P26P13R69
52377B96975J108J225J505J613J343J395K465M021M920M994M980N096M726L561
52363C39927K125Q78l15j405j661o51P11R65p1j016p19L48R18P04N29Q78J199
52346C43344R12M05M39J104J894K493K944L228L283L248L349L612M064M917O121
$$ plain form
52331 385357 392425 399763 407204 415409 425028 435985 447889 460692 474572 489483 505199 521446
52319 521446 537612 552690 566044 578062 589682 601489 613693 626706 641115 657055 674037
52308 674037 691420 708714 725503 741532 756998 772480 788439 804919 821652 838198 853993
52297 853993 868506 881405 892426 901148 907142 910412 911545 911344 910330 908498 905430 900682 894228 886584
52283 886584 878523 870736 863738 857843 853057 849148 845961 843611 842350 842382 843857 846808 850955 855756 860831
52268 860831 866234 872207 878832 886015 893719 902030 911103 921082 932042 943964 956782 970378 984463
52255 984463 998691 1013112 1028272 1044399 1060613 1075412 1087990 1098603 1107638 1114857 1119738 1122061
52243 1122061 1121902 1119454 1115103 1109383 1102634 1094956 1086568 1077822 1068787 1059224 1049101 1038699 1028166
$$ packed form
52331C85357P068P338P441Q205R619J0957J1904J2803J3880J4911J5716J6247
52319E21446J6166J5078J3354J2018J1620J1807J2204J3013J4409J5940J6982
52308F74037J7383J7294J6789J6029J5466J5482J5959J6480J6733J6546J5795
52297H53993J4513J2899J1021Q722N994L270J133k01j014j832l068m748o454p644
52283H86584q061p787o998n895m786l909l187k350j261L2J475K951M147M801N075
52268H60831N403N973O625P183P704Q311R073R979J0960J1922J2818J3596J4085
52255I84463J4228J4421J5160J6127J6214J4799J2578J0613R035P219M881K323
52243A122061j59k448m351n720o749p678q388q746r035r563j0123j0402j0533
$$ plain form
52230 1028166 1017525 1007202 997848 989426 981176 972808 965022 958448 952841 947863 943825 940864 938079
52217 938079 934528 930762 928420 928426 930361 933471 937371 941710 945946 949748 953211 956510 959665 962675 965592
52202 965592 968528 971841 976083 981435 987447 993663 1000177 1007143 1014221 1021163 1028466 1036537 1044408 1050260
52188 1050260 1053299 1054303 1054254 1053274 1051047 1047455 1042418 1035781 1027788 1019155 1010405 1001603 992965 985089 978159
52173 978159 971530 964669 958164 953223 950342 948926 948169 947894 948515 950410 953371 956580 959194 961050 962717
52158 962717 964817 967447 970234 972659 974177 974336 973128 971175 969350 968214 967842 968086 968833 970001 971416
52143 971416 972758 973652 973829 973155 971541 969009 965952 963201 961643 961737 963439 966461 970474 975224 980727
52128 980727 987405 995894 1006725 1020145 1036020 1053801 1072807 1092742 1113768 1135914 1158644 1181295
$$ packed form
52230A028166j0641j0323r354q422q250q368p786o574n607m978m038k961k785
52217I38079l551l766k342OJ935L110L900M339M236L802L463L299L155L010K917
52202I65592K936L313M242N352O012O216O514O966P078O942P303Q071P871N852
52188A050260L039J004m9r80k227l592n037o637p993q633q750q802q638p876o930
52173I78159o629o861o505m941k881j416p57k75O21J895K961L209K614J856J667
52158I62717K100K630K787K425J518J59j208j953j825j136l72K44P47J168J415
52143I71416J342Q94J77o74j614k532l057k751j558R4J702L022M013M750N503
52128I80727O678Q489J0831J3420J5875J7781J9006J9935K1026K2146K2730K2651
$$ plain form
52116 1181295 1203785 1226572 1250028 1274032 1298022 1321081 1342177 1360731 1377086 1392204 1406922
52105 1406922 1421576 1436031 1449755 1462035 1472528 1481489 1489164 1495072 1498314 1498450 1495617 1489878 1481028
52092 1481028 1469163 1454958 1439155 1422141 1404285 1386396 1369529 1354318 1340617 1327776 1315279
52081 1315279 1303194 1291938 1281664 1272120 1263219 1255412 1249231 1244768 1241963 1241115 1242585 1246126 1251012
$$ packed form
52116A181295K2490K2787K3456K4004K3990K3059K1096J8554J6355J5118J4718
52105A406922J4654J4455J3724J2280J0493Q961P675N908L242J36k833n739q850
52092A481028j1865j4205j5803j7014j7856j7889j6867j5211j3701j2841j2497
52081A315279j2085j1256j0274r544q901p807o181m463k805q48J470L541M886
$$ [...]
##END NTUPLES=NMR SPECTRUM
##END=
