##TITLE=AC1435_CAUAH13244_8011448_WKsL3sx1ML
##JCAMPDX= 6.0         $$ Bruker NMR JCAMP-DX V2.0
##DATA TYPE= NMR SPECTRUM
##DATA CLASS= NTUPLES
##ORIGIN= BRUKER
##OWNER= Administrator
$$ 1.72 TOPSPIN		Version 2.1
$$ 2013-07-05 15:41:34.637 -0700  Administrator@X
$$ Compression mode = diff/dup
##.OBSERVE FREQUENCY= 400.02188249412
##.OBSERVE NUCLEUS= ^1H
##.ACQUISITION MODE= SIMULTANEOUS (DQD)
##.ACQUISITION SCHEME= undefined
##.AVERAGES= 8
##.DIGITISER RES= 22
##SPECTROMETER/DATA SYSTEM= spect
##.PULSE SEQUENCE= zg30
##.SOLVENT NAME= COFFEE_meoh
##.SHIFT REFERENCE= INTERNAL, COFFEE_meoh, 1, 14.98509
##AUDIT TRAIL= $$ (NUMBER, WHEN, WHO, WHERE, PROCESS, VERSION, WHAT)
$$ ##TITLE= Audit trail, TOPSPIN		Version 2.1
$$ ##JCAMPDX= 5.01
$$ ##ORIGIN= Bruker BioSpin GmbH
$$ ##OWNER= Administrator
$$ $$ E:\/data/COFFEE/nmr/AC1435_CAUAH13244_8011448_WKsL3sx1ML/10/pdata/1/auditp.txt
$$ ##AUDIT TRAIL=  $$ (NUMBER, WHEN, WHO, WHERE, PROCESS, VERSION, WHAT)
(   1,<2013-07-05 15:41:26.824 -0700>,<Administrator>,<X>,<go>,<TOPSPIN 2.1>,
      <created by zg
	started at 2013-07-05 15:40:20.516 -0700,
	POWCHK enabled, PULCHK disabled,
       configuration hash MD5:
       C8 4E 4E 5D D3 5C D8 9E 9F 52 82 E0 59 8A DE 15
       data hash MD5: 64K
       E1 86 8B CF BF EC 76 C3 BB EE 0A F4 A4 0A 45 22>)
(   2,<2013-07-05 15:41:30.121 -0700>,<Administrator>,<X>,<proc1d>,<TOPSPIN 2.1>,
      <Start of raw data processing
       efp LB = 0 FT_mod = 6 PKNL = 1 PHC0 = 0 PHC1 = 0 SI = 32K 
       data hash MD5: 32K
       73 B6 A4 54 F4 6F 0A EB 61 D9 F0 5D 17 7E 3A 33>)
(   3,<2013-07-05 15:41:30.496 -0700>,<Administrator>,<X>,<proc1d>,<TOPSPIN 2.1>,
      <pk PHC0 = 93.31238 PHC1 = 0 
       data hash MD5: 32K
       C9 02 E6 F7 51 11 13 26 7A 37 37 B9 ED 20 9F D4>)
(   4,<2013-07-05 15:41:30.746 -0700>,<Administrator>,<X>,<proc1d>,<TOPSPIN 2.1>,
      <abs ABSG = 1 
       data hash MD5: 32K
       99 4A 06 4A BD AD F8 D5 DF 68 04 4F 6A 25 B2 16>)
(   5,<2013-07-05 15:41:30.856 -0700>,<Administrator>,<X>,<proc1d>,<TOPSPIN 2.1>,
      <abs ABSG = 2 
       data hash MD5: 32K
       2A 01 FB 29 A1 35 86 91 3F 7D 19 42 5E D1 8E DF>)
(   6,<2013-07-05 15:41:30.903 -0700>,<Administrator>,<X>,<proc1d>,<TOPSPIN 2.1>,
      <abs ABSG = 3 
       data hash MD5: 32K
       C6 D5 63 C7 BA 03 A6 AB 2C 50 A6 E2 F2 3A A2 C7>)
(   7,<2013-07-05 15:41:30.981 -0700>,<Administrator>,<X>,<proc1d>,<TOPSPIN 2.1>,
      <abs ABSG = 4 
       data hash MD5: 32K
       E7 72 DA DA AC D5 01 00 7D 52 15 2A 92 0A B2 4F>)
(   8,<2013-07-05 15:41:31.090 -0700>,<Administrator>,<X>,<proc1d>,<TOPSPIN 2.1>,
      <abs ABSG = 5 
       data hash MD5: 32K
       35 58 A8 82 6F 01 A4 0B EF 58 1C 3C 95 CF AD E1>)
$$ ##END=
$$ 
$$ $$ hash MD5
$$ $$ CA 01 B8 D4 81 D8 7A 20 53 C1 E3 B5 95 3E 83 F2
##$RELAX= 
##$RELAX= 
##$RELAX= 
##$RELAX= 
##$RELAX= 
##$RELAX= 
##$RELAX= 
$$ Bruker specific parameters
$$ --------------------------
##$DU= <E:\>
##$EXPNO= 10
##$NAME= <AC1435_CAUAH13244_8011448_WKsL3sx1ML>
$$ [...]
##$TP= (0..7)
150 150 150 150 150 150 150 150
##$TP07= 0
##$TPNAME0= <>
##$TPNAME1= <>
##$TPNAME2= <>
##$TPNAME3= <>
##$TPNAME4= <>
##$TPNAME5= <>
##$TPNAME6= <>
##$TPNAME7= <>
##$TPOAL= (0..7)
0.5 0.5 0.5 0.5 0.5 0.5 0.5 0.5
##$TPOFFS= (0..7)
0 0 0 0 0 0 0 0
##$TUNHIN= 0
##$TUNHOUT= 0
##$TUNXOUT= 0
##$USERA1= <user>
##$USERA2= <user>
##$USERA3= <user>
##$USERA4= <user>
##$USERA5= <user>
##$V9= 5
##$VALIST= <valist>
##$VCLIST= <CCCCCCCCCCCCCCC>
##$VD= 0
##$VDLIST= <DDDDDDDDDDDDDDD>
##$VPLIST= <PPPPPPPPPPPPPPP>
##$VTLIST= <TTTTTTTTTTTTTTT>
##$WBST= 1024
##$WBSW= 4
##$XGAIN= (0..3)
0 0 0 0
##$XL= 0
##$YL= 0
##$YMAX_a= 638012
##$YMIN_a= -540184
##$ZGOPTNS= <>
##$ZL1= 120
##$ZL2= 120
##$ZL3= 120
##$ZL4= 120
##$ABSF1= 14.98509
##$ABSF2= -5.573092
##$ABSG= 5
##$ABSL= 3
##$ALPHA= 0
##$AQORDER= 0
##$ASSFAC= 0
##$ASSFACI= 0
##$ASSFACX= 0
##$ASSWID= 0
##$AUNMP= <proc_prof1d_extract_pilot.lims>
##$AXLEFT= 0
##$AXNAME= <>
##$AXNUC= <1H>
##$AXRIGHT= 0
##$AXTYPE= 0
##$AXUNIT= <>
##$AZFE= 0.1
##$AZFW= 0.1
##$BCFW= 0
##$BC_mod= 0
##$BYTORDP= 0
##$COROFFS= 0
##$CY= 15
##$DATMOD= 1
##$DC= 0
##$DFILT= <>
##$DTYPP= 0
##$F1P= 0
##$F2P= 0
##$FCOR= 0.5
##$FTSIZE= 32768
##$FT_mod= 6
##$GAMMA= 0
##$GB= 0
##$INTBC= 1
##$INTSCL= 1
##$ISEN= 128
##$LB= 0
##$LEV0= 0
##$LPBIN= 0
##$MAXI= 10000
##$MC2= 0
##$MEAN= 0
##$ME_mod= 0
##$MI= 0
##$NCOEF= 0
##$NC_proc= -8
##$NLEV= 6
##$NOISF1= 0
##$NOISF2= 0
##$NSP= 0
##$NTH_PI= 0
##$NZP= 0
##$OFFSET= 14.98509
##$PC= 1
##$PHC0= 93.31238
##$PHC1= 0
##$PH_mod= 1
##$PKNL= yes
##$PPARMOD= 0
##$PPDIAG= 0
##$PPIPTYP= 0
##$PPMPNUM= 2147483647
##$PPRESOL= 1
##$PSCAL= 4
##$PSIGN= 0
##$PYNMP= <proc.py>
##$REVERSE= no
##$SF= 400.02
##$SI= 32768
##$SIGF1= 0
##$SIGF2= 0
##$SINO= 400
##$SIOLD= 32768
##$SPECTYP= <>
##$SREGLST= <1H.CDCl3>
##$SSB= 0
##$STSI= 32768
##$STSR= 0
##$SW_p= 8223.68421052631
##$SYMM= 0
##$S_DEV= 0
##$TDeff= 65536
##$TDoff= 0
##$TI= <>
##$TILT= no
##$TM1= 0
##$TM2= 0
##$TOPLEV= 0
##$USERP1= <user>
##$USERP2= <user>
##$USERP3= <user>
##$USERP4= <user>
##$USERP5= <user>
##$WDW= 1
##$XDIM= 32768
##$YMAX_p= 472533223
##$YMIN_p= -704122
##$CURPLOT= <Network HP LaserJet P1505>
##$CURPRIN= <$Network HP LaserJet P1505>
##$DFORMAT= <normdp>
##$LAYOUT= <+/1D_H.xwp>
##$LFORMAT= <normlp>
##$PFORMAT= <normpl>
##$SURQMSG= 1
$$ End of Bruker specific parameters
$$ ---------------------------------
##NTUPLES= NMR SPECTRUM
##VAR_NAME=  FREQUENCY,     SPECTRUM/REAL,   SPECTRUM/IMAG
##SYMBOL=    X,             R,               I
##VAR_TYPE=  INDEPENDENT,   DEPENDENT,       DEPENDENT
##VAR_FORM=  AFFN,          ASDF,            ASDF
##VAR_DIM=   32768,         32768,           32768
##UNITS=     HZ,            ARBITRARY UNITS, ARBITRARY UNITS
##FACTOR=    0.250966925370066, 1,           1
##FIRST=     8223.43324360094, -115099,      -37046
##LAST=      0,             -8282,           -77802
##MIN=       0,             -704122,         0
##MAX=       8223.43324360094, 472533223,    0
$$ Real data points
##PAGE= N=1
##DATA TABLE= (X++(R..R)), XYDATA
$$ [...]
19533d79050a58006K2336e4157a9994P632r169A50629b4641j15848D5067b94350
19521A34753i7545G8752f25944a08153R798B22021q9422J06180K6366l5666o4654
19510A64825a63634Q1759l04815J71439p3421E9297j8185a12542E8298g1364j99254
19499b70618A66731a02852j25355E7756a24319B31708a8124B92343c52118b8077
19488h4350k4535e2745A28623a75276a2090k03975A34342k1045l7475a32204b4362
19476A9070J1312K47737a87095B24215a6538q435o0939m8785b0252j76788O1617
19465a35423A6551J7558b1487j80795L9329k37408Q3213G3543J74493c72085a47141
19453a74062j17406a8913j95761k4888M4134M7514H4189b46462c9613F157J76753
$$ y = [-479050, -158006, -135670, -54157, -19994, -12362, -21531, 150629, -24641, -140489, 45067, -294350, 134753, -97545, 78752, -625944, -108153, -98355, 222021, 132599, 238779, 265145, 229479, 164825, -163634, -81875, -386690, -215251, -288672, 59297, 41112, -112542, 58298, -71364, -270618, 166731, -102852, -228207, 57756, -124319, 231708, -18124, 292343, -352118, -28077, -84350, -108885, -52745, 128623, -175276, -12090, -216065, 134342, 113297, 75822, -132204, -24362, 19070, 30382, 278119, -187095, 224215, -16538, -24973, -85912, -134697, -20252, -197040, -135423, 16551, 34109, -21487, -202282, -162953, -400361, -317148, 73543, 248036, -372085, -147141, -174062, -291468, -18913, -214674, -239562, -195428, -147914, 84189, -246462, -39613, 6157, 182910]
19442A82910c84624A75837G5214J84840a2650j70897j32972E02478a38112C40
19431c59903A6483N132k513K2774a46921E7200c3752J5085B72888C9006K29025
19420B68031B4585b24871a9720n16356K06322a18537a9369C26677b3392k12475
19410b35867g1630k20740J36819i504k57553j05850a40200A95397b52408E2009
19399b8210L779m53589J89746J18249L8661H6310a34273j70998K8402Q3803A85669
19387B724a60740L9266B9027c7078J0060j71106B81352b38056A39931B8535J79579
19376B08114I4901a25857O208C9362d6573A40745e0644B67056b01566d3520j02353
19365a45873A17413l3665c92894h224o0398B4113b8463A64211a78483M1942j86517
$$ y = [182910, -384624, 175837, 75214, 260054, -12650, -183547, -316519, 502478, -138112, 340, -359903, 16483, 21615, 19102, 41876, -146921, 57200, -33752, -18667, 272888, 39006, 268031, 24585, -224871, -19720, -536076, -329754, -118537, -19369, 326677, -23392, -235867, -71630, -292370, -155551, -9504, -267057, -372907, -140200, 195397, -252408, 52009, -28210, -24431, -478020, -288274, -170025, -131364, 86310, -134273, -305271, -276869, -193066, 185669, 2724, -160740, -121474, 29027, -37078, -27018, -198124, 281352, -238056, 139931, 28535, 208114, 94901, -125857, -119649, 39362, -46573, 140745, -50644, 267056, -201566, -43520, -145873, 117413, 83748, -392894, -8224, -68622, 24113, -28463, 164211, -178483, -136541, -323058]
19354c23058b495j85921P0940j99067a43008A20269h9386J0985b2652A19230a20651
19342e8851D5610O6734c49761a06021C8076N8926f5598l10941a13762F0761b51573
19330d6759j05672q8714B5745f3050b8241G3649i5790P704e6l38785g5973A25266
19317a63657D6879d7689r8603A22431J37986D1437Q5928b49003C5172g183l1008
19306c8191F1774i6493l76258a62992A8478L0455J22432c923k3134C8536a50724
19294A02968A0708O5323j092h8655b5628k22973i2600K5916E1912k2016N6016
19283H5912a55528B20269p8923g2743A06199a96479D9799K65524b501l62180B2594
19271i6697B6626K3541a95271D66992D2866d42524b11728N1161j54245A26338
$$ y = [-323058, -2495, -188416, -117476, -316543, -143008, 120269, -89386, -78401, -22652, 119230, -120651, -58851, 45610, 112344, -349761, -106021, 38076, 97002, -65598, -376539, -113762, 60761, -251573, -46759, -152431, -241145, 25745, -63050, -28241, 73649, -95790, -88086, -56, -338841, -75973, 125266, -163657, 46879, -47689, -146292, 122431, 260417, 41437, 127365, -249003, 35172, -7183, -38191, 61774, -96493, -472751, -162992, 18478, 48933, 171365, -3923, -27057, 38536, -150724, 102968, 10708, 76031, 74939, -88655, -25628, -248601, -92600, -66684, 51912, 29896, 85912, -155528, 220269, 141346, -72743, 106199, -196479, 49799, 315323, -2501, -364681, 22594, -96697, 26626, 50167, -195271, 466992, 42866, -442524, -211728, -160567, -314812, 126338]
19260e0132F1156b2053e982B47908o5251a53535p737g3105j40704a05918B0238
19248a06966j26689K3082n3721a5684B53115a00829B31832j11746a16716M6200
19238g0516r3928d1626B45004a94378b1813j90253J05962j00631p5136d9763A37919
19226A24609b74255a22330D7635b09272A31201A7125J16147C3393j988a22181
19215a60752N3380l2271N2021j10120C14381D5449f4799l6289j32433B19763a33016
19203b74289O1364a04439B34054j16685B0863J72968a29176e7856k87575Q9101
19193b56330P2480c6376j41910Q7335p2982B46308j1200g5758H5370a90881q5820
19182b76701a04730k824n0367g537r1880k27791J60370D7455M0864c299j73093
$$ y = [-50132, 61156, -22053, -5982, 247908, 182657, -153535, -161272, -73105, -213809, -105918, 20238, -106966, -233655, -210573, -264294, -15684, 253115, -100829, 231832, 120086, -116716, -70516, -164444, -41626, 245004, -194378, -21813, -212066, -106104, -206735, -281871, -49763, 137919, 124609, -274255, -122330, 47635, -209272, 131201, 17125, 133272, 33393, 31405, -122181, -160752, -107372, -139643, -87622, -197742, 314381, 45449, -64799, -101088, -233521, 219763, -133016, -274289, -212925, -104439, 234054, 117369, 20863, 193831, -129176, -57856, -345431, -256330, -183850, -36376, -178286, -90951, -163933, 246308, 235108, -75758, 85370, -190881, -276701, -104730, -107554, -157921, -7537, -99417, -327208, -166838, 47455, 88319, -3299, -176392]
19171a76392K264Q5847b6934m8179l8184j71529k37420b52144i8163B04873C9798
19159b08877E31725c25679a52510b1444m26413A6805c5527r6286A77989A956J74571
19148A76527k7072a44551h785E8589a91484K9538N6498l08477d258B31023b27782
19136A2810g4795G3822K06550K7116g8326J7699r7944a1681A57793g7844m4262
19125a22106j49416B21661a35830p8069D466b55338R3576A3471a39602o4125j85149
19114c88876f4895B3095J33634a65924G6931a64714O0565A48207I913b12276H2924
19102a1275j36991A7397J8414c29060C09304c20380A63504a96932o8608a19522
19091g4012b9609A67305J0718a28134B34882l5006A9923a20226j19351A77458
$$ y = [-176392, -174128, -88281, -26934, -75113, -113297, -284826, -522246, -252144, -98163, 204873, 39798, -208877, 531725, -325679, -152510, -21444, -447857, 16805, -35527, -131813, 177989, 1956, 176527, 149455, -144551, -8785, 58589, -191484, -161946, -105448, -413925, -4258, 231023, -227782, 12810, -74795, 73822, 280372, 307488, -78326, -60627, -158571, -11681, 157793, -77844, -122106, -271522, 221661, -135830, -213899, 4466, -255338, -161762, 13471, -139602, -203727, -388876, -64895, 23095, 156729, -165924, 76931, -164714, -104149, 148207, 9913, -212276, 82924, -11275, -148266, 17397, 35811, -329060, 309304, -320380, 163504, -196932, -265540, -119522, -74012, -29609, 167305, 178023, -128134, 234882, 199876, 19923, -120226, -239577, 177458]
19080a84108j65250h8990j89462i4671C31057a82901g7549o3862k10296B16465
19069F6000l1705G000K53534D9114P5583a60469k6784d8350j28393H9069b4800
19057C9495g8795J1158B12130f5104k6093j84933f0609k34691a29972N2332L1303
19046d6337F5690g1019A47086d29455a74970G9381O8062L5794a26592p3163k01134
19035d00889f6326L761k49676D0721Q3855a20149E7296M7310D9752Q0937O0223
19024A90912L4619a11611A26381A0163b97813B95045c81452A11479a44356d899
19013B49499F1753O7557b802j33738j4836K2063A87450g1500B63630F3638a5574
19001A73564f2029l2875M0950m2445A13216K9302a48979K3834K6056k32219F0412
$$ y = [-184108, -349358, -88990, -278452, -94671, 331057, -182901, -77549, -141411, -351707, 216465, 66000, 34295, 7000, 260534, 49114, 124697, -160469, -187253, -48350, -176743, 89069, -24800, 39495, -78795, -67637, 212130, -65104, -91197, -276130, -60609, -295300, -129972, -77640, -46337, 65690, -71019, 147086, -429455, -174970, 79381, 147443, 183237, -126592, -199755, -400889, -66326, -62565, -312241, 40721, 124576, -120149, 57296, 104606, 49752, 130689, 190912, 225531, -111611, 126381, 10163, -297813, 295045, -381452, 111479, -144356, -4899, 249499, 61753, 129310, -2802, -136540, -151376, -129313, 187450, -71500, 263630, 63638, -15574, 173564, -62029, -94904, -53954, -96399, 113216, 142518, -148979, -125145, -99089, -331308, 60412]
18989A78070G6985a44923j91273C4021J7863a68307P9491A953c6147l2526A85695
18977f063m29569g2131k7137j34126j09559A95514f3262l8015k05746a40905b2103
18965A77578e17178K51337E9160B1517L17370c39750B49734C445J07752d05860
18954A40339K2429m8379a05931A61424f6300H8598a42240k1533d6429q2174M5736
18943h2867a8974A01544a53127A43954B9551b36517A89353b32642C24780b49542
18932e0591k08519a05868b8448A62768g1088j24716j75142f3629c070m1797A51852
18920B25696b16455j7486B25260a98001q385O0594O7612B15822a28416F9001O5741
18909A34742i9833I1117k7405h0069B15248c800A47250a2474l3918B4814c44j79001
$$ y = [178070, 76985, -144923, -336196, 34021, 51884, -168307, -88816, 1953, -36147, -68673, 185695, -6063, -435632, -72131, -99268, -233394, -342953, 195514, -63262, -101277, -307023, -140905, -22103, 177578, -517178, -265841, 59160, 21517, 338887, -339750, 249734, 3445, 111197, -405860, 140339, 162768, 114389, -105931, 161424, -66300, 88598, -142240, -163773, -46429, -128603, -82867, -18974, 101544, -153127, 143954, 29551, -236517, 189353, -232642, 324780, -249542, -50591, -259110, -105868, -28448, 162768, -71088, -195804, -370946, -63629, -3070, -44867, 151852, 225696, -216455, -233941, 225260, -198001, -206386, -145792, -78180, 215822, -128416, 69001, 134742, -99833, 91117, 63712, -80069, 215248, -3800, 147250, -12474, -46392, 24814, -344, -179345]
18897a79345j49861a23279C7562J55729d6065m998A20229c10899C49451G1605
18886H4201J96306e83310a94430e0869k07439g1582q1721A08743B4746K16853
18876B41599a74561q6146R4545A49917C6402d7151B0520b35071A36633c54680
18865a40545b7805l84660a49013D15183J97078E9817a03387g39l23788A86930
18854a76071Q1274k03361H4062r201b38132A36027J42905E5421a27607E288a45986
18842a93220i0762A98601D8645O2382J64308b61747n4573P4091J17916B8672f9485
18830A26576a6885q9861M9574l56401h6787D3852C725N8341b604l1349C28694
18818A24440b32027b5885k50570J2773E4177K6128e905C64872A5776J93307I394
$$ y = [-179345, -329206, -123279, 37562, 193291, -46065, -51063, 120229, -310899, 349451, 71605, 84201, 280507, -583310, -194430, -50869, -258308, -71582, -153303, 108743, 24746, 241599, -174561, -260707, -166162, 149917, 36402, -47151, 20520, -235071, 136633, -354680, -140545, -27805, -412465, -149013, 415183, 612261, 59817, -103387, -739, -324527, 186930, -176071, -94797, -298158, 84062, 74861, -238132, 136027, 278932, 55421, -127607, 5288, -145986, -193220, -90762, 198601, 48645, 111027, 275335, -261747, -316320, -242229, -124313, 28672, -69485, 126576, -16885, -106746, -57172, -413573, -86787, 43852, 3725, 62066, -2604, -33953, 328694, 124440, -232027, -25885, -276455, -263682, 54177, 80305, -5905, 364872, 15776, 209083, 9394]
18806G0219C267a46623c872A24711E6789i5161M0493C36230d4054l7480l9031
18795a20565A06047A1910J42409b53167r8393A4729f2581B15950a82457k20208
18785d02665i8395n964o6767B43080d1855A85769m5876B7993m19b28283c1557
18773a44261C1628h7364j6841e1756H4120J03911b56684g0771A992a2226k1967
18762c4193o0798L7406F70b29723B5018g8061L0538p9026n0406A60619D2170b06706
18749e7717a3557B60472a67400O8531k09972M8817i4542L0098D340P9911b8521
18737i7138K1559n4324j29085A88221a15707F1083P3454a15579j79101F3097b35473
18725d9549o6072m19612J36339I2861G737a60092E253b1998q4185k19716j9633
$$ y = [70219, 3267, -146623, -3872, 124711, 56789, -95161, -54668, 336230, -44054, -81534, -120565, 106047, 11910, 154319, -253167, -351560, 14729, -62581, 215950, -182457, -402665, -98395, -104359, -171126, 243080, -41855, 185769, 139893, 27993, 27574, -228283, -31557, -144261, 31628, -87364, -104205, -51756, 84120, 188031, -256684, -70771, 1992, -12226, -34193, -94991, -57585, 670, -229723, 25018, -78061, -47523, -126549, -176955, 160619, 42170, -206706, -57717, -13557, 260472, -167400, -98869, -308841, -260024, -94542, -64444, 4340, 84251, -28521, -97138, -75579, -129903, -258988, 188221, -115707, 61083, 134537, -115579, -294680, 63097, -235473, -49549, -115621, -535233, -398894, 92861, 7737, -160092, 5253, -21998, -106183, -325899, -345532]
18714c45532f6249C9989o173h1247E2730c1870A35237N407a08630l1584f6095
18702E588f8897A61946J79650A36765e3036j77467G8053I693L0161d9739A95569
18690H5340a28301d1470n2112L329L1846j52534a0028j06840c4199k86145d2293
18678b48092e0927B43698F1996d5244m30907a89997B30818b33746a16768K5012
18668i1756R600D06515a9952k00661C30646j62188a60533g4615q719N432B05950
18656c0312j2229B1142a35135M9429B8425g3773k61757F0274A5951h6116k98615
18645c84731e349j4946n8146A98635D098b64083g254l63861B63678d8674l16246
18634c64920b3975l6905A98324J31955A748e8978k13376J12602A68585i1122A69763
$$ y = [-345532, -66249, 39989, 33816, -81247, 52730, -31870, 135237, 140644, -108630, -140214, -66095, 5588, -68897, 161946, 341596, 136765, -53036, -230503, 78053, 9693, 39854, -49739, 195569, 85340, -128301, -41470, -93582, -90253, -58407, -210941, -10028, -116868, -34199, -320344, -42293, -248092, -50927, 243698, 61996, -45244, -476151, -189997, 230818, -233746, -116768, -91756, -82156, 406515, -19952, -220613, 330646, 168458, -160533, -74615, -83334, -77902, 205950, -30312, -42541, 21142, -135135, -85706, 28425, -73773, -335530, 60274, 15951, -86116, -384731, -5349, -20295, -78441, 198635, 4098, -264083, -7254, -371115, 263678, -48674, -364920, -23975, -60880, 198324, 330279, 1748, -58978, -272354, -159752, 168585, -91122, 169763]
18622b48799R3665B08764I5738a1207j35646I8105d37534G7380d5540k08176A5773
18610c63856G4102N8830d07168A2918J7579b8194l263A21054a62367p0825M0213
18599a92979r2013E6711b76494B21116M9135F4697M6967M8563b22690B48647I979
18587A46084N5303d5593J6687j24740E8450L2591a53100A43748o2051b11575C5522
18575g1384j20491J1362B28997q6973a60014B31796d6121a2089l0481g246o2804
18564g0050r9428B42153a75030A35808n1669b09430A70724l2907m5554J48886
18554B41149b27288A82617H6356a90914j04116J19349j0311j8767A22488D9258
18543b65993E2432K9483C846b01055J00111E3527O9677d13668B89749a26552M3623
$$ y = [-248799, -155134, 208764, 95738, -11207, -146853, 98105, -437534, 77380, -45540, -253716, 15773, -363856, 74102, 132932, -407168, 12918, 30497, -28194, -31457, 121054, -162367, -233192, -192979, -284992, 56711, -276494, 221116, 270251, 64697, 111664, 160227, -222690, 248647, 9979, 146084, 201387, -45593, -28906, -153646, 58450, 91041, -153100, 143748, 81697, -211575, 35522, -71384, -191875, -180513, 228997, 142024, -160014, 231796, -46121, -12089, -42570, -7246, -70050, -169478, 242153, -175030, 135808, 84139, -209430, 170724, 137817, 92263, 241149, -227288, 182617, 86356, -190914, -295030, -175681, -185992, -204759, 122488, 49258, -265993, 52432, 81915, 3846, -201055, -100944, 53527, 123204, -413668, 289749, -126552, -82929]
18532h2929A62686E3350a43140D117h603D0537g9001B2881e5008D6899h6763A22074
18519a98107m78440a71053L2826j21575B19297d3554m55778A19554R2633d38121
18508c22869J13404A67211c9393A20941A9353f2289J747E3698L32942A02338b28271
18496D8493c45808e1155A82367i5863H5523N6028D151c36200e1351J7731G1825
18484b1669C08552a90122B36088C519i2406B56613f8571j26838f3823p0372j5116
18473a49311A04309b43403k899c4527F7599a50274F7874c5754m04894b13560M8925
18462a64635e1222j900j12655p3797d0882A50322c27030j6851h9241B87344e2429
18450a1708A0550J22656J20295A7451L09299f4921A39582e6917A6477J24834J30658
$$ y = [-82929, 162686, 53350, -143140, 4117, -8603, 40537, -79001, 22881, -55008, 46899, -86763, 122074, -198107, -676547, -171053, -138227, -259802, 219297, -43554, -499332, 119554, 212187, -438121, -322869, -209465, 167211, -39393, 120941, 19353, -62289, -60542, 53698, 386640, 102338, -228271, 48493, -345808, -51155, 182367, -95863, 85523, 141551, 4151, -336200, -51351, -33620, 71825, -21669, 308552, -190122, 236088, 3519, -92406, 256613, -68571, -195409, -63823, -134195, -149311, 104309, -243403, -246302, -34527, 67599, -150274, 67874, -35754, -440648, -213560, -164635, -51222, -53122, -165777, -239574, -40882, 150322, -327030, -343881, -89241, 287344, -52429, -11708, 10550, 133206, 253501, 17451, 326750, -64921, 139582, -56917, 16477, 141311, 271969]
18439B71969e4421K5058k19443d8680C9691c42026D0528a98316A32562A5152c52461
18427c1487A25187a35993e2181m2357C0991J01166C5188J11918b7624B94075c11268
18415H5719a60949A26503c39339G3077d32272A88703K0674p5586F0228F334L6481
18404D2815b35916A75956J43626a5234A27105g5469n4896N9478E4453b55155B01674
18392a7964C59192F6876b033o0244A20846a52157B12282b22384G8455C2195d19131
18380c00484a02871b0I7338a9246j58427K6126r7478A75420a74964m0156G8633
18368b14575I1023d2600a4945n9609j4260A15303E0022K3708P2173l460k660B5691
18355c60872f320j48677k873j30023A58701a36951c48o8604A02800d7297B15772
$$ y = [271969, -54421, -29363, -248806, -48680, 39691, -342026, 40528, -198316, 132562, 15152, -352461, -31487, 125187, -135993, -52181, -94538, 30991, 132157, 35188, 147106, -27624, 294075, -311268, 85719, -160949, 126503, -339339, 73077, -432272, 188703, 209377, 133791, 60228, 6334, 42815, -235916, 175956, 319582, -15234, 127105, -75469, -130365, -70887, 54453, -255155, 201674, -17964, 359192, 66876, -2033, -62277, 120846, -152157, 212282, -222384, 78455, 32195, -419131, -300484, -102871, -20, 97338, -19246, -177673, -151547, -249025, 175420, -174964, -215120, 78633, -214575, 91023, -42600, -14945, -74554, -88814, 115303, 50022, 73730, 145903, 142443, 139783, 25691, -360872, -6320, -154997, -157870, -287893, 158701, -136951, -348, -68952, 102800, -47297, 215772]
18343b20362P6594A95627a90079O4665N2321j07337O6714f269k21522c6812j31630
18332a68442N9063K0402n9509K854k71287a00742A97027b32953A21468b74254
18321I7904C9020d07655J68766p1190J28476b6545k74907A89235f788k22748l5428
18310b64964a21494A44659J05324Q7784C2402b10954R5203A40787F2179J47473
18300B09652e7015k27663B77184r0163o269a59984l82906A96549I6767b8385F7634
18288C7018R4684L67444a7147j27005b7342j48218B5124p189K42556E8175L7089
18277I5264a00600k8902e2281j61733l22952B78606a35596a1083I1079R11d46637
18265h0410B18813g606m5467m5159D8123L6665l6693a8286H9640m449c57156i5778
$$ y = [-220362, -143768, 195627, -190079, -125414, -73093, -180430, -113716, -6269, -227791, -36812, -168442, -109379, -88977, -148486, -145632, -416919, -100742, 197027, -232953, 121468, -274254, 97904, 39020, -407655, -238889, -310079, -181603, -26545, -301452, 189235, -6788, -229536, -264964, -121494, 144659, 249983, 337767, 32402, -210954, -115751, 140787, 62179, 209652, -57015, -284678, 277184, 187021, 180752, -159984, -542890, 196549, 96767, -28385, 67634, 37018, 131702, 499146, -17147, -144152, -27342, -175560, 25124, 17935, 260491, 58175, 95264, -100600, -129502, -52281, -214014, -536966, 278606, -135596, -11083, 91079, 91990, -446637, -80410, 218813, -7606, -53073, -98232, 48123, 84788, 48095, -18286, 89640, 85191, -357156, -95778]
18252A85588a6256j30943I1586d842B40002c3585a1293j89354d7317A69712b88065
18240I3864J08464f6138D0615b61816A00251b28742A46245i692K75D3159a0007
18228a15585j95372A69060h7171H2742j5625b68833C07b132E2911J60074c0138
18216a96454F7262a54839M1706B13741L0102b23495P366A06417C415N9059A6409
18204D4934j8801K24708b06096D3917a31538A16918m0302J55635a2235j7010A3181
18192C6951j4817a62982E0448i9693j28805N3838F0184b11699B08491a59742E8744
18180a88444C59358E1842K84797A66887i6744d1396j2060p8527k55382A05851
18169a02973b7882j52678j02678E9207d7541j60062A03284b08326O8855k68941
$$ y = [185588, -16256, -147199, 91586, -4842, 240002, -33585, -11293, -200647, -47317, 169712, -288065, 93864, 202328, -66138, 40615, -261816, 100251, -228742, 146245, -9692, -9417, 43159, -10007, -115585, -310957, 169060, -87171, 82742, 67117, -268833, 307, -2132, 52911, 212985, -30138, -196454, 67262, -154839, -113133, 213741, 243843, -223495, -216129, 106417, 3415, 62474, 16409, 44934, 26133, 250841, -206096, 43917, -131538, 116918, 76616, 232251, -12235, -29245, 13181, 36951, 22134, -162982, 50448, -99693, -228498, -174660, 60184, -211699, 208491, -159742, 58744, -188444, 359358, 51842, 336639, 166887, -96744, -41396, -53456, -131983, -387365, 105851, -102973, -27882, -180560, -283238, 59207, -47541, -207603, 103284, -208326, -139471, -408412]
18159d08412f5994E2131c33223j5355E9367J94011a45630F501a06354j20946k65048
18148d92348B38955m5388G3039J64018a25560I0979b61298K9885i3244j0845l63393
18137d67482e1238m8306A32216l8518d0065A2452N8510Q1540c18436B94193m8820
18126B45373i7974A887a99449A16456a77250q9163G7709a9872C36939d12170a17402
18114d7717l15135J54282r194h3575H6707A1402c1303B6503a67692D168J12187
18103A16355n2158f78j68083H5821P6582a59861D2804a45007F2919O5079c2464
18091E1552L1052J15598m0301L0190L589a53931A58303i2560B87702A09270b07489
18079f3384j15002M0910j00552f4152g357j53884B04473a74142B19055i8671j29862
$$ y = [-408412, -65994, 52131, -333223, -348578, 59367, 253378, -145630, 6501, -106354, -227300, -492348, 238955, 193567, 73039, 237057, -125560, 90979, -261298, -231413, -93244, -104089, -467482, -51238, -99544, 132216, 93698, -40065, 12452, 70962, 152502, -318436, 294193, 245373, -97974, 1887, -199449, 116456, -177250, -266413, 77709, -19872, 336939, -412170, -117402, -47717, -362852, -208570, -217764, -83575, 86707, 11402, -31303, 26503, -167692, 4168, 116355, 64197, -678, -168761, 85821, 162403, -159861, 42804, -145007, 62919, 127998, -32464, 51552, 82604, 198202, 157901, 188091, 191680, -153931, 158303, -92560, 287702, 109270, -207489, -63384, -178386, -137476, -238028, -64152, -7357, -161241, 204473, -174142, 219055, -98671, -228533]
18068b28533i7010F3616O3233a08333b7992A5315O7937N3032L58236a67553i506
18056h4484j45801R0417B8589J53540a94774A8295a20614A23894B7015e1555H8799
18044A62734g8073B08393b04602j80096C14785D2948c8843A42781h7655G6958
18033B22291D2225k0744J60193a47845B70303g4577A00080b64621Q8947b1839
18022f1040A06320K19214H7042C4469f9102b0982j283k10093g5129D5716c9187
18010G1360a16570q7500r2552Q7906e6271r3256f2981I3593c86686J04111a34090
17998A84614K5895b08034E6085L4865c5706B19421G5911a58724j00911C1391a37353
17986A7112O8204c0839k17662B54407i207d216A31417f9425A89862g4842K5232
$$ y = [-228533, -97010, 63616, 126849, -108333, -27992, 15315, 83252, 136284, 494520, -167553, -9506, -84484, -230285, -139868, 28589, 182129, -194774, 18295, -120614, 123894, 27015, -51555, 88799, 162734, -78073, 208393, -204602, -384698, 314785, 42948, -38843, 142781, -87655, 76958, 222291, 42225, 21481, 181674, -147845, 270303, -74577, 100080, -264621, -175674, -21839, -61040, 106320, 325534, 87042, 34469, -69102, -20982, -22265, -232358, -75129, 45716, -39187, 71360, -116570, -204070, -296622, -208716, -56271, -149527, -62981, 93593, -386686, -282575, -134090, 184614, 210509, -208034, 56085, 90950, -35706, 219421, 75911, -158724, -259635, 31391, -137353, 17112, 85316, -30839, -248501, 254407, -9207, -4216, 131417, -69425, 189862, -74842, -49610]
17975d9610H7957e0840A51352E8113a01680D9109J61978B3716a13827G8586N4723
17964A33309d9782A68750h4045p4504A747b11430G0724j1385c2880E571L77363
17953C82934H8597o32e5590k90089d3760j39257k0326J6110k852f1666o5448B40622
17940E2829J1149J1401a39474H817a01481M1430B61880I9473i8383r116j39115
17929b46614A2281f939k3270q7330e4983A6717a42075B45170Q8086r6409h7010
17917a97908A98220a80347C1736K22912b39803E3240d3769k09999E8992b30257
17906d9592A44078d3526H3138a6903A47687K06161b26486H9197b78524A43721
17895a28869n4615H0878g951l28761a00291B82931C5055g541k46296E0201d20801
$$ y = [-49610, 87957, -50840, 151352, 58113, -101680, 49109, 211087, 23716, -113827, 78586, 133309, -49782, 168750, -84045, -158549, 1747, -211430, 70724, 59339, -32880, 5571, 382934, 88597, 87965, -55590, -345679, -43760, -183017, -203343, -187233, -190085, -61666, -127114, 240622, 52829, 63978, 75379, -139474, 8817, -101481, -60051, 261880, 99473, -98383, -107499, -246614, 12281, -6939, -30209, -117539, -54983, 16717, -142075, 245170, 333256, 236847, -87010, -197908, 198220, -180347, 31736, 254648, -239803, 53240, -43769, -253768, 58992, -230257, -49592, 144078, -43526, 83138, -16903, 147687, 353848, -226486, 89197, -278524, 143721, -128869, -183484, 80878, -7951, -336712, -100291, 282931, 35055, -7541, -253837, 50201, -420801]
17883A20514k6250E809J57669a10044d7485F5884L9586n40a59098c5759A31297
17871B44681B5806e4228K6272k10990D2455k721J94072A5593J73537D3849A1417
17859I579J01877J85206b679n3441C5139J26315L4132P6105F2830a71462j35673
17848c07135A75204a15315A96004L9269A3335f0706I009a99866d9397k3477j14838
17837a87712a0487A99045J27503D5126a05512b7524A29965e7198A25938d3751
17826a47429A07736M4664N9986c0021A43700n6763K21895A24598a64414a6447
17815f2099m8447A69320J50373b09828B84132j39237b34697L5992A46949f2566
17804A87259F8267a84334B48006c12597b9946A0025K6498J34964i5753d7004A06529
$$ y = [120514, 94264, 5809, 163478, -110044, -47485, 65884, 105470, 104930, -159098, -35759, 131297, 244681, 25806, -54228, -27956, -238946, 42455, 39734, 233806, 15593, 189130, 43849, 11417, 9579, 111456, 296662, -2679, -56120, 35139, 161454, 195586, 271691, 62830, -171462, -307135, 175204, -115315, 196004, 235273, 13335, -60706, 9009, -199866, -49397, -72874, -187712, -10487, 199045, 326548, 45126, -105512, -27524, 129965, -57198, 125938, -43751, -147429, 107736, 152400, 212386, -30021, 143700, 86937, 308832, 124598, -164414, -16447, -62099, -110546, 169320, 319693, -209828, 284132, 144895, -234697, -198705, 146949, -62566, 187259, 68267, -184334, 248006, -312597, -29946, 10025, 36523, 171487, -95753, -47004, 106529]
17792a5283B86069c39066a68179e775j80206Q7635l1499I0931a43679d0895j22924
17781a63819j14056A73082R310a66613D8483J37371O4746d0265j95755N4595b3395
17769b8880I0389a72783p2245A5198d7437k92755J23946L5698J1211B46267a08320
17757c557A8878a5444q5446E7061b61210Q3522J0690C63637a2242m83003A30618
17745d2391C9114P2424a1820j73355C1885a06257A35420J16450q7787A744O469
17734H213O9250K51007b43394g4343A9002a09800H5915a0747A04731R3245B358
17722a92882A07572K93173a42713f409A52099b37359A77151o5838b7840n0028
17712g7868e352I2454b56022Q4724B35187I4194Q3074D0570a01092I7884b54582
$$ y = [-15283, 286069, -339066, -168179, -5775, -185981, -98346, -129845, 90931, -143679, -40895, -163819, -277875, 173082, 182392, -166613, 48483, 185854, 250600, -40265, -236020, -181425, -23395, -28880, 90389, -172783, -245028, 15198, -47437, -340192, -216246, -180548, -169337, 246267, -108320, -3557, 18878, -15444, -100890, 57061, -261210, -177688, -166998, 363637, -12242, -495245, 130618, -42391, 39114, 111538, -11820, -185175, 31885, -106257, 135420, 251870, 164083, 1744, 8213, 77463, 328470, -243394, -74343, 19002, -109800, 85915, -10747, 104731, 197976, 2358, -192882, 107572, 400745, -142713, -6409, 152099, -237359, 177151, 111313, -27840, -77868, -5352, 92454, -256022, -171298, 235187, 94194, 177268, 40570, -101092, 97884, -254582]
17700g1584A35001N050F0534c64093A68561G0632a44131B88868a45639A41846
17689G3035J31230q1124c822n3846k2617k45893a56351I9206i1363C00566j19117
17678A81449q6994J2982b83181A19630l6812a66660j70597I2358a17349I8927
17667a38542B1832M12063g7372A28141K8200K11189A03970J66244c6934B04084
17656A46883l3707c425C60463p6047g8748p0404l8125C83799G6718N0941b34270
17644F2810J40032A5162K47368N6793a57731C15556b03557B84370A02895d7320
17633i0693l1477p2392O5299o243b7408D291a73814a6645B19924M02506c06054
17621d2479D1766H235N5313B1570g7197L1875C84626A67644p1897k0656a83770
$$ y = [-71584, 135001, 140051, 60534, -364093, 168561, 70632, -144131, 288868, -145639, 141846, 73035, 204265, 123141, -3822, -57668, -80285, -326178, -156351, 99206, -91363, 300566, 181449, 94455, 107437, -283181, 119630, 82818, -166660, -337257, 92358, -117349, 98927, -138542, 21832, 433895, -77372, 128141, 156341, 367530, 103970, 270214, -36934, 204084, 146883, 113176, -3425, 360463, 284416, -78748, -149152, -187277, 383799, 76718, 127659, -234270, 62810, 202842, 15162, 262530, 319323, -157731, 315556, -203557, 284370, 102895, -47320, -90693, -122170, -194562, -129263, -135506, -27408, 4291, -173814, -16645, 219924, 622430, -306054, -42479, 41766, 8235, 63548, 21570, -77197, -45322, 384626, 167644, 95747, 75091, -183770]
17609a49348A7113K86286m0262G2607J37322a75490B4237J17556b3860A30655
17598D79646k33115B4746J37195o1467c15550f068C83233j57123q9179P5533n9082
17587A53382o991k0681G933b89014J17583A75356n7204c24847C04527h7197F5836
17575h1416A11571c4131A81815j607G347b07618A75697R7482a4822A85788o6380
17564A19408b30546C0170c24386a46543H6217L81493c88933a49227b6251l9973
17554f6224A51090P2723e4764a0079C56365B8866J08318F8138J47680G8493c6392
17542a34598H4194c2703A07327d2413A61140E6947e6585B16387O8152a95033h0486
17530D4586c5874E1190K62516C3985c7963A40140L5873b60717B75366C3478a10805
$$ y = [-149348, 17113, 303399, 263137, 72607, 209929, -175490, 24237, 141793, -23860, 130655, 479646, 246531, 24746, 161941, 100474, -315550, -6068, 383233, 226110, 136931, 212464, 153382, 146391, 125710, 7933, -289014, -171431, 175356, 118152, -324847, 304527, -87197, 65836, -81416, 111571, -34131, 181815, 180208, 7347, -207618, 175697, 273179, -14822, 185788, 119408, -230546, 30170, -324386, -146543, 86217, 467710, -388933, -149227, -26251, -66224, 151090, 223813, -54764, -10079, 356365, 28866, 137184, 68138, 215818, 78493, -36392, -134598, 84194, -32703, 107327, -42413, 161140, 56947, -56585, 216387, 284539, -195033, -80486, 44586, -35874, 51190, 313706, 33985, -37963, 140140, 176013, -260717, 275366, 33478, -110805]
17518C30321a53021C33309j65355p765a07425A9280e7227A47630c71707B98850
17507B4312K92231H3161a75965a2146B08856f6828A12398J96413f4946C10352
17496A31576J44384A18120a38176d6762I359K37953J46905j54932q6781K0908
17486A73412o8185J0455d7588E22814b07995E71831c3690k65904D5699a620j42282
17475a43902B96175j09233a4801k98654B21906M983L5028a41162B09786j03885
17465A05901m9268N6145M4745C9908J57383E8280K2371B845c2489A75508a46335
17453B33236J51151J11467j86754A34426h5897C87024o1058q0207g2309A30609
17442B9186a74265C09481K99581I5487O492J42630o1550K55374E9737J17160i8776
$$ y = [330321, -153021, 333309, 167954, 160189, -107425, 19280, -57227, 147630, -371707, 298850, 24312, 316543, 83161, -175965, -12146, 208856, -66828, 112398, 308811, -64946, 310352, 131576, 275960, 118120, -138176, -46762, 9359, 247312, 394217, 239285, 152504, 173412, 105227, 115682, -47588, 522814, -207995, 571831, -33690, -299594, 45699, -1620, -143902, 296175, 186942, -14801, -313455, 221906, 226889, 261917, -141162, 209786, 105901, 56633, 112778, 157523, 39908, 197291, 58280, 80651, 2845, -32489, 175508, -146335, 233236, 384387, 495854, 309100, 134426, -85897, 387024, 325966, 245759, -72309, 130609, 29186, -174265, 309481, 609062, 95487, 101979, 244609, 183059, 438433, 59737, 176897, -98776]
17430B94822A35021K78473j52910a68622B25852L62120A26675O4171a0697E00292
17419E40241A99819p8418M3906Q0755L55454a59095A70083j4678K81672a38179
17408B60695j9952I7623k5726g9958C93464g1325A12115n0031k078m009c9026
17396B49699m8574a48373B69111j11588M6086a97755f4355A80749j1580L30657
17386D99826j56488A61539J38888n4131D0054M17589k27473J23782A04006N40790
17376F44796a60352E27096b0598A82828J72396l443A59154J42339C3517J25773
17366A59290P1800J19052j36628l1278f2649A81375a04417D0192e4181A3969J5663
17355B9632N5073O3289b28201b0087C47307j16268o9941G5139j5306L16055E1921
$$ y = [294822, 135021, 413494, 260584, -168622, 225852, 587972, 126675, 190846, -10697, 500292, 540241, 199819, 121401, 165307, 246062, 601516, -159095, 170083, 155405, 437077, -138179, 260695, 240743, 97623, 71897, -79958, 393464, -71325, 112115, 62084, 60006, 55997, -39026, 249699, 201125, -148373, 269111, 157523, 203609, -197755, -64355, 180749, 169169, 499826, 343338, 161539, 300427, 246296, 40054, 457643, 230170, 353952, 104006, 644796, -160352, 527096, -20598, 182828, 355224, 351781, 159154, 301493, 33517, 159290, 231090, 350142, 213514, 182236, -62649, 181375, -104417, 40192, -54181, 13969, 29632, 84705, 147994, -228201, -20087, 347307, 231039, 161098, 75139, 59833, 375888, 51921]
17343B97012K70347B73988n7986P2169b0161o2575A53661d0477C32542A32178
17332B23491K25087A85118c15214b9529A02554A2797J64627m2023h1336j9797
17322a01133q533B95666A11525R7481K48863B7605c7489G1993e0521A37328J3438
17311A50766a07890b5992l9235A40774J09828A22065m6582J73901A16778L41405
17301D58183j80415J18990H3834J83993q0146N2935J15099A41939P5498D6607
17290A27253J20716n6199a77251Q1266A55780D3265M46882j10671j34799G5970
17279C01333A14276J62171J70273N1947E8393M17796E8791K96155l800j71713
17269A79433J1382H5246K03413G1259k2913J43558L14782A41989B6422e2801A41298
$$ y = [297012, 567359, 273988, 216002, 288171, -20161, -82736, 153661, -40477, 332542, 132178, 223491, 448578, 185118, -315214, -29529, 102554, 12797, 177424, 135401, -81336, -101133, -109666, 295666, 111525, 209006, 457869, 27605, -37489, 71993, -50521, 137328, 150766, -107890, -25992, -65227, 140774, 250602, 122065, 75483, 249384, 116778, 458183, 277768, 396758, 83834, 267827, 187681, 240616, 355715, 141939, 217437, 46607, 127253, 247969, 191770, -177251, -95985, 155780, 43265, 490147, 379476, 244677, 75970, 301333, 114276, 276447, 446720, 498667, 58393, 476189, 58791, 354946, 351146, 179433, 190815, 85246, 288659, 71259, 48346, 191904, 506686, 141989, 26422, -52801, 141298]
17257C13476A19786i6450c5264C47478j21289J96477A75191a06880D02809j56391
17247B46418o2495p0465k4739J69176L76525k96051j05257e3372B28025a9289
17236B22032I7349a69802c6600A18036a02304A38120J08088B4611K51396K862
17226B78869j11077K35642J22201k56796H9554R9706J99386G8054K87688P371
17216C73113K7893A74366J11570J97563k28234b0845A14242J02703K31584r0111
17206C58418h5446D67429B13767A8474K87629K2404n2076J39826A92467m2541
17196A49926D3492M41097j15707j62053q1780J59143K27783A6168K72529K86768
17186E75465B40004L3496P8503A20147L64851K2142j82713J30521A00627L29772
$$ y = [313476, 119786, -96450, -35264, 347478, 226189, 422666, 175191, -106880, 402809, 246418, 183923, 113458, 88719, 257895, 634420, 338369, 233112, -53372, 228025, -19289, 222032, 97349, -169802, -36600, 118036, -102304, 138120, 246208, 24611, 276007, 278869, 167792, 403434, 525635, 268839, 89554, 189260, 388646, 78054, 365742, 373113, 401006, 174366, 285936, 483499, 255265, -20845, 114242, 216945, 448529, 358418, -85446, 467429, 213767, 18474, 306103, 328507, 276431, 416257, 192467, 149926, 43492, 484589, 368882, 206829, 125049, 284192, 511975, 16168, 288697, 575465, 240004, 273500, 352003, 120147, 484998, 507140, 324427, 454948, 100627, 430399]
17176D30399I7840J8119Q6128D1494J59639J96433R0804Q6811L3504j30673k15851
17165B62161J85996K528K832j75281J05039J80576M8586A86994L19710j33523
17155C73181q9449K50168i226B52000q3337M3901K84676B16965K29285L09866
17145G56116C21658p3991J557N1559n7289L20105q1996j37605c056D85607A69883
17133D32112p9234j38373J96138j51871L27727B12276N68186k80526o137j93413
17123C00386M26733k18013j84293j61190J97890J05316j57803J43457k24982P4595
17113C02096J41227k20339J78174K38970B35276Q9246L7177j36919B8143M90127
17103E18270B57146N0594K96516j16976j90799K59923k02234q1965J41934L33480
$$ y = [430399, 97840, 115959, 202087, 41494, 201133, 397566, 488370, 575181, 608685, 478012, 262161, 448157, 450685, 453517, 278236, 383275, 563851, 612437, 186994, 506704, 373181, 283732, 533900, -9226, 252000, 168663, 212564, 497240, 216965, 446250, 756116, 321658, 247667, 249224, 300783, 243494, 563599, 481603, 343998, -3056, 485607, 169883, 432112, 352878, 214505, 410643, 258772, 586499, 212276, 780462, 499936, 493799, 300386, 727119, 509106, 324813, 163623, 361513, 466829, 309026, 452483, 227501, 302096, 443323, 222984, 401158, 640128, 235276, 324522, 361699, 224780, 28143, 518270, 257146, 307740, 604256, 487280, 296481, 556404, 354170, 272205, 414139, 747619]
17093G47619B60181K62629j92461k2929L0309N599L21071A49399K54110O4914
17083D68423M7560q536K59081j65914B51409J27945j4573j62501K61483j58890
17073C04873Q9270J33534j62023M68172m07245J53895j0814j3226j35481j40975
17063B79980J06344J38972L32280m05282J16393j5403j29889J2544L33154k19713
17053E49380N5653P6421q3095K68717k60739M2877J14754k46653k24047M30107
17043G23375B02397J13749M41697j29270K22154j4990k707l14158O6570J16938
17033G02380J43320k12772o4401Q7451k77953J43628N8103J67650j8548j08797
17023F20061J0616P6230J06862j445j45605L317o8999k8479J81341K48174k09553
$$ y = [747619, 260181, 522810, 330349, 307420, 337729, 343328, 664399, 149399, 403509, 468423, 515983, 507447, 766528, 600614, 251409, 379354, 364781, 202280, 463763, 304873, 394143, 527677, 365654, 833826, 426581, 580476, 569662, 556436, 420955, 279980, 386324, 525296, 857576, 452294, 568687, 553284, 423395, 435939, 769093, 549380, 605033, 681454, 598359, 867076, 606337, 649214, 763968, 517315, 293268, 723375, 202397, 316146, 757843, 628573, 850727, 835737, 833030, 518872, 585442, 702380, 845700, 632928, 568527, 655978, 378025, 521653, 579756, 747406, 728858, 620061, 630677, 706907, 813769, 812324, 666719, 670036, 601037, 572558, 753899, 1002073, 792520]
17012G92520J15132j05483j10897j14185J68714o3663j997J07771M6638J60513
17002I95063o3654J13513l84819L87369j52058j04127m6017k01477K91399k14
16992H34978K96580j31861j8793K67506m25476M7234q5905Q7805j37899N75690
16982A309859F21586M48826j86931J24642J66304j78385q197J84904k31269l7014
16972I04466J24920P0021Q5983k19085k9653L90794k79279K64837r9916n9723
16962A153365j8069j64113J03332J3823K03112k88540J78894J259J4061O5772
16952A262896l89622L93817q5117l34564N51722j96817l21682K88298O9229k96206
16942I41954M09165J10603o1555K0774j19245K38759R9260k32682K68135p93314
$$ y = [792520, 907652, 802169, 691272, 577087, 745801, 682138, 680141, 787912, 834550, 995063, 931409, 1044922, 660103, 1047472, 895414, 791287, 745270, 543793, 835192, 834978, 1131558, 999697, 980904, 1248410, 822934, 870168, 784263, 872068, 734169, 1309859, 621586, 1070412, 883481, 1008123, 1174427, 996042, 987845, 1172749, 941480, 904466, 1029386, 1099407, 1185390, 966305, 936652, 1327446, 1048167, 1313004, 1213088, 1153365, 1135296, 971183, 1074515, 1088338, 1291450, 1002910, 1181804, 1183063, 1197124, 1262896, 873274, 1267091, 1181974, 847410, 1399132, 1202315, 880633, 1168931, 1238160, 941954, 1351119, 1461722, 1400167, 1420941, 1301696, 1540455, 1639715, 1407033, 1675168, 881854]
16932H81854N17119J69082r0132j07041j35169M60888K08719l27712j37133K58421
16922A698896j59542R102j64588O2858q1789K76849K02361l73779J42016K23017
16912A835401j80828J78210J99038O345j42618k36393K62313j12352L87J6196
16902A825699J33892L1976P4685k11381J13420l00963J70455L7340M07069n9424
16892B222768J3556J5339j59128M99889j76945k09057J08070q255N1826k1482
16882B336581j02669J91310Q3290j58881J34061J87003n42932L84978q3975N14544
16872B943310m65008L65740l23854K73206R9863j23048K69394l78910K31105J93205
16862C085003J35730K46441k65879J8053j76552O01578P9740n12261L8870M39520
$$ y = [881854, 1398973, 1568055, 1477923, 1370882, 1235713, 1696601, 1905320, 1577608, 1440475, 1698896, 1539354, 1548456, 1383868, 1446726, 1364937, 1641786, 1844147, 1470368, 1612384, 1835401, 1654573, 1832783, 2031821, 2038166, 1895548, 1659155, 1921468, 1809116, 1809503, 1825699, 1959591, 1991567, 2066252, 1854871, 1968291, 1667328, 1837783, 1875123, 2282192, 2222768, 2236324, 2251663, 2092535, 2592424, 2415479, 2206422, 2314492, 2306237, 2358063, 2336581, 2233912, 2425222, 2508512, 2349631, 2483692, 2670695, 2127763, 2512741, 2428766, 2943310, 2478302, 2844042, 2520188, 2793394, 2893257, 2770209, 3039603, 2660693, 2891798, 3085003, 3220733, 3467174, 3201295, 3219348, 3042796, 3644374, 3724114, 3211853, 3250723, 3690243]
16852C690243n9099j4753J95620R758j31008k03257J60664K20405K3602k3758
16842C868417K42319K86449j99673K19027J27598l46168J10441M68557p3616K403
16832D705754K40739m61078M55895L4588J91026j68698K49457J58581Q9555K0390
16822E516209R4081K65457j9581J95916Q0383j08170L46691p1324N80648K9522
16812F909832J38296J26940J25886m73718O78892O5090L95175j18199M88680l32800
16802H004074O57201j64455L51431N41779q2735l6812M55370k4070N57900L23156
16792A0582839J89404J49159K13312L82169L90413L36733J59836N94662L4789
16783A3033316O55832M35975J37649N52765L94230M62758M84808L21597N17005
$$ y = [3690243, 3631144, 3616391, 3812011, 3821769, 3690761, 3487504, 3648168, 3868573, 3892175, 3868417, 4110736, 4397185, 4197512, 4416539, 4544137, 4197969, 4308410, 4776967, 4703351, 4705754, 4946493, 4485415, 4941310, 4975898, 5166924, 4998226, 5247683, 5406264, 5495819, 5516209, 5610290, 5875747, 5856166, 6052082, 6132465, 6024295, 6370986, 6299662, 6880310, 6909832, 7048128, 7175068, 7300954, 6827236, 7506128, 7571218, 7966393, 7848194, 8336874, 8004074, 8661275, 8496820, 8848251, 9390030, 9307295, 9270483, 9725853, 9701783, 10259683, 10582839, 10772243, 10921402, 11134714, 11516883, 11907296, 12244029, 12403865, 12998527, 13033316, 13689148, 14125123, 14262772, 14815537, 15209767, 15672525, 16157333, 16478930, 16995935]
16774A6995935Q76545J26461P02444O14531N35410R14680K49252J005031Q30526
16765B2850815P18108Q70796R29105J031450R87561J122637R69990J228697J135413
16756C1844572J469032J194117J658036J614222J371670J899821J746367J987334
16748D4785171K483365J992838K358129K766119K451439K795207L045060L368067
16740F6045395L641009L419159M104888L870697M680308M560577M853967N080149
16732A00256149M991694N605176N691626N803867O021880N915838N798055N684783
16724A45769068N748077M935141M826706M241841L489573K589739J760063J202534
16716A74562742l56186j228865j568312k442067l602941m168974m619115n213392
$$ y = [16995935, 17872480, 17998941, 18701385, 19315916, 19851326, 20766006, 21015258, 22020289, 22850815, 23568923, 24439719, 25368824, 26400274, 27387835, 28510472, 29480462, 30709159, 31844572, 33313604, 34507721, 36165757, 37779979, 39151649, 41051470, 42797837, 44785171, 47268536, 49261374, 51619503, 54385622, 56837061, 59632268, 62677328, 66045395, 69686404, 73105563, 77210451, 81081148, 85761456, 90322033, 95176000, 100256149, 105247843, 110853019, 116544645, 122348512, 128370392, 134286230, 140084285, 145769068, 151517145, 156452286, 161278992, 165520833, 169010406, 171600145, 173360208, 174562742, 174206556, 172977691, 171409379, 168967312, 165364371, 161195397, 156576282, 151362890]
16708A51362890n584071n690882o003420o081360n940195n559845o201297n544989
16700A04756831n472826n208265m510192n202315m213499l948923m310921l232214
16692F8657676l847729l009453l173296k778525l147640k379854k386386k488399
16684D5446394j968346j809654k228266j839168j351554j628794j429971j671439
16676C1519202q16156j435407j078456j247748r33214j185151p96204r97913m83708
16667B2545245r12067r78275p50838n76271m93695p78427p84607n92804m10535
16658A6267726l96899n95045n29222j85857n01742n80401k99818p37404N790o92662
16648A1754466J11703l28452l93881l07880o39790O4535j48812p27083k53485
$$ y = [151362890, 145778819, 140087937, 134084517, 128003157, 122062962, 116503117, 110301820, 104756831, 99284005, 94075740, 89565548, 84363233, 80149734, 76200811, 71889890, 68657676, 64809947, 61800494, 58627198, 55848673, 52701033, 50321179, 47934793, 45446394, 43478048, 41668394, 39440128, 37600960, 36249406, 34620612, 33190641, 31519202, 30703046, 29267639, 28189183, 26941435, 26008221, 24823070, 24026866, 23028953, 22545245, 21633178, 20654903, 19904065, 19327794, 18834099, 18055672, 17271065, 16678261, 16267726, 15870827, 15275782, 14746560, 14560703, 14058961, 13478560, 13178742, 12441338, 12447128, 11754466, 11866169, 11537717, 11143836, 10835956, 10196166, 10260701, 10111889, 9384806, 9131321]
16639I131321m23519J54563l0509k08430n1189n53312k38813j35960k82089K62485
16629G624548m38994l78941j57156J45239m9709m53021K0543M5952l38193j18679
16619E901589M730o96657J1047m4324l6333L5614j52542L01717j67383l95177
16609D762281q9035k84392J31512j85823J4796k33297K59540J8691k24591k18064
16599C951618J0214k78490K98273j22019m23014L00080o3813j67621m20303L42426
16589C427351k24347l45457N76707j93901j81867J86132j41789L5871l75217R8529
16579B862012J20900J17033k90976k76937P5750m2329j87809K24970j38986p261
16569B456367J54597j38901l28852q59J08008K83422k65962m7334r7199n0553
$$ y = [9131321, 8707802, 8862365, 8831856, 8623426, 8572237, 8018925, 7780112, 7644152, 7362063, 7624548, 7185554, 6806613, 6649457, 6794696, 6744987, 6291966, 6312509, 6358461, 6020268, 5901589, 5906319, 5209662, 5220709, 5176385, 5140052, 5175666, 5023124, 5324841, 5157458, 4762281, 4673246, 4388854, 4520366, 4334543, 4349339, 4116042, 4375582, 4394273, 4169682, 3951618, 3961832, 3683342, 3981615, 3859596, 3436582, 3736662, 3672849, 3505228, 3084925, 3427351, 3203004, 2857547, 3434254, 3240353, 3058486, 3244618, 3102829, 3138700, 2763483, 2862012, 2982912, 3099945, 2808969, 2532032, 2607782, 2565453, 2377644, 2602614, 2463628, 2456367, 2610964, 2472063, 2143211, 2142352, 2250360, 2533782, 2267820, 2220486, 2123287, 2072734]
16559B072734r8419K11810l29894J09445K14252l67198K41795Q819J08203J3762
16549B185309l23098k32342o9361L13546m12837M89200m45138P1150J30148l43208
16539A363369M32228k00358O4035j98589L9874Q7368j40992m1533l12532K53473
16529A346343J23912q3521J24461k07573M45862m02127P6524J52643n80129M21811
16519A418206j43364L42056k42505q3207n57942L64375J80852k23325l7139p3570
16509I44437N69198l11736j43809L31849l60637k28796N36985k66286k7735o1512
16499I81958p5423K79491D78414N50699J65585k14256M59142l58880j39752o6928
16489H74024q3019r9529N17242m07381K87659j46947r1044N2291l7424o7845J39683
$$ y = [2072734, 1974315, 2186125, 1856231, 1965676, 2179928, 1812730, 2054525, 2063344, 2171547, 2185309, 1862211, 1629869, 1560508, 1874054, 1461217, 1950417, 1505279, 1576429, 1706577, 1363369, 1795597, 1595239, 1659274, 1460685, 1500559, 1587927, 1446935, 1405402, 1092870, 1346343, 1470255, 1386734, 1511195, 1303622, 1749484, 1347357, 1423881, 1576524, 996395, 1418206, 1274842, 1616898, 1374393, 1291186, 733244, 1097619, 1278471, 1055146, 1018007, 944437, 1513635, 1201899, 1058090, 1389939, 1029302, 800506, 1337491, 1071205, 1043470, 981958, 906535, 1186026, 478414, 1029113, 1194698, 980442, 1439584, 1080704, 940952, 874024, 791005, 691476, 1208718, 801337, 1088996, 942049, 851005, 903296, 865872, 798027, 937710]
16478I37710l43054L5814K12138m9650L00546k37222j48576k26138M80011p2691
16468H88888l09829K80304k34835J65669L81805n66918K06830C89967L80658j71633
16458E98992J07640k67468N90127D77929J11121L27343j89115K0793j16648j10347
16448E21076K70266k88194R8913P1341j94952P4836M3241B87762M37647m9783
16438F75626L05651D25096L99164j70413k34513K10071j74332J36933j54188J65891
16428F03709n8856J66215C33584L00800B70287L14508m4939n6864m1915K97613
16418G38690l49823M313J74947Q3355l3264j54919J00803o4653r3376o267M0760
16407D40566K72524k42043L27787B39395L2107O6578K20373B13651k2905J71189
$$ y = [937710, 594656, 630470, 842608, 792958, 1093504, 856282, 707706, 481568, 961579, 888888, 579059, 859363, 624528, 790197, 1172002, 605084, 811914, 389967, 770625, 598992, 706632, 439164, 1029291, 477929, 589050, 916393, 727278, 748071, 631423, 521076, 791342, 503148, 602061, 673402, 478450, 553286, 596527, 287762, 725409, 675626, 981277, 425096, 824260, 653847, 419334, 629405, 455073, 592006, 437818, 603709, 544853, 711068, 333584, 634384, 270287, 584795, 539856, 482992, 441077, 738690, 388867, 393180, 568127, 651482, 618218, 463299, 564102, 499449, 406073, 399806, 440566, 713090, 471047, 798834, 239395, 271502, 338080, 558453, 213651, 190746, 361935]
16397C61935L02130A82580K39066A59549K87876K59687C47620J8707q3867K51082
16387E33542A57343K6090L88070B8539O4090L84682J9864B47187G7272N40445
16377F17717C6197K78839B295K17874J20095J13426P2237k04785K65178B09284
16366C36819A16501M91734k97786K5904j9111r1744A11240m0715h6335B37500
16355B31138j06102O1855L47122A96294M52776B95139A39831j9410R9519J41802
16345C61742G657O2852J55348J965R4140A35544K86148R097a4386A42237o6027
16334G6210K21197p599A24369L49199B07498p6915J49208n4985r594L65075A55147
16322A93141Q3346q6449a10874C34586R1677a22667C05230K8836n0398j39891
$$ y = [361935, 664065, 182580, 421646, 159549, 447425, 707112, 347620, 366327, 282460, 533542, 157343, 183433, 571503, 28539, 92629, 477311, 497175, 247187, 77272, 617717, 36197, 315036, 2295, 220169, 340264, 453690, 525927, 321142, 586320, 209284, 336819, 116501, 608235, 310449, 336353, 317242, 225498, 111240, 70525, -86335, 237500, 231138, 125036, 186891, 534013, 196294, 649070, 295139, 139831, 120421, 219940, 361742, 7657, 70509, 225857, 227822, 321962, 135544, 421692, 430789, -14386, 142237, 76210, 297407, 289808, 124369, 473568, 207498, 130583, 279791, 224806, 215212, 580287, 155147, 193141, 276487, 190038, -110874, 334586, 426263, -122667, 305230, 334066, 283668, 143777]
16312A43777i6536C09210B8798O5447K49305j67720R988P8650B6004L52186A07889
16300B54017D8039L5368l0899d1712I7067Q3131M3909H3551k426a29956B80137
16288B20622J32626j41840b6736B83411a4788A19368k465L21122L857B14390J29505
16277C43895A49044K33261G9342E480k354J04537J13404Q540m4109D3539L04270
16266C47809b9538B61005G7913J22506o4987L02666A90002J02914m3395a47697
16255A82465C0392J73061k3972J42496Q8635j85792I5792O4717n3891J52735m2320
16244B17033J76446j65767j00403J30493J24423J16284a10077c8947A21902a438
16233B98096P544A23100a7587C96518A20296k7313A4907f9925l5912A32936m1917
$$ y = [143777, -96536, 309210, 28798, 94245, 343550, 175830, 185818, 264468, 26004, 378190, 107889, 254017, 48039, 83407, 52508, -41712, 97067, 180198, 224107, 83551, 81125, -129956, 280137, 220622, 353248, 211408, -26736, 283411, -14788, 119368, 116903, 438025, 441882, 214390, 343895, 149044, 382305, 79342, 5480, 3126, 107663, 221067, 229607, 185498, 43539, 347809, -29538, 261005, 77913, 200419, 135432, 438098, 190002, 292916, 249521, -147697, 182465, 30392, 203453, 179481, 321977, 410612, 224820, 95792, 160509, 106618, 259353, 217033, 393479, 227712, 127309, 257802, 382225, 498509, -110077, -38947, 121902, -1438, 298096, 305640, 123100, -17587, 396518, 120296, 92983, 14907, -69925, -105837, 132936, 91019]
16222I1019b64553a32166A5123d55262B40635c0925j05518b8742A00237a45360
16211B2304J85222L6092h6293b4795D8218a77302C7209M3784B7062a73125B55511
16199b81437c3906n2331m6610C09530N9720j73768n4900C3546K9898c45131J27246
16188b17885i433C3371L48893H0417a14301c1798j2043A30621D8213J98274o8262
16177A78225c17887D0464J42727f605A58881f1540I7529e7571B60769j21470B9850
16165a8399j24609d0450A60636h1065B16201f0022j08340d8137A59565E2559g667
16153E2614K48693f0568C70445g5232C73684A05253L1150K970k0253b6783A04884
16141B14167A1239J6904b2391A70300C5214f4226B30644K298c2159o7274H3761
$$ y = [91019, -264553, -132166, 15123, -455262, 240635, -30925, -136443, -28742, 100237, -145360, 22304, 207526, 243618, -86293, -24795, 48218, -177302, 37209, 80993, 27062, -173125, 255511, -281437, -33906, -86237, -132847, 309530, 369250, 195482, 140582, 33546, 63444, -345131, -217885, -9433, 33371, 382264, 80417, -114301, -31798, -43841, 130621, 48213, 246487, 178225, -317887, 40464, 183191, -6605, 158881, -61540, 97529, -57571, 260769, 139299, 29850, -18399, -143008, -40450, 160636, -81065, 216201, -60022, -168362, -48137, 159565, 52559, -7667, 52614, 301307, -60568, 370445, -75232, 373684, 105253, 136403, 139373, 119120, -26783, 104884, 214167, 11239, 28143, -22391, 170300, 35214, -64226, 230644, 232942, -32159, -99433, 83761]
16129B28912I7186M3498b9506m4878B7596N9897i2019B97439b3184A9958L9003
16118E8961i6081j99010f5801A03098a00570b5734A0669K1998P6540K61525j79530
16107A91202J39720a17347C9397L8534C2804K82041j13439e2810l37216J45615
16097b44411A12188J18927A07270R864b7551a2542C65157c0963B00891i0441A03294
16085a13078A35113N8568a1304B46559E5528J33882H0013a59062M6797n468l4053
16074a51786H2575k0621a7220E6846B69J14859J7993B0334c6538k77689L5126
16063b79101B64531c40932c6387K85G2682b95917e2892F2752J08666f3212j88364
16052b51576e3762E958N42848H4944h0685j12581C53512H9051l1342a21776j44151
$$ y = [228912, 97186, 140684, -29506, -74384, 27596, 87493, -92019, 297439, -23184, 19958, 58961, -96081, -295091, -65801, 103098, -100570, -25734, 10669, 32667, 109207, 370732, 191202, 330922, -117347, 39397, 77931, 32804, 314845, 201406, -52810, -390026, -244411, 112188, 231115, 107270, 117134, -27551, -12542, 365157, -30963, 200891, -90441, 103294, -113078, 135113, 193681, -11304, 246559, 55528, 189410, 80013, -159062, -112265, -117733, -151786, 82575, 61954, -17220, 56846, 269, 115128, 133121, 20334, -36538, -314227, -279101, 264531, -340932, -36387, -36102, 72682, -295917, -52892, 62752, 171418, -63212, -251576, -53762, 5958, 548806, 84944, -80685, -193266, 353512, 89051, 57709, -121776, -265927]
16041b65927j46944c1779k95053A00349c47853E50489b86871N5544P6318B09955
16030H0548M0549C6607L549c43A76219C1860J49927a6228D6945L91775A11200
16018C95002a40987A65892a74779g6498D1728J35784a67603C7079K32911c13858
16007A16693a73709C42326A62684l9312b11812Q4969O167b6955k82889O0551l962
15996b53255C16759a67184E2914B6445A0323b6059B75934j00524J37964A41894
15985A36882A6938M8039K00611J19233L2123j70268J6145C3932a6165D5745e0227
15973b23728c8774i690r2495j47722i5167F2903a60166B11501g3838b5197j1211
15962c6408j2437m4830E1773a15673A24094g2295G3049N6839a98122A71807d15121
$$ y = [-265927, -412871, -31779, -326832, 100349, -347853, 550489, -286871, -231327, -155009, 209955, 80548, 121097, 36607, 40156, -343, 176219, 31860, 181787, -16228, 46945, 438720, 111200, 395002, -140987, 165892, -174779, -76498, 41728, 177512, -167603, 37079, 269990, -313858, 116693, -173709, 342326, 162684, 123372, -211812, -126843, -120676, -26955, -309844, -249293, -253255, 316759, -167184, 52914, 26445, 10323, -26059, 275934, 175410, 313374, 141894, 136882, 16938, 64977, 265588, 384821, 416944, 246676, 262821, 33932, -16165, 45745, -50227, -223728, -38774, -9690, -102185, -249907, -95167, 62903, -160166, 211501, -73838, -25197, -36408, -48845, -93675, 51773, -115673, 124094, -72295, 73049, 129888, -198122, 171807, -415121]
15950a43189L3721C4819a83137e7835b6702j77358C13055b42185B68777a71844
15939c87k7842A38470o87a27032F9166L40792g3185A01277a04085A3247d6481
15927a57908A33018a2098A96254a02310B49192b79553Q7161Q6418a0476m8759
15917e9235b2848C6806Q9774D2687a8283A15885g6232d504G9350J65859a49355
15905D1044d3053B2786P4748b49842E1093O2124J86173j22147K61892H8204K81925
15894C70129a15615B7980M4011a64471h929k72826C12913b50365Q8735A83160
15883h6652C6627N0512b17081B04612K6132a89132B1681d1974F6992J75180d6812
15871h2967k1475l26386B83576a40092f2238B43216a33242O6376j08451A79899
$$ y = [-143189, -109468, 34819, -183137, -57835, -26702, -204060, 313055, -242185, 268777, -171844, -387, -28229, 138470, 137783, -127032, 69166, 409958, -73185, 101277, -104085, 13247, -46481, -157908, 133018, -12098, 196254, -102310, 249192, -279553, -192392, -105974, -10476, -59235, -22848, 36806, 126580, 42687, -18283, 115885, -76232, -4504, 79350, 245209, -149355, 41044, -43053, 22786, 97534, -249842, 51093, 113217, 299390, 177243, 439135, 88204, 370129, -115615, 27980, 71991, -164471, -8929, -281755, 312913, -250365, -161630, 183160, -86652, 36627, 87139, -217081, 204612, 230744, -189132, 21681, -41974, 66992, 242172, -46812, -82967, -104442, -430828, 283576, -140092, -62238, 243216, -133242, -66866, -175317, 179899]
15860b72186B59523a40728l2282B10507f3382g433j63584k11579g7930L2756B70009
15848D9647b3022k2789n352J6458j96310b6286A09184a91566g8747n5230K6512
15837a07465A74717b51594A68252b11164N4527A45338L0933R6918C7288K51525
15827B88813b82958A23979A4288a35700H6693a33115j94239H6528b23948B03714
15816a60209g7908k025A03427m6751j9444J15341a38941A47887g2625m4517K1847
15805i5295l104j15403A42187F6563J05991n6015D9384A6463h8482k09475h8482
15793I9041J21483A0210K9080K14082a36001L4526B8424M4207c6072k64280A35367
15781A63181c7327A33028B5834O9768f3687K8681A45941b02554g5G0232J2830
$$ y = [-272186, 259523, -140728, -173010, 210507, -63382, -7433, -171017, -382596, -77930, -45174, 270009, 49647, -23022, -45811, -51163, -34705, -231015, -26286, 109184, -191566, -78747, -133977, -107465, 174717, -251594, 168252, -211164, -156637, 145338, 176271, 273189, 37288, 288813, -282958, 123979, 14288, -135700, 86693, -133115, -327354, 86528, -223948, 203714, -160209, -77908, -79933, 103427, 56676, 37232, 152573, -138941, 147887, -72625, -117142, -95295, -98399, -213802, 142187, 66563, 172554, 116539, 49384, 16463, -88482, -297957, -88482, 99041, 220524, 10210, 39290, 253372, -136001, -101475, 28424, 72631, -36072, -300352, 135367, 163181, -37327, 133028, 25834, 95602, -63687, -35006, 145941, -202554, -75, 70232, 83062]
15770H3062O0622C3914K0080b9807l9459E883b10761A24743b24077d8062A87382
15758D4044J26337a75165E6255f8870l8617B20567C2261J73134i1939A80415l6523
15747A43892d3272n1647A16860a30880b1954F3465K4551K7d0670A0569K79136
15736B89705c51303J07309f3992h638o9135r6563A40630J30223c51779b4307k6187
15725e0494j68408g2407H4221a09112e26A93K29015b11491j15890b3470k00201
15714b23671n5175h5617l5352e5794m910A16156a8987m8958p0269A24900a19649
15702A13250b70549B72531j34583l3526g1519F095J30392b2039B72775L1990g8612
15690A53892P6331J9516Q3726a24215N232H1886b30799A61570d5795n4563A86756
$$ y = [83062, 143684, 33914, 53994, -29807, -69266, 5883, -210761, 124743, -224077, -48062, 187382, 44044, 170381, -175165, 56255, -68870, -107487, 220567, 32261, 205395, -91939, 180415, 143892, -43272, -94919, 116860, -130880, -21954, 63465, 88016, 88043, -40670, 10569, 289705, -351303, -243994, -63992, -8638, -77773, -174336, 140630, 270853, -351779, -24307, -50494, -218902, -72407, 84221, -109112, -526, 193, 229208, -211491, -327381, -23470, -223671, -278846, -85617, -120969, -55794, -60704, 116156, -18987, -67945, -138214, 124900, -119649, 113250, -270549, 272531, 137948, 104422, -71519, 6095, 136487, -22039, 272775, 304765, -78612, 153892, 230223, 249739, 333465, -124215, -118983, 81886, -230799, 161570, -45795, -100358, 186756]
15678A306c17248D2527c89779A78845g3232j45798B25469n1760E2956K0562k3675
15667D9843J62582a10352d8024r0931r7491A42169a84454C0552a8759p6909B4118
15655G077a60994F4964N6053b63870D4127b01657m7650i4600F5227f7314a7844
15643D0231K6044P6136J51362H0807d3189G5750A8102R44d5859A0497a60883B72567
15630a850j99829C66997f6733C4669K9310c7204j64043c343k17505l9438i9653
15618c11208A32565L42769B7437K11042P4609O8186i4155k07750A39831c01265
15607F7984a02176d7031k07095I6299a40136f0123P779a9644n5847A07843a22400
15595B1160i8836J0657k69705B65177a33837A46184f4339A38689L09456d0088
$$ y = [1306, -317248, 42527, -389779, 178845, -73232, -219030, 225469, 173709, 52956, 73518, 49843, 212425, -110352, -48024, -138955, -236446, 142169, -184454, 30552, -18759, -95668, 24118, 7077, -160994, 64964, 121017, -263870, 44127, -201657, -249307, -94600, 65227, -67314, -17844, 40231, 66275, 142411, 293773, 80807, -43189, 75750, 18102, 19046, -45859, 10497, -160883, 272567, -1850, -201679, 366997, -66733, 34669, 63979, -37204, -201247, -3343, -220848, -260286, -99653, -311208, 132565, 475334, 27437, 238479, 313088, 381274, -94155, -301905, 139831, -301265, 67984, -102176, -47031, -254126, 96299, -140136, -60123, -52344, -19644, -75491, 107843, -122400, 21160, -98836, -88179, -357884, 265177, -133837, 146184, -64339, 138689, 448145, -40088]
15584A58624p241i540A76340k9559a60675A38460l05f8485c1381C44109d08706
15572b6075j55982f6520j75336D3596b74578N0308M4484C25075G9470N159a09046
15560E4759L65084j89793p4736b6605n0132a233k9204A3386g1605A60752b59007
15548A8854J05382n7454a47887a5174E4841f3046A7719a09154j4794B05404M07884
15537F13288b80113P9343I724b43058P7004M2171o4893Q3172a6581p4801k80413
15526c71795C9417L6437B9553c4026C23870a61737a4349A44579G1456a39012e6815
15514A62241E3366f2111B44160a14055G6295K13090b34914J12105H1644J60967
15504B42611c78051a29219N7170k4381B21599l8386a96354C1248a05991j97627
$$ y = [158624, 151383, -9540, 176340, 146781, -160675, 138460, 138155, -68485, -31381, 344109, -408706, -26075, -182057, -66520, -241856, 43596, -274578, -224270, -179786, 325075, 79470, 84629, -109046, 54759, 419843, 230050, 155314, -26605, -76737, -1233, -30437, 13386, -71605, 160752, -259007, 18854, 124236, 66782, -147887, -15174, 54841, -63046, 17719, -109154, -123948, 205404, 613288, -280113, -200770, 9724, -243058, -166054, -123883, -188776, -105604, -16581, -91382, -371795, 39417, 75854, 29553, -34026, 323870, -161737, -14349, 144579, 71456, -139012, -56815, 162241, 53366, -62111, 244160, -114055, 76295, 289385, -234914, -122809, 81644, 242611, -378051, -129219, -72049, -96430, 221599, 183213, -196354, 31248, -105991, -303618]
15494c03618h1805r7615b8300a2461A77819n9847M6116b51138D8927a33887F5078
15482b97163f837k36570h072r3692A98338Q4899a12569b9099G1091c23995L5069
15471b88926F6420K9580c1172k71803J1172a13711m0006C96715g9385B05514m7469
15460A58045j3603A086b21005J03595m098A51703e5857G1914b43914b1390E3551
15448a04131r4618D6229K05861N469A02249c2929r1942H8189A92b36016A92694
15436B68792A14919R3337r9515h7710o0919I1139K13741A11516e8752D2862B1337
15424d04825C44636F0824N9105K7238h7350A35745Q9099G9233j892b8564C27012
15412c4355A67098L9137L8573k8022O2127c640j8563r3808n0913H7533M4664a69625
$$ y = [-303618, -81805, -179420, -28300, -12461, 177819, 117972, 164088, -251138, 48927, -133887, 65078, -297163, -6837, -243407, -8072, -101764, 198338, 283237, -112569, -29099, 71091, -323995, -288926, 66420, 96000, -31172, -302975, -291803, -113711, -153717, 396715, -79385, 205514, 158045, 144442, 1086, -221005, -117410, -121508, 151703, -55857, 71914, -243914, -21390, 53551, -104131, -198749, 46229, 252090, 257559, 102249, -32929, -124871, 88189, 192, -236016, 192694, 268792, 114919, 208256, 108741, -87710, -148629, 91139, 304880, 111516, -58752, 42862, 21337, -404825, 344636, 60824, 119929, 147167, -87350, 135745, 224844, 79233, 77341, -28564, 327012, -34355, 167098, 206235, 244808, 216786, 278913, -3640, -22203, -116011, -166924, 87533, 132197, -169625]
15399I5021A3750a86814P3973r6639d1819j11324B1639a05952E9948e4895j79347
15388b34242b8408j495q958B56963g7929j4965L9659A34504a53216B04299C5173
15376e1288k09669B04891e1043B6148b14282J4780k40378g1349J6611k74329d0408
15364A56516a30828E214g0055j66959f6928j30267f1146A58152J36336a3324A64646
15352B74464n9295A00451m5067J67299e5321j18284A87385c2163h378A20594n2092
15341F8502c6199A99760E1390g3915A23925D1203A9370J97491c12442E3195J6455
15330F9650i611j47031p9704H2917K58308j33433p5299O0159f487F907K0726a6615
15317a51893j02658K2459e9160B87680Q251g1074M230q9127I6251a64815k2905
$$ y = [95021, 13750, -186814, -112841, -209480, -41819, -153143, 21639, -105952, 59948, -54895, -234242, -28408, -29903, -38861, 256963, -77929, -92894, -53235, 134504, -153216, 204299, 35173, -51288, -260957, 204891, -51043, 26148, -214282, -199502, -439880, -71349, -54738, -329067, -40408, 156516, -130828, 5214, -70055, -237014, -66928, -197195, -61146, 158152, 294488, -13324, 164646, 274464, 215169, 100451, 55384, 222683, -55321, -173605, 187385, -32163, -8378, 120594, 68502, -36199, 199760, 51390, -73915, 123925, 41203, 19370, 216861, -312442, 53195, 69650, -9611, -156642, -236346, 82917, 341225, 207792, 132493, 192652, -6487, 6907, 27633, -16615, -151893, -254551, -232092, -59160, 287680, 295931, -71074, -66844, -155971, 96251, -164815, -187720]
15306a87720C35404b6013A05024b28283A12593n5015L33176k2820a33004p0053
15296b03057C40311A63878J45969r5311c88002D99040D0768M7670A7483c5342
15285I8278B1231L62317A3153L0927N2137K90888O5836e9383H924L4632a946A03943
15272a05577k5534E4089A8244J07562b12160H6007P5791b41249d7037A427J94325
15261A95752o5820a8578D7603i2053I9255a20596B12320K6667J10313J2246j66643
15250A94903F0636O60748Q78474m94365J2425m1612m78342A16142J51303J42829
15240D10274a7669A7062e37A94474M2899a33890E56727d8944B80318A35716h9451
15228A95983n2659R3503b05907c0604A89967e5970A85759F8581a32990N3540A26923
$$ y = [-187720, 335404, -26013, 105024, -228283, 112593, 57578, 390754, 367934, -133004, -203057, 340311, 163878, 309847, 214536, -388002, 499040, 40768, 88438, 17483, -35342, 98278, 21231, 383548, 13153, 44080, 96217, 387105, 452941, -59383, 8924, 43556, -1946, 103943, -105577, -131111, 54089, 18244, 125806, -212160, 86007, 161798, -241249, -47037, 1427, 195752, 129932, -18578, 47603, -92053, 99255, -120596, 212320, 238987, 349300, 361546, 194903, 60636, 721384, 1599858, 1105493, 1117918, 1076306, 597964, 116142, 267445, 410274, -17669, 17062, -537, 194474, 237373, -133890, 556727, -48944, 280318, 135716, -89451, 195983, 143324, 236827, -205907, -30604, 189967, -55970, 185759, 68581, -132990, -79450, 126923]
15216A36230A1764K3591J02470b10427C75496J6672A27961j3469j6229O19b05938
15204b43526a5062B720J87135k582a759C4778K29794E3532L29923k1537A79437
15192g5727J7486o4478E7532p586a22966k0269c505I8579K3678N2220a46176L2226
15180a13950A16602a57937D2165J35514h9901c3796j54715b3754H424J4401P7063
15169I9888J18077E9414J31672B8390J41424a64266B69467m7574N1694Q2974K9766
15158C86327A47483J21280c817j81709B80892a21689G4802l337e5379B75773L9913
15147C15686A12199b9573l486B03444c48632B43877L2555b20732Q8108C23273
15136B69141j09341n1742M3427n4054h2147a5567r5205A30961h8820A04434L99984
$$ y = [136230, 11764, 35355, 137825, -210427, 375496, 392168, 127961, 114492, 98263, 98882, -205938, -243526, -15062, 2720, 189855, 187273, -1759, 34778, 264572, 53532, 383455, 361918, 179437, -75727, -58241, -122719, 57532, 49946, -122966, -143235, -3505, 98579, 122257, 174477, -146176, -113950, 116602, -157937, 42165, 177679, -89901, -33796, -188511, -23754, 8424, 22825, 99888, 217965, 59414, 191086, 28390, 169814, -164266, 269467, 221893, 273587, 356561, 386327, 147483, 268763, -3817, -185526, 280892, -121689, 74802, 71465, -55379, 275773, 315686, 112199, -29573, -33059, 203444, -348632, 243877, 276432, -220732, -132624, 323273, 269141, 159800, 108058, 151485, 97431, -82147, -15567, -110772, 130961, -88820, 104434, 504418]
15125E04418g2734H9985J18826q630Q6090c6457C00431I5093b6989o1042A37079
15113F838J77268J02480A35543i1672A67567p2271J32048K56062a18288A05039
15102A69808d9315D70443q3410A10791K92313e1577A84168a2642k7508E1238a78306
15090C2325K7484a83060B57541P7642A16926P8M76254H5898K20671m2659C2423
15078a72801e6120D76447q8168o1650a3929A00945K2583A4799Q8554K30832j24942
15067B09243M6298I692J53305a53250C7920J31789b88502A18102g173r4194I2679
15055b31243A69235g2838B71399n8333G1015K89892j64331n342j0749e7256C23769
15043B66315G3725J32172p5376a44126J7052B41969j4302j08114N0948f1435C13080
$$ y = [504418, -72734, 89985, 208811, 200181, 286271, -36457, 300431, 95093, -26989, -88031, 137079, 6838, 184106, 286586, 135543, -91672, 167567, 95296, 227344, 483406, -118288, 105039, 169808, -49315, 470443, 387033, 110791, 403104, -51577, 184168, -12642, -40150, 51238, -178306, 32325, 59809, -183060, 257541, 335183, 116926, 117004, 593258, 85898, 306569, 263910, 32423, -172801, -56120, 476447, 388279, 326629, -13929, 100945, 123528, 14799, 103353, 334185, 209243, 255541, 9692, 162997, -153250, 37920, 169709, -288502, 118102, -7173, -101367, 92679, -231243, 169235, -72838, 271399, 213066, 71015, 360907, 196576, 191234, 180485, -57256, 323769, 266315, 73725, 205897, 130521, -144126, -127074, 241969, 227667, 119553, 170501, -61435, 313080]
15031E9343J10093K07449A016K12574f5262A37417j8276h1202F5623J55987F6186
15019E12591o1925A93543L89C5965J64605g2263A84353c76291B5750g2138B02811
15007C46622f1639E07829b10012C17939o2764j07130J48961K38385H840K12389
14997B21229H0631J46454C7306P8348i559A56115K53391l84j23507F6077Q1117
14986A47194K23352A11171j5311L26580K481g0439D43088j87261m7760J16868
14976C24935b866D4334M62977A98759r54Q7736H3750N76109i2342C73373j10763
14965B62610N9463K03604A39975L35903B8069i4341B47181b9287j10775C18468
14954A61502K7844J79906a50132D49127r5234A2491K17522m5703J43416j6242
$$ y = [59343, 169436, 376885, 1016, 213590, -65262, 137417, 119141, -81202, 65623, 221610, 66186, 512591, 450666, 193543, 193932, 35965, 200570, -72263, 184353, -376291, 25750, -72138, 202811, 346622, -61639, 507829, -210012, 317939, 255175, 148045, 297006, 535391, 8840, 221229, 80631, 227085, 37306, 115654, -9559, 156115, 409506, 409122, 285615, 66077, 147194, 370546, 111171, 95860, 422440, 424921, -70439, 443088, 255827, 208067, 324935, -2866, 44334, 507311, 198759, 197805, 285541, 83750, 659859, -92342, 373373, 262610, 322073, 525677, 139975, 475878, 28069, -94341, 247181, -29287, -140062, 318468, 161502, 189346, 369252, -150132, 449127, 353893, 12491, 230013, 184310, 327726, 311484]
14944C11484r6108r3718K85378J57981k49667A04570c47A8197K72058J66114J3327
14933D69696a5285C96354n1364H6054M2325o004K56063A24952R5392K34987a07001
14921A08597J87735m1649p8747R4082K29382j69334K5440J08048J31365I7314
14910D03395A40490M28737P5726a31443C43268J90469k61372j32443M3205b7623
14899A68661L02316j18131J61187n0877M6842J85155C3859L64644J54339j10540
14889D42302J23553j08102q9268J47033k05979L4058J75358C9315M33494n2860
14879D19949Q4855j48593l1289K05555m1626r4839A45585N6633Q1687n8392J89668
14868D15181A85909N17609B50125K20170j0742A23354K27137L09460k26161k2665
$$ y = [311484, 215376, 121658, 407036, 565017, 315350, 104570, -347, 18197, 290255, 456369, 469696, -15285, 396354, 344990, 86054, 128379, 122375, 378438, 124952, 220344, 455331, -107001, 108597, 296332, 254683, 175936, 270018, 499400, 330066, 355506, 463554, 594919, 97314, 403395, 140490, 569227, 644953, -131443, 343268, 533737, 272365, 139922, 183127, -27623, 168661, 470977, 352846, 514033, 463156, 509998, 695153, 33859, 398503, 552842, 442302, 565855, 457753, 368485, 515518, 309539, 343597, 518955, 39315, 472809, 419949, 504804, 356211, 324922, 530477, 488851, 394012, 145585, 202218, 283905, 225513, 415181, 185909, 703518, 250125, 470295, 459553, 123354, 350491, 659951, 433790, 411125]
14858D11125j73664R2981N926R1025k8307K6986j3299m0815R1547K40921A40124
14846C46337M7828K10527B80084K79778j04230r9792j25820N25427k44648K2037
14836E32836P0792j54323J71747k37264J50512r2798P5800j95490K82786A37880
14825c22156E81697k33620n7434O9816J98923J00919L2029M3715l63540J99485
14815E71990O9755k25743p2075M31953l46498M08349A94583O65538j92350J42472
14805H10243K57500E11204A89405K45971r2803K08769L30995k8018B59328j2306
14795B47022L44886n9598J29503K1583j09329K21031C04825K96461j95373J37433
14785E43346K24088q895n9435n0278B44935M23402j26198K28203l9366j13468
$$ y = [411125, 237461, 330442, 336368, 427393, 399086, 426072, 412773, 371958, 463505, 704426, 140124, 346337, 394165, 604692, 280084, 559862, 455632, 355840, 230020, 755447, 510799, 532836, 603628, 449305, 621052, 383788, 534300, 441502, 517302, 321812, 604598, 137880, -322156, 581697, 348077, 290643, 360459, 559382, 660301, 692330, 736045, 372505, 571990, 641745, 416002, 343927, 775880, 429382, 837731, 194583, 860121, 667771, 810243, 1067743, 511204, 189405, 435376, 342573, 551342, 882337, 854319, 259328, 247022, 591908, 532310, 661813, 683396, 574067, 795098, 304825, 601286, 405913, 543346, 767434, 758539, 699104, 648826, 244935, 668337, 542139, 770342, 730976, 617508]
14775F17508R9047r0798j35811l3974K05358K50144k84051l09750M9653K57029
14765F24355K2946p6293Q8197j64970J89117j41054j75448j3233p0217J42624
14755D26024O04024l88843K2392K58252m31764j77853J98069M73838m04724r1944
14745D87471K25675M02372m86129M3365k01225R6447P8757R1256J73552k21528
14735F90013j41208j3255l0898J90120M11378l02991N317k00826J82520j35057
14725F55113M2276K16623j53787m3130Q8766M2054r1538r3758J9560o8711L31881
14714I45349J05987L3630M7349D81922K68011K06912m18774P6297M00668r7129
14704I17907L0030l42229L43558J01106k39040j16750J73449J91458J026k03103
$$ y = [617508, 716555, 625757, 489946, 455972, 661330, 911474, 627423, 317673, 367326, 624355, 647301, 571008, 659205, 494235, 683352, 542298, 366850, 353617, 283400, 426024, 1030048, 641205, 663597, 921849, 490085, 312232, 510301, 984139, 579415, 487471, 713146, 1115518, 629389, 672754, 471529, 567976, 646733, 737989, 911541, 690013, 548805, 535550, 504652, 694772, 1106150, 803159, 808476, 607650, 790170, 655113, 697389, 914012, 760225, 717095, 805861, 847915, 756377, 662619, 682179, 613468, 945349, 1051336, 1084966, 1132315, 481922, 749933, 956845, 538071, 614368, 1015036, 917907, 947937, 605708, 949266, 1050372, 811332, 694582, 868031, 1059489, 1060515, 857412]
14694H57412J45950k5987k87273P1294p6887J40436J94955R8583J83191D99415
14683A029183k75583L83421k82871j78972N48141j8910m00297J51797Q9298r7718
14673I47489j40551J21220L13748m69076L53511E00369L33311K85746j87962J02458
14663A033922k65122K21662l4997j27400L88896k52816J34526l27209J78536M74740
14653A424738l82870N4781K6046j29867r4054K71340K1807l80792O25885J84137
14643A621151n37895K57062k97080M11296k47860J09391K1649Q136l18747O00511
14633A627614j79779l2801k10714L7466j3503R0343r1608J20455q5929J43459
14623A405003n119J26378k41935K00686k13292K49718p3588j25658L18194q6939
$$ y = [857412, 1003362, 977375, 690102, 761396, 684509, 824945, 1019900, 1118483, 1301674, 499415, 1029183, 753600, 1137021, 854150, 675178, 1223319, 1204409, 804112, 955909, 1045207, 947489, 806938, 928158, 1241906, 772830, 1126341, 500369, 833680, 1119426, 931464, 1033922, 768800, 990462, 955465, 828065, 1216961, 964145, 1098671, 771462, 949998, 1424738, 1041868, 1096649, 1122695, 992828, 898774, 1170114, 1191921, 811129, 1437014, 1621151, 1083256, 1340318, 1043238, 1454534, 1206674, 1316065, 1337714, 1345850, 1027103, 1627614, 1447835, 1415034, 1204320, 1241786, 1228283, 1318626, 1227018, 1347473, 1261544, 1405003, 1399884, 1526262, 1284327, 1485013, 1271721, 1521439, 1447851, 1322193, 1640387, 1553448]
14613A553448Q6851r2790o4440J54866j62207K4454j16338L7631m8455M70061
14603A843081m01783K4139J31666l75810N24196j65854O42204m80565J70986O5239
14593A977499l22248K07884J83207m87109N18230o13655K24428L89632j76463
14584A901405p1180L28286k01355q7871K74114p7348k36208n2696K13525K31151
14574B221823l13464k96554K98888P9573J05066M23370j35630K98887j24661j39078
14564B418220M4396j58141J52567K36409j10847N9494J99998J32596N6317K64510
14554C295519K26173J92128J09536O88964P77108J673993L606796J0286584K2910683
14545D3767484k11386k0822511I860992m670718j996993m74443m68042O6844l23092
$$ y = [1553448, 1640299, 1547509, 1483069, 1637935, 1475728, 1500182, 1383844, 1421475, 1373020, 1843081, 1441298, 1465437, 1597103, 1221293, 1745489, 1579635, 2221839, 1741274, 1912260, 1977499, 1655251, 1863135, 2046342, 1559233, 2077463, 1463808, 1688236, 2077868, 1901405, 1830225, 2158511, 1957156, 1869285, 2143399, 2066051, 1829843, 1777147, 1990672, 2221823, 1908359, 1611805, 1910693, 1990266, 2095332, 2518702, 2383072, 2681959, 2557298, 2418220, 2462616, 2304475, 2457042, 2693451, 2582604, 2642098, 2842096, 2974692, 3031009, 3295519, 3521692, 3713820, 3823356, 4512320, 5289428, 6963421, 10570217, 20856801, 43767484, 43556098, 22733587, 9860992, 5190274, 3193281, 2718838, 2250796, 2317640, 1994548]
14536A994548P5303k23615J15325r2569j49626O47880l77018M45799l95475J3314
14526B053866M68493o62001K60469L65294p6537k92764M45422r7067J07450N8033
14516B630658J32855j32292j70374K29128M1021P8630R1944L2693l51505L07265
14506B890023j5725J15470l629J76278J87256m90480M16259o11289M63988Q7055
14496C215206P8090k78243M01919k85512K82925J59362j19863K0286o0014p0240
14486C343916J79451J91424o3490R5109o16657M93927L38564j57369o4127R7204
14476C837952k56232N24671O9839J93964j58742K8876L2080k06874L12002j40649
14466D236887q3199J74122K57427j49765J61848P2936L51014k45853K40261k40075
$$ y = [1994548, 2069851, 1846236, 1961561, 1868992, 1719366, 2367246, 1990228, 2436027, 2040552, 2053866, 2522359, 1860358, 2120827, 2486121, 2409584, 2116820, 2562242, 2465175, 2572625, 2630658, 2763513, 2631221, 2460847, 2689975, 2730996, 2809626, 2901570, 2934263, 2582758, 2890023, 2874298, 2989768, 2986139, 3162417, 3349673, 2859193, 3275452, 2664163, 3128151, 3215206, 3293296, 3015053, 3416972, 3131460, 3414385, 3573747, 3453884, 3474170, 3414156, 3343916, 3523367, 3714791, 3651301, 3746410, 3129753, 3623680, 3962244, 3804875, 3740748, 3837952, 3581720, 4106391, 4176230, 4370194, 4211452, 4240328, 4272408, 4065534, 4377536, 4236887, 4153688, 4327810, 4585237, 4435472, 4597320, 4670256, 5021270, 4775417, 5015678, 4775603]
14456D775603n0344J41175K75675N6393p0736R1641n5867M70588J37823k29482
14446E542469j13554K52601R9440k10826N81733m38720L91727p3271K69379l3637
14436F267341J77854J67006K59703l86166L73668m5548j932K30750J35943j87561
14426F991058M74866l50100O55703R4793l11651J65036K57895J91361j73053J67559
14416H163467J65996j30238J76938M07186l4030J63389P3874J96366K24993l6131
14406I371810J69005J70525M1639L72941L09911j00666J96331J05943p2418K015
14396A0567036L26652N13191K40872J59213O796r4853J28737O91073l8605K69215
14386A2769327L07912K88280L15600L49827o8256J65163P15020K79203j38199
$$ y = [4775603, 4725259, 4866434, 5142109, 5198502, 5127766, 5219407, 5163540, 5634128, 5771951, 5542469, 5428915, 5681516, 5780956, 5570130, 6151863, 5713143, 6104870, 6031599, 6300978, 6267341, 6445195, 6612201, 6871904, 6485738, 6859406, 6813858, 6811926, 7042676, 7178619, 6991058, 7465924, 7115824, 7771527, 7866320, 7554669, 7719705, 7977600, 8168961, 7995908, 8163467, 8329463, 8199225, 8376163, 8783349, 8749319, 8912708, 8986582, 9182948, 9407941, 9371810, 9540815, 9711340, 9752979, 10125920, 10435831, 10335165, 10531496, 10637439, 10565021, 10567036, 10893688, 11406879, 11647751, 11806964, 11813760, 11718907, 11847644, 12538717, 12500112, 12769327, 13077239, 13365519, 13681119, 14030946, 13962690, 14127853, 14842873, 15122076, 14983877]
14377A4983877L86486L35578K59164K68070K94405Q83643o844L47902M02233J76743
14367A8331257M95016K16612N79966M92341M82438J96297M33627O69603L21610
14358B2218767M07710N82979M64110P96668Q98938J36790L69683R07517M80070
14349B7263232N69727P16105J042259O59694M85379R54552J154329M97082R97910
14340C4340269R46235J452800P21883Q74850J175551R95949J588444R63473J369039
14331D4428493J111304J712127J636669J166038J682137J778636J588142K168247
14323E7271793J619143K254454J900645K483184K346684K325511K865643K286324
14315G5353381L346708K894324L195668L752687L545827L788273M117830M454390
$$ y = [14983877, 15370363, 15705941, 15965105, 16233175, 16527580, 17411223, 17404379, 17752281, 18154514, 18331257, 18826273, 19042885, 19622851, 20115192, 20597630, 20793927, 21227554, 21897157, 22218767, 22626477, 23209456, 23673566, 24470234, 25369172, 25505962, 25875645, 26783162, 27263232, 27832959, 28549064, 29591323, 30251017, 30736396, 31690948, 32845277, 33342359, 34340269, 35286504, 36739304, 37461187, 38336037, 39511588, 40507537, 42095981, 43059454, 44428493, 45539797, 47251924, 48888593, 50054631, 51736768, 53515404, 55103546, 57271793, 58890936, 61145390, 63046035, 65529219, 67875903, 70201414, 73067057, 75353381, 78700089, 81594413, 84790081, 88542768, 92088595, 95876868, 99994698, 104449088]
14307A04449088M335112M919588N393987M963655O149998O259132O481630O795359
14299A49747549P475729Q222368Q144232Q799936R471711R904403J0346948J1541414
14291B23654290J1500244J2210071J2815724J3742882J4122977J4679826J5216363
14284C17942377J5135805J5742407J5898812J5385117J5821126J4716816J4207834
14277D24850294J2628950J1640105R558373P687611M749786J418104k345885m138198
14269D66049140o190949n951193m932840o429092r733476j1261427j3047169j4584072
14261C93918922j4996399j5247415j5920221j6132146j5883726j5808489j4301106
14254B85629420j4158101j3604025j3168036j2582311j1437877j1475794j0207771
$$ y = [104449088, 108784200, 113703788, 119097775, 124061430, 130211428, 136470560, 142952190, 149747549, 157223278, 165445646, 173589878, 182389814, 191861525, 201765928, 212112876, 223654290, 235154534, 247364605, 260180329, 273923211, 288046188, 302726014, 317942377, 333078182, 348820589, 364719401, 380104518, 395925644, 410642460, 424850294, 437479244, 449119349, 458677722, 466365333, 471115119, 472533223, 470187338, 466049140, 459858191, 453906998, 448974158, 442545066, 432811590, 421550163, 408502994, 393918922, 378922523, 363675108, 347754887, 331622741, 315739015, 299930526, 285629420, 271471319, 257867294, 244699258, 232116947, 220679070, 209203276, 198995505]
14247A98995505j0035189r396724q480950q080111p323592p711683p126995o598138
14239A34242123o090642m905924n169275n731816m800528m628052m425872l548672
14231I4941342l597742l626697l884761l160373l119537k952556k751756k702225
14223F9145695k009071k621109k064496k457509j724797k463482j584775k078628
14215E2141828j315293j123323j407240j643895j549979j654101j543689p46855
14207D1157453m59548j278311j334110j317794r37500j318218O6725j111209j373031
14198C2094457m15334j333121n80371m77144q44594m94807r54800m65575n63901
14189B5964810q51222o58612l55379o48566l02249q01654n65012n36485k97996
$$ y = [198995505, 188960316, 179563592, 171082642, 163002531, 155678939, 147967256, 140840261, 134242123, 128151481, 123245557, 118076282, 112344466, 107543938, 102915886, 98490014, 94941342, 91343600, 87716903, 83832142, 80671769, 77552232, 74599676, 71847920, 69145695, 67136624, 64515515, 62451019, 59993510, 58268713, 55805231, 54220456, 52141828, 50826535, 49703212, 48295972, 46652077, 45102098, 43447997, 41904308, 41157453, 40697905, 39419594, 38085484, 36767690, 35830190, 34511972, 34578697, 33467488, 32094457, 31679123, 30346002, 29765631, 29288487, 28443893, 27949086, 26994286, 26528711, 25964810, 25113588, 24454976, 24099597, 23451031, 23148782, 22347128, 21782116, 21245631, 20947635]
14180B0947635m58451m21698n52057j31505n05177m32222k54136m72128n99093
14171A7121168o5658l74191k70133j58036n73591m22852p7762L1566o29440m21417
14161A4159654K07928l09641o21902K6174n33375K32787j94489q99778L04928
14152A2372286k33142j13310k57271l31396K30613o22760J45438k48451n45648
14143A0396359K5765r7121j32866R6981m24878q0667R781l82657M3870j31460
14133I323107j50261j72122j12342m18919p4687o4655J56417m75427J09520k26847
14123G893784P5523k88882L4919j32077n68463M71177l27008m44456K9956q7991
14113F656482K845R0001m35077M54156m56407J15966k96808K69784k80791J21436
$$ y = [20947635, 20489184, 20067486, 19515429, 19383924, 18878747, 18446525, 18192389, 17720261, 17121168, 17055510, 16681319, 16411186, 16253150, 15679559, 15256707, 15178945, 15210511, 14581071, 14159654, 14367582, 14057941, 13436039, 13462213, 12928838, 13161625, 12967136, 12067358, 12372286, 12139144, 12025834, 11768563, 11437167, 11667780, 11045020, 11190458, 10942007, 10396359, 10422124, 10325003, 10192137, 10289118, 9864240, 9783573, 9793354, 9410697, 9454567, 9323107, 9172846, 9000724, 8888382, 8469463, 8394776, 8330121, 8486538, 8011111, 8120631, 7893784, 7969307, 7680425, 7715344, 7583267, 7014804, 7485981, 7158973, 6714517, 6744473, 6656482, 6659327, 6749328, 6314251, 6768407, 6312000, 6427966, 6131158, 6400942, 6120151, 6241587]
14103F241587j58042m29663L60430j71314j27131j41671Q2005k52181O037n3065
14093E356992N88630o18818J5417J20889J5969m73398K62930k70333K9733k41296
14083D786715j306Q2802l28107L59742n17251J71722J3761j71953l6331j43456
14073D216338M35978k85251k08251K01362o5167j87996j83995J23552P5395j60412
14063C961553M6442r9828K70736m82573L14154j18124n7212J39521l20319k73835
14053C380515P557J55000M2448R3844K4109k41619j4002l83761k5210J98828J74131
14042C411840j15290k03650K89418m78558j03483L33154N044j64076N44194j98210
14032C320383k97889J82527k83841M7312k68583L75995l81328K50552j81355j86506
$$ y = [6241587, 6083545, 5653882, 6014312, 5842998, 5715867, 5574196, 5656201, 5404020, 5410057, 5356992, 5945622, 5326804, 5342221, 5463110, 5479079, 5005681, 5268611, 4998278, 5028011, 4786715, 4785409, 4868211, 4540104, 4899846, 4382595, 4554317, 4568078, 4396125, 4359794, 4216338, 4652316, 4367065, 4158814, 4360176, 4295009, 4107013, 3923018, 4046570, 4121965, 3961553, 4007995, 3908167, 4178903, 3696330, 4010484, 3892360, 3835148, 3974669, 3654350, 3380515, 3388072, 3543072, 3585520, 3679364, 3703473, 3461854, 3447852, 3064091, 3038881, 3237709, 3411840, 3296550, 3092900, 3382318, 2903760, 2800277, 3133431, 3138475, 2974399, 3518593, 3320383, 3022494, 3205021, 2921180, 2968492, 2699909, 3075904, 2694576, 2945128, 2763773, 2577267]
14022B577267L43250k12603m29158K27519J43795k24538m2441J24911r8676r5288
14012B314038L65286o46198M31978j43607J4480j59022K01045j93734j91889K67054
14002B259431J7652J7825j09306P4471j60829m0044Q2960m53202J98465k92057
13992A595366O38954j11433J49771N59186K090843P185956K2129504J0459358
13984D4697505j7831210j2326499n685963k675279j535654n69111l89493q24009
13976B860287o0876M66999n47560k00902n0793l31649J0477L36584j08982R4979
13966B468564k09931r8765l8319j19058Q5500J31401l90073R1984K2661o0645
13956A883319K59692k4717M7055l78644K57814k47348k31501M22739K74032p66341
$$ y = [2577267, 2920517, 2707914, 2278756, 2506275, 2650070, 2425532, 2383091, 2508002, 2409326, 2314038, 2679324, 2033126, 2465104, 2321497, 2335977, 2176955, 2378000, 2184266, 1992377, 2259431, 2277083, 2294908, 2185602, 2260073, 2099244, 2059200, 2142160, 1688958, 1887423, 1595366, 2234320, 2122887, 2272658, 2831844, 4922687, 12108643, 34238147, 44697505, 26866295, 14539796, 8853833, 6178554, 4642900, 4073789, 3684296, 2860287, 2799411, 3266410, 2718850, 2517948, 2467155, 2135506, 2145983, 2482567, 2373585, 2468564, 2258633, 2159868, 2121549, 2002491, 2087991, 2219392, 1829319, 1921303, 1943964, 1883319, 2143011, 2118294, 2165349, 1786705, 2044519, 1797171, 1565670, 1988409, 2262441, 1496100]
13946A496100P88516n58248k14392L80140j94367R4511p2613J06552m44258N27316
13936A909257K7456m81361M34346n85984K02246K26705l1718J06227k47542k62772
13926A296860M52240j10905R4026k33220K97310k13452k00651l7642K50197l49109
13916A245654J52270R3365k12451J8568J99670p8006l44387M71659j49575q6398
13906A310369K73094k93431m1937J64286q2681j12478K5867J98773J02399J8714
13896A562975p10571K86498R3271J03579l4738J08493l01463M10409l18528L8482
13886A238407L05493o00127K43429o838k44901L87106k08625P3153q2948J9248
13876A123397N23483o24804N4965J23453q2583j44215L59104l9666l87253J64838
$$ y = [1496100, 2284616, 1726368, 1511976, 1892116, 1697749, 1792260, 1719647, 1826199, 1381941, 1909257, 1936713, 1455352, 1889698, 1303714, 1505960, 1732665, 1700947, 1807174, 1559632, 1296860, 1749100, 1638195, 1732221, 1499001, 1796311, 1582859, 1382208, 1344566, 1594763, 1245654, 1397924, 1491289, 1278838, 1297406, 1497076, 1419070, 1074683, 1546342, 1396767, 1310369, 1583463, 1290032, 1248095, 1412381, 1329700, 1217222, 1243089, 1441862, 1544261, 1562975, 852404, 1138902, 1232173, 1335752, 1301014, 1409507, 1108044, 1518453, 1199925, 1238407, 1543900, 943773, 1187202, 1180364, 935463, 1322569, 1113944, 1187097, 1104149, 1123397, 1646880, 1022076, 1077041, 1200494, 1117911, 973696, 1332800, 1293134, 905881, 1070719]
13866A070719J87593j00503R4732k08171J06213l45389M85568k85169j03353J81451
13856A083691j16908J31245J36927o0738m36102K82672j7973P1300l60121J88453
13846I02446K29970m27473K03272j4993J76164k79861L22268k38709j1448J03214
13836I64850j62588k69619O64774m98277J56480k01258q3421J32519o246j0388
13826F86826j3764L22647J40777k61299M1250j42542L02308l47521r9033N4638
13816F84287O6851K20444k00666r7625k53240K62352R1881n9190L58341J08380
13806A181815k95474m36263M12543j71094J23553O4295J40501C81629O80057l06933
13796G54753j52714K77120l2434l39420K83555O6918j56385J17628L4988j99358
$$ y = [1070719, 1258312, 1157809, 1252541, 1044370, 1150583, 805194, 1290762, 1005593, 902240, 1083691, 966783, 1098028, 1234955, 1174217, 738115, 1020787, 1002814, 1074114, 713993, 902446, 1132416, 704943, 908215, 893222, 1069386, 789525, 1111793, 873084, 861636, 964850, 802262, 532643, 1197417, 699140, 855620, 654362, 570941, 703460, 697214, 686826, 673062, 995709, 1136486, 875187, 916437, 773895, 1076203, 728682, 629649, 684287, 751138, 971582, 770916, 673291, 420051, 682403, 774284, 715094, 1073435, 1181815, 886341, 450078, 862621, 691527, 815080, 879375, 1019876, 381629, 1061686, 754753, 602039, 879159, 846725, 507305, 790860, 857778, 701393, 819021, 854009, 654651]
13786F54651r9637M56374D39555L5170k4241K49593J09765m7683k3153j62015
13776E76991J46172j48027L00223l14922J63581K94045D08997M14736k43505J81946
13766G62174P4566j08719k32797M63940l76226Q4104M7026l9297J45196l60244
13756D59723N06952l68187J27601K13684B92735L65086q6090j11338K13365n4574
13746F19184k47024K50436N5861k24816M6191L55883j60891l13455K99954j53546
13736E27777L92781D36990K22410O1334j15867K176n839j49939P7920j31536J41337
13725E38986J72887M5567k5839k98103L35600k13256j78771R0391K85977C19139
13714E29218K64539l06050K13668P678N1348k72162p9119K21393k30231j4230
$$ y = [654651, 555014, 1011388, 439555, 474725, 450484, 700077, 809842, 762159, 739006, 576991, 723163, 575136, 875359, 560437, 724018, 1018063, 408997, 823733, 580228, 762174, 836740, 728021, 495224, 959164, 582938, 667042, 714068, 674771, 819967, 459723, 966675, 598488, 726089, 939773, 292735, 657821, 571731, 460393, 673758, 619184, 372160, 622596, 678457, 453641, 499832, 855715, 694824, 381369, 681323, 527777, 920558, 436990, 659400, 720734, 604867, 607043, 601204, 451265, 529185, 397649, 538986, 711873, 757440, 731601, 433498, 769098, 555842, 377071, 467462, 753439, 319139, 529218, 793757, 487707, 701375, 709053, 760401, 488239, 409120, 630513, 400282, 386052]
13704C86052K68788j63263B19086J43174O23550C48443J56005J22998n3277J37536
13694G11705k88796R0565L8419K13537j8729l21174J27216j33287L48895N3128
13684H21479B88793K61673j07646K5728J5530q2931r1137q7619J19506M6567K1583
13673D10047A95762K42563j6661q8743J84170j08859J17893f9880C55070r4076
13663B60994J68207J88341j27187o1234K01265B67745O37186B40065M14114k99243
13653C54936M877K05681k32648J14104J1763J06456N7778j25041B35494K82628
13643E18122A67870j5965K58235M721j83115K74185K1234A41706J9180J6806L02080
13632D79772B01030M20690r9422B48439J15806p6948J81851n1835N4584A52949
$$ y = [386052, 654840, 491577, 219086, 362260, 985810, 348443, 504448, 627446, 574169, 711705, 422909, 513474, 551893, 765430, 746701, 425527, 552743, 419456, 768351, 821479, 288793, 550466, 442820, 468548, 484078, 401147, 310010, 222391, 341897, 388464, 410047, 195762, 438325, 421664, 332921, 517091, 408232, 526125, -69880, 355070, 260994, 429201, 617542, 490355, 429121, 630386, 267745, 904931, 240065, 654179, 354936, 359813, 565494, 332846, 446950, 458713, 565169, 622947, 497906, 235494, 518122, 167870, 151905, 410140, 414861, 231746, 505931, 527165, 141706, 160886, 177692, 479772, 201030, 621720, 522298, 248439, 364245, 287297, 469148, 417313, 471897, 152949]
13621A59263L33977j19143j18457Q0923l6707N2390K75912k48272j71320L22627
13611E31193k03767J76402j35399A43289K57796J55773B18918r574k7352M7746
13601B29738J85495r6297K3466L2010A41441J80692J75325F3802M7910M82990
13591E94702A23308L07939A05547e3933A77962M82472B39010p1491N1549J8412
13581B37480A10725g1844B87906M0995J84273j21289J46198j30263j32981m0823
13571B34016J40231L98726k94018k11643F9962R7948J62374e9446C16838M8537
13561C65375L4394L7562o9985j06236R1464o2442r2330J64462j80967L4953K49252
13550D65502o9469r9731K9359F8881K64429O3706A72243M6182G4696O92861B79422
$$ y = [159263, 493240, 374097, 255640, 336563, 299856, 352246, 628158, 379886, 208566, 531193, 327426, 503828, 368429, 143289, 401085, 556858, 218918, 209344, 181992, 229738, 415233, 318936, 342402, 374412, 141441, 322133, 497458, 63802, 111712, 594702, 123308, 431247, 105547, -53933, 177962, 660434, 239010, 167519, 219068, 237480, 110725, -71844, 287906, 328901, 513174, 391885, 538083, 407820, 274839, 234016, 374247, 772973, 478955, 267312, 69962, 167910, 330284, -59446, 316838, 365375, 399769, 437331, 367346, 261110, 352574, 290132, 197802, 362264, 181297, 216250, 465502, 396033, 296302, 325661, 68881, 333310, 397016, 172243, 218425, 74696, 767557, 279422]
13538C09956o7199K10312j64852J81020j75083n1695p1865L5573K13673o8878
13528C50962k8850A04251M01905F9561J19478m9629M12447b0449B00252l4479
13518A65773g8090B53468a1137H7894K29370J94609A96992L14220A70538K15864
13508C86402e5593G29548a12708K2620B56733O7483j19681a5034C31738N2052
13498C83790A24852J19531Q4481j6439d8215A9461K88564A48954J5418K07813
13488C72185j25820j17362l3920J95352G3201K81541j28554r3650J63434P9863
13478C75835j00706M0707j15137M30806f907q4084D04191b84899f1346A47965
13467A06966M85050B18083K94890q9686A02881j2031J94962A38953E2520R5959
$$ y = [309956, 242757, 453069, 288217, 469237, 294154, 242459, 170594, 206167, 419840, 350962, 322112, 104251, 506156, 69561, 189039, 139410, 551857, -20449, 200252, 165773, -78090, 253468, -11137, 87894, 317264, 511873, 196992, 511212, 170538, 386402, -55593, 729548, -112708, -90088, 256733, 324216, 204535, -15034, 331738, 383790, 124852, 244383, 328864, 312425, -48215, 19461, 308025, 148954, 164372, 372185, 246365, 129003, 95083, 290435, 73201, 354742, 226188, 132538, 295972, 375835, 275129, 315836, 200699, 631505, -6907, -90991, 404191, -284899, -61346, 147965, 106966, 592016, 218083, 512973, 423287, 102881, 90850, 285812, 138953, 52520, 148479]
13457A48479J91299J31955k10300A24278a31573B14633I5523J07659J30362J48388
13447D81932J57498A06079K44420j29343I7537Q5709J39494a2980D24694j75103
13437B49591n7080I3022B6756J23266J50755j19112D2397b86637C7659c2508A21658
13425A76671L07738A71471a9275E27503A40608L53200j77774j35568J8604e1311
13414B628L22039j05951L7743D8458b27276B39846L11099A09526K36438J18811
13404D64775L88k22341L3451e0695B35236a34087L1119C5056M936L69292a1373
13392D5029L23180C3510N9396M9017b4690A31128J11169j01919J35574A17558
13381a00320E4283J62744K5420M764m5239J84896g7514C67736F0901J52450J23887
$$ y = [148479, 339778, 471733, 261433, 124278, -131573, 214633, 95523, 203182, 333544, 481932, 639430, 106079, 350499, 221156, 97537, 183246, 322740, -12980, 424694, 249591, 192511, 93022, 26756, 150022, 300777, 181665, 42397, -286637, 37659, -32508, 121658, 176671, 484409, 171471, -19275, 527503, 140608, 493808, 316034, 180466, 199070, -51311, 2628, 324667, 218716, 256459, 48458, -227276, 239846, 550945, 109526, 345964, 464775, 465163, 242822, 276273, -50695, 235236, -134087, -102968, 35056, 39992, 409284, -11373, 45029, 368209, 33510, 92906, 141923, -24690, 131128, 242297, 140378, 275952, 117558, -100320, 54283, 217027, 242447, 247211, 201972, 386868, -77514, 367736, 60901, 213351, 337238]
13370C37238q8014N3599J0708j22328b3269A66599a55523B10974D560M66536A44600
13358C04203E8201P860O6953P9390L7399i6758j58606A68421L19210A77596q2823
13347I4773K76102i5789B82063j7649O8107a1997D2261L87434I1279J02186J6277
13336B09742g7910C5065a74996A59241M23550j61535B1711a22311D80889n1829
13326D29060j47399H3340J04311K57170B7776K04810r2231Q8207d5450C54336
13315C71463j68635n8880J55110k6535E2483J87532e8698A16598b31724A49612
13304B02832H2856J785A6034c8568E13801e4350E77976c4699C96204j91994h1843
13292f4687E5667M8347b55995A61524o7128J82633a66842A80804o8393J51468
$$ y = [337238, 249224, 302823, 313531, 191203, -23269, 166599, -155523, 210974, 4560, 471096, 144600, 304203, 58201, 66061, 133014, 212404, 249803, -96758, -255364, 168421, 487631, 177596, 94773, 370875, -95789, 282063, 264414, 332521, -11997, 42261, 429695, 91279, 193465, 209742, -77910, 35065, -174996, 159241, 582791, 421256, 21711, -122311, 480889, 429060, 281661, 83340, 187651, 444821, 27776, 232586, 140355, 228562, -45450, 354336, 371463, 202828, 143948, 299058, 272523, 52483, 240015, -58698, 116598, -231724, 149612, 202832, 82856, 84641, 16034, -38568, 513801, -54350, 577976, -34699, 396204, 204210, -81843, -64687, 55667, 104014, -255995, 161524, 94396, 277029, -166842, 180804, 112411, 263879]
13282B63879A10625L4036M2942J43526B1105R695R9079K51527j61119a55042C18346
13270f4144k8513k03490c6299B95091A4773L67184q0416j29166b7055A97600q945
13259A88655K6194r3965N6617p151d3603D45545j96081K55475j03923e4754E6893
13247B03401K0205j0208e3220B71152b4284l04539I5810Q5227m1873n4853o189
13236G8122a8324l9460K4502A2240L79441a07701B85351r7690o6550a38382C25218
13224F4405e3969C70743e9721A90797B0343L1409a52936A65528K15725n3154c5998
13212F9171C1199K5289a94558a2720B44906C0796K75628a50951H1216c2247H6027
13200B23610h6528B17065D0696J79812p6967b40602A74112R5046C3938a27996
$$ y = [263879, 110625, 144661, 187603, 331129, 21105, 30800, 129879, 381406, 220287, -155042, 318346, -64144, -92657, -296147, -36299, 295091, 14773, 381957, 301541, 172375, -27055, 197600, 188655, 214849, 120884, 177501, 170350, -43603, 445545, 249464, 504939, 401016, -54754, 56893, 203401, 223606, 213398, -53220, 271152, -24284, -328823, 95810, 181037, 139164, 84311, 78122, -18324, -57784, -33282, 12240, 391681, -107701, 285351, 187661, 121111, -138382, 325218, 64405, -53969, 370743, -59721, 190797, 20343, 51752, -152936, 165528, 381253, 328099, -35998, 69171, 31199, 56488, -194558, -12720, 244906, 30796, 306424, -150951, 81216, -32247, 86027, 223610, -86528, 217065, 40696, 220508, 143541, -240602, 174112, 269158, 33938, -127996]
13189b3165A13287J26666A06031b52011a457D7362a54225I0031k9006a45529A08490
13177F9416b7723B94508b28498f2226C04629O2702b88547i6475F3196K5596J06277
13166A95069q2686a49734k57053E9214a39834R544J8142B25365A08336a66608
13155b8846B26041K86629B27203F8986a14660b2576B34717c6434j0740C52729
13144A80963b32323A5122e7841I7388J15948h4509k7855L6292A24479N2122c9322
13132A37126C0858J20003a42586e1515B71372b0996F4907a16941F5247J32276
13122A97523a03797B47302b26647f8799B37447m0586H6904i1293B81810e0730
13111d2143D3125h9247E8314a03041H4850a22730d4193a0181d986C85750A76612
$$ y = [-23165, 113287, 239953, 106031, -252011, -1457, 47362, -154225, 90031, 61025, -145529, 108490, 69416, -27723, 294508, -228498, -62226, 304629, 367331, -288547, -96475, 63196, 88792, 195069, 112383, -149734, -406787, 59214, -139834, -130290, -112148, 225365, 108336, -166608, -28846, 226041, 512670, 227203, 68986, -114660, -22576, 234717, -36434, -47174, 352729, 180963, -232323, 15122, -57841, 97388, 213336, -84509, -112364, -76072, 124479, 176601, -39322, 137126, 30858, 150861, -142586, -51515, 271372, -20996, 64907, -116941, 65247, 197523, -103797, 247302, -226647, -68799, 237447, 196861, 86904, -91293, 281810, -50730, -42143, 43125, -89247, 58314, -103041, 84850, -122730, -44193, -10181, -4986, 385750, 176612]
13099A76943a11338H6915L9357d6163B3727K60619F5640K53166A46613f5941A11146
13087a23030c5006n1906b1225F5233M7022b71407H0612B4789O7599b20281D31755
13075a23638C0351Q5118g5616C21116j50638Q8768j373d6271B25935M5493F0861
13063C1330J40603Q0125a42l77510B29936a44718C81457a56000F602a07639b7215
13051b44727J03128A8881K17678q0172b3409B25040e5321B76412I8725J3714J0258
13040A22697J59347I4516e6276l6903D40740a07946A53502J4131P052o744M5802
13029B13743K96707k39892D2091J23705L60824A60622F3584R8311E9344M5842
13019A05186K3105J38284q3676b26771E18639j79103b54094A68067l1080b7489
$$ y = [176943, -111338, 86915, 126272, -46163, 23727, 284346, 65640, 318806, 146613, -65941, 111146, -123030, -35006, -86912, -21225, 65233, 112255, -271407, 80612, 24789, 92388, -220281, 431755, -123638, 30351, 115469, -75616, 321116, 170478, 259246, 257873, -46271, 225935, 271428, 60861, 31330, 171933, 252058, -142, -377652, 229936, -144718, 381457, -156000, 6602, -107639, -27215, -244727, -141599, 18881, 236559, 156387, -23409, 225040, -55321, 276412, 98725, 112439, 122697, 282044, 94516, -56276, -93179, 440740, -107946, 153502, 167633, 174685, 167941, 213743, 510450, 270558, 42091, 165796, 526620, 160622, 63584, 161895, 59344, 105186, 128291, 266575, 182899, -226771, 518639, 339536, -254094, 168067, 136987, -27489]
13008D77495d1942p7132M4102c1682B22042E4549J16741a60430b6305p0874F0307
12996C81883b49354a582l1803o7423A13846J15230K88665b3280C51595j26936
12986B24659J1912F8919A1190P2098a32574B69397a0919j98870a01916C49211
12975i5387c9535n6454B69955e42B8566o217G853h3035K2494b0474A26085a87621
12962d8020C9481J75625r1145L11305a11822F9228C546a28894B3019J02742m8416
12951G7345g8309A49321B7250R8865i0600J5829B62715a21003a0918j8526A03954
12939B82991F0016b54801A04051a25337A17903J94093h3494A76400A8388Q7051
12929A05439A0257i5942K7051N807G0935K44122D7699g6302B56717A14774R5099
$$ y = [477495, -41942, -119074, -74972, -31682, 222042, 54549, 171290, -160430, -26305, -97179, 60307, 381883, -249354, -1582, -33385, -100808, 113846, 229076, 517741, -23280, 351595, 224659, 236571, 68919, 11190, 83288, -132574, 269397, -10919, -209789, -101916, 349211, -95387, -39535, -95989, 269955, -542, 28566, 22349, 7853, -83035, -60541, -20474, 126085, -187621, -48020, 39481, 215106, 123961, 435266, -111822, 69228, 3546, -128894, 23019, 125761, 77345, -78309, 149321, 27250, 126115, -90600, -74771, 262715, -121003, -10918, -29444, 103954, 282991, 60016, -254801, 104051, -125337, 117903, 311996, -83494, 176400, 18388, 105439, 10257, -95942, -68891, -63084, 70935, 315057, 47699, -76302, 256717, 114774, 209873]
12918B09873O6424b01025f1546A03007K8456g7604C1749J52459D9238i4884j24344
12907b19228G344M9396a37734A21991Q1259e2916B7016a47712B44017b03741H8384
12895A90906I291J1636a46217C24919E8148O2067c95344h5023A60868a46886L425
12884a43461K4561B62707b7086E3184K21796F9646c59534h4410a0732B84265P5209
12873C59474I4852C1933J4606b99846h6285F5776c75998A86433B6254O0343a84400
12861b3966B55834K06716a27723B42971i3439C8320O3394J42959q1504B3483L01312
12850C24795a18242B78871b812j00719l1791A66189f0389B16355O4140b14652
12839c718A05719e6943A14737A8989J5809C593K13006i6956B08081H5334B6528
$$ y = [209873, 276297, -201025, -61546, 103007, 131463, -77604, 31749, 184208, 49238, -94884, -219228, 7344, 56740, -137734, 121991, 203250, -52916, 27016, -147712, 244017, -203741, 88384, 190906, 9291, 20927, -146217, 324919, 58148, 120215, -395344, -85023, 160868, -146886, -143461, -118900, 262707, -27086, 53184, 274980, 69646, -359534, -84410, -10732, 284265, 359474, 94852, 31933, 46539, -299846, -86285, 65776, -375998, 186433, 26254, 86597, -184400, -23966, 255834, 462550, -127723, 242971, -93439, 38320, 101714, 244673, 163169, 23483, 324795, -118242, 278871, -2812, -103531, -135322, 166189, -60389, 216355, 280495, -214652, -3718, 105719, -56943, 114737, 18989, 34798, 3593, 216599, -96956, 208081, 85334, 26528]
12827g7857A5965J22250c6843H8309a2415B45653a90917g706k4284G5397a99935
12815G6886A4272b55747H6965d20555R2006A16436a8480j12964F2134M906a38829
12803a64751c7623r0958C95785D5252J2502c65191C1181K32098E5201J03908b78378
12791A05232E2090b12192O4556L8753q3537Q0132A4379g3590k95864d8404A49832
12779c1937J4757B30003A5273P6019g0604C22996a62262B09667A02557L7028b83306
12767b12522C1232a92161j17791A92796a22786m7953P7341l7877B3404J64107
12757A87511M2229A6800J25041E5767f0368r0123g1449B11590a61147n4281P5556
12746a39872k9115A62416c45359a30513j69458A31185a05032C31115B4692M3456
$$ y = [-77857, 15965, 138215, -36843, 88309, -12415, 245653, -190917, -7706, -31990, 75397, -199935, 76886, 14272, -255747, 86965, -420555, -328549, 116436, -18480, -131444, 62134, 67040, -138829, -164751, -37623, -128581, 395785, 45252, 57754, -365191, 31181, 263279, 55201, 159109, -278378, 105232, 52090, -212192, -147636, -108883, -192420, -112288, 14379, -73590, -369454, -48404, 149832, -31937, -17180, 230003, 15273, 91292, -70604, 322996, -162262, 209667, 102557, 139585, -283306, -212522, 31232, -192161, -309952, 192796, -122786, -170739, -93398, -131275, 23404, 187511, 229740, 16800, 141841, 55767, -60368, -150491, -71449, 211590, -161147, -215428, -139872, -168987, 162416, -345359, -130513, -299971, 131185, -105032, 331115, 24692, 68148]
12736F8148K39135O9876D1600J5110K08605j13130E4722J80078D2484a91202G6536
12724b44717A68940i9352E1354c21788A3318J83873a42469B0693J49788a08819
12713B2540i1846B19012F0897i9540A74929a0789k84301a7811A50216e9403A64876
12701B77265Q6209A18681J63821C4794m063i3303A68136l1186m746N7951E2605
12689h626B56646c9125j30740F3047a59760A9865a24454D5086f847B9N641i4557
12676i0518D2408K78007d2753l1440H6144M0638K47343a44911K7677C8318b60455
12664D11916A21832J23780p7096n3608D8712P4357g5340B74631A08656M2627M0729
12653A92012q6455R3086d7527C9675h8269B52049g7747m9719A89861D0299e9810
$$ y = [68148, 307283, 377159, 41600, 56710, 265315, 152185, 54722, 234800, 42484, -191202, 76536, -244717, 168940, -99352, 51354, -321788, 13318, 197191, -142469, 20693, 170481, -108819, 22540, -91846, 219012, 60897, -99540, 174929, -10789, -295090, -17811, 150216, -59403, 164876, 277265, 363474, 118681, 282502, 34794, 30731, -93303, 168136, 136950, 132204, 190155, 52605, -8626, 256646, -39125, -169865, 63047, -159760, 19865, -124454, 45086, -6847, 29, 5670, -94557, -90518, 42408, 320415, -42753, -74193, 86144, 126782, 374125, -144911, -117234, 38318, -260455, 411916, 121832, 245612, 168516, 114908, 48712, 123069, -75340, 274631, 108656, 151283, 192012, 105557, 198643, -47527, 39675, -88269, 252049, -77747, -127466, 189861, 40299, -59810]
12641b11034A27981J46000O9258b8608E3508N0824a16854p448e5008o3560C19216
12629C65091j08947a65808k3775B69785j32604O847o6782a2114F6618d3349B03988
12617d5124C01669A40990n7499a01422A2811i7255G9511b52821A3488b18775R0293
12606a28482j17614i0853A63024A7725b14192q548E1193j3071J49737b6489G132
12594C66783A42741a16178A82775c3729k7347B62821b94142J44572A51124a34231
12583D614J10170C0089M71296d521k1925c061j66394A47513l3780a09031A65740
12571C5806J4747b05336A43084a58764O0893A97850a635C54127E9844a94197B31748
12559H4043a06745a2213D7487L68322a89044K4125m8986H8506N4917B2855a29585
$$ y = [-211034, 127981, 273981, 343239, -28608, 53508, 104332, -116854, -124302, -55008, -118568, 319216, 365091, 256144, -165808, -189583, 269785, 137181, 144028, 77246, -12114, 66618, -43349, 203988, -45124, 301669, 140990, 83491, -101422, 12811, -97255, 79511, -252821, 13488, -218775, -128482, -246096, -90853, 163024, 17725, -214192, -222740, 51193, 38122, 187859, -26489, 7132, 366783, 142741, -116178, 182775, -33729, -61076, 262821, -294142, -149570, 151124, -134231, 4614, 114784, 30089, 501385, -4521, -26446, -3061, -169455, 147513, 113733, -109031, 165740, 35806, 50553, -205336, 143084, -158764, -97871, 197850, -1635, 354127, 59844, -194197, 231748, 84043, -106745, -12213, 47487, 415809, -189044, -164919, -213905, 88506, 143423, 22855, -129585]
12547B2427b52970b5546A99911p2356a84284N5649l151E9036c8432d656j12890
12536a17546k16505A14867Q2600p9837J53859G0576a34348L230A00610b0163l0931
12525e1094n3978B5244Q937J79974c6342F3272R2983J9003H6147j8405J06010
12514A73752a85519A81172a60372E5603f5155o5469L2191B69859g4990o6773A18091
12502b49382A88520B4195b45279D31933A31024a03677B09387J4711o7a47628d3318
12490h3647j63336a08683E5394c1622G1721P0507C6485J3370i1823H9315b9422
12478A09352J65280j33122L4559f0900A58138a92235O2791B6852m037J71199b15397
12466A27208l0211J05418a61598I7308b6915B9854L4558d8557K4242m2208k79270
$$ y = [22427, -252970, -25546, 199911, 127555, -184284, -128635, -131786, 59036, -38432, -4656, -117546, -334051, 114867, 197467, 117630, 271489, 70576, -134348, -131118, 100610, -20163, -51094, -105072, 25244, 34181, 214155, -36342, 63272, 156255, 175258, 86147, 67742, 173752, -185519, 181172, -160372, 55603, -65155, -130624, -98433, 269859, -74990, -141763, 118091, -249382, 188520, 24195, -245279, 431933, 131024, -103677, 209387, 224098, 224031, -147628, -43318, -83647, -246983, -108683, 55394, -31622, 71721, 142228, 36485, 49855, -91823, 89315, -29422, 109352, 274632, 141510, 176069, -60900, 158138, -192235, -129444, 26852, 22815, 194014, -215397, 127208, 96997, 202415, -161598, 97308, -26915, 29854, 64412, -48557, -24315, -66523, -345793]
12455c45793C65174i2232k88308A12403b42073M6904C37353A1093K82476e57205
12444A7604P8868C4490O2137J01148b25560A54134e9586k01433j44748A11094
12433A55407b8743D7486a78017P7329k07204D388Q8515b51644O58C7313b28039
12421h0652A1142J11737a50778I908d41509a73152j20621a18016j70573A47637
12410G8899K11650c92037e2487G1408J88258J26593h810A40006o5897R7811A2368
12398B85730A15835B2512J16913o9255a87552k276J7507e8388j07334K1459e7059
12386c4225p7521A15745C0787Q6301b14154C6582d093k78301k3906A90223a27215
12374A17493L9157a84481B1681K6357N3741m9118c9613I1961K8908h575k76856
$$ y = [-345793, 365174, -92232, -380540, 112403, -242073, -195169, 337353, 11093, 293569, -557205, 17604, 96472, 34490, 96627, 197775, -225560, 154134, -59586, -261019, -405767, 111094, 155407, -28743, 47486, -178017, -100688, -307892, 4388, 92903, -251644, -250986, 37313, -228039, -80652, 11142, 122879, -150778, 9908, -441509, -173152, -293773, -118016, -288589, 147637, 78899, 290549, -392037, -52487, 71408, 259666, 386259, -8810, 140006, 74109, 171920, 12368, 285730, 115835, 22512, 139425, 70170, -187552, -189828, -172321, -58388, -165722, -144263, -57059, -34225, -111746, 115745, 30787, 117088, -214154, 36582, -4093, -282394, -306300, 190223, -127215, 117493, 156650, -184481, 21681, 48038, 101779, 52661, -39613, 91961, 120869, -8575, -285431]
12363b85431a20877C47281a36254c1611j9205G4062i6342J6544A93187p0579b7794
12351a63165M1327G6707J75018p238a85269A43308B1946c1256G9820N2579P2558
12340B04957i1491b0249H6158C0766a5947A79509a13876A5237a3384A52617b53613
12328i1517r7070j93717C55945B9637J34712p3433d5919A44309k1217h4049E14928
12316a55058K6222d751B51763j15251R4424i571j76954K1157J177H6243a14405
12304c81058B2709K23553a1498A76059F069L03336c5227B48294G3481b37299O0027
12293a77272B53488I2903d0987A25448b60239a7401G3420J07173p2088K1845c620
12281G6451J18245J4133E761J56606a06695A48081d078C32652A65030J38625j48123
$$ y = [-285431, -120877, 347281, -136254, -31611, -50816, 74062, -96342, -79798, 193187, 122608, -27794, -163165, -121838, 76707, 251725, 244487, -185269, 143308, 21946, -31256, 79820, 132399, 204957, -91491, -20249, 86158, 30766, -15947, 179509, -113876, 15237, -13384, 152617, -253613, -91517, -188587, -382304, 355945, 29637, 164349, 90916, -45919, 144309, 123092, -84049, 514928, -155058, -128836, -4751, 251763, 136512, 230936, -9571, -186525, -165368, -164191, 86243, -114405, -381058, 22709, 246262, -11498, 176059, 6069, 309405, -35227, 248294, 73481, -237299, -177272, 253488, 92903, -40987, 125448, -260239, -17401, 73420, 180593, 108505, 130350, -3620, 76451, 194696, 208829, 5761, 162367, -106695, 148081, -4078, 332652, 165030, 303655, 155532]
12270A55532M1029n5444l9610b03247b633A22557l9772f038j06921A23580O0631
12259A84211c9493q6851D12571j03830l9756K23377b8176I3536Q147d07908F7198
12247E5074a98022b441o0285A94609G9043l1314K1473J38810K56665a91737A00792
12235A20451L01032c6047A40116l7165J65944B5067b4044C86115I0497K26899
12225C17396i3065B03178J69057I3617b3919B75869N2649A5911K38282f4503A27987
12213I4576g8333B38862A8737e9049A16228Q099c21334d4818B0982K37554j9971
12202B38565J71955j49951F1132K0516P5953O8012A01112m316O04J0302J9194
12191A26896L30803J22862g412q3366A25071a98433o410B69638q7346a53713H1303
$$ y = [155532, 196561, 141117, 101507, -203247, -2633, 122557, 82785, -6038, -112959, 123580, 184211, -39493, -126344, 412571, 308741, 268985, 492362, -28176, 93536, 101683, -407908, 67198, 55074, -198022, -2441, -62726, 194609, 79043, 47729, 69202, 208012, 464677, -191737, 100792, 120451, 421483, -36047, 140116, 102951, 268895, 25067, -24044, 386115, 90497, 317396, -93065, 203178, 372235, 93617, -23919, 275869, 328518, 15911, 254193, -64503, 127987, 94576, -78333, 238862, 18737, -59049, 116228, 124327, -321334, -44818, 20982, 258536, 238565, 410520, 260569, 61132, 81648, 157601, 225613, 101112, 96796, 97400, 107702, 126896, 457699, 580561, -7412, -90778, 125071, -198433, -204843, 269638, 182292, -153713, 81303]
12179i5795j04168B34373C205J52211h7974A67898P2047D9257R260J20824c8301
12167B6365L03321r7348M1613K3617G7740i4783I3023M226L96598d9055A2282
12155b10141A44720c48777d2840B47564G8867i9915o3863A1174J50812a17502
12144A26989P3520m7288c12857D19846E7694K9997J18210Q0108p4437C7909a5273
12132C6253c1131A37048b6472A90599q5650K242M7080l3283a44474B20845r5185
12121A25660b72900I4210J24728H2415J61850a14751a2262m6971B59889b52197
12110b88854D5501c1796B19432l1740C2399a4701E4599J66503a48751A29423H054
12098b2069A81971a31974G9831J7030b18657B6112a46807L405l6990A64173L7140
$$ y = [-95795, -199963, 234373, 3205, 155416, -87974, 167898, 239945, 49257, 58517, 179341, -38301, 26365, 329686, 232338, 273951, 297568, 77740, -94783, 93023, 97249, 493847, -49055, 12282, -210141, 144720, -348777, -42840, 247564, 78867, -99915, -163778, 11174, 161986, -117502, 126989, 200509, 153221, -312857, 419846, 57694, 87691, 205901, 286009, 211572, 37909, -15273, 36253, -31131, 137048, -26472, 190599, 104949, 107191, 154271, 120988, -144474, 220845, 125660, -272900, 94210, 218938, 82415, 244265, -114751, -12262, -59233, 259889, -252197, -288854, 45501, -31796, 219432, 187692, 32399, -14701, 54599, 221102, -148751, 129423, 8054, -22069, 181971, -131974, 79831, 96861, -218657, 26112, -146807, -143402, -180392, 164173, 201313]
12087B01313C9452h948j21678B97768a07713C4618K49922J14580L07731J599371
12077B306222q30869F91427B03140R2471A37169a25610B0088b2581A95310G2456
12066B19345b54922D0614a1173j95928e5574K6920n5899c3512j43345A36393f506
12054g1035A85422C6399i5229A15528j429f4953L1658j04158k41493a58592k4712
12043a83304C48597c20651F2436a80236B3245f8978j48161M808M0837f9192H6280
12031a33728H4872b47588C8328A6394b48600C32166e747B2264b7393D53649c86348
12019F8102L33929A08970l8254b91562H4526b36215b3404k73523G8882a82361
12008A91205N287d1717R873B2798J00649E6202K11927b7066C2493A0550J79836
$$ y = [201313, 39452, -8948, -130626, 297768, -107713, 34618, 284540, 399120, 706851, 2306222, 1475353, 691427, 203140, 295611, 137169, -125610, 20088, -22581, 195310, 72456, 219345, -254922, 40614, -11173, -207101, -55574, -28654, -84553, -33512, -176857, 136393, -6506, -71035, 185422, 36399, -95229, 115528, 114099, -64953, -33295, -137453, -378946, -158592, -183304, 348597, -320651, 62436, -180236, 23245, -68978, -217139, -212331, -171494, -69192, 86280, -133728, 84872, -247588, 38328, 16394, -248600, 332166, -5747, 22264, -27393, 453649, -386348, 68102, 402031, 108970, 70716, -291562, 84526, -236215, -23404, -296927, 78882, -182361, 191205, 196492, -41717, -31844, 22798, 123447, 56202, 268129, -27066, 32493, 10550, 190386]
11997A90386c79552c6036D2554J22541a20588A62533a09404L3854A91575a0405
11986A69822b78143a25561A4965d2169k33714L2555A67154E4614R3223a6646H9259
11974a18979a9816L528j62930k4814A14022J39218a12859B1343b20838j45027
11964c65865E6860N0778e7063A03072j0780a75123G1249f8872k99626a19412l90741
11953e10153A22901a66919C0392d0973H274a29213l3608A63428A0340K52979a10555
11941A84250E5413b00423R0231G385a14554p1462f4965G7715h1740K2300p6762
11930a36202l95647D62465a62090j24825F8850l1201M7464C1117N548R7080M5325
11919A79070m5555a26296l8541j18766J30339A34041b64350F6280R1448i3727
$$ y = [190386, -379552, -36036, 42554, 165095, -120588, 162533, -109404, -75550, 191575, -10405, 169822, -278143, -125561, 14965, -42169, -275883, -243328, 167154, 54614, 147837, -16646, 89259, -118979, -19816, -16288, -179218, -204032, 114022, 253240, -112859, 21343, -220838, -365865, 56860, 107638, -57063, 103072, 92292, -175123, 71249, -68872, -368498, -119412, -510153, 122901, -166919, 30392, -40973, 8274, -129213, -162821, 163428, 10340, 263319, -110555, 184250, 55413, -200423, -110192, 7385, -114554, -186016, -64965, 77715, -81740, -59440, -136202, -531849, 462465, -162090, -286915, 68850, 37649, 85113, 31117, 36665, 133745, 179070, 133515, -126296, -164837, -283603, -153264, 134041, -264350, 66280, 157728, -93727]
11908C9110h2306r3168I3675a46642A83013R3009e723A29396C4625b92254O9210
11897b23044c9245L475J4124A60266L7259g5596H4835c11253d4997j75122h5318
11885C2454K04496g4109j90964g1621J2966m04760a17356p1708A29955a01416
11874A46206N1721f7627k3245A60262L8443C4545a93646B52914b44046K1785b5358
11862A75852J90158i7789a5519j67293j39471b1367j67454j13256d9348k242o0244
11851a11834l9647e2684m1982K9468H9431J72959j14983b65145B1669a67101A71836
11839c2905p662a8931G4239a48969N9981k74363a04082M6981I8575g3394k27819
11828c01213A44247b93372A67299e5084C7627n048K0170J18558h6274B21072c8837
$$ y = [39110, -82306, -175474, 93675, -146642, 183013, 276022, -5723, 129396, 34625, -292254, -223044, -39245, -35770, -21646, 160266, 197525, -75596, 84835, -311253, -44997, -220119, -85318, 32454, 236950, -74109, -265073, -71621, -58655, -463415, -117356, -189064, 129955, -101416, 146206, 197927, -67627, -90872, 160262, 198705, 34545, -193646, 252914, -244046, -222261, -25358, 175852, 366010, -97789, -15519, -182812, -322283, -21367, -188821, -302077, -49348, -51590, -111834, -151481, -52684, -94666, -65198, 89431, 262390, 147407, -265145, 21669, -167101, 171836, -32905, -40567, -18931, 74239, -148969, -88988, -363351, -104082, -57101, 98575, -73394, -301213, 144247, -293372, 167299, -55084, 37627, 32579, 52749, 171307, -86274, 221072, -38837]
11816f247r214B97779g4133j82639R579A13955K53776b44504I802a30743N9234
11805g1509o1227j82829B3712M5547h2554k27289D2572A884b77297h7343B27538
11793H5211b9306k33307d9855m6576k28420D628d05046C0812b15666c6680j85574
11782b22254B62616a71361h5349j67063c962j66045B16905b3211C59511D6512
11771H9363N0628f3599G3447c41928a43757e9766j15375F8425O6678a19714d9619
11759b2168j66564n3272Q2633g7938l06D012Q302e613k90149i9694B52935B3862
11746a53705B7058f5712a6703G9825a54803J3371I7118J17603r3838f1659n0721
11735a12380M0610B0046b2775I7493i8785B7342L1094L18905b5786p7152m2769
$$ y = [-6247, -15461, 297779, -74133, -256772, -247193, 113955, 367731, -244504, 9802, -130743, -71509, -132736, -315565, 23712, 69259, -82554, -309843, 42572, 1884, -277297, -87343, 227538, 85211, -29306, -262613, -49855, -96431, -324851, 4628, -405046, 30812, -215666, -36680, -222254, 262616, -171361, -85349, -252412, -3962, -170007, 216905, -23211, 359511, 46512, 89363, 139991, -63599, 73447, -341928, -143757, -59766, -175141, 68425, 135103, -119714, -49619, -22168, -188732, -242004, -159371, -77938, -78244, 4012, 12314, -5613, -295762, -99694, 252935, 23862, -153705, 27058, -65712, -16703, 79825, -154803, -141432, 97118, 214721, 120883, -61659, -112380, -71770, 20046, -22775, 97493, -98785, 27342, 58436, 377341, -25786, -102938, -145707]
11724a45707C33411a73930f084l18647g7272D10728h9004L5843l89313B96383
11713a11210A72238J17829E3228L51877j56873N9630A06994J1562e5987A1104
11702h4529q8416c6185G0852a10488b4005r8607B5679J88353L4014a20205A61874
11690F8671O9705h8640b7737A67783P3881a43886f5185q4219r9841B5801O9462
11679I5263f770A33254J70730b40076A36113m951a13267G5894b74823J23116p4176
11668b25883A30002L3722d5295A35932J50251j05613b07348C00748B4460o1b24550
11656A09523L6206a64877A87308a66120A07513a88750A89479C8983j2530a62567
11645A30598j4038O1230c01805C3295L46076a1444j77265A14600J89663b21521
$$ y = [-145707, 333411, -173930, -6084, -324731, -77272, 410728, -89004, -53161, -442474, 296383, -111210, 172238, 290067, 53228, 405105, 248232, 307862, 106994, 118556, -55987, 11104, -84529, -172945, -36185, 70852, -110488, -24005, -122612, 25679, 214032, 248046, -120205, 161874, 68671, 138376, -88640, -27737, 167783, 241664, -143886, -65185, -149404, -249245, 25801, 95263, -6770, 133254, 303984, -240076, 136113, 131162, -113267, 75894, -274823, -151707, -225883, 130002, 163724, -45295, 135932, 286183, 180570, -207348, 300748, 24460, 24399, -224550, 109523, 145729, -164877, 187308, -166120, 107513, -188750, 189479, 38983, 26453, -162567, 130598, 116560, 177790, -301805, 33295, 379371, -11444, -188709, 114600, 304263, -221521]
11634i3797j22388I8242D8958a7972o280n4623A93146K815a40552A33262d8364
11622c5514r6693A52364c0597B25060a62311E7511b22611A83561d6032J2048n758
11611c9742i810D6382e8204B7707J81261h1722B2434l488J303L7632J25925B2425
11598b88713a03141F4662O4110a39140F4681A0623P0774b22514A28032d6087k26501
11587b72588B56576d565j29911H3024B7245J62146c4061j45292o9464B78706I6271
11575A22449J44266A07845J29007K93304g3301C59205i1222A66892a72514G6354
11564e1853k6821B43929H0931J21727a417G1492K39738F6612e4201A46696J87916
11553C34612k8730b0307n5938a1600A44467K11353d1323B8008e0418G6680N5384
$$ y = [-93797, -216185, 98242, 48958, -17972, -24252, -78875, 193146, 195961, -140552, 133262, -48364, -35514, -132207, 152364, -30597, 225060, -162311, 57511, -222611, 183561, -46032, -33984, -39742, -9810, 46382, -58204, 27707, 208968, -81722, 22434, 18946, 20249, 57881, 183806, 22425, -288713, -103141, 64662, 128772, -139140, 64681, 10623, 81397, -222514, 128032, -46087, -272588, 256576, -4565, -134476, 83024, 27245, 189391, -34061, -179353, -248817, 278706, 96271, 122449, 266715, 107845, 236852, 530156, -73301, 359205, -91222, 166892, -172514, 76354, -51853, -78674, 243929, 80931, 202658, -1417, 71492, 311230, 66612, -54201, 146696, 334612, 305882, -20307, -76245, -11600, 144467, 355820, -41323, 28008, -50418, 76680, 132064]
11542A32064K472K21116a7468q2026K8000D4179J29817P2563P1245B504a82544
11530H7713b45348f6061B32800h448A44058F3041J43785h7679J915A89715a79202
11518a14723K3217A40906k5765J38328G0615B5454a81079D29684j81502a7390
11507A31123M3840J3139J97319A39864E8903J08911J3592n9578b08321B30036
11496B14364d0388A59090M3581G3642P0450B8792a72104m1137B35597p3861B5630
11484a07841H0038Q772O6128J3532D8678B3950N4924N0048E3821L36226A41565
11472e7871I1425D4537J37117D9588J03397b43782B06199j3135r1856J95366a03397
11460G1104J14376a3738B00969F4420e7237B62596b2965f053A69844O4670o3622
$$ y = [132064, 134536, 355652, -17468, -99494, -71494, 44179, 173996, 246559, 317804, 2504, -182544, 87713, -245348, -66061, 232800, -8448, 144058, 63041, 206826, -87679, -85764, 189715, -179202, -114723, -91506, 140906, 115141, 253469, 70615, 25454, -181079, 429684, 248182, -17390, 131123, 174963, 188102, 385421, 139864, 58903, 167814, 181406, 121828, -208321, 230036, 214364, -40388, 159090, 202671, 73642, 144092, 28792, -172104, -213241, 235597, 161736, 25630, -107841, 80038, 88810, 154938, 168470, 48678, 23950, 78874, 128922, 53821, 390047, 141565, -57871, 91425, 44537, 181654, 49588, 152985, -243782, 206199, 193064, 101208, 296574, -103397, 71104, 185480, -13738, 200969, 64420, -57237, 262596, -22965, -6053, 169844, 234514, 170892]
11449A70892J3781O0674j1382F3632a97517K3485h1851D11692a09010a2164B43818
11437h8279A83717i7311L1041B60756e2256M545A40974O6459p2019J02048a06633
11425b46809C48609j73259E4495a76877M7577A28583c31922J54592J5812A60148
11414A09321K39254b1610n867D4599b10443g103A99091D2505g4884a5359G164
11402A47914L7513a22878j58973I9625b52643Q9550B04170g1733a1788j77813
11392a89601j7447A43787K45846j14398a71879f4854G6198l1789b07335e5390
11381A18855a76343e3162A65573p5467a73184E359L3593F51K11308r7836a85557
11369f6744K3597j93434P0136A23551b46954C21663e7313r664F5297J82927J89799
$$ y = [170892, 184673, 245347, 233965, 63632, -197517, -174032, -81851, 411692, -109010, -12164, 243818, -88279, 183717, -97311, -66270, 260756, -52256, -47711, 140974, 207433, 135414, 237462, -106633, -246809, 348609, 175350, 54495, -176877, -129300, 128583, -331922, -177330, -161518, 160148, 109321, 348575, -21610, -27477, 44599, -210443, -7103, 199091, 42505, -74884, -15359, 7164, 147914, 185427, -122878, -281851, 99625, -252643, -163093, 204170, -71733, -11788, -189601, -207048, 143787, 389633, 275235, -171879, -64854, 76198, 44409, -207335, -55390, 118855, -176343, -53162, 165573, 90106, -173184, 5359, 38952, 651, 211959, 114123, -185557, -66744, -43147, -236581, -166445, 123551, -246954, 321663, -57313, -66977, 65297, 248224, 438023]
11358D38023a30320q501H0894H27R0446b35892L2228A03922j1807K09163b38574
11346i4979b2344C01184E2857b56861D16716A87953i1188c8260D1671J41349g8774
11334F4255Q5843P5525b71524B47521b56715A01433b07038d1381B79914f632q0803
11323h7435k01558e6010f992j11423A29522b60590c2375m03479a20630m0079k18699
11312c79408J81758A22896B2378a45883I3159K0042i0407A92314e224l4032H2010
11300C14972a51068k13830b4637D21733b55710j41033C5340h4162A00205b0460
11289b93112A01137k0319a3825j45348E1306d3307n7940L5789k31266D607a66233
11277a90470N6437A70747b87150g249E17236a74013B0282i0805L3330l90491D2742
$$ y = [438023, -130320, -138821, 80894, 827, 91273, -235892, -203664, 103922, 92115, 301278, -238574, -94979, -22344, 301184, 52857, -256861, 416716, 187953, -91188, -38260, 41671, 183020, -78774, 64255, 150098, 225623, -271524, 247521, -256715, 101433, -207038, -41381, 279914, -6632, -87435, -288993, -56010, -6992, -118415, 129522, -260590, -32375, -435854, -120630, -160709, -379408, -197650, 122896, 22378, -145883, 93159, 113201, -90407, 192314, -5224, -39256, 82010, 314972, -151068, -364898, -24637, 421733, -255710, -396743, 35340, -84162, 100205, -20460, -293112, 101137, 80818, -13825, -159173, 51306, -43307, -101247, -65458, -296724, 4607, -166233, -190470, -134033, 170747, -287150, -7249, 517236, -174013, 20282, -90805, -57475, -447966, 42742]
11265b44393b8991G336K72169b81073G5609a53119P1744A24086a29651F1609C558
11253c1388k35548l6727J44518O6144B46245b77075i8476B7341K55218a77497
11242D8304L1586a10674A6676K8964a53819N059h729l29331a52967c9439k2342
11231f1781r8862B0356b74650D0264J99303H5458b2784n8393o6646B15180a95005
11219G9184K56938g4816E6395A3064c30152a0703D3677b85751b5303A39880a2269
11207a25436A61904a13722j98731J07562g518l9299j79136R7579K1574B06230
11196C53613a83671g7771r3587d6047q5273I93a82321h0049Q72A67265F5563J44625
11184B10188e9026A67101p4327J60882f2617D6124K2246A2122L40664H8883i9524
$$ y = [-244393, -28991, 7336, 279505, -281073, 75609, -153119, -81375, 124086, -129651, 61609, 3558, -31388, -266936, -303663, -159145, -93001, 246245, -277075, -98476, 27341, 282559, -177497, 48304, 79890, -110674, 16676, 45640, -153819, -148760, -8729, -338060, -152967, -39439, -61781, -160643, 20356, -274650, 40264, 239567, 85458, -22784, -81177, -147823, 215180, -195005, 79184, 336122, -74816, 56395, 13064, -330152, -10703, 43677, -285751, -25303, 139880, -12269, -125436, 161904, -113722, -312453, -204891, -7518, -46817, -225953, -128374, -106800, 206230, 353613, -183671, -77771, -171358, -46047, -131320, 993, -182321, -80049, -79177, 167265, 65563, 210188, -59026, 167101, 92774, 253656, -62617, 46124, 68370, 12122, 352786, 88883, -99524]
11172B07160b89873Q1741h0331K3147I1218A5775a59685D313J20269L2887g1556
11160a24715p3731R5297N141n058k53179J71042k0570R0390j55331C2838M24052
11149D56890d8891B34080j01304D5424L87508i3935j72985j16970h5532m9153
11139a34685A10573h7689A88642N8856c0516G0070K62980G3239b28640G2013J05591
11128A77604a06826C17008A16601l4465J97584f9691l08973B25616J02542b0192
11117A1798b8208E320L9181a0698q4193p9016l5751A30804O9974B5026a81149
11105D56044c8888C04990A50147B7063J47597i0198A0291M35188a21019D15827
11094A87222J50694h383B56870E2660L0710J50831J88745A72208J72795j49233
$$ y = [207160, -289873, -208132, -80331, -57184, 91218, 15775, -159685, 4313, 124582, 157469, -71556, -124715, -198446, -103149, -98008, -103066, -356245, -185203, -205773, -115383, -270714, 32838, 456890, -48891, 234080, 132776, 45424, 432932, -93935, -266920, -383890, -85532, -134685, 110573, -87689, 188642, 247498, -30516, 70070, 333050, 73239, -228640, 72013, 177604, -106826, 317008, 116601, 82136, 279720, -69691, -378664, 225616, 328158, -20192, 11798, -28208, 5320, 44501, -10698, -94891, -173907, -209658, 130804, 200778, 25026, -181149, 456044, -38888, 304990, 150147, 27063, 174660, -90198, 10291, 445479, -121019, 415827, 187222, 337916, -8383, 256870, 52660, 83370, 234201, 422946, 172208, 345003, 195770]
11084A95770J27219A31805J65777K9299A15894L44235A19801J87095J04593p0956
11074C40533O6980j80908n5755N8579n151J2925C6111K72383J12222Q2176a75775
11062C56235K01899j49827J00576n4940c9600C53740J22758J88045j74097l3026
11052D57420J31285J0396o5681K40784N2605l96110K76826j62457j74158K00419
11042E71329J96176j78317j19307L27097C17543M22317k89078O6562Q0356l0872
11032E66828J56381k49213q4339R1148j18506K70265J45138j25418j15466P0881
11022F07699K09325j74496k69643J08011L44717C78221K59047N6816k83301K81565
11012F92348J36611N21j92994p9689p0197L9653k7048j07453J28050r9198M07497
$$ y = [195770, 322989, 131805, 297582, 326881, 115894, 460129, 119801, 306896, 411489, 340533, 407513, 226605, 170850, 229429, 224278, 237203, 36111, 308494, 420716, 502892, -175775, 356235, 558134, 408307, 508883, 453943, -39600, 353740, 476498, 664543, 490446, 457420, 588705, 599101, 533420, 774204, 826809, 430699, 707525, 545068, 370910, 571329, 767505, 589188, 469881, 796978, 317543, 739860, 450782, 517344, 597700, 566828, 723209, 473996, 389657, 480805, 362299, 632564, 777702, 652284, 536818, 607699, 817024, 642528, 372885, 480896, 825613, 378221, 637268, 694084, 410783, 692348, 828959, 829480, 636486, 556797, 486600, 526253, 499205, 391752, 519802, 420604, 828101]
11001H28101N0736j99554r1446n2407O7418j63496j43801L78724A40348L38602
10991D78950J15813J2054P0729p9485J22927m7775N5386j33542M41617j40060
10981H96614k23027Q8719N22184l03661M39474K6890K81498l5384M26508q8412
10971B031403L81889K0168j12440l8810m62895N12008n44559j23720m3664o8586
10961A550794J46886j93660k7365M6059K7577L30716l71914k21127J40643n76695
10951H51914K85362j06637j63054k50172L8353C24917n6689L0427j21107J69011
10941C46559H5446J40865j08072a27195C1438L98765k05377l6306k0642F1644
10930A74034k5177f5196A98276O7892o8247d2085C60392A9854b3464j16707H6381
$$ y = [828101, 878837, 679283, 587837, 535430, 602848, 439352, 295551, 674275, 140348, 478950, 594763, 606817, 677546, 598061, 720988, 673213, 728599, 595057, 1036674, 896614, 673587, 762306, 1284490, 980829, 1420303, 1447193, 1728691, 1693307, 2119815, 2031403, 2413292, 2433460, 2321020, 2282210, 1819315, 2331323, 1786764, 1663044, 1619380, 1550794, 1697680, 1504020, 1476655, 1522714, 1550291, 1881007, 1509093, 1287966, 1428609, 851914, 1137276, 1030639, 867585, 617413, 655766, 324917, 268228, 298655, 177548, 346559, 85446, 226311, 118239, -127195, 31438, 430203, 224826, 188520, 167878, 61644, 174034, 148857, -65196, 198276, 266168, 197921, -42085, 360392, 19854, -23464, -140171, 86381]
10918D985K911a9136A32990B4550h3093c6063j4786C00021I8712R1334b59332
10906C2867a00224q2463A64553a11111A97012g7185K1942e870A2442R8899c33736
10894H9112e2636k4124H8779f9131k65623A10056J27085f3473l07179J13334b7183
10882a19364j5911A22924a12030A33343J0808a57805B6612K6031i6622k765o5977
10871a65364C24687o2339m0006I7224J19964C7598p105O6402c01863i5348E6748
10859C1978M8428b73164d3077A9509a90861F4787f0024B35500A7850N3986k4131
10848D7705b6936B05922J35438b79646A54201o7665a68599D8922Q583B256M0782
10837D3038Q3849d70072G3655a95832A61624d6534A83567b03328j76742E3958
$$ y = [4985, 7896, -19136, 132990, 24550, -83093, -36063, -50849, 300021, 98712, 190046, -259332, 32867, -100224, -182687, 164553, -111111, 197012, -77185, -55243, -5870, 12442, 111341, -333736, 89112, -52636, -76760, 88779, -69131, -334754, 110056, 237141, -63473, -370652, -257318, -27183, -119364, -135275, 122924, -112030, 133343, 144151, -157805, 26612, 52643, -96622, -99387, -165364, 324687, 262348, 222342, 97224, 217188, 37598, 30493, 96895, -301863, -95348, 56748, 31978, 80406, -273164, -43077, 19509, -190861, 64787, -60024, 235500, 17850, 71836, 47705, -26936, 205922, 341360, -279646, 154201, 86536, -168599, 48922, 57505, 2256, 43038, 126887, -470072, 73655, -195832, 161624, -46534, 183567, -203328, -380070, 53958]
10826a45972d4959J7687n7802K5210C08867a39163q4656n3755b7884A15824L5750
10815A51574D9111A0651c11064C6703a184n61295a4044p6522J7186r5514G2393
10803a7567A16619Q3461B2897i467r5136B25585h0696B29300b76981I6204I518
10791a49832c4473j32767L5669N2214A75436i3706j74370b3838B0815L04835A20193
10779C14478C4830Q6632f5827d259j01305j83108N9547l50504E0319a3017o8915
10768h1932c7860k11552a0673r1754B20461a76097j12690J27263k6859A86941
10757B13755F906d3152j12939B27442A7169J7383b92314H7897d7084C26457a65062
10745a84382p0173A18162J05809b01509B24436a55527A48845g5497l707J4936
$$ y = [-145972, -44959, -27272, -85074, -59864, 308867, -139163, -223819, -277574, -27884, 115824, 151574, 49111, 10651, -311064, 36703, -1184, -562479, -14044, -90566, -73380, -168894, 72393, -17567, 116619, 200080, 22897, -9467, -104603, 225585, -80696, 229300, -276981, 96204, 9518, -149832, -34473, -167240, -131571, -79357, 175436, -93706, -268076, -23838, 20815, 325650, 120193, 314478, 34830, 121462, -65827, -4259, -105564, -288672, -229125, -579629, 50319, -13017, -81932, -37860, -249412, -10673, -102427, 220461, -176097, -288787, -161524, -188383, 186941, 213755, 6906, -43152, -156091, 227442, 17169, 34552, -292314, 87897, -47084, 326457, -165062, -184382, -254555, 118162, 223971, -201509, 224436, -155527, 148845, -75497, -79204, -64268]
10735f4268q017j954A36076g2964l62317f7632A80302c61620a15389k40377B72237
10723i3296m8040j58461P9557k0690g0366A014i7474p8916g9619j05085M8467
10712a36237A93890D6894K9248K10405b17879G709J56045K14858c78787a50553
10701d1265B7985a75957F1971j7328J34341O2185f4935p262D312a40294A19895
10689G6201b64669K1732I0117B3292J97232b28506G3534a7919j90840i0165C27744
10677g8677I726d1285q3690q6342A2741c2802j46083f3312I1572a23277E309b78403
10664g1792C05450D2297j7028a04582j83667B71059F8596a90258b1371n8523j28871
10653b08765B37476C3434r647d452G1001J75915a62826L5202B1135b27718j5761
$$ y = [-64268, -72285, -74239, 136076, -72964, -435281, -67632, 180302, -361620, -115389, -355766, 272237, -93296, -141336, -299797, -220240, -240930, -70366, 1014, -97474, -176390, -79619, -184704, -136237, 193890, 46894, 76142, 286547, -217879, 7709, 163754, 378612, -378787, -150553, -41265, 27985, -175957, 61971, 44643, 178984, 241169, -64935, -72197, 4312, -140294, 119895, 76201, -264669, -242937, 90117, 23292, 220524, -228506, 73534, -17919, -208759, -90165, 327744, -78677, 9726, -41285, -124975, -211317, 12741, -32802, -178885, -63312, 91572, -123277, 5309, -278403, -71792, 305450, 42297, 25269, -104582, -288249, 271059, 68596, -190258, -21371, -79894, -208765, 237476, 33434, 23787, -4452, 71001, 246916, -162826, -127624, 21135, -227718, -243479]
10642b43479B66937d5249B09238n2101b42688i5943k2496a7041k1586D2112b59396
10630b15716i8510D8160R3084d31824C7058N5630j9769a81846e801A0216g8107
10618A71768J5685c90048H1515a86359J5478j97231J08997G6132g2851A67156
10607A57229a94991f0961F9912L3930a5957m0370j04141A63746J19861C7683c0515
10595C5679a39282p6461C20387c36504i7556B67579H464k529K28877C2961J7929
10584E0890i3437a4703C73568j85688a98353a7821g74A04529a38145B03619q1475
10573A22144n5559b19850d3331D5367b40975f2658l48356c5923H3135M4238b25225
10561c51059Q9653H2714l4441b98509e8903K6061a6251A37973l4079J37881b4354
$$ y = [-243479, 266937, -45249, 209238, 157137, -242688, -95943, -118439, -17041, -38627, 42112, -259396, -215716, -98510, 48160, 141244, -431824, 37058, 92688, 72919, -181846, -5801, 10216, -78107, 171768, 187453, -390048, 81515, -186359, -170881, -368112, -259115, 76132, -72851, 167156, 157229, -194991, -60961, 69912, 103842, -15957, -56327, -160468, 163746, 283607, 37683, -30515, 35679, -139282, -215743, 320387, -336504, -97556, 267579, 8464, 5935, 234812, 32961, 50890, -93437, -14703, 373568, 187880, -198353, -17821, -774, 104529, -138145, 203619, 122144, 66585, -219850, -43331, 45367, -240975, -62658, -411014, -35923, 83135, 127373, -225225, -351059, -261406, 82714, 48273, -298509, -58903, -32842, -16251, 137973, 103894, 241775, -24354]
10549a74847I5515h8546q2274F4449m985i329k38615c0144C85267A60725a09413
10537C457J38823h6551q3229B13009r0189b33784r6506B23479a10568L6674A891
10525a30552G9561a27818I7539b29315f8796L3054n0050j75340d7082A05657L6382
10514A42039J9880e505A60651b69331o435C5830c1310E4968b40468J4939M9580
10503a75949N293j4738a8849j16658L8303d121B47144H8489m4075P8164D1497
10491H112a12224A27645R3061K2715b02411A7561a40455O7852A44374J01084K48043
10480D93501k0060r7381m8760J4426C4139a47987B63603b14395B16712A0669K28140
10469B38809i7271k33024A40357d6220E704h5196B8976d2840a6131k98889a01596
$$ y = [-174847, 95515, -88546, -170820, 64449, 59464, -9329, -247944, -30144, 385267, 160725, -109413, 3457, 142280, -86551, -169780, 213009, 122820, -233784, -330290, 223479, -110568, -73894, 1891, -130552, 79561, -127818, 97539, -229315, -68796, -35742, -85792, -261132, -47082, 105657, 142039, 161919, -5505, 160651, -269331, -275766, 35830, -31310, 54968, -240468, -225529, -175949, -170656, -185394, -18849, -135507, -97204, -4121, 247144, 88489, 44414, 122578, 41497, 8112, -112224, 127645, 220706, 243421, -202411, 17561, -140455, -72603, 144374, 245458, 493501, 473441, 376060, 327300, 341726, 34139, -147987, 263603, -214395, 216712, 10669, 238809, -97271, -330295, 140357, -46220, 5704, -85196, 28976, -42840, -16131, -315020, -101596]
10457A62853c72793E5595a96614k7071K2797A6344b4992j99686Q915B10808e459
10445A08703J03584r5525m4242b6885j56964J1120G3297O4168n7079c396l52738
10434c56134A1729J00719a96665a628k00514b0765n1353G2512K21921b09579A21039
10422E7658c62537D5843p874M74928H5595a6611j88189g9437n8229G2909f6968
10410c35575G2307Q8126o0800b174k37408K707A0398K3427M7156b78566C49990
10398E200f1530B70462b74114J17141I1306L8509k1446j3968b4624q9586B15347
10386C6682L19894A17533b70199A06652b13737C86135e3867B78610L7689B0011
10375A59685b87860A76343n6748Q2861K27677j73479p5722J92129L2945J43329
$$ y = [162853, -372793, 55595, -196614, -223685, -200888, 16344, -24992, -224678, -215763, 210808, -5459, 108703, 212287, 116762, 72520, -26885, -183849, -172729, 73297, 137465, 80386, -3396, -356134, 11729, 112448, -196665, -1628, -202142, -20765, -72118, 72512, 294433, -209579, 121039, 57658, -362537, 45843, 37969, 512897, 85595, -16611, -204800, -79437, -137666, 72909, -66968, -335575, 72307, 160433, 99633, -2174, -239582, -236875, 10398, 33825, 80981, -278566, 349990, 5200, -61530, 270462, -274114, -156973, 91306, 129815, 108369, 94401, -24624, -114210, 215347, 36682, 356576, 117533, -270199, 106652, -213737, 386135, -53867, 278610, 316299, 20011, 159685, -287860, 176343, 119595, 202456, 430133, 256654, 180932, 373061, 406006, 549335]
10365E49335j76546L74518a06720B92108j21000O4505L04626B42998h5545h169
10354I0381J97807c3146B27760M08520k31764A63941M1511K05192I4178B5050
10343C16268j45009m7941c495D1605p36N4312J37859m0949m9787m1061m1042L52398
10331D12599A90571D063K5004K059K92920H3471g3902B67997A27459a8660A43493
10319a44528g971k01463B80584b35505B16533K18050j79433o2612K61424I036
10308A62312a88855O0907j01890P4873K6441G7523m626J59719b44624a13653A50084
10296a41219f8813k1912k49429e5422K5516q7126k21604a15056j6626B28818h6612
10284a82217l2318J05599k8859L2702A20887N3277D1258R9884b36733c5620H0729
$$ y = [549335, 372789, 747307, -106720, 292108, 171108, 235613, 540239, 242998, -85545, -8169, 90381, 288188, -33146, 227760, 636280, 404516, 163941, 205452, 410644, 94178, 25050, 316268, 171259, 123318, -3495, 41605, 40869, 95181, 233040, 192091, 142304, 101243, 60201, 412599, 190571, 4063, 29067, 31126, 324046, 83471, -73902, 267997, 127459, -18660, 143493, -144528, -7971, -209434, 280584, -235505, 216533, 434583, 255150, 192538, 453962, 9036, 162312, -188855, -127948, -229838, -154965, -128524, 77523, 72897, 232616, -244624, -113653, 150084, -141219, -68813, -90725, -340154, -55422, -29906, -117032, -338636, -115056, -131682, 228818, -86612, -182217, -214535, -108936, -137795, -105093, 120887, 174164, 41258, 141142, -236733, -35620, 80729]
10272b19325r377F1393Q8220j3651E9839P0786l2858K2912r59O1738q1107L80724
10260D81075B37489E3039a07300D91459C3275Q1721L0019b43465C12718c5769
10249h8141p6395B38536d5404k71599h6539c2153A31707b43967a03608b8041k45161
10238b73202P4854j06421R7239l5724a862I9074b78570B28421b5387l06155C00224
10226d8872A00196P9537F5381b21317d4668E4434d6825K0543P285q3008k20578
10215c22583B07912a24855b7843k45276b9638L730C1177g0619F1341b82392l7601
10204c19993g5841E8413j5901L26196d4084A4134c1895H2523N5458b17358h1937
10192h5552C55401c2536p3903j47606P4931C34719a06410m7155F7374b03224j81118
$$ y = [-219325, -228702, 61393, 149613, 135962, 59839, 130625, 97767, 120679, 119720, 181458, 100351, 481075, 237489, 53039, -107300, 491459, 33275, 114996, 145015, -243465, 312718, -35769, -88141, -164536, 238536, -45404, -317003, -86539, -32153, 131707, -243967, -103608, -28041, -273202, -198348, -304769, -207530, -243254, -1862, 99074, -278570, 228421, -25387, -331542, 300224, -48872, 100196, 179733, 65381, -221317, -44668, 54434, -46825, -26282, -18997, -102005, -322583, 207912, -124855, -27843, -273119, -29638, -25908, 31177, -70619, 61341, -282392, -319993, -75841, 58413, 42512, 368708, -44084, 14134, -31895, 82523, 137981, -217358, -81937, -85552, 355401, -32536, -106439, -254045, -179114, 334719, -106410, -153565, 67374, -203224, -384342]
10181c84342c9562j67779j02719B4579b44809e6521a9742D0654a27728k519j16528
10170b46775a19211I2357K1734C4111b3356I2423a9553j21073p5092L7890B16252
10158B54916c51577J35073b707A05094c00154r9730F9734C3313b26101a6015j71934
10147a87949A99727a21568k9543D9825B3994a66015g9881D2560e1762Q855j61341
10136b04248i1326C3356N3270f0420A75815a55074m3037l3195c9005A34803b74578
10124C83949A34319B3117d0946j08144j55599g5043L7220k72j41991g6897A06021
10112a43569F1509J25437D8404c53418J41423L1560A51947B5302a5972B25909
10101a04586b3645j65163e7583p6919K8689A35457a25970m1932A46384J09493
$$ y = [-384342, -39562, -207341, -310060, 24579, -244809, -56521, -19742, 40654, -127728, -130247, -246775, -119211, 92357, 114091, 34111, -23356, 92423, -19553, -140626, -215718, -177828, 216252, 254916, -351577, -216504, -2707, 105094, -300154, -399884, 69734, 33313, -226101, -16015, -187949, 199727, -121568, -151111, 49825, 23994, -166015, -79881, 42560, -51762, -42907, -204248, -91326, 33356, 86626, -60420, 175815, -155074, -198111, -231306, -39005, 134803, -274578, 383949, 134319, 23117, -40946, -149090, -304689, -75043, -37823, -38095, -180086, -76897, 106021, -143569, 61509, 186946, 48404, -353418, -211995, -180435, 151947, 25302, -15972, 225909, -104586, -23645, -188808, -57583, -134502, -105813, 135457, -125970, -167902, 146384, 255877]
10091B55877D6547J51820c59955d6959F9510h118k00734M4345J2234A62899a13272
10079G5045B1137F65b77942d4529n2608B15443a85349R224A41235A2190b52964
10067b3116C3126J6235c24890G7425d8258A74821a16076r8274J01368M6601F5273
10055A88689b93574f3484j56173E8089c46347d5238j34988M1942j8668j32753
10045b89705a03116r3662I3047D3292J44960F7116c0544o372B17780M6604A04393
10033b58327c3713A34829b8074k40049L644E2057a91951M644J4378L1027C5168
10021E0745c43319e2939j18310P0456K6455A2014L7914i6107A45278f0890A9813
10009a44165C9812b7532G1179a31438n0900F166N2696i0501D0752M2285J90464
$$ y = [255877, 46547, 198367, -359955, -46959, 69510, -8118, -208852, -164507, -152273, 162899, -113272, 75045, 21137, 665, -277942, -44529, -97137, 215443, -185349, -176125, 141235, 12190, -252964, -23116, 33126, 49361, -324890, 77425, -48258, 174821, -116076, -214350, -112982, -66381, 65273, 188689, -293574, -63484, -219657, 58089, -346347, -45238, -180226, -138284, -156952, -289705, -103116, -196778, 93047, 43292, 188252, 67116, -30544, -36916, 217780, 264384, 104393, -258327, -33713, 134829, -28074, -268123, -264479, 52057, -191951, -187307, -172929, -141902, 35168, 50745, -343319, -52939, -171249, -100793, -74338, 12014, 49928, -96107, 145278, -60890, 19813, -144165, 39812, -27532, 71179, -131438, -182338, 6166, 58862, -90501, 40752, 83037, 273501]
9998B73501B5119a11997M9721H5234b5481k54415H8021b76851b9320n3579j08991
9987a91890B06038d32850a54731e0731a8146B84734a11881k0205L7050n0318o918
9976a52272A3982J01191b11184Q8614H9635g897k9170l6867l0008b6219j13236
9965a39455l7477P3670K1781F2692b91876J38679M3665a4140C9253c84564E2729
9953D99626a74222e8539p7051A15757a19996b4346B17810a42792L4072M1115B3728
9941a35971n7772I2876D1458c11678M9543E9463a69167M2146M8042Q571B77246
9929A7157c37822B03393h7864B8139f4412J0450k25966B17850n5507f7196l01323
9918c68519a58001A86709b50114k8139A68682g4580p940H5609K7877g8112k42455
$$ y = [273501, 25119, -111997, -62276, 85234, -25481, -279896, 88021, -276851, -29320, -82899, -191890, 206038, -432850, -154731, -50731, -18146, 284734, -111881, -132086, -95036, -145354, -152272, 13982, 115173, -211184, -122570, 89635, -7897, -37067, -73934, -103942, -26219, -139455, -176932, -103262, -81481, 62692, -291876, -153197, -109532, -14140, 39253, -384564, 52729, 499626, -174222, -58539, -135590, 115757, -119996, -24346, 217810, -142792, -108720, -67605, 23728, -135971, -193743, 92876, 41458, -311678, -262135, 59463, -169167, -127021, -78979, -70408, 277246, 17157, -337822, 203393, -87864, 28139, -64412, -53962, -279928, 217850, 162343, -67196, -368519, -158001, 186709, -250114, -278253, 168682, -74580, -82520, 85609, 113486, -78112, -320567]
9907c20567A54858b36294B7226P433b21103Q4366O6917D0126c03738B0473a22290
9895b51615f5033D1821a83094A54676a1435E3103f9585j15825i1357C7053b37627
9883A86889O582m9816n4536a72071B79724C8829c02218a20880C8958d9568H5910
9871a65988J8249M5398M8762a5190k45002C04272a72580Q0945j61539A8294b76369
9859a94832C42840b62810j9343G6463B7854b50825k89684i8298L0457A96435a16201
9847a88029P4430B325b47230c3031j38642d3661j51598H9200c00271J47045A21932
9835H6037a21814L5672E5411N6399J27007a41891A0931b31965b414k01731D7926
9823b54100A26916b04362Q5105A62751k2218e6021l6668C7168a94996A51544L887
$$ y = [-320567, 154858, -236294, 27226, 34659, -221103, -136737, -69820, 40126, -303738, 20473, -122290, -251615, -65033, 41821, -183094, 154676, -11435, 53103, -69585, -185410, -91357, 37053, -237627, 186889, 193471, 143655, 89119, -172071, 279724, 38829, -302218, -120880, 38958, -49568, 85910, -165988, -147739, -102341, -53579, -15190, -260192, 304272, -172580, -91635, -253174, 18294, -276369, -194832, 342840, -262810, -282153, 76463, 27854, -250825, -540509, -98298, -67841, 196435, -116201, -188029, -113599, 2325, -247230, -33031, -171673, -43661, -195259, 89200, -300271, -153226, 121932, 86037, -121814, -86142, 55411, 111810, 238817, -141891, 10931, -231965, -2414, -204145, 47926, -254100, 126916, -204362, -119257, 162751, 140533, -56021, -92689, 37168, -194996, 151544, 155431]
9812A55431C5237K5274J53033q3676E0444b45842k9633d3396C9394M63640E2269
9800A55310K0080p2412a55006P92m0809b6843n5990k63389k26143A81580C5912
9788f6316g975l11742g9221L4901p1350A65426b4147k47264h3259B99824f0499
9776E7021K28652A06633D3367b17523D4411c2612n8359j67832p8671a18700l5263
9765a53963f2738l5823C57985b36697C05201c28993N5335e8118A7547b40797P2227
9754a68570C5556g8458I8055a07548j07191r010n8031G9560h6579l3419C01693
9742B48399a22842L0084p5190L5288l1015j87035d4481A14748a13823A0396b54830
9730E9293d4351E9065a11000A29024a15603d0784r083J665l3983j24516j9100
$$ y = [155431, 35237, 60511, 213544, 129868, 50444, -245842, -275475, -43396, 39394, 503034, 52269, 155310, 175390, 102978, -155006, -154214, -195023, -26843, -82833, -346222, -572365, 181580, 35912, -66316, -7975, -319717, -79221, -44320, -115670, 165426, -24147, -271411, -83259, 299824, -60499, 57021, 285673, 106633, 43367, -217523, 44411, -32612, -90971, -258803, -337474, -118700, -153963, -62738, -98561, 357985, -236697, 305201, -328993, -273658, -58118, 17547, -240797, -168570, 35556, -78458, 98055, -107548, -214739, -223749, -281780, 79560, -86579, -119998, 301693, 248399, -122842, -92758, -167948, -132660, -163675, -350710, -44481, 114748, -113823, 10396, -254830, 59293, -44351, 59065, -111000, 129024, -115603, -40784, -49867, -48202, -82185, -206701, -225801]
9719b25801g2725j57229k550G4691a6113A78126J6967a13496C36666b60311N7598
9708b02713l4807K0676i202A4266g692j0956M026l5409j23099r7067a8795A0434
9695e950r258n243E7051A2348c14425M8984c2114A70953a80257p8799e0272n1405
9683a01677O023C9946g8338B08805a9247m7416C63759M2622J14550A86759a51785
9671c12517F4372c3101H7447b17291B56564e8425j03959g3885B66464a04391G1420
9659C9754J6869a04815j40125b7865A70151a18318j21255A23430o0463f8959k11814
9648b80773f7500a6293B9373A596a46410f5102m8820E5780a97019L4318c4522
9636b50345g9927j27719o0935A86589A587f3486k70952f4047A90741d47773p9672
$$ y = [-225801, -72725, -229954, -232504, 74691, -16113, 178126, 195093, -113496, 336666, -260311, -202713, -237520, -216844, -9202, 14266, -7692, -18648, -14622, -50031, -173130, -270197, -18795, 10434, -5950, -15208, -20451, 57051, 12348, -314425, -265441, -32114, 170953, -180257, -259056, -50272, -101677, -95654, 39946, -78338, 208805, -19247, -66663, 363759, 406381, 520931, 186759, -151785, -312517, 64372, -33101, 87447, -217291, 256564, -58425, -162384, -73885, 266464, -104391, 71420, 39754, 56623, -104815, -244940, -27865, 170151, -118318, -239573, 123430, 62967, -68959, -280773, -67500, -16293, 29373, 1596, -146410, -65102, -113922, 55780, -197019, -162701, -34522, -250345, -79927, -207646, -268581, 186589, 1587, -63486, -334438, -64047, 190741, -447773, -527445]
9625e27445I7154a26363m35955D10c65434C4191h622j37635o2260O062h1076J0221
9613g0855q6073k6978C05591B7033K0059b20442J0701B34082G1891a63196j14944
9602b78140J13713d5220k28203a34398A00090f0010D3839J24118a5928p9511L6977
9591e8462m3547m9413B68528b05040j76608G4073K1803a61829B212a3000j63403
9580a76403L5592j34215p5161h7908j62900h0240A82338b37024M1996b8128A10828
9568E3195f7066q7718B42953A9098L6477J97741b91253C6245a94516j4279p2860
9557b81655A82486C0988a92902A42513b29385J360P5951R274B00261E0934R4265
9546A45199J74108l216f218m2748l82411B54049c32469B71206a61364o9189N3297
$$ y = [-527445, 97154, -126363, -562318, 410, -365434, 34191, -8622, -146257, -208517, -202455, -81076, -70855, -156928, -183906, 305591, 27033, 47092, -220442, -209741, 234082, 71891, -163196, -278140, -164427, -45220, -273423, -134398, 100090, -60010, 43839, 167957, -15928, -95439, -58462, -102009, -151422, 268528, -205040, -381648, 74073, 95876, -161829, 2212, -13000, -176403, -140811, -275026, -350187, -87908, -250808, -80240, 182338, -237024, -195028, -28128, 110828, 53195, -67066, -154784, 242953, 19098, 55575, 253316, -291253, 36245, -194516, -208795, -281655, 182486, 30988, -192902, 142513, -229385, -228025, -152074, -142800, 200261, 50934, 145199, 319307, 316091, -6218, -48966, -431377, 254049, -332469, 271206, -161364, -230553, -177256]
9535a77256K9144O2816C23125a39507b4403l69815L571P4044A10317O235b23489
9523C1895a62518k1644K7485a8513k5408D2456e1719A6803K4314h3273m0457B55545
9510b33958g9642j67492B13109c8505k2603r9654A44158b24488b0346J222r7584
9499a16708m4963A4951a2166B52645c5403B44415b27114C39780a77112R636B33852
9487d7071E9660q188a01881l24522A78734e8994A16743a12885j6344M0814j62783
9476b51198A74709a34724M8365a3535A35689d3450j05417A8876a94754F8371j9942
9465D8429b43169A04504b15775R4730B38987a5693j09969d1287a8701k99503N6946
9454b61258J3238F2084e8754r7087l4572B6524g1733j12101k5437R5890C55206
$$ y = [-177256, -148112, -85296, 323125, -139507, -24403, -394218, -390647, -316603, 110317, 116552, -223489, 31895, -162518, -184162, -156677, -18513, -43921, 42456, -51719, 16803, 41117, -83273, -123730, 255545, -233958, -79642, -247134, 213109, -38505, -61108, -160762, 144158, -224488, -20346, -19124, -116708, -161671, 14951, -12166, 252645, -35403, 244415, -227114, 339780, -177112, -167476, 233852, -47071, 59660, 51472, -101881, -426403, 178734, -58994, 116743, -112885, -129229, -88415, -251198, 174709, -134724, -86359, -13535, 135689, -43450, -148867, 18876, -194754, 68371, 48429, -243169, 104504, -215775, -121045, 238987, -15693, -125662, -41287, -18701, -318204, -261258, -248020, 62084, -58754, -155841, -190413, 26524, -71733, -183834, -209271, -113381, 355206]
9442A64480A9667J66250a91953j31557g1995D7365e9363o9932j17365B00803a206
9430B27169a95779d8664A21874E8917O0298d26200i6382G7136b9836J0328k92148
9419c11656J49727k00976H4903f9095n1291n5950P0121H3941A5825a50469E2124
9407d5124k1820C10645a41585C50292i937k56122A31159K1575a35038c8319A94528
9395B2537P3622f8930m3834A19793c5028J0143k58823H3485b52946E2951a97286
9383C2023J90217c85508i3926a7817A44599J51753e17359F2085c318j2767A78366
9371a53481c0257B12382m1782J08656a62940C3955i8556a1418p2780k45209J53683
9360a75724M0876A2482c7902k14676F403b34915J09290b6565D882J28874n8679
$$ y = [164480, 19667, 185917, -191953, -323510, -71995, 47365, -59363, -129295, -246660, 200803, -1206, 227169, -195779, -48664, 121874, 58917, 119215, -426200, -96382, 77136, -29836, -19508, -311656, -161929, -362905, 84903, -69095, -120386, -176336, -106215, 83941, 15825, -150469, 52124, -45124, -66944, 310645, -141585, 350292, -9937, -266059, 131159, 152734, -135038, -38319, 194528, 22537, 96159, -68930, -112764, 119793, -35028, -24885, -283708, 83485, -252946, 52951, -197286, 32023, 222240, -385508, -93926, -17817, 144599, 296352, -517359, 62085, -3318, -16085, 178366, -153481, -30257, 212382, 170600, 279256, -162940, 33955, -98556, -11418, -84198, -329407, -175724, -134848, 12482, -37902, -252578, 6403, -234915, -125625, -26565, 4882, 133756, 75077]
9349G5077J25568a58488b4458H4739e45852B7630J43568b93894A79287G4500l2862
9338D1638c27642n1047J60034A40540g9981B76373a76138G0411k4225c51186B55960
9326A01750c7599a8161A1510c27580A74649G0721c29032A02424b0319l78915b039
9314a92926j15048J33414k0193r9931e2127e028k90278D2972O7783a30850B13276
9302c19973K6735j5751M8882A50701e831j80929L0986l9989O8143C02836E145
9290B86102g7421A62269h6264k59386F1850a94232f0463A60786b11873b479n4593
9279e7072l07419J23700l491A32668f799C3319g5038A89606e9225l2857I023l517
9267E506a87912E9698d1276J2296J1663j39095B19449g8108j34751K4320r325
$$ y = [75077, 200645, -158488, -24458, 84739, -545852, 27630, 171198, -293894, 179287, 74500, 41638, -327642, -378689, -218655, 140540, -79981, 276373, -176138, 70411, 46186, -351186, 255960, 101750, -37599, -18161, 11510, -327580, 174649, 70721, -329032, 102424, -20319, -399234, -2039, -192926, -307974, -174560, -194753, -294684, -52127, -5028, -295306, 42972, 110755, -130850, 213276, -319973, -293238, -308989, -260107, 150701, -5831, -186760, -155774, -195763, -127620, 302836, 5145, 286102, -77421, 162269, -86264, -345650, 61850, -194232, -60463, 160786, -211873, -2479, -57072, -364491, -240791, -244282, 132668, -6799, 33319, -75038, 189606, -59225, -92082, 9023, 5506, -187912, 59698, -41276, -28980, -17317, -156412, 219449, -78108, -212859, -188539, -197864]
9256a97864K879h9002c7861J4590A54142b00140l3141A08500b23696A4366b7257
9244G3007b64417D1478J67471A1373b6519C28307a14042j11044B19184b0454h606
9232H115J9730i2524q0487a810j99392A29930O9465B5150A2094b10989I79b15083
9219a57261B24777b51519D18316a94723c3028q2642A93912I6646g729j10380K2259
9208i5850l3778b4886j9126G6394a24196l3472f9408C2007a63666N7285j01456
9197b07837b505F9288b64006a26575B00972H6913f1723B7108P7735b88800E9718
9185a76778Q4826C37058b42102l0041A83695G2084b3597j03590m18814a60927
9174E4108a33730j538a2337j64330O3728j70062E9025f4658p1124a2734k50401
$$ y = [-197864, -194985, -89002, -37861, -23271, 154142, -200140, -233281, 108500, -223696, 14366, -27257, 73007, -264417, 41478, 208949, 11373, -26519, 328307, -114042, -225086, 219184, -20454, -8606, 8115, 27845, -92524, -173011, -1810, -201202, 129930, 199395, 25150, 12094, -210989, 979, -215083, -157261, 224777, -251519, 418316, -194723, -33028, -115670, 193912, 96646, -7729, -118109, -95850, -129628, -24886, -44012, 76394, -124196, -157668, -69408, 32007, -163666, -106381, -207837, -2505, 69288, -264006, -126575, 200972, 86913, -61723, 27108, 104843, -288800, 59718, -176778, -91952, 337058, -242102, -272143, 183695, 72084, -23597, -127187, -546001, -160927, 54108, -133730, -135268, -12337, -176667, -112939, -283001, 59025, -64658, -135782, -12734, -263135]
9163b63135A3218J25573a16752D3129c27660G7740C7434a90572e7474A8584c9766
9151h3043E213b31620J11608A85463h2091k15994J7712D9498g8204L0592k95238
9140c42850i1836A8324P786L6030J90604A7884d7009A0537J41047h9557j8888
9129a08445B94553D8620b22175J01437C29456a36202K7351M0760A93817b40588
9118a48429f8373o0923H332L78854h1727C7917L21177A06243a28466M1468E7325
9106a17532A96285o9320A4871N0411a39441C421a76576a8721k25064A89139f9285
9094C099J76239a02685k13561H842b62651L8758K0766i5582F1677f1661A83589
9082A13062f3006j60816a8177j60096j0869k9272d0124A75001p8498A3477f8439
$$ y = [-263135, 13218, 138791, -116752, 43129, -327660, 77740, 37434, -190572, -57474, 18584, -39766, -83043, 5213, -231620, -120012, 185463, -82091, -298085, -280373, 49498, -78204, -47612, -342850, -91836, 18324, 26110, 62140, 252744, 17884, -47009, 10537, 151584, -89557, -108445, 294553, 48620, -222175, -120738, 329456, -136202, -108851, -68091, 193817, -240588, -148429, -68373, -129296, 8332, 387186, -81727, 37917, 359094, 106243, -128466, -86998, 57325, -117532, 196285, 126965, 14871, 65282, -139441, 3421, -176576, -18721, -243785, 189139, -69285, 3099, 179338, -102685, -316246, 8842, -262651, -223893, -203127, -95582, 61677, -61661, 183589, 113062, -63006, -223822, -18177, -178273, -189142, -218414, -40124, 175001, 96503, 13477, -68439]
9070a95096a5697n1536E9M4209g3090F7664f213r4474P019a8256I3269h9481j15852
9057b05333h1926M0047j29497f9940A7516a59591j75019a10268q2443N0427j36859
9046b79143c1830B970M7920J25028f9441a0917k50610A34256b06696j35505N3403
9035b88798A79307A3559a47614k10554a66266k0494c508l01037A68149B8571b98628
9023a91677C5089M4101j1573B3794a29586e6958L248B64415P5299H1129J61670
9012B42799e9703E0385G623L8888J77306a72508N3724k48004A27467i6926m1744
9001a38670o4349C22040A42347C6384A925K40b98098H7101J22444a68757f2060
8989b9148H744J80462a44249A07322B7437e0372k57817Q9542f8899C68956c02126
$$ y = [-195096, -15697, -67233, 59, 44268, -73090, 67664, -6213, -100687, -93668, -18256, 93269, -89481, -205333, -81926, -41879, -171376, -69940, 17516, -159591, -334610, -110268, -192711, -142284, -279143, -31830, 2970, 50890, 175918, -69441, -10917, -261527, 134256, -206696, -342201, -288798, 179307, 13559, -147614, -358168, -166266, -186760, -3508, -304545, 168149, 28571, -298628, -191677, 35089, 79190, 67617, 23794, -129586, -56958, -53710, 264415, 339714, 81129, 242799, -59703, 50385, 7623, 46511, 223817, -172508, -118784, -366788, 127467, -96926, -138670, -203019, 322040, 142347, 36384, 1925, 2165, -298098, 87101, 209545, -168757, -62060, -29148, 8744, 189206, -144249, 107322, 27437, -50372, -308189, -218647, -68899, 368956, -302126]
8977G0755c33809N6435D4975b26213F5725g908l19356E1628a05584E6267f6047
8965B9695k219M0456f9956j34576C0060d3328n4612B66745d9122k6575B7311P450
8953C4761b77156A09159b89282r1112A33909a54954a0306k30912e5361l2226k93910
8942c81497B01121J26373r6720a24149j37751h280n4331K2279k7341A5082b86402
8930g4333A13700a84048G651b72257j57874b0913K515D08541O47149k3977m82358
8919E49355a2299j78068A34769m2550C9134A4899g9806l82345C70511b44415e943
8907a26657F586d38395g4527A7067P980a63125A36114g6129a6612r4518n3909
8896a65039g5497i683j63737D3397b65507B11384b3464C26771A1466b24257a00901
$$ y = [70755, -333809, -277374, 44975, -226213, 65725, -7908, -327264, 51628, -105584, 56267, -66047, 29695, 27476, 67932, -69956, -204532, 30060, -43328, -97940, 266745, -49122, -75697, 27311, 34761, -277156, 109159, -289282, -380394, 133909, -154954, -10306, -241218, -55361, -87587, -381497, 201121, 327494, 230774, -124149, -261900, -8280, -62611, -40332, -67673, 15082, -286402, -74333, 113700, -184048, 7651, -272257, -430131, -20913, -18398, 408541, 1055690, 1031713, 549355, -12299, -190367, 134769, 92219, 39134, 14899, -79806, -462151, 370511, -244415, -5943, -126657, 6586, -438395, -74527, 17067, 25047, -163125, 136114, -76129, -16612, -111130, -165039, -75497, -9683, -173420, 43397, -265507, 211384, -23464, 326771, 11466, -224257, -100901]
8884b78477L5083h6381k16793J25268j00567J12049a9616n8841l2462a3542A04966
8872c59737K1474c9527j91891B29541b05882B12337c51200B79947q4307a42986
8861B63968b98178a03648A41694b17928A02902c0399k11874E7031K3019A8033
8850a45133h843j90077C6148a71775f8279k73976R8866l436I9248L1348a30875
$$ y = [-278477, -243394, -86381, -303174, -177906, -278473, -166424, -19616, -78457, -110919, -13542, 104966, -359737, -338263, -39527, -231418, 229541, -205882, 212337, -351200, 279947, 195640, -142986, 263968, -298178, -103648, 141694, -217928, 102902, -30399, -242273, 57031, 80050, 18033, -145133, -8843, -198920, 36148, -171775, -68279, -342255, -243389, -246825, 99248, 130596, -130875]
$$ [...]
##END NTUPLES=NMR SPECTRUM
##END=
