##TITLE=AC1436_CPOAH13245_7790681_jLSF8JDTXy
##JCAMPDX= 6.0         $$ Bruker NMR JCAMP-DX V2.0
##DATA TYPE= NMR SPECTRUM
##DATA CLASS= NTUPLES
##ORIGIN= BRUKER
##OWNER= Administrator
$$ 1.72 TOPSPIN		Version 2.1
$$ 2013-04-16 19:55:21.529 -0700  Administrator@X
$$ Compression mode = diff/dup
##.OBSERVE FREQUENCY= 400.02188249412
##.OBSERVE NUCLEUS= ^1H
##.ACQUISITION MODE= SIMULTANEOUS (DQD)
##.ACQUISITION SCHEME= undefined
##.AVERAGES= 64
##.DIGITISER RES= 22
##SPECTROMETER/DATA SYSTEM= spect
##.PULSE SEQUENCE= noesygpps1d.comp
##.SOLVENT NAME= COFFEE_meoh
##.SHIFT REFERENCE= INTERNAL, COFFEE_meoh, 1, 14.96094
##AUDIT TRAIL= $$ (NUMBER, WHEN, WHO, WHERE, PROCESS, VERSION, WHAT)
$$ ##TITLE= Audit trail, TOPSPIN		Version 2.1
$$ ##JCAMPDX= 5.01
$$ ##ORIGIN= Bruker BioSpin GmbH
$$ ##OWNER= Administrator
$$ $$ E:\/data/COFFEE/nmr/AC1436_CPOAH13245_7790681_jLSF8JDTXy/12/pdata/1/auditp.txt
$$ ##AUDIT TRAIL=  $$ (NUMBER, WHEN, WHO, WHERE, PROCESS, VERSION, WHAT)
(   1,<2013-04-16 19:55:16.404 -0700>,<Administrator>,<X>,<go>,<TOPSPIN 2.1>,
      <created by zg
	started at 2013-04-16 19:43:47.240 -0700,
	POWCHK enabled, PULCHK disabled,
       configuration hash MD5:
       33 CF 6A 21 5C D3 B9 40 6C 15 AA 8D 27 A2 4F 13
       data hash MD5: 64K
       DF 01 A4 4D A6 58 22 96 24 CF 99 6F A5 08 72 58>)
(   2,<2013-04-16 19:55:19.357 -0700>,<Administrator>,<X>,<proc1d>,<TOPSPIN 2.1>,
      <Start of raw data processing
       efp LB = 0.3 FT_mod = 6 PKNL = 1 PHC0 = 0 PHC1 = 0 SI = 128K 
       data hash MD5: 128K
       7F 91 A7 A4 76 FB 69 77 68 17 36 A9 2F C9 7E 47>)
(   3,<2013-04-16 19:55:20.404 -0700>,<Administrator>,<X>,<proc1d>,<TOPSPIN 2.1>,
      <pk PHC0 = -78.77747 PHC1 = 0 
       data hash MD5: 128K
       75 FE 7E 75 F1 39 CC EE E4 01 92 BF 75 9A 51 30>)
(   4,<2013-04-16 19:55:20.889 -0700>,<Administrator>,<X>,<proc1d>,<TOPSPIN 2.1>,
      <abs ABSG = 1 
       data hash MD5: 128K
       9F 21 C7 5C F6 C7 62 A4 AC 5F 48 D3 3F 99 9E 71>)
(   5,<2013-04-16 19:55:20.998 -0700>,<Administrator>,<X>,<proc1d>,<TOPSPIN 2.1>,
      <abs ABSG = 2 
       data hash MD5: 128K
       00 6E D6 44 FA E5 55 4D 6E 87 5F CE 63 CE 86 11>)
(   6,<2013-04-16 19:55:21.123 -0700>,<Administrator>,<X>,<proc1d>,<TOPSPIN 2.1>,
      <abs ABSG = 3 
       data hash MD5: 128K
       9C C8 64 63 87 5D 4C 4D 18 77 74 4F 96 14 B7 F5>)
(   7,<2013-04-16 19:55:21.232 -0700>,<Administrator>,<X>,<proc1d>,<TOPSPIN 2.1>,
      <abs ABSG = 4 
       data hash MD5: 128K
       03 66 F0 01 B7 50 51 ED FB 08 F4 05 D2 86 B2 93>)
(   8,<2013-04-16 19:55:21.342 -0700>,<Administrator>,<X>,<proc1d>,<TOPSPIN 2.1>,
      <abs ABSG = 5 
       data hash MD5: 128K
       95 B0 38 DD AD 25 75 F1 EE 66 1D B0 B5 F8 62 AD>)
$$ ##END=
$$ 
$$ $$ hash MD5
$$ $$ 94 3E C2 9F 8D 21 A7 A5 2D D8 B2 B3 92 AE 58 7C
##$RELAX= 
##$RELAX= 
##$RELAX= 
##$RELAX= 
##$RELAX= 
##$RELAX= 
##$RELAX= 
##$RELAX= 
$$ Bruker specific parameters
$$ --------------------------
##$DU= <E:\>
##$EXPNO= 12
$$ [...]
##$TP07= 0
##$TPNAME0= <>
##$TPNAME1= <>
##$TPNAME2= <>
##$TPNAME3= <>
##$TPNAME4= <>
##$TPNAME5= <>
##$TPNAME6= <>
##$TPNAME7= <>
##$TPOAL= (0..7)
0.5 0.5 0.5 0.5 0.5 0.5 0.5 0.5
##$TPOFFS= (0..7)
0 0 0 0 0 0 0 0
##$TUNHIN= 0
##$TUNHOUT= 0
##$TUNXOUT= 0
##$USERA1= <user>
##$USERA2= <user>
##$USERA3= <user>
##$USERA4= <user>
##$USERA5= <user>
##$V9= 5
##$VALIST= <valist>
##$VCLIST= <CCCCCCCCCCCCCCC>
##$VD= 0
##$VDLIST= <DDDDDDDDDDDDDDD>
##$VPLIST= <PPPPPPPPPPPPPPP>
##$VTLIST= <TTTTTTTTTTTTTTT>
##$WBST= 2048
##$WBSW= 25
##$XGAIN= (0..3)
0 0 0 0
##$XL= 0
##$YL= 0
##$YMAX_a= 6281816
##$YMIN_a= -14126977
##$ZGOPTNS= <>
##$ZL1= 120
##$ZL2= 120
##$ZL3= 120
##$ZL4= 120
##$ABSF1= 14.96094
##$ABSF2= -5.597241
##$ABSG= 5
##$ABSL= 3
##$ALPHA= 0
##$AQORDER= 0
##$ASSFAC= 0
##$ASSFACI= 0
##$ASSFACX= 0
##$ASSWID= 0
##$AUNMP= <proc_prof1d_extract.lims>
##$AXLEFT= 0
##$AXNAME= <>
##$AXNUC= <1H>
##$AXRIGHT= 0
##$AXTYPE= 0
##$AXUNIT= <>
##$AZFE= 0.1
##$AZFW= 0.1
##$BCFW= 0
##$BC_mod= 0
##$BYTORDP= 0
##$COROFFS= 0
##$CY= 15
##$DATMOD= 1
##$DC= 0
##$DFILT= <>
##$DTYPP= 0
##$F1P= 0
##$F2P= 0
##$FCOR= 0.5
##$FTSIZE= 131072
##$FT_mod= 6
##$GAMMA= 0
##$GB= 0
##$INTBC= 1
##$INTSCL= 1
##$ISEN= 128
##$LB= 0.3
##$LEV0= 0
##$LPBIN= 0
##$MAXI= 10000
##$MC2= 0
##$MEAN= 0
##$ME_mod= 0
##$MI= 0
##$NCOEF= 0
##$NC_proc= -2
##$NLEV= 6
##$NOISF1= 0
##$NOISF2= 0
##$NSP= 0
##$NTH_PI= 0
##$NZP= 0
##$OFFSET= 14.96094
##$PC= 1
##$PHC0= -78.77747
##$PHC1= 0
##$PH_mod= 1
##$PKNL= yes
##$PPARMOD= 0
##$PPDIAG= 0
##$PPIPTYP= 0
##$PPMPNUM= 2147483647
##$PPRESOL= 1
##$PSCAL= 4
##$PSIGN= 0
##$PYNMP= <proc.py>
##$REVERSE= no
##$SF= 400.020009660262
##$SI= 131072
##$SIGF1= 0
##$SIGF2= 0
##$SINO= 400
##$SIOLD= 131072
##$SPECTYP= <>
##$SREGLST= <1H.CDCl3>
##$SSB= 0
##$STSI= 131072
##$STSR= 0
##$SW_p= 8223.68421052631
##$SYMM= 0
##$S_DEV= 0
##$TDeff= 65536
##$TDoff= 0
##$TI= <>
##$TILT= no
##$TM1= 0
##$TM2= 0
##$TOPLEV= 0
##$USERP1= <user>
##$USERP2= <user>
##$USERP3= <user>
##$USERP4= <user>
##$USERP5= <user>
##$WDW= 1
##$XDIM= 131072
##$YMAX_p= 457388266
##$YMIN_p= -15400
##$CURPLOT= <Network HP LaserJet P1505>
##$CURPRIN= <$Network HP LaserJet P1505>
##$DFORMAT= <normdp>
##$LAYOUT= <+/1D_H.xwp>
##$LFORMAT= <normlp>
##$PFORMAT= <normpl>
##$SURQMSG= 1
$$ End of Bruker specific parameters
$$ ---------------------------------
##NTUPLES= NMR SPECTRUM
##VAR_NAME=  FREQUENCY,     SPECTRUM/REAL,   SPECTRUM/IMAG
##SYMBOL=    X,             R,               I
##VAR_TYPE=  INDEPENDENT,   DEPENDENT,       DEPENDENT
##VAR_FORM=  AFFN,          ASDF,            ASDF
##VAR_DIM=   131072,        131072,          131072
##UNITS=     HZ,            ARBITRARY UNITS, ARBITRARY UNITS
##FACTOR=    0.0627417313425164, 1,          1
##FIRST=     8223.62146879497, 2967,         -59257
##LAST=      0,             4133,            -58225
##MIN=       0,             -15400,          0
##MAX=       8223.62146879497, 457388266,    0
$$ Real data points
##PAGE= N=1
##DATA TABLE= (X++(R..R)), XYDATA
$$ [...]
61547D04923Q30J033M77k09J50J170J177j33r36M0J687K430K572L249M190M178
61531D26828L188K408K309K224J846J732J974J624pk275l957m482m061l061j825
61516D24465p51j02J04q1n88j029p85K79J418J751J266O27J73l94j184j625j193
61499D22351k53M05O55J053J795K361K329J948J659J500J315J103Q13L04k15k39
61483D38884J62J50o10j128k49J726L459M243M420M414M257M081M164M360M074
61468D76407K933J141p77k116k253j383o55q91j495j473j136j569k688l180k495
61453D58370j590j235q94J16J316J816J633J423J384J176O42Q8r8K14Q57J472
61437D66690J763J707J397Q80L97M28J044J464R70K4k85L15J153J701J914J634
$$ plain form
61547 404923 405753 406786 407263 407054 407204 408374 409551 409418 408482 408522 410209 412639 415211 418460 422650 426828
61531 426828 430016 432424 434733 436957 438803 440535 442509 444133 444126 441851 437894 433412 429351 426290 424465
61516 424465 423714 423612 423716 423635 423047 422018 421233 421512 422930 424681 425947 426574 426747 426353 425169 423544 422351
61499 422351 422098 422503 423158 424211 426006 428367 430696 432644 434303 435803 437118 438221 439034 439338 439123 438884
61483 438884 439046 439196 438586 437458 437209 438935 442394 446637 451057 455471 459728 463809 467973 472333 476407
61468 476407 479340 480481 479704 477588 475335 473952 473297 472406 470911 469438 468302 466733 464045 460865 458370
61453 458370 456780 455545 454651 454767 456083 457899 459532 460955 462339 463515 464157 464245 464147 464361 465218 466690
61437 466690 468453 470160 471557 472437 472834 473262 474306 475770 476740 476764 476479 476794 477947 479648 481562 483196
61421D83196Q32L40J140K765L601L025K094J735J563J049O37Q17J001L00j161
61406E02934k467k952k515j482o55q59j877k454j884q82l86k45J50N89M21k56
61390D85180o11k35M58R03R91J016J301J865K310K217J700J273J277J772K814
61375E04231M192N101M913M233M192M740M696L691K770K639K577J853J057J075
61361E51960J599J688J217R08J292K353L756M945N463N667O513Q216R841J0672
61347F16090J1099J1541J1392R903P370M644K089j29j382j205j73O49P28K6j444
61332F71198l319m654m903m571m331m051l509l307m067n197n472m532k995j441
61318F14849j19O90R66J323K317L595M511N268O644Q791J1021J2720J3902J4993
$$ plain form
61421 483196 484028 484368 485508 488273 491874 494899 496993 498728 500291 501340 501977 502794 503795 504095 502934
61406 502934 500467 497515 495000 493518 492863 492004 490127 487673 485789 484907 484521 484276 484426 485015 485436 485180
61390 485180 484569 484334 484792 485695 486686 487702 489003 490868 493178 495395 497095 498368 499645 501417 504231
61375 504231 508423 513524 518437 522670 526862 531602 536298 539989 542759 545398 547975 549828 550885 551960
61361 551960 553559 555247 556464 557372 558664 561017 564773 569718 575181 580848 587361 595577 605418 616090
61347 616090 627189 638730 650122 660025 667395 672039 674128 673999 672617 671412 671239 671888 672616 672642 671198
61332 671198 667879 663225 658322 653751 649420 645369 641860 638553 634486 629289 623817 619285 616290 614849
61318 614849 614730 615420 616386 617709 620026 623621 628132 633400 640044 648835 659856 672576 686478 701471
61304G01471J6427J8195J9499J9362J7779J5615J3077R346M313n28l847o173q674
61291H15862j1150j2547j2745j2481j1961j0964r929r509r287q245o474n084m459
61278F91027l824k620j212j8J078K211L291M367N523O390O404N600M530L586K980
61263G29313L070L950N058N962P141R188J1582J3208J3701J3240J1500Q083L829
61250H38825L24j881l471m859n707n972o131o180n647m813m675n336n577m537
61236G74363k858j582q41k76j9m95j579k384j825N84M042O717P323O503N965O338
61220G99976O632N912M542L461L004K949L218L987N284O710P490O932N094K881
61206H68072J165N0p42j133r07j95Q13K334M536P040R560J2527J6274K0048K2883
$$ plain form
61304 701471 717898 736093 755592 774954 792733 808348 821425 830771 835084 834556 830709 824536 815862
61291 815862 804712 792165 779420 766939 754978 744014 734085 724576 715289 707044 700570 695486 691027
61278 691027 687203 684583 683371 683353 684431 686642 689933 694300 699823 706213 712617 718217 722747 726333 729313
61263 729313 732383 736333 741391 747353 754494 763682 775264 788472 802173 815413 826913 834996 838825
61250 838825 839149 837268 833797 828938 823231 817259 811128 804948 799301 794488 789813 784477 778900 774363
61236 774363 771505 769923 769082 768806 768787 768292 766713 764329 762504 763088 767130 773847 781170 787673 793638 799976
61220 799976 806608 812520 817062 820523 823527 826476 829694 833681 838965 845675 853165 860097 865191 868072
61206 868072 869237 869287 868545 867412 866505 866310 867123 869457 873993 881033 890593 903120 919394 939442 962325
61191I62325K4950K6844K7835K6243K1668J5622R815M926J267o91j007o46n96
61178A118555j143k238l863n803p687r470j1405j3405j5014j6015j6476j6324
61166I99712j5553j4750j4651j5180j5671j5952j6367j6810j6617j5549j4057
61155H28555j2509j0832r003p158n155k713Q0K927N808Q542J0182R768P436M064
61141H29992J39m066p630r608j0259j0470j0122q421n709l458k232j046R63L486
61127G61559N914Q114J0018J1566J3243J5648J8335K0272K1496K3083K5278K7130
61115I61656K8200K9263L0828L2274L3019L3306L3304L2598L1087K9371K7761
61104A302667K6004K4243K3005K1865J9464J5339J0408N258o33p278j3321j7683
$$ plain form
61191 962325 987275 1014119 1041954 1068197 1089865 1105487 1115302 1120228 1121495 1120804 1119797 1119151 1118555
61178 1118555 1117412 1115174 1111311 1105508 1097821 1088351 1076946 1063541 1048527 1032512 1016036 999712
61166 999712 984159 969409 954758 939578 923907 907955 891588 874778 858161 842612 828555
61155 828555 816046 805214 796211 789053 783898 781185 781265 784192 790000 798542 808724 818492 825928 829992
61141 829992 830131 826065 818435 808827 798568 788098 777976 769555 763846 760388 758156 757110 758073 761559
61127 761559 767473 775587 785605 797171 810414 826062 844397 864669 886165 909248 934526 961656
61115 961656 989856 1019119 1049947 1082221 1115240 1148546 1181850 1214448 1245535 1274906 1302667
61104 1302667 1328671 1352914 1375919 1397784 1417248 1432587 1442995 1448253 1447620 1440342 1427021 1409338
61092A409338k0817k3384k4979k5156k4593k4174k3775k2935k1869k0851j9426
61081A157379j7187j4692j2718j1146r342p120m728k417m57R98K367M226O293
61068A091456P738Q628R883J1556J2537J2498J2692J4071J5781J6418J5765J4620
61056A243643J3868J4256J5983J7919J8454J7601J7004J7415J7770J7401J7377
61045A428691J8526J9785J9881J9208J8729J8313J7501J6807J6794J6945J6625
61034A627805J6210J6075J5544J4098J2587J1970J1894J1672J1631J2262J3194
61023A774942J4169J5868J8616K1442K3573K5435K7147K7796K7590K8867L3147
61012B038592L9088M5285N3092O4198P7107Q8853R8897J08883J20198J34586J55585
$$ plain form
61092 1409338 1388521 1365137 1340158 1315002 1290409 1266235 1242460 1219525 1197656 1176805 1157379
61081 1157379 1140192 1125500 1112782 1101636 1092294 1085174 1080446 1078029 1077572 1078570 1080937 1085163 1091456
61068 1091456 1099194 1107822 1117705 1129261 1141798 1154296 1166988 1181059 1196840 1213258 1229023 1243643
61056 1243643 1257511 1271767 1287750 1305669 1324123 1341724 1358728 1376143 1393913 1411314 1428691
61045 1428691 1447217 1467002 1486883 1506091 1524820 1543133 1560634 1577441 1594235 1611180 1627805
61034 1627805 1644015 1660090 1675634 1689732 1702319 1714289 1726183 1737855 1749486 1761748 1774942
61023 1774942 1789111 1804979 1823595 1845037 1868610 1894045 1921192 1948988 1976578 2005445 2038592
61012 2038592 2077680 2122965 2176057 2240255 2317362 2406215 2505112 2613995 2734193 2868779 3024364
61001C024364J86075K25837K74790L36763M16187N13670O30911P78552R72043
60992G359192J220109J524459J885158K280765K624251K755879K525236J916084
60984B4091133J094161L18082k08233m11390l18216l472M09053P28082P45897
60975B6445097L59262l48388j153257j827625k247935k407043k363121k189639
60967A4267351j951312j695178j448230j222373j022645q50981p05883n83779
60959D786970m82006l99127l33053k80860k40077k08564j83579j62542j44410
60950B352752j29033j15595j02909r0728p9601o9770o1255n4579n0374m8440m7960
60939A502508m8221m8619m8539m7932m7412m7030m5688m2491l8021l3536k9606
$$ plain form
61001 3024364 3210439 3436276 3711066 4047829 4464016 4977686 5608597 6387149 7359192
60992 7359192 8579301 10103760 11988918 14269683 16893934 19649813 22175049 24091133
60984 24091133 25185294 25503376 25295143 24883753 24565537 24562065 24971118 25699200 26445097
60975 26445097 26804359 26455971 25302714 23475089 21227154 18820111 16456990 14267351
60967 14267351 12316039 10620861 9172631 7950258 6927613 6076632 5370749 4786970
60959 4786970 4304964 3905837 3572784 3291924 3051847 2843283 2659704 2497162 2352752
60950 2352752 2223719 2108124 2005215 1914487 1834886 1765116 1703861 1649282 1598908 1550468 1502508
60939 1502508 1454287 1405668 1357129 1309197 1261785 1214755 1169067 1126576 1088555 1055019 1025413
60928A025413k6252k3679k1916k0306j8282j6127j4300j2695j1240j0523j0771
60917H39322j0993j0185q822q046p806o957n067k974j629j076p28k5J103K076
60903G78193K161J365L92m77j692l272m292m302m298n301o758p457p380p437p827
60888G21618p983p869p991q242p961p205o780o881o813o307o053o573p397p789
60874F19774p522o659n288l886l219l420l642l118k064j141m70K86J114J559J416
60859E83720J144J440K462L593M069L915M061N206O703P066N622L288J537R99
60845F34825J305J929K704L602M352M480L517J250k102n826q930j0562j0425q934
60831F11185p116o122o501p695q388p704o028m525l892l814l716l542l577l867
$$ plain form
60928 1025413 999161 975482 953566 933260 914978 898851 884551 871856 860616 850093 839322
60917 839322 828329 818144 809322 801276 793470 786513 781446 778472 776843 775767 775039 775014 776117 778193
60903 778193 780354 781719 782111 781634 779942 776670 772378 768076 763778 758477 751719 744262 736882 729445 721618
60888 721618 713635 705766 697775 689533 681572 674367 667587 660706 653893 647586 641533 634960 627563 619774
60874 619774 612252 605593 600305 596419 593200 589780 586138 583020 580956 579815 579345 579631 580745 582304 583720
60859 583720 584864 586304 588766 592359 596428 600343 604404 609610 616313 623379 629001 632289 633826 634825
60845 634825 636130 638059 640763 644365 648717 653197 656714 657964 655862 650036 641106 630544 620119 611185
60831 611185 604069 597947 591446 583751 575363 567659 561631 557106 553214 549400 545684 542142 538565 534698
60817E34698m138m200m029l615l070k737k900l395l828m051m076l729k880j932
60803D86118j541j793k081j926j452r86o31m22m56o51p22o08n61o49m84K14J094
60786D72463J575J550J465J718K328L036L528L527K927J972J122O52L45k17j008
60771D96983j454j169n92m14n11j13Q94J578J221L10k58l10j23L13R75J239O38
60754D99207j45j25L98J95r59j955k098j990k264k496k012r22K64J303J827J103
60738D89331r46k999l631l103k966l911m932m846l881l168l041k621j210N33J350
60723D49959J013M99M99O03K64j68j22J74J84K03R69K252K878K238R53n0l86L
60705D61965R98J990K165J507R31J119J716J895J243j5j161j338l22R37J258O45
$$ plain form
60817 534698 530560 526360 522331 518716 515646 512909 510009 506614 502786 498735 494659 490930 488050 486118
60803 486118 484577 482784 480703 478777 477325 476339 475708 475286 474830 474179 473457 472849 472288 471639 471155 471369 472463
60786 472463 474038 475588 477053 478771 481099 484135 487663 491190 494117 496089 497211 497863 498208 497991 496983
60771 496983 495529 494360 493768 493354 492843 492730 493624 495202 496423 496733 496475 496165 496042 496355 497330 498569 499207
60754 499207 499062 498937 499335 499530 498571 496616 494518 492528 490264 487768 485756 484834 485098 486401 488228 489331
60738 489331 488385 485386 481755 478652 475686 471775 466843 461997 458116 454948 451907 449286 448076 448609 449959
60723 449959 450972 451471 451970 452573 452837 452669 452547 452721 452905 453108 454077 456329 459207 461445 462398 462348 461962 461965
60705 461965 462963 464953 467118 468625 469556 470675 472391 474286 475529 475514 474353 473015 472693 473630 474888 475533
60689D75533J13Q6l3n44p88l08L12L52L6K3M43R83J473J838J917J785J882K451
60671D87554L174L652L811L600K811J462j22j777l497m873n286m819m222l682
60657D77786k580q52M23M17k92o77n83l66N2R04J864K460K745K882K566J568L71
60640D88688m42r98j670k284k528k622k835k781k044j084o54o00j98N98J100J048
60624D70694Q76Q41O50J00n20q03o14j13K75J18l87m01M64J386J348N77J99N98
60606D75288J016P99J95k85o24j032j407j417r18j30N15O62L63J18M62J542L126
60589D78273M788N966O186N517M538L661K767J726Q31L66J73J18N15J564K685
60574E19674L065K766K669L325M409N332O031O991Q653J0885J3033J4636J5998
$$ plain form
60689 475533 475646 475732 475699 475155 474367 474059 474371 474723 474759 474782 475225 476208 477681 479519 481436 483221 485103 487554
60671 487554 490728 494380 498191 501791 504602 506064 505942 504165 500668 495795 490509 485690 481468 477786
60657 477786 475206 474354 474777 475194 474902 474225 473642 473276 473328 474232 476096 478556 481301 484183 486749 488317 488688
60640 488688 488246 487248 485578 483294 480766 478144 475309 472528 470484 469400 468746 468146 467948 468546 469646 470694
60624 470694 471570 472411 473061 473161 472641 471838 471224 471111 471386 471504 471117 470716 471180 472566 473914 474491 474690 475288
60606 475288 476304 477103 477298 477013 476389 475357 473950 472533 471615 471485 472000 472662 473025 473143 473605 475147 478273
60589 478273 483061 489027 495213 500730 505268 508929 511696 513422 514253 514619 514792 514910 515425 516989 519674
60574 519674 522739 525505 528174 531499 535908 541240 547271 554262 562915 573800 586833 601469 617467
60561F17467J7615J9138J9456J7982J5266J2055Q429M280n1m101p672j0383j1441
60548F98040j0604q823p219n831m114k152n20P82K313M272O336Q328J0342J2347
60534G03497J4325J6760K0245K4609K8998L2709L5433L6762L6123L3242K8240
60523A010943K1382J3206M730l023r651j5132j9209k1580k2500k2490k1642j9810
60511H95224j7370j5100j3271j1491r427p207n003k787n02J918M744Q252J2414
60498H40394J7109K2450K8546L5131M1797M8327N4385N9276O2581O4569O5305
60487A339870O3737N8669N0490M1092L2185K4511J8644J5341J4575J4947J4457
60476A688518J1569N414m259j6899l1233m5771n9106o9846p6852p9785p9121p5619
$$ plain form
60561 617467 635082 654220 673676 691658 706924 718979 727408 731688 731637 727536 719864 709481 698040
60548 698040 687436 678613 671394 665563 661449 659297 658777 659559 661872 666144 672480 680808 691150 703497
60534 703497 717822 734582 754827 779436 808434 841143 876576 913338 949461 982703 1010943
60523 1010943 1032325 1045531 1050261 1047238 1037587 1022455 1003246 981666 959166 936676 915034 895224
60511 895224 877854 862754 849483 837992 828565 821358 816355 813568 813066 814984 819728 827980 840394
60498 840394 857503 879953 908499 943630 985427 1033754 1088139 1147415 1209996 1274565 1339870
60487 1339870 1403607 1462276 1512766 1553858 1586043 1610554 1629198 1644539 1659114 1674061 1688518
60476 1688518 1700087 1705501 1701242 1684343 1653110 1607339 1548233 1478387 1401535 1321750 1242629 1167010
60464A167010p0098o3558n6931n0523m4179l8078l2956k9368k7067k5220k3026
60453G06006k0168j6997j4272j2426j1117r737q194o832n819n044m489m176l850
60440E82885l249k602k437k840l380l663l535k902j874j096j289k286k974k449
60426E46309r95K13K17q95k100k389j684o76J31Q48J609K171K406K583K691K205
60410E52644R90r5k47K33N79P95J293J876J985J737J741K133K572K991L411L355
60394E77993K425J292J036J646K180K298K583L296L924M059L779L104K038J203
60380F12856J365K264K912L078L350L720L454K648K464L289L958L501K449J657
60366F52965J002J91k00L43J139J239Q94J000J502J559J034P48J265K361L700
$$ plain form
60464 1167010 1096912 1033354 976423 925900 881721 843643 810687 781319 754252 729032 706006
60453 706006 685838 668841 654569 642143 631026 621289 613095 606263 600444 595400 590911 586735 582885
60440 582885 579636 577034 574597 571757 568377 564714 561179 558277 556403 555307 554018 551732 548758 546309
60426 546309 545314 545527 545744 544849 542749 540360 538676 538000 538131 538979 540588 542759 545165 547748 550439 552644
60410 552644 553634 553539 553292 553525 554104 554899 556192 558068 560053 561790 563531 565664 568236 571227 574638 577993
60394 577993 580418 581710 582746 584392 586572 588870 591453 594749 598673 602732 606511 609615 611653 612856
60380 612856 614221 616485 619397 622475 625825 629545 632999 635647 638111 641400 645358 648859 651308 652965
60366 652965 653967 654158 653958 654301 655440 656679 657573 658573 660075 661634 662668 663416 664681 667042 670742
60351F70742N236O803P995Q681R184R745J0136R932Q920P208N090K839M45k262
60337G60694n117p437q599q746q494q168p571o607n646n101m826m353l644l260
60323F73125l626m393m850m747m315l603k430r81J76R06J681K670L416L879M983
60308F61891P406J0491J3114J5127J7056J8851K0093K0993K2051K2838K2252J9975
60296H72138J6614J2402O929L47o232j1925j6653k0280k2094k1717j9751j7086
60284G72692j4165j1333r153p896p175o494n786n246n090n563o638p628p758p186
60270F65581o818p000p121o631n652m482l314k650l016l916l935k483o28K70J03
60255F08308l04m09k49N9M75R92J656K433K990K984K572K067J281o8j393j715
$$ plain form
60351 670742 675978 682781 690776 699457 708641 718386 728522 738454 747374 754582 759672 762511 762956 760694
60337 760694 755577 748140 739541 730795 722301 714133 706562 699955 694309 689208 684382 680029 676385 673125
60323 673125 669499 665106 660256 655509 651194 647591 645161 644180 644356 645262 646943 649613 653029 656908 661891
60308 661891 669297 679788 692902 708029 725085 743936 764029 785022 807073 829911 852163 872138
60296 872138 888752 901154 908083 908430 902198 890273 873620 853340 831246 809529 789778 772692
60284 772692 758527 747194 738041 730145 722970 716476 710690 705444 700354 694791 688153 680525 672767 665581
60270 665581 658763 651763 644642 638011 632359 627877 624563 621913 618897 614981 611046 608563 607935 608205 608308
60255 608308 608004 607595 607346 607405 607880 608872 610528 612961 615951 618935 621507 623574 624855 624787 623394 621679
60239F21679j129p67j059j219p35j78nK63R63J509J552J892L250M950N878O086
60223F42930O369O797O755O195N777N927O477P196Q022Q882R746J0779J2003J3090
60209G56945J3778J4151J4238J3827J2993J2276J1886J1308J0133Q792P925P534
60197H95786P263O963O504N582M263L083K150Q44j055k685l441m141n849q108
60183I07159r485r565r237r227r393r513r691r818r406q261o784n463m515m049
60169G92752m030m055l654k936k598l076l937m212l343j807p68q74j450j321l34
60154G54357N53Q18J088J929K705K482J486R00J444K803M215N040M927M008K946
60139G91701K466K949M540P094R801J1491J1802J1628J1902J2485J2683J2266
$$ plain form
60239 621679 620550 619783 618724 617505 616770 616592 616587 616850 617813 619322 620874 622766 626016 630966 636844 642930
60223 642930 649299 656096 662851 669046 674823 680750 687227 694423 702445 711327 721073 731852 743855 756945
60209 756945 770723 784874 799112 812939 825932 838208 850094 861402 871535 880327 888252 895786
60197 895786 903049 910012 916516 922098 926361 929444 931594 932438 931383 928698 925257 921116 915267 907159
60183 907159 897674 888109 878872 869645 860252 850739 841048 831230 821824 813563 806779 801316 796801 792752
60169 792752 788722 784667 781013 778077 775479 772403 768466 764254 760911 759104 758336 757462 756012 754691 754357
60154 754357 754910 755728 756816 758745 761450 763932 765418 766318 767762 770565 774780 779820 784747 788755 791701
60139 791701 794167 797116 801656 808750 818551 830042 841844 853472 865374 877859 890542 902808
60127I02808J1304R604P103M472K559J508J004J075J905L158M201M879N427N813
60113I66820N748N222M522L809L091K396J621N08q95k149l177m573o647q618r434
60098I58244r028q127p249o492n898n359m506l276k301k040k037j660j117r73
60084H98181j083q83l47J77P97J755K609K598J699M09j304l811o716r066j0671
60069H74344j2282j4138j5351j5128j3826j2425j1422j0653r831q877p874o917
60057G35620n956m931m092l860m144m168l317j793r0J637L282M464N123N852P030
60042G30657Q124Q618Q984R825J0633J0546R854R462R110P520M444J217r56k234
60028H25804l343m495n532o400p147p942r180j0937j2423j2798j2401j2302j2655
$$ plain form
60127 902808 914112 923716 930819 935291 937850 939358 940362 941437 943342 946500 950701 955580 961007 966820
60113 966820 972568 977790 982312 986121 989212 991608 993229 993737 992842 990693 987516 982943 976296 967678 958244
60098 958244 949216 941089 933840 927348 921450 916091 911585 908309 906008 903968 901931 900271 899154 898181
60084 898181 897098 896215 895868 896045 896842 898597 901206 903804 905503 905912 904608 900797 894081 885015 874344
60069 874344 862062 847924 832573 817445 803619 791194 779772 769119 759288 750411 742537 735620
60057 735620 729664 724733 720641 716781 712637 708469 705152 703359 703269 704906 708188 712652 717775 723627 730657
60042 730657 738781 747399 756383 766208 776841 787387 797241 806703 815813 823333 827777 828994 828038 825804
60028 825804 822461 817966 812434 806034 798887 790945 781765 770828 758405 745607 733206 720904 708249
60015G08249j2618j1957j1426j1233j0390q342o115m970m724m334l482k654k074
60002F13930j437n87L21J208K074K684K781K584K570K816K961K852K826L229L977
59987F44789M763N505O329P168P582P133N880M333K867J372m44k523m365n416
59973F84973n495m958m431m297m399m330l864k932j392O46K485L493M108N404
59959F65011P487R173R531Q920P946O426M065J440o12k045l191l855l739l270
59945G03287l061k855k111j236j162j788k077j722j630k454l629m253m136l525
59931F67648k472r30Q41K431L640M579N511O589P554P843P219O039M710L305K063
59916G26570J642K239L003L157L240M276O005P098P076O877P268P789P602O623
$$ plain form
60015 708249 695631 683674 672248 661015 650625 642283 636168 631198 626474 622140 618658 616004 613930
60002 613930 612493 611906 612227 613435 615509 618193 620974 623558 626128 628944 631905 634757 637583 640812 644789
59987 644789 649552 655057 661386 668554 676136 683269 689149 693482 696349 697721 697277 694754 690389 684973
59973 684973 679478 674520 670089 665792 661393 657063 653199 650267 648875 649521 652006 655499 659607 665011
59959 665011 672498 681671 691202 700122 708068 714494 718559 719999 719387 717342 714151 710296 706557 703287
59945 703287 700226 697371 695260 694024 692862 691074 688997 687275 685645 683191 679562 675309 671173 667648
59931 667648 665176 664246 665087 667518 671158 675737 681248 687837 695391 703234 710453 716492 721202 724507 726570
59916 726570 728212 730451 733454 736611 739851 744127 750132 757230 764306 771183 778451 786240 793842 800465
59902H00465N231L508J367r04k621l248k809j871j065m83L17J566K871L795M531
59887H10650N486O564P318P631P751P831P894Q041Q281Q435Q571R123J0142J0813
59873I24531J0246Q339N556K449k00j531j768k355m151o202p287p810q835r998
59859I00984r994q880q138q446q880q594p924p400o823n848m623l433k314j225
59845H08462p9J417L307N021O150P367R536J2080J3218J1919Q817N273K474J298
59831H96260K010L885N871P505Q592Q348O031K148k069o123j0044j3122j4357
59818H94935j4096j3790j3934j3638j2416j0976r933r016p954p058o483n989n591
59805G64061n524n371m379k768j591j189r31o20q28j667k441k807l034l002k214
$$ plain form
59902 800465 805696 809204 810571 809667 807046 803798 800989 799118 798053 797570 797887 799453 802324 806119 810650
59887 810650 816136 822700 830018 837649 845400 853231 861125 869166 877447 885882 894453 903576 913718 924531
59873 924531 934777 943116 948672 951121 950921 949390 947622 945267 941116 934914 927627 919817 910982 900984
59859 900984 890990 882110 873972 865526 856646 848052 840128 832728 825905 820057 815434 812001 809687 808462
59845 808462 808383 809800 813107 818128 824278 831645 841181 853261 866479 878398 887215 892488 894962 896260
59831 896260 898270 902155 908026 915531 924123 932471 938502 940650 938581 932458 922414 909292 894935
59818 894935 880839 867049 853115 839477 827061 816085 806152 797136 789182 782124 775641 769652 764061
59805 764061 758537 753166 748787 746019 744428 743239 742308 741688 740860 739193 736752 733945 730911 727909 725695
59790G25695r76k60j59J25O70O97K15J37M92K14p69j143m34J61l4n7O51R38J4
59771G26177q31p1J747L045L451L603L699L640L814M482N039N021N131O154P595
59756G81696Q502R045J0218J2277J4526J6213J6972J6792J6160J5750J5593J5042
59744I48786J3925J2771J1661R944P553N428L968K329j1k181l288l680m000m137
59730I99068m020m313n208n707n164m467m580n059n107n035n354n539n015m399
59716I30101m402m494m008l571l868l977k686p63j8o07r75k62R65K210L650N135
59700I12430N954N923N635N539N551N622N895O412P147Q016Q374P173M362J349
59686I95382o92k110l483m163l427k198j935k538k908l172m463o700q387q757
$$ plain form
59790 725695 724719 724459 724300 724425 725095 725792 726007 726144 726636 726850 726081 724938 724504 724665 724631 724574 725225 726163 726177
59771 726177 725346 725275 727022 730067 733518 737121 740820 744460 748274 752756 757795 762816 767947 774101 781696
59756 781696 790198 799243 809461 821738 836264 852477 869449 886241 902401 918151 933744 948786
59744 948786 962711 975482 987143 997087 1004640 1010068 1014036 1016365 1016354 1014173 1010885 1007205 1003205 999068
59730 999068 995048 990735 985527 979820 974656 970189 965609 960550 955443 950408 945054 939515 934500 930101
59716 930101 925699 921205 917197 913626 909758 905781 903095 902332 902314 901707 900732 900470 901435 903645 907295 912430
59700 912430 918384 924307 929942 935481 941032 946654 952549 958961 966108 974124 982498 989671 994033 995382
59686 995382 994690 992580 989097 984934 981507 979309 977374 974836 971928 968756 964293 957593 949206 940449
59672I40449q659q973r473r586r268q691p875o890n875m789l566k276p58J406
59658H55176L927N513N467M915N403O810P819Q007Q120Q496Q465P394N284K391
59644I43187q76l830o105q145j0398j2375j3430j3866j4262j4249j3130j1280
59632H21241r662q318o579m596l302l018l325m157n769p646q717q741q421q170
59618G30820p771p231o845o472n784n111n016n067m192k256k63J064J864K406
59604F80146K733L074L544L566K588J263P61R96P68k49r34m63N59J094R57N96
59588G00999L42K16M2m44j252j998k447k890l492l737l241k545k380k585k652
59573F71936k731l101l192k381j202o47o28m13j44m95j182j290q91q60j240j222
$$ plain form
59672 940449 931790 922817 913344 903758 894490 885799 877924 871034 865159 860370 856804 854528 853770 855176
59658 855176 859103 864616 870083 874998 880401 887211 895030 903037 911157 919653 928118 935512 940796 943187
59644 943187 942311 938481 932376 924231 913833 901458 888028 874162 859900 845651 832521 821241
59632 821241 811579 803261 796682 792086 788784 785766 782441 778284 772515 764869 756152 747411 738990 730820
59618 730820 723049 715818 708973 702501 696717 691606 686590 681523 677331 675075 674812 675876 677740 680146
59604 680146 682879 685953 689497 693063 695651 696914 697675 698671 699439 699190 698256 697793 698352 699446 700403 700999
59588 700999 701341 701557 701599 701155 699903 697905 695458 692568 689076 685339 682098 679553 677173 674588 671936
59573 671936 669205 666104 662912 660531 659329 658682 658054 657641 657497 657002 655820 654530 653639 652779 651539 650317
59557F50317p25n35q35j012r10r33q33J21J649K550K455K189K288K504K925M087
59541F65302N750O960P646Q905J1461J5074J9532K4539K8273K7784K1761J2029
59529H55016J913n859r694r393o649l908k041j18K227L746L520K468J824J317
59515H34369o3k361m723o625q125r369j0425j1201j1289j0411r166q550q547q150
59501G25364p006n974n681n569m920l919l022k108r08L48J237J658J758J835K387
59486F95480L583M651M645L863L617M470N702O606P253P716P599O789N848N311
59472G73133N276N731O416O471N234L343J975J081k84j968k668k011j086n11L88
59457H00520K009L637M887O447Q618J0523J1556J2276J2979J2826J1374R682Q753
$$ plain form
59557 650317 649592 649057 648222 647210 646300 645367 644534 644655 646304 648854 651309 653498 655786 658290 661215 665302
59541 665302 671052 678012 685658 694563 706024 721098 740630 765169 793442 821226 842987 855016
59529 855016 856929 851070 841376 831983 825334 821426 819385 819267 821494 825240 828760 831228 833052 834369
59515 834369 834306 831945 827222 820597 812472 803103 792678 781477 770188 759777 750611 742061 733514 725364
59501 725364 718358 712384 706703 701134 696214 692295 689273 687165 686257 686605 687842 689500 691258 693093 695480
59486 695480 699063 703714 708359 712222 715839 720309 726011 732617 739870 747586 755185 761974 767822 773133
59472 773133 778409 784140 790556 797027 802261 805604 807579 808660 808376 806408 803740 801729 800643 800132 800520
59457 800520 802529 806166 811053 817500 826118 836641 848197 860473 873452 886278 897652 907334 916087
59444I16087P941O038K951p05m726q846j1948j2994j2233j0660q863p129n936
59431H48977n450n038m068k698j382j52J104K366L955O456R704J2733J5203J7827
59417H99537K0862K3366K4688K5621K7144K9247L1883L5728M0365M2555L8239
59406A239235K6418J0192n744j7822k4429k5661k2664j6551p743L271J4542K2411
59394A195455K3026J4700l89j6776k8969l4912l6139l4908l2110k8002k3371j9181
59382I78424j5756j3087j1177r711q007n929m112k951k095j257o69l04L05J107
59368I04781J395J158J485K906M444N034M963N075N432N719O137P045Q294R657
59354I73525J1284J3124J4581J5393J6135J7242J8322J9030J9772K0889K1902
$$ plain form
59444 916087 924028 930066 933017 932312 927586 918740 906792 893798 881565 870905 862042 854913 848977
59431 848977 843527 838489 834421 831723 830341 830189 831293 833659 837614 844070 853774 866507 881710 899537
59417 899537 920399 943765 968453 994074 1021218 1050465 1082348 1118076 1158441 1200996 1239235
59406 1239235 1265653 1275845 1270101 1252279 1227850 1202189 1179525 1162974 1155231 1158502 1173044 1195455
59394 1195455 1218481 1233181 1232792 1216016 1187047 1152135 1115996 1081088 1048978 1020976 997605 978424
59382 978424 962668 949581 938404 928693 920686 914757 910645 907694 905599 904342 903673 903369 903674 904781
59368 904781 906176 907334 908819 911725 916169 921203 926166 931241 936673 942392 948529 955574 963868 973525
59354 973525 984809 997933 1012514 1027907 1044042 1061284 1079606 1098636 1118408 1139297 1161199
59343A161199K2260K2087K1536K0189J7755J4627J1159P159K602j925o108j0326
59331A282214j4638j8315k0936k3095k5272k6932k7351k6555k4901k2697k0629
59320A030893j9492j8947j7686j5412j3377j2341j1449r964q658q370q479p998
59308H78720p114o449n857n048m426m246l918l124k505k302j587P8J588K202L136
59293H39148N802R721J3668J7530K1158K2550J9364J1865K716n570j1597j4395
59281I31960j3771j1103q128n168j701J967N031P678J0678J3952J6906J9706K2662
59268I90669K4918K5254K3920K2187K0424J8073J5160J2302R423N875J751k213
59256A167743n767r016j1453j2480j2531j2453j2083j0778q996p898p623p313
$$ plain form
59343 1161199 1183459 1205546 1227082 1247271 1265026 1279653 1290812 1297971 1300573 1298648 1292540 1282214
59331 1282214 1267576 1249261 1228325 1205230 1179958 1153026 1125675 1099120 1074219 1051522 1030893
59320 1030893 1011401 992454 974768 959356 945979 933638 922189 912225 903567 895197 886718 878720
59308 878720 871606 865157 859300 854252 849826 845580 841662 838538 836033 833731 832144 832222 833810 836012 839148
59293 839148 844950 854671 868339 885869 907027 929577 948941 960806 963522 957952 946355 931960
59281 931960 918189 907086 898958 893790 892089 894056 899087 906765 917443 931395 948301 968007 990669
59268 990669 1015587 1040841 1064761 1086948 1107372 1125445 1140605 1152907 1162330 1168205 1169956 1167743
59256 1167743 1161976 1152960 1141507 1129027 1116496 1104043 1091960 1081182 1072186 1064288 1056665 1049352
59244A049352o555n522l977j635O12J344N32m26n85k06K63P40R46L82r89k808
59228A031468m871p005q719r821j0903j2366j3628j4166j4514j5098j5032j3417
59216H91928j1097r473q393o858n185m569m886m845m124l480k890j467O41K052
59202H27354K137J730J555J480J489J945K602K654K067J695J892K150K258K647
59188H55655L389L965M145M137L884L179K368J860J236n9j392j647r67n33p52
59173H78468j109j547k449l310k953j241P86K440L804M637M429L608L235L349
59159H92147K950J717L29j002k840n158p076q224r152j0107j0657j0694j0571
59146H21662j0245r473q830r142r896r732q567p658p386o694n106l637l058k773
$$ plain form
59244 1049352 1042797 1037275 1033298 1031663 1032275 1033619 1034151 1033725 1033140 1032934 1033197 1033937 1034883 1035265 1034276 1031468
59228 1031468 1026597 1019592 1010873 1001052 990149 977783 964155 949989 935475 920377 905345 891928
59216 891928 880831 871358 862965 856107 850922 846353 841467 836622 832498 829018 826128 824661 825302 827354
59202 827354 829491 831221 832776 834256 835745 837690 840292 842946 845013 846708 848600 850750 853008 855655
59188 855655 859044 863009 867154 871291 875175 878354 880722 882582 883818 883759 882367 880720 879753 879220 878468
59173 878468 877359 875812 873363 870053 867100 865859 866645 869085 872889 877526 881955 885563 888798 892147
59159 892147 895097 896814 897143 896141 893301 888143 881067 872843 863691 853584 842927 832233 821662
59146 821662 811417 801944 793114 783972 774076 764344 755777 748119 740733 734039 728933 725296 722238 719465
59132G19465k048j117l93K73J013J592K154L264M874O150O695O986P462Q168R396
59117G73934J1458J3707J4998J5362J5952J7086J7693J7013J5630J4272J2815
59106I39920J0997R072P247N322L327J721O26l81j555k813m233n905p320p861
59092I48164p748p523o922n420l532k238j383j58R85O04j475l827n534p007q482
59077H88504r399r649r937j0393j0205r056p621o392n304m702n168o091o019m751
59063G83817l611l323l212k894l060l886m358l876l211l050l006k666k377k277
59049G39010j801q69l86q60j591j778j435p94O3O68L93l79n27P9M48K58L44J052
59031G31895J688K098L275N697Q453J0679J2595J4536J6245J7676J9269K0903
$$ plain form
59132 719465 717417 716300 715907 716180 717193 718785 720939 724203 729077 735227 741922 748908 756370 764538 773934
59117 773934 785392 799099 814097 829459 845411 862497 880190 897203 912833 927105 939920
59106 939920 950917 959989 967236 972558 975885 977606 978232 977851 976296 973483 969250 963345 956025 948164
59092 948164 940416 932893 925971 920551 917019 914781 913398 913240 914225 914829 913354 909527 903993 896986 888504
59077 888504 879105 869456 859519 849126 838921 829865 822244 815852 810548 805846 800678 794587 788568 783817
59063 783817 780206 776883 773671 770777 767717 763831 759473 755597 752386 749336 746330 743664 741287 739010
59049 739010 737209 736340 735954 735094 733503 731725 730290 729496 729559 730227 730620 730241 729714 729793 730241 730499 730843 731895
59031 731895 733583 735681 738956 744653 753106 763785 776380 790916 807161 824837 844106 865009
59019H65009K1764K1571K0660J8637J4521Q600K655k120n897q674r810r657r730
59006I27529j0524j0764r639p998o534m563j651J212L188M805O520P533P159O065
58992I12338N044L807K040M56l23q12j670k619l227l716m192m135l359k383j350
58977H95899K85K479M321N570P012Q854J0196J0741J1449J2863J4317J5331J6154
58964A015471J6439J5307J3384J2662J3482J3696J1831Q890N905K025l362q770
58952A116960j2692j5695j8690k0861k1343k1256k1992k2695k1615j8982j6522
58941I04617j4828j3084j0834q458o222m106k170k75J879L829M507L909L326L263
58927H65353K726J320K10p4q58k915m836n365n514o471p212o337m707l957l624
$$ plain form
59019 865009 886773 908344 929004 947641 962162 970762 973417 971297 965400 956726 946916 937259 927529
59006 927529 917005 906241 896602 888604 882070 877507 875856 877068 880256 885061 891581 899114 906273 912338
58992 912338 917382 921189 923229 923685 923362 922550 920880 918261 915034 911318 907126 902991 899632 897249 895899
58977 895899 896184 898663 902984 908554 915566 924420 934616 945357 956806 969669 983986 999317 1015471
58964 1015471 1031910 1047217 1060601 1073263 1086745 1100441 1112272 1121162 1127067 1129092 1125730 1116960
58952 1116960 1104268 1088573 1069883 1049022 1027679 1006423 984431 961736 940121 921139 904617
58941 904617 889789 876705 865871 857413 851191 847085 844915 844640 846519 850348 854855 858764 862090 865353
58927 865353 868079 869399 869609 869535 868677 865762 860926 855561 850047 843576 836364 830027 825320 821363 817739
58912H17739k206o8J036Q44P73J663L160N029P318R526J1107J2429J4069J5652
58898H98071J6587J7308J8419J9357J9209J8201J7196J6436J5989J6609J8820
58887A092202K1830K4492K6586K8086K8188K6286K3086J9534J5583J1103O900
58876A323876L562L38l532p407j0395j2755j4895j6166j6073j5537j5481j5281
58864A200254j4096j2602j1913j1837j1707j1820j2588j3374j3622j3969j4777
58853A057949j4908j3520j1777j0970j0312q535o439n775o621p861r367j1638
58841I40226j4009j5224j5249j4927j4405j3452j2506j1938j1152r831q901q852
58829G89780q399o480m276l346l129k242r40j80N16K002L398L365K539K536L355
$$ plain form
58912 817739 815533 815465 816501 817345 818118 819781 822941 827970 835288 844814 855921 868350 882419 898071
58898 898071 914658 931966 950385 969742 988951 1007152 1024348 1040784 1056773 1073382 1092202
58887 1092202 1114032 1138524 1165110 1193196 1221384 1247670 1270756 1290290 1305873 1316976 1323876
58876 1323876 1327438 1327776 1324244 1316837 1306442 1293687 1278792 1262626 1246553 1231016 1215535 1200254
58864 1200254 1186158 1173556 1161643 1149806 1138099 1126279 1113691 1100317 1086695 1072726 1057949
58853 1057949 1043041 1029521 1017744 1006774 996462 987927 981488 975713 969092 961231 951864 940226
58841 940226 926217 910993 895744 880817 866412 852960 840454 828516 817364 807533 798632 789780
58829 789780 781381 774901 770625 767279 764150 761908 760968 760788 761304 763306 766704 770069 772608 775144 778499
58814G78499L909M159M590M457K890R03R0J29k47p64m23J08n81k037k671k475
58798G90536k642l166l173l073l864m862m566l355k896l299l210k347j505l92
58784G48186K019N165P325Q381R873J2299J4434J5437J5677J5443J4465J2638
58772H81342R836N536rn050q357j0912j3779j5736j5230j3408j2555j2498j1291
58759G77889q675o119m111k024j90N85R16J778K294J174m65o19R8l73j583j131
58743G59444J245L509N047P176R899J1455J1403J1048J0579Q908O610N854O872
58730H59049P471O668N949O238O393N503M205L066J872R75J201K136K683L281
58716I16690N181P637Q517P741P296P739P504N902L981K095o01l884o434q381
$$ plain form
58814 778499 782408 786567 791157 795614 798504 799407 799497 799626 799379 798615 798192 798300 797719 795682 793011 790536
58798 790536 787894 784728 781555 778482 774618 769756 765190 761835 758939 755640 752430 750083 748578 748186
58784 748186 750205 755370 762695 771076 780949 793248 807682 823119 838796 854239 868704 881342
58772 881342 891178 896714 896705 891655 883298 872386 858607 842871 827641 814233 801678 789180 777889
58759 777889 769214 763095 758984 756960 756770 757355 758271 760049 762343 763517 763052 762433 762531 762158 760575 759444
58743 759444 760689 764198 769245 776421 786320 797775 809178 820226 830805 839713 846323 852177 859049
58730 859049 866520 873188 879137 885375 891768 897271 901476 904542 906414 907389 908590 910726 913409 916690
58716 916690 921871 929508 938025 945766 953062 960801 968305 974207 978188 980283 979682 975798 969364 960983
58702I60983j1170j4692j7336j9077k1432k4129k4975k3552k1926k1035j9535
58691G42124j6934j4664j3162j0949p744n568n530o227o442o841p813q152p183
58678F24915n935n097l985k347j104n51J32J061J497J836L421O133Q541J0628
58664F39145J3682J7331J9615K0090J9896J8464J3664N853j552o455r920j2857
58652G36956j4267j3846j3171j2989j2206j0656r907j0280j0024q454p052o357
58640F07747m945k484p56l48N59K874N054O046O778P546O969M864L098K342R81
58625F46325j510l267l314l010l029k116j42R70P49J260L283M921N402O598R089
58610F62209J0454R401P964P532O449L783J779J998K475J399L21R13J683Q58m33
$$ plain form
58702 960983 949813 935121 917785 898708 877276 853147 828172 804620 782694 761659 742124
58691 742124 725190 710526 697364 686415 678671 673103 667573 661346 654904 648063 640250 632098 624915
58678 624915 618980 613883 609898 607551 606447 605896 606028 607089 608586 610422 613843 619976 628517 639145
58664 639145 652827 670158 689773 709863 729759 748223 761887 767740 766188 759733 749813 736956
58652 736956 722689 708843 695672 682683 670477 659821 649914 639634 629610 621156 614104 607747
58640 607747 602802 600318 599562 599214 599773 602647 607701 613747 620525 628071 635040 639904 643002 645344 646325
58625 646325 644815 641548 638234 635224 632195 630079 629937 630907 631656 632916 636199 641120 646522 653120 662209
58610 662209 672663 682064 690028 697560 704009 707792 709571 711569 714044 715443 715764 716677 718360 719218 718785
58595G18785p12j118k864m319l508j310M77K097M409O779Q695J1209J4613J6996
58581G70229J7239J7000J7586J7574J5722J3436J2027J0276P244M794M685N783
58569I13595O725Q638J2612J7024K0235K3496K8385L3716L7754M1126M4749M7042
58557A235097M6020M2168L6689K9016J8717P882r34p452j2306j5000j5200j3990
58545A350707j2028q772n101l851n969r172j2239j7110k4512l1297l4858l6663
58533A149135l8453l8627l5706l1934k9662k7394k3082j8441j5997j4694j2280
58522H62865r595q588q420p275n865n514n046l150j515j976k870j895l23n87j895
58507G98351k023j460j891k581j927q15q49j128k64M33o80k100j612k45j83p43
$$ plain form
58595 718785 718073 716955 714091 709772 706264 704954 705431 707528 711937 718716 727411 738620 753233 770229
58581 770229 787468 804468 822054 839628 855350 868786 880813 891089 898333 903127 907812 913595
58569 913595 920320 928958 941570 958594 978829 1002325 1030710 1064426 1102180 1143306 1188055 1235097
58557 1235097 1281117 1323285 1359974 1388990 1407707 1415589 1414655 1407203 1394897 1379897 1364697 1350707
58545 1350707 1338679 1329907 1324806 1320955 1314986 1305814 1293575 1276465 1251953 1220656 1185798 1149135
58533 1149135 1110682 1072055 1036349 1004415 974753 947359 924277 905836 889839 875145 862865
58522 862865 853270 844682 836262 828987 823122 817608 812562 809412 807897 805921 803051 801156 800833 800246 798351
58507 798351 796328 794868 792977 790396 788469 787654 786805 785677 785413 785846 785166 783066 781454 781209 781026 780283
58491G80283m3J286J698K039L769N818O753P993J1345J5367J7836J9692K2907
58478H96743K6491K8324K8975L0020L0529K8661K4762J9632J2112J923p680j3740
58466A106752j7535k1138k3076k1388j8040j5816j3506q767l085P04L544Q058
58454I76707J3576J7811K1187K4920K7065K5131K0450J5511R390M67q924j5456
58442A127835j9933k4532k7566k6319k2576j9954j7939j3961r164o513n309l095
58430I30974q62p92r22K069O778R519J0808J3540J6707J7036J5075J3529J1334
58417A044793N655j825o879r529j2721j5909j6344j5212j5839j7115j5387j1690
58405I11998j0359j1415j0999q554o909o083l636n05J06r28Q7K735L363K092K353
$$ plain form
58491 780283 780240 781526 783224 785263 789032 794850 801603 809596 820941 836308 854144 873836 896743
58478 896743 923234 951558 980533 1010553 1041082 1069743 1094505 1114137 1126249 1128172 1120492 1106752
58466 1106752 1089217 1068079 1045003 1023615 1005575 989759 976253 967486 964401 965105 968649 976707
58454 976707 990283 1008094 1029281 1054201 1081266 1106397 1126847 1142358 1151748 1152215 1143291 1127835
58442 1127835 1107902 1083370 1055804 1029485 1006909 986955 969016 955055 945891 939378 934069 930974
58430 930974 930112 929320 928398 930467 937245 946764 957572 971112 987819 1004855 1019930 1033459 1044793
58417 1044793 1050448 1048623 1041744 1032215 1019494 1003585 987241 972029 956190 939075 923688 911998
58405 911998 901639 890224 879225 870671 863762 857679 854043 853538 853644 852716 852803 855538 858901 860993 863346
58390H63346M058L962K261K147L325K623N57N73K248J985M0N2K075K892K711M642
58374H99497Q013R128Q288R064J1159J1094R477J0255J3135J4175J3456J4785
58362A031526J8095J9666J9578K1242K3872K3199J9501J7083J5952J2040N546
58351A227300R97r58l691o800o524l768l175m258k229K451M445L528M862Q912
58337A221092J0643R501J0620J4998J7932J8359K0352K4044K4610K1641K0095
58326A413887K0506J7869J1694P400O166L169k325n052l807l516n348m676q48
58313A455119J018K5J261N570P757O943Q377J2785J4490J2361J2036J4974J6000
58300A568716J4027J4237J7289J7640J4900J5395J9907K1648J9038J8508K1723
$$ plain form
58390 863346 867404 871366 873627 875774 879099 881722 882279 882852 885100 887085 887125 887177 889252 892144 894855 899497
58374 899497 907510 916638 924926 933990 945149 956243 965720 975975 989110 1003285 1016741 1031526
58362 1031526 1049621 1069287 1088865 1110107 1133979 1157178 1176679 1193762 1209714 1221754 1227300
58351 1227300 1228297 1227339 1223648 1216848 1210324 1206556 1203381 1199123 1196894 1199345 1203790 1207318 1212180 1221092
58337 1221092 1231735 1241236 1251856 1266854 1284786 1303145 1323497 1347541 1372151 1393792 1413887
58326 1413887 1434393 1452262 1463956 1471356 1477522 1480691 1478366 1473314 1469507 1465991 1460643 1455967 1455119
58313 1455119 1456137 1456162 1457423 1462993 1470750 1477693 1486070 1498855 1513345 1525706 1537742 1552716 1568716
58300 1568716 1582743 1596980 1614269 1631909 1646809 1662204 1682111 1703759 1722797 1741305 1763028
58289A763028K2390J8913J7775K0958K2468K0696K1638K6364K8250K6202K7380
58278B016062L3194L6047L3711L3128L6196L6145L2038L2023L7819M1108L9814
58267B407285M2374N1008N6860N7032N9899O7830P1574O8037O6514P0610P1403
58256C090426O5495O2076O4816O4767N8911N7292O3687O8072O6384O8485P7953
58245C808364Q4151Q3292Q6751R8912J07974J08775J12954J25939J36375J39262
58235D892749J46394J62375J74437J77951J86953K06841K22981K29605K42350
58226F642636K67900K90185L02083L20519L53532L84008M03898M31494M75764
58217I872019N18302N51037N95287O61448P28623P87594Q62691R65706J072776
$$ plain form
58289 1763028 1785418 1804331 1822106 1843064 1865532 1886228 1907866 1934230 1962480 1988682 2016062
58278 2016062 2049256 2085303 2119014 2152142 2188338 2224483 2256521 2288544 2326363 2367471 2407285
58267 2407285 2449659 2500667 2557527 2614559 2674458 2742288 2813862 2881899 2948413 3019023 3090426
58256 3090426 3155921 3217997 3282813 3347580 3406491 3463783 3527470 3595542 3661926 3730411 3808364
58245 3808364 3892515 3975807 4062558 4161470 4269444 4378219 4491173 4617112 4753487 4892749
58235 4892749 5039143 5201518 5375955 5553906 5740859 5947700 6170681 6400286 6642636
58226 6642636 6910536 7200721 7502804 7823323 8176855 8560863 8964761 9396255 9872019
58217 9872019 10390321 10941358 11536645 12198093 12926716 13714310 14577001 15542707 16615483
58208A6615483J174758J302723J473303J661010J858508K107875K435573K819709
58200C1448942L263785L833538M575791N483773O598125Q047784R928206J2260203
58192H5440147J5159378J8904959K3715959K9601498L6492844M4056575N0785630
58185C04156990N3453043M8461783L4593068J4528958o552800k3963611l5406429
58178C89271002m0850331m1477651l8844990l4389175k9144461k3802697j9012187
58171A61749510j5423143j3336547j2457205j2138207j1830810j1277227j0433352
58164G4853019r373756q239437p153647o158301n253388m459143l796089l243238
58156B7176020k767018k365768k046285j785275j553371j352499j194085j064114
$$ plain form
58208 16615483 17790241 19092964 20566267 22227277 24085785 26193660 28629233 31448942
58200 31448942 34712727 38546265 43122056 48605829 55203954 63251738 73179944 85440147
58192 85440147 100599525 119504484 143220443 172821941 209314785 253371360 304156990
58185 304156990 357610033 406071816 440664884 455193842 448641042 424677431 389271002
58178 389271002 348420671 306943020 268098030 233708855 204564394 180761697 161749510
58171 161749510 146326367 132989820 120532615 108394408 96563598 85286371 74853019
58164 74853019 65479263 57239826 50086179 43927878 38674490 34215347 30419258 27176020
58156 27176020 24409002 22043234 19996949 18211674 16658303 15305804 14111719 13047605
58148A3047605r42690q35393p54239o88599o23609n66645n28143m95975m55068
58139G157244m13473l83984l58331l23878k88259k63669k43343k16737j92140
58130D473430j81737j78759j70823j61923j60579j59918j49967j37005j31285
58121C041434j27686j17214j05624j02043j00626r1686q0196p5704p4279o7685
58111B098691o0289n9905o1443n6280m8829m7688m9102m4994l8945l8719m0885
58100A551612l8094l3960l5778l9801l8253l4052l4349l6149l2385k5895k3796
58089A179100k3964k0325j5519j5356j6669j3530r814j2663j8877k0409j8351
58078I93623j9068k1400k0006j6911j7655k0114j8668j5384j5804j7804j5799
$$ plain form
58148 13047605 12104915 11269522 10515283 9826684 9203075 8636430 8108287 7612312 7157244
58139 7157244 6743771 6359787 6001456 5677578 5389319 5125650 4882307 4665570 4473430
58130 4473430 4291693 4112934 3942111 3780188 3619609 3459691 3309724 3172719 3041434
58121 3041434 2913748 2796534 2690910 2588867 2488241 2396555 2316359 2240655 2166376 2098691
58111 2098691 2038402 1978497 1917054 1860774 1811945 1764257 1715155 1670161 1631216 1592497 1551612
58100 1551612 1513518 1479558 1443780 1403979 1365726 1331674 1297325 1261176 1228791 1202896 1179100
58089 1179100 1155136 1134811 1119292 1103936 1087267 1073737 1063923 1051260 1032383 1011974 993623
58078 993623 974555 953155 933149 916238 898583 878469 859801 844417 828613 810809 795010
58067G95010j2039j2446j5092j3830r901r066j0407q725n057m524o439o418n569
58054F75497p949j1700j2051j0353j1000j2435j0335o614o037o978m816j438k004
58041E71787n036n186l199l820o175n654l250l723o277o074l510l255n486o503
58027E04639o511q584j1339j0776p985p237p945o381l644l926o376o570m675m395
58013D08295n327m137j896k444m667m155j359m69j422o21J555J616K86J268L708
57998C90231L593J684K369N210N530K924J509J899O03k542l805k723k638l826
57984D00018l110p02m30k629l551k404k418m217m649l002k244l161l145j536n72
57969C62248m85Q12K772K578P24O19K293K275N2j046l7L17j034j953j797k424
$$ plain form
58067 795010 782971 770525 755433 741603 731702 722636 712229 703504 698447 693923 687484 681066 675497
58054 675497 667548 655848 643797 633444 622444 610009 599674 593060 587023 580045 575229 573791 571787
58041 571787 566751 561565 558366 554546 548371 542717 539467 535744 529467 523393 519883 516628 511142 504639
58027 504639 498128 489544 478205 467429 459444 452207 444262 437881 434237 430311 423935 417365 412690 408295
58013 408295 402968 398831 396935 394491 389824 385669 384310 383841 382419 381798 383353 384969 385255 386523 390231
57998 390231 393824 395508 397877 403087 408617 411541 413050 414949 415552 413010 409205 406482 403844 400018
57984 400018 396908 396206 395776 393147 389596 387192 384774 380557 375908 372906 370662 367501 364356 362820 362248
57969 362248 361763 362575 365347 367925 368649 369268 371561 373836 373888 372842 372805 373122 372088 370135 368338 365914
57953C65914l895m148l343l738n011m605k749k055k239n68K549L836L154L702
57939C46804O030P407P440Q819J1865J3856J4339J5679J7738J7406J4242J1270
57927D92895R386O247J599j700k960m836q176j0691j1715j3270j5362j5310j2892
57914D13215j1194j1168j0236p539n586n336m468k061l98n55n91M12P94j8l95
57899C54876j53j100k914k880p24O85M97J172L526N124M970N241O920Q071P919
57884C91230Q269R398Q896O121L665K813J775k35j420j484k859o040p912o670
57870D05547m518l632l186k167j425j182j47J411J275n98j355P4J394J407K011
57855C94909M214O150O744P486Q900R189P904P098P205N877K582J82O9j42k001
$$ plain form
57953 365914 362019 357871 354528 350790 345779 341174 338425 336370 334131 333563 336112 339948 343102 346804
57939 346804 352834 360241 367681 376500 388365 402221 416560 432239 449977 467383 481625 492895
57927 492895 502281 508528 510127 508427 505467 500631 492455 481764 470049 456779 441417 426107 413215
57914 413215 402021 390853 380617 373078 367492 362156 357688 355627 355229 354674 354083 354495 355289 355271 354876
57899 354876 354723 353623 350709 347829 347105 347790 348287 349459 352985 358109 363079 368320 375240 383311 391230
57884 391230 399499 408897 417793 423914 427579 430392 432167 431932 430512 429028 426169 420129 412217 405547
57870 405547 401029 397397 394211 392044 390619 389437 389290 390701 391976 391378 390023 390097 391491 392898 394909
57855 394909 399123 405273 412017 419503 428403 437592 445496 452594 459799 465676 468258 468440 468509 468367 466366
57840D66366l492l147k731l510l694k169j034j845k805k234j421j595j447j37
57826D35105O29r5l58R99J830M06j514j987k108l377m693m705m402m913n305m878
57810D00634m900n852n829l991k722l998o336p649q400r513r969q959p839p585
57796C07092o932n147l904m096l781j650L75N52M45J854L486L538L063L799N006
57781C03700N353N719P269Q867R183R344J0763J2325J2309J1238J0345R096O710
57768D22221M206K605R79j431l198l169k820l799n158n417n273n831o168n187
57754C82560l924l569l192j816p18j124j615m98J122J220M8r90j861k842k794
57739C60007j051O43O03j07K64J196J405J387J925J927L78j290j327m71j74J39
$$ plain form
57840 466366 462874 459727 456996 453486 449792 447623 446589 444744 441939 439705 438284 436689 435242 435105
57826 435105 435734 435639 435281 436280 438110 438516 437002 435015 432907 429530 424837 420132 415730 410817 405512 400634
57810 400634 395734 389882 384053 380062 377340 373342 367006 359357 350957 341444 331475 322516 314677 307092
57796 307092 300160 295013 291109 287013 283232 281582 281957 282509 282954 284808 288294 291832 294895 298694 303700
57781 303700 309053 314772 322041 330908 340091 349435 360198 372523 384832 396070 406415 415511 422221
57768 422221 426427 429032 430011 428580 425382 422213 419393 415594 410436 405019 399746 393915 387747 382560
57754 382560 378636 375067 371875 370059 369341 368217 366602 366104 367226 368446 368494 367504 365643 362801 360007
57739 360007 358956 359599 360202 360095 360359 361555 362960 364347 366272 368199 368577 367287 365960 365489 365315 365454
57723C65454J430K533K058J142J454K099J362l9k51M46N07J8M6K73j46o01l51
57706C77434m67j976l495l274k244k346l185l049k020j383j059k87K49m35j464
57691C50999j597j674l059m813n120m372m203m529m159l347l109k902j511P01
57677C07305K728N160R068J3756J8023K2643K9249L7894M7991O0408P6135R3702
57665G24062J09754J20436J20233J02586O5895J8063k8271o4490q8145r9306r9375
57654H81442r2448q3274p3404o2177n0770m1751l5191k8929k2587j7932j5219
57643C57760j2625r578p516o890o319n099m030l400k573j737j719k083j672q67
57629B91652r59j617j441p13q77j697j648r80j499l300m496m383m118m110l479
$$ plain form
57723 365454 366884 369417 371475 372617 374071 376170 377532 377493 377242 377688 378195 378213 378259 378532 378386 377785 377434
57706 377434 376967 374991 371496 368222 365978 363632 360447 357398 355378 353995 352936 352649 352898 352463 350999
57691 350999 349402 347728 344669 339856 334736 330364 326161 321632 317473 314126 311017 308115 306604 307305
57677 307305 310033 315193 324261 338017 356040 378683 407932 445826 493817 554225 630360 724062
57665 724062 833816 954252 1074485 1177071 1242966 1261029 1232758 1168268 1080123 980817 881442
57654 881442 788994 705720 632316 570139 519369 477618 442427 413498 390911 372979 357760
57643 357760 345135 335557 328041 321151 314832 309733 305703 302303 299730 297993 296274 294191 292519 291652
57629 291652 290693 289076 287635 286922 286045 284348 282700 281720 280221 276921 272425 268042 263924 259814 256335
57614B56335k298j779j924j594j073j953m108n413m908l817l009j908m65K89K39
57599B22614N29J286J199n3j043r62p65j317k101k391k231j824j336j368k205
57584B08032k812k103q42n18r20q44o69j723l480l947k906k172k551k954k798
57569A76793k831l234l173k679k729l192k864j832j578k328k583j718q89q46r34
57554A43383p73q68j073m34J011K131K767L917N525O070M860K877J022p23k092
57539A67600k432k057j926j829p46R55J666J059L98K88J56N3P35J723J520J05
57523A67268q82p16k57J23J059K365K896K574K495K780K477J678J499J823J394
57508A88576L48J00O16L59q15j439j319j870l100l288k275k024l031l291j879
$$ plain form
57614 256335 254037 252258 250334 248740 247667 245714 241606 236193 231285 227468 224459 222551 222086 222375 222614
57599 222614 223143 224429 225628 225575 224532 223570 222805 221488 219387 216996 214765 212941 211605 210237 208032
57584 208032 205220 203117 202275 201757 200837 199993 199324 197601 194121 190174 187268 185096 182545 179591 176793
57569 176793 173962 170728 167555 164876 162147 158955 156091 154259 152681 150353 147770 146052 145163 144317 143383
57554 143383 142610 141742 140669 140235 141246 143377 146144 150061 155586 161656 166516 169393 170415 169692 167600
57539 167600 165168 163111 161185 159356 158610 159565 161231 162290 162688 162976 163132 163185 163920 165643 167163 167268
57523 167268 166386 165670 165413 165536 166595 168960 171856 174430 176925 179705 182182 183860 185359 187182 188576
57508 188576 188924 189024 189640 189999 189184 187745 186426 184556 181456 178168 175893 173869 170838 167547 165668
57493A65668o23p57q85J68J092M92p43j197j083j012n73L62P17L3m66N5O71N30
57475A62449K74M47K30r80k415l375m178m732m125k516j601k117k794k677k459
57460A29431k568k109q86k57p13p61M00J277O26m45n01j0O1L3L29K43n83j058
57442A22509m94Q7j48k66O15J616J617J022O40L30J3L99J464J867J040K13K89
57425A32813N46N24J084K304K545J123k23k02j28j327k580k233r47k21J78J160
57409A34416K212K494K588L236L593K697J291M46k59j441k312k141j794k031j893
57394A41102o28M50R8n70m2R50J060R71J905L062L084K899M265O515P425O630
57378A79176N571M678L187J308J11m57j322k249k216j509j499k457l351l615l555
$$ plain form
57493 165668 165045 164288 163403 163571 164663 165155 164412 163215 162132 161120 160547 160909 161626 161659 161193 161248 161919 162449
57475 162449 162723 163170 163400 162420 160005 156630 152452 147720 143595 141079 139478 137361 134567 131890 129431
57460 129431 126863 124754 123868 123611 122898 122137 122537 123814 124440 123995 123494 123484 123545 123578 123907 124150 123567 122509
57442 122509 122015 122102 121954 121688 122303 123919 125536 126558 127198 127528 127541 127940 129404 131271 132311 132524 132813
57425 132813 133359 133883 134967 137271 139816 140939 140716 140514 140386 139059 136479 134246 133299 133078 133256 134416
57409 134416 136628 139122 141710 144946 148539 151236 152527 152973 152714 151273 148961 146820 145026 142995 141102
57394 141102 140474 140924 141022 140452 140410 141360 142420 143391 145296 148358 151442 154341 158606 165121 172546 179176
57378 179176 184747 189425 192612 193920 194031 193574 192252 190003 187787 186278 184779 182322 178971 175356 171801
57363A71801l254k511j589q06L6Q56R09L19O50K472L908L337K028J925K420J831
57347A84332P57J054K383K661J589Q81J148J256P90O87J140J139M19q9m9q6k33
57330A99779K17J084J225L55n31p54o33n02k91j05p4J46P53J123Q22N86J114J635
57312B05949J159K38m5P5j10k2J117K346K203J300J419K587L285L162L208L582
57296B31453L472L078L402M172M136L458L585M669N283M945M808N530O426P039
57282B95456P745Q447Q485Q163Q646J0049J1306J2080J2984J3795J3331J1560
57270D22047J0006R596R689R583R411R122Q248P044O455O517O235N239M204L461
57256E26857K769K531L581N508O838P183P657Q807R754R783R276Q657P947P619
$$ plain form
57363 171801 168547 166036 164447 163641 163677 164533 165442 165761 166411 168883 172791 176128 178156 180081 182501 184332
57347 184332 185089 186143 188526 191187 192776 193657 194805 196061 196851 197538 198678 199817 200236 200147 200098 200012 199779
57330 199779 199996 201080 202305 202660 202129 201375 200742 200240 199949 199844 199770 199916 200669 201792 202614 203200 204314 205949
57312 205949 207108 207346 207301 207376 207266 207244 208361 210707 212910 214210 215629 218216 221501 224663 227871 231453
57296 231453 234925 238003 241405 245577 249713 253171 256756 261425 266708 271653 276461 281991 288417 295456
57282 295456 303201 311648 320133 328296 336942 346991 358297 370377 383361 397156 410487 422047
57270 422047 432053 441649 451338 460921 470332 479454 487702 494746 501201 507718 513953 519192 523396 526857
57256 526857 529626 532157 535738 541246 548084 555267 562924 571731 581485 591268 600544 609201 617148 624767
57242F24767Q423J0011J1144J1492J1802J2164J1785J0770J0326J0767J1018J0577
57230G55046J0344J0870J1406J1404J1446J1994J2586J2952J3604J4648J5302
57219H91602J5251J5287J5966J6792J7364J8082J9155J9967K0153K0273K0852
57208A090744K1572K1884K1607K0676J9211J7958J7748J8378J8931J9150J9419
57197A307278J9603J9233J8740J9031J9919K0427K0730K2041K4443K6530K7513
57186A545488K8087K8814K9345K9621L0228L1012L0991L0141K9745L0411L1256
57175A875139L1578L1755L1985L1708L0927L0451L0286K9338K7460K6112K6168
57164B202907K6742K6988K7421K8501K9399K9269K8437K7480K6455K5817K6520
$$ plain form
57242 624767 633190 643201 654345 665837 677639 689803 701588 712358 722684 733451 744469 755046
57230 755046 765390 776260 787666 799070 810516 822510 835096 848048 861652 876300 891602
57219 891602 906853 922140 938106 954898 972262 990344 1009499 1029466 1049619 1069892 1090744
57208 1090744 1112316 1134200 1155807 1176483 1195694 1213652 1231400 1249778 1268709 1287859 1307278
57197 1307278 1326881 1346114 1364854 1383885 1403804 1424231 1444961 1467002 1491445 1517975 1545488
57186 1545488 1573575 1602389 1631734 1661355 1691583 1722595 1753586 1783727 1813472 1843883 1875139
57175 1875139 1906717 1938472 1970457 2002165 2033092 2063543 2093829 2123167 2150627 2176739 2202907
57164 2202907 2229649 2256637 2284058 2312559 2341958 2371227 2399664 2427144 2453599 2479416 2505936
57153B505936K8205K8942K7894K6736K7147K8429K9039K9049K9441L0102L0199
57142B821119K9752K9244K8348K6416K3712K0881J7827J4293J0957Q747P576O874
57130C045746O910Q489J1705J5971K0820K5874L0512L4385L7697M0239M0846L8809
57118C358003L5127L1487K8779K7616K9401L5262M4464N5319O7340Q1094R6291
57107C890183J11746J27471J45318J67345J94943K29942K75041L32415M03199
57098E877603M89527N96221P29520Q94897J096673J338013J618771J933304K271793
57089A6846322K623699K978205L321050L632298L887111M057574M115504M037315
57081D5499078L805813L403311K807302K010606J061638P9665p91753j463917
$$ plain form
57153 2505936 2534141 2563083 2590977 2617713 2644860 2673289 2702328 2731377 2760818 2790920 2821119
57142 2821119 2850871 2880115 2908463 2934879 2958591 2979472 2997299 3011592 3022549 3031296 3038872 3045746
57130 3045746 3052656 3061145 3072850 3088821 3109641 3135515 3166027 3200412 3238109 3278348 3319194 3358003
57118 3358003 3393130 3424617 3453396 3481012 3510413 3545675 3590139 3645458 3712798 3793892 3890183
57107 3890183 4001929 4129400 4274718 4442063 4637006 4866948 5141989 5474404 5877603
57098 5877603 6367130 6963351 7692871 8587768 9684441 11022454 12641225 14574529 16846322
57089 16846322 19470021 22448226 25769276 29401574 33288685 37346259 41461763 45499078
57081 45499078 49304891 52708202 55515504 57526110 58587748 58667413 57875660 56411743
57073E6411743j941600k288935k566889k802583k998031l145425l231906l244224
57065C4192150l178560l044123k856173k629813k381057k127382j882674j653890
57057A4438478j444297j256886j092791r49907q25748p19684o30622n55195m90703
57048F472645m37912l98703l72002l53548l38218l21564l00833k76297k50671
57039C422897k26233k03497j82879j65481j51355j38857j26886j16105j07100
57030B004504r9145r1555q4357p6872o7666n6827m6147l6123k4894j1054M981
57019A414845K3183M3978O3765P3256O3874L5397m078m4105p6426r6509j04347
57008A392833j03723r8663r0773q0637p0089o1041n3292m5547l7893l1577k6937
$$ plain form
57073 56411743 54470143 52181208 49614319 46811736 43813705 40668280 37436374 34192150
57065 34192150 31013590 27969467 25113294 22483481 20102424 17975042 16092368 14438478
57057 14438478 12994181 11737295 10644504 9694597 8868849 8149165 7518543 6963348 6472645
57048 6472645 6034733 5636030 5264028 4910480 4572262 4250698 3949865 3673568 3422897
57039 3422897 3196664 2993167 2810288 2644807 2493452 2354595 2227709 2111604 2004504
57030 2004504 1905359 1813804 1729447 1652575 1584909 1528082 1481935 1445812 1420918 1409864 1414845
57019 1414845 1438028 1482006 1545771 1619027 1682901 1718298 1714220 1670115 1593689 1497180 1392833
57008 1392833 1289110 1190447 1099674 1019037 948948 887907 834615 789068 751175 719598 692661
56997F92661k3165j9657j6342j3219j0550q851p899o670m866l249j786R84N778
56984E83169J1139J5194J7280J6889J2882N238l837j1926j8269k2660k4354k3383
56972E57362k1357j9472j7220j4214j1454r418o915l385l19J396L516P780J3117
56959D79417J7803K2462K8255L3400L4251K9141J9196O390p027j8296k5656k9655
56947E89681l1471l0982k8026k4048k0510j6957j2567q281n250k541J414O301
56935D16763J0987J5884K2125K9487L7020M3973M7960M4396L1040J1936o151k0105
56923F85315l0526l7298l9157l7068l4120l1684k8720k4892k1386j8527j5412
56912C66525j2241j0314r537q403o654n481m992l929k144q97m19M44J879K773
$$ plain form
56997 692661 669496 649839 633497 620278 609728 600877 592978 586308 581442 578193 576407 577391 583169
56984 583169 594308 609502 626782 643671 656553 661791 657954 646028 627759 605099 580745 557362
56972 557362 536005 516533 499313 485099 473645 464227 457312 453927 453608 455004 458520 466300 479417
56959 479417 497220 519682 547937 581337 615588 644729 663925 670315 663288 644992 619336 589681
56947 589681 558210 527228 499202 475154 454644 437687 425120 416839 411589 409048 410462 416763
56935 416763 427750 443634 465759 495246 532266 576239 624199 668595 699635 711571 705420 685315
56923 685315 654789 617491 578334 541266 507146 475462 446742 421850 400464 381937 366525
56912 366525 354284 343970 334433 326030 319376 313895 308903 304974 302830 301933 301514 301958 303837 306610
56898C06610K953L591M920N810N962O565Q345J0831J3741J7257K0923K4207K7896
56885D59611L2609L5903L3486K4000J0649k302j2647j9812k3742k5118k4942k3289
56873D64406j9730j5068j0838p159k921J848N942R472J4313K1644L0901M1487
56861E34297N3536O6382P7633Q3973Q1775O7945M2741J1932j6251l6853m9665
56850I17445n5919n6356n2509m6747m0062l1946k2796j4185o291K469J2727K3492
56838F29322L4770M8300O4906Q3489J03106J22817J37876J39170J19587Q0427
56828A563770L0553j9385o1097q9827j04703j08219j04142r5536q4476p2389n9980
56817G94569m7564l5716k4841j4267k919R206K1528L4561M9569O6450Q3120R6261
$$ plain form
56898 306610 309563 313154 318074 323884 329846 336411 344756 355587 369328 386585 407508 431715 459611
56885 459611 492220 528123 561609 585609 596258 593956 581309 561497 537755 512637 487695 464406
56873 464406 444676 429608 418770 411611 408690 410538 416480 425952 440265 461909 492810 534297
56861 534297 587833 654215 731848 815821 897596 965541 1008282 1020214 1003963 967110 917445
56850 917445 861526 805170 752661 705914 665852 633906 611110 596925 590634 593103 605830 629322
56838 629322 664092 712392 777298 860787 963893 1086710 1224586 1363756 1483343 1563770
56828 1563770 1594323 1574938 1513841 1424014 1319311 1211092 1106950 1011414 926938 854549 794569
56817 794569 747005 711289 686448 672181 669262 678468 699996 734557 784126 850576 933696 1029957
56805A029957J01136R1911O5682K6929j4279m9132p3931q8168r2394q8877q1388
56794H27446p2651o3274n3554m4208l5039k5234j5593q070k474L879J2446K1953
56782E45627L1289M0947N0005N4366N0030L6681J6954n720k7251m3406n2362n5697
56770F41463n5583n2564m6951m0419l4586k9559k5101k1734j9522j7317j4505
56759B83622j1959j0305q837p147o051n856n433m194l170l074l067k594k497l106
56745B06332l218k227j350j298q38Q10K126J674M49L9Q1n16j362j495j167r97
56729A97043n68M71J208R77P68J537K423K304J820K115K755K720K299K386K730
56714B22988K546J986J594J188N39K03M66N26q5m40K04R87Q55J43m33j025j704
$$ plain form
56805 1029957 1131093 1223004 1288686 1315615 1301336 1252204 1178273 1090105 997711 908834 827446
56794 827446 754795 691521 637967 593759 558720 533486 517893 509823 507349 511228 523674 545627
56782 545627 576916 617863 667868 722234 772264 808945 825899 820179 792928 749522 697160 641463
56770 641463 585880 533316 486365 445946 411360 381801 356700 334966 315444 298127 283622
56759 283622 271663 261358 252521 245374 239323 233467 228034 223840 220670 217596 214529 211935 209438 206332
56745 206332 203114 200887 199537 198239 197401 198211 200337 202011 202460 202499 202580 202064 200702 199207 198040 197043
56729 197043 196475 196946 198154 199131 199899 201436 203859 206163 207983 210098 212853 215573 217872 220258 222988
56714 222988 225534 227520 229114 230302 230841 231044 231510 232036 231951 231511 231715 232702 233557 233700 233267 232242 230538
56697B30538j715j014j073k602l940l393j800j049j284j357j040r22r29o20k42
56682B07558j30K17J219K264K790L228L791L612K330J231J379J861J363L11r8
56667B32926M3j58p14j028j036r34n45N8K22j60l39j59l59p82q1J864L146K647
56649B34611J678J606J881J778J929K523K207N93l40O44J675Q06p38q14M0Lp17
56632B49365p74n03j120k145k279j820j811j827j033l75j240k865l576l597m149
56617B20251m658l580j387j98p00j685k172k090j327k8P48M28J06O97J053r5j621
56600B03742j635n08J41L07J044J943J803J021R38J451J521J292J426J297K01
56585B15984n76N56K544L024J898J041J075J052P68Q36R06K03o06l35N77J004
$$ plain form
56697 230538 228823 227809 226736 224134 220194 216801 215001 213952 212668 211311 210271 209349 208420 207800 207558
56682 207558 207428 207645 208864 211128 213918 217146 220937 224549 226879 228110 229489 231350 232713 233024 232926
56667 232926 232969 232811 232097 231069 230033 229099 228554 228612 228834 228674 228335 228176 227817 227035 226954 228818 231964 234611
56649 234611 236289 237895 239776 241554 243483 246006 248213 248806 248466 249110 250785 251591 250853 250039 250079 250082 249365
56632 249365 248591 248088 246968 244823 242544 240724 238913 237086 236053 235678 234438 231573 227997 224400 220251
56617 220251 215593 212013 210626 210428 209728 208043 205871 203781 202454 202426 203174 203602 203708 204405 205458 205363 203742
56600 203742 202107 201599 201740 202047 203091 205034 206837 207858 208796 210247 211768 213060 214486 215783 215984
56585 215984 215408 215964 218508 221532 223430 224471 225546 226598 227366 228202 229108 229311 228705 228370 228947 229951
56569B29951J405K770M261M459M168N220P273Q592R323J1183J4398J7666K0471
56556C41140K2666K2460J8009J0632L644j626n862q690q939p520o658o428n305
56543C67523l787l993n689o316n203m223m035l281k106k716n367p191o455m931
56529C02230m650n017m620l545k451j304k46k7o38j134j287j835k808l453l788
56514B65427m323m346k787o69j28j048j246j93L40l67q44k58L26K75M13R63R00
56497B52435J04o0R26J935K241K300K168J360N16Q79J864J522l07j797k155k205
56481B61726j846P1K844L910K513O84q5m09p23k98O30O08l29m35M88M78j001j850
56463B66976q50M20M68m0k99r09j954k093r17J5k24m96N5N16K61K72J166J956
$$ plain form
56569 229951 231356 234126 238387 242846 247014 252234 259507 268099 277422 288605 303003 320669 341140
56556 341140 363806 386266 404275 414907 418551 416925 411063 402373 393434 385914 379256 372828 367523
56543 367523 363736 359743 354054 347738 342535 338312 334277 330996 328890 326174 320807 313616 307161 302230
56529 302230 297580 292563 287943 284398 281947 280643 280397 280370 279732 278598 277311 275476 272668 269215 265427
56514 265427 261104 256758 253971 253302 253174 252126 250880 250687 251027 250660 249816 249558 249884 250159 250572 251535 252435
56497 252435 252539 252479 253405 255340 257581 259881 262049 263409 263925 264804 266668 268190 267883 266086 263931 261726
56481 261726 259880 259951 262795 266705 269218 269902 269817 269408 268685 268387 269017 269625 269296 268861 269349 269827 268826 266976
56463 266976 266126 266546 267014 266974 266675 265766 263812 261719 260802 260817 260593 260097 260152 260668 260929 261201 262367 264323
56445B64323J899J661J695J475J071J342J879J146p04j602r59o22j577k336j747
56430B66944q10m80j23O44R12M41L75R91J026J73j70M51O69o4m81j39l14j266
56412B68779j388k10M98j60p17k35J6q36j587j267o51l06L83J181P65m43q5K271
56394B66008M107L973L485L939M155L355K962L712L936K656J524J778K110J430
56380C09130R07J359J415K49o40k53O7m91m36R85J921J166L10N77N30p53j380
56363C14663K2J545J311O47J323K246J772Q08Q06R79K40k78O72J919J999J705
56347C32379K111K232J079p3J21P12N44M98J427K155J821J801L037L979L536L432
56331C60791N025O387N368L216K323K619K932L659N247O134M952K929J629M21
$$ plain form
56445 264323 266222 267883 269578 271053 272124 273466 275345 276491 275787 274185 273226 272604 271027 268691 266944
56430 266944 266134 265654 265531 266175 267087 267528 267903 268894 269920 270093 269923 270374 271043 270979 270498 270359 270045 268779
56412 268779 267391 267181 267679 267519 266802 266567 266583 265747 264160 262893 262242 261936 262319 263500 264265 263822 263737 266008
56394 266008 270115 274088 277573 281512 285667 289022 291984 295696 299632 302288 303812 305590 307700 309130
56380 309130 310037 311396 312811 313060 312420 312167 312234 311743 311307 312292 314213 315379 315689 316266 316796 316043 314663
56363 314663 314685 316230 317541 318188 319511 321757 323529 324337 325143 326122 326362 326084 326756 328675 330674 332379
56347 332379 334490 336722 337801 337728 337849 338561 339105 339603 341030 343185 345006 346807 349844 353823 357359 360791
56331 360791 365816 372203 377571 380787 383110 385729 388661 392320 397567 403701 408653 411582 413211 413632
56317D13632j492k865k692k297k786k826j438l17p97j175K22J973K332K347L347
56302D05168M138L717L948O324Q685Q440O570N254M177K482J673L047M753M760
56288D73136M328N221O165N513M733N614O733O371O136P834R479Q652P103P789
56274E64807R802J0609J0873J2500J4227J3845J2765J3746J5890J6587J6596J8497
56262G30744K1711K3789K5242K8470L3159L7183M0954M6463N3162N9071O4931
56251A164879P3123Q3423R3675J03547J13873J23715J31782J39304J47707J55094
56241B330122J58784J59355J58262J53638J42836J27163J09550Q9530O5111L7841
56231C532192J1216j4226l9495o2693q0902r4990j07615j18059j23872j26005
$$ plain form
56317 413632 412140 409275 406583 404286 401500 398674 397236 396919 396122 394947 395169 397142 399474 401821 405168
56302 405168 409306 413023 416971 423295 431980 440420 446990 452244 456421 458903 460576 463623 468376 473136
56288 473136 477464 482685 488850 494363 499096 504710 511443 517814 523950 531784 541263 549915 557018 564807
56274 564807 574609 585218 596091 608591 622818 636663 649428 663174 679064 695651 712247 730744
56262 730744 752455 776244 801486 829956 863115 900298 941252 987715 1040877 1099948 1164879
56251 1164879 1238002 1321425 1415100 1518647 1632520 1756235 1888017 2027321 2175028 2330122
56241 2330122 2488906 2648261 2806523 2960161 3102997 3230160 3339710 3429240 3494351 3532192
56231 3532192 3543408 3529182 3489687 3426994 3346092 3251102 3143487 3025428 2901556 2775551
56221B775551j27319j27531j24739j20281j16851j13375j07159r9630r4376r0819
56211A653471q5544p8795p3834p0685o6329o0514n5837n2468m8199m3268l9849
56200I78149l7313l3167k8070k4813k3080k0347j7044j5534j4975j2747r891r472
56188G31696j0470r240o201n030n896n596l881l491m256l321j062o90k052j870
56174F68640K7O06l58j24J351J586J095K696N572O300N401O564R521J0405R131
56159G28413R678J2737J4755J4770J5591J7691J8383J7724J8839K1833K3674K4497
56147I38585K7672L3216L7686M1071M7210N6976O7526P8685R3359J11221J28619
56136A661826J44954J61999J76569J81304J73732J58028J37713J14072R1895P8310
$$ plain form
56221 2775551 2648232 2520701 2395962 2275681 2158830 2045455 1938296 1838666 1744290 1653471
56211 1653471 1567927 1489132 1415298 1344613 1278284 1217770 1161933 1109465 1061266 1017998 978149
56200 978149 940836 907669 879599 854786 831706 811359 794315 778781 763806 751059 741168 731696
56188 731696 721226 711986 705785 700755 694859 689263 685382 681891 677635 674314 673252 672562 670510 668640
56174 668640 668667 669273 668915 668791 670142 671728 672823 675519 681091 687391 692792 699356 708877 719282 728413
56159 728413 738091 750828 765583 780353 795944 813635 832018 849742 868581 890414 914088 938585
56147 938585 966257 999473 1037159 1078230 1125440 1182416 1249942 1328627 1421986 1533207 1661826
56136 1661826 1806780 1968779 2145348 2326652 2500384 2658412 2796125 2910197 3002092 3080402
56126C080402P4042P2650O9304O3473N3152L5064J2033p726k0446k9107l5784
56115C367057l9942m5149n8579q1597j08103j33275j56193j73448j79320j74172
56105B217279j64392j52598j36157j16265r9057q6016p2563n7961m7227m1298
56095A243745l4930k6668k1228j9589j6524j0721p442q181p540l481q57j475n99
56082A084510L267N075L276L195O779Q906P592P730J1013J2365J0238J0029J3378
56069A187353J4654J2185J2008J6218J8666J6760J6274J9633K0956J7850J6476
56058A369033J9403K0185J5822J2822J4744J5507J1586R043J1655J3719J1568
56047A525087J0665J4321J6867J5117J4980J9666K3052K1761K1786K6195K8641
$$ plain form
56126 3080402 3154444 3227094 3296398 3359871 3413023 3448087 3460120 3452394 3431948 3402841 3367057
56115 3367057 3327115 3281966 3223387 3141790 3033687 2900412 2744219 2570771 2391451 2217279
56105 2217279 2052887 1900289 1764132 1647867 1548810 1462794 1390231 1332270 1285043 1243745
56095 1243745 1208815 1182147 1160919 1141330 1124806 1114085 1106643 1098462 1090922 1087441 1086584 1085109 1084510
56082 1084510 1087777 1092852 1096128 1099323 1106102 1115008 1122600 1130330 1141343 1153708 1163946 1173975 1187353
56069 1187353 1202007 1214192 1226200 1242418 1261084 1277844 1294118 1313751 1334707 1352557 1369033
56058 1369033 1388436 1408621 1424443 1437265 1452009 1467516 1479102 1488145 1499800 1513519 1525087
56047 1525087 1535752 1550073 1566940 1582057 1597037 1616703 1639755 1661516 1683302 1709497 1738138
56036A738138K6243K6003L1041L3727L0262K8501L3170L7208L6322L7734M5339
56025B103688N0648M8210M5670M8649N0384M6456M4802N0345N4880N3132N3434
56014B650298O1209O7732O7034O7617P5322Q1230P9359P9189Q7330R4228R2888
56003C503436R2928J01586J09211J08700J10436J22196J33513J36336J41226J56049
55993D715617J69365J72903J79071J97243K14973K22452K32519K55442K78039
55984F637624K89989L05773L36924L68592L88656M12758M54032M96841N28747
55975A0219936N68139O29865O95727P51568Q19147R16076J021206J118527J235660
55966A7975851J396470J578685J766137J996747K306292K675831L094862L621604
$$ plain form
56036 1738138 1764381 1790384 1821425 1855152 1885414 1913915 1947085 1984293 2020615 2058349 2103688
56025 2103688 2154336 2202546 2248216 2296865 2347249 2393705 2438507 2488852 2543732 2596864 2650298
56014 2650298 2711507 2779239 2846273 2913890 2989212 3070442 3149801 3228990 3316320 3410548 3503436
56003 3503436 3596364 3697950 3807161 3915861 4026297 4148493 4282006 4418342 4559568 4715617
55993 4715617 4884982 5057885 5236956 5434199 5649172 5871624 6104143 6359585 6637624
55984 6637624 6927613 7233386 7570310 7938902 8327558 8740316 9194348 9691189 10219936
55975 10219936 10788075 11417940 12113667 12865235 13684382 14600458 15621664 16740191 17975851
55966 17975851 19372321 20951006 22717143 24713890 27020182 29696013 32790875 36412479
55958C6412479M315028N172890O217090P567935R341668J1565975J4322010J7870416
55950A12785491K2474663K8195370L4991470M2672889N0099874N4365742N1630717
55943C97216216L9754076K0417974j515572k0856380l4523129m1955338m4152933
55936C14384914m2681117l9091032l4577745k9857765k5317104k1207314j7668448
55929A03984389j4691729j2198382j0142533q489780p157147o051518n134795
55922D0118505m395060l789044l266516k819311k455578k152621j879524j639778
55914A7721073j448748j292397j147203j018122r19440q38830p55805o76536o16972
55905I007020n69404n17367m66781m31706m04861l71184l36084l12776k95394
$$ plain form
55958 36412479 40727507 45900397 52117487 59685422 69027090 80593065 94915075 112785491
55950 112785491 135260154 163455524 198446994 241119883 291219757 345585499 397216216
55943 397216216 436970292 457388266 455872694 435016314 400493185 358537847 314384914
55936 314384914 271703797 232612765 198035020 168177255 142860151 121652837 103984389
55929 103984389 89292660 77094278 66951745 58461965 51304818 45253300 40118505
55922 40118505 35723445 31934401 28667885 25848574 23392996 21240375 19360851 17721073
55914 17721073 16272325 14979928 13832725 12814603 11895163 11056333 10300528 9623992 9007020
55905 9007020 8437616 7920249 7453468 7021762 6616901 6245717 5909633 5596857 5301463
55896E301463k71023k45136k29813k19292k01589j82304j73189j68634j56434
55887C454049j41046j33845j30618j20445j07187j01113r8317q8832p6403p0522
55877B385721o7187n6862m3641l8023l8327l7087l7961m8148o1408o6400o5352
55866A825325o7385p0230o5667n6807n2764n1704m5656l7024l4228l5711l3705
55855A274444k9375k9220l1043k8135k3110k3199k6079k4366k0007k0294k3709
55844I95907k3426k0995k2766k6492k5102k0415j9757k2093k0696j6541j6012
55833G61612j7916j5759j0600r097j0756r422n509m816o877o194l507m468q506
55820F48185r989r017j0336j3088j2281q987q571j0219q569m313k839l681j567
$$ plain form
55896 5301463 5030440 4785304 4555491 4336199 4134610 3952306 3779117 3610483 3454049
55887 3454049 3313003 3179158 3048540 2928095 2820908 2719795 2621478 2532646 2456243 2385721
55877 2385721 2318534 2261672 2218031 2180008 2141681 2104594 2066633 2018485 1957077 1890677 1825325
55866 1825325 1757940 1687710 1622043 1565236 1512472 1460768 1415112 1378088 1343860 1308149 1274444
55855 1274444 1245069 1215849 1184806 1156671 1133561 1110362 1084283 1059917 1039910 1019616 995907
55844 995907 972481 951486 928720 902228 877126 856711 836954 814861 794165 777624 761612
55833 761612 743696 727937 717337 708240 697484 688062 682553 677737 670860 664666 661159 656691 648185
55820 648185 638196 629179 618843 605755 593474 584487 575916 565697 557128 552815 549976 546295 544728
55807E44728L145N142M303N345Q350R253Q695J0855J4429J4218J0689Q653P632
55794F55437L042m061q095r004j1706j6143j7432j5507j5154j6515j4825r717
55782E20320n907m560k709j130l839r534j2260j0959r975j0003p244j891J434
55769D41743K422N644J1389J4199J1825P769L895j743q545j2496j3019j3663j5075
55756D34345j4269j1539j0739j1960j1202q131o816p927p689n515n165p113p346
55743C18934n120m457o221o188l019q86j868k564q17O44q6p35K55R59L00n5R4
55726B89170j429m308n306m032l810n520o103m513l497m009l497j309k01q73m95
55711B40268J790L283L191M115O527P337N648M478M906M035O72k313l347m556
$$ plain form
55807 544728 547873 553015 557318 562663 571013 580266 588961 599816 614245 628463 639152 647805 655437
55794 655437 658479 654418 646323 637319 625613 609470 592038 576531 561377 544862 530037 520320
55782 520320 514413 509853 507144 506014 502175 492641 480381 469422 459447 449444 442200 440309 441743
55769 441743 444165 449809 461198 475397 487222 494991 498886 497143 488598 476102 463083 449420 434345
55756 434345 420076 408537 397798 385838 374636 366505 359689 351762 344073 338558 333393 326280 318934
55743 318934 313814 309357 303136 296948 293929 293043 291175 288611 287794 288438 288352 287617 287872 288831 289131 289076 289170
55726 289170 287741 283433 278127 274095 270285 264765 258662 254149 250652 246643 243146 241837 241636 240763 240268
55711 240268 242058 245341 248532 252647 259174 266511 272159 276637 281543 285578 286250 283937 280590 276034
55697B76034o810p582n963m755n372n424l576k028k087j882m74L06RR01L308M377
55681B38982L321L188N331O938O151M975M901M275K316J208J800J561p35k550
55667B81662k131j346j664j481J46J127K00o02L22J539J782K104K925K682J332
55652B88597J325L206M134K709J154Q12l71l508o193o733p079q911j0456r858
55638B48828q289p268o160m605m117n086n391m065l002l222k974j434n28j133
55624A91554j206J52O71q27j977j151l32j161j887r71j61j125k354k244k000k782
55608A72199l164k129j447k369l049j949o69p90r82J5O19n40j766j326n47j056
55592A51050j735j168m50q24j159m01J26o30j131j23Q94O24N43J869K870K024
$$ plain form
55697 276034 269224 261642 255679 250924 245552 240128 236552 234524 232437 230555 230081 230387 230396 231297 234605 238982
55681 238982 242303 245491 250822 257760 263911 268886 273787 278062 280378 281586 283386 284947 284212 281662
55667 281662 279531 278185 276521 275040 275186 276313 276513 275911 276233 277772 279554 281658 284583 287265 288597
55652 288597 289922 293128 297262 299971 301125 301937 301566 298058 291865 285132 278053 269142 258686 248828
55638 248828 240539 233271 227111 222506 218389 213303 207912 203847 200845 197623 194649 193215 192687 191554
55624 191554 190348 190500 191171 190344 188367 187216 186884 185723 183836 182865 182704 181579 179225 176981 174981 172199
55608 172199 169035 166906 165459 163090 160041 158092 157423 156633 155651 155666 156285 155745 153979 152653 152106 151050
55592 151050 149315 148147 147697 146873 145714 145313 145439 144809 143678 143555 144449 145073 145616 147485 150355 152379
55576A52379J030J755K820K271J169J530K937M045N215O941P973P590P354Q007
55562B13016P314L755l13k185k840m351n813n394m156m240n041m660l513l227
55548A78352l400k586j244p83r02n11j0j93l32L63R68P36R50K549L816K984J189
55531A81946L42M5q28j516j158j159k845m571m245k982l207m616n149m588m196
55516A41273l957l106k272k402k600j637m66o90j752k046j604j348j026l06l28
55501A15733j762k849j988n95o55j116L52L361N558O167N937M797K518O08N96
55486A36662J343Q34l76k72J003J535R01L01Q2l33o74l34k9o99j584j549j259
55469A35552j857k610k200j249j199j770j887j923k625l001j833j23M20J82M72
$$ plain form
55576 152379 153409 155164 157984 160255 161424 162954 165891 169936 175151 182092 190065 197655 205009 213016
55562 213016 220330 224085 223772 221587 218747 214396 208583 203189 199033 194793 189752 185092 181579 178352
55548 178352 174952 172366 171122 170339 169437 168926 168916 168723 168391 168754 169722 170458 171408 173957 177773 180757 181946
55531 181946 182288 182333 181505 179989 178831 177672 174827 170256 166011 163029 159822 155206 150057 145469 141273
55516 141273 137316 134210 131938 129536 126936 125299 124833 124143 122391 120345 118741 117393 116367 116061 115733
55501 115733 113971 111122 109134 108539 107884 106768 107120 110481 116039 122206 128143 132940 135458 136066 136662
55486 136662 138005 138839 138463 138191 139194 140729 141630 141931 142013 141680 141006 140672 140643 139944 138360 136811 135552
55469 135552 133695 131085 128885 127636 126437 124667 122780 120857 118232 115231 113398 113275 113695 113877 114349
55454A14349R09N70L25J234J999R65o32n02P63Q63j57l65L01J60p64p34M53J197
55436A20934R63O97N93K2o75p24p23j452j772l32J535J615N60O04J345M52j832
55419A21810k683j306M9J17K70J376K157J702R63P50N00j17l90j17p8m88o46l89
55401A23480k93l69j58j8n24j024n42L12K75k77j76J39n59j606j203M33J343J022
55383A20255P37Q34L90l66p9J130J636J119R59J537J568N13p13j657k800l836
55367A21227l709k651j985j786r31M39Q67J99j17L72N20p4m44k65k83m05L65J675
55349A13014J820N24m81j66N43P15O26M70j54r90j101n36l19o15n95k06j89l67
55331A11993J36J052J320J158J616K247J608J3o92j84P7l04j51O66Q31J55p2K29
$$ plain form
55454 114349 115258 115828 116153 117387 119386 120351 119719 119217 119980 120843 120686 120321 120622 120782 120018 119284 119737 120934
55436 120934 121897 122594 123187 123209 122534 121810 121087 119635 117863 117531 119066 120681 121241 121845 123190 123642 121810
55419 121810 119127 117821 117870 117987 118257 119633 121790 123492 124455 125205 125705 125588 125198 125081 125003 124515 123869 123480
55401 123480 123187 122818 122660 122642 122118 121094 120552 120864 121139 120862 120686 120825 120266 118660 117457 117890 119233 120255
55383 120255 120992 121826 122216 121850 121771 122901 124537 125656 126615 128152 129720 130233 129520 127863 125063 121227
55367 121227 117518 114867 112882 111096 110165 110604 111471 111670 111553 111925 112445 112371 111927 111662 111379 110974 111339 113014
55349 113014 114834 115358 114877 114711 115254 115969 116595 117065 116911 115921 114820 114284 113965 113350 112755 112549 112360 111993
55331 111993 112129 113181 114501 115659 117275 119522 121130 121143 120451 120267 120344 120040 119889 120555 121386 121541 121469 121698
55313A21698m02j985k555j407k28p4J79J282K011J365K00n43j216j942j742l52
55297A14289Q74R05K71l74j106j523o63J138K163J845J370J321Q74plJ049J461
55280A23884N34j98K50O52k6p62n29j72o53j239j014n39n42n32m7J80l42p23k30
55261A17952M44N70N53O96L46o35j107n12Q5m5LQ88J569J119M35O62J228J011
55243A25262K48j28o1L1K06M31J21p45j139n46Q9p9n13m94l39m61m40n4oo39j078
55222A19666o63r9j25k54K21R52J278J225J037O61L28N64J111J029K78j54q2m65
55204A26508j442j857j335r37j014m62R17J480L48r61r63l75l70m70J55R18R48
55187A21088O49O40M86n7n7Q81J424O00l78q6P64P82L39O36J324J157J37p14j093
$$ plain form
55313 121698 121296 119311 116756 115349 115121 115047 115226 116508 118519 119884 120084 119541 118325 116383 114641 114289
55297 114289 115163 116068 116339 115965 114859 113336 112673 113811 115974 117819 119189 120510 121384 121377 121374 122423 123884
55280 123884 124418 124220 124470 125122 125096 124334 123805 123633 122980 121741 120727 120188 119646 119114 119067 119247 118905 118182 117952
55261 117952 118396 118966 119519 120215 120561 119926 118819 118307 118392 118347 118350 119238 120807 121926 122361 123023 124251 125262
55243 125262 125510 125382 125321 125352 125558 125989 126110 125365 124226 123680 123769 123690 123177 122683 122344 121883 121443 121389 121383 120744 119666
55222 119666 119003 118904 118779 118525 118746 119698 120976 122201 123238 123899 124227 124791 125902 126931 127209 127055 126973 126508
55204 126508 125066 123209 121874 120937 119923 119461 120378 121858 122206 121245 120282 119907 119537 119067 119222 120140 121088
55187 121088 121737 122377 122863 122806 122749 123630 125054 125654 125276 125190 125954 126736 127075 127711 129035 130192 130329 129615 128522
55168A28522j315j173m19K54J10l42j90M82J130J778K375K175R66n8L7M65J71
55151A34968m33n23m97j011j537j421j323j911k257j300J05M87J81M31R09L64
55135A25232p76p45O52J575Q27o82j519j348n76L43R39Q96M40k2m70r55j060m31
55117A22320N30J150J287J075M89j62j18P59J475J316R02R77J115O24n1o0M59
55100A34087Q09R29J059R31L42r5J57N23K36l80n18j69J51L35M18J29l53j02J147
55081A39636K144J792P35J32r4n24p64k01N25L81l57p37q38j299j772j417n99
55064A36743m68j011j067k09O86Q64N40K24P7Q5R4k29r30j449j270n60J71N92
55046A32883M30l83j091o06R33K109K195J939J841J201k55j340j212p77j027j348
$$ plain form
55168 128522 127207 126034 125615 125869 125979 125637 125447 125929 127059 128837 131212 133387 134353 134295 134332 134797 134968
55151 134968 134535 134012 133515 132504 130967 129546 128223 126312 124055 122755 122860 123347 123528 123959 124868 125232
55135 125232 124456 123711 124363 125938 126765 126083 124564 123216 122640 122983 123922 124818 125258 125236 124766 123811 122751 122320
55117 122320 122850 124000 125287 126362 126851 126689 126571 127330 128805 130121 131023 132000 133115 133739 133688 133628 134087
55100 134087 134896 135825 136884 137815 138157 138062 138219 138742 138978 138598 138080 137911 138062 138397 138815 138944 138591 138489 139636
55081 139636 141780 143572 144307 144439 144345 143821 143057 142856 143381 143762 143405 142668 141830 140531 138759 137342 136743
55064 136743 136275 135264 134197 133988 134674 135538 136078 136302 136379 136464 136558 136329 135399 133950 132680 132120 132291 132883
55046 132883 133313 132930 131839 131233 132166 134275 136470 138409 140250 141451 141196 139856 138644 137867 136840 135492
55030A35492q93k28j22l4O40J058M23l06m3L78k81j221q96K02L69m08o67r2L31
55011A33702M35J012J912K067J414R02P09J99m82n62k73n73j282j219j92P61J158
54994A39688J443J614J121J50m20l72j95J06P89J269P47k87p18o44q85j112l07
54977A41987J108J647J213J180J858J941Q28l66o39k79K02P16Q20r2j381j451
54961A49292l6J347J651J504J589J413N03m50n96j22K88M33M86N81Q89J450J709
54944A61931J023k75j147j202r68p70l48K78N72K79k12m30q0R81K348L000K550
54927A67530K099K827M223M983N114N760P239Q786R987J0922J1083R797P623N773
54913B63746M098J386k352n475o955p455p867q220q315q123p334n772m322m130
$$ plain form
55030 135492 134599 134371 134249 134215 134855 135913 136336 136030 135987 136365 136084 134863 133967 134169 134538 134130 133463 133371 133702
55011 133702 134137 135149 137061 139128 140542 141444 142153 142352 141870 141308 141035 140462 139180 137961 137769 138530 139688
54994 139688 141131 142745 143866 144016 143596 143224 143029 143135 143924 145193 145940 145653 144935 144291 143406 142294 141987
54977 141987 143095 144742 145955 147135 148993 150934 151762 151396 150757 150478 150680 151396 152216 152124 150743 149292
54961 149292 149256 150603 152254 153758 155347 156760 157263 156813 156217 156095 156383 156816 157302 157883 158772 160222 161931
54944 161931 162954 162679 161532 160330 159362 158592 158244 158522 159094 159373 159161 158731 158651 159632 161980 164980 167530
54927 167530 169629 172456 176679 181662 186776 192536 199775 208561 218548 229470 240553 250350 257973 263746
54913 263746 267844 269230 266878 261403 254448 246993 239126 230906 222591 214468 207134 201362 197040 192910
54899A92910m796m883m156l601l293k149k27P39j12j380j439l80Q52J940K864
54884A72889L268L133L196L979N146O203P096P774Q095Q370R035R616R063P249
54870B64112N004K562o17m307p254q786r440r638r141q122p315o699n439l668
54856A91252k793l412m330m385l858l369k726j814j333j695k155j952j446j291
54842A54693j337j159q89q62j017j195j317j029J0J214J437N97j35p0J45j41n58
54825A48387o11n29n93o14n38p51j245j421j059o44l53J76Q60J078Q61J021J688
54808A45713K031J795J756K113J914P69k29j75K94K33j47j85M8J86L64O97P61
54791A57938L80J35M62R37J097J183J474J687J578J369J156O96J59J60O42P80
$$ plain form
54899 192910 188114 183231 179075 175474 172181 170032 169805 170544 170432 169052 167613 167233 168085 170025 172889
54884 172889 176157 179290 182486 186465 191611 197814 204910 212684 220779 229149 238184 247800 256863 264112
54870 264112 269116 271678 271061 266754 259500 250714 241274 231636 222495 214373 207058 200359 194920 191252
54856 191252 188459 185047 180717 176332 172474 169105 166379 164565 163232 161537 159382 157430 155984 154693
54842 154693 153356 152197 151308 150446 149429 148234 146917 145888 145898 147112 148549 149146 149011 148941 149086 148945 148387
54825 148387 147776 147247 146654 146040 145502 144751 143506 142085 141026 140382 140029 140205 141065 142143 143004 144025 145713
54808 145713 147744 149539 151295 153408 155322 156091 155862 155687 155981 156214 156067 155882 155930 156116 156480 157177 157938
54791 157938 158318 158453 158915 159852 160949 162132 163606 165293 166871 168240 169396 170092 170251 170411 171053 171833
54775A71833M06M34J318K321K863L473M615N754O435P268Q908J0821J1930J1825
54761B50204J0689Q690O067L256M68k360m991p027q618j0098j0914j0120q113
54748B17133o517o044n822n099m192l320k075o86k61j038j779j582r67n43k8O62
54732A77842R36Q21J212K083K117J113Q99K690N191O698P489Q623R813J0173R918
54717B47618R603Q663O212K594j220m909q273j0389j0643r814q969q120p072o424
54703A98857o496o292m961l293k378j795o76M14L32o08j127r35p41p65o73n51
54687A68312o44n66J4M55L9p57j083j116j443j778j543j167j313j485p47O06J469
54670A57253J528J223O00m23j142q11k1J0p44j254j062o15k15K14N08M50L62N74
$$ plain form
54775 171833 172239 172673 173991 176312 179175 182648 187263 193017 199452 206720 215628 226449 238379 250204
54761 250204 260893 269583 275650 278906 279374 277014 272023 264996 256378 246280 235366 225246 217133
54748 217133 210616 204572 198750 193651 189459 186139 184064 183378 183117 182079 180300 178718 177751 177208 177180 177842
54732 177842 178778 179599 180811 182894 185011 186124 187023 189713 194904 201602 209091 217714 227527 237700 247618
54717 247618 257221 265884 272096 274690 273470 268561 260288 249899 239256 229442 220473 212353 205281 198857
54703 198857 192361 186069 181108 177815 175437 173642 172966 173380 173712 173104 171977 171042 170301 169536 168863 168312
54687 168312 167668 167102 167116 167571 167610 166853 165770 164654 163211 161433 159890 158723 157410 155925 155178 155784 157253
54670 157253 158781 160004 160604 160181 159039 158228 158207 158217 157473 156219 155157 154542 154327 154541 155049 155499 155861 156435
54652A56435O38M1p57q74k47N44J154J400R38o1o48m08k26p63j161m75N93Q19
54634A56942M32L94M97k3o74l18P66J194O77K09J94Ln56q73p75p83r45o83O4O63
54614A56405Q75J079J351J326J013Q00O94L21k54n45l73M2M95P72N13k35q75j100
54596A62304j301j499r16O16J799J535M84j11j43o7L30J148J391L59r04j068n78
54579A63379n96r12o59k32m63p04J01J148Q12m63p00M23J227Q64J96k29q50j472
54561A60870j087K61J260J337J122P91j34j133q70N57J444J052M72M44L51o3J48
54544A66822J263K013J538P42O81J020J054J008J259J377Q68P1m28n52m14rL52
54527A78665K10k50m43m98j053j836j841j040n93r65j265q32j92R3K58M63L13
$$ plain form
54652 156435 157073 157114 156357 155483 155236 155780 156934 158334 159272 159211 158563 158155 157929 157166 156005 155530 156123 156942
54634 156942 157374 157768 158265 158242 157568 157250 158016 159210 159887 160096 160290 160293 159737 158864 158089 157306 156361 155678 155742 156405
54614 156405 157280 158359 159710 161036 162049 162849 163543 163864 163610 163065 162692 162734 163229 164001 164514 164279 163404 162304
54596 162304 161003 159504 158588 159204 161003 162538 163022 162911 162768 162701 163031 164179 165570 165929 165025 163957 163379
54579 163379 162783 161871 161212 160980 160517 159813 159914 161062 161874 161411 160711 161134 162361 163225 163421 163192 162342 160870
54561 160870 159783 160044 161304 162641 163763 164554 164420 163287 162417 162974 164418 165470 165942 166386 166737 166674 166822
54544 166822 168085 170098 171636 172378 173059 174079 175133 176141 177400 178777 179645 179716 179288 178736 178322 178313 178665
54527 178665 178875 178625 178182 177684 176631 174795 172954 171914 171321 170356 169091 168259 168067 168160 168418 168881 169194
54510A69194k37n96n29l92j52N82J321R50m26j369j246r92j172r71J20J143J165
54493A66393P32P72J160J263J018O25P6l90k44L60N36N9k09J77N17L03R2L42N50
54474A74132L24K16O82J179J117Q14Q31J194J852K864L656L181J526K08J74O09
54458A94559M08k57p23j016j337j334q66n35o40n13K19P07J61p83j011m84J00
54441A86655M53N63J42q56j673j634j067o80n44l91k77k93j35L74Q33Q61N73J26
54423A83030n05r33n11N42J097P46M16P43J012N01j30J64J199J914J725Q25l01
54406A91534j010q26j28J59p1m2M27N18L0n5O65J110N78O9N66J343J328R60J198
54387A98353J662J365N05Nj41n95j223j377j165j136j093m62M47P99N69L82L56
$$ plain form
54510 169194 168957 168361 167832 167440 167288 167870 169191 170141 169715 168346 167100 166108 164936 163965 164085 165228 166393
54493 166393 167125 167897 169057 170320 171338 171963 172039 171649 171405 171765 172301 172360 172151 172328 172845 173148 173240 173582 174132
54474 174132 174456 174672 175354 176533 177650 178464 179295 180489 182341 185205 188861 192042 193568 193776 193950 194559
54458 194559 194967 194710 193987 192971 191634 190300 189434 188899 188259 187746 187965 188672 188833 188050 187039 186555 186655
54441 186655 187108 187671 187813 186957 185284 183650 182583 181903 181359 180968 180691 180398 180263 180637 181470 182331 182904 183030
54423 183030 182525 181592 181081 181623 182720 183466 183882 184625 185637 186138 186008 186172 187371 189285 191010 191835 191534
54406 191534 190524 189698 189570 189729 189658 189616 190043 190561 190591 190536 191201 192311 192889 192958 193524 194867 196195 197155 198353
54387 198353 200015 201380 201885 201890 201749 201154 199931 198554 197389 196253 195160 194698 195145 195944 196513 196895 197251
54370A97251K36L03J010J994K539K733L111L506L348K837K623K620K198J365O12
54355B28286j10j148k077k118j531j386j938k366k214k006k205k510k482k072
54341B02123j371m76J55k2r04j758k112k119k030j803j314n68K87R02R18N13L88
54324A90809Q16J125O57k34p50p86p63p44m63l8J22J0L0L71R29J505J743J192
54306A95531J0q44p08j03J29Nj0p3o29j325j287m44L68N59L48J22m2j65k70n17
54286A90655r31j084m95O69J759K387K593K487K101J498O96k90j095j131l89L69
54270A99799N73N32P14R94J082J104J079N06p47j738j525n05K30M55P86J371J653
54253B06363J404J132J280J685J900J672J085N11K58Q6n02j301j389n03L50K50
$$ plain form
54370 197251 197487 197790 198800 200794 203333 206066 209177 212683 216031 218868 221491 224111 226309 227674 228286
54355 228286 228176 227028 224951 222833 221302 219916 217978 215612 213398 211392 209187 206677 204195 202123
54341 202123 200752 200276 200431 200409 199505 197747 195635 193516 191486 189683 188369 187801 188088 188990 189908 190421 190809
54324 190809 191625 192750 193407 193173 192423 191637 190874 190130 189667 189629 189751 189761 189791 190162 191091 192596 194339 195531
54306 195531 195541 194697 193989 193886 194015 194020 194010 193937 193308 191983 190696 190252 190620 191179 191527 191649 191607 191442 191172 190655
54286 190655 189724 188640 188145 188814 190573 192960 195553 198040 200141 201639 202335 202045 200950 199819 199430 199799
54270 199799 200372 200904 201618 202612 203694 204798 205877 206383 205636 203898 202373 201868 202098 202553 203339 204710 206363
54253 206363 207767 208899 210179 211864 213764 215436 216521 217032 217290 217376 216874 215573 214184 213681 214031 214281
54237B14281l35m41j38k07p52j193j314j413j458j038j13Q12J239J047M36j21
54221B09292j89M0l9m04k52O22J176N84m82q87o43n49p89r66r73r02n07L18R44
54202B05394P64J40k45m73q87j163q60m00m13n91k72L08M49K34K28L51J77l4K50
54183B02957P53Q75Q56J244J641J267M44J36L29K09k19j69L33L94j60m79j24M06
54165B10693O32M96k27j706l121l208j882l62M19N08J42n54j092r81o11p04r74
54148A97468n54L57O61J83j13Q7q6j011j761j443l17Q97J830K252K058J724J803
54131B04035J887J091l22j058o66k9K50N34R13O59m17j300j128j76R80K201L190
54114B10644L297K531J785J538J311Q69P83J279J692J754K287L815N508O410O739
$$ plain form
54237 214281 213946 213505 213367 213160 212408 211215 209901 208488 207030 205992 205879 206691 207930 208977 209413 209292
54221 209292 209103 209143 209104 208700 208448 209070 210246 210830 210348 209461 208818 208269 207480 206514 205541 204639 204132 204450 205394
54202 205394 206158 206298 206053 205580 204693 203530 202670 202270 201857 201266 200994 201302 201751 201985 202213 202564 202741 202707 202957
54183 202957 203710 204585 205441 206685 208326 209593 210037 210173 210502 210711 210492 210323 210656 211050 210890 210411 210287 210693
54165 210693 211325 211821 211594 209888 206767 203559 201677 201315 201734 202242 202384 201830 200738 199757 199146 198442 197468
54148 197468 196914 197271 197932 198115 198002 198089 198003 196992 195231 193788 193471 194368 196198 198450 200508 202232 204035
54131 204035 205922 207013 206691 205633 204967 204938 205188 205722 206635 207294 206877 205577 204449 204273 205253 207454 210644
54114 210644 213941 216472 218257 219795 221106 221975 222758 224037 225729 227483 229770 233585 239093 245503 252242
54099B52242P042O898N486K919J25k213l931n033n641n921n695m566k716r73J81
54084B38204J009J664J775J341J107J547K117K051J302K76o97j244j037l21K65
54069B49359O20J143J591J050n15j808j887j306r55q17o17p01j304j758j408p21
54053B39966n71r19j061o96q4M80P97Q22J013J996L424M055L501L086M055N824
54037B65688O943P143P251P601P717P377O990O876O978P249P652P817P284O143
54023C66709M954M084L449K864K292J855J719J798J603P21n14j404j926k769m182
54008C81253n555o348o677o632n993m969m428m762n299n355n099m831m321l509
53994C07475l031l254l573l401l136l241l247k641j972j937k060j517p03n99r90
$$ plain form
54099 252242 259284 266182 271668 274587 274712 272499 268568 263535 257894 251973 246278 241712 238996 238023 238204
54084 238204 239213 240877 242652 243993 245100 246647 248764 250815 252117 252393 251696 250452 249415 249094 249359
54069 249359 249979 251122 252713 253763 253248 251440 249553 248247 247292 246475 245858 245157 243853 242095 240687 239966
54053 239966 239395 238476 237415 236719 236635 237115 237912 238734 239747 241743 245167 249222 252723 255809 259864 265688
54037 265688 272631 279774 287025 294626 302343 309720 316710 323586 330564 337813 345465 353282 360566 366709
54023 366709 371663 375747 379196 382060 384352 386207 387926 389724 391327 392048 391534 390130 388204 385435 381253
54008 381253 375698 369350 362673 356041 350048 345079 340651 335889 330590 325235 320136 315305 310984 307475
53994 307475 304444 301190 297617 294216 291080 287839 284592 281951 279979 278042 275982 274465 273762 273163 272173
53979B72173p80rN0j039k035j814q32j73kK51P05R06P25P25J493K863M084M637
53961B81928M774N123N991P284R051J1476J4183J5925J5356J2070O828J071l753
53948C87307o875q502r210r050p701n444l206j470J48J906L296L813L723L474
53934C52209K951J978J039Q02J195J475J119K96l07R5J668L529M506M575M866
53919C81996N947P003P245P215P835Q915R535R478R325R437R707J0074J0445J0293
53905E04450R114P210N346L770K232Q00j38o65j383k472l348l515l348l689m848
53890E09516o230p024p158p366q215r315r886r792r495r144q593q185q505r133
53876C91475q745o959n078m349m426m313l951l886m119m320m663n432o108n877
$$ plain form
53979 272173 271393 271384 271434 270395 268360 266546 265714 265541 265539 265790 266495 267401 268126 268851 270344 273207 277291 281928
53961 281928 286702 291825 297816 305100 314151 325627 339810 355735 371091 383161 389989 391060 387307
53948 387307 380432 371930 362720 353670 345969 340525 337319 335849 335997 337903 341199 345012 348735 352209
53934 352209 355160 357138 358177 358979 360174 361649 362768 363064 362757 362852 364520 368049 372555 377130 381996
53919 381996 387943 394946 402191 409406 417241 426156 435691 445169 454494 463931 473638 483712 494157 504450
53905 504450 513564 520774 526120 529890 532122 532922 532784 532119 530736 528264 524916 521401 518053 514364 509516
53890 509516 503286 496262 489104 481738 473523 464208 454322 444530 435035 425891 417298 409113 400608 391475
53876 391475 382730 375771 370693 366344 361918 357605 353654 349768 345649 341329 336666 331234 325126 319249
53862C19249m840l833l231k752k275k016j991k017k239k952l885m311l940l136
53848B75831k328j603r13k92K27O17P86O82L83n0n54q88q42o62q32j241j193m39
53830B66689L95O86N37L54K62L41O93J018Q10K96L43J069J477R82K97J71L00K47
53812B76967M13J115J700J606J514K214L217L635L788M540N614O014N715N635
53798C23687O074O514O741P033P285P053O395N750N178M570M297M610M821M136
53784D04144K999K387K162J382jj172k040l326n035o215o507o591o819o632n777
53769C62959m948m757m949n103n246n439n428n092m578l960l286k996l436m026
53755B99715l780k710j779j481j443j462j764k106j792r32n94j259k108k340k175
$$ plain form
53862 319249 314409 310576 307345 304593 302318 300302 298311 296294 294055 291103 287218 282907 278967 275831
53848 275831 273503 271900 270987 270695 270922 271539 272325 273007 273390 273340 272786 271898 271056 270394 269562 268321 267128 266689
53830 266689 267084 267770 268307 268661 268923 269264 269957 270975 271785 272081 272424 273493 274970 275952 276249 276420 276720 276967
53812 276967 277380 278495 280195 281801 283315 285529 288746 292381 296169 300709 306323 312337 318052 323687
53798 323687 329761 336275 343016 350049 357334 364387 370782 376532 381710 386280 390577 395187 400008 404144
53784 404144 407143 409530 411692 413074 413073 411901 409861 406535 401500 395285 388778 382187 375368 368736 362959
53769 362959 358011 353254 348305 343202 337956 332517 327089 321997 317419 313459 310173 307177 303741 299715
53755 299715 295935 293225 291446 289965 288522 287060 285296 283190 281398 280466 279872 278613 276505 274165 271990
53740B71990k046j716q84P8O86J048J404J603J529J572J991K313J958J142O17
53725B83285O77R09Q65O32O94J281J939J919J108L44M25J121J620J648J581J717
53709C01765K048K620L387L882L648K970K486K279K033J896K336L185L781L992
53695C42308M344M971N313M964M101L028J935J104O46J30p90j536j367q03j111
53680C67237k324l025k382j214o03n34n54p64j366j914j796j062k74K16M21M81
53664C50543N44O39O20M81O03J183J706J515P80J20l92r81j268p16J80M25J77
53647C56159N38J520J766P47j95J84J331J991J988J934J980J846J596J515J561
53632C76461J485J130L96o01j043M1K363M303M760M341M196M540M941N330N832
$$ plain form
53740 271990 269944 268228 267344 267422 268108 269156 270560 272163 273692 275264 277255 279568 281526 282668 283285
53725 283285 283962 284871 285736 286368 287062 288343 290282 292201 293309 293653 294078 295199 296819 298467 300048 301765
53709 301765 303813 306433 309820 313702 317350 320320 322806 325085 327118 329014 331350 334535 338316 342308
53695 342308 346652 351623 356936 361900 366001 369029 370964 372068 372714 372844 372054 370518 369151 368348 367237
53680 367237 364913 361888 359506 358292 357689 357155 356601 355837 354471 352557 350761 349699 349425 349641 350062 350543
53664 350543 351087 351726 352346 352827 353430 354613 356319 357834 358614 358734 358342 357361 356093 355377 355557 355982 356159
53647 356159 356697 358217 359983 360730 360535 360719 362050 364041 366029 367963 369943 371789 373385 374900 376461
53632 376461 377946 379076 379472 378871 377828 377869 380232 384535 389295 393636 397832 402372 407313 412643 418475
53617D18475O141N826N048M355M061M162M453M484L822K726J949J776J792J825
53603D70895K238L024L504L382L174L125K664J522M63J17k0n77j088p96n1J12
53587D91688n80j549k335k837k905k477j986j899k059k060k019k321k829k970
53573D60862k515j805j267j160j494j909j827j096k83k9l86r28j201q98p8O11
53557D44597M99j37k25O87J833K329K130J620R72M63O19J453K102J864J082N85
53541D62473P09J319K150K803K978L097L899N107N512M896M739O162Q239R373
53527E23456R511R702J0209J0451J0439J0863J1854J2794J3426J4119J4978J5562
53515F67364J5699J5897J6724J8227K0126K2093K3843K5192K6068K6453K6532
$$ plain form
53617 418475 424616 430442 435490 439845 443906 448068 452521 457005 460827 463553 465502 467278 469070 470895
53603 470895 473133 476157 479661 483043 486217 489342 492006 493528 493991 494108 494088 493511 492423 491627 491576 491688
53587 491688 491108 489559 487224 484387 481482 479005 477019 475120 473061 471001 468982 466661 463832 460862
53573 460862 458347 456542 455275 454115 452621 450712 448885 447789 447506 447477 447091 446163 444962 444064 443986 444597
53557 444597 445096 444959 444734 445421 447254 449583 451713 453333 454305 454768 455387 456840 458942 460806 461888 462473
53541 462473 463182 464501 466651 469454 472432 475529 479428 484535 490047 494943 499682 505844 514083 523456
53527 523456 532967 542669 552878 563329 573768 584631 596485 609279 622705 636824 651802 667364
53515 667364 683063 698960 715684 733911 754037 776130 799973 825165 851233 877686 904218
53504I04218K6839K7714K8473K7863K5796K3742K2921K2787K2027K0399J8774
53493A171553J7870J7748J8157J8627J8620J8148J7926J8326J8807J8877J8922
53482A373581J9352J9635J9191J8514J8420J8611J8075J6553J4606J2571J0420
53471A559529Q377O662M878K524j22k538n042q245j1693j4162j5309j5922j6559
53458A492378j6881j6549j5866j5350j5339j6134j7833j9927k1570k2332k2316
53447A292281k1728k0807j9918j9188j8289j7103j6100j5463j4451j2417r960
53436A106857q092o769n319l886l180l035k498j358k75O42K118M349O461P773
53422A093788Q697R941J1602J3333J4861J6063J7059J8273J9937K1665K3055K4461
$$ plain form
53504 904218 931057 958771 987244 1015107 1040903 1064645 1087566 1110353 1132380 1152779 1171553
53493 1171553 1189423 1207171 1225328 1243955 1262575 1280723 1298649 1316975 1335782 1354659 1373581
53482 1373581 1392933 1412568 1431759 1450273 1468693 1487304 1505379 1521932 1536538 1549109 1559529
53471 1559529 1567906 1574568 1579446 1581970 1581848 1579310 1574268 1566023 1554330 1540168 1524859 1508937 1492378
53458 1492378 1475497 1458948 1443082 1427732 1412393 1396259 1378426 1358499 1336929 1314597 1292281
53447 1292281 1270553 1249746 1229828 1210640 1192351 1175248 1159148 1143685 1129234 1116817 1106857
53436 1106857 1098765 1091996 1086677 1082791 1079611 1076576 1074078 1072720 1072445 1073087 1075205 1079554 1086015 1093788
53422 1093788 1102485 1112426 1124028 1137361 1152222 1168285 1185344 1203617 1223554 1245219 1268274 1292735
53410A292735K6377K8397K9708L0433L1411L2774L3887L4666L5784L7460L9213
53399A652845M1024M3561M6863M9946N2155N3876N5495N6662N7174N7636N8503
53388B225740N9302N9425N9019N8395N7214N5046N2255M9610M7317M4960M2235
53377B810518L9183L5872L2218K8034K3132J7594J1976O932K464k156p604j3908
53365B984255k0635k7355l3854m0131m6136n1263n4456n5285n4692n4077n3904
53354B492467n3790n3526n3154n2264n0239m7338m4579m2510m0934l9815l9472
53343A974846l9709l9779l9480l9354l9527l9193l7659l5084l1899k8382k5097
53332A579683k2785k1341j9724j7428j5231j3983j3515j3329j3573j4496j5587
$$ plain form
53410 1292735 1319112 1347509 1377217 1407650 1439061 1471835 1505722 1540388 1576172 1613632 1652845
53399 1652845 1693869 1737430 1784293 1834239 1886394 1940270 1995765 2052427 2109601 2167237 2225740
53388 2225740 2285042 2344467 2403486 2461881 2519095 2574141 2626396 2676006 2723323 2768283 2810518
53377 2810518 2849701 2885573 2917791 2945825 2968957 2986551 2998527 3005459 3007923 3005767 2998163 2984255
53365 2984255 2963620 2936265 2902411 2862280 2816144 2764881 2710425 2655140 2600448 2546371 2492467
53354 2492467 2438677 2385151 2331997 2279733 2229494 2182156 2137577 2095067 2054133 2014318 1974846
53343 1974846 1935137 1895358 1855878 1816524 1776997 1737804 1700145 1665061 1633162 1604780 1579683
53332 1579683 1556898 1535557 1515833 1498405 1483174 1469191 1455676 1442347 1428774 1414278 1398691
53321A398691j6080j5944j5673j5469j5190j4837j4414j3591j2040r991q020o363
53309A241079m781l002j073O02J563J838K169L363N380P511R355J1141J3109J5186
53295A303440J7281J9372K1198K2583K3975K5999K8329K9849L0008K9264K8073
53284A579371K6399K4413K2679K1221J9285J6534J3591J0965Q255M997J491j706
53272A747495m524p104r473j1905j4799j7768j9762k0613k1512k3278k5192k6291
53260A545274k6931k7939k9113k9605k9275k8674k8156k7937k8415k9445k9816
53249A229968k8575k6439k4846k4093k3471k2859k2843k3421k3874k3881k3695
53238I61971k3159k1786j9885j8540j8210j8238j7976j7351j6177j4016j1168
$$ plain form
53321 1398691 1382611 1366667 1350994 1335525 1320335 1305498 1291084 1277493 1265453 1255462 1247442 1241079
53309 1241079 1236298 1233296 1232223 1232825 1234388 1236226 1238395 1241758 1247138 1254649 1264004 1275145 1288254 1303440
53295 1303440 1320721 1340093 1361291 1383874 1407849 1433848 1462177 1492026 1522034 1551298 1579371
53284 1579371 1605770 1630183 1652862 1674083 1693368 1709902 1723493 1734458 1742713 1747710 1749201 1747495
53272 1747495 1742971 1735867 1726394 1714489 1699690 1681922 1662160 1641547 1620035 1596757 1571565 1545274
53260 1545274 1518343 1490404 1461291 1431686 1402411 1373737 1345581 1317644 1289229 1259784 1229968
53249 1229968 1201393 1174954 1150108 1126015 1102544 1079685 1056842 1033421 1009547 985666 961971
53238 961971 938812 917026 897141 878601 860391 842153 824177 806826 790649 776633 765465
53227G65465q855p816p501p171o981p420q329r249j0204j1420j2616j3347j3801
53214F40755j4537j5502j6007j5693j4921j4066j2987j1545j0134r282q970q740
53202D88371q373p988p635p176o722o621o871o947o560o119o090o260o198o070
53188C92741o246o376n754m573l897m112m313l644k564k141k659l477l919l713
53174C35353k866j690q02o34r97j374j534j601j684j691j403o96J16K65o85k007
53158C16070k410j629p43o56r63q10j35N06Q38Q67M76l20j017j106p00j90K68
53141C08346M72q3j422k518k380j379p18p30o26J56J211J852J854J467J137J250
53125C07889J641J608R31N31J286K468K474J089j29Q9J259K255K831L312L560
$$ plain form
53227 765465 756610 748794 741293 734122 727141 719721 711392 702143 691939 680519 667903 654556 640755
53214 640755 626218 610716 594709 579016 564095 550029 537042 525497 515363 506081 497111 488371
53202 488371 479998 472010 464375 457199 450477 443856 436985 430038 423478 417359 411269 405009 398811 392741
53188 392741 386495 380119 374365 369792 365895 361783 357470 353826 351262 349121 346462 342985 339066 335353
53174 335353 332487 330797 329995 329361 328364 326990 325456 323855 322171 320480 319077 318381 318497 318762 318077 316070
53158 316070 313660 312031 311288 310632 309669 308859 308724 309230 310068 310935 311411 311091 310074 308968 308268 308078 308346
53141 308346 308818 308735 307313 304795 302415 301036 300318 299588 298962 299118 300329 302181 304035 305502 306639 307889
53125 307889 309530 311138 312069 312600 313886 316354 318828 319917 319788 319877 321136 323391 326222 329534 333094
53110C33094L127K128J199O97M48J38m36j371k457l133k990k327j887k018k388
53095C21824k445k050j561j494k024k725k820j931n40L83L48j98m38j63N3l50
53079C03869j128j561j395j056q86o34l3N37M65j63n96m22n8q7n08r39j226j506
53061B92673j735j549p53K98R51R05M94L07O20J166J441J241R35J163K083K987
53045C03227K923J721J44j084j932k549k608j729k79R34J572J779J494N16o42
53030C03487r12MJ109J351Q10K43J1J7K68Q38J433J510R00L4m18r3P53J370J258
53011C13973P34M64N06L66L0J32Q97J654J850J745J623J081j11j109r58o2K36
52994C23051n29j430j472o51M09J251J791K146K477K857L221L500L638L413K522
$$ plain form
53110 333094 336221 338349 339548 340245 340693 340831 340395 339024 336567 333434 330444 328117 326230 324212 321824
53095 321824 319379 317329 315768 314274 312250 309525 306705 304774 304234 304617 304965 304767 304329 304166 304219 303869
53079 303869 302741 301180 299785 298729 297843 297209 297176 297713 298178 298015 297419 296997 296939 296852 296344 295405 294179 292673
53061 292673 290938 289389 288636 288934 289885 290790 291284 291591 292211 293377 294818 296059 296994 298157 300240 303227
53045 303227 306150 307871 308015 306931 304999 302450 299842 298113 297834 298768 300340 302119 303613 304129 303487
53030 303487 302575 302579 303688 305039 305849 306092 306103 306120 306388 307226 308659 310169 311069 311103 310685 310592 311345 312715 313973
53011 313973 314707 315171 315677 316043 316073 316205 317102 318756 320606 322351 323974 325055 324944 323835 322877 322815 323051
52994 323051 322522 321092 319620 318969 319378 320629 322420 324566 327043 329900 333121 336621 340259 343672 346194
52979C46194J142Jl89k68j45j32j75l99p89q62k69N26P67L86L1K71J171K401L281
52960C52743L147K092J123J030J421J331M38q44j985k565k363j847k004k956l393
52945C45368k335q14n21j291j407l33N06jj043j262o49j66k49m47k78J82M10n1
52927C35619j052j810j782j360j248j411j327j031r67r25k40Q70J327Q23L19M48
52911C26253N64j9q46j135q74l76M04J279J355K17j048j123l27m8n81p99nJ019
52893C23910J207N76o0j67K21Q34J340J365P69j45q38r75o61k54o8j27k13j54
52875C26560M2L14P10J336K253L425M648N469N435M546L302K225J419P38P8o10
52859C61890j355k045k443k569k835l466l989l662k452j218q76j546k668l645
$$ plain form
52979 346194 347336 347337 346948 346680 346535 346403 346228 345829 345040 344178 343909 344435 345202 345588 345619 345890 347061 349462 352743
52960 352743 355890 357982 359105 360135 361556 362887 363325 362481 360496 357931 355568 353721 351717 348761 345368
52945 345368 343033 342219 341698 340407 339000 338667 339173 339172 338129 336867 336218 336052 335803 335356 335078 335260 335670 335619
52927 335619 334567 332757 330975 329615 328367 326956 325629 324598 323631 322706 322466 323336 324663 325486 325805 326253
52911 326253 326817 326798 325952 324817 323943 323567 323971 325250 326605 326822 325774 324651 324324 324276 323695 322896 322891 323910
52893 323910 325117 325693 325633 325466 325687 326521 327861 329226 329995 329850 329012 328037 327376 327122 327054 326927 326714 326560
52875 326560 326602 326916 327626 328962 331215 334640 339288 344757 350192 354738 358040 360265 361684 362422 362500 361890
52859 361890 360535 358490 356047 353478 350643 347177 343188 339526 337074 335856 334980 333434 330766 327121
52845C27121m123l895k926j648q88j142k021k668k713k517k491k523k270j596
52831B93700n68O72J740K056J424M12j70l3N96J363J837J491K41j164j824j715
52815C00058j473j295o80O37K071K768K472J671J171J496K381K808J952J53j384
52800C14806j852j505j086j071j486k005k111j576q35o03r73j293r76r0Q15J204
52784B99363Q72J62k03O8L57q2r49j216n28M17R35J036R07N47K16N28J548K376
52766C06354K100P85q10j974k262j519k34N77L42m86j081j103o70N1P54R31M46
52749C02201j77m30m55n26l57N36J977L198L675L427K715J894J430J579K017K163
52733C24867J842J407J268J544K040K339K089J445J036J285J857K071J571M00
$$ plain form
52845 327121 322998 319103 316177 314529 313641 312499 310478 307810 305097 302580 300089 297566 295296 293700
52831 293700 293132 293804 295544 297600 299024 299436 299266 299233 299829 301192 303029 304520 304761 303597 301773 300058
52815 300058 298585 297290 296610 297247 299318 302086 304558 306229 307400 308896 311277 314085 316037 316190 314806
52800 314806 312954 311449 310363 309292 307806 305801 303690 302114 301279 300676 299703 298410 297434 297344 298159 299363
52784 299363 300235 300397 300194 300262 300619 300537 299588 298372 297844 298261 299196 300232 301139 301686 301902 302430 303978 306354
52766 306354 308454 309239 308429 306455 304193 302674 302440 303017 303359 302873 301792 300689 300019 300070 300824 301755 302201
52749 302201 302024 301594 301139 300613 300256 300792 302769 305967 309642 313069 315784 317678 319108 320687 322704 324867
52733 324867 326709 328116 329384 330928 332968 335307 337396 338841 339877 341162 343019 345090 346661 347061
52719C47061j283l120m454m756m123l105k130j331o79j5Q22J579J620Q11K9J71
52703C27097R20J138M71k15j49L51N71M57M70O82O98L92J07N5m6m46q58q21l88
52684C30486l1M0L6K7k47p49q54j61P50R05J96n97r25j007j148j173q64m44k29
52665C24011j28J23M37M35Lm66m47J55Q41J044Q16Q11J363J951K045K155L200
52648C38349M824N345L717Q75j389k357k543k432j901q81J12M15p5q55j348j356
52632C38500j030n40Q8P80J407K147L438N162O151N200K544k80k143l194m041
52617C54189m741m983m634l698k244p07K19L34K27M26O75M80n8l58q3N87J182
52600C36813J204N09m03p78n11k20l02m37k84o9q6j70q3J00L31Q45J579J933J610
$$ plain form
52719 347061 345778 342658 338204 333448 329325 326220 324090 322759 322080 322065 322887 324466 326086 326897 326926 327097
52703 327097 328017 329155 329626 329411 329262 329613 330184 330641 331111 331793 332491 332883 332990 333045 332999 332553 331695 330874 330486
52684 330486 330455 330495 330531 330558 330311 329562 328708 328547 329297 330202 330398 329801 328876 327869 326721 325548 324684 324240 324011
52665 324011 323883 324006 324443 324878 324881 324415 323968 324123 324964 326008 326824 327635 328998 330949 332994 335149 338349
52648 338349 343173 348518 352235 353110 351721 349364 346821 344389 342488 341607 341719 342134 342059 341204 339856 338500
52632 338500 337470 336930 337018 337798 339205 341352 344790 349952 356103 361303 363847 363567 361424 358230 354189
52617 354189 349448 344465 339831 336133 333889 333182 333401 333735 333962 334388 335063 335543 335485 335127 335044 335631 336813
52600 336813 338017 338526 338123 337345 336834 336614 336312 335875 335591 335522 335436 335266 335183 335283 335614 336459 338038 339971 341581
52581C41581J164J156J288J098Q84J193J757J823J281O26M0o81j368j502j024
52566C49316m58j74j27l13q39j472j727j505j146q26l84J67N02M72K53q1o17j203
52548C39838j404j140r21j233j867k097j409k3J190J374M13r44j804j833j208
52533C26932k53O60J117J065J007J389J949K050J561J007Q30R28R32P33O46J051
52517C43604J861K395K104J392J248J955K809L313L859M791N530N456M955M642
52503C89914L997J923j468m675o460o851o427n561m537l702l078k389j623j160
52489C47903j162j343j447j506j519j356j023o43j20O52J339J527J476J861K588
52474C47227K657J536Q5l39O53K284L533L972L872L756L814L753L395L154L517
$$ plain form
52581 341581 342745 343901 345189 346287 347171 348364 350121 351944 353225 353851 353891 353210 351842 350340 349316
52566 349316 348858 348684 348557 348244 347405 345933 344206 342701 341555 340729 340345 340512 341014 341486 341739 341658 341041 339838
52548 339838 338434 337294 336373 335140 333273 331176 329767 329744 330934 332308 332721 331777 329973 328140 326932
52533 326932 326679 327339 328456 329521 330528 331917 333866 335916 337477 338484 339314 340242 341174 341907 342553 343604
52517 343604 345465 347860 349964 351356 352604 354559 357368 360681 364540 369331 374861 380317 385272 389914
52503 389914 393911 395834 394366 389691 383231 376380 369953 364392 359855 356153 353075 350686 349063 347903
52489 347903 346741 345398 343951 342445 340926 339570 338547 337904 337784 338436 339775 341302 342778 344639 347227
52474 347227 349884 351420 351505 351166 351819 354103 357636 361608 365480 369236 373050 376803 380198 383352 386869
52459C86869M095L854K317J06j858l165l898m247m445m704m966m990m806m710
52445C55452m704m357l384k060r26l19k58n43q57j051j292j664j794j259l42K01
52429C30843J05j32l4L61Q32J259J500J459J442J825K268J857L42j329j982j349
52413C39267MJ326K017J904J574K019L502N221O404P259Q447J0066J1727J3077
52399D13814J3628J2446Q918L792j196m853p170q554r055q658p690o513n126l509
52385C90274k145j643j883j985j327k63M38N69N89R46J687K642L596M251M521
52370D00267M858N763O927P358O620N280L803J854p32k977l753l289k765k641
52356D26573k356j623r56p50p10n23l71l92k66K92J081J736K159K386K460K564
$$ plain form
52459 386869 390964 394818 397135 397241 395383 392218 388320 384073 379628 374924 369958 364968 360162 355452
52445 355452 350748 346391 343007 340947 340021 339702 339444 338901 338044 336993 335701 334037 332243 330984 330642 330843
52429 330843 330948 330816 330782 331143 331975 333234 334734 336193 337635 339460 341728 343585 343927 342598 340616 339267
52413 339267 339271 340597 342614 344518 346092 348111 351613 356834 363238 370497 378944 389010 400737 413814
52399 413814 427442 439888 448806 452598 451402 446549 439379 430825 421770 413112 405422 398909 393783 390274
52385 390274 388129 386486 384603 382618 381291 381028 381466 382035 382624 383570 385257 387899 391495 395746 400267
52370 400267 405125 410888 417815 425173 431793 437073 440876 442730 441998 439021 435268 431979 429214 426573
52356 426573 424217 422594 421638 420888 420178 419655 419284 418892 418626 418918 419999 421735 423894 426280 428740 431304
52340D31304K900L301L410L324L539M178M805N239N910P154Q622R742J0353J0683
52326E14464J1085J1985J3600J5470J6782J7345J7707J8021J7558J5831J3658
52315F83506J2418J2514J3221J3874J4588J5757J7363J8962K0201K1117K2003
52304H65524K2953K3731K4159K4454K4917K5483K5862K5959K5677K4463K1753
52293A134935J7844J3652R651N688J988o23j875k678l963n542o620p057p354p768
52279A140278q050q008p789p614p485p178o379m952l148j379K87K066L956N661
52265A090266P069Q292R187R417R202R392J0513J2225J4018J5837J7696J9331
52253A232445K0653K1950K3112K3293K1932J9649J7382J5126J2222Q619N098K313
$$ plain form
52340 431304 434204 437505 440915 444239 447778 451956 456761 462000 467910 475064 483686 493428 503781 514464
52326 514464 525549 537534 551134 566604 583386 600731 618438 636459 654017 669848 683506
52315 683506 695924 708438 721659 735533 750121 765878 783241 802203 822404 843521 865524
52304 865524 888477 912208 936367 960821 985738 1011221 1037083 1063042 1088719 1113182 1134935
52293 1134935 1152779 1166431 1176082 1181770 1183758 1183135 1181260 1178582 1174619 1169077 1162457 1155400 1148046 1140278
52279 1140278 1132228 1124220 1116431 1108817 1101332 1094154 1087775 1082823 1079675 1078296 1078583 1080649 1084605 1090266
52265 1090266 1097335 1105627 1114814 1124231 1133433 1142825 1153338 1165563 1179581 1195418 1213114 1232445
52253 1232445 1253098 1275048 1298160 1321453 1343385 1363034 1380416 1395542 1407764 1416383 1421481 1423794
52241A423794L18j065j956k592l320m354n712p284q752r688j0035j0257j0707
52228A348390j1164j1327j1383j1645j1910j1751j1219j0743j0417r925r077q061
52216A219768p153o450n808m855l270j340J23P31J078J906L050L728L672L371
52202A208551L310L552M073N002O340P731Q683Q949Q765Q764R439J0549J1295
52189A305003J1179J0445R503Q412P123N777M365K489j19l137o069q663j0642
52176A335666j1565j1533j1439j1862j2165j1464j0064q952q187o872m793k927
52164A223843j989j383j59J633L185M159M985N948O483N660L281L08j957k981
52150A251016l152k940k370j436m55K85R27J701K519L190L671L812L200J743O6
$$ plain form
52241 1423794 1424112 1423047 1421091 1418499 1415179 1410825 1405113 1397829 1389077 1379389 1369354 1359097 1348390
52228 1348390 1337226 1325899 1314516 1302871 1290961 1279210 1267991 1257248 1246831 1236906 1227829 1219768
52216 1219768 1212615 1206165 1200357 1195502 1192232 1190892 1191015 1191746 1192824 1194730 1197780 1201508 1205180 1208551
52202 1208551 1211861 1215413 1219486 1224488 1230828 1238559 1247242 1256191 1264956 1273720 1283159 1293708 1305003
52189 1305003 1316182 1326627 1336130 1344542 1351665 1357442 1361807 1364296 1364177 1361040 1354971 1346308 1335666
52176 1335666 1324101 1312568 1301129 1289267 1277102 1265638 1255574 1246622 1238435 1231563 1226770 1223843
52164 1223843 1221854 1220471 1220312 1221945 1225130 1229289 1234274 1240222 1246705 1252365 1255646 1255954 1253997 1251016
52150 1251016 1247864 1244924 1242554 1241118 1240663 1240948 1241875 1243576 1246095 1249285 1252956 1256768 1259968 1261711 1261777
52135A261777j141j799k153k177j726q72M20K517N492Q694J1573J4394J7416J9959
52121A332374K1287K2026K3500K5796K7610K8049K7606K7093K6611K5859K4618
52110A612429K2760K0415J8315J7224J6871J6278J5260J4715J5221J6300J7419
52099A803207J8681J9944K0214J8753J6126J3329J0338O444J646l173p420j1383
52087A906706j5516j9591k2765k4311k4181k2961k1324j9537j7704j6175j5307
52076A687334j4770j3750j1981j0094q640p330n609l490j401N39K568M854P361
52063A625591R972J2398J4214J5275J5946J6594J7163J7508J7839J8394J8970
52052A799864J9213J9080J8510J6974J4008J0135O461L249l10m715r181j2614
$$ plain form
52135 1261777 1260636 1258837 1256684 1254507 1252781 1251909 1252329 1254846 1260338 1269032 1280605 1294999 1312415 1332374
52121 1332374 1353661 1375687 1399187 1424983 1452593 1480642 1508248 1535341 1561952 1587811 1612429
52110 1612429 1635189 1655604 1673919 1691143 1708014 1724292 1739552 1754267 1769488 1785788 1803207
52099 1803207 1821888 1841832 1862046 1880799 1896925 1910254 1920592 1927036 1928682 1925509 1918089 1906706
52087 1906706 1891190 1871599 1848834 1824523 1800342 1777381 1756057 1736520 1718816 1702641 1687334
52076 1687334 1672564 1658814 1646833 1636739 1628099 1620769 1615160 1611670 1610269 1610808 1613376 1618230 1625591
52063 1625591 1635563 1647961 1662175 1677450 1693396 1709990 1727153 1744661 1762500 1780894 1799864
52052 1799864 1819077 1838157 1856667 1873641 1887649 1897784 1904245 1907494 1907184 1902469 1893288 1880674
52040A880674j4960j6885j8494j9176j8788j8153j8016j8102j7673j6669j5730
52029A688028j5322j5360j5652j6056j6226j5775j4980j4695j5220j5800j5642
52018A517300j5004j4668j4678j4379j3531j2682j2227j1741j0608q953p633p431
52006A373765q408j0024j1751j3585j5877j8692k1508k3682k4927k5175k4271
51995A175865k2223j9585j7149j5322j4081j3355j3147j3365j3946j5079j6913
51984A001700j9046k0667k1240k0862k0101j9680k0084k1012k1446k0720j9308
51973G77534j8072j6936j5060j2206r138o530m162j493J545M601P329R467J0832
51960G27711J1437J1406J0640Q889O150K730j096n063q614j1098j2268j2173j0728
$$ plain form
52040 1880674 1865714 1848829 1830335 1811159 1792371 1774218 1756202 1738100 1720427 1703758 1688028
52029 1688028 1672706 1657346 1641694 1625638 1609412 1593637 1578657 1563962 1548742 1532942 1517300
52018 1517300 1502296 1487628 1472950 1458571 1445040 1432358 1420131 1408390 1397782 1388829 1381196 1373765
52006 1373765 1365357 1355333 1343582 1329997 1314120 1295428 1273920 1250238 1225311 1200136 1175865
51995 1175865 1153642 1134057 1116908 1101586 1087505 1074150 1061003 1047638 1033692 1018613 1001700
51984 1001700 982654 961987 940747 919885 899784 880104 860020 839008 817562 796842 777534
51973 777534 759462 742526 727466 715260 706122 699592 695430 693937 695482 700083 707412 716879 727711
51960 727711 739148 750554 761194 770083 776233 778963 777867 772804 764190 753092 740824 728651 717923
51947G17923p972m635j719O39L082N843Q463J0885J3789J7333K0500K2462K3804
51934H30397K5543K7519K8678K8528K7334K4967K0636J3895N250m353j4058k2915
51922I91421k9896l4488l6992l7925l7414l5408l2239k8602k5026k1639j8452
51911F53340j5615j3223j1105q963o684m266j555J577M776P345Q989J0005J0496
51898F35117R981Q234N883L497N69l663q595j2594j4923j6283j7225j7186j5650
51885E57162j3248j0923q669n980l054o90Q32K045L531N430P631R968J2218J4079
51871E70332J5186J4970J2917R284N203J737r68l236n012n937o066n841n323m022
51857E93224j677J179L504M628M752M664M873M986M139K077n01k809m755o649
$$ plain form
51947 717923 709951 705316 703597 704236 707318 713161 721624 732509 746298 763631 784131 806593 830397
51934 830397 855940 883459 912137 940665 967999 992966 1013602 1027497 1032747 1028394 1014336 991421
51922 991421 961525 927037 890045 852120 814706 779298 747059 718457 693431 671792 653340
51911 653340 637725 624502 613397 604434 597750 593484 591929 593506 598282 605627 614616 624621 635117
51898 635117 645098 653332 659215 662712 663281 659618 651023 638429 623506 607223 589998 572812 557162
51885 557162 543914 532991 524322 518342 515288 514598 515430 517475 521006 526436 534067 544035 556253 570332
51871 570332 585518 600488 613405 622689 627892 629629 628661 625425 620413 614476 608410 602569 597246 593224
51857 593224 591547 592726 596230 600858 605610 610274 615147 620133 624272 626349 625848 623039 618284 611635
51843F11635q481r920j0785j1136j1003j0351r263p934o497n050l680k374j053
51830E14108J85J094J655K119K500K415J625M17q44k119l377m151l977l068k163
51815E06419j751j666j384n25Q31K084K597K288J606R15K90j13n7J92m1q39j405
51798E09441j177n81j08O19K002L250L083J437m80j757k512l039l212k972k592
51783E01402k129j229J66J460K091K080J677R41R2j73P28K549M484O024P227Q301
51767E35691R334J0434J1720J2918J3230J1981R408O475L777R60k463o001q512
51754F08952r592j0042j0712j1536j2005j2011j1677j0837r315p535o152n227
51742D92311m336l301k249j037O81K740M478N655O838Q557J0490J1754J1733J0389
$$ plain form
51843 611635 603154 593234 582449 571313 560310 549959 540696 532762 526265 521215 517535 515161 514108
51830 514108 514293 515387 517042 519161 521661 524076 525701 526118 525274 523155 519778 515627 511650 508582 506419
51815 506419 504668 503002 501618 501093 501924 504008 506605 508893 510499 511414 511704 511591 511534 511726 511685 510846 509441
51798 509441 508264 507683 507575 508194 510196 513446 516529 517966 517486 515729 513217 510178 506966 503994 501402
51783 501402 499273 498044 498210 499670 501761 503841 505518 506459 506551 506378 507106 509655 514139 520163 527390 535691
51767 535691 545025 555459 567179 580097 593327 605308 614716 621191 624968 625928 623465 617464 608952
51754 608952 599360 589318 578606 567070 555065 543054 531377 520540 511225 503690 497538 492311
51742 492311 487975 484674 482425 481388 482069 484809 489287 494942 501780 510337 520827 532581 544314 554703
51728E54703P995M930J667j147k751k540m80K671N585O927N900K738j198m196
51714E80804n468n547n295m929m292l597l257l258l335l541l988m102k909k32
51700E27054K963N504O777O551M784J956r43l070m157m150k947p99J310K170J239
51685E44242r74l288m691n122n359n881o065n020l010j281m62J5O83J214J322
51670E06323J564K428L318L483L610N292Q902J2999J5965J7415J7550J6000J2167
51657F27016O379k8n707r978j2608j3472j2585j0181o562k155K253N658P374P249
51643E82653N301J592l156p332r544r902r586r129p882n487k948j641j678k094
51629E19167k306k544k930l059k699k187j790j308p61q17j897l203l501k795k437
$$ plain form
51728 554703 562698 567628 569295 568148 565397 562857 562377 565048 570633 577560 583460 586198 585000 580804
51714 580804 575336 569789 564494 559565 555273 551676 548419 545161 541826 538285 534297 530195 527286 527054
51700 527054 530017 535521 542298 548849 553633 555589 554646 551576 547419 543269 540322 539523 540833 543003 544242
51685 544242 543268 539980 535289 530167 524808 518927 512862 507842 504832 503551 503089 503104 503787 505001 506323
51670 506323 507887 510315 513633 517116 520726 526018 534920 547919 563884 581299 598849 614849 627016
51657 627016 633395 633367 627660 617682 605074 591602 579017 568836 562274 560119 562372 568030 575404 582653
51643 582653 587954 589546 586390 579058 569514 559612 550026 540897 533015 527528 524580 522939 521261 519167
51629 519167 516861 514317 511387 508328 505629 503442 501652 500344 499583 498766 496869 493666 490165 487370 484933
51614D84933l318m619m861l763k452j939k082k208k149k195k358k326k004j599
51600D47060j046Q4J884L760N100O078P500R891J2968J5797J7287J6674J3823
51587E56860R177L479k253o714q842q701p462o211n006l320r84J713M555P574
51573E33865J0767J3967J6863J8947J9800J9817K0267K2064K4577K6183K5894
51562G53011K4096K2000K0954K2100K5804L1241L6973M2034M6008M8109M6919
51551A119249M1419L1956K0017P334m745j5536k4972l3104l9568m3809m5776m5959
51539I66506m4760m2194l8380l3747k8686k3390j8222j3780j0437q146o976p237
51527F90551q808j0757j2138j2849j3277j3361j2647j1162r706q918q531p832
$$ plain form
51614 484933 481615 476996 472135 468372 465920 463981 461899 459691 457542 455347 452989 450663 448659 447060
51600 447060 446014 446098 447982 451742 456842 462920 470420 480311 493279 509076 526363 543037 556860
51587 556860 566037 569516 567263 560549 551707 543006 535544 529333 524327 521007 520023 521736 526291 533865
51573 533865 544632 558599 575462 594409 614209 634026 654293 676357 700934 727117 753011
51562 753011 777107 799107 820061 842161 867965 899206 936179 978213 1024221 1072330 1119249
51551 1119249 1160668 1192624 1212641 1219975 1215230 1199694 1174722 1141618 1102050 1058241 1012465 966506
51539 966506 921746 879552 841172 807425 778739 755349 737127 723347 712910 704764 697788 690551
51527 690551 681743 670986 658848 645999 632722 619361 606714 595552 585846 576928 568397 560565
51515E60565o737n985o148o771o866o096m992m042l140k275k091l072m533n202
51501D92615m753l966l408k681j307M06J791K620L078L241L066K625K069J479
51487D96875R92Q96J328K019K387J864K23k045l733l860k778j929k207l029l282
51472D83721k728k012j704j876k417l223m068m664m902m815m377l591k678j932
51458D38734j405j052j020j501k232k526j952q36J06N76R76J878L352M931O237
51443D44266P444R060J1382J4282J7300J9679K0466J8955J5350J0845O894M394
51431F00317L343L120K981K355P41k322o736j1228j3900j3895j2220j0529r393
51418E32634q302o955n761n111m895m843m703m037k550q12L4l72j130j181m33
$$ plain form
51515 560565 553828 547843 541695 534924 528058 521962 516970 512928 509788 507513 505422 502350 497817 492615
51501 492615 487862 483896 480488 477807 476500 476906 478697 481317 484395 487636 490702 493327 495396 496875
51487 496875 497867 498763 500091 502110 504497 506361 506584 504539 500806 496946 494168 492239 490032 487003 483721
51472 483721 480993 478981 477277 475401 472984 469761 465693 461029 456127 451312 446935 443344 440666 438734
51458 438734 437329 436277 435257 433756 431524 428998 427046 426210 426316 426892 427868 429746 433098 438029 444266
51443 444266 451710 460770 472152 486434 503734 523413 543879 562834 578184 589029 595923 600317
51431 600317 603660 606780 609761 612116 612857 610535 603799 592571 578671 564776 552556 542027 532634
51418 532634 524332 517377 511616 506505 501610 496767 492064 488027 485477 484665 484699 484327 483197 482016 481583
51403D81583N37J308J822K088K244K552L123L765M321M789N078N088N134N836
51389E29268P355R145J0677J1959J3241J4831J7353K1427K6799L2429L7861M3658
51377G76003M9992N5772O0078O3706O7973P2181P3444O9093N8619M3361K5336
51366A415558O606j1019k6363l8950m8770n6103o1383o4807o6199o5509o3170
51355I19891n9576n4649m8480m2056l6483l1724k6941k2010j7821j4997j3228
51344E51926j2061j1448j1161j0497r122p579o432n447m191k899k110j785j433
51331D65761q89l91qM13P73P68M27J06j44o85j642k594l175l511l737l428k117
51314D45927k82Q51O87kk9Q05J717K110K181K272K243J803J064K85o05j684k467
$$ plain form
51403 481583 482120 483428 485250 487338 489582 492134 495257 499022 503343 508132 513210 518298 523432 529268
51389 529268 536623 545768 556445 568404 581645 596476 613829 635256 662055 694484 732345 776003
51377 776003 825995 881767 941845 1005551 1073524 1145705 1219149 1288242 1346861 1390222 1415558
51366 1415558 1422164 1411145 1384782 1345832 1297062 1240959 1179576 1114769 1048570 983061 919891
51355 919891 860315 805666 757186 715130 678647 646923 619982 597972 580151 565154 551926
51344 551926 539865 528417 517256 506759 497637 490058 483626 478179 473988 471089 468979 467194 465761
51331 465761 464872 464481 464473 464886 465659 466427 466854 466960 466816 466131 464489 461895 458720 455209 451472 448044 445927
51314 445927 445645 446496 447183 447181 447152 447957 449674 451784 453965 456237 458480 460283 461347 461632 461027 459343 456876
51297D56876k364j723j719k831m064m156l136k051j468j026l88J77M45P56J440
51282D34768K212K677L014L687M759O040P530Q962R244P402M161J579P60P85L46
51267D97926m45n72K95J621K953M060M481L790K320P89o26k176l624m290m051
51252E02451l520l163k939k947l532m601n443n535m991m170l452l380m116m654
51238D46008l619j165Q71J190M19j85l47l09K37J571K939L294K698J963J232L4
51222D56831j397k021j441n56m06r58j356r51J28J171J514J148P00O65Q76R99
51206D54946J189J747K448K753K563K235K042K128K775M070N293N385M144K491
51192D96209J449J285J634J907J508J76j604k890l168k690j975j348j020j143
$$ plain form
51297 456876 454512 452789 451070 448239 444175 440019 436883 434832 433364 432338 431950 432127 432572 433328 434768
51282 434768 436980 439657 442671 446358 451117 457157 464687 473649 482893 490295 494456 496035 496795 497580 497926
51267 497926 497481 496909 497204 498825 501778 505838 510319 514109 516429 517218 516592 514416 510792 506502 502451
51252 502451 498931 495768 492829 489882 486350 481749 476306 470771 465780 461610 458158 454778 450662 446008
51238 446008 442389 441224 442095 443285 443704 443519 443172 442863 443100 444671 447610 450904 453602 455565 456797 456831
51222 456831 455434 453413 451972 451416 451010 450052 448696 447745 447873 449044 450558 451706 452406 453071 453947 454946
51206 454946 456135 457882 460330 463083 465646 467881 469923 472051 474826 478896 484189 489574 493718 496209
51192 496209 497658 498943 500577 502484 503992 504168 502564 499674 496506 493816 491841 490493 489473 488330
51178D88330j562j824j623j102n80k11P8L95P46J027J174J316J496J284J61j488
51162D87617k328j494L43J879K701L201L425K910J642K15j010k117k929l013k598
51147D88444k623l357l819l090j669p88q25j049p58l8O09Q27O00K08J17O40J583
51130D75012K392K637K306J705J157Q41P65Q59J043J259J427J485J414J263J160
51115D96725J283J663K045K107J913J909K362K966L189K810K013J231J003J606
51101E24825K593L075K729K236K300K664K548J758P51j59j001j604j616j071m67
51086E39561j10J84O40J134J320R17l8r83j193o14q6k46o05l13M99R77R62J149
51068E43155J870K629L093L619M488N424O343P810J0239J3290J6596K0521K5298
$$ plain form
51178 488330 486768 484944 483321 482219 481639 481428 481506 481901 482647 483674 484848 486164 487660 488944 489105 487617
51162 487617 485289 483795 484138 486017 488718 491919 495344 498254 499896 500111 499101 496984 494055 491042 488444
51147 488444 485821 482464 478645 475555 473886 473098 472273 471224 470466 470428 471037 471864 472464 472672 472789 473429 475012
51130 475012 477404 480041 482347 484052 485209 486050 486815 487674 488717 489976 491403 492888 494302 495565 496725
51115 496725 498008 499671 501716 503823 505736 507645 510007 512973 516162 518972 520985 522216 523219 524825
51101 524825 527418 530493 533222 535458 537758 540422 542970 544728 545479 545320 544319 542715 541099 540028 539561
51086 539561 539451 539635 540275 541409 542729 543646 543608 542625 541432 540818 540732 540486 539881 539568 540067 541044 542006 543155
51068 543155 545025 547654 550747 554366 558854 564278 570621 578431 588670 601960 618556 639077 664375
51055F64375K9743L1584K9335K3524J6238R836O023N440P557J0712J2660J1788
51043H58815Q335M281J579L84q59l643p992j2465j5081j4384j0412m981p67K70
51029H03080k279p405j3243j7817j9979j9905j8382j5847j2461q754n408k535
51017F59065J63K609M537O318Q703J1562J3800J4716J4662J4135J3079J1475R835
51004G84659Q595P595O532N335L844J789n29k247l043l571m503n719o839p694
50990G84204p859o560l791q09J233K602M211O162P886R305J1028J3559J6947K0881
50976H58999K4660K7344K8407K8042K6547K4147K1798K1345K3898K8582L3703
50965A147472L8643M3783M9145N4296N9277O4488O9649P3881P6802P8658P9440
$$ plain form
51055 664375 694118 725702 755037 778561 794799 804635 810658 816098 823655 834367 847027 858815
51043 858815 867150 871431 873010 873394 872535 868892 860900 848435 833354 818970 808558 803577 802810 803080
51029 803080 800801 793396 780153 762336 742357 722452 704070 688223 675762 667008 661600 659065
51017 659065 659228 661837 666374 672692 681395 692957 706757 721473 736135 750270 763349 774824 784659
51004 784659 793254 800849 807381 812716 816560 818349 817820 815573 812530 808959 804456 798737 791898 784204
50990 784204 776345 769785 765994 765185 766418 769020 773231 779393 787279 796584 807612 821171 838118 858999
50976 858999 883659 911003 939410 967452 993999 1018146 1039944 1061289 1085187 1113769 1147472
50965 1147472 1186115 1229898 1279043 1333339 1392616 1457104 1526753 1600634 1677436 1756094 1835534
50954A835534P8768P6601P3187O8350O1745N3931M6185L9017L1801K4180J6970
50943B406269J1227P207M782M023M674N567N340L612R94j826m536o941q922j0769
50929B420701j3176j6680k1152k5946l0612l5403m1021m7801n5208o2163o7698
50918B003841p1252p2687p2275p0549o7845o4123n9484n4579n0149m6337m2838
50907A331723l9532l6523l3675l0708k7716k5153k3212k1626k0088j8475j6643
50896A038372j4476j2202j0249q693p230n794m702m048l429k557j700j161p01
50883I61430N3R31J440J636K212L553N156O328P096Q011R176J0125J0773J1780
50869A039700J3497J5133J5741J5789J6707J8956K1501K3501K5462K8145L1261
$$ plain form
50954 1835534 1914302 1990903 2064090 2132440 2194185 2248116 2294301 2333318 2365119 2389299 2406269
50943 2406269 2417496 2424703 2429485 2433508 2438182 2443749 2449089 2452701 2453695 2451869 2447333 2440392 2431470 2420701
50929 2420701 2407525 2390845 2369693 2343747 2313135 2277732 2236711 2188910 2133702 2071539 2003841
50918 2003841 1932589 1859902 1787627 1717078 1649233 1585110 1525626 1471047 1420898 1374561 1331723
50907 1331723 1292191 1255668 1221993 1191285 1163569 1138416 1115204 1093578 1073490 1055015 1038372
50896 1038372 1023896 1011694 1001445 992752 985522 979728 975026 970978 967549 964992 963292 962131 961430
50883 961430 961483 962414 963854 965490 967702 971255 976411 982739 989835 997846 1007022 1017147 1027920 1039700
50869 1039700 1053197 1068330 1084071 1099860 1116567 1135523 1157024 1180525 1205987 1234132 1265393
50858A265393L4064L6621L9585M3167M7327N2662O0030O9285P9271Q9148R8996
50847A915549J09055J19126J28979J38688J48330J57681J66338J73732J79051
50838C236529J81513J80739J76387J67673J53923J35597J14071R0500O5702M1114
50828D543748J8772j45j5941k9034l8698m3775m3993l9910l2103k1283r067K334
50816D290905J1253J6886J8385J4378L967j1991l1063n0926p0720r0672j10629
50805C989773j29328j45240j57657j66606j72009j73442j70707j64245j54896
50796B555643j43595j31242j18539j05855r3435q1656p0782o0734n1375m2879
50786A655551l5362k8480k1979j6425j2532r921p470m898l132k756l168l627m283
$$ plain form
50858 1265393 1299457 1336078 1375663 1418830 1466157 1518819 1578849 1648134 1727405 1816553 1915549
50847 1915549 2024604 2143730 2272709 2411397 2559727 2717408 2883746 3057478 3236529
50838 3236529 3418042 3598781 3775168 3942841 4096764 4232361 4346432 4436932 4502634 4543748
50828 4543748 4562520 4562375 4546434 4517400 4478702 4434927 4390934 4351024 4318921 4297638 4288571 4290905
50816 4290905 4302158 4319044 4337429 4351807 4355774 4343783 4312720 4261794 4191074 4100402 3989773
50805 3989773 3860445 3715205 3557548 3390942 3218933 3045491 2874784 2710539 2555643
50796 2555643 2412048 2280806 2162267 2056412 1962977 1881321 1810539 1749805 1698430 1655551
50786 1655551 1620189 1591709 1569730 1553305 1540773 1530852 1523382 1518484 1515352 1512596 1509428 1505801 1501518
50773A501518n501o938q055q982j0188j1686j3244j4927j6710j8003j8314j8148
50761A350822j8416j9152j9543j9123j8166j6905j5216j3183j1283r698p998n798
50749A176341l343j113Q24K866N544R244J3924J8921K3412K7208L0866L4875L9087
50736A378656M3209M7454N2361N8050O4029O9662P4567P8610Q1812Q4341Q6418
50725B119169Q8024Q8873Q8781Q7943Q6699Q4955Q1993P6966O9446N9337M6472
50714B978658L0788J3059m928k1242l4744m4887n0972n2344m9325m3383l5907
50703B684773k7263j7438p222J955R267J4791J8293J8412J3658M058q785k3097
50691B681402l7958n2930o7294p9978q9901r6233r8627r7534r4011q8936q2513
$$ plain form
50773 1501518 1496017 1489079 1481024 1472042 1461854 1450168 1436924 1421997 1405287 1387284 1368970 1350822
50761 1350822 1332406 1313254 1293711 1274588 1256422 1239517 1224301 1211118 1199835 1190137 1182139 1176341
50749 1176341 1172998 1171885 1172709 1175575 1181119 1190363 1204287 1223208 1246620 1273828 1304694 1339569 1378656
50736 1378656 1421865 1469319 1521680 1579730 1643759 1713421 1787988 1866598 1948410 2032751 2119169
50725 2119169 2207193 2296066 2384847 2472790 2559489 2644444 2726437 2803403 2872849 2932186 2978658
50714 2978658 3009446 3022505 3017577 2996335 2961591 2916704 2865732 2813388 2764063 2720680 2684773
50703 2684773 2657510 2640072 2632850 2634805 2644072 2658863 2677156 2695568 2709226 2713284 2704499 2681402
50691 2681402 2643444 2590514 2523220 2443242 2353341 2257108 2158481 2060947 1966936 1878000 1795487
50680A795487p4757o6122n7265m8407l9418l0513k2322j5119q398j514N484J1909
50668A449045J7216K1396K4598K6674K7315K6608K5119K3286K1037J8362J6019
50657A696675J5038J5431J6051J6092J6112J7028J8651J9921K0358K0461K0780
50646A892598K1494K2945K5720K9806L4376L8788M3271M8074N2571N5810N7669
50635B323122N8791N9522N9540N8517N6583N3967N0690M6870M3109M0298L9002
50624B890011L8883L8311L4411K4216O799j5128l6131n1171n8348n8826n4696
50613B758331m7387l7821k7115j6515o999P33O270R794J1886J2424J0116L874
50601B677591n557j6180k6920l8286n0643o2692p2276p8185q0730q0956p9807
$$ plain form
50680 1795487 1720730 1654608 1597343 1548936 1509518 1479005 1456683 1441564 1433166 1431652 1437136 1449045
50668 1449045 1466261 1487657 1512255 1538929 1566244 1592852 1617971 1641257 1662294 1680656 1696675
50657 1696675 1711713 1727144 1743195 1759287 1775399 1792427 1811078 1830999 1851357 1871818 1892598
50646 1892598 1914092 1937037 1962757 1992563 2026939 2065727 2108998 2157072 2209643 2265453 2323122
50635 2323122 2381913 2441435 2500975 2559492 2616075 2670042 2720732 2767602 2810711 2851009 2890011
50624 2890011 2928894 2967205 3001616 3025832 3032631 3017503 2981372 2930201 2871853 2813027 2758331
50613 2758331 2710944 2673123 2646008 2629493 2622494 2623227 2629497 2639291 2651177 2663601 2673717 2677591
50601 2677591 2672034 2655854 2628934 2590648 2540005 2477313 2405037 2326852 2246122 2165166 2085359
50590B085359p7850p5288p2203o8840o5528o2239n8598n4515n0441m6716m3018
50579A410123l8835l4237k9802k5863k2205j8489j4686j1031p692m533j279K117
50567A203588N291P885R917J1593J2890J3793J4801J6539J8832K0769K1909K2809
50555A380616K4034K5258K5884K6127K6868K8620L1077L3463L4955L4997L3700
50544A705599L1906L0534K9926L0047L1051L3224L6527M0598M5177N0276N5957
50533B120822O2185O8788P5336Q1261Q6377R1158R6378J02609J10161J19048J28588
50522C142711J37337J44003J48366J50904J51607J49631J44073J34689J21754
50513D425075J05617Q6568O4933M1214J6139r381l4422n8138p9750r8711j14800
$$ plain form
50590 2085359 2007509 1932221 1860018 1791178 1725650 1663411 1604813 1550298 1499857 1453141 1410123
50579 1410123 1371288 1337051 1307249 1281386 1259181 1240692 1226006 1214975 1207283 1202750 1201471 1203588
50567 1203588 1208879 1216764 1226681 1238274 1251164 1264957 1279758 1296297 1315129 1335898 1357807 1380616
50555 1380616 1404650 1429908 1455792 1481919 1508787 1537407 1568484 1601947 1636902 1671899 1705599
50544 1705599 1737505 1768039 1797965 1828012 1859063 1892287 1928814 1969412 2014589 2064865 2120822
50533 2120822 2183007 2251795 2327131 2408392 2494769 2585927 2682305 2784914 2895075 3014123 3142711
50522 3142711 3280048 3424051 3572417 3723321 3874928 4024559 4168632 4303321 4425075
50513 4425075 4530692 4617260 4682193 4723407 4739546 4730165 4695743 4637605 4557855 4459144 4344344
50502D344344j27686j36342j39412j36356j27751j14291r6161p3970m9584k5169
50492C317622j804K0187L9824N5432O5808P0478O8603N8769M0389J4796j5240
50481C734864m6600p6316j01947j22268j37307j47332j52098j51433j46136j37879
50471B515548j28319j18606j09386j00856r2854q5282p8365p2308o6840o1329
50461A601403n5413m9332m3643l8632l3944k8822k2915j6773j1360p039l373J20
50449A290277L377O156Q543J0845J3264J5975J9332K3646K8695L3488L6518L6412
50437A526528L2812K6812K0219J4223Q973M431J054p42j278j285j125p92l59J23
50423A629594R95K625M695O506Q055J0177J3442J7474K1715K6363L1962L8387
$$ plain form
50502 4344344 4216658 4080316 3940904 3804548 3676797 3562506 3466345 3392375 3342791 3317622
50492 3317622 3315818 3336005 3375829 3431261 3497069 3567547 3636150 3694919 3735308 3750104 3734864
50481 3734864 3688264 3611948 3510001 3387733 3250426 3103094 2950996 2799563 2653427 2515548
50471 2515548 2387229 2268623 2159237 2058381 1965527 1880245 1801880 1729572 1662732 1601403
50461 1601403 1545990 1496658 1453015 1414383 1380439 1351617 1328702 1311929 1300569 1293530 1290157 1290277
50449 1290277 1293654 1299810 1308353 1319198 1332462 1348437 1367769 1391415 1420110 1453598 1490116 1526528
50437 1526528 1559340 1586152 1606371 1620594 1629567 1633998 1635052 1634310 1633032 1631747 1630622 1629830 1629471 1629594
50423 1629594 1630589 1633214 1637909 1644415 1652470 1662647 1676089 1693563 1715278 1741641 1773603 1811990
50411A811990M4842N0882N6801O2882O8666P3314P6464P8361P9204P8730P6595
50400B558731P2982O8502O3491N7577M9994M0215K8203J4233j263j7657l4140
50389B900868m9940o4402p6785q6128r1571r2920r0677q5495p7752o7876n6761
50378B060561m5426l4120k2256r581K817J3150K0500K5237K7788K7607K3773J6192
50366B106242N677o922k0863l4833m6850n5374o0242o2199o1929n9884n6618n2569
50354A593636m7673m1813l5683l0551k6997k4451k2334k1149k2007k5227k9709
50343A266042l3569l5237l4293l1522k8040k4283k0090j5749j2217r911p960n421
50331A007750k726j020l58M23J994L756M973N770O564P250P552P651P922Q437
$$ plain form
50411 1811990 1856832 1907714 1964515 2027397 2096063 2169377 2245841 2324202 2403406 2482136 2558731
50400 2558731 2631713 2700215 2763706 2821283 2871277 2911492 2939695 2953928 2952665 2935008 2900868
50389 2900868 2850928 2786526 2709741 2623613 2532042 2439122 2348445 2262950 2185198 2117322 2060561
50378 2060561 2015135 1981015 1958759 1949178 1951995 1965145 1985645 2010882 2038670 2066277 2090050 2106242
50366 2106242 2111919 2104997 2084134 2049301 2002451 1947077 1886835 1824636 1762707 1702823 1646205 1593636
50354 1593636 1545963 1504150 1468467 1437916 1410919 1386468 1364134 1342985 1320978 1295751 1266042
50343 1266042 1232473 1197236 1162943 1131421 1103381 1079098 1059008 1043259 1031042 1021131 1013171 1007750
50331 1007750 1005024 1004004 1003646 1004069 1006063 1009819 1014792 1020562 1027126 1034376 1041928 1049579 1057501 1065938
50317A065938R129J0021J0935J1352J0999J0255R578Q975Q367Q059Q291Q841R570
50304A190310J0942J3273J5927J8114K0206K3382K8084L3716L9998M7692N7488
50293A499132O8421P7252P9035O9054M6069J4585j6950m1334n6295o3434o4960
50282A610575o2307n6868n0262m3432l6323k8904k1848j5931j1232p302l833q41
50270A271492J565L315M369M922N466O326P220P549P253P049P645Q910J0188J1238
50256A364507J2501J4298J6102J6911J6244J4575J2846J1697J1132J0738J0152
50245A511703R417Q787Q243P234N088J596k828p461j1571j4547j5958j5627j3663
50232A470413j0476o626k629J140M054M894K430l336j0830j8084k4029k8392l0925
$$ plain form
50317 1065938 1075067 1085088 1096023 1107375 1118374 1128629 1138207 1147182 1155549 1163608 1171899 1180740 1190310
50304 1190310 1201252 1214525 1230452 1248566 1268772 1292154 1320238 1353954 1393952 1441644 1499132
50293 1499132 1567553 1644805 1723840 1792894 1838963 1853548 1836598 1795264 1738969 1675535 1610575
50282 1610575 1548268 1491400 1441138 1397706 1361383 1332479 1310631 1294700 1283468 1276166 1272333 1271492
50270 1271492 1273057 1276372 1280741 1285663 1291129 1297455 1304675 1312224 1319477 1326526 1334171 1343081 1353269 1364507
50256 1364507 1377008 1391306 1407408 1424319 1440563 1455138 1467984 1479681 1490813 1501551 1511703
50245 1511703 1521120 1529907 1538150 1545384 1550472 1552068 1549240 1541779 1530208 1515661 1499703 1484076 1470413
50232 1470413 1459937 1453311 1450682 1451822 1455876 1460770 1463200 1459864 1449034 1430950 1406921 1378529 1347604
50219A347604l1413l0336k8793k7572k6668k5655k4211k2225j9940j7978j6849
50208A075964j6293j5569j4355j2950j1584j0153q759p864p598p477p161o974
50196I49227p235p602p538p054o460n778m934m185l801l615l414l472m041m674
50182H75424m747m376m040l537k424j303j416k756l789l619l174l414l518k142
50168H31169K63J854J846J212Q99P99P47J265K544L615L472K524K141K999M567
50153H61916O036P180Q328R956J2300J5079J7638J9545K0926K2023K2839K3553
50141A047319K4803K6990K9452L1002L1278L0988L0870L0986L1212L1841L3342
50130A380083L5736L8405M0302M0291L7620L2216K4460J4822L979o858j6369k4008
$$ plain form
50219 1347604 1316191 1285855 1257062 1229490 1202822 1177167 1152956 1130731 1110791 1092813 1075964
50208 1075964 1059671 1044102 1029747 1016797 1005213 995060 986301 978437 970839 963362 956201 949227
50196 949227 941992 934390 926852 919798 913338 907560 902626 898441 894640 891025 887611 884139 880098 875424
50182 875424 870677 866301 862261 858724 856300 854997 853581 850825 847036 843417 840243 836829 833311 831169
50168 831169 831432 833286 835132 836344 837243 838042 838789 840054 842598 846213 849685 852209 854350 857349 861916
50153 861916 867952 875132 883460 893416 905716 920795 938433 957978 978904 1000927 1023766 1047319
50141 1047319 1072122 1099112 1128564 1159566 1190844 1221832 1252702 1283688 1314900 1346741 1380083
50130 1380083 1415819 1454224 1494526 1534817 1572437 1604653 1629113 1643935 1647914 1641056 1624687 1600679
50118A600679l0082l4871l8169l9838m0176l9469l7561l4324l0145k5666k1299
50107A229079j7397j4520j3001j2397j1951j1519j1613j2412j3154j2887j1658
50096A086570j0698j1211j3044j4736j4962j3728j1989j0373q713o741m660k932
50084I62783j857j438j368j036OJ474K620L152L518M239N402O945Q874J0891J2313
50069A016518J2657J2031J0853R553Q640Q423Q435P729O022M037K461J257K09
50056A108825o49j522k947m812o085o188n831n860n989n532m551l420k003l08
50042A053128Q77J232K025M526P875J0113J0999J2032J3873J5497J6223J6832
50030A165232J8159J9989K1921K3947K5639K6008K4948K3706K3278K3385K3607
$$ plain form
50118 1600679 1570597 1535726 1497557 1457719 1417543 1378074 1340513 1306189 1276044 1250378 1229079
50107 1229079 1211682 1197162 1184161 1171764 1159813 1148294 1136681 1124269 1111115 1098228 1086570
50096 1086570 1075872 1064661 1051617 1036881 1021919 1008191 996202 985829 977116 970375 965715 962783
50084 962783 960926 959488 958120 957084 957090 958564 961184 964336 967854 972093 977495 984440 993314 1004205 1016518
50069 1016518 1029175 1041206 1052059 1061612 1070252 1078675 1087110 1094839 1100861 1104898 1107359 1108616 1108825
50056 1108825 1108176 1106654 1103707 1098895 1092810 1086622 1080791 1074931 1068942 1063410 1058859 1055439 1053436 1053128
50042 1053128 1054005 1055237 1057262 1061788 1069663 1079776 1090775 1102807 1116680 1132177 1148400 1165232
50030 1165232 1183391 1203380 1225301 1249248 1274887 1300895 1325843 1349549 1372827 1396212 1419819
50019A419819K4198K5050K5097K3819K2162K0777J8440J3722P523K392l74j585
50007A601040k476l640n689r481j5126k1532k7351l1882l4928l6385l6225l4463
49995A341862l1097k6581k2218j9433j8423j7994j6963j5266j3657j2800j2903
49984A134527j3931j5720j7934k0001k1207k1092j9828j8127j6572j5235j4045
49973I40835j3118j2458j1666j0389q845p463o231m893l663l155l581m480n279
49960H45614n713n661n009l820k283m04J996M787P380R252J0508J1645J2839J3559
$$ plain form
50019 1419819 1444017 1469067 1494164 1517983 1540145 1560922 1579362 1593084 1600607 1602999 1602625 1601040
50007 1601040 1598564 1594924 1589235 1579754 1564628 1543096 1515745 1483863 1448935 1412550 1376325 1341862
49995 1341862 1310765 1284184 1261966 1242533 1224110 1206116 1189153 1173887 1160230 1147430 1134527
49984 1134527 1120596 1104876 1086942 1066941 1045734 1024642 1004814 986687 970115 954880 940835
49973 940835 927717 915259 903593 893204 884359 876896 870665 865772 862109 858954 855373 850893 845614
49960 845614 839901 834240 829231 825411 823128 822724 824720 829507 836887 846139 856647 868292 881131 894690
$$ [...]
##END NTUPLES=NMR SPECTRUM
##END=
