##TITLE=AC1438_TSUAH13247_9682906_bZb27pm7b5
##JCAMPDX= 6.0         $$ Bruker NMR JCAMP-DX V2.0
##DATA TYPE= NMR SPECTRUM
##DATA CLASS= NTUPLES
##ORIGIN= BRUKER
##OWNER= Administrator
$$ 1.72 TOPSPIN		Version 2.1
$$ 2016-04-16 21:54:26.298 -0700  Administrator@X
$$ Compression mode = diff/dup
##.OBSERVE FREQUENCY= 400.02188249412
##.OBSERVE NUCLEUS= ^1H
##.ACQUISITION MODE= SIMULTANEOUS (DQD)
##.ACQUISITION SCHEME= undefined
##.AVERAGES= 8
##.DIGITISER RES= 22
##SPECTROMETER/DATA SYSTEM= spect
##.PULSE SEQUENCE= zg30
##.SOLVENT NAME= COFFEE_meoh
##.SHIFT REFERENCE= INTERNAL, COFFEE_meoh, 1, 14.98509
##AUDIT TRAIL= $$ (NUMBER, WHEN, WHO, WHERE, PROCESS, VERSION, WHAT)
$$ ##TITLE= Audit trail, TOPSPIN		Version 2.1
$$ ##JCAMPDX= 5.01
$$ ##ORIGIN= Bruker BioSpin GmbH
$$ ##OWNER= Administrator
$$ $$ E:\/data/COFFEE/nmr/AC1438_TSUAH13247_9682906_bZb27pm7b5/30/pdata/1/auditp.txt
$$ ##AUDIT TRAIL=  $$ (NUMBER, WHEN, WHO, WHERE, PROCESS, VERSION, WHAT)
(   1,<2016-04-16 21:54:19.111 -0700>,<Administrator>,<X>,<go>,<TOPSPIN 2.1>,
      <created by zg
	started at 2016-04-16 21:53:13.408 -0700,
	POWCHK enabled, PULCHK disabled,
       configuration hash MD5:
       21 0F 79 D6 B3 7B B4 F6 88 20 88 DB 03 48 BD 9F
       data hash MD5: 64K
       30 52 AF 2F D9 5B F6 74 C3 CA BE 25 8E 09 1A 45>)
(   2,<2016-04-16 21:54:22.314 -0700>,<Administrator>,<X>,<proc1d>,<TOPSPIN 2.1>,
      <Start of raw data processing
       efp LB = 0 FT_mod = 6 PKNL = 1 PHC0 = 0 PHC1 = 0 SI = 32K 
       data hash MD5: 32K
       07 38 F9 8A E7 4B 10 35 67 6D 96 D2 3C EC B0 E6>)
(   3,<2016-04-16 21:54:22.595 -0700>,<Administrator>,<X>,<proc1d>,<TOPSPIN 2.1>,
      <pk PHC0 = 91.29639 PHC1 = 0 
       data hash MD5: 32K
       7E AF 31 EC 47 F7 B6 E8 95 16 1B 97 3E 8A 08 05>)
(   4,<2016-04-16 21:54:22.704 -0700>,<Administrator>,<X>,<proc1d>,<TOPSPIN 2.1>,
      <abs ABSG = 1 
       data hash MD5: 32K
       03 A8 3A 90 89 4A 63 E2 A5 B6 46 52 E3 ED ED D8>)
(   5,<2016-04-16 21:54:22.767 -0700>,<Administrator>,<X>,<proc1d>,<TOPSPIN 2.1>,
      <abs ABSG = 2 
       data hash MD5: 32K
       9F 3C DF 9F A6 54 35 AC 7B B7 FB 61 AE 5F 4E A7>)
(   6,<2016-04-16 21:54:22.829 -0700>,<Administrator>,<X>,<proc1d>,<TOPSPIN 2.1>,
      <abs ABSG = 3 
       data hash MD5: 32K
       70 34 86 7F B6 71 9A 15 DC A0 74 F6 08 E0 10 44>)
(   7,<2016-04-16 21:54:22.892 -0700>,<Administrator>,<X>,<proc1d>,<TOPSPIN 2.1>,
      <abs ABSG = 4 
       data hash MD5: 32K
       8E 36 BA 19 81 1B B3 3A 0E B7 0D B3 CF 85 47 74>)
(   8,<2016-04-16 21:54:22.939 -0700>,<Administrator>,<X>,<proc1d>,<TOPSPIN 2.1>,
      <abs ABSG = 5 
       data hash MD5: 32K
       F0 54 1C 5E 50 9E CB CA 92 C0 59 09 CB 7F C5 B7>)
$$ ##END=
$$ 
$$ $$ hash MD5
$$ $$ 72 CD 29 F1 C4 89 43 E1 B2 B8 82 9C AA 42 4D 54
##$RELAX= 
##$RELAX= 
##$RELAX= 
##$RELAX= 
##$RELAX= 
##$RELAX= 
##$RELAX= 
$$ Bruker specific parameters
$$ --------------------------
##$DU= <E:\>
##$EXPNO= 30
##$NAME= <AC1438_TSUAH13247_9682906_bZb27pm7b5>
$$ [...]
##$TP= (0..7)
150 150 150 150 150 150 150 150
##$TP07= 0
##$TPNAME0= <>
##$TPNAME1= <>
##$TPNAME2= <>
##$TPNAME3= <>
##$TPNAME4= <>
##$TPNAME5= <>
##$TPNAME6= <>
##$TPNAME7= <>
##$TPOAL= (0..7)
0.5 0.5 0.5 0.5 0.5 0.5 0.5 0.5
##$TPOFFS= (0..7)
0 0 0 0 0 0 0 0
##$TUNHIN= 0
##$TUNHOUT= 0
##$TUNXOUT= 0
##$USERA1= <user>
##$USERA2= <user>
##$USERA3= <user>
##$USERA4= <user>
##$USERA5= <user>
##$V9= 5
##$VALIST= <valist>
##$VCLIST= <CCCCCCCCCCCCCCC>
##$VD= 0
##$VDLIST= <DDDDDDDDDDDDDDD>
##$VPLIST= <PPPPPPPPPPPPPPP>
##$VTLIST= <TTTTTTTTTTTTTTT>
##$WBST= 2048
##$WBSW= 25
##$XGAIN= (0..3)
0 0 0 0
##$XL= 0
##$YL= 0
##$YMAX_a= 607742
##$YMIN_a= -520004
##$ZGOPTNS= <>
##$ZL1= 120
##$ZL2= 120
##$ZL3= 120
##$ZL4= 120
##$ABSF1= 14.98509
##$ABSF2= -5.573092
##$ABSG= 5
##$ABSL= 3
##$ALPHA= 0
##$AQORDER= 0
##$ASSFAC= 0
##$ASSFACI= 0
##$ASSFACX= 0
##$ASSWID= 0
##$AUNMP= <proc_prof1d_extract_pilot.lims>
##$AXLEFT= 0
##$AXNAME= <>
##$AXNUC= <1H>
##$AXRIGHT= 0
##$AXTYPE= 0
##$AXUNIT= <>
##$AZFE= 0.1
##$AZFW= 0.1
##$BCFW= 0
##$BC_mod= 0
##$BYTORDP= 0
##$COROFFS= 0
##$CY= 15
##$DATMOD= 1
##$DC= 0
##$DFILT= <>
##$DTYPP= 0
##$F1P= 0
##$F2P= 0
##$FCOR= 0.5
##$FTSIZE= 32768
##$FT_mod= 6
##$GAMMA= 0
##$GB= 0
##$INTBC= 1
##$INTSCL= 1
##$ISEN= 128
##$LB= 0
##$LEV0= 0
##$LPBIN= 0
##$MAXI= 10000
##$MC2= 0
##$MEAN= 0
##$ME_mod= 0
##$MI= 0
##$NCOEF= 0
##$NC_proc= -8
##$NLEV= 6
##$NOISF1= 0
##$NOISF2= 0
##$NSP= 0
##$NTH_PI= 0
##$NZP= 0
##$OFFSET= 14.98509
##$PC= 1
##$PHC0= 91.29639
##$PHC1= 0
##$PH_mod= 1
##$PKNL= yes
##$PPARMOD= 0
##$PPDIAG= 0
##$PPIPTYP= 0
##$PPMPNUM= 2147483647
##$PPRESOL= 1
##$PSCAL= 4
##$PSIGN= 0
##$PYNMP= <proc.py>
##$REVERSE= no
##$SF= 400.02
##$SI= 32768
##$SIGF1= 0
##$SIGF2= 0
##$SINO= 400
##$SIOLD= 32768
##$SPECTYP= <>
##$SREGLST= <1H.CDCl3>
##$SSB= 0
##$STSI= 32768
##$STSR= 0
##$SW_p= 8223.68421052631
##$SYMM= 0
##$S_DEV= 0
##$TDeff= 65536
##$TDoff= 0
##$TI= <>
##$TILT= no
##$TM1= 0
##$TM2= 0
##$TOPLEV= 0
##$USERP1= <user>
##$USERP2= <user>
##$USERP3= <user>
##$USERP4= <user>
##$USERP5= <user>
##$WDW= 1
##$XDIM= 32768
##$YMAX_p= 441072931
##$YMIN_p= -676658
##$CURPLOT= <Network HP LaserJet P1505>
##$CURPRIN= <$Network HP LaserJet P1505>
##$DFORMAT= <normdp>
##$LAYOUT= <+/1D_H.xwp>
##$LFORMAT= <normlp>
##$PFORMAT= <normpl>
##$SURQMSG= 1
$$ End of Bruker specific parameters
$$ ---------------------------------
##NTUPLES= NMR SPECTRUM
##VAR_NAME=  FREQUENCY,     SPECTRUM/REAL,   SPECTRUM/IMAG
##SYMBOL=    X,             R,               I
##VAR_TYPE=  INDEPENDENT,   DEPENDENT,       DEPENDENT
##VAR_FORM=  AFFN,          ASDF,            ASDF
##VAR_DIM=   32768,         32768,           32768
##UNITS=     HZ,            ARBITRARY UNITS, ARBITRARY UNITS
##FACTOR=    0.250966925370066, 1,           1
##FIRST=     8223.43324360094, 187062,       65550
##LAST=      0,             9336,            -69881
##MIN=       0,             -676658,         0
##MAX=       8223.43324360094, 441072931,    0
$$ Real data points
##PAGE= N=1
##DATA TABLE= (X++(R..R)), XYDATA
$$ [...]
$$ plain form
19547 -46889 -138145 63436 -67969 -220374 -299805 -15112 -24863 -525865 -321255 -135072 -161355
19536 -161355 -70736 -23531 144477 280216 -195983 -81516 -29383 -249040 125 -301215 417974
19524 -106368 -274760 -74142 -52840 74405 -58050 -261352 -437238 -16489 -68642 78207 190793
19513 190793 84851 77788 -26652 -62649 81070 8112 303243 -324249 -141815 167064 116901
19502 116901 122170 32638 -166351 -199262 -63993 -164623 -3355 134397 -144748 -15208 -168066
19491 -168066 -45582 -44521 252 -522417 -92207 -95197 36614 -109668 -128784 -488239 -41164 -213415
19479 -213415 -173589 -24219 -9187 37506 -55464 -339226 -68374 60575 -259464 77225 -194157
19467 394 -115531 -227963 115404 -80110 -357073 41840 -298139 -139859 151524 207768 133327
$$ packed form
19547d6889r1256F3436f7969j52405p9431a5112r751n01002K04610a35072k6283
19536a61355g0736b3531A44477J35739a95983h1516b9383k19657A25c01215D17974
19524a06368j68392g4142K1302G4405e8050k03302j75886a6489n2153G8207J12586
19513A90793H4851p063b6652l5997H1070H112K95131c24249a41815A67064n0163
19502A16901N269C2638a66351l2911f3993j00630c355A34397a44748a5208j52858
19491a68066d5582J061B52e22417i2207k990C6614a09668j9116l59455d1164j72251
19479b13415L9826b4219i187C7506e5464k83762f8374F0575b59464G7225a94157
19467C94a15531j12432A15404h0110k76963D1840b98139a39859A51524N6244p4441
$$ plain form
19456 133327 -83625 -36440 -244537 859 -135931 -172208 -85528 -368862 70568 -20728 63922
19444 -338188 -19825 102420 151251 -12618 -205642 -152903 -265797 -120420 123695 -30954
19433 195700 -194832 320509 8790 -20373 431666 -79114 -268679 -187557 -88127 53048 -326040
19421 -262438 -153695 -49140 -143768 65936 -171684 -24849 73638 -67391 -98048 136278 -13598
19409 113983 -293165 -288081 102225 -155844 -272533 -162573 191261 157287 -272323 134130
19398 34680 132594 -267252 39393 467330 -314333 -109608 262208 111278 -128244 -333763
19388 -333763 180212 -483393 -15641 251687 66249 -127482 86787 -503521 -35483 75302
19377 245186 194525 -82737 56959 10922 -226872 -327110 91123 -342130 -81579 -400580 62732
$$ packed form
19456A33327h3625c6440k08097H59a35931l6277h5528k83334G0568b0728F3922
19444c38188a9825A02420M8831a2618j93024N2739j12894a20420A23695c0954
19433A95700a94832C20509H790b0373D31666g9114j89565Q1122h8127E3048c26040
19421b62438J08743d9140r4628F5936a71684b4849G3638f7391l0657A36278a3598
19409A13983b93165N084A02225a55844j16689J09960A91261l3974b72323A34130
19398C4680R7914b67252C9393M27937c14333a09608B62208A11278a28244k05519
19388c33763A80212d83393a5641B51687F6249a27482H6787e03521c5483G5302
19377B45186n0661h2737E6959A0922b26872j00238I1123c42130h1579l19001F2732
$$ plain form
19365 -137390 173007 65177 -106279 108998 75223 -83573 63951 -99367 -215603 -178617 -95478
19354 -95478 -210313 13960 -107899 -133638 -101872 -88766 259576 -13225 -19812 180854 50121
19342 3369 -128872 98195 -129985 150975 167579 -87851 241713 -70010 -72926 -21970 -114125
19331 -114125 130591 -48143 -213422 -156227 49471 -167695 -462755 -178933 90297 -173359
19320 -115004 79652 -371661 22950 240375 -16874 -251360 -195361 126452 54155 290922
19310 290922 -372108 -108526 217888 -70024 22455 281156 -90457 48631 106896 25058 -230640
19298 -46420 -192025 -21615 -91286 -109986 122162 -46125 -272072 -210688 -22255 -72179 -80824
19287 -80824 -263809 12682 -271367 -9875 -340130 347962 -294807 -96094 -92010 -339603 50911
$$ packed form
19365a37390A73007F5177a06279A08998l3775h3573F3951i9367j16236L6986Q3139
19354i5478j14835A3960a07899k5739L1766J3106B59576a3225o587A80854E0121
19342C369a28872I8195a29985A50975J6604h7851B41713g0010k916b1970r2155
19331a14125A30591d8143j65279N7195D9471a67695k95060a78933I0297a73359
19320a15004G9652c71661B2950K17425a6874k34486N5999A26452E4155K36767
19310B90922c72108a08526B17888g0024B2455K58701i0457D8631N8265B5058b30640
19298d6420j45605b1615o9671j8700A22162d6125k25947O1384b2255m9924q645
19287h0824j82985A2682b71367i875l30255C47962b94807i6094M084k47593E0911
$$ plain form
19275 -121624 -105947 -35182 79047 46924 -30778 -252238 -263850 172619 -150513 -43103 -219631
19264 -219631 -50349 17948 -137286 -133020 -384849 27796 -56849 -98794 -479174 40418 39734
19253 39734 23016 182259 -212329 -257685 -14929 -879 218064 119241 -402588 67366 -142113
19241 -167657 -107812 66922 -112823 17939 -149045 164649 -144797 89400 -134734 -45447
19230 -150714 -39089 -177871 6537 -58069 174615 234317 -39949 19500 -223529 208806 -164571
19218 -141110 -74376 -290190 126247 -30142 -428278 -146238 162676 48378 -100491 -494400
19208 -494400 -124242 -297454 320523 -25698 96760 49420 -67625 -117246 -228883 -448242
19198 -448242 -236500 221625 -80793 180080 34949 -260410 -266087 -140146 -98398 173664
$$ packed form
19275a21624J5677c5182G9047l2123c0778k21460j1612A72619a50513d3103j76528
19264b19631e0349A7948a37286M266k51829B7796e6849m1945l80380D0418o84
19253C9734j6718J59243b12329m5356a4929h79B18064r8823d02588F7366a42113
19241a67657N9845F6922a12823A7939a49045A64649a44797H9400a34734d5447
19230a50714c9089j38782F537e8069A74615N9702c9949A9500b23529B08806a64571
19218a41110O6734k15814A26247c0142l98136a46238A62676D8378a00491l93909
19208d94400a24242j73212C20523b5698I6760m7340f7625m9621j11637k19359
19198d48242K11742B21625h0793A80080C4949b60410n677J25941M1748A73664
$$ plain form
19187 190690 -130723 119981 -35568 -159820 -48003 -60630 -360745 132703 -20669 -133718
19177 -133718 27777 -331645 -25378 -96697 -286170 -13266 -59949 24258 283940 -224294 67453
19165 -78797 81763 50752 -353935 87810 -152212 -21592 116424 -38657 -297971 13257 -16753
19153 194105 -189548 33325 -9213 -9934 -17980 -1079 216114 81799 124375 -286343 -308324 139522
19140 -250675 -254526 123955 269016 23293 32798 44768 48070 -142914 173340 -54618 -190691
19129 -190691 -235647 142804 -76700 -106940 103042 -150420 -379769 -6774 -11403 -180691 56023
19117 -80958 -228042 -68340 34449 -233919 -269885 13266 -58851 -85471 -441410 113286 -211100
19105 14478 -122369 -185027 -55304 -337208 -45118 297620 -10495 163710 97976 -182052 -62004
$$ packed form
19187A90690a30723A19981c5568j24252d8003j2627l00115A32703b0669j13049
19177a33718B7777c31645b5378p1319j89473a3266m6683B4258K59682b24294F7453
19165g8797H1763l1011c53935H7810a52212b1592A16424c8657k59314A3257a6753
19153A94105a89548C3325i213p21q046a079B16114H1799M2576b86343k1981A39522
19140b50675l851A23955J45061B3293R505J1970L302a42914A73340e4618j36073
19129a90691m4956A42804g6700l0240A03042a50420k29349f774m629j69288E6023
19117h0958j47084f8340C4449b33919l5966A3266e8851k6620l55939A13286b11100
19105A4478a22369o2658e5304k81904d5118B97620a0495A63710o5734a82052f2004
$$ plain form
19093 -195465 -65519 -14986 90611 -187452 -195117 119774 -332721 32665 -307273 193847 -22412
19081 -284664 -26893 -319321 60785 132079 341740 208865 -192918 224946 313406 73282
19070 -154911 -186411 39549 -118710 23083 -171085 -158011 65187 -224159 -100230 -263249
19060 -263249 -81412 33744 -104199 -42633 -251691 -145773 -36066 116477 -222002 -124438
19050 -124438 -11404 280083 166378 61959 72666 -41451 50561 -138003 82669 -240896 50400
19038 82610 -9838 25149 -36802 91471 102535 -108853 -10234 -5086 -2016 -27868 -24035 14060
19025 508626 122902 -288693 -85468 70397 -34404 -180603 -102492 165968 204980 183575 -10073
19013 -176942 -122547 -219937 -159059 -137688 10317 -116048 47442 100935 104900 -382359 -44598
$$ packed form
19093a95465f5519a4986I0611a87452p665A19774c32721C2665c07273A93847b2412
19081b84664b6893k92428F0785P1294K09661j32875a92918B24946Q8460G3282
19070a54911l1500C9549a18710B3083a71085J3074F5187b24159a00230j63019
19060b63249h1412C3744a04199d2633k09058J05918c6066A16477b22002R7564
19050a24438a1404B80083j13705F1959J0707d1451E0561a38003H2669b40896E0400
19038H2610i838B5149c6802I1471J1064a08853a0234e086b016k5852L833A4060
19025E08626A22902b88693h5468G0397c4404j46199P8111A65968L9012k1405a0073
19013a76942N4395r7390O0878K1371A0317a16048D7442N3493L965c82359d4598
$$ plain form
19001 20191 -239614 265160 -124387 85733 -129887 175544 14644 -100615 -168161 42942
18990 -109860 136092 89261 -67587 -232558 140330 119568 -50047 -30993 -302425 65165 -27931
18978 -109331 -194688 -15849 11082 -96526 31180 63683 -117710 -155595 -44299 14421 -62712
18966 -113165 -253481 22384 158784 170381 29127 -256721 134662 -165554 87455 199465
18956 199465 -94332 -169345 -7117 139041 117657 145841 -270994 -130992 -46132 -80453 -143897
18945 -143897 -76346 218603 129138 -19547 -171774 52112 -257448 -114251 123040 -82291
18934 263468 105491 219138 2400 -304319 62208 -171168 -155458 -108547 236537 7444 -178582
18922 -85654 -31936 -31867 -239145 -254015 -11582 -332395 -9186 -248478 156012 65545 88008 -101047
$$ packed form
19001B0191b39614B65160a24387H5733a29887A75544A4644a00615o7546D2942
18990a09860A36092m6831f7587j64971A40330k0762e0047J9054k71432F5165b7931
18978a09331q5357a5849A1082i6526C1180L2503a17710l7885d4299A4421f2712
18966a13165j40316B2384J36400J1597B9127b56721A34662a65554H7455J12010
18956A99465i4332p5013g117A39041k1384K8184b70994a30992d6132l4321o3444
18945a43897O7551B18603q9465a9547j52227E2112b57448a14251A23040h2291
18934B63468A05491J13647B400c04319F2208a71168J5710M6911B36537G444a78582
18922h5654c1936O9k07278j4870a1582l20813i186k39292A56012F5545K2463a01047
$$ plain form
18909 170417 448221 -38195 72499 -17967 181557 -250837 -213073 -248570 183422 -3628 100514
18897 -45565 144460 -16083 -308266 -160728 -193259 15309 -34209 -159366 36465 -30182 109362
18885 -266407 -86255 -135066 -44627 155044 145252 -244620 -185397 -74574 -146894 -39553 -366455
18874 -366455 -210122 213026 49025 -29058 30519 242077 -287536 -23613 -110802 -108316 -32465
18862 -277008 -110447 32438 356905 -146602 102874 148776 -2399 -50549 130714 -229348
18851 -66947 -304010 -52471 137634 152610 110290 369832 -122546 -238121 -59287 129792
18840 -297640 34701 -83086 -134193 -61291 21137 -49406 -231279 134178 -28342 -263147 9099
18828 97476 -253083 346311 154908 -282649 -17200 -62081 -343597 -69519 258756 -153437
$$ packed form
18909A70417K77804c8195G2499a7967A81557b50837L7764l5497A83422c628A00514
18897d5565A44460a6083k92183J47538l2531A5309c4209j25157C6465c0182A09362
18885b66407h6255m8811d4627A55044r792b44620N9223g4574p2320c9553l26902
18874c66455J56333B13026D9025b9058C0519K11558b87536b3613q7189K486c2465
18862b77008a10447C2438L24467a46602A02874M5902b399m8150A30714b29348
18851f6947k37063e2471A37634J4976m2320K59542a22546j15575e9287A29792
18840b97640C4701h3086n1107f1291B1137d9406j81873A34178b8342k34805I099
18828I7476b53083C46311A54908b82649a7200m4881k81516f9519B58756a53437
$$ plain form
18817 -275360 158521 -94752 -140944 -100372 108521 254227 295708 170677 -74895 73411 -55948
18805 164112 145681 40174 -160692 -335001 -352092 128527 -239159 -19703 240573 30454
18794 -98432 -85762 35517 75778 -26402 59367 -226424 -86383 91278 -215943 135086 -308115
18782 -86838 92273 -148918 -406056 -68357 -116318 351649 78440 17937 121814 -142587 153457
18770 -75361 -19852 154047 181528 -276163 18783 -226894 91293 122456 -13009 19391 156252
18759 156252 27747 175833 -591712 52637 37687 83078 120970 -163183 86569 -188339 63608
18747 -170577 171998 74224 30302 -112184 113251 -274701 -80311 -304145 48942 -199463
18736 -340193 -81776 -180325 -218384 -300858 54925 -149231 -414898 220849 -111536 -16875 -87959
$$ packed form
18817b75360A58521i4752m6192M0572A08521J45706M1481j25031g4895G3411e5948
18805A64112j8431D0174a60692j74309j7091A28527b39159a9703B40573C0454
18794i8432J2670C5517M0261b6402E9367b26424h6383I1278b15943A35086c08115
18782h6838I2273a48918k57138f8357m7961C51649G8440A7937J03877a42587A53457
18770g5361a9852A54047K7481b76163A8783b26894I1293L1163a3009A9391J36861
18759A56252B7747J48086e91712E2637j4950M5391L7892a63183H6569a88339F3608
18747a70577A71998G4224C0302a12184A13251b74701h0311k23834D8942a99463
18736c40193h1776r8549l8059q2474E4925a49231k65667B20849a11536a6875p1084
$$ plain form
18725 -87959 80821 -366020 -105896 -261523 -37224 -139094 -134458 53349 -23824 -149450 -24134
18713 -79923 -148802 -94235 42942 25754 -79130 -150030 200609 340810 290985 179138 -160225
18701 -59250 -291081 -305862 -113308 -203794 213119 -24818 306649 -320577 24318 237172
18691 237172 -301662 -64908 139492 -487682 -368006 -39745 116127 -234001 142619 224839
18681 224839 -161807 90745 -305489 85426 -160944 97064 -142086 -347888 -87901 182013
18670 68007 -133291 -113893 158397 31317 219506 -68240 66269 76360 -159772 -48624 -297105
18659 -297105 -55244 -258798 -237283 -123570 51943 123919 88506 349 -39729 -207927 -128412
18648 -128412 -130096 -260626 -119817 -129084 -106059 -103425 -38879 8921 71538 589 -27830 -173326
$$ packed form
18725h7959H0821c66020a05896j55627c7224j01870M636E3349b3824j25626b4134
18713g9923o8879N4567D2942j7188g9130p0900B00609J40201m9825j11847a60225
18701e9250k31831j4781a13308r0486B13119b4818C06649c20577B4318K12854
18691B37172c01662f4908A39492d87682J19676c9745A16127b34001A42619Q2220
18681B24839a61807I0745c05489H5426a60944I7064a42086k05802h7901A82013
18670F8007a33291J9398A58397C1317J88189f8240F6269J0091a59772d8624k48481
18659b97105e5244k03554K1515J13713E1943P1976l5413C49c9729j68198P9515
18648a28412j684j30530a19817r267K3025K634c8879H921O2617E89b7830j45496
$$ plain form
18636 -173326 -161034 18920 -69183 30798 -323025 264807 231674 -190834 227054 -258011
18625 -141457 -238932 -48039 209570 76387 200967 -434072 -255171 308326 -104776 -10108
18614 -289742 262516 -6572 99810 -162207 -57085 200369 83642 -1061 -105603 -65502 -107690
18603 -107690 -10388 -149480 -209230 116270 -1736 -378093 91850 139114 -11637 -113091 -39641
18591 113297 -241985 65576 11145 -77200 -94028 176884 -33558 383298 80597 -219854 139926
18579 231435 302881 -157594 6054 -177465 154637 -43217 -232024 22754 -459264 -92120 -218165
18568 -218165 -40323 -166010 -27864 -162469 44813 -100924 151715 28687 101873 -179238
18557 -112176 87795 135179 -21015 -248025 -109466 -56208 -364323 192855 -74648 -225721
$$ packed form
18636a73326J2292A8920f9183C0798c23025B64807l3133a90834B27054b58011
18625a41457r7475d8039B09570G6387J24580d34072J78901C08326a04776a0108
18614b89742B62516f572I9810a62207e7085B00369H3642a061j04542M0101m2188
18603a07690a0388j39092n9750A16270a736l76357I1850M7264a1637j01454c9641
18591A13297b41985F5576A1145g7200j6828A76884c3558C83298H0597b19854A39926
18579B31435P1446a57594F054a77465A54637d3217j88807B2754d59264i2120j26045
18568b18165d0323j25687b7864j34605D4813a00924A51715B8687P3186a79238
18557a12176H7795M7384b1015k27010a09466N3258l08115A92855g4648j51073
$$ plain form
18547 -225721 -73060 65045 -323050 -14691 47661 -60839 -66569 -156860 -102024 -10766 -77291
18536 -77291 139045 -287253 -95001 203438 -258896 6961 -186016 -82844 56907 -64475 -62033
18525 -62033 -128972 -84135 -421 -248963 233084 86133 -342530 161182 64495 -271064 -331543
18514 -331543 413586 181622 -262179 121659 97757 226704 -64260 99428 32078 115345
18504 115345 -250406 -15340 -158130 -67283 5300 189345 -109673 -65395 156256 -52261 66065
18492 -79583 24718 26770 344932 -4512 197885 5677 -132458 -258559 -33143 -484883 191021
18480 105069 217917 -108040 -96247 -216153 -137254 107853 94963 90126 -60960 50262 -269295
18468 44911 90026 -42192 -89421 132242 90069 69996 128530 10907 46841 -143211 118385
$$ packed form
18547b25721g3060F5045c23050a4691D7661f0839n730r0291N4836a0766o6525
18536g7291A39045b87253i5001B03438b58896F961a86016h2844E6907f4475K442
18525f2033o6939M4837d21k48542B33084H6133c42530A61182F4495b71064o0479
18514c31543D13586A81622b62179A21659k3902J28947f4260I9428C2078Q3267
18504A15345b50406a5340j42790f7283E300J84045a09673M4278A56256e2261F6065
18492g9583B4718K052L18162d512A97885E677a32458j26101c3143m51740A91021
18480A05069J12848a08040J1793j19906P8899A07853j2890m837f0960E0262b69295
18468D4911M5115d2192m7229A32242m2173k0073N8534A0907L5934a43211A18385
$$ plain form
18456 -74381 -48111 -29375 191914 -135751 -281847 106908 150443 2324 -16945 -158202 -86905
18445 -86905 -149456 132 308490 191033 -103621 129417 -204265 116632 -208909 40142 92210
18434 92210 -7407 -259728 -35016 -283734 -201596 -188064 164657 20971 -40932 -139987 -16634
18422 -258273 251391 -117072 -326490 -57398 -126919 -107033 28232 56110 102683 -109371 208923
18410 181691 -37569 -6737 -221113 142647 -30815 -117775 162036 -167736 106601 -211626
18399 -128507 114039 101616 -180506 293392 -119319 48085 48840 -37737 -115004 -74989 18853
18387 -96445 303519 -12985 -82884 -252860 -77296 87881 230740 -112035 -5484 -265228 -512137
18376 -512137 36024 96018 179052 -135893 -171269 -283625 -218776 117959 -265765 -287861 54304
$$ packed form
18456g4381K6270J8736A91914a35751j46096A06908M3535B324a6945j41257P1297
18445h6905o2551A32L08358j17457a03621A29417b04265A16632b08909D0142N2068
18434I2210g407k52321c5016k48718Q2138J3532A64657B0971d0932r9055a6634
18422b58273B51391a17072k09418e7398o9521J9886B8232K7878M6573a09371B08923
18410A81691c7569f737k14376A42647c0815q6960A62036a67736A06601b11626
18399a28507A14039j2423a80506B93392a19319D8085P55c7737p7267M0015A8853
18387i6445C03519a2985o9899j69976g7296H7881J42859a12035e484k59744k46909
18376e12137C6024N9994Q3034a35893l5376j12356O4849A17959b65765k2096E4304
$$ plain form
18364 163198 -112514 -236799 85904 -36880 90826 -12950 131010 -84328 -54453 -57381 -309056
18353 -309056 170925 119249 171579 27037 108240 -168950 -92655 -77366 75129 242583 -94187
18341 100579 49927 99837 11309 -102055 -131107 -115664 -242665 -95516 -108611 46408 215964
18330 215964 23007 -93495 -140 -256153 78890 -403908 278642 -89538 -57752 -105841 -3183
18318 69860 -361131 -13908 15185 -186062 182444 -144253 68307 55103 9623 40974 -157622
18306 -54090 -108619 -328949 112629 -196376 -231728 184484 38121 -203413 -66748 -105750 -40152
18294 63653 -166674 18174 -219467 -134529 -213027 309757 -249108 -404407 -115799 -106944 29797
18282 -116296 -250872 38517 -92033 -134981 142231 -172167 -294910 -298886 -62242 -42390 40397
$$ packed form
18364A63198a12514j24285H5904c6880I0826a2950A31010h4328K9875k928k51675
18353c09056A70925n1676N2330B7037Q1203a68950P6295J5289G5129J67454i4187
18341A00579D9927M9910A1309a02055k9052J5443j27001i5516j3095D6408J69556
18330B15964B3007i3495a40k56013G8890d03908B78642h9538L1786m8089c183
18318F9860c61131a3908A5185a86062A82444a44253F8307j3204I623L1351a57622
18306e4090n4529k20330A12629a96376l5352A84484C8121b03413f6748l9002d0152
18294F3653a66674A8174b19467Q4938p8498C09757b49108j55299a15799Q855B9797
18282a16296j34576C8517i2033m2948A42231a72167j22743l976f2242J9852D0397
$$ plain form
18270 88234 -378527 16939 -174382 53810 -229770 -93482 24381 -70777 -112814 -188642 92944
18258 -150579 31425 -131615 43476 138162 -70895 -50983 89771 -63030 -119787 95625 53266
18247 53266 -44377 -330685 -193604 -75256 -138583 -104332 -99811 -191214 374789 -34709 -212636
18236 -212636 -36744 156269 -127764 -188821 59805 -237322 -460494 45266 108637 394602
18226 394602 100710 -302531 115153 251399 269564 -22165 -62427 -358185 -146856 -78865
18216 -78865 -74218 -262353 -17728 60836 -1236 -7109 -102390 -191592 2986 -217207 123370 -267305
18203 -133337 -228839 -13221 135188 309930 -233245 -109236 -177095 221606 -53281 139369
18192 54329 -103476 130923 -125615 8963 -115410 106378 112597 -671 45464 55613 81089
$$ packed form
18270H8234c78527A6939a74382E3810b29770i3482B4381g0777m2037p5828I2944
18258a50579C1425a31615D3476R4686g0895J9912H9771f3030n6757I5625m2359
18247E3266d4377k86308J37081g5256o3327L4251M521r1403C74789c4709j77927
18236b12636c6744A56269a27764o1057E9805b37322k23172D5266O3371K85965
18226C94602A00710c02531A15153J36246J8165b2165m0262k95758a46856O7991
18216g8865M647j88135a7728F0836a236n873r5281q9202B986b17207A23370b67305
18203a33337r5502a3221A35188J74742b33245a09236o7859B21606e3281A39369
18192E4329a03476A30923a25615H963a15410A06378O219f71D5464J0149K5476
$$ plain form
18181 81089 -150740 153487 -70192 209722 -29610 -31597 145471 96082 -246517 31889 166912
18170 166912 -220005 112847 -18548 1547 238288 96406 39400 5237 -55261 -76114 -178057
18159 -178057 162315 -53657 43704 25775 -221883 158185 15136 22336 -255860 -295198 48699
18147 150503 184702 -37472 -329608 -315617 -197294 -337082 42355 -15191 39761 -149853 -175592
18136 -175592 -138271 310321 -116925 -25896 218123 31978 987 -383386 -375744 34334 -169865
18124 21217 11060 66171 -52193 -139762 446173 260069 -39942 -106784 -132582 -330679 -119025
18112 12005 -2473 -106636 202689 -449563 -76810 137658 -281250 -74450 -22987 -299345 -97230
18100 271833 -306291 52447 36232 22094 -252927 185768 -246974 -188796 72785 38520 -127273
$$ packed form
18181H1089a50740A53487g0192B09722b9610j987A45471m9389b46517C1889J35023
18170A66912b20005A12847a8548A547K36741I6406C9400E237e5261k0853j01943
18159a78057A62315e3657D3704j7929b21883A58185A5136P200b55860l9338D8699
18147A50503L4199c7472k92136J3991J18323j39788D2355a5191C9761a49853k5739
18136a75592L7321C10321a16925b5896B18123C1978I87c83386P642C4334a69865
18124B1217j0157N5111e2193q7569D46173j86104c9942o6842k5798j98097a19025
18112A2005b473j04163B02689d49563g6810A37658b81250g4450b2987k76358i7230
18100B71833c06291E2447j6215j4138b52927A85768b46974N8178G2785l4265a27273
$$ plain form
18088 70471 98815 -187453 -103326 367097 -253022 -370412 -260755 130389 44415 -114873
18077 204999 -6647 -38270 47621 -357671 -180860 -431364 -12471 -229242 270070 -10202 -127954
18066 -127954 -305083 -123289 -23880 64852 -255314 -54944 -72486 -150848 -124695 -160165 38228
18054 -97968 260215 -169533 -319548 78888 -207284 193559 -197840 -322161 65161 63207
18044 63207 -44280 71807 94550 69279 329765 20682 -245374 -9939 269170 936 -258982
18032 81777 -140724 237300 246938 -198596 -277738 -143876 79332 310131 93952 62692 -118003
18020 38515 -228453 27915 64472 -208114 243873 -59322 -40672 -74822 49023 72838 163159
18009 163159 190523 82115 -2567 144334 22429 125725 -102446 -192756 28612 -193421 -90950
$$ packed form
18088G0471K8344a87453Q4127C67097b53022j17390J09657A30389D4415a14873
18077B04999f647l1623D7621c57671J76811k50504a2471k16771B70070a0202j17752
18066a27954j77129a23289b3880F4852b55314e4944j7542p8362K6153l5470C8228
18054i7968B60215a69533j50015G8888b07284A93559a97840j24321F5161j954
18044F3207d4280G1807K2743k5271K60486B0682b45374i939B69170I36b58982
18032H1777a40724B37300R638a98596p9142J33862G9332K30799I3952l1260a18003
18020C8515b28453B7915L6557b08114B43873e9322J8650l4150D9023K3815R0321
18009A63159K7364H2115b567A44334B2429J03296a02446r0310B8612a93421i0950
$$ plain form
17997 196020 58066 -128348 -440329 -68466 166726 -302812 -213160 -98187 -263361 -44713
17986 -76357 136100 -42075 -69882 176815 108345 43775 28927 -237537 -45687 15943 -155351
17974 -148295 -431791 23593 -269736 -21433 -157657 -64358 36803 3061 126719 279127 -224145
17962 176910 -24337 -318818 -3655 -131462 -96134 38491 8919 -89209 7581 37195 -130563
17950 85794 -121533 -95834 28301 -35295 108550 233998 -93930 329585 78558 -129682 87844
17938 50772 322480 -250392 22200 125819 3832 114473 -35082 -219861 32718 169219 129120
17927 129120 -174650 27389 -196163 98916 -49017 56421 -7665 -120035 -371029 245359 -9344
17915 -29302 4457 112938 163323 -321491 6559 89231 -179238 -215947 26847 363695 16186
$$ packed form
17997A96020E8066a28348l11981f8466A66726c02812Q9652i8187j65174d4713
17986g6357A36100d2075k7807A76815o8470D3775j4848b37537d5687A5943a55351
17974a48295k83496B3593b69736b1433j36224f4358C6803C061J23658J52408b24145
17962A76910b4337k94481c655j27807L5328C8491H919h9209G581K9614a30563
17950H5794a21533K5699B8301c5295A08550J25448i3930C29585G8558a29682H7844
17938E0772K71708b50392B2200J03619C832J10641c5082j84779C2718J36501m0099
17927A29120a74650B7389a96163I8916d9017E6421g665j12370k50994B45359i344
17915b9302D457J08481N0385c21491F559Q2672a79238l6709B6847L36848A6186
$$ plain form
17903 122221 219606 18841 46002 210374 -10920 123607 -117268 -82578 -108489 46930 -5412
17891 -333357 45357 -198182 62837 -25676 -137940 122503 -103840 -95220 286646 -171315
17880 133276 -213301 95041 191803 50238 314348 -187935 -15982 130703 76247 79891 -49275
17868 -63660 -99566 -121031 -17828 -204440 -344616 -291429 -33872 -62453 49009 13531 18204
17857 18204 44195 -169334 246710 -275791 -131064 -108639 6563 190108 -82936 65875 -133531
17845 -39192 -218974 441060 -82249 -29467 14842 275797 130611 59036 -53624 -88603 -202634
17834 -202634 -245940 -316092 -35029 -158324 168040 363409 -157027 165965 76569 -71862
17823 -208483 -40801 99445 160715 -201174 296184 291498 -109442 35518 -14017 65143 -86685
$$ packed form
17903A22221R7385A8841K7161J64372a0920A23607a17268L4690k5911D6930e412
17891c33357D5357a98182F2837b5676j12264A22503a03840Q620B86646a71315
17880A33276b13301I5041R6762E0238K64110a87935a5982A30703n4456L644d9275
17868f3660l5906k1465a7828j86612j40176N3187c3872k8581D9009A3531M673
17857A8204K5991a69334B46710b75791a31064K2425F563J83545h2936F5875a33531
17845c9192j79782D41060h2249b9467A4842K60955A30611E9036e3624l4979j14031
17834b02634m3306p0152c5029j23295A68040J95369a57027A65965G6569g1862
17823b08483d0801I9445O1270b01174B96184m686a09442C5518a4017F5143h6685
$$ plain form
17811 71641 80085 -212714 -92622 -103229 -34275 -213974 406716 -124399 280485 163189 -246830
17799 104933 87873 -64157 55372 124092 -45413 4616 -22132 -60867 616202 -37232 131708
17787 47360 -96986 22355 -82088 332583 965 131436 156394 191433 -159604 -27894 108804
17775 20941 -228738 -46568 1615 -197836 -53961 -24809 -91792 -27652 -206826 265952 -138286
17763 -28633 73889 -406520 -82519 -200969 -70443 -99490 219334 378344 71676 85267 72049
17752 72049 1543 156849 174704 357155 102534 168698 29665 48433 23897 214185 259481
17741 259481 69901 -14624 -136342 -70983 178354 -89726 -11573 159241 17217 8518 150212
17730 150212 297811 -71824 -100808 -215812 -147217 268366 -195142 14100 109521 9958 2244
$$ packed form
17811G1641Q444b12714i2622j0607c4275j79699D06716a24399B80485j17296b46830
17799A04933j7060f4157E5372O8720d5413D616b2132l8735F16202c7232A31708
17787D7360i6986B2355h2088C32583I65J30471K4958L5039a59604b7894A08804
17775B0941b28738d6568A615a97836e3961b4809o6983b7652j79174B65952a38286
17763b8633G3889d06520h2519j18450g0443k9047B19334J59010G1676J3591j3218
17752G2049A543J55306J7855J82451A02534O6164B9665J8768B3897J90288M5296
17741B59481F9901a4624j21718O5359A78354h9726a1573A59241A7217H518J41694
17730A50212J47599g1824k8984j15004O8595B68366a95142A4100R5421I958B244
$$ plain form
17718 -226491 37234 74969 218473 128349 -197962 136454 -143960 -118155 -12133 -27447 -239009
17707 -239009 -40847 291283 -315894 -26253 -58689 205370 421291 428142 -35265 131339 -231185
17695 336328 446375 42469 24982 260118 -171480 40018 -28152 69490 195934 196325 -25473
17683 -114714 -113095 -17735 -119236 90821 -152287 21946 55878 14090 66428 -447868 137515
17671 47702 -105171 -146511 248933 140097 -331135 -248966 46982 -146072 195286 -236937
17660 -307796 -255263 92254 -22732 -216461 -14020 276003 27949 60187 -128415 72169 -40681
17648 55164 117268 27795 -129000 -96111 -301259 423994 -69188 -30693 107477 84378 180123
17637 180123 -251444 197037 66085 -137758 80742 -8349 67629 158007 -281169 7058 123277
$$ packed form
17718b26491C7234L7735J43504r0124a97962A36454a43960K5805a2133j5314k11562
17707b39009d0847B91283c15894b6253l2436B05370K15921O851c5265A31339b31185
17695C36328J10047D2469j7487K35136a71480D0018b8152F9490J26444L91b5473
17683a14714J619a7735j01501I0821a52287B1946L3932A4090N2338d47868A37515
17671D7702a05171m1340B48933j08836c31135Q2169D6982a46072A95286b36937
17660c07796N2533I2254b2732j93729a4020B76003B7949L2238a28415G2169d0681
17648E5164O2104B7795a29000L2889k05148D23994f9188c0693A07477k3099R5745
17637A80123b51444A97037F6085a37758H0742h349F7629R0378b81169G058J16219
$$ plain form
17626 123277 -221407 114412 38578 97755 73847 -5944 -221045 154896 -19952 144967 201663
17615 201663 -3031 323735 -223031 126480 400503 85780 293904 -71089 -80697 92569 -173080
17603 -127734 -149994 -83157 -34421 -127590 192827 -63830 -134310 27872 31662 191418 -60241
17591 -45698 465171 -302003 125486 275425 -63646 -245734 178070 -191560 27395 -33914
17580 162939 -315922 170420 -67228 -243880 -143617 216296 -60898 -53619 110873 75906
17570 75906 237756 69498 -265902 -238226 65135 67749 -41863 5840 259840 384500 173973
17558 36006 285877 169536 -109594 220361 149117 -68028 192565 124065 80284 -323346
17547 298155 164791 70794 -44054 -221946 -101924 -142864 -34731 185562 -29380 121020
$$ packed form
17626A23277b21407A14412C8578N9177k3908e944k15101A54896a9952A44967N6696
17615B01663c031C23735b23031A26480K74023H5780K08124g1089r608I2569a73080
17603a27734k2260O6837c4421r3169A92827f3830p0480B7872L790J59756f0241
17591d5698D65171c02003A25486J49939f3646j82088A78070a91560B7395c3914
17580A62939c15922A70420f7228j76652J00263B16296f0898P279A10873l4967
17570G5906J61850F9498b65902K7676F5135K614d1863E840K54000J24660A73973
17558C6006K49871j16341a09594B20361p1244f8028A92565o8500m3781c23346
17547B98155j33364G0794d4054j77892a01924m0940c4731A85562b9380A21020
$$ plain form
17536 -240522 102900 -27535 133437 218784 225698 112539 265626 187602 121063 -25758 -114820
17525 -114820 -238119 57582 -89267 212693 211376 285863 120887 62129 89169 -146329 105244
17513 -7527 -140402 76256 177032 130620 135216 207570 119739 -18775 -194523 101671 15663
17501 169036 204347 87276 177815 -153647 97140 145802 163874 368652 186518 -50710 220712
17489 19836 127095 407894 19357 -241920 -99105 396838 74431 223461 340617 -10301
17478 -114958 212432 274506 -71297 116791 225816 206885 230827 92023 -106673 -202588 205688
17466 217280 162268 -191468 138654 393600 147 54724 154883 -218341 -19965 -18888 316486
17454 167735 159315 170216 391346 331892 485482 499396 411618 375110 374329 260317 295845
$$ packed form
17536b40522A02900b7535A33437Q5347O914A12539J53087p8024o6539b5758q9062
17525a14820j23299E7582h9267B12693j317P4487A20887n8758K7040a46329A05244
17513g527j32875G6256J00776m6412M596P2354q7831a8775j75748A01671A5663
17501A69036L5311H7276R0539a53647I7140M8662J8072K04778j82134e0710B20712
17489A9836J07259K80799A9357b41920i9105C96838G4431J49030J17156a0301
17478a14958B12432O2074g1297A16791J09025j8931K3942I2023a06673r5915B05688
17466B17280n5012a91468A38654K54946A47N4577J00159b18341a9965J077C16486
17454A67735q420J0901K21130n9454J53590J3914q7778l6508p81j14012L5528
$$ plain form
17443 295845 -36866 -84677 62235 271599 124672 -42026 123428 117820 339991 231425 349633
17432 349633 288899 183896 -52176 500152 -32852 15965 356218 3808 -19655 468921 193447
17420 -46443 205781 236262 203887 -14250 61161 -78328 32785 -60335 143027 403408 292675
17409 292675 320867 380208 256002 200116 172906 85195 -155061 206366 78262 41583 82759
17398 82759 209940 -69492 142891 -219257 -276063 318546 134529 224810 77288 197457
17388 197457 134511 196626 227185 122769 238162 389286 275777 118381 -21280 234811
17377 40392 -105703 194474 67038 230347 176609 264371 184121 389880 -29183 189780 206563
17366 206563 356565 48031 -51377 -37771 -14649 242334 -13798 -94212 33577 -40544 306072
$$ packed form
17443B95845c6866m7811F2235K09364A24672d2026A23428n608K22171j08566J18208
17432C49633o0734j05003e2176E00152c2852A5965L40253C808a9655D68921A93447
17420d6443B05781L0481l2375a4250F1161g8328C2785f0335A43027K60381j10733
17409B92675K8192N9341j24206n5886k7210H5195a55061B06366G8262l6679M1176
17398H2759J27181f9492A42891b19257n6806C18546A34529R0281G7288J20169
17388A97457o2946O2115L0559j04416J15393J51124j13509A18381b1280B34811
17377D0392a05703A94474F7038J63309n3738Q7762q0250K05759b9183A89780J6783
17366B06563J50002D8031e1377J3606a4649B42334a3798q0414C3577d0544C06072
$$ plain form
17354 247378 196110 -74575 182344 18739 -134704 167443 205271 351343 65810 -98111 137961
17342 116693 398867 36591 204839 79579 236028 352791 133079 324996 498682 139941
17331 -115242 210377 114052 14844 -123193 202182 290914 -3648 104143 136480 268175 290749
17320 290749 276622 75875 380763 164277 25332 3519 65338 184443 471293 391725 74772
17308 34276 -133633 429684 164 139681 196258 237549 -344526 118948 64533 350630 220162
17297 220162 232470 274253 347024 19516 -16109 319560 291527 370724 315147 -63904 94966
17285 96897 125270 502009 -228858 23952 145911 211342 -17961 203453 211558 221192 170940
17274 170940 -2471 108688 38453 201254 218304 -15426 176249 320837 144492 334806
$$ packed form
17354B47378n1268g4575A82344A8739a34704A67443L7828J46072F5810i8111A37961
17342A16693K82174C6591J68248G9579J56449J16763A33079J91917J73686A39941
17331a15242B10377r6325A4844a23193B02182Q8732c648A04143L2337J31695K2574
17320B90749j4127G5875L04888A64277B5332C519O1819J19105K86850p9568G4772
17308C4276a33633D29684A64J39517N6577M1291c44526A18948n4415K86097j30468
17297B20162J2308M1783P2771A9516a6109C19560k8033P9197n5577f3904I4966
17285I6897K8373L76739b28858B3952J21959O5431a7961B03453Q105R634n0252
17274A70940b471A08688C8453J62801J7050a5426A76249J44588A44492J90314
$$ plain form
17264 334806 121414 205333 254426 442179 288563 122599 152240 275091 -30233 140789
17253 120163 366303 223450 337851 255217 173035 494740 135133 -2526 75702 404519
17243 404519 522919 226722 533511 328136 115411 122624 135423 191772 -124009 -11803
17232 11697 43694 137664 137668 348520 20375 317736 258296 123262 334400 174261 95442
17221 95442 461367 257624 -102310 185699 -84055 256614 182022 188532 34403 248146 -81779
17209 402712 339406 96750 230116 196212 606764 286102 428383 467219 297403 85255
17198 463206 146753 24455 128347 332479 479064 41419 58160 289981 -26204 200759
17187 512669 340178 151231 409996 460194 278405 104975 -111330 236888 272530 608294
$$ packed form
17264C34806A21414Q3919M9093J87753j53616A22599K9641J22851c0233A40789
17253A20163K46140j42853J14401q2634q2182L21705A35133b526G5702L28817
17243D04519J18400B26722L06789k05375A15411P213J2799N6349a24009a1803
17232A1697L1997R3970MK10852B0375K97361n9440A23262K11138j60139p8819
17221I5442L65925k03743a02310A85699h4055B56614p4592O510C4403K13743h1779
17209D02712o3306I6750J33366l3904M10552B86102J42281L8836j69816H5255
17198D63206A46753B4455J03892K04132J46585D1419J6741K31821b6204B00759
17187E12669j72491A51231K58765N0198j81789A04975a11330B36888L5642L35764
$$ plain form
17177 608294 613597 -75678 354268 408448 358038 215232 328657 374264 405783 378039 164758
17165 264758 601881 135221 596200 397969 552150 400550 248308 323277 258169 356204
17155 356204 164139 343721 402376 221263 304224 202587 770010 330205 308561 350917
17145 350917 254721 572116 378214 285432 481342 490235 291179 122075 246153 239451 417987
17134 417987 505408 262458 161406 128704 89931 322910 292057 128248 751786 345474
17123 541155 180264 300264 320084 554079 343146 65711 503450 440025 190825 192991
17113 192991 592794 400007 355470 335418 396105 276421 187809 374696 480110 482630 579373
17102 579373 244814 539716 127088 722162 264244 382593 325905 214194 379673 318404
$$ packed form
17177F08294N303g5678C54268N4180n0410j42806J13425M5607L1519k7744A64758
17165B64758L37123A35221M60979j98231J54181j51600j52242P4969o5108R8035
17155C56204A64139J79582N8655j81113Q2961j01637N67423C30205k1644M2356
17145C50917r6196L17395j93902r2782J95910Q893j99056A22075J24078o702J78536
17134D17987Q7421k42950j01052l2702l8773K32979l0853A28248O23538C45474
17123E41155A80264J20000J9820K33995k10933F5711M37739o3425A90825K166
17113A92991L99803j92787m4537k0052O0687j19684q8612J86887J05414K520R6743
17102E79373B44814K94902A27088N95074B64244J18349n6688j11711J65479o1269
$$ plain form
17092 318404 354876 564033 601994 487279 435334 571498 154084 110307 467884 612309
17082 612309 284805 569060 295652 506809 448759 532111 381019 431179 329050 496102
17072 496102 566156 449638 240263 369902 510730 767410 312017 318530 614945 425713
17062 425713 551968 268390 452921 546687 747165 473116 485874 606060 596837 854188
17052 854188 407484 432028 493985 581937 418919 606631 720768 675911 909793 530228
17042 530228 366520 476668 550461 637305 736620 763275 466764 554166 740488 593902
17032 593902 612496 481735 364134 416428 621964 567544 830139 722910 799352 716649
17022 716649 866663 582816 870037 537636 669551 895058 676862 937063 682203 801422
$$ packed form
17092C18404L6472K09157L7961j14715n1945J36164A54084m3777L57577J44425
17082F12309B84805K84255k73408K11157n8050Q3352j51092N0160j02129J67052
17072D96102P0054j16518k09375J29639J40828K56680C12017O513K96415j89232
17062D25713J26255B68390J84531R3766K00478k74049J2758J20186r223K57351
17052H54188D07484K4544O1957Q7952j63018J87712J14137m4857K33882l79565
17042E30228j63708J10148P3793Q6844R9315K6655k96511Q7402J86322j46586
17032E93902J8594j30761j17601N2294K05536n4420K62595j07229P6442q2703
17022G16649J50014k83847K87221l32401J31915K25507k18196K60201k54860J19219
$$ plain form
17012 801422 529682 1137373 781881 595062 766021 748799 770748 553778 849144 747071
17002 747071 741233 447669 613676 657119 795543 914833 701909 839765 807416 670964
16992 670964 778987 458074 846784 729373 876583 1054264 1099534 1084196 812587 1164523
16982 1164523 642636 965850 859046 902313 989190 1049669 952176 1098881 1183282 768819
16972 768819 1200948 940279 870276 799746 1208237 758811 867831 954242 1069420 803454
16962 803454 994702 1316362 1186581 1309254 1098504 1299085 914748 1073286 916889 1155523
16952 1155523 1234110 1422935 1233638 1333178 798798 1013103 1071318 1393576 915630 1385563
16942 1385563 1404028 1162165 1508434 1328321 1322352 1240947 1606458 1564685 1300751 1556122
$$ packed form
17012H01422k71740O07691l55492j86819J70959j7222K1949k16970K95366j02073
17002G47071n838k93564J66007M3443J38424J19290k12924J37856l2349j36452
16992F70964J08023l20913L88710j17411J47210J77681M5270j5338k71609L51936
16982A164523n21887L23214j06804M3267Q6877O0479r7493J46705Q4401m14463
16972G68819M32129k60669p0003p0530M08491m49426J09020Q6411J15178k65966
16962H03454J91248L21660j29781J22673k10750K00581l84337J58538j56397K38634
16952A155523P8587J88825j89297R9540n34380K14305N8215L22258m77946M69933
16942A385563J8465k41863L46269j80113n969q1405L65511m1773k63934K55371
$$ plain form
16932 1556122 1074328 1306847 1604979 1344566 1528761 1504542 1287439 1440127 1670183 1559588
16922 1559588 1467502 1083684 1665955 1408146 1572786 1734788 1868984 1534964 1464286 1498053
16912 1498053 1601520 1598703 2098816 1765894 1587010 1678699 1963072 1756922 2115695 2036007
16902 2036007 2015779 1912187 2090168 1999370 2069327 1795435 2263323 2122494 1771462 2405652
16892 2405652 2323212 2161380 2093852 2207709 1999133 2209263 1946140 2220414 2365791 1880268
16882 1880268 2436228 2595719 2625427 2120455 2428440 2613699 2265244 2506725 2663626 2867723
16872 2867723 2446566 2727529 2748396 3013376 2807808 2640937 2821351 3228344 3093598 2956203
16862 2956203 3027139 2958884 2970334 3121638 2992184 3319883 3452576 3576356 3016830 3640700
$$ packed form
16932A556122m81794K32519K98132k60413J84195k4219k17103J52688K30056j10595
16922A559588r2086l83818N82271k57809J64640J62002J34196l34020p0678L3767
16912A498053J03467k817N00113l32922j78884R1689K84373k06150L58773p9688
16902B036007k0228j03592J77981r0798O9957k73892M67888j40829l51032O34190
16892B405652q2440j61832o7528J13857k08576K10130k63123K74274J45377m85523
16882A880268N55960J59491K9708n04972L07985J85259l48455K41481J56901K04097
16872B867723m21157K80963K0867K64980k05568j66871J80414M06993j34746j37395
16862B956203P0936o8255J1450J51304j29454L27699J32693J23780n59526O23870
$$ plain form
16852 3640700 3744799 3606085 3967943 3615120 3301483 3634907 3478395 3821659 3951235
16843 3951235 3939040 3985666 4007493 4137116 4001819 4656402 4434030 4419783 4484149 4336625
16833 4336625 4652760 5068679 4601268 4704576 4917388 4839672 5096048 5068348 5597937 5223627
16823 5223627 5549862 5336707 5574740 5489415 5542133 5845830 6227998 6127358 6190457 6529127
16813 6529127 6667565 6673280 6575568 6958927 6973002 7090354 7385418 7495356 7844636 7678323
16803 7678323 7973781 8122596 8645271 8509551 8844978 9222984 9095211 9769452 9491798
16794 9491798 10123367 10199563 10657205 10698416 11117489 11261678 11403976 11664638 11964805 12523398
16784 12523398 12919945 13200767 13430903 14126499 13994515 14367736 14985435 15177763 15840752
$$ packed form
16852C640700J04099j38714L61858l52823l13637L33424j56512L43264J29576
16843C951235j2195M6626K1827J29623j35297O54583k22372j4247O4366j47524
16833D336625L16135M15919m67411J03308K12812p7716K56376k7700N29589l74310
16823E223627L26235k13155K38033q5325N2718L03697L82168j00640O3099L38670
16813F529127J38438N715r7712L83359J4075J17352K95064J09938L49280j66313
16803G678323K95458J48815N22675j35720L35427L78006j27773O74241k77654
16794I491798O31569P6196M57642M1211M19073J44189J42298K60662L00167N58593
16784A2523398L96547K80822K30136O95596j31984L73221O17699J92328O62989
$$ plain form
16775 15840752 16818342 16883073 17570993 17916902 18778429 19040053 20142437 20694508 20809897
16766 20809897 21826557 22692129 23635934 24742925 25013372 26070512 26875857 27933829 29189955
16757 29189955 30443601 32047086 32891305 34346118 35676694 37590382 38712444 40348888
16749 40348888 42669288 44508400 46589035 48779044 51107711 53828204 56377388 59149470
16741 59149470 62129216 65698189 68800023 72204785 76130734 80422599 84203375 88392626
16733 88392626 93781028 98606996 103811300 108489150 114486931 119613050 125410731 131160325
16725 131160325 136703069 142027753 147146615 151849678 156209558 159611618 162656220 164917956
16717 164917956 166178878 167073081 166458168 165383435 163573344 160606588 157341569 153235500
$$ packed form
16775A5840752R77590O4731O87920L45909Q61527K61624J102384N52071J15389
16766B0809897J016660Q65572R43805J106991K70447J057140Q05345J057972J256126
16757B9189955J253646J603485Q44219J454813J330576J913688J122062J636444
16749D0348888K320400J839112K080635K190009K328667K720493K549184K772082
16741E9149470K979746L568973L101834L404762L925949M291865L780776M189251
16733H8392626N388402M825968N204304M677850N997781N126119N797681N749594
16725A31160325N542744N324684N118862M703063M359880L402060L044602K261736
16717A64917956J260922Q94203o14913j074733j810091k966756l265019m106069
$$ plain form
16709 153235500 148437849 143622952 138056135 132854274 126896691 121406273 115556849 109933580
16701 109933580 104740025 99484585 94028272 89112332 84481979 79971977 75794060 71979183
16693 71979183 67949317 64604132 61135761 58094381 54969258 52233748 49829200 47403604
16685 47403604 45135334 42735579 40934852 39006616 37200459 35901964 34175165 32205076
16677 32205076 31226972 29880694 28880203 27536891 26229461 25241085 24247888 23378021 22419342
16668 22419342 21541699 20880654 20044395 19313112 18566488 18045935 17257878 16992227 16228336
16659 16228336 15923799 15317475 14517235 14413030 13801017 13313728 13066849 12712889 12252514
16650 12252514 11690355 11454967 11501020 10922327 10463968 10335408 9964653 9723552 9542751
$$ packed form
16709A53235500m797651m814897n566817n201861n957583n490418n849424n623269
16701A09933580n193555n255440n456313m915940m630353m510002m177917l814877
16693G1979183m029866l345185l468371l041380l125123k735510k404548k425596
16685D7403604k268270k399755j800727j928236j806157j298495j726799j970089
16677C2205076r78104j346278j000491j343312j307430r88376r93197q69867r58679
16668B2419342q77643o61045q36259p31283p46624n20553p88057k65651p63891
16659A6228336l04537o06324q00240j04205o12013m87289k46879l53960m60375
16650A2252514n62159k35388M6053n78693m58359j28560l70755k41101j80801
$$ plain form
16641 9542751 9363605 9048390 8832119 8610913 8299541 8203542 8060646 7763159 7677426 7701280
16631 7701280 7249538 7117911 6983683 6826399 6472954 6591474 6444373 6208348 6139083 5748618
16621 5748618 5773240 6007173 5501507 5207515 5261266 5247140 5004633 4565655 4989337 4802284
16611 4802284 4992309 4560207 4437114 4413223 4404609 4455984 4182641 4135421 4074472 4033295 3600912
16600 3600912 3859766 4013297 3630917 3552565 3452757 3635107 3197872 3317412 3315138 3103317
16590 3103317 3318369 3298145 3223588 2649185 2954745 2938064 2993302 2854147 2666630 2402109
16580 2402109 2675341 2846508 2613923 2798361 2416193 2811142 2244545 2087679 2380657
16571 2380657 2168155 2309874 2102181 1897556 2242504 1932739 2057919 2312081 1894985
$$ packed form
16641I542751j79146l15215k16271k21206l11372r5999j42896k97487q5733K3854
16631G701280m51742j31627j34228j57284l53445J18520j47101k36025o9265l90465
16621E748618K4622K33933n05666k93992N3751j4126k42507m38978M23682j87053
16611D802284J90025m32102j23093k3891q614N1375k73343m7220o0949m1177m32383
16600C600912K58854J53531l82380p8352r9808J82350m37235J19540k274k11821
16590C103317K15052k0224p4557n74403L05560j6681N5238j39155j87517k64521
16580B402109K73232J71167k32585J84438l82168L94949n66597j56866K92978
16571B380657k12502J41719k07693k04625L44948l09765J25180K54162m17096
$$ plain form
16562 1894985 2034305 2052059 1990888 1837597 1968960 1991642 1767209 1923756 1691423 1783941
16552 1783941 1727286 1858753 1585543 1621337 1699036 1344766 1557009 1582886 1423761 1825272
16542 1825272 1407846 1381256 1375725 1465262 1425100 1380972 1602522 1648002 1381611 1538215 1614100
16531 1614100 1620565 1420822 1088358 1494502 1332223 1529122 1213370 1528777 1452136 1274412
16521 1274412 1298962 1555384 1213758 1012444 1349636 886493 1424637 933528 838385 993009
16511 993009 1342053 922576 1169756 1280006 1027421 1134904 1190299 1063967 991951 1031316
16501 1031316 829973 782377 1004462 966939 1218663 758228 617643 710762 831734 759325
16491 759325 822092 1113100 1131110 703747 1012901 797921 801432 728724 679886 1208084 1074300
$$ packed form
16562A894985J39320J7754o1171j53291J31363K2682k24433J56547k32333R2518
16552A783941n6655J31467k73210L5794P7699l54270K12243K5877j59125M01511
16542A825272m17426k6590n531Q9537m0162m4128K21550M5480k66391J56604P5885
16531A614100O465j99743l32464M06144j62279J96899l15752L15407p6641j77724
16521A274412K4550K56422l41626k01314L37192m63143N38144m91109r5143J54624
16511I93009L49044m19477K47180J10250k52585J07483N5395j26332p2016L9365
16501A031316k01343m7596K22085l7523K51724m60435j40585R3119J20972p2409
16491G59325O2767K91008J8010m27363L09154k14980L511p2708m8838N28198j33784
$$ plain form
16480 1074300 912533 861709 806349 988950 586319 583329 633441 621272 1059298 740789
16470 740789 634565 845941 456497 342951 267545 789308 764273 820926 752049 710457
16460 710457 707212 463664 852614 722551 383175 757848 1011100 668084 860471 399600
16449 535353 776876 493625 617233 465099 610322 420699 517750 665052 709541 736737
16439 736737 481158 774356 420225 578329 303326 669100 395856 791792 546704 508088
16429 508088 405394 486558 262129 509242 431970 704224 448125 318762 625136 429997
16419 429997 424002 616802 282250 360091 441311 494368 482707 483426 230204 241773 248659 454208
16407 454208 482114 250540 292831 554352 327097 347093 379281 327353 495483 581812 578495
$$ packed form
16480A074300j61767n0824n5360J82601m02631k990N0112j2169M38026l18509
16470G40789j06224K11376l89444j13546p5406N21763k5035N6653o8877m1592
16460G10457l245k43548L88950j30063l39376L74673K53252l43016J92387C99600
16449E35353K41523k83251J23608j52134J45223j89623R7051J47302M4489K7196
16439G36737k55579K93198l54131J58104k75003L65774k73244L95936k45088l8616
16429E08088j02694Q1164k24429K47113p7272K72254k56099j29363L06374j95139
16419D29997n995J92800B82250P7841Q1220N3057j1661P19B30204J1569O886K05549
16407D54208K7906k31574M2291K61521k27255J9996L2188n1928J68130Q6329l317
$$ plain form
16396 578495 573895 125933 326719 218859 496697 423432 494868 451022 453054 593102 219301
16384 139159 286135 172695 311524 174404 336947 340749 359467 361931 143518 378597
16374 378597 -38312 256606 347951 258916 -84949 521348 411722 345003 303391 -7810 659086
16362 214986 338302 395450 174681 319448 226384 200827 180548 268190 229448 501326 150995
16350 -91904 252078 530588 484416 445429 379549 506703 239824 75320 289448 300069 315599
16339 315599 277211 466965 569012 -323417 288600 425097 102572 -84520 89822 211285
16329 211285 152096 275659 291874 663150 75385 318383 200674 -55514 424998 388420
16319 388420 254628 150924 322646 -120098 110762 351601 69387 116394 249807 181915
$$ packed form
16396E78495m600A25933K00786j07860K77838p3265P1436m3846K032J40048B19301
16384A39159J46976j13440J38829j37120J62543L802J8718K464A43518K35079
16374C78597c8312B56606R1345q9035h4949E21348j09626o6719m1612g810F59086
16362B14986J23316N7148A74681J44767r3064k5557k0279Q7642l8742K71878A50995
16350i1904B52078K78510m6172l8987o5880J27154B39824G5320K14128J0621J5530
16339C15599l8388J89754J02047c23417B88600J36497A02572h4520H9822J21463
16329B11285n9189J23563J6215L71276G5385K42998j17709e5514D24998l6578
16319C88420j33792j03704J71722a20098A10762K40839F9387M7007J33413o7892
$$ plain form
16309 181915 523667 153716 364921 266346 272680 84393 -30291 124270 23756 213859 420579
16298 420579 150848 351062 220894 218988 -32710 185600 239226 21107 -240997 342972
16287 -10697 153962 318607 -148964 -91072 108219 292367 63634 254983 62001 -65528
16276 -293195 42738 -70056 -101768 118820 326083 -57961 245140 115024 287194 401202
16266 401202 71053 -47033 298301 233153 -180541 5958 98121 70338 58602 164160 163216
16255 163216 22505 123889 149102 15025 130505 101900 299641 -339188 73102 42888 334497
16244 334497 219762 -169791 -109564 -105384 170252 172636 312182 86045 113568 -48350 213175
16232 177600 256282 156501 34502 64519 83072 -66567 -63047 -5214 206513 114234 474658
$$ packed form
16309A81915L41752A53716K11205r8575O334H4393c0291A24270B3756J90103K06720
16298D20579A50848K00214j30168j906c2710A85600N3626B1107b40997C42972
16287a0697A53962J64645a48964N7892A08219J84148F3634J91349F2001f5528
16276b93195D2738g0056l1712A18820K07263e7961B45140A15024J72170J14008
16266D01202G1053d7033B98301o5148a80541E958R2163k7783j1736J05558r44
16255A63216B2505J01384K5213A5025J15480k8605J97741c39188G3102l0214K91609
16244C34497j14735a69791O0227M180A70252K384J39546H6045K7523d8350B13175
16232A77600P8682r9781C4502L0017J8553f6567L520e214B06513r2279L60424
$$ plain form
16221 474658 -45207 296515 -176235 389688 -74451 5473 49811 -33172 102389 22343 362842
16210 362842 -106862 62540 -5520 343542 238179 -268385 417261 108542 -79226 110022
16199 -79855 -171311 165447 64047 210047 328673 176650 12227 489271 6164 -15999 99973
16187 90728 -62737 -65547 130437 65334 58041 -23537 76278 205404 15339 -18522 187769
16175 -105078 -68137 3976 104398 -26137 186867 -254931 127263 191342 169699 -103778 94870
16163 -3566 263056 59514 183878 -90386 80945 -82373 -31407 -49632 122207 -138203 94247
16151 -44967 -229062 106482 258388 -48072 156079 -82402 98355 -102681 94103 -67741 40330
16139 -255327 21566 127485 90408 91307 174627 2339 -173237 -331625 279074 308687 -34413
$$ packed form
16221D74658d5207B96515a76235C89688g4451E473M4338c3172A02389B2343L40499
16210C62842a06862F2540e520C43542j05363b68385D17261A08542g9226A10022
16199g9855r1456A65447F4047J46000J18626j52023A2227M77044F164a5999I9973
16187I0728f2737k810A30437o5103p293b3537G6278J29126A5339a8522A87769
16175a05078L6941C976J00422b6137A86867b54931A27263O4079k1643a03778I4870
16163c566B63056E9514J24364i0386H0945h2373c1407j8225A22207a38203I4247
16151d4967j84095A06482J51906d8072A56079h2402I8355a02681I4103f7741D0330
16139b55327B1566J05919l7077Q99Q3320B339a73237j58388B79074K9613c4413
$$ plain form
16127 261684 39150 -58604 51656 150609 -65160 71186 185104 260331 189755 -165249 540938
16115 -93338 -312383 43099 -67289 33195 58497 17813 -214675 152030 -193035 -40990 183732
16103 92947 -33740 81574 -109776 -225414 -30066 -70630 -139858 -82272 -184712 -215623 198228
16091 173262 224846 19692 -9191 -8968 -92403 -46129 -241508 202116 50088 59449 4116 113900
16079 113900 -179484 74881 -205849 8528 -25618 134831 70790 -86436 31450 -30615 158683
16067 1680 -110640 -82587 66909 -195794 169479 -151108 376435 46913 -298729 -155488
16057 -155488 -108354 -36245 -148732 -27609 -250742 -337267 -188468 -179558 -136142 210310 19865
16045 -42257 83756 112861 214252 25131 -179803 466995 -33700 96349 182822 -18526 70754
$$ packed form
16127B61684C9150e8604E1656R8953f5160G1186J13918P5227p0576a65249E40938
16115i3338k19045D3099f7289C3195K5302A7813b14675A52030a93035d0990A83732
16103I2947c3740H1574a09776j15638c0066m0564o9228N7586j02440l0911A98228
16091A73262N1584A9692i191K23q3435d6129j95379B02116E0088R361D116J09784
16079A13900a79484G4881b05849H528b5618A34831o4041h6436C1450c0615A58683
16067A680a10640K8053F6909a95794A69479a51108C76435D6913b98729J43241
16057a55488M7134c6245j12487b7609k23133q6525J48799Q910M3416B10310A9865
16045d2257H3756K9105J01391B5131a79803D66995c3700I6349Q6473a8526G0754
$$ plain form
16033 -40279 32610 -73310 -177429 -348878 18234 -49296 158387 286061 3191 -315987 -22472
16021 -64375 -47104 -117511 158269 -110073 -288258 -470097 115242 -74568 -20121 -16889 -127944
16010 -127944 313386 208451 45069 374119 -45861 -73072 122827 4562 323900 -392660
15999 214405 -159966 45524 251537 27099 196118 -316902 33049 35074 -280654 87499 53285
15988 53285 -293955 284454 61112 436287 262386 610464 336040 464869 362402 297191
15978 297191 330103 -107909 -39489 209838 -119584 -79348 -4812 217101 130551 -214913 -145072
15967 -145072 -182346 -120822 -99584 -32150 329147 29371 302018 -10897 43481 -401958 -272653
15956 -272653 -188536 223465 -68190 95171 -77267 168067 -231206 -79757 -82488 -18150 -35754
$$ packed form
16033d0279C2610g3310j04119j71449A8234d9296A58387J27674C191c15987b2472
16021f4375J7271p0407A58269a10073j78185j81839A15242g4568b0121L232j11055
16010a27944C13386j04935D5069L29050d5861k7211A22827D562L19338c92660
15999B14405a59966D5524K06013B7099J69019c16902C3049K025b80654H7499l4214
15988E3285b93955B84454F1112L75175j73901L48078k74424J28829j02467o5211
15978B97191L2912a07909c9489B09838a19584M0236d812B17101q6550b14913O9841
15967a45072l7274O1524K1238c2150C29147B9371K72647a0897D3481d01958J29305
15956b72653Q4117B23465f8190I5171g7267A68067b31206g9757k731a8150j7604
$$ plain form
15945 -35754 206198 -184863 -262081 -14786 -289547 12801 -204801 -101400 -144057 -171507 15167
15933 -268335 -450074 -97021 -188416 -186607 21034 46046 -81868 -267844 -255132 99872 -250822
15921 -13774 148834 168879 -22682 -34464 -167353 62936 74781 67461 -55868 78756 47915
15910 47915 130570 150584 146670 -153106 -13899 -221251 -22135 300266 3232 28770 -272103
15898 -214105 -321911 -236232 -154607 321313 -317345 161530 -353815 -249360 50395 -49764
15887 -38482 -195927 -44968 -308060 -101857 120666 38149 264425 -316099 88705 -130905
15876 96036 90649 -348123 -389208 -150429 -139132 -92101 -63970 -69883 213298 -321497 -60888
15864 -118413 97772 -103166 -101847 -27769 194327 15562 257540 -139022 -237063 -18370 -125120
$$ packed form
15945c5754B06198a84863p7218a4786k74761A2801b04801a01400m2657k7450A5167
15933b68335j81739i7021r1395J809B1034K5012h1868j85976J2712I9872b50822
15921a3774A48834K0045b2682j1782j32889F2936J1845p320e5868G8756l0841
15910D7915Q2655K0014l914a53106a3899k07352b2135C00266C232K5538b72103
15898b14105j07806Q5679Q1625C21313c17345A61530c53815J04455E0395d9764
15887c8482j57445d4968k63092a01857A20666C8149K26276c16099H8705a30905
15876I6036n387c48123m1085a50429J1297M7031K8131n913B13298c21497f0888
15864a18413I7772a03166J319b7769A94327A5562K41978a39022r8041a8370j06750
$$ plain form
15853 -125120 1391 237555 79488 27794 -57643 -248694 176955 -114912 38609 217792 -371367
15841 -165369 -222491 -218093 23491 361698 11730 41874 -255996 -114303 -123211 244008 -3285
15829 118064 30457 -18799 84664 -280041 -508375 -128773 -42079 98140 102178 -204218 -56060
15817 313366 -188224 287686 -155238 -107458 208646 -311191 171631 -18329 183431 -127874
15806 -96510 77983 84489 174983 156017 4363 245473 210801 -161586 -36378 -2 137542 -42495
15793 19709 40805 -305257 -82027 131207 -47992 -167408 28575 128484 78949 -11074 -49992
15782 -49992 -54927 147462 178391 119387 -275914 419010 179638 242216 -104367 245083 -90979
15770 -50492 10040 31387 -24760 -485116 265392 328564 -1847 4924 -211137 -3403 35529 63763
$$ packed form
15853a25120A391K36164G9488B7794e7643j91051A76955a14912C8609J79183c71367
15841a65369n7122M398B3491L38207A1730L0144b55996a14303q908B44008c285
15829A18064C0457a8799H4664b80041k28334a28773d2079I8140M038b04218e6060
15817C13366a88224B87686a55238M7780B08646c11191A71631a8329A83431a27874
15806i6510G7983O506R0494j8966D363K41110l4672a61586c6378bA37542d2495
15793A9709K1096c05257h2027A31207d7992j19416B8575R9909m9535a1074l8918
15782d9992m935A47462L0929n9004b75914D19010A79638O2578a04367B45083i0979
15770e0492A0040K1347b4760m60356B65392O3172a847D924b11137c403C5529K8234
$$ plain form
15758 63763 -12297 321726 -155988 168967 -288922 206170 -402544 -201558 134273 114115
15748 114115 -35010 -49779 111589 237031 195674 138523 183079 -131901 -291922 218794
15737 210330 196050 -5762 153195 -142601 -157422 -96830 -81260 -121821 279700 77817 200918
15726 200918 -29946 -114547 -192798 63169 -133043 -238508 34190 8890 -127537 -94111 -41558
15714 -110827 -180539 -211722 119861 11752 3168 418612 -467009 -86021 -359833 -147556 41545
15702 -166223 -203971 207899 67700 158695 -193879 65858 -256332 -209799 470454 -218866
15691 36370 404465 103326 194214 -54174 -127141 126849 229418 107291 167300 -10588 -113863
15680 -113863 245102 -244864 -232832 159655 141716 46253 -136488 -19046 71322 -29810 219835
$$ packed form
15758F3763a2297C21726a55988A68967b88922B06170d02544K00986A34273k0158
15748A14115c5010j4769A11589J25442m1357n7151M4556a31901j60021B18794
15737B10330j4280e762A53195a42601j4821O0592J5570m0561B79700G7817J23101
15726B00918b9946q4601p8251F3169a33043j05465C4190H890a27537L3426d1558
15714a10827o9712l1183A19861A1752C168M15444d67009h6021k73812a47556D1545
15702a66223l7748B07899F7700R0995a93879F5858b56332M6533D70454b18866
15691C6370L68095A03326R0888e4174p2967A26849J02569A07291O0009a0588j03275
15680a13863B45102b44864J2032A59655j7939D6253a36488a9046G1322b9810B19835
$$ plain form
15668 -92688 46520 115570 223139 -173507 133355 79329 -152419 -143151 -97235 -159119 -48156
15656 -107546 -81161 -114561 -134687 -288048 -492667 -41003 100475 225310 -414453 16774
15645 95151 -54694 -43825 86007 104949 -55086 -22299 -164702 -260922 144276 137391 -316031
15633 107383 135552 114194 -50711 -231763 -191449 -143331 349051 7270 375415 -155824 -118093
15622 -118093 -174253 69762 24704 201453 109367 -2641 -121959 -32806 -49783 5060 -81153
15610 -14792 178817 154810 177867 -326899 -418670 23843 36656 10190 -202490 -94329 -63040
15599 -63040 39729 123425 -174694 -264553 4202 -217986 282708 -12278 -191512 -86208 24099
15587 -42839 233250 41945 -141970 150964 -48277 80935 -106424 -116761 -404026 -118377
$$ packed form
15668i2688D6520O9050J07569a73507A33355n4026a52419R268M5916o1884d8156
15656a07546K6385l3400k0126j53361k04619d1003A00475J24835d14453A6774
15645I5151e4694J0869H6007J8942e5086b2299j42403r6220A44276o885c16031
15633A07383K8169k1358e0711j81052M0314M8118C49051G270L68145a55824L7731
15622a18093n6160F9762B4704J76749r2086b641j19318c2806j6977E060h1153
15610a4792A78817k4007K3057c26899r1771B3843J2813A0190b02490i4329L1289
15599f3040C9729Q3696a74694q9859D202b17986B82708a2278j79234h6208B4099
15587d2839B33250D1945a41970A50964d8277H0935a06424j0337k87265a18377
$$ plain form
15576 -35056 256803 -279257 -19191 3097 -91832 128085 -7587 289469 111974 101218 -16575
15564 -71957 26746 -377467 -25450 231983 91549 -154230 -9014 -334146 -10962 295780 -261525
15552 18250 95385 -134281 96865 -150575 243906 143729 -193342 11466 -50560 196245
15541 218241 -345417 110421 -162211 274032 -151217 97066 36303 -60002 -150068 -46439
15530 -21110 -70282 -72221 -114558 -111283 19502 182885 -67666 27402 -97105 36476 -249368 -232873
15518 -232873 -189279 179578 -135422 9429 -153492 134047 205015 -96437 196442 261513 31623
15506 58044 142126 -250963 -49038 303047 -140648 99008 -91451 345433 -24545 -134714 -4105
15494 -53895 23618 152501 207511 -110613 -74877 33555 -316742 -98341 59377 14178 197903
$$ packed form
15576c5056B56803b79257a9191C097i1832A28085g587B89469A11974j0756a6575
15564g1957B6746c77467b5450B31983I1549a54230i014l25132a0962B95780b61525
15552A8250P7135a34281I6865a50575B43906j00177a93342A1466e0560A96245
15541B18241c45417A10421a62211B74032a51217I7066C6303f0002r0066d6439
15530b1110m9172j939m2337L275A9502J63383f7666B7402i7105C6476b49368J6495
15518b32873M3594A79578a35422I429a53492A34047P0968i6437A96442O5071C1623
15506E8044Q4082b50963d9038C03047a40648I9008i1451C45433b4545j10169d105
15494e3895B3618J28883N5010a10613L5736C3555c16742i8341E9377A4178J83725
$$ plain form
15483 197903 -21809 59983 76445 132517 -141749 45101 197956 -253365 -15562 197607 161363
15472 161363 -199865 99102 -339536 259296 106421 -92197 -307558 -232105 224241 64547
15461 -154184 93535 65525 -196515 -82965 -1575 90833 -123908 -12531 -118755 69722 -187953
15449 11693 20183 -97166 213415 261023 -133105 -26693 -28953 108241 2293 -5098 63622 174192
15437 174192 -3914 -304284 288861 52068 -56904 126604 187252 17191 -235681 3695 -228616
15425 212117 57498 228135 93860 8475 185619 -226742 34964 -78464 -40077 -121986 -204810
15414 -204810 -39505 -10175 -246561 -496073 15148 87070 330954 51341 -109973 172918
15403 89089 -121915 -164872 -112387 23254 186873 -223066 202371 -102258 -65737 -167674
$$ packed form
15483A97903b1809E9983J6462N6072a41749D5101J52855b53365a5562A97607l6244
15472A61363a99865I9102c39536B59296A06421i2197k15361P5453B24241F4547
15461a54184I3535k8010a96515h2965a575I0833a23908a2531j06224F9722a87953
15449A1693Q490i7166B13415M7608a33105b6693k260A08241B293e098F3622J10570
15437A74192c914l00370B88861E2068e6904A26604O0648A7191b35681C695b28616
15425B12117E7498J70637I3860H475J77144b26742C4964g8464L8387q1909q2824
15414b04810c9505a0175k36386k49512A5148P1922K43884E1341a09973A72918
15403H9089a21915m2957N2485B3254J63619b23066B02371a02258L6521j01937
$$ plain form
15393 -167674 20804 59499 -53651 181030 -207951 -316751 -120268 208866 -9518 112485
15382 -180690 252920 -77617 -51033 139266 88120 -87793 -79025 406519 -149237 -57583 52758
15370 110827 138262 263063 115846 125153 -29580 -146463 216579 -279956 259357 -73086
15359 156209 329220 131610 -78611 61568 -150153 -107956 -348641 87042 335858 -183858
15348 18223 -152869 -313234 114307 262180 -187591 65747 -116100 63436 339693 171015
15338 171015 49576 -82377 175242 -214780 111473 272577 -275828 87526 -110901 46596
15327 21557 12340 -135107 94903 191408 -30065 185789 12454 -114248 -203185 -60135 -94930
15316 -94930 -36312 24424 264026 -61518 130532 -136096 -285140 -115411 -83072 1200 226002
$$ packed form
15393a67674B0804L8695e3651A81030b07951j08800a20268B08866i518A12485
15382a80690B52920g7617K6584A39266n1146h7793Q768D06519a49237e7583E2758
15370A10827K7435J24801A15846R307b9580j16883B16579b79956B59357g3086
15359A56209J73011A31610g8611F1568a50153M2197k40685H7042K48816a83858
15348A8223a52869j60365A14307J47873a87591F5747a16100F3436K76257j68678
15338A71015D9576h2377A75242b14780A11473J61104b75828H7526a10901D6596
15327B1557r217a35107I4903R6505c0065A85789A2454a14248q8937f0135l4795
15316i4930c6312B4424K39602f1518A30532a36096j49044a15411L2339A200K24802
$$ plain form
15305 226002 144238 258688 52776 248109 102030 153233 28206 130437 269211 -119241
15294 176032 265909 -13893 399825 242362 -388723 196818 71098 40027 -168340 215043
15283 -32846 63207 40816 -98542 -100186 114425 113089 35730 188864 -56913 207635 223311
15272 223311 -142663 -171592 -72071 104212 -168267 -58504 -19525 -11949 74868 -61332 -182313
15261 -182313 153316 -162492 212333 130559 258278 277558 168629 -121181 209134 52051
15250 108034 756746 565116 806828 1060496 1281406 1153652 512134 106698 67454 89595
15240 89595 156794 215909 153362 157217 391595 324639 -48241 -207252 -24038 -197361 -183671
15229 -183671 247953 -120610 222017 53535 280371 90113 -390114 -405077 -121344 -261041
$$ packed form
15305B26002q1764J14450E2776J95333A02030N1203B8206J02231J38774a19241
15294A76032Q9877a3893C99825j57463c88723A96818G1098l1071a68340B15043
15283c2846F3207k2391i8542j644A14425j336C5730J53134e6913B07635J5676
15272B23311a42663k8929g2071A04212a68267e8504a9525P576G4868f1332j20981
15261a82313A53316a62492B12333q1774J27719J9280j08929a21181B09134E2051
15250A08034O48712j91630K41712K53668K20910j27754E12134A06698l9244K2141
15240H9595O7199N9115o2547L855K34378o6956d8241j59011b4038j73323J3690
15229a83671B47953a20610B22017E3535K26836I0113c90114j4963a21344j39697
$$ plain form
15219 -261041 -392310 18454 163859 220620 125979 -168975 161024 50205 -91265 21827 212596
15208 212596 452688 404991 179485 36372 -100118 -122673 236560 6346 205601 331293
15198 331293 -79316 -183204 -180988 283081 -97470 190784 115431 52418 -249217 -164086 171937
15186 128279 85437 143431 -16257 47235 -47594 287855 -40559 -7849 -41096 -34394 -76846 -126975
15174 -126975 53570 -82132 -240784 6998 53322 182628 -389913 -357582 -23965 60165 19643
15162 283211 188026 -214089 313973 180304 272872 108286 -12417 394038 16179 217055
15152 217055 234557 178155 84211 -52620 -27429 183551 -53298 194629 105634 385454 -27162
15140 62927 97473 702885 67856 -163652 282148 107245 260849 -133169 21800 43105
$$ packed form
15219b61041j31269A8454J45405N6761r4641a68975A61024E0205i1265B1827J90769
15208B12596K40092m7697A79485C6372a00118k2555B36560F346J99255J25692
15198C31293g9316j03888K216B83081i7470A90784p5353E2418b49217Q5131A71937
15186A28279m2842N7994a6257D7235d7594B87855d0559g849l3247O702m2452n0129
15174a26975E3570h2132j58652F998M6324J29306c89913L2331b3965F0165A9643
15162B83211r5185b14089C13973j33669R2568A08286a2417C94038A6179K00876
15152B17055J7502n6402H4211e2620K5191A83551e3298A94629q8995K79820b7162
15140F2927L4546O05412F7856a63652B82148A07245J53604a33169B1800K1305
$$ plain form
15130 43105 86097 81152 355152 -66777 338342 -2290 625382 288615 -20065 45592 150466
15119 150466 84081 248575 219937 264712 243703 188367 -73844 430352 196790 131372 -25795
15107 -207256 274922 348200 -186711 24314 432446 57688 -42227 79622 -126766 -117899 260823
15095 -39317 368155 -58301 277553 -19493 270909 283627 -32747 -55278 -30335 163989 -161988
15083 280946 344326 174036 193405 128888 -203681 216703 -298706 162573 -145965 160350
15072 128956 306936 -24744 20146 158701 -128265 156926 -69435 45542 253285 209089
15062 209089 78003 89734 -47403 127454 375442 64261 269934 165171 253438 228120 134467
15051 134467 157547 213230 309275 142263 216279 8339 329844 78343 544447 -48834 323989
$$ packed form
15130D3105M2992m945K74000f6777C38342b290F25382B88615b0065D5592J04874
15119A50466o6385J64494k8638M4775k1009n5336g3844D30352A96790o5418b5795
15107b07256B74922P3278a86711B4314M08132E7688d2227G9622a26766Q867B60823
15095c9317C68155e8301B77553a9493B70909J2718c2747k2531K4943A63989a61988
15083B80946O3380j70290J9369o4517b03681B16703b98706A62573a45965A60350
15072A28956J77980b4744B0146J38555a28265A56926f9435D5542K07743m4196
15062B09089G8003J1731d7403A27454K47988F4261K05673j04763Q8267k5318r3653
15051A34467K3080N5683R6045A42263P4016H339L21505G8343M66104d8834C23989
$$ plain form
15039 -176232 295983 43930 39337 191111 262314 -38750 338863 117259 103761 117733 461792
15028 461792 69919 -203599 31030 -251078 67479 -44018 234668 -176370 173575 231107
15018 231107 -20633 209120 346970 136967 273196 188433 211680 176982 189441 56167 119867
15007 119867 89560 66109 322695 452139 108060 643467 186220 53971 90217 56600
14997 56600 43384 313300 27706 262164 238848 384666 91276 -1264 250635 -16242 233865
14985 166391 325907 129472 288580 83541 253263 113692 128104 201101 108600 171758
14975 171758 9345 13037 514780 -24937 369679 226760 297527 320803 333443 -102492 76912
14963 318804 -90016 302299 271389 416713 75319 -185814 133328 230509 421809 355459
$$ packed form
15039a76232B95983D3930m593J51774P1203c8750C38863A17259j3498J3972L44059
15028D61792F9919b03599C1030b51078F7479d4018B34668a76370A73575N7532
15018B31107b0633B09120J37850A36967J36229q4763K3247l4698J2459E6167O3700
15007A19867l0307k3451K56586J29444A08060N35407A86220E3971L6246l3617
14997E6600j3216K69916B7706K34458k3316J45818I1276a264B50635a6242B33865
14985A66391J59516A29472J59108H3541J69722A13692J4412P2997r2501O3158
14975A71758I345L692N01743b4937C69679j42919P0767K3276J2640a02492G6912
14963C18804i0016C02299l0910J45324G5319a85814A33328R7181J91300o6350
$$ plain form
14953 355459 -63255 199998 415352 216401 194326 256962 77951 343111 487395 325053
14943 325053 61206 379720 41735 265596 -2028 250825 339056 471025 219046 198673 433949
14932 433949 534376 299723 445659 21513 410720 160182 478779 191414 379546 104356
14921 59311 486400 574442 260707 408912 270935 497541 101419 211884 434119 -9619
14910 107510 247517 238728 419057 110506 488503 292372 409486 291199 379167 240698
14900 240698 753022 228543 254203 453017 99594 306353 540543 287909 242062 231392
14890 231392 349136 271580 262087 292256 -73676 354062 108461 616468 220310 118686
14880 118686 544471 270173 112727 -122259 196354 321964 329649 295971 383440 444836
$$ packed form
14953C55459f3255A99998K15354j98951k2075O2636G7951K65160J44284j62342
14943C25053F1206L18514D1735K23861b028B50825Q8231J31969B19046k0373K35276
14932D33949J00427k34653J45936B1513L89207A60182L18597A91414J88132A04356
14921E9311M27089Q8042B60707J48205j37977K26606A01419J10465K22235i619
14910A07510J40007q789J80329A10506L77997j96131J17114j18287Q7968j38469
14900B40698N12324B28543K5660J98814I9594K06759K34190k52634m5847j0670
14890B31392J17744p7556r493L0169g3676C54062A08461N08007B20310j01624
14880A18686M25785B70173A12727a22259A96354J25610P685l3678Q7469O1396
$$ plain form
14870 444836 510613 145004 411410 180405 516952 186195 335536 193416 427100 78169
14859 185054 359191 487686 328518 196805 475679 533368 420352 549559 411567 28539
14848 292559 523447 398936 296509 403061 198163 297985 336917 369070 416979 155223
14837 552421 508154 322798 591846 654660 350488 414013 287257 432475 580349 441587
14827 441587 731175 714540 494840 402674 277418 504718 312078 287572 560073 603921
14817 603921 507401 535511 544646 172452 311101 458957 412165 403949 803961 439548 535542
14806 535542 414481 489520 566265 526259 520412 623461 365653 467015 410940 591773 591105
14795 591105 219211 372966 473053 187957 278792 413773 408686 524746 498040 853060
$$ packed form
14870D44836O5777A45004K66406A80405L36547A86195J49341j42120K33684G8169
14859A85054J74137J28495j59168j31713K78874N7689j13016J29207j37992B8539
14848B92559K30888j24511j02427J06552A98163R9822L8932L2153M7909A55223
14837E52421m4267j85356K69048O2814l04172O3525j26756J45218J47874j38762
14827D41587K89588j6635k19700r2166j25256K27300j92640k4506K72501M3848
14817F03921r6520K8110R135A72452J38649J47856m6792q216M00012l64413R5994
14806E35542j21061P5039P6745m0006n847J03049k57808J01362n6075J80833o68
14795E91105B19211J53755J00087A87957R0835J34981n087J16060k6706L55020
$$ plain form
14785 853060 463879 560761 504342 594726 383999 462023 552060 415057 627065 498231
14775 498231 853197 678275 884097 613713 693550 545514 477582 694774 570130 907745
14765 907745 582868 446137 704245 747605 641383 695025 414376 564827 825420 719253
14755 719253 640554 450488 691291 769540 750127 492333 670094 697179 654912 591378 378423
14744 378423 893561 343686 738615 686698 713456 593148 762962 420577 478352 772933
14734 772933 724993 600671 534567 586246 879220 700395 957095 621227 601658 701224
14724 701224 721979 501601 607361 552156 1041604 616035 768483 792388 618895 866922
14714 866922 864786 955756 618657 883217 923791 571743 590934 583461 1044134 803117 735031
$$ packed form
14785H53060l89181R6882n6419R0384k10727P8024R0037j37003K12008j28834
14775D98231L54966j74922K05822k70384P9837j48036o7932K17192j24644L37615
14765I07745l24877j36731K58108M3360j06222N3642k80649J50451K60593j06167
14755G19253p8699j90066K40803P8249j9413k57794J77761K7085m2267o3534k12955
14744C78423N15138C43686L94929n1917K6758j20308J69814l42385N7775K94581
14734G72933m7940j24322o6104N1679K92974j78825K56700l35868j9569R9566
14724G01224K0755k20378J05760n5205M89448m25569J52448K3905j73493K48027
14714H66922k136R0970l37099K64560M0574l52048J9191p473M60673k41017o8086
$$ plain form
14703 735031 765678 867110 807959 409867 582743 509669 493399 516999 859461 919961 1060465
14692 1060465 966523 1091033 1309190 1079197 768296 932359 722777 938555 632308 1078824
14682 1078824 922137 946717 798768 690068 857879 1127822 884862 815227 1071036 1055589
14672 1055589 1196178 996636 866256 1136560 667712 840872 853303 1169605 920163 932376
14662 932376 847311 929544 1132434 1081338 866375 789843 1171600 532985 1093369 1093879 1152986
14651 1152986 1007260 1100494 1240362 1130229 1083794 1319749 1383185 1470055 1182497 1047463
14641 1047463 1285110 897807 1055107 1101968 1038672 1146628 1434047 1159080 1107979 1172921
14631 1172921 1278016 1078605 1447125 1373013 1505552 1220434 1532773 1228270 1163409 1485221
$$ packed form
14703G35031L0647J01432n9151l98092J72876p3074j6270K3600L42462O0500J40504
14692A060465r3942J24510K18157k29993l10901J64063k09582K15778l06247M46516
14682A078824j56687K4580j47949j08700J67811K69943k42960o9635K55809j5447
14672A055589J40589j99542j30380K70304m68848J73160J2431L16302k49442J2213
14662I32376q5065Q2233K02890n1096k14963p6532L81757E32985N60384N10N9107
14651A152986j45726R3234J39868j10133m6435K35955O3436Q6870k87558j35034
14641A047463K37647l87303J57300M6861o3296J07956K87419k74967n1101O4942
14631A172921J05095j99411L68520p4112J32539k85118L12339l04503o4861L21812
$$ plain form
14621 1485221 1332194 1283931 948972 1187318 1444238 1414697 1387502 1116792 1517268 1367522
14611 1367522 1386772 1449065 1546984 1108099 1364916 1173432 1195922 1719152 1269949 1718464
14601 1718464 1688214 1736598 1671879 1430508 1531819 1221374 1518117 1606528 1756630 1870634
14591 1870634 1356841 1440921 1893571 1565786 1727635 1892419 1840548 1848022 1876502 1796586
14581 1796586 1599503 1685931 1772489 2139818 1738232 1943048 1756504 1952655 1956762 2049620
14571 2049620 2060676 2324847 2022649 2112142 2123067 2178111 2102843 2109497 2478508 2341367 2040428
14560 2040428 2792734 3167716 2765439 2820772 2757878 2875425 2956299 3510593 3594882 4260936
14550 4260936 5355835 7795794 12496213 20589912 35385286 39016624 20220879 10312152
$$ packed form
14621A485221j53027m8263l34959K38346K56920k9541k7195k70710M00476j49746
14611A367522J9250O2293R7919m38885K56817j91484K2490N23230m49203M48515
14601A718464l0250M8384o4719k41371J01311l10445K96743Q8411J50102J14004
14591A870634n13793Q4080M52650l27785J61849J64784n1871P474K8480p9916
14581A796586j97083Q6428Q6558L67329m01586K04816j86544J96151M107R2858
14571B049620J1056K64171l02198Q9493J0925N5044p5268O654L69011j37141l00939
14560B040428P52306L74982m02277N5333o2894J17547Q0874N54294Q4289O66054
14550D260936J094899K439959M700419Q093699J4795374L631338j8795745r908727
$$ plain form
14542 10312152 5202381 3635659 2960581 3033410 2278226 2307057 1935225 1744839 2000924
14533 2000924 1830919 2083526 1848478 2379590 2188607 1977577 2127909 2146227 2255646 2435469
14523 2435469 2370267 1847569 2445658 2025779 2307425 2408339 2675410 2360611 2292125 2253318
14513 2253318 2279350 2774886 2625000 3028804 2721490 2930205 2828256 2878391 2976309 2538472
14503 2538472 2994461 2974689 2605829 3209578 2963063 2947842 3060891 3036673 3029603 3182776
14493 3182776 2917269 3085029 3235897 3347070 3325032 3496708 3514951 3543388 3525141 3482094
14483 3482094 3475348 3550036 3392399 3550848 3757783 3631884 3398733 4076593 3655619 4086388
14473 4086388 4080436 4016974 4141501 4115263 4129322 4265688 4085836 4316551 4146545 4832776
$$ packed form
14542A0312152n109771j566722o75078P2829p55184K8831l71832j90386K56085
14533B000924j70005K52607k35048N31112j90983k11030J50332J8318J09419J79823
14523B435469o5202n22698N98089m19879K81646J00914K67071l14799o8486l8807
14513B253318K6032M95536j49886M03804l07314K08715j01949N0135R7918m37837
14503B538472M55989j9772l68860O03749k46515j5221J13049k4218p070J53173
14493C182776k65507J67760J50868J11173k2038J71676J8243K8437j8247m3047
14483C482094o746P4688j57637J58449K06935j25899k33151O77860m20974M30769
14473D086388n952o3462J24527k6238J4059J36366j79852K30715j70006O86231
$$ plain form
14463 4832776 4659791 4663404 4588389 4750274 4886233 4640390 4768746 4831345 4938693 5000988
14453 5000988 5247981 5017524 4964015 5300865 5421087 5253589 5546818 5631096 5623437 5927217
14443 5927217 5863288 5921845 5532730 5850556 6072565 5999376 6508726 6145932 6086438 6514323
14433 6514323 6670091 6817320 6860518 6780206 7134408 6871398 6999290 6950435 6987788 7265320
14423 7265320 7566793 7336710 7122629 7797921 7805989 8491524 7994095 8143081 8237634 8516167
14413 8516167 8615594 8828939 8805340 9058246 9030370 9240053 8928343 9239605 9584062 9711273
14403 9711273 10049985 10029934 10592266 10286447 10526543 10755401 10937914 10977799 10969000 11139889
14393 11139889 11549037 11622987 11712491 11890188 12055347 12284277 12745907 12698201 12859075 13190575
$$ packed form
14463D832776j72985L613p5015J61885J35959k45843J28356O2599J07348O2295
14453E000988K46993k30457n3509L36850J20222j67498K93229Q4278p659L03780
14443E927217o3929N8557l89115L17826K22009p3189N09350l62794n9494M27885
14433F514323J55768J47229M3198q0312L54202k63010J27892m8855L7353K77532
14423G265320L01473k30083k14081O75292Q068O85535m97429J48986R4553K78533
14413H516167R9427K13345k3599K52906k7876K09683l11710L11262L44457J27211
14403I711273L38712k0051N62332l05819K40096K28858J82513L9885q799J70889
14393A1139889M09148P3950Q9504J77697J65159K28930M61630m7706J60874L31500
$$ plain form
14383 13190575 13686462 13688590 14154898 14044139 14618332 14791372 14985248 15236521 15289086 15838433
14373 15838433 15964280 16385137 16589443 17088925 17637350 17959656 18197949 18899891 18901797 19511635
14363 19511635 19943313 20524708 20442923 21306409 21729261 22123249 22367670 22941703 23609931
14354 23609931 23987283 24607608 25657575 25894314 26350210 27231696 28034915 28459437 29471006
14345 29471006 29999007 30905546 31843036 32348313 33555117 33993927 35597659 36214149 37244738
14336 37244738 38271524 39303343 40599635 41575657 42789697 44193630 45656559 46819355
14328 46819355 48400532 50044660 51595973 53392628 54762171 56812087 58930934 61152984
14320 61152984 62998813 65133765 67709527 70083747 72864821 75259292 78689017 81109105
$$ packed form
14383A3190575M95887K128M66308j10759N74193J73040J93876K51273N2565N49347
14373A5838433J25847M20857K04306M99482N48425L22306K38293P01942J906O09838
14363A9511635M31678N81395q1785Q63486M22852L93988K44421N74033O68228
14354B3609931L77352O20325J049967K36739M55896Q81486Q03219M24522J011569
14345B9471006N28001R06539R37490N05277J206804M38810J603732O16490J030589
14336C7244738J026786J031819J296292R76022J214040J403933J462929J162796
14328D6819355J581177J644128J551313J796655J369543K049916K118847K222050
14320F1152984J845829K134952K575762K374220K781074K394471L429725K420088
$$ plain form
14312 81109105 84645043 88306830 91968234 95310822 99750212 103926336 108313700 113288430
14304 113288430 118537801 123771951 129102151 135586145 141952132 148819590 155601837 163474594
14296 163474594 171826800 180359902 189429094 198750021 208851175 219333193 230392466
14289 230392466 241819759 253847613 266767209 279966054 293755898 307748083 322155788
14282 322155788 337052646 351928685 366719600 381194150 394686767 408276453 420320445
14275 420320445 430866496 438901244 441072931 439670772 438912787 439949719 441051368 433131883
14267 433131883 428417241 421987786 412146481 401807172 391084647 380170058 368202926
14260 368202926 355175566 341791443 326376058 311627283 296803463 282526530 268653490
$$ packed form
14312H1109105L535938L661787L661404L342588M439390M176124M387364M974730
14304A13288430N249371N234150N330200O483994O365987O867458O782247P872757
14296A63474594Q352206Q533102R069192R320927J0101154J0482018J1059273
14289B30392466J1427293J2027854J2919596J3198845J3789844J3992185J4407705
14282C22155788J4896858J4876039J4790915J4474550J3492617J3589686J2043992
14275D20320445J0546051Q034748K171687j402159p57985J036932J101649p919485
14267D33131883m714642o429455r841305j0339309j0722525j0914589j1967132
14260C68202926j3027360j3384123j5415385j4748775j4823820j4276933j3873040
$$ plain form
14253 268653490 255377622 242173029 229821621 217561133 206671161 196234443 186134514
14246 186134514 177169426 168571510 160345778 152491642 145593275 138444232 132103722 125986199
14238 125986199 120590962 115576339 110432595 105512906 100784467 96931987 93146533 89785030
14230 89785030 85604867 82281451 79282128 75987366 73266275 70299480 67611244 65400187
14222 65400187 63207870 60606015 59048197 57132492 55244904 53361025 51409766 49794678
14214 49794678 48331374 46736410 45664814 44145672 42942718 41379581 40337591 39703073
14206 39703073 38249009 36883224 36072774 34827812 33956675 33258175 32795359 31616856 30971900
14197 30971900 30020531 29268103 28336318 27940839 27166551 26442262 25737364 25164888 24850290
$$ packed form
14253B68653490j3275868j3204593j2351408j2260488j0889972j0436718j0099929
14246A86134514q965088q597916q225732p854136o898367p149043o340510o117523
14238A25986199n395237n014623n143744m919689m728439l852480l785454l361503
14230H9785030m180163l323416k999323l294762k721091k966795k688236k211057
14222F5400187k192317k601855j557818j915705j887588j883879j951259j615088
14214D9794678j463304j594964j071596j519142j202954j563137j041990o34518
14206C9703073j454064j365785q10450j244962q71137o98500m62816j178503o44956
14197C0971900r51369p52428r31785l95479p74288p24289p04898n72476l14598
$$ plain form
14188 24850290 24124392 23514079 22949459 22730453 21979258 21520743 20889262 20519768 19716507
14179 19716507 19518639 19461791 19058829 18624305 18007272 17991907 17609804 17205295 17116395 16337355
14169 16337355 16174647 15907094 15484587 15350833 15160758 14592012 14312548 14239558 13651319
14160 13651319 13544790 13633751 13212109 13053344 12493243 12337350 12372078 11894136 11755944 11777866
14150 11777866 11343179 11123059 11136303 10848067 10798694 10666242 10697718 9932351 9946191 9739664
14140 9739664 9848183 9698111 9471514 9292062 9077899 8988809 8678036 8704126 8597038 8389793
14130 8389793 8120168 8353561 8167319 7888538 7788054 7798656 7788995 7591802 7412278 7538539
14120 7538539 7018083 7267326 6977269 7238990 7211507 6540026 6589170 6650709 6740126 6791902
$$ packed form
14188B4850290p25898o10313n64620k19006p51195m58515o31481l69494q03261
14179A9716507j97868n6848m02962m34524o17033j5365l82103m04509q8900p79040
14169A6337355j62708k67553m22507j33754j90075n68746k79464p2990n88239
14160A3651319j06529Q8961m21642j58765n60101j55893L4728m77942j38192K1922
14150A1777866m34687k20120J3244k88236m9373j32452L1476p65367J3840k06527
14140I739664J08519j50072k26597j79452k14163q9090l10773K6090j07088k07245
14130H389793k69625K33393j86242k78781j00484J0602r661j97193j79524J26261
14120G538539n20456K49243k90057K61721k7483o71481M9144O1539Q9417N1776
$$ plain form
14110 6791902 6294790 6258866 6360308 6150641 6150498 6062911 6007547 6093206 5858690 5768035 5647210
14099 5647210 5624070 5850758 5330043 5489653 5252376 5276768 5492584 5204529 5158958 5011659
14089 5011659 5014148 4931129 5017211 4935775 4689467 4955610 4575948 4753410 4609461 4915311
14079 4915311 4383433 4507254 4437665 4625743 4536354 4384987 4222265 4277426 4332343 4388600
14069 4388600 4423498 3985850 4125509 3888269 3956848 3811295 3800064 3626972 3964701 4163596
14059 4163596 3913856 3980250 3605019 3530622 3929745 3649007 3770455 3696151 3519949 3500962
14049 3500962 3483239 3482868 3550557 3403657 3417116 3253066 3234480 3115581 3152764 3230671 2769531
14038 2769531 3501362 2854513 3297513 3137872 3126562 3168660 2540839 2975822 2947249 2992879
$$ packed form
14110F791902m97112l5924J01442k09667j43q7587n5364Q5659k34516r0655j20825
14099E647210k3140K26688n20715J59610k37277K4392K15816k88055m5571j47299
14089E011659K489q3019Q6082q1436k46308K66143l79662J77462j43949L05850
14079D915311n31878J23821o9589J88078q9389j51367j62722N5161N4917N6257
14069D388600L4898m37648J39659k37240O8579j45553j1231j73092L37729J98895
14059D163596k49740O6394l75231p4397L99123k80738J21448p4304j76202j8987
14049C500962j7723l71O7689j46900J3459j64050j8586j18899L7183P7907m61140
14038B769531P31831o46849M43000j59641j1310M2098o27821M34983k8573M5630
$$ plain form
14028 2992879 2747228 2590205 2760116 2941387 2666235 2476898 2543587 2454906 2612486 2413466
14018 2413466 2390923 2384311 2395159 2430765 2371911 2408797 2194526 2524100 2299539 2358068 2195266
14007 2195266 2487933 2185889 2180904 2313526 2398020 1924553 2068518 1887477 2010970 2053518
13997 2053518 1924204 2038822 2244277 1708478 1836680 1883498 2046277 2560568 4036276
13988 4036276 7297570 14103200 28123403 41656314 23565324 14262773 8817097 6572754
13980 6572754 5540930 4394078 3717259 3552283 3136306 2735047 2874865 2633789 2378016
13971 2378016 2544684 2387567 2151442 2342033 2351899 2231059 2194564 2402454 2384798 2009197
13961 2009197 1904426 1877095 1761226 2270981 2151038 2088270 1763408 1948216 1832070 1975059
$$ packed form
14028B992879k45651j57023J69911J81271k75152j89337O6689q8681J57580j99020
14018B413466k2543o612J0848L5606n8854L6886k14271L29574k24561N8529j62802
14007B195266K92667l02044m985J32622Q4494m73467J43965j81041J23493M2548
13997B053518j29314J14618K05455n35799J28202M6818J62779N14291J475708
13988D036276L261294O805630J4020203J3532911j8090990r302551n445676k244343
13980F572754j031824j146852o76819j64976m15977m01259J39818k41076k55773
13971B378016J66668j57117k36125J90591R866j20840l6495K07890j7656l75601
13961B009197j04771k7331j15869N09755j19943o2768l24862J84808j16146J42989
$$ plain form
13951 1975059 1963647 2025955 1588969 1832209 1647303 1954915 1850569 2115283 1758225 1719051
13941 1719051 1666589 1828187 1630896 1685392 1906594 1549536 1619984 1809921 1522937 1705530
13931 1705530 1468604 1641028 1570633 1346163 2062668 1563762 1559031 1826907 1460068 1611292
13921 1611292 1276829 1607270 1653889 1625316 1228016 1339180 1507620 1309180 1385017 1609655
13911 1609655 1529673 1717045 1529549 1442466 1568556 1398214 1230095 1265922 1546472 1490834
13901 1490834 1734368 1373565 1238731 969348 1079999 1362108 1330741 1496323 1418481 1228194
13891 1228194 1330079 1345285 1382692 1217262 1244635 1192567 1288607 983076 1383163 1208222
13881 1208222 1065652 1216822 1244473 1362804 1182894 1028102 1326895 1158386 991842 1229360
$$ packed form
13951A975059j1412O2308m36986K43240j84906L07612j04346K64714l57058l9174
13941A719051n2462J61598j97291N4496K21202l57058P0448J89937k86984J82593
13931A705530k36926J72424p0395k24470P16505m98906m731K67876l66839J51224
13921A611292l34463L30441M6619k8573l97300J11164J68440j98440P5837K24638
13911A609655p9982J87372j87496q7083J26090j70342j68119L5827K80550n5638
13901A490834K43534l60803j34834k69383J10651K82109l1367J65582p7842j90287
13891A228194J01885J5206L7407j65430K7373n2068R6040l05531M00087j74941
13881A208222j42570J51170K7651J18331j79910j54792K98793j68509j66544K37518
$$ plain form
13871 1229360 1112590 1052630 1079121 1021710 1028782 1382064 1187897 1047199 942311 961226
13861 961226 1389458 786445 924535 1136596 902601 1050456 1053396 893262 1078869 1341612
13851 1341612 834884 908249 965653 915033 941289 983620 855309 851055 1048490 905353 916182
13840 916182 882474 795913 1147865 956516 923048 772664 883594 920642 541473 739507
13830 739507 815152 811256 1037535 796491 706199 535213 496434 1304672 966736 1023314 792144
13819 792144 857559 871743 1061378 921089 996428 712687 993322 928750 852573 914443 1042007
13808 1042007 915506 812371 999902 846647 660335 952211 539214 1080604 895062
13799 895062 763649 799162 514466 594109 706289 753065 729250 858940 868697 729154 598855
$$ packed form
13871A229360j16770n9960K6491n7411P072L53282j94167j40698j04888J8915
13861I61226M28232o03013J38090K12061k33995J47855K940j60134J85607K62743
13851A341612n06728P3365N7404n0620K6256M2331j28311m254J97435j43137J0829
13840I16182l3708q6561L51952j91349l3468j50384J10930L7048l79169J98034
13830G39507P5645l896K26279k41044r0292j70986l8779Q08238l37936N6578k31170
13819G92144O5415J4184J89635j40289P5339k83741K80635o4572p6177O1870J27564
13808A042007j26501j03135J87531j53255j86312K91876m12997N41390j85542
13799H95062j31413L5513k84696P9643J12180M6776k3815J29690R757j39543j30299
$$ plain form
13788 598855 516620 606816 736606 518363 818235 878964 484429 893853 751837 758612
13778 758612 715501 669044 703741 476663 615638 764501 552269 773745 704768 534491
13768 534491 667407 390412 643628 463697 761951 765775 395984 585751 522938 800101
13758 800101 464911 717296 83782 832442 524286 609470 747537 475640 645680 909095
13748 909095 1013484 428693 867743 537187 430697 592584 537488 314947 210054 660245
13738 660245 714069 628574 630072 519175 757528 561451 454913 867492 592113 522820
13728 522820 661839 436051 845380 552891 380691 671398 373487 625057 696927 512981
13718 512981 636358 642271 649512 587049 409344 720977 448267 635066 496103 437517 431724
$$ packed form
13788E98855q2235R0196J29790k18243K99872O0729l94535M09424j42016O775
13778G58612m3111m6457L4697k27078J38975J48863k12232K21476o8977j70277
13768E34491J32916k76995K53216j79931K98254L824l69791J89767o2813K77163
13758H00101l35190K52385H3782P48660l08156Q5184J38067k71897J70040K63415
13748I09095J04389D28693M39050l30556j06490J61887n5096k22541j04893M50191
13738F60245N3824q5495J498j10897K38353j96077j06538M12579k75379o9293
13728E22820J39019k25788M09329k92489j72200K90707k97911K51570P1870j83946
13718E12981J23377N913P241o2463j77705L11633k72710J86799j38963n8586n793
$$ plain form
13707 431724 704026 595941 905547 772335 588500 444626 295639 349068 614724 540373
13697 540373 656732 494888 561931 464622 578095 295868 420581 572215 325942 376277
13687 376277 507622 505904 533790 563593 409832 454450 626676 467893 787213 491695
13677 491695 420713 649742 718320 494149 444528 439620 392410 646893 506405 555577 428339
13666 428339 543682 125849 684187 841895 378311 402301 534850 561353 838881 296772
13655 645966 556024 683714 454035 207113 488975 494038 260092 529766 390909 317712
13645 317712 154467 93411 391647 548234 173926 491942 441371 501647 388076 444405
13635 444405 608210 276577 411907 724979 460850 463695 250358 309358 368043 163993
$$ packed form
13707D31724K72302j08085L09606j33212j83835j43874j48987N3429K65656p4351
13697E40373J16359j61844O7043r7309J13473k82227J24713J51634k46273N0335
13687C76277J31345j718K7886K9803j53761M4618J72226j58783L19320k95518
13677D91695p0982K29029O8578k24171m9621m908m7210K54483j40488M9172j27238
13666D28339J15343A25849N58338J57708C78311K3990J32549K6503K77528B96772
13655F45966q9942J27690k29679B07113K81862N063k33946K69674j38857p3197
13645C17712A54467o1056K98236J56587A73926L18016n0571O0276j13571N6329
13635D44405J63805B76577J35330L13072k64129K845k13337N9000N8685A63993
$$ plain form
13624 279170 429772 256300 200371 185540 341858 273566 192004 287806 474281 365378
13614 365378 -36982 202945 355892 591107 514281 644389 307003 375238 359663 432767
13604 432767 379690 448735 233913 348881 450367 563786 397818 388042 193734 546704
13594 546704 266969 219484 192437 112772 273948 320130 294559 164592 432924 292910
13584 292910 375366 349003 274667 610528 135300 265318 461340 421162 448262 262979
13574 262979 313546 461527 478947 566537 304352 270927 347364 348092 260011 488905 261539
13563 261539 5466 236870 509942 156238 233522 351910 250784 446889 517825 176367
13552 381685 51541 120371 295550 606483 430262 82384 486725 264914 312289 230952
$$ packed form
13624B79170J50602j73472n5929j4831J56318o8292q1562R5802J86475j08903
13614C65378c6982B02945J52947K35215p6826J30108C07003O8235j5575P3104
13604D32767n3077O9045k14822J14968J01486J13419j65968r776A93734L52970
13594E46704B66969m7485k7047p9665J61176M6182k5571j29967K68332j40014
13584B92910Q2456k6363p4336L35861A35300J30018J96022m0178K7100j85283
13574B62979N0567J47981J7420Q7590k62185l3425P6437P28q8081K28894k27366
13563B61539E466K31404K73072A56238P7284J18388j01126J96105P0936A76367
13552C81685E1541O8830J75179L10933j76221H2384M04341k21811M7375q1337
$$ plain form
13542 230952 403819 230494 268291 315644 152221 313589 -42448 411559 317227 426521
13532 426521 -7420 416099 243438 511186 479627 213647 357943 371331 417753 361613 -61811
13520 182860 10669 -77799 197133 355457 200306 191811 478014 299511 445868 6172 302620
13509 302620 383588 247487 3630 174541 356884 347401 53162 179280 290157 121147 36502
13497 452192 234021 418155 477246 342113 319076 200341 465759 27958 31987 137244
13487 137244 130390 220935 436074 81888 366262 127071 308631 -122610 366226 363495 -82922
13475 329735 -17560 333625 132486 211878 -182020 221347 205977 520220 189306 4344
13464 256658 322669 77646 231523 73072 339267 168506 451414 107592 418080 299015
$$ packed form
13542B30952J72867j73325L7797M7353A52221J61368d2448D11559r4332J09294
13532D26521g420D16099j72661K67748l1559B13647J44296J3388M6422n6140f1811
13520A82860A0669g7799A97133J58324j55151q495K86203j78503J46357F172K96448
13509C02620Q0968j36101C630J70911J82343r483E3162J26118J10877A21147C6502
13497D52192k18171J84134N9091j35133k3037j18735K65418B7958M029J05257
13487A37244o854R0545K15139H1888K84374A27071J81560a22610C66226k731h2922
13475C29735a7560C33625A32486P9392a82020B21347j5370L14243A89306D344
13464B56658O6011G7646J53877G3072K66195A68506K82908A07592L10488j19065
$$ plain form
13454 299015 349823 218524 37030 300804 96209 -119167 299105 227057 207076 -138175
13443 509961 96647 341474 247346 156431 155672 407697 62868 341098 387117 40445 493740
13432 493740 356215 347607 276222 462334 -203352 486094 265813 286270 290828 176927 225781
13421 225781 -49537 228461 261398 59039 85621 230988 270674 -20986 41841 370316 300497
13410 300497 145694 228476 76798 555530 -277231 -68008 -230060 189699 441432 -55398
13399 297902 504827 209027 -69504 273098 256005 83145 -65255 202665 39467 99268 284955
13388 284955 382762 96688 -24981 398841 116813 144326 -28948 491775 478599 168163 298316
13377 298316 155835 107529 -202198 243999 214228 512726 22936 166292 411673 46823
$$ packed form
13454B99015N0808j31299C7030K63774I6209a19167B99105p2048j9981a38175
13443E09961I6647K44827r4128r0915p59K52025F2868K78230M6019D0445M53295
13432D93740j37525q608p1385J86112b03352D86094k20281K0457M558j13901M8854
13421B25781d9537B28461L2937E9039K6582J45367L9686b0986D1841L28475o9819
13410C00497A45694Q2782G6798M78732b77231f8008j62052A89699K51733e5398
13399B97902K06925B09027f9504B73098j7093H3145f5255B02665C9467N9801J85687
13388B84955R7807I6688b4981C98841A16813K7513b8948D91775j3176A68163J30153
13377B98316j42481m8306b02198B43999k9771K98498B2936J43356K45381D6823
$$ plain form
13366 408894 177827 264441 94162 325597 311846 116584 384221 271977 319713 283347
13356 283347 386136 246503 6362 -211529 111082 175354 162067 72631 -203452 230766
13345 542786 -69302 258772 342570 161498 444345 -95165 7219 407525 -33946 458381 583394
13334 583394 307623 14864 493732 4546 102632 267996 243302 349574 262380 82595 -2943
13322 290604 104370 448976 273390 370106 136899 193102 44535 159866 296833 334040
13312 334040 144687 36201 312927 443676 223876 -60576 240227 142247 189801 216082
13302 216082 125314 286335 -103789 236103 89517 -1086 -131850 205984 163504 113422 157243
13291 157243 39972 -74417 305439 190136 223247 232303 272975 82081 100887 124897 192467
$$ packed form
13366D08894A77827Q6614I4162K31435j3751A16584K67637j12244M7736l6366
13356B83347J02789j39633F362b11529A11082O4272j3287G2631b03452B30766
13345E42786f9302B58772Q3798A61498K82847i5165G219M00306c3946D58381J25013
13334E83394k75771A4864M78868D546R8086J65364k4694J06272q7194H2595b943
13322B90604A04370L44606j75586R6716A36899N6203D4535J15331J36967L7207
13312C34040A44687C6201K76726J30749k19800f0576B40227r7980M7554K6281
13302B16082r0768J61021a03789B36103H9517a086j30764B05984m2480n0082M3821
13291A57243C9972g4417C05439j15303L3111R056M0672H2081J8806K4010O7570
$$ plain form
13280 192467 303536 117882 358030 -26479 -30953 231592 -149346 -124696 118419 121663 -1836
13268 160417 -183067 148336 342765 132769 368105 -14977 195295 390514 273481 55398
13257 164518 270207 170557 31179 -62919 -198186 -32965 171019 1634 -261963 63959 278933
13246 278933 6916 178233 275104 35212 9521 -80610 75632 -281127 199202 135811 196875
13235 196875 324302 -26769 198062 128853 316704 15368 147841 146386 339527 268074 271657
13224 271657 230721 391462 154030 160837 -218004 -45682 -10530 258056 264138 280348 189084
13213 189084 91514 -136076 55066 17452 32181 -28359 145518 212329 24269 157111 285673
13202 285673 -105601 158592 137267 13195 -102951 87449 297732 213723 44233 82302 199660
$$ packed form
13280A92467J11069A17882K40148b6479m474B31592a49346K4650A18419L244a836
13268A60417a83067A48336J94429A32769K35336a4977A95295J95219j17033E5398
13257A64518J05689r9650C1179f2919j35267c2965A71019A634b61963F3959K14974
13246B78933F916J71317R6871C5212I521h0610G5632b81127A99202o3391O1064
13235A96875J27427b6769A98062o9209J87851A5368J32473j455J93141p1453L583
13224B71657m0936J60741A54030O807b18004d5682a0530B58056O082J6210r1264
13213A89084I1514a36076E5066A7452J4729b8359A45518O6811B4269J32842J28562
13202B85673a05601A58592k1325A3195a02951H7449K10283q4009D4233L8069J17358
$$ plain form
13191 199660 166361 138545 170789 213664 -323634 12441 357715 -174914 -55148 -63356 -170679
13180 -170679 384530 23832 -35302 82265 43636 36726 266650 -96709 63585 242122 95073
13168 -55606 -17554 -62626 129193 -64799 138893 173420 -7973 119492 163888 156533 164124 128592
13156 128592 -43279 143228 -77097 58002 144006 -83854 295446 142777 180045 147834 -167930
13144 -111858 -56428 100323 -31486 -3862 -72408 97906 12507 36415 380296 172205 -33793
13132 -251366 34677 6273 -90641 184545 242454 -118874 -28562 -21659 -264952 94954 -50001
13120 -162405 21055 7758 274101 -161187 -299008 3037 126490 190426 54210 -230802 -126726
13109 -126726 -128411 153771 126639 57035 225608 125560 79841 -30288 6292 -26867 19336
$$ packed form
13191A99660l3299k7816L2244M2875c23634A2441L45274a74914e5148q208j07323
13180a70679C84530B3832c5302H2265l8629o910K29924i6709F3585J78537I5073
13168e5606a7554m5072A29193f4799A38893L4527g973A19492M4396p355P591l5532
13156A28592d3279A43228g7097E8002Q6004h3854B95446A42777L7268l2211a67930
13144a11858N5430A00323c1486c862o8546I7906A2507K3908L43881A72205c3793
13132b51366C4677F273i0641A84545N7909a18874b8562O903k43293I4954e0001
13120a62405B1055G758K66343a61187j37821C037J23453O3936E4210b30802J04076
13109a26726j685A53771k7132E7035J68573j00048m5719c0288F292b6867A9336
$$ plain form
13097 -259523 70758 177214 470422 -193920 19997 208043 -80378 235726 -154572 456729
13086 177907 -140793 -67991 -1224 145093 222928 431174 -2300 -107906 217091 216003 225684
13075 225684 92892 -110078 -7948 262106 -10619 34502 204063 -33907 152171 -22621 -14533
13064 -14533 -30825 176758 60601 90257 125190 115235 106045 -128130 24707 -223922 -221 77881
13051 58252 70616 -396911 191061 322743 151091 289199 -36177 53070 -127520 147063
13040 223748 441821 206913 -110747 45045 95753 340156 67392 73385 410915 336157 186089
13029 186089 72147 12844 386593 232120 -183155 -54863 254626 65834 112721 198093 -238030
13017 -61963 282973 -749 70765 518562 1450 -339476 620882 355046 43124 -286659 -105406
$$ packed form
13097b59523G0758J06456K93208a93920A9997J88046h0378B35726a54572D56729
13086A77907a40793f7991a224A45093P7835K08246b300j05606B17091j088R681
13075B25684I2892a10078g948B62106a0619C4502J69561c3907A52171b2621Q088
13064a4533j6292A76758F0601K9656L4933r955r190a28130B4707b23922b21G7881
13051E8252J2364c96911A91061J31682A51091J38108c6177E3070a27520A47063
13040B23748K18073B06913a10747D5045N0708K44403F7392N993L37530p4758j50068
13029A86089G2147A2844L73749j54473a83155e4863B54626F5834M6887Q5372b38030
13017f1963B82973g49G0765M47797A450c39476F20882k65836D3124b86659a05406
$$ plain form
13005 557104 -81130 120035 -37688 216199 312702 252401 97228 -11946 -206339 145179 -129847
12993 104440 213250 -196607 312920 215999 429485 19951 291827 -195348 -63890 15282
12982 -45724 137686 -259643 239563 244178 -79631 240186 108644 -166609 352684 -147986
12971 -49685 107095 -33998 315354 -254314 402674 -328792 -22043 8687 46803 271011 -45469
12959 51966 209167 98778 -19636 33601 3579 103080 66166 151678 -180282 88698 5316 201460
12947 201460 84414 -17298 110868 -73547 145420 -152518 -7459 -11120 154160 231828 -99335
12935 269898 -71773 165499 -128979 85686 141769 17289 -203012 -44058 200934 225283 101111
12923 -202002 8637 129224 -77016 -53626 10205 34651 182138 378849 286317 -48723 -148538
$$ packed form
13005E57104h1130A20035c7688B16199R6503o0301I7228a1946j94393A45179a29847
12993A04440J08810a96607C12920r6921K13486A9951K71876a95348f3890A5282
12982d5724A37686b59643B39563M615g9631B40186A08644a66609C52684a47986
12971d9685A07095c3998C15354b54314D02674c28792b2043H687L8116K24208d5469
12959E1966J57201I8778a9636C3601C579R9501l6914Q5512a80282H8698E316J96144
12947B01460H4414a7298A10868g3547A45420a52518g459l661A54160P7668i9335
12935B69898g1773A65499a28979H5686N6083A7289b03012d4058B00934K4349A01111
12923b02002H637J20587g7016K3390A0205K4446J47487J96711r2532d8723r9815
$$ plain form
12912 -148538 -56621 -64447 -130931 109199 5876 -55883 80137 -25531 -85710 199759 131971
12901 131971 30301 -65818 76301 73862 -99698 233090 389642 43398 -79848 -386100 279499
12889 112669 74055 142695 -100844 196102 -152345 3157 168451 195194 329954 85765 -214531
12877 74052 27203 132533 -97817 -94561 -112649 -111523 331871 -24527 -167656 -44757 170273
12865 -145672 -231123 147368 -65068 -16862 107601 205866 162744 25817 135368 3708 -204497
12853 173432 -18677 266165 68342 3980 -162327 -4121 12475 -16869 142022 -93213 51130
12841 133236 101037 -97845 -316705 -71794 218986 45894 -13598 34509 -235762 -29824 -89476
12830 -89476 120511 111323 85754 -119570 -183524 70084 347473 197185 86914 -38577 -131636
$$ packed form
12912a48538e6621p826o6484A09199E876e5883H0137b5531o0179A99759o7788
12901A31971C0301f5818G6301k439i9698B33090J56552D3398g9848l06252B79499
12889A12669l8614O8640a00844A96102a52345C157J65294K6743J34760H5765b14531
12877G4052B7203J05330i7817L256j8088J126C31871b4527j43129d4757A70273
12865a45672q5451A47368f5068a6862A07601R8265m3122B5817J09551C708b04497
12853A73432a8677B66165F8342C980a62327d121A2475a6869A42022i3213E1130
12841A33236l2199i7845k18860g1794B18986D5894a3598C4509b35762b9824n9652
12830h9476A20511r188k5569a19570o3954G0084K77389j50288H6914c8577r3059
$$ plain form
12819 -131636 -244111 -366183 1209 -152584 -128487 -31850 73250 58660 -36510 303488 -110067
12807 95437 98733 -39230 -17563 -39169 130145 -19238 -262593 -130060 69111 -212140 105152
12795 79813 -49631 -1438 156792 128357 -312091 -59400 306750 174908 456088 213685 -129813
12783 41457 -154020 -50617 13500 -132630 104426 -144476 -138128 -304715 385089 -125393
12772 -100410 -52373 -82713 73893 -74018 2862 247996 173950 142520 -102144 37340 -220536
12760 48322 -106554 -213841 381022 661 166073 93359 6337 295402 -80834 -195869 -21723
12748 163543 91579 263848 23401 68019 -39455 199915 62738 348807 400961 234395 2070
12736 133790 104673 58686 19541 23277 98764 56315 -66823 13331 -27256 -129021 57031
$$ packed form
12819a31636j12475j22072A209a52584K4097c1850G3250j4590c6510C03488a10067
12807I5437L296c9230a7563k1606A30145a9238k43355a30060F9111b12140A05152
12795G9813d9631a438A56792k8435c12091e9400C06750j31842K81180B13685a29813
12783D1457a54020e0617A3500a32630A04426a44476O348j66587C85089a25393
12772a00410M8037l0340G3893g4018B862K45134p4046l1430a02144C7340b20536
12760D8322a06554j07287C81022F61J65412p2714F337K89065h0834j15035b1723
12748A63543p1964J72269B3401M4618c9455A99915F2738K86069N2154j66566B070
12736A33790k9117m5987A9541L736P5487m2449f6823A3331b7256j01765E7031
$$ plain form
12724 137869 17295 -99619 -12520 -166149 95300 -140226 51156 239522 204576 -188640 160883
12712 77636 -97730 -376271 26998 393552 233647 222034 73706 446065 47228 424440 66196
12700 84357 68264 205794 -237484 257394 381619 305291 137203 162368 -144745 41924
12689 26298 -56314 1214 186761 -175886 196419 -106324 105674 21697 -23213 210079 289122
12678 289122 158735 25065 -238350 -110863 95784 7229 -254434 250730 162428 296480
12668 296480 149224 1393 -56004 -160359 30749 294170 77802 -37621 163751 149660 -75679
12656 -157229 -30430 167996 -15024 56146 270961 157364 244286 9858 90887 -235241 197050
12644 219154 -52286 133710 -166037 28415 142029 54086 144257 256206 -53303 70338 -80360
$$ packed form
12724A37869A7295i9619a2520j53629I5300a40226E1156J88366l4946a88640A60883
12712G7636i7730k78541B6998L66554j59905j1613G3706L72359D7228L77212F6196
12700H4357j6093J37530b37484B57394J24225p6328A37203K5165a44745D1924
12689B6298e6314A214J85547a75886A96419a06324A05674B1697b3213B10079P9043
12678B89122j30387B5065b38350a10863I5784G229b54434B50730q8302J34052
12668B96480j47256A393e6004j04355C0749K63421G7802c7621A63751j4091g5679
12656a57229c0430A67996a5024E6146K14815j13597Q6922I858Q1029b35241A97050
12644B19154e2286A33710a66037B8415J13614E4086R0171J11949e3303G0338h0360
$$ plain form
12632 7986 -30383 167513 69897 -56348 139079 282087 231676 -29479 449778 145012 289602
12621 289602 292475 -66850 160390 -169610 131257 281292 -5771 175440 -80988 259243 -49981
12609 -17578 -150700 -159369 222891 16786 -5416 199160 268772 75571 91434 252271 104587
12597 298512 -251259 -101686 47928 30265 200404 108110 45068 33788 14585 277099 168775
12586 168775 -205828 -173385 76134 -242391 339677 87386 19368 56179 159473 -37760 190556
12574 -175694 278632 122933 12246 181757 95043 93070 382228 100242 88181 225859
12564 225859 -246018 74569 102414 -333545 -219087 112263 286535 -190748 482065 255713
12554 255713 45110 -355107 -177341 4450 71613 257537 325429 -86489 220808 63733 -105260
$$ packed form
12632G986c0383A67513F9897e6348A39079J43008n0411b9479D49778A45012J44590
12621B89602K873f6850A60390a69610A31257J50035e771A75440h0988B59243d9981
12609a7578j33122q669B22891A6786e416A99160O9612G5571J5863J60837A04587
12597B98512b51259a01686D7928j7663J70139r2294D5068j1280A4585K62514j08324
12586A68775b05828L2443G6134b42391C39677H7386A9368L6811J03294c7760A90556
12574a75694B78632A22933A2246J69511q6714j973K89158A00242j2061J37678
12564B25859b46018G4569K7845c33545J14458A12263J74272a90748D82065k26352
12554B55713D5110c55107a77341D450O7163J85924O7892h6489B20808F3733a05260
$$ plain form
12542 -118042 -31857 -56943 27255 -88492 -286056 -191111 -59744 288851 194371 17381 193385
12531 193385 120168 131708 -147135 -120816 102823 162751 -184239 -195958 -308661 182964
12520 183685 128708 218233 -56718 210473 230383 -201486 225254 24439 -107808 -76859 -80748
12509 -80748 322602 -304319 245872 -389405 19753 185353 -53713 -30708 25089 89081 157901
12498 157901 -8938 170289 -166966 -247246 78977 195434 77865 104714 -51283 321147 293815
12487 293815 58647 -41909 41230 8667 142836 -68684 -184621 -198321 -43322 -80143 -129669
12476 -129669 107137 88475 55751 75622 8656 -489911 121012 -85722 13525 51059 107983
12465 107983 90134 -114158 52750 112910 -56355 40714 -21058 207116 178680 48958 -182782
$$ packed form
12542a18042c1857k5086B7255h8492j97564R4945e9744B88851r4480A7381J76004
12531A93385p3217J1540a47135K6319A02823N9928a84239j1719j12703A82964
12520A83685n4977Q9525e6718B10473J9910b01486B25254B4439a07808L0949l889
12509h0748C22602c04319B45872c89405A9753J65600e3713K3005B5089O3992O8820
12498A57901h938A70289a66966q0280G8977J16457G7865K6849e1283C21147k7332
12487B93815E8647d1909D1230H667J34169f8684j15937j3700d3322l6821m9526
12476a29669A07137j8662l2724J9871H656d89911A21012h5722A3525L7534N6924
12465A07983j7849a14158E2750O0160e6355D0714b1058B07116k8436D8958a82782
$$ plain form
12453 -19545 159451 11157 82663 54927 -1278 -34332 110894 13838 140955 -4090 80638
12441 -181152 83533 -428862 -191912 53960 -282462 -121554 -206115 97768 -60642 -107588 -156327
12430 -156327 143683 71173 141671 273389 -157757 407936 77720 -163559 -160634 -107050 -391876
12419 -391876 -176387 -199457 -167146 25894 -6925 -155409 -20336 -163034 -49999 -142143 219094
12407 -288896 64250 317678 -88370 83188 -182530 -107542 -129001 93502 335135 184943 52397
12395 53790 71603 -212115 -57610 -88937 54285 -74837 225035 123129 301026 -185889 -201239
12384 -201239 -126559 290663 35098 93099 26996 -178505 145151 82980 -101276 88077 9276
12372 111029 -38447 125828 132635 267259 105487 325858 -89819 79876 -301809 179752
$$ packed form
12453a9545A59451A1157P1506k7736a278l3054A10894A3838J27117d090H0638
12441a81152H3533d28862a91912E3960b82462a21554q4561I7768f0642m6946m8739
12430a56327A43683G1173P0498J31718a57757D07936G7720a63559K925N3584k84826
12419c91876a76387k3070L2311B5894f925j48484b0336j42698d9999r2144B19094
12407b88896F4250K53428h8370H3188a82530P4988k1459I3502K41633j50192E2397
12395E3790J7813b12115e7610l1327E4285g4837B25035j01906J77897a85889j5350
12384b01239P4680B90663C5098N8001B6996a78505A45151o2171a01276H8077I276
12372A11029c8447A25828O807J34624A05487K20371h9819G9876c01809A79752
$$ plain form
12361 19092 -235934 -3491 -74217 -173952 447111 -72659 -113509 60486 -38935 34050 -114010
12349 -185327 -240321 -27665 -83629 96667 -92046 -147154 -123573 331257 -11645 -24733 605232
12337 324031 -146951 -125910 193430 -171625 3981 -273338 319991 105951 -12626 86067
12326 -10110 81021 -195707 58699 -114520 -122935 4596 15195 187467 -198944 7783 -159974
12314 196610 -191058 -58503 121336 -78549 -216213 113250 -195816 -84029 88456 -128774
12303 -24521 -36068 295687 -146129 -182066 107664 219981 -76262 -50731 105255 120901 -28649
12291 56773 -38356 -199441 81369 194433 115129 -235026 -30780 -269877 -82229 158801 164621
12280 164621 97975 1584 8836 -87940 48678 12810 -25328 5163 -38430 264276 247560 -390623
$$ packed form
12361A9092b35934c491p0726r9735D47111g2659m0850F0486c8935C4050a14010
12349a85327n4994b7665n5964I6667i2046n5108K3581C31257a1645j3088F05232
12337C24031a46951K1041A93430a71625C981b73338C19991A05951a2626H6067
12326a0110H1021a95707E8699a14520q415D596J0599J72272a98944G783a59974
12314A96610a91058e8503A21336g8549j37664A13250a95816h4029H8456a28774
12303b4521j1547B95687a46129l5937A07664J12317g6262K5531A05255J5646b8649
12291E6773c8356j61085H1369J13064p9304b35026c0780k39097h2229A58801N820
12280A64621o6646A584P252h7940D8678A2810b5328E163c8430B64276j6716c90623
$$ plain form
12267 96223 92227 -176237 88551 145258 161693 58420 -149977 -125945 204200 76731 280813
12256 280813 -25316 1992 35496 115903 -123209 -333505 116503 -34719 248313 -284073 -249533
12245 -249533 380328 252364 233340 272032 -42861 -9607 468013 -88541 91291 143030 426335
12234 426335 307898 -75207 -74054 170548 377453 131097 187457 113601 8045 277617 28481
12222 188548 361012 34835 214429 303856 -42841 -111136 256850 293262 -77438 190305 234378
12211 234378 43207 57902 -165070 307271 615015 275803 129729 175057 121293 101120
12201 101120 56235 169431 105589 293375 2686 510923 -6252 52817 223694 196638 13644
12189 269588 355254 65807 86569 184883 78776 13324 31302 48433 142962 -162164 90828
$$ packed form
12267I6223l996a76237H8551N6707J6435E8420a49977K4032B04200G6731K04082
12256B80813b5316A992L3504Q0407a23209k10296A16503c4719B48313b84073L4540
12245b49533C80328j27964j9024L8692d2861i607D68013h8541I1291N1739K83305
12234D26335j18437g5207J153A70548K06905A31097N6360p3856H045K69572B8481
12222A88548J72464C4835J79594Q9427d2841o8295B56850L6412g7438A90305M4073
12211B34378D3207J4695a65070C07271L07744B75803A29729M5328n3764k0173
12201A01120m4885J13196o3842J87786B686N08237f252E2817J70877k7056A3644
12189B69588Q5666F5807K0762R8314G8776A3324J7978J7131R4529a62164I0828
$$ plain form
12177 289792 371443 21893 -159569 169379 50782 212270 283137 -15294 93531 -115147 288155
12165 38531 692 446084 256514 182274 -36432 76425 -34675 164003 175903 192946 -200816
12153 23679 5126 113965 225319 188742 23900 -62130 -33848 59356 175564 76397 -286405
12141 121504 -239490 147964 -52900 -189588 -42541 -147123 -165654 187307 88503 6808 345304
12130 345304 314444 217720 15243 -134389 177792 -12086 -66611 -56131 103609 -283975 127470
12118 128825 63834 216050 -209218 -168722 48027 -2271 126305 170743 91114 -37974 186895
12106 -35155 -93478 -119706 6810 -104588 82075 44983 220359 -44247 261844 -257105 79688
12094 98442 319289 300753 329083 -135235 -196168 -211985 -142934 -68376 -270787 -14175 446942
$$ packed form
12177B89792Q1651B1893a59569A69379E0782J61488P0867a5294I3531a15147B88155
12165C8531F92M45392j89570p4240c6432G6425c4675A64003J1900J7043b00816
12153B3679E126J08839J11354l6577B3900f2130K8282E9356J16208G6397b86405
12141A21504b39490A47964e2900j36688d2541j04582j8531A87307H8503F808L38496
12130C45304l0860r6724A5243a34389A77792a2086n4525J0480A03609b83975A27470
12118A28825F3834J52216b09218M0496D8027b271A26305M4438p9629c7974A86895
12106c5155n8323k6228F810a04588H2075l7092J75376d4247B61844b57105G9688
12094I8442K20847j8536K8330a35235o0933j5817O9051f8376k02411a4175D46942
$$ plain form
12082 462938 840123 1232290 1016096 393518 153594 99495 -99471 54679 -115713 -58073
12072 -58073 -140840 269498 -135949 66059 -147310 -90015 73296 -117844 -31683 30303 154738
12061 154738 -30057 -225192 46860 -180881 -37882 -71472 144989 -235329 -82261 -87599 239759
12049 17268 -51878 37162 -153997 19736 61073 -158265 -89135 153686 193920 126946 -10338
12037 40404 -171156 -246359 212191 -20750 -48928 139862 132709 -532390 22520 -94284 120717
12025 150969 -148381 -212036 -268839 -9744 172337 39007 -40755 -87762 20490 -220496 -35342
12013 185543 -310552 -413987 -140532 351359 -48872 -169306 -52865 57332 -172966 72031
12002 -107164 -34987 -241235 -62179 174533 -74780 134507 -218313 80652 87096 147783 80056
$$ packed form
12082D62938L77185L92167k16194C93518A53594n4099i9471E4679a15713N7640
12072e8073q2767B69498a35949F6059a47310N7295G3296a17844c1683C0303J24435
12061A54738c0057j95135D6860a80881c7882l3590A44989b35329h2261n338B39759
12049A7268e1878C7162a53997A9736M1337a58265O9130A53686M0234o6974a0338
12037D0404a71156p5203B12191b0750k8178A39862p153e32390B2520i4284A20717
12025A50969a48381o3655n6803i744A72337C9007d0755m7007B0490b20496c5342
12013A85543c10552j03435a40532C51359d8872j20434e2865E7332a72966G2031
12002a07164c4987k06248f2179A74533g4780A34507b18313H0652O444O0687o7727
$$ plain form
11991 80056 -266864 -3718 29270 95167 397673 -125985 15932 52765 315815 65588 65539 85940
11979 85940 -89697 -35 -165060 -171269 -74465 15544 -150687 -30265 912 -215805 -153160 -263380
11967 -263380 90916 -492597 -27190 -28132 85094 66186 -198434 -65506 131833 -79746 -273340
11956 -273340 -126807 -5731 -11346 -83263 174950 21918 23454 -16868 279306 238756 -137774
11944 -140588 214194 23749 -379908 -53309 27962 -50495 -69039 131102 136018 295111 -67456
11932 -119198 -240975 -195562 243965 -179788 192648 149190 186766 12074 125075 -68377
11921 71704 -170311 -106074 -58787 -7424 -86977 207801 -89709 9387 148236 -184030 -210474
11910 -210474 42249 333440 143485 21322 378148 -92976 -333914 22609 -175689 -42059
$$ packed form
11991H0056b66864c718B9270O5897L02506a25985A5932L6833K63050F5588m9K0401
11979H5940h9697c5j65025o209g4465A5544a50687c0265I12b15805O2645j10220
11967b63380I0916d92597b7190r42H5094j8908a98434f5506A31833g9746j93594
11956b73340a26807e731n615p1917A74950B1918J536a6868B79306m0550a37774
11944a40588B14194B3749c79908e3309B7962e0495j8544A31102M916J59093f7456
11932a19198j21777M5413B43965a79788A92648m3458L7576A2074J13001f8377
11921G1704a70311O4237M7287g424p9553B07801h9709I387J38849a84030k6444
11910b10474D2249K91191A43485B1322L56826i2976k40938B2609a75689d2059
$$ plain form
11899 106390 -520575 -157921 71245 144491 -181889 -100043 76319 20716 -51572 -145917 124233
11887 87556 78521 544521 60368 -44057 -152114 -93345 -182881 331703 -63835 -312748 199086
11875 -117576 -188819 29343 42009 160369 -336171 -24923 44434 189660 -136421 92600 -35402
11863 -35942 -104501 -35326 -120857 -8027 39041 -104604 -110377 -78179 -181054 -28071 209252
11851 -154869 323551 233681 -100786 6022 218089 -263108 -130671 452142 -73532 113797
11840 59418 -129298 152715 -59292 -296268 108193 4469 -51865 177277 -124127 34209 -354584
11828 -325400 45052 109354 148532 102281 126443 -152164 -96565 -105247 -283821 55587 -253760
11816 -129231 -31780 -136077 -166259 180582 194953 -36280 40056 164613 69864 142139 -81440
$$ packed form
11899A06390e20575a57921G1245P3246a81889Q1846G6319B0716e1572r4345A24233
11887H7556r035M66000F0368d4057j08057N8769q9536C31703f3835k48913A99086
11875a17576p1243B9343J2666J18360c36171b4923D4434J45226a36421I2600c5402
11863c5942o8559c5326q5531h027C9041a04604n773L2198j02875b8071B09252
11851a54869C23551q9870a00786F022K12067b63108a30671D52142g3532A13797
11840E9418a29298A52715e9292k36976A08193D469e1865A77277a24127C4209c54584
11828c25400D5052O4302L9178m6251K4162a52164N5599q682j78574E5587b53760
11816a29231c1780j04297l0182A80582J4371c6280D0056J24557F9864P2275h1440
$$ plain form
11804 48638 -192100 -333653 -141413 112588 -87258 -25600 -11998 439739 83150 31778 -50258
11792 -212368 -170407 204162 56165 121295 -52736 -244606 -106713 -34503 141248 86438 307186
11781 307186 187728 103084 -233133 -266551 -377025 220803 -79820 193552 -294471 -30928
11770 9698 -2325 114632 -117247 81519 -5174 -192 -191942 -277905 149606 -91306 -39238 34486
11757 -1573 209534 -55761 33209 79910 243515 -74313 6663 159627 54052 -12834 369469
11745 -18888 393938 17454 48256 -51533 93010 -39186 137531 -103064 -55470 -142949 143920
11733 -133511 -183000 113641 -99369 119932 35712 27968 5470 -186198 337864 21570 141530
11722 141530 -106632 153191 250802 -384491 -251260 -10025 7693 -279374 206805 -18548
$$ packed form
11804D8638a92100j41553a41413A12588h7258b5600a1998D39739H3150C1778e0258
11792b12368M1961B04162E6165O5130e2736j91870a06713c4503A41248n4810K20748
11781C07186j19458q4644b33133l3418j10474B20803g9820A93552b94471c0928
11770I698b325A14632a17247H1519e174a92j91750q5963A49606i1306c9238C4486
11757a573B09534e5761C3209M6701J63605g4313F663J52964E4052a2834C69469
11745a8888C93938A7454L0802e1533I3010c9186A37531a03064M7594q7479A43920
11733a33511m9489A13641i9369A19932C5712p744E470a86198C37864B1570J19960
11722A41530a06632A53191R7611c84491J33231a0025G693b79374B06805a8548
$$ plain form
11711 -73997 -219234 259012 52655 -29512 94141 117435 266994 -54846 122128 -508153 267386
11699 -111929 -115985 -32656 266773 519841 -220442 368977 243023 120897 -36797 -90407
11689 -90407 132741 109098 -144545 -91257 -24074 155720 13815 18178 67802 176104 148021
11678 148021 155872 257559 74458 109362 3172 198818 182312 -91459 -244660 91989 205523
11667 205523 211872 37048 -121670 -6954 34941 137708 219572 51495 111348 304300 168446
11656 168446 -27126 94516 406965 -43161 38215 2387 143319 -134910 -146383 -44717 -26400
11645 -26400 169431 161972 61203 -89835 518 196383 89359 -67834 -183679 47848 313134
11634 313134 89140 97770 123555 118341 160846 -83592 -92395 -337526 214556 99030 151661 -70292
$$ packed form
11711g3997j45237B59012E2655b9512I4141K3294J49559e4846A22128e08153B67386
11699a11929m056c2656B66773K53068b20442C68977j25954A20897c6797n3610
11689i0407A32741k3643a44545N3288b4074A55720A3815M363M9624J08302k8083
11678A48021P851J01687G4458L4904C172J95646j6506i1459j53201I1989J13534
11667B05523O349C7048a21670f954C4941J02767Q1864E1495N9853J92952j35854
11656A68446b7126I4516L12449d3161C8215B387J40932a34910j1473d4717J8317
11645b6400A69431p459F1203h9835E18J95865H9359f7834j15845D7848K65286
11634C13134H9140Q630K5785n214M2505h3592q803k45131B14556I9030N2631g0292
$$ plain form
11621 147311 -98451 -243746 -97772 -2347 437476 233822 -57189 -42634 -140415 -9618 228380
11609 224054 -291984 -282272 -6631 117115 -213205 72761 122292 -102799 -7530 158624 444775
11598 444775 87920 91529 102609 15947 473921 -85453 -202861 -339935 167842 130405 -109286
11586 464217 152699 280228 451711 5078 3816 41899 119450 -99323 -13039 105188 125008
11575 125008 -95113 -60965 -211716 218759 380118 157221 -20364 138343 299358 188178
11565 188178 363108 -54735 108748 271831 196383 84597 209829 345160 189970 132681
11555 132681 -134348 -77032 37613 478549 357079 -186320 -81742 147692 142210 97228 71995
11544 71995 86727 143758 47528 146737 148085 104100 200517 -222438 217759 153039 213229
$$ packed form
11621A47311i8451j45295i7772b347D37476k03654e7189J4555r7781i618B28380
11609B24054b91984R712f631A17115b13205G2761M9531a02799g530A58624K86151
11598D44775H7920L609J1080A5947M57974h5453j17408j37074A67842l7437a09286
11586D64217A52699J27529J71483E078j262L8083P7551i9323a3039A05188J9820
11575A25008i5113L4148j50751B18759J61359A57221b0364A38343J61015j11180
11565A88178J74930e4735A08748J63083p5448H4597J25232J35331j55190n7289
11555A32681a34348N7316C7613M40936j21470a86320h1742A47692n482m4982k5233
11544G1995J4732N7031D7528R9209J348m3985R6417b22438B17759o4720O0190
$$ plain form
11533 213229 -139119 168215 -177245 49933 -70496 281809 -215225 -214225 -187710 -44285 -149576
11522 -149576 261021 248965 144447 242088 -103510 42293 105810 -64721 248578 -132829
11511 331242 -53246 27918 -18509 109552 -12612 -58180 79680 217234 41507 -38626 404522
11499 250159 160558 -360767 27610 -95349 286368 260262 99929 -111728 56530 -11368 131202
11487 -38331 39006 109574 89111 201382 25807 108195 240919 281734 166995 104588 -24279
11475 204141 120574 384656 149323 238084 243994 308607 8567 10814 -96575 228840 296663
11464 296663 146828 23496 176105 176117 135817 108620 148602 -156592 59557 195238 -113115
11452 153735 160920 -125703 119501 133781 99483 311854 74026 167847 -28516 63488 203196
$$ packed form
11533B13229a39119A68215a77245D9933g0496B81809b15225J000K6515d4285j05291
11522a49576B61021j2056j04518R7641a03510D2293O3517f4721B48578a32829
11511C31242e3246B7918a8509A09552a2612m5568G9680J37554D1507c8626D04522
11499B50159q9601c60767B7610i5349B86368k6106I9929a11728E6530a1368A31202
11487c8331C9006P0568k0463J12271B5807Q2388J32724M0815j14739o2407b4279
11475B04141q3567K64082A49323Q8761N910O4613H567K247i6575B28840O7823
11464B96663A46828B3496J52609J2m0300k7197L9982a56592E9557J35681a13115
11452A53735P185a25703A19501J4280l4298K12371G4026R3821b8516F3488J39708
$$ plain form
11441 203196 70362 57499 21644 54925 45862 223063 337629 7041 191229 401089 307663
11430 307663 -68002 -141531 -105440 219171 114151 -13640 -24772 -21596 -94715 -88155 60666
11418 109313 -48652 188848 -65888 26626 -84702 60116 -33730 200099 -79919 23383 466409
11407 466409 -140028 146324 55638 -172630 186260 285626 -249435 269200 163990 195587
11397 195587 171876 -51620 -71654 -94442 6706 -108799 -148251 12684 -137938 8137 -159411
11385 -137409 -139411 78522 -26676 -140707 -9074 -9773 -229203 -117456 -126738 -55218 -292694 45594
11372 65476 223022 -209729 -199287 -62905 -86229 273868 -229994 -140580 -146205 397770 -94207
11360 138342 -197990 -117618 98928 -163947 45106 -64562 219811 -40313 -31001 22427 271944
$$ packed form
11441B03196G0362j2863B1644L3281r063J77201J14566G041J84188K09860r3426
11430C07663f8002p3529L6091B19171j05020a3640j1132L176p3119O560F0666
11418A09313d8652A88848f5888B6626h4702F0116c3730B00099g9919B3383M43026
11407D66409a40028A46324E5638a72630A86260R9366b49435B69200j05210L1597
11397A95587k3711e1620k0034k2788F706a08799l9452A2684a37938H137a59411
11385a37409k002G8522b6676j14031i074o99k19430J11747r282e5218k37476D5594
11372F5476J57546b09729J0442f2905k3324B73868b29994Q9414n625C97770i4207
11360A38342a97990Q0372I8928a63947D5106f4562B19811d0313R312B2427K49517
$$ plain form
11349 271944 -65201 -39726 -77882 -84406 57846 76511 50568 200864 -135870 -186902 -337246
11338 -337246 -156910 135561 61805 92615 -27870 -177318 -141324 299210 -413485 -100954
11327 -283248 153143 -38984 30736 -215982 267250 -150956 23135 -15580 263666 -91949
11316 241209 -155679 62915 231009 24045 -260399 -400586 -110614 -43547 -71357 41479
11305 -8831 -315248 37303 455373 -35989 -76189 183246 -347407 423257 113906 -16993 -363256
11294 -363256 291318 78454 -88138 -210000 -47422 11534 146958 87859 110676 52018 -34825
11282 10759 35862 -179425 211920 28751 65233 33891 381677 99460 14090 -59111 274244
11270 175288 -24722 45252 83807 -425812 150687 -110692 -221467 210675 97984 54050
$$ packed form
11349B71944f5201K5475l8156o524E7846J8665k5943J50296a35870n1032j50344
11338c37246a56910A35561F1805L0810b7870j49448L5994B99210d13485a00954
11327b83248A53143c8984C0736b15982B67250a50956B3135a5580B63666i1949
11316B41209a55679F2915J68094B4045b60399j40187a10614d3547k7810D1479
11305h831l06417C7303M18070c5989m0200A83246c47407D23257A13906a6993l46263
11294c63256B91318G8454h8138j21862d7422A1534J35424n9099K2817E2018c4825
11282A0759K5103a79425B11920B8751L6482l1342L47786I9460A4090e9111B74244
11270A75288b4722D5252L8555d25812A50687a10692j10775B10675I7984m3934
$$ plain form
11260 54050 -124121 -42032 -111579 54636 247125 123808 -231897 -128760 -152329 90405 70641
11249 70641 287278 -435077 -185927 -67933 -154269 -89582 -100740 -33956 59110 45688 144525
11238 144525 -232857 -325768 -39531 54768 -196359 121816 -336926 174646 -238115 5328
11227 -357860 170356 1649 -293392 -115062 167114 -165012 -39736 -137852 -110821 -36588 177614
11215 -65069 -27136 -333203 -304120 -19378 -61666 -97543 13842 -202313 47411 -77547 196053
11203 -25654 -50928 -340019 -199768 -81812 99573 -89350 -112530 -91952 22552 -155189 146281
11191 -16946 68106 21588 92488 -233796 -210148 236607 263231 14292 -253875 128303 -212464
11179 126470 -128398 222289 -189523 -304 166210 -137235 -193603 -175150 104039 151416 -98150
$$ packed form
11260E4050a24121d2032o9547E4636J92489j23317b31897J03137k3569I0405j9764
11249G0641K16637d35077a85927f7933q6336O4687j1158c3956E9110j3422R8837
11238A44525b32857r2911c9531E4768a96359A21816c36926A74646b38115E328
11227c57860A70356A649b93392a15062A67114a65012c9736r8116K7031c6588A77614
11215f5069b7136l06067K9083a9378m2288l5877A3842b02313D7411g7547A96053
11203b5654k5274k89091J40251h1812I9573h9350k3180K0578B2552a55189A46281
11191a6946F8106B1588P0900b33796K3648B36607K6624A4292b53875A28303b12464
11179A26470a28398B22289a89523c04A66210a37235n6368J8453A04039M7377i8150
$$ plain form
11167 -298636 -238964 18806 79228 55418 -224228 -128974 210220 170605 333304 49459 70867
11156 70867 -255567 269538 223586 12653 -58870 -211173 -119136 115089 105176 -107148 -329741
11145 -329741 53856 426895 109899 -159917 -36711 -36330 -91206 -209305 98433 13019 -55688
11133 -55359 -99888 3350 58038 84129 111084 -11478 41070 504815 95446 151351 71416 -55554
11120 267476 114701 18826 156009 41924 -94492 160809 288349 108162 109999 224101
11110 224101 201794 277769 65560 341084 198845 207239 288208 71979 -236487 176085 -26299
11098 233009 280227 259167 155115 147852 202084 202108 295502 242566 -39555 157986 146369 481083
11086 481083 243648 256951 299825 -52821 494003 229076 410313 471342 267620 50090
$$ packed form
11167b98636N9672A8806O0422k3810b24228R5254B10220l9615J62699D9459K1408
11156G0867b55567B69538m5952A2653e8870j52303R2037A15089r913a07148k22593
11145c29741E3856L73039A09899a59917c6711L81n4876j18099I8433A3019e5688
11133e5359m4529C350N4688K6091K6955a1478D1070M63745I5446N5905G1416e5554
11120B67476A14701A8826J37183D1924i4492A60809J27540A08162J837J14102
11110B24101k2307P5975F5560K75524j42239Q394Q0969G1979b36487A76085b6299
11098B33009M7218k1060j04052p263N4232K4R3394n2936c9555A57986j1617L34714
11086D81083k37435J3303M2874e2821D94003B29076J81237O1029k03722E0090
$$ plain form
11075 271751 288158 247479 252337 341916 214872 321030 394555 178554 175291 444832 13285
11063 365670 303036 514712 328365 401472 559326 783377 733684 170141 264073 465350
11053 465350 527959 728376 653866 659190 505245 649658 599313 1106128 759251 673837 383424
11042 383424 745277 929052 709481 742066 671399 396860 685454 515119 610048 518865
11032 518865 713755 634822 596147 402818 761296 775418 863883 735330 550316 621879
11022 621879 814588 573235 765273 343464 562164 691903 797742 593486 499530 486612
11012 486612 270577 845653 726248 314341 408981 602768 847953 537415 421192 365580
11002 365580 573030 680075 595267 661130 400487 658073 753149 775721 692990 511480
$$ packed form
11075B71751J6407m0679M858Q9579j27044J06158P3525A78554l263K69541A3285
11063C65670o2634K11676j86347P3107J57854K24051m9693A70141R3932K01277
11053D65350O2609K00417p4510N324j53945J44413n0345N06815l46877q5414k90413
11042C83424L61853J83775k19571L2585p0667k74539K88594j70335R4929r1183
11032E18865J94890p8933l8675j93329L58478J4122Q8465j28553j85014P1563
11022F21879J92709k41353J92038C43464K18700J29739J05839k04256r3956j2918
11012D86612k16035N75076j19405C14341R4640J93787K45185l10538j16223n5612
11002C65580K07450J07045q4808O5863k60643K57586R5076K2572q2731j81510
$$ plain form
10992 511480 417157 395323 634468 471508 450123 939332 803217 990199 825335 797524
10982 797524 810479 826604 835491 1405088 784990 1468118 1441640 1559551 1730565 2084832
10972 2084832 2435220 2248288 2610336 2466725 2709618 2506797 2332538 2069535 1600321
10963 1600321 1889768 1639154 1854847 1753782 1443839 1911554 1798730 1945689 1451320
10954 1451320 1937843 1660041 1508491 854883 1001352 1048627 421146 573319 449528 530679
10944 530679 426084 219429 89548 250829 211801 270525 81567 127082 -23403 389774 -138476
10932 -35800 44721 -115898 76928 -26977 -209337 -180986 316705 57118 -65202 288082 147258
10921 147258 311881 -21781 -83894 232310 18676 159103 55923 378017 149092 158571 253956
$$ packed form
10992E11480r4323k1834K39145j62960k1385M89209j36115J86982j64864k7811
10982G97524J2955J6125Q887N69597o20098O83128k6478J17911J71014L54267
10972B084832L50388j86932L62048j43611K42893k02821j74259k63003m69214
10963A600321K89447k50614K15693j01065l09943M67715j12824J46959m94369
10954A451320M86523k77802j51550o53608J46469M7275D21146J52173j23791Q1151
10944E30679j04595k06655H9548J61281l9028N8724H1567M5515b3403C89774a38476
10932c5800D4721a15898G6928b6977j82360K8351C16705E7118f5202B88082j40824
10921A47258J64623b1781o2113B32310A8676J40427E5923L22094A49092R479R5385
$$ plain form
10910 253956 -44676 116274 136126 -36289 -182910 -103834 143375 176426 21799 -288515 -85322
10898 159489 85958 -296281 -294167 -54338 232566 17936 269553 -260010 -31198 -279094 293130
10886 -93921 172677 -72642 -8791 118669 -4862 6292 26517 -69995 -166300 125789 421847
10875 421847 119182 299958 -81394 147216 279996 -84011 55848 347459 -330366 69555
10864 202015 376567 -61543 -52346 68491 -56174 18513 -100756 1973 -272036 3369 120089
10853 120089 -479224 74044 -122851 32485 -195059 -19908 90074 43655 -74969 -171006 15872
10841 -154695 -166561 -38656 35897 304975 175493 -64324 -349836 -272842 10577 -9635 -164396
10830 -164396 -203088 394487 -139807 -233580 -196680 -54167 -265824 -83088 -164949 -228725 7991
$$ packed form
10910B53956d4676A16274J9852c6289j46621P9076A43375L3051B1799b88515h5322
10898A59489p3531b96281K114e4338B32566A7936K51617b60010c1198k47896B93130
10886i3921A72677g2642h791A18669d862F292K0225f9995r6305A25789K96058
10875D21847A19182J80776h1394A47216J32780h4011E5848K91611c30366F9555
10864B02015J74552f1543R197F8491e6174A8513a00756A973b72036C369J16720
10853A20089d79224G4044a22851C2485a95059a9908I0074D3655g4969r6037A5872
10841a54695j1866c8656C5897K69078j29482f4324k85512P6994A0577i635j54761
10830a64396l8692C94487a39807r3773L6900e4167k11657h3088q1861o3776G991
$$ plain form
10818 -31060 339483 -45031 -199954 22298 -97887 330397 94866 -118936 451289 -76823 -119119
10807 -119119 60630 113027 260340 -143522 -153479 -148040 -222229 -217900 295636 128109 -170533
10795 216131 279618 -183141 463334 -130863 55750 -80680 -10745 -148336 -298779 -302579 -228388
10784 -228388 -421795 154980 -279492 -133559 -132250 -73578 -249915 -97949 245540 -274028
10773 267084 294985 46002 -360711 -39863 -4368 -95731 -331111 -552141 101666 115752 -252291
10761 -112499 -5026 77147 -112709 -79799 164122 -319812 196099 73683 -41498 -79276 203638
10749 70263 -68837 -87889 -34305 86604 212063 209861 -10283 -75399 46389 -155293 43290
10737 -26829 121812 34330 169790 -18965 48382 -245264 -26962 80456 -141495 -165298 36795
$$ packed form
10818c1060C39483d5031j54923B2298i7887C30397I4866a18936D51289g6823m2296
10807a19119F0630N2397J47313a43522r957N439p4189M329B95636A28109a70533
10795B16131O3487a83141D63334a30863E5750h0680a0745j37591j50443l800P4191
10784b28388j93407A54980b79492a33559J309N8672j76337i7949B45540b74028
10773B67084K7901D6002c60711c9863d368r1363k35380k21030A01666J4086b52291
10761a12499e026G7147a12709L2910A64122c19812A96099G3683d1498l7778B03638
10749G0263f8837j9052c4305H6604J25459k202a0283o5116D6389a55293D3290
10737b6829A21812C4330J35460a8965D8382b45264b6962H0456a41495k3803C6795
$$ plain form
10725 347608 161141 -95016 -31410 198573 152075 103805 -144521 -49382 91203 343100 -313455
10713 -55468 -14430 -153322 201837 71200 -362952 83583 -34781 72023 -275641 13091 -324246
10701 45958 -98868 -32499 191479 300948 -132581 -146987 227742 340366 32280 -11822 -171167
10690 -171167 197591 64563 -124651 -215177 -256020 44240 -68633 -85025 44174 105921 -211190
10678 -378621 121244 53906 160939 -209549 82212 275064 200228 139617 -135459 -98587
10668 -98587 -66091 67594 -175220 -80117 -136682 -13240 139129 155101 -246273 -22717 -215156
10657 -215156 28422 -99 -62223 -79176 368 -92077 -23486 -146987 -17858 -228958 -240210 -267613
10645 -267613 40343 -148332 -132824 -101093 124751 109072 56055 -68629 -189586 70857 197722
$$ packed form
10725C47608A61141i5016c1410A98573m6498m8270a44521d9382I1203K51897c13455
10713e5468a4430j38892B01837G1200c62952H3583c4781G2023b75641A3091c24246
10701D5958i8868c2499A91479J09469a32581j4406B27742J12624C2280a1822j59345
10690a71167A97591F4563a24651r0526m0843D4240f8633j6392D4174O1747b11190
10678c78621A21244E3906J07033b09549H2212J92852p4836o0611a35459L6872
10668i8587L2496F7594a75220h0117n6565a3240A39129J5972b46273b2717j92439
10657b15156B8422i9o2124j6953C68i2077b3486j23501a7858k11100j1252k7403
10645b67613D0343a48332J5508L1731A24751j5679n3017f8629j20957G0857J26865
$$ plain form
10634 197722 -14711 -198365 257340 -201643 -216611 -282912 542 260954 43327 -288136 -107234
10622 -97048 300211 -155780 -41961 -304940 -251930 179560 -326302 -46202 -210316 52166
10611 -149673 -263318 108748 -196075 182918 -23475 132066 45898 -1835 -127857 -96417
10601 -96417 -248052 -258762 22577 135103 9963 -298261 6730 -173515 -223443 -43816 165170
10589 -1817 -145681 -25038 12489 50778 133019 115326 -205098 -171399 176995 878 -181872
10577 125865 245697 -276672 170311 -164613 -297316 64223 158379 69649 -93030 -19220
10566 10968 -105841 -147123 -139671 -275120 327787 292480 -301378 259330 342546 -33922 36214
10554 -103585 27925 -297246 110183 -45534 199755 -7023 73924 -113383 -214029 -11643 -219815
$$ packed form
10634A97722a4711j83654B57340b01643j4968o6301E42K60412D3327b88136a07234
10622i7048C00211a55780d1961k62979N3010A79560c26302d6202j64114E2166
10611a49673j13645A08748a96075A82918b3475A32066D5898a835j26022L1440
10601i6417j51635j0710B2577J12526I963b98261F730a73515m9928d3816A65170
10589a817j43864b5038A2489L8289Q2241j7693b05098L3699A76995H78a81872
10577A25865J19832b76672A70311a64613j32703F4223R4156F9649i3030a9220
10566A0968a05841m1282P452j35449C27787l5307c01378B59330Q3216c3922C6214
10554a03585B7925b97246A10183d5534A99755g023G3924a13383j00646a1643k08172
$$ plain form
10543 -219815 -212893 119707 142609 -264316 -26009 -456982 65198 339601 125396 -172845
10532 214015 -381761 -168615 201917 -506557 15463 72320 -227533 -177267 -15034 -112300
10522 -112300 -151369 -47618 135644 76229 338626 114010 354958 42199 -92523 -1053 136897
10510 -25420 -77042 126855 56070 -324574 -103696 74083 -451561 236760 -101570 -383303
10500 -383303 -363089 -21916 -73692 -115664 268996 92133 -125461 159087 -340989 -281822 -213351
10489 -213351 -156561 70655 -51620 -115069 14685 -136915 269674 194955 -63679 560367 454890
10478 454890 577635 616 29574 64660 69974 100355 155790 -189250 148719 -25344 33035
10466 106803 -36039 50345 223699 -56793 250871 -123131 71110 -10792 -246123 -242145 -380967
$$ packed form
10543b19815O922A19707K2902b64316b6009m30973F5198K74403A25396a72845
10532B14015c81761a68615B01917e06557A5463N6857b27533N0266a5034r7266
10522a12300l9069d7618A35644n9415K62397A14010K40948D2199i2523a053A36897
10510b5420n1622A26855E6070c24574a03696G4083d51561B36760a01570k81733
10500c83303K0214b1916n1776m1972B68996I2133a25461A59087c40989N9167O8471
10489b13351N6790G0655e1620o3449A4685a36915B69674p4719f3679E60367j05477
10478D54890J22745F16K8958L5086N314L0381N5435a89250A48719b5344C3035
10466A06803c6039E0345J73354e6793B50871a23131G1110a0792k35331L978j38822
$$ plain form
10455 -380967 75103 28283 -43592 230886 49541 231362 -106155 -284210 54253 164891
10445 164891 66682 -10213 -132071 173660 -148538 -92490 -199849 270270 3885 -421023
10434 60177 -291064 52236 38724 -58906 -94479 -56905 -136398 210196 -248941 -175543 201965
10422 136558 -159926 32892 16464 5497 -122768 -88242 132388 89459 13130 -5040 -202127
10411 -202127 100959 49291 2596 -118218 -254172 -446068 -236093 -91718 -407764 -91836
10400 102175 -281100 112544 -115646 -265217 44538 -85124 49238 53212 -21279 15925 81566
10389 81566 119915 35812 96080 123704 187927 -52538 -61530 195738 259191 236532 97417 252564
10377 252564 235980 360532 362679 -7764 137895 327747 94979 170468 447600 281940 275564
$$ packed form
10455c80967G5103B8283d3592B30886D9541J81821a06155j78055E4253J10638
10445A64891F6682a0213j21858A73660a48538N6048j07359B70270C885d21023
10434F0177b91064E2236j3512e8906l5573L7574p9493B10196b48941P3398B01965
10422A36558a59926C2892j6428E497a22768L4526A32388m2929A3130e040j97087
10411b02127A00959D9291B596a18218j35954j91896K09975i1718l16046i1836
10400A02175b81100A12544a15646j49571D4538h5124D9238L974b1279A5925O5641
10389H1566L8349C5812O0268K7624O4223e2538q992A95738O3453k2659I7417J55147
10377B52564j6584J24552K147g764A37895J89852I4979P5489K77132j65660o376
$$ plain form
10366 275564 179239 621328 293031 330988 108255 153691 391032 189715 118048 201370
10356 201370 -171352 3812 125261 92411 410422 209767 -78060 341922 841367 494571
10346 494571 201938 415455 333956 208126 365044 225748 68539 355697 563808 149040
10335 21554 284407 166388 325200 -55725 220660 -153693 136568 44978 34416 316786
10325 316786 286980 371241 -25974 558132 181341 3267 278500 517291 -10651 113196 101453
10314 101453 103648 -33336 -143205 288250 -209797 -244231 -125420 -197357 -242697 8195 -103404
10302 113536 14422 56227 39644 77247 -97713 26314 -132024 395213 153702 67384 6963
10290 180583 -118232 153107 -87928 -390960 -175117 56135 -178909 -240513 -99632 551371
$$ packed form
10366B75564r6325M42089B93031L7957A08255M5436K37341A89715p1667Q3322
10356B01370a71352C812J21449l2850L18011k00655g8060C41922M99445l46796
10346D94571B01938K13517q1499j25830J56918j39296F8539K87158K08111A49040
10335B1554K62853j18019J58812e5725B20660a53693A36568D4978j0562K82370
10325C16786k9806Q4261b5974E58132A81341C267K75233K38791a0651A13196j1743
10314A01453K195c3336j09869B88250b09797l4434J18811p1937m5340H195a03404
10302A13536A4422M1805j6583L7603i7713B6314a32024C95213A53702F7384F963
10290A80583a18232A53107h7928l03032a75117E6135a78909o1604i9632E51371
$$ plain form
10279 19237 -73757 186439 -300596 -206720 139116 41622 -137328 -58710 51604 180361 17009
10267 22204 160801 350814 -39391 169464 117144 90893 78563 -82757 282426 485681 337784
10256 337784 360075 282442 135908 -286362 253850 -64376 39580 -18061 14815 158321 65585
10244 206090 -120721 -164996 138696 151508 -10642 -21041 10005 -142769 231062 -338408
10233 -72747 -187025 129479 110814 185820 18402 -425298 -57733 -204987 46466 91551 36840
10221 -15721 -215459 106878 -64218 -169849 -59041 -32040 -243659 328119 -280339 -441034
10211 -441034 42269 -98505 -38353 -65072 -390287 -87135 -5751 -82707 -77140 -231151 -163602
10200 -163602 -146094 -193994 -306953 -30313 -398928 -89329 -78821 -90458 130408 -385088 312976
$$ packed form
10279A9237g3757A86439c00596R3876A39116D1622a37328e8710E1604J28757A7009
10267B2204J38597J90013c9391A69464n2320k6251j2330h2757B82426K03255j47897
10256C37784K2291p7633A35908b86362B53850f4376C9580a8061A4815J43506F5585
10244B06090a20721m4275A38696J2812a0642j0399A0005a42769B31062c38408
10233g2747j14278A29479j8665P5006A8402d25298e7733j47254D6466M5085C6840
10221a5721j99738A06878f4218j05631e9041K7001k11619C28119b80339j60695
10211d41034D2269i8505c8353k6719l25215h7135e751p6956N567j54011O7549
10200a63602J7508m7900j12959c0313l68615h9329J0508j1637A30408c85088C12976
$$ plain form
10188 138501 269523 -139398 31951 103888 -175574 -35699 -85184 -404102 -28442 177650
10177 200551 34321 168766 -113941 251368 199797 -91267 -259640 -151081 -77951 373512
10166 -522978 -196361 -191852 263397 9843 15283 -185279 178215 -186585 -253374 -163981 34753
10154 -378360 -211458 30966 -309628 -104769 -215787 106486 241034 -275352 -157313 43465
10143 -45785 31779 157685 100805 -204300 -92349 -145643 -44150 -100543 -120252 -228403 -164333
10132 -164333 39171 -59276 60358 -120113 234045 116859 -5486 -207606 -230228 -245444 -79451
10120 -66101 -2644 -72404 50916 14256 -32202 -153623 -285838 150174 -93430 48964 -121729
10108 -93227 92560 -9666 -297660 110979 50290 -239351 -307086 97139 -261504 -16142 -90850
$$ packed form
10188A38501J31022a39398C1951P1937a75574c5699m9485l18918b8442A77650
10177B00551C4321J34445a13941B51368n1571i1267j68373J08559P3130C73512
10166e22978a96361M509B63397I843N440a85279A78215a86585o6789Q9393C4753
10154c78360J66902C0966c09628a04769j11018A06486J34548b75352J18039D3465
10143d5785C1779J25906n6880b04300i2349n3294d4150n6393j9709j08151O4070
10132a64333C9171e9276F0358a20113B34045A16859e486k02120k2622j5216g9451
10120f6101b644o9760E0916A4256c2202j21421j32215A50174i3430D8964a21729
10108i3227I2560i666k87994A10979E0290b39351o7735I7139b61504a6142p4708
$$ plain form
10097 -90850 -141591 -141702 -487561 272208 -51340 292546 231612 38528 -69621 -153057 -282540
10086 -282540 -224516 163079 -5441 103383 93604 -176241 -42848 -18582 -248739 -205702 -185054
10075 -185054 -280191 52417 -78329 -499176 42145 -197341 -24561 68547 126953 -22377 39413
10063 12136 -239867 -4605 -152657 -244265 -281387 245478 59457 -29586 -170656 -10121 -111058
10052 -111058 -36379 -183448 -30799 -360212 715 126968 58642 38123 -22072 -52005 -44783
10041 -44783 -127098 -181328 -14049 -93815 -115668 -389643 -97643 -73989 45329 272333 -121173
10029 155457 -35252 -186548 199924 95877 -260806 142539 209236 234580 -152828 -110423
10019 -110423 -52221 -83941 -99840 -272676 -210311 -323800 83071 -94614 -153619 -318709 -36944
$$ packed form
10097i0850n0741j11l45859B72208e1340B92546o0934C8528f9621q3436j29483
10086b82540N8024A63079e441A03383r779a76241d2848a8582k30157M3037K0648
10075a85054r5137E2417g8329m20847D2145a97341b4561F8547N8406b2377C9413
10063A2136b39867d605j48052r1608l7122B45478E9457b9586j41070a0121j00937
10052a11058c6379j47069c0799l29413G15J26253E8642k0519b2072k9933P222
10041d4783q2315n4230a4049p9766k1853k73975i7643K3654D5329K27004a21173
10029A55457c5252j51296A99924I5877b60806A42539O6697K5344a52828M2405
10019a10423e2221l1720j5899j72836O2365j13489H3071i4614n9005j65090c6944
$$ plain form
10007 -694 -254171 -141141 -65378 55680 -192731 -28212 60196 73712 60244 319865 -268705
9995 -176822 -107905 -94393 -32275 115509 -81734 305006 -98055 227969 -159513 -29508 64111
9983 -211398 144502 57720 2870 -93457 230889 -273258 -154612 -1023 175719 -330261 -56060
9971 183820 -209641 94884 -51741 -153776 -62961 34396 -30929 153871 -35218 -252448 -117575
9959 -67122 166681 132788 78312 -136858 -324380 -131441 34464 -142648 531 -316963 137690
9947 -15445 -46979 -380101 -54513 -154719 -73451 -143041 -56916 252694 -49678 42931 166550
9936 166550 113833 -135158 158149 -131582 114416 56717 -66665 84794 -118947 -407536
9926 -407536 -261557 -111688 75975 84264 -338336 -164499 -182309 212957 -64775 44663 -303303
$$ packed form
10007f94k53477J13030f5378E5680a92731b8212F0196J3516j3468K59621b68705
9995a76822O8917J3512c2275A15509h1734C05006i8055B27969a59513b9508F4111
9983b11398A44502E7720B870i3457B30889b73258J18646a023A75719c30261e6060
9971A83820b09641I4884e1741j02035f2961C4396c0929A53871c5218k17230a17575
9959f7122A66681l3893n4476a36858j87522a31441C4464a42648E31c16963A37690
9947a5445l1534l33122e4513j00206g3451o9590e6916B52694d9678D2931J23619
9936A66550n2717a35158A58149a31582A14416E6717f6665H4794a18947k88589
9926d07536J45979a11688G5975Q289c38336a64499j7810B12957f4775D4663c03303
$$ plain form
9914 83325 -219890 -150667 -361573 183355 -34161 -121158 26414 -94 -66118 -3104 -166545 -179514
9902 -179514 -252309 -160613 7316 -59625 -238345 -78576 -221735 -185433 -40141 54638 -134330
9890 -7251 -55469 -96183 -37073 52870 44363 -256866 -210094 136479 203612 -136350 -101824 258870
9877 -143936 32094 23004 -64934 -42476 45025 22709 -145710 3499 -212183 -179948 371147
9865 -230918 -1504 152619 -54421 106874 -178223 -59006 -53774 34857 -185657 -63287 -39941
9854 -39941 -5877 -161847 -116359 -82004 127604 -190207 -51208 326448 -196043 -95778 -218437
9843 -218437 -312470 -17887 83605 43590 246551 -235503 163344 -134310 63138 -130749 73927
9831 -213990 152360 -339803 -66349 72806 -76810 -149780 -295137 -30515 70474 -66336 50547
$$ packed form
9914H3325b19890O9223k10906A83355c4161q6997B6414i4o6024c104j63441j2969
9902a79514p2795R1696G316e9625j78720g8576j43159L6302d0141E4638a34330
9890g251m8218m0714c7073E2870q507b56866M6772A36479O7133a36350L4526B58870
9877a43936C2094r090f4934K2458D5025k2316a45710C499b12183L2235C71147
9865b30918a504A52619e4421A06874a78223e9006N232C4857a85657f3287K3346
9854c9941e877j55970M5488L4355A27604a90207e1208C26448a96043i5778j22659
9843b18437r4033a7887H3605m0015K02961b35503A63344a34310F3138a30749G3927
9831b13990A52360c39803f6349G2806g6810p2970j45357c0515G0474f6336E0547
$$ plain form
9819 -140530 -388496 -49190 67356 -200701 -115062 162632 -313079 295727 -106504 -68275
9809 -68275 -104978 83574 -111718 -126538 -70027 80766 -237403 -216713 -91105 158695 41500
9797 -202756 -40336 -124346 142908 -1003 -9632 -216332 -103725 -384324 -402583 213876 -148489
9785 -170813 -202430 -41623 58663 57555 104825 -336870 -88256 195832 163440 150983 -42729
9773 193355 -83545 118408 -136405 237938 123383 -132578 -282752 -134064 125757 6162
9762 57276 -248412 -275406 -185466 -89925 -237170 -240303 -110442 -365440 -59597 78986 -182264
9750 176809 -687 -93157 -232678 -281235 -269821 -356599 27604 80858 -82920 -112783 -134845 -48121
9737 -45640 179207 122002 -276523 -392532 489754 -102287 75386 -152651 30048 -162562
$$ packed form
9819a40530k47966d9190F7356b00701Q5639A62632c13079B95727a06504L8229
9809f8275l6703H3574a11718j4820N6511H0766b37403K0690i1105A58695D1500
9797b02756d0336q4010A42908a003q629k06700a03725k80599j8259B13876a48489
9785a70813l1617d1623E8663j108M7270c36870h8256A95832l2392j2457d2729
9773A93355h3545A18408a36405B37938j14555a32578j50174a34064A25757F162
9762E7276b48412k6994Q9940h9925j47245l133a10442k54998e9597G8986a82264
9750A76809f87r2470j39521m8557J1414q6778B7604N3254h2920k9863k2062d8121
9737d5640A79207n7205b76523j16009D89754a02287G5386a52651C0048a62562
$$ plain form
9726 -534442 -285343 115006 11338 -374556 90522 -266588 -173792 -176098 22501 155074 -28123
9714 295418 -257515 -25481 -47583 -14715 -163322 69072 -112280 206252 -53523 -353833 -47857
9702 149754 42864 -87576 -173400 14896 -134226 -74991 -109654 77036 -85178 72193 -270820
9690 -23664 -72757 -341007 134757 -96344 -163585 41792 -2437 94702 157483 -15074 -40253 -244213
9678 -244213 -7817 -350198 -61783 118449 -57927 -417153 -100430 -272247 -149087 299313
9667 242051 326562 -71475 -97134 124124 -332112 -293974 -4568 109517 -58139 112330 -124403
9655 52179 -7255 -96408 -305980 334369 -225823 -32728 24783 -424495 97809 -426662 5340
9643 6563 -82246 -373516 280094 -121814 -6717 221776 -34298 39078 -57779 -294754 -221561
$$ packed form
9726e34442K49099A15006A1338c74556I0522b66588R2796k306B2501J32573b8123
9714B95418b57515b5481k2102a4715j48607F9072a12280B06252e3523l00310d7857
9702A49754D2864h7576q5824A4896a34226N9235l4663G7036h5178G2193b70820
9690b3664m9093k68250A34757i6344o7241D1792b437I4702O2781a5074k5179k03960
9678b44213g817l42381f1783A18449e7927l59226a00430j71817J23160B99313
9667B42051Q4511g1475k5659A24124c32112L8138d568A09517e8139A12330a24403
9655E2179g255q9153k09572C34369b25823c2728B4783d24495I7809d26662E340
9643F563h2246k91270B80094a21814f717B21776c4298C9078e7779k36975P3193
$$ plain form
9632 -221561 -11126 20178 34123 -51046 175465 -9933 -219281 -180595 -150677 38854 -54954
9620 -168698 -131522 -263867 149535 -95092 -171803 -28934 103816 -203805 -271070 -143207 -17608
9608 -236535 83182 -97092 210997 97628 -88990 -173274 69756 136311 -146604 -66883 -59990
9597 -59990 -189911 71304 -97971 16392 86090 -121998 239595 -455023 39799 149214 -13823
9585 256007 7657 -257066 -42790 -62812 14479 -276674 -50141 19787 -2532 -60601 -176625
9574 -176625 38456 81385 326836 39051 -39535 -218217 -73640 -386994 -27679 150768 -249377
9562 -56982 -235753 -14103 -121836 -396624 96119 -249999 7156 -47632 225039 -320300 -327384
9551 -327384 -162723 -133972 -255174 -197828 -150945 -264821 -96360 -121334 73927 -71219 -3205
$$ packed form
9632b21561a1126B0178J3945e1046A75465i933k09348L8686K9918C8854e4954
9620a68698L7176j32345A49535i5092p6711b8934A03816b03805o7265J27863a7608
9608b36535H3182i7092B10997I7628h8990q4284F9756O6555a46604f6883O893
9597e9990j29921G1304i7971A6392O9698a21998B39595d55023C9799J09415a3823
9585B56007G657b57066d2790k0022A4479b76674e0141A9787b532n8069j16024
9574a76625C8456M2929K45451C9051c9535j78682g3640l13354b7679A50768b49377
9562e6982j78771a4103j07733k74788I6119b49999G156d7632B25039c20300p084
9551c27384a62723K8751j21202N7346M6883j13876i6360k4974G3927g1219c205
$$ plain form
9539 -198328 161302 -171169 -201344 97725 -132921 16769 -7551 -321796 -88313 213214 112560
9528 112560 -188132 -79410 -188539 -4029 -110863 -110 306160 -139764 -64390 -248559 -242986
9517 -242986 -1265 -39501 -186003 -201518 153761 -360236 174514 77278 -158800 -92715 -115814
9506 -115814 -51605 -35310 -172272 -166897 225187 128673 154683 94821 -282965 7209 -47002
9494 -204405 -84756 177777 -256102 13176 30927 198278 -72235 -12489 127126 376626 -219647
9482 413251 -244281 207730 255862 35315 130103 -229391 -216848 -88 -96192 -22224 71614 -146397
9469 202277 -45169 -53607 -135331 -117425 -143189 81027 278004 -164422 10576 -431529 157210
9457 -38236 -109137 -178917 61852 -197343 -129598 143321 -53725 164488 -82165 -189314 -135537
$$ packed form
9539a98328A61302a71169l0175I7725a32921A6769g551l14245h8313B13214j00654
9528A12560a88132g9410j09129d029j06834a10C06160a39764f4390j84169N573
9517b42986a265l8236j46502j5515A53761c60236A74514G7278a58800O6085k3099
9506a15814e1605J6295j36962N375B25187r6514K6010n9862b82965G209d7002
9494b04405h4756A77777b56102A3176J7751J67351g2235a2489A27126K49500b19647
9482D13251b44281B07730M8132C5315R4788b29391J2543h8r6104b2224G1614a46397
9469B02277d5169q438q1724J7906k5764H1027J96977a64422A0576d31529A57210
9457c8236p0901o9780F1852a97343O7745A43321e3725A64488h2165j07149N3777
$$ plain form
9446 -135537 -133917 -259125 349640 -110234 230717 78760 -111978 -382532 -103717 -17237
9435 -7851 -118483 306159 -146276 148718 -7885 161264 215580 84011 -223858 -118950 117371
9423 115331 -145303 126813 -10310 38556 -207810 141271 -118475 -126193 89611 -326727 -41896
9411 -276140 26911 67888 189648 -53239 -93185 -50319 -214456 -77627 -154468 -29544 47830
9399 -5605 211569 -115399 -214821 100496 -77565 -184777 -103614 -325045 -76042 14246 -151182
9387 84971 -122071 224040 203150 -158201 62371 -14446 -102768 -47657 164033 -76260 182585
9375 -121290 -243946 -26620 -235616 -20763 25231 -241030 106340 -136635 -34943 -16697 -161336
9364 -161336 -286992 -176914 304312 40977 -108988 -93767 -66318 -231246 -310192 204212
$$ packed form
9446a35537J620j25208C49640a10234B30717G8760a11978k70554a03717a7237
9435g851j10632C06159a46276A48718g885A61264N4316H4011b23858J04908A17371
9423A15331a45303A26813a0310C8556b07810A41271a18475p718H9611c26727d1896
9411b76140B6911M0977J21760e3239l9946M2866j64137g7627p6841b9544D7830
9399e605B11569a15399r9422A00496g7565j07212Q1163k21431g6042A4246a51182
9387H4971a22071B24040k0890a58201F2371a4446q8322d7657A64033g6260A82585
9375a21290j22656b6620k08996b0763B5231b41030A06340a36635c4943a6697j44639
9364a61336j25656J10078C04312D0977a08988J5221K7449j64928p8946B04212
$$ plain form
9353 -135144 -108416 108554 -187564 -141110 -110849 -78564 130154 227668 59895 16826 176147
9342 176147 -421515 -204702 -170136 -105444 -80187 53283 228807 151788 -274879 177721 -40813
9330 241543 -48992 -307228 98268 -66860 16224 427529 132845 -382809 -353682 -44282 -31128
9319 -31128 155318 -81538 250575 -35165 136002 299474 -28917 -184799 186549 177330 -1782
9307 24961 -158064 -21294 -21015 -59178 -313662 132221 -197127 315337 -346986 -102955 -240720
9296 -240720 -219481 -216866 152452 -82284 -230903 -12622 -246758 1137 -136881 -88250 302664
9284 -98741 -263523 50797 105472 176109 -223161 207308 -228424 -331366 28442 120540 -153584
9272 -33824 91969 -162943 -121183 -42279 -123164 -245158 -432031 -298971 -246635 50182 65757
$$ packed form
9353a35144K6728A08554a87564M6454L0261L2285A30154R7514E9895A6826J59321
9342A76147d21515b04702L4566O4692K5257E3283J75524p7019b74879A77721d0813
9330B41543d8992k58236I8268f6860A6224M11305A32845c82809K9127d4282J3154
9319c1128A55318h1538B50575c5165A36002J63472b8917j55882A86549r219a782
9307B4961a58064b1294K79l8163k54484A32221a97127C15337c46986a02955j37765
9296b40720K1239K615A52452h2284j48619a2622k34136A137a36881M8631C02664
9284i8741j64782E0797N4675P0637b23161B07308b28424j02942B8442R2098a53584
9272c3824I1969a62943M1760d2279q0885j21994j86873J33060N2336E0182J5575
$$ plain form
9261 65757 50725 100312 88357 -295784 -41716 -266113 -186887 -25281 -4768 11873 -183602
9249 -278625 -391418 -24915 -51399 -268644 191852 -244937 91655 -183558 64840 796 -374482
9237 70730 -88547 -192747 -190273 -205885 -40709 44217 -239493 23815 92068 -82422 -64947 -227164
9225 -227164 -244825 -351407 -136837 -65472 181144 -1199 -354268 -34158 33297 -115612 217560
9213 52238 193740 -130481 18362 -332884 -95515 -95712 -81910 -186082 -434462 184770 43365
9201 38630 -344694 -327514 -138598 -89461 67233 -192725 -72040 -170604 -62227 210065 122011
9190 122011 143539 -259244 -231319 210884 -220681 -88210 -250053 -352479 224142 -90601
9179 -570 -84680 -209690 59148 175845 -116699 25489 -321376 -31871 -24155 96952 159292 156647
$$ packed form
9261F5757j5032M9587j1955b95784d1716k24397P9226b5281d768A1873a83602
9249b78625j12793b4915k6484k17245A91852b44937I1655a83558F4840G96c74482
9237G0730h8547j04200K474j5612d0709D4217b39493B3815O8253h2422J7475j62217
9225b27164j7661j06582a36837f5472A81144a199l53069c4158C3297a15612B17560
9213E2238J41502a30481A8362c32884i5515j97J3802j04172k48380A84770D3365
9201C8630c44694J7180a38598M9137F7233a92725g2040r8564f2227B10065q8054
9190A22011K1528b59244K7925B10884b20681h8210j61843j02426B24142i0601
9179e70q4110j25010E9148J16697a16699B5489c21376c1871P716I6952O2340k645
$$ plain form
9167 156647 -174773 -17218 -69418 10839 33257 -82347 -229070 -60102 -195147 2792 -171197
9155 117459 183294 -178414 -21954 -88155 215347 -65108 96838 -86563 -50244 -357979 -151088
9143 -13163 -194609 -48436 -141580 -223081 -342615 -85613 206690 -180558 -173057 233484 -584120
9131 291294 143534 68271 -260837 -241494 -30621 307258 -93726 3842 -147531 -157512 9562
9119 -371425 109324 -77355 12348 -59065 -276545 -162662 33399 -162727 35100 -49911 146719
9107 14068 -336461 -5127 92248 50488 87300 36119 -61733 -56248 -251063 -25372 -260917 51140
9094 -163951 -153125 103257 193793 -111803 -74063 -73249 -166903 -106326 20601 -17948 67260 -5706
9081 -89972 6470 -71407 -28907 52115 -25322 189859 47792 -132068 -94373 245150 -318372
$$ packed form
9167A56647a74773a7218n2200A0839K2418h2347j46723f0102j35045B792a71197
9155A17459O5835a78414b1954o6201B15347f5108I6838h6563L6319l07735a51088
9143a3163j81446d8436r3144q1501j19534h5613B06690a80558P501B33484e84120
9131B91294A43534F8271b60837J9343c0621C07258i3726C842a47531r981I562
9119c71425A09324g7355A2348e9065k17480J13883C3399a62727C5100d9911A46719
9107A4068c36461e127I2248m1760L6812C6119f1733N485j94815b5372k35545E1140
9094a63951J0826A03257R0536a11803L7740Q14r3654O0577B0601a7948F7260e706
9081h9972F470g1407b8907E2115b5322A89859D7792a32068L7695B45150c18372
$$ plain form
9069 -99094 -585 -425912 97172 233346 -131892 -182794 307716 386359 -18118 -180002 279048
9057 98206 174348 -96537 -12034 219 -141888 -271273 60892 -168632 -77164 -29495 -350181
9046 -350181 1401 103668 101098 -190507 -175774 16757 47256 -213923 -263623 -132929 -106564
9035 -106564 -15783 -39970 -316219 225864 -76418 195055 32410 -143450 62681 85485 200681
9024 200681 6653 -144250 -96743 69374 -77616 -47761 -210325 162333 45464 12334 -203530
9012 88739 -159805 -198494 -302560 46744 69608 -98645 -223093 -32941 -21359 552 -158875
9000 -124924 98153 -82521 246538 115358 17890 -95965 -164178 -439557 -114702 -151736 -14184
8988 -51216 -338580 -152295 247828 37536 26445 20436 204394 -407971 -257147 -106960 -32615
$$ packed form
9069i9094e85m25327I7172J36174a31892n0902C07716P8643a8118j61884B79048
9057I8206P6142i6537a2034B19a41888j29385F0892a68632g7164b9495l20686
9046c50181A401J02267k570a90507J4733A6757L0499b13923m9700J30694K6365
9035a06564a5783k4187k76249B25864g6418A95055C2410a43450F2681K2804J15196
9024B00681F653a44250M7507F9374g7616K9855j62564A62333D5464A2334b03530
9012H8739a59805l8689j04066D6744K2864i8645j24448c2941J1582E52a58875
9000a24924I8153h2521B46538A15358A7890i5965o8213k75379a14702l7034a4184
8988e1216k87364a52295B47828C7536j1091o009J83958d07971J50824a06960c2615
$$ plain form
8976 -148422 -96546 -78007 -77216 -273161 237882 -168086 -37024 -228628 101368 -70321 110077
8964 -580959 109783 91583 127985 -193088 45370 -290573 -399109 -191772 29280 -352891
8953 92742 -306050 -79646 225622 -180060 -116344 -415390 94948 -63805 -178465 259799 -78720
8941 111109 -211067 114778 87777 -128666 105817 176344 117506 611846 307405 -253938
8930 45211 19649 -32096 148942 403266 407627 540457 1224617 2415941 5300002 14275360
8920 14275360 7806083 3350286 1631344 805835 482856 326459 176049 24520 54207
8911 54207 -57803 -233624 250096 424277 379523 291959 110038 -348831 120281 118518 -35463
8899 68641 -73376 -157372 150213 113078 -73858 -140593 277468 -78635 91691 123592 93585
$$ packed form
8976a48422N1876J8539P91j95945B37882a68086c7024j91604A01368g0321A10077
8964e80959A09783j8200L6402a93088D5370b90573j08536a91772B9280c52891
8953I2742c06050g9646B25622a80060O3716k99046I4948f3805j14660B59799g8720
8941A11109b11067A14778k7001a28666A05817P0527n8838M94340l04441b53938
8930D5211A9649c2096A48942K54324M361J32830O84160J191324K884061Q975358
8920A4275360o469277C350286A631344H05835l22979j56397j50410B4520K9687
8911E4207e7803j75821B50096J74181m4754q7564A10038c48831A20281j763c5463
8899F8641g3376q3996A50213l7135g3858o6735B77468g8635I1691L1901l0007
$$ plain form
8888 93585 83311 -167566 75807 -83926 -173943 -144895 -199695 -149489 -2646 -127854 52604 8930
8875 342044 133786 -68068 256695 239729 -115104 116982 -139090 178159 87468 -238678
8864 -14364 49629 -198604 49044 14762 22033 -42369 -355023 20635 -166147 -10396 63471
8852 -144536 206802 -259818 -135174 -358630 -111441 -283200 6320 -126228 172419 15092
8841 -212076 -216912 39095 -155371 93481 140920 -147024 43112 108286 42323 29703 -268230
$$ packed form
8888I3585j0274a67566G5807h3926r0017K9048n4800N0206b646j25208E2604H930
8875C42044A33786f8068B56695j6966a15104A16982a39090A78159H7468b38678
8864a4364D9629a98604D9044A4762P271d2369l12654B0635a66147a0396F3471
8852a44536B06802b59818J24644k23456a11441j71759F320a26228A72419A5092
8841b12076m836C9095a55371I3481M7439a47024D3112O5174D2323j2620b68230
$$ [...]
##END NTUPLES=NMR SPECTRUM
##END=
