##TITLE=AC1438_TSUAH13247_9682906_bZb27pm7b5
##JCAMPDX= 6.0         $$ Bruker NMR JCAMP-DX V2.0
##DATA TYPE= NMR SPECTRUM
##DATA CLASS= NTUPLES
##ORIGIN= BRUKER
##OWNER= Administrator
$$ 1.72 TOPSPIN		Version 2.1
$$ 2016-04-16 22:07:29.236 -0700  Administrator@X
$$ Compression mode = diff/dup
##.OBSERVE FREQUENCY= 400.02188249412
##.OBSERVE NUCLEUS= ^1H
##.ACQUISITION MODE= SIMULTANEOUS (DQD)
##.ACQUISITION SCHEME= undefined
##.AVERAGES= 64
##.DIGITISER RES= 22
##SPECTROMETER/DATA SYSTEM= spect
##.PULSE SEQUENCE= noesygpps1d.comp
##.SOLVENT NAME= COFFEE_meoh
##.SHIFT REFERENCE= INTERNAL, COFFEE_meoh, 1, 14.96129
##AUDIT TRAIL= $$ (NUMBER, WHEN, WHO, WHERE, PROCESS, VERSION, WHAT)
$$ ##TITLE= Audit trail, TOPSPIN		Version 2.1
$$ ##JCAMPDX= 5.01
$$ ##ORIGIN= Bruker BioSpin GmbH
$$ ##OWNER= Administrator
$$ $$ E:\/data/COFFEE/nmr/AC1438_TSUAH13247_9682906_bZb27pm7b5/32/pdata/1/auditp.txt
$$ ##AUDIT TRAIL=  $$ (NUMBER, WHEN, WHO, WHERE, PROCESS, VERSION, WHAT)
(   1,<2016-04-16 22:07:23.954 -0700>,<Administrator>,<X>,<go>,<TOPSPIN 2.1>,
      <created by zg
	started at 2016-04-16 21:55:54.329 -0700,
	POWCHK enabled, PULCHK disabled,
       configuration hash MD5:
       21 0F 79 D6 B3 7B B4 F6 88 20 88 DB 03 48 BD 9F
       data hash MD5: 64K
       1F 4D DA C4 A5 62 B5 4A CD 3D 0C 39 00 45 2D F0>)
(   2,<2016-04-16 22:07:27.204 -0700>,<Administrator>,<X>,<proc1d>,<TOPSPIN 2.1>,
      <Start of raw data processing
       efp LB = 0.3 FT_mod = 6 PKNL = 1 PHC0 = 0 PHC1 = 0 SI = 128K 
       data hash MD5: 128K
       41 8E E6 4C 3A 15 B2 AD AE B5 B4 20 4E B5 74 1E>)
(   3,<2016-04-16 22:07:28.064 -0700>,<Administrator>,<X>,<proc1d>,<TOPSPIN 2.1>,
      <pk PHC0 = -86.47339 PHC1 = 0 
       data hash MD5: 128K
       62 95 80 C2 8E 5B A2 FB 1F 34 C1 32 8D 6D B0 52>)
(   4,<2016-04-16 22:07:28.439 -0700>,<Administrator>,<X>,<proc1d>,<TOPSPIN 2.1>,
      <abs ABSG = 1 
       data hash MD5: 128K
       D7 DE 07 F6 36 38 E6 6E EF E4 40 2D 13 A1 2E 41>)
(   5,<2016-04-16 22:07:28.548 -0700>,<Administrator>,<X>,<proc1d>,<TOPSPIN 2.1>,
      <abs ABSG = 2 
       data hash MD5: 128K
       D8 DA 8C 97 47 5C E1 06 DA 4A 46 51 6E 42 47 E1>)
(   6,<2016-04-16 22:07:28.626 -0700>,<Administrator>,<X>,<proc1d>,<TOPSPIN 2.1>,
      <abs ABSG = 3 
       data hash MD5: 128K
       61 5B 4F F7 4D 6E 5F F5 47 C0 76 6D C6 C3 C2 F9>)
(   7,<2016-04-16 22:07:28.720 -0700>,<Administrator>,<X>,<proc1d>,<TOPSPIN 2.1>,
      <abs ABSG = 4 
       data hash MD5: 128K
       7F 86 57 47 FA 81 D7 20 61 CC E8 C9 BB 3F 23 C4>)
(   8,<2016-04-16 22:07:28.829 -0700>,<Administrator>,<X>,<proc1d>,<TOPSPIN 2.1>,
      <abs ABSG = 5 
       data hash MD5: 128K
       B3 8B 8B 43 CF 91 03 26 53 5B 82 01 A4 EE 90 6D>)
$$ ##END=
$$ 
$$ $$ hash MD5
$$ $$ 96 21 85 9B 4C 00 5A F2 FA 9E 51 D7 E9 65 F2 32
##$RELAX= 
##$RELAX= 
##$RELAX= 
##$RELAX= 
##$RELAX= 
##$RELAX= 
##$RELAX= 
##$RELAX= 
$$ Bruker specific parameters
$$ --------------------------
##$DU= <E:\>
##$EXPNO= 32
$$ [...]
##$TP07= 0
##$TPNAME0= <>
##$TPNAME1= <>
##$TPNAME2= <>
##$TPNAME3= <>
##$TPNAME4= <>
##$TPNAME5= <>
##$TPNAME6= <>
##$TPNAME7= <>
##$TPOAL= (0..7)
0.5 0.5 0.5 0.5 0.5 0.5 0.5 0.5
##$TPOFFS= (0..7)
0 0 0 0 0 0 0 0
##$TUNHIN= 0
##$TUNHOUT= 0
##$TUNXOUT= 0
##$USERA1= <user>
##$USERA2= <user>
##$USERA3= <user>
##$USERA4= <user>
##$USERA5= <user>
##$V9= 5
##$VALIST= <valist>
##$VCLIST= <CCCCCCCCCCCCCCC>
##$VD= 0
##$VDLIST= <DDDDDDDDDDDDDDD>
##$VPLIST= <PPPPPPPPPPPPPPP>
##$VTLIST= <TTTTTTTTTTTTTTT>
##$WBST= 2048
##$WBSW= 25
##$XGAIN= (0..3)
0 0 0 0
##$XL= 0
##$YL= 0
##$YMAX_a= 6101276
##$YMIN_a= -12453145
##$ZGOPTNS= <>
##$ZL1= 120
##$ZL2= 120
##$ZL3= 120
##$ZL4= 120
##$ABSF1= 14.96129
##$ABSF2= -5.596891
##$ABSG= 5
##$ABSL= 3
##$ALPHA= 0
##$AQORDER= 0
##$ASSFAC= 0
##$ASSFACI= 0
##$ASSFACX= 0
##$ASSWID= 0
##$AUNMP= <proc_prof1d_extract.lims>
##$AXLEFT= 0
##$AXNAME= <>
##$AXNUC= <1H>
##$AXRIGHT= 0
##$AXTYPE= 0
##$AXUNIT= <>
##$AZFE= 0.1
##$AZFW= 0.1
##$BCFW= 0
##$BC_mod= 0
##$BYTORDP= 0
##$COROFFS= 0
##$CY= 15
##$DATMOD= 1
##$DC= 0
##$DFILT= <>
##$DTYPP= 0
##$F1P= 0
##$F2P= 0
##$FCOR= 0.5
##$FTSIZE= 131072
##$FT_mod= 6
##$GAMMA= 0
##$GB= 0
##$INTBC= 1
##$INTSCL= 1
##$ISEN= 128
##$LB= 0.3
##$LEV0= 0
##$LPBIN= 0
##$MAXI= 10000
##$MC2= 0
##$MEAN= 0
##$ME_mod= 0
##$MI= 0
##$NCOEF= 0
##$NC_proc= -2
##$NLEV= 6
##$NOISF1= 0
##$NOISF2= 0
##$NSP= 0
##$NTH_PI= 0
##$NZP= 0
##$OFFSET= 14.96129
##$PC= 1
##$PHC0= -86.47339
##$PHC1= 0
##$PH_mod= 1
##$PKNL= yes
##$PPARMOD= 0
##$PPDIAG= 0
##$PPIPTYP= 0
##$PPMPNUM= 2147483647
##$PPRESOL= 1
##$PSCAL= 4
##$PSIGN= 0
##$PYNMP= <proc.py>
##$REVERSE= no
##$SF= 400.020009520074
##$SI= 131072
##$SIGF1= 0
##$SIGF2= 0
##$SINO= 400
##$SIOLD= 131072
##$SPECTYP= <>
##$SREGLST= <1H.CDCl3>
##$SSB= 0
##$STSI= 131072
##$STSR= 0
##$SW_p= 8223.68421052631
##$SYMM= 0
##$S_DEV= 0
##$TDeff= 65536
##$TDoff= 0
##$TI= <>
##$TILT= no
##$TM1= 0
##$TM2= 0
##$TOPLEV= 0
##$USERP1= <user>
##$USERP2= <user>
##$USERP3= <user>
##$USERP4= <user>
##$USERP5= <user>
##$WDW= 1
##$XDIM= 131072
##$YMAX_p= 369175488
##$YMIN_p= -11030
##$CURPLOT= <Network HP LaserJet P1505>
##$CURPRIN= <$Network HP LaserJet P1505>
##$DFORMAT= <normdp>
##$LAYOUT= <+/1D_H.xwp>
##$LFORMAT= <normlp>
##$PFORMAT= <normpl>
##$SURQMSG= 1
$$ End of Bruker specific parameters
$$ ---------------------------------
##NTUPLES= NMR SPECTRUM
##VAR_NAME=  FREQUENCY,     SPECTRUM/REAL,   SPECTRUM/IMAG
##SYMBOL=    X,             R,               I
##VAR_TYPE=  INDEPENDENT,   DEPENDENT,       DEPENDENT
##VAR_FORM=  AFFN,          ASDF,            ASDF
##VAR_DIM=   131072,        131072,          131072
##UNITS=     HZ,            ARBITRARY UNITS, ARBITRARY UNITS
##FACTOR=    0.0627417313425164, 1,          1
##FIRST=     8223.62146879497, -398,         -61408
##LAST=      0,             1897,            -62261
##MIN=       0,             -11030,          0
##MAX=       8223.62146879497, 369175488,    0
$$ Real data points
##PAGE= N=1
##DATA TABLE= (X++(R..R)), XYDATA
$$ [...]
63941C168703K49199K54102K54259K49073K39410K25851K07577J83762J55357
$$ 3168703 3417902 3672004 3926263 4175336 4414746 4640597 4848174 5031936 5187293
63932E187293J24336R1633N6934K0362j6750n3011q7853j20849j50930j76867
$$ 5187293 5311629 5403262 5460196 5480558 5463808 5410797 5322944 5202095 5051165 4874298
63922D874298j98071k14510k26155k33035k35541k34287k29786k22492k13044
$$ 4874298 4676227 4461717 4235562 4002527 3766986 3532699 3302913 3080421 2867377
63913B867377k02070j89892j76611j62466j47986j33880j20827j09188r8821q9328
$$ 2867377 2665307 2475415 2298804 2136338 1988352 1854472 1733645 1624457 1525636 1436308
63903A436308q0509p2443o5074n8060n1257m5080m0182l6809l4633l3026l1363
$$ 1436308 1355799 1283356 1218282 1160222 1108965 1063885 1023703 986894 952261 919235 887872
63892H87872k9323k7080k5135k3742k2687k1690k0774j9920j8643j6384j3345
$$ 887872 858549 831469 806334 782592 759905 738215 717441 697521 678878 662494 649149
63881F49149j0510q588p224n465k938k26J887L353M750O449Q229R837J1456J3308
$$ 649149 638639 630051 622827 617362 614424 614198 616085 619438 624188 630637 638866 648703 660159 673467
63867F73467J5076J6214J6707J7041J7390J7381J6772J5828J4732J3126J0684
$$ 673467 688543 704757 721464 738505 755895 773276 790048 805876 820608 833734 844418
63856H44418P820N315L343J407q56l241n404p400r529j1859j4110j6005j7570
$$ 844418 852238 857553 860896 862303 861447 858206 852802 845402 835873 824014 809904 793899 776329
63843G76329j9064k0594k1904k2615k2681k2478k2414k2537k2550k2104k1073
$$ 776329 757265 736671 714767 692152 669471 646993 624579 602042 579492 557388 536315
63832E36315j9692j8428j7596j7077j6515j5772j4976j4189j3263j2091j0736
$$ 536315 516623 498195 480599 463522 447007 431235 416259 402070 388807 376716 365980
63821C65980r296p864o602n690n165n008n266n731n717m732l332k623k805k934
$$ 365980 356684 348820 342218 336528 331363 326355 321089 315358 309641 304909 301577 298954 296149 293215
63807B93215k443k040k541l524l974l743l461l351l090k743k812l223l148k249
$$ 293215 290772 288732 286191 282667 278693 274950 271489 268138 265048 262305 259493 256270 253122 250873
63793B50873j346j381k195k900l046k882k641k249j718j332j156p62J55J052R41
$$ 250873 249527 248146 245951 243051 240005 237123 234482 232233 230515 229183 228027 227265 227420 228472 229413
63778B29413l26j678k011j440q44n07PP02Q37J00p40q85n70l64j16N74J312J264
$$ 229413 229087 227409 225398 223958 223114 222607 222614 223316 224153 224253 223513 222628 222058 221694 221578 222152 223464 224728
63760B24728M47k82m66m68o28p81p40n94l94q7J79K94O43J558K374K033Q00L24
$$ 224728 225175 224893 224427 223959 223331 222550 221810 221216 220822 220735 220914 221208 221851 223409 225783 227816 228616 228940
63742B28940J486L150L691K956J983J434J287J560K292L001K998K280J510J111
$$ 228940 230426 233576 237267 240223 242206 243640 244927 246487 248779 251780 254778 257058 258568 259679
63728B59679R99J146J689K461K976L094L197L571M028M314M434M316L582K024
$$ 259679 260678 261824 263513 265974 268950 272044 275241 278812 282840 287154 291588 295904 299486 301510
63714C01510J61j125j447j238j141j315j407j135o57l36l12m66o78q83q53k78
$$ 301510 301671 300546 299099 297861 296720 295405 293998 292863 292206 291870 291558 291092 290414 289531 288678 288400
63698B88400Q57K122K995L224K862K222J803J955K465K724K429J809J095J91q88
$$ 288400 289257 291379 294374 297598 300460 302682 304485 306440 308905 311629 314058 315867 316962 317153 316265
63683C16265j713k000k055k226k234j628o52k1J04K15N36O72M21L35R76J993K450
$$ 316265 314552 312552 310497 308271 306037 304409 303757 303736 303840 304055 304591 305263 305684 306019 306995 308988 311438
63666C11438J938R87L46J94Q7m92j639k927l734l776l355l077l222l423l083k145
$$ 311438 313376 314363 314709 314903 314990 314498 312859 309932 306198 302422 299067 295990 292768 289345 286262 284117
63650B84117j257j029j319j503j374j269j298r90j3J158J837K048K319K727K837
$$ 284117 282860 281831 280512 279009 277635 276366 275068 274078 274065 275223 277060 279108 281427 284154 286991
63635B86991K595K647L411M394M874M913N204O045P008P630P999Q503R293J0265
$$ 286991 289586 292233 295644 300038 304912 309825 315029 321074 328082 335712 343711 352214 361507 371772
63621C71772J1310J2329J3173J3839J4691J6090J7828J9251K0071K0667K1415
$$ 371772 383082 395411 408584 422423 437114 453204 471032 490283 510354 531021 552436
63610E52436K2008K1829K0726J9000J6857J4318J1564Q786N826K508o25k686l720
$$ 552436 574444 596273 616999 635999 652856 667174 678738 687524 693350 695858 695233 692547 688827
63597F88827m876o819q712r389r005q745r228j0063j0890j1942j3358j4620j5099
$$ 688827 683951 677132 668420 659031 650026 641281 632053 621990 611100 599158 585800 571180 556081
63584E56081j4789j4193j3679j3130j2149j0478q379o530n400m764m041k955j617
$$ 556081 541292 527099 513420 500290 488141 477663 469284 462754 457354 452590 448549 445594 443977
63571D43977q2J678L369M447M769M798N051N654O546P725R018R919J0125J0107
$$ 443977 443895 445573 448942 453389 458158 462956 468007 473661 480207 487932 496950 506869 516994 527101
63557E27101J0891J3057J6020J8453J9561K0003K1226K3790K6578K7953K7287
$$ 527101 537992 551049 567069 585522 605083 625086 646312 670102 696680 724633 751920
63546G51920K4897K0894J5019P767P74m365p317q725r276r364r209q719p595o054
$$ 751920 776817 797711 812730 820497 821271 816906 809589 800864 791588 782224 773015 764296 756701 750647
63532G50647n172n983q300j0941j3034j4668j6294j7952j9246j9791j9571j8992
$$ 750647 745475 739492 731192 720251 707217 692549 676255 658303 639057 619266 599695 580703
63520E80703j8567j8400j8132j7500j6741j6079j5172j3572j1662j0431j0227
$$ 580703 562136 543736 525604 508104 491363 475284 460112 446540 434878 424447 414220
63509D14220j0292r852r031q326p644o487m934l718l272l174k808k151j666j587
$$ 414220 403928 394076 385045 376719 369075 362588 357654 353936 350664 347490 344682 342531 340865 339278
63495C39278j655j501j050n04j25k8o6Q5O11J304J740J715J406J159J205J610
$$ 339278 337623 336122 335072 334568 334443 334415 334349 334434 335045 336349 338089 339804 341210 342369 343574 345184
63479C45184K255K808K972K858K836K908K502J259k92j308j718k181k976l532
$$ 345184 347439 350247 353219 356077 358913 361821 364323 365582 365290 363982 362264 360083 357107 353575
63465C53575l292k526j849j393r17n02n47j079j506j177K5J662L047L597L279
$$ 353575 350283 347757 345908 344515 343598 343096 342549 341470 339964 338787 338812 340474 343521 347118 350397
63450C50397K817L180M675O697Q507R974J1381J2782J3863J4478J5017J6131J8102
$$ 350397 353214 356394 361069 367766 376273 386247 397628 410410 424273 438751 453768 469899 488001
63437D88001K0510K2446K3053K2002J9503J6034J2196Q745O457N659N956O706
$$ 488001 508511 530957 554010 576012 595515 611549 623745 632490 638947 644606 650562 657268
63425F57268P700R218J1411J3989J6581J9103K1530K3468K4335K3851K2120J9245
$$ 657268 664968 674186 685597 699586 716167 735270 756800 780268 804603 828454 850574 869819
63413H69819J5169J0029M469n05m073o072p085p945q987r867j0289j0704j1971
$$ 869819 884988 895017 899486 898981 894908 888836 881751 873806 864819 854952 844663 833959 821988
63400H21988j4331j7173j9736k1604k2552k2450k1690k1056k0878k0658j9928
$$ 821988 807657 790484 770748 749144 726592 704142 682452 661396 640518 619860 599932
63389E99932j9009j8388j7807j6604j4725j2685j0643q265n564l171j570n84K07
$$ 599932 580923 562535 544728 528124 513399 500714 490071 481806 476242 473071 471501 470917 471124
63376D71124J020K061L546N322O809P724Q492R715J1475J3374J4984J6099J6867
$$ 471124 472144 474205 477751 483073 489882 497606 506098 515813 527288 540662 555646 571745 588612
63363E88612J7800J9376K1472K3443K4879K5801K6093K5303K3278K0454J7150
$$ 588612 606412 625788 647260 670703 695582 721383 747476 772779 796057 816511 833661
63352H33661J3176Q605M298R92j635m260o629p861p924p842q433r608j1048j2731
$$ 833661 846837 855442 859740 860732 859097 854837 848208 840347 832423 824581 816148 806540 795492 782761
63338G82761j4527j5976j6989j8179j9955k1671k2214k1188j9087j6550j3989
$$ 782761 768234 752258 735269 717090 697135 675464 653250 632062 612975 596425 582436
63327E82436j1766j0059q495o410l807j795j692l774p079j0350j2873j4442j4898
$$ 582436 570670 560611 552116 545706 541899 540104 538412 534638 527559 517209 504336 489894 474996
63314D74996j4124j2426j0603r418r052r056q766p789o307n005m489m672m872
$$ 474996 460872 448446 437843 428425 419373 410317 401551 393762 387455 382450 377961 373289 368417
63301C68417m561l802k923k127j615j726k462l171l135k434j794j591j495j148
$$ 368417 363856 360054 357131 355004 353389 351663 349201 346030 342895 340461 338667 337076 335581 334433
63287C34433p11n37o69q95j084j233j289j201j051r78r89r24o03N3R32J782K389
$$ 334433 333722 333185 332516 331621 330537 329304 328015 326814 325763 324785 323796 322872 322269 322322 323254 325036 327425
63270C27425K641K471J864J150J001J767K853L217K628J972K158K975L457L081
$$ 327425 330066 332537 334401 335551 336552 338319 341172 344389 347017 348989 351147 354122 357579 360660
63256C60660K271J746J815K354L205M273N384O274O835P180P371P256O856O759
$$ 360660 362931 364677 366492 368846 372051 376324 381708 387982 394817 401997 409368 416624 423480 430239
63242D30239P710R627J1495J2556J3265J4552J6414J7895J8455J8690J9431K0712
$$ 430239 437949 447576 459071 471627 484892 499444 515858 533753 552208 570898 590329 611041
63230F11041K1997K3058K4062K4984K5380K4866K3606K2259K1456K1262K1141
$$ 611041 633038 656096 680158 705142 730522 755388 778994 801253 822709 843971 865112
63219H65112K0598J9896J9815K0574K1291K0856J9155J7055J5193J3170J0159
$$ 865112 885710 905606 925421 945995 967286 988142 1007297 1024352 1039545 1052715 1062874
63208A062874N971J218l497q155j2898j7292k0524k2374k3495k4442k4854k4148
$$ 1062874 1068845 1070063 1066566 1058411 1045513 1028221 1007697 985323 961828 937386 912532 888384
63196H88384k2624k1155j9832j7810j4686j1227q212n310j870J725M402N964P385
$$ 888384 865760 844605 824773 806963 792277 781050 772838 767528 765658 767383 771785 777749 785134
63183G85134R436J1782J3707J5115J6336J7442J8310J9079K0004K0910K1250K0782
$$ 785134 794570 806352 820059 835174 851510 868952 887262 906341 926345 947255 968505 989287
63171I89287J9863J8927J7955J6690J5116J3365J1255Q311M415J58l770p350j1099
$$ 989287 1009150 1028077 1046032 1062722 1077838 1091203 1102458 1110769 1115184 1115342 1111572 1104222 1093123
63158A093123j5224j9238k2481k4704k6112k7065k7914k8802k9478k9467k8540
$$ 1093123 1077899 1058661 1036180 1011476 985364 958299 930385 901583 872105 842638 814098
63147H14098k6965k5125k3197k1297j9633j8283j6973j5352j3359j1157q934o998
$$ 814098 787133 762008 738811 717514 697881 679598 662625 647273 633914 622757 613823 606825
63135F06825n767n335n151m616l837l347l126k507j226l7J98k43j77R64K333K704
$$ 606825 601058 595723 590572 585956 582119 578772 575646 573139 571913 571876 572074 571831 571654 572618 574951 577655
63119E77655K007J374J657K377K474J690P57L48M36P18J042J181P78j26q92r96
$$ 577655 579662 581036 582693 585070 587544 589234 589991 590339 590775 591493 592535 593716 594494 594368 593476 592480
63103E92480o74m38l97m42o92j182j454j121o12o24r73p95J26J087J606K002K513
$$ 592480 591806 591368 590971 590529 589837 588655 587201 586080 585468 584844 583871 583076 583202 584289 585895 587897 590410
63086E90410K721K322J891K226L323M473N055M803L743K434J961L015N001O612
$$ 590410 593131 595453 597344 599570 602893 607366 612421 617224 620967 623401 625362 628377 633378 639990
63072F39990P282P614Q378R565J0625J1264J1681J2267J3253J4652J6280J7815
$$ 639990 647272 654886 663264 672829 683454 694718 706399 718666 731919 746571 762851 780666
63060G80666J9027K0090K1617K4081K7159K9926L1988L4054L6990M0572M3757
$$ 780666 799693 819783 841400 865481 892640 922566 954554 988608 1025598 1066170 1109927
63049A109927M6004M7676M9134N0229N0932N1586N2165N1984N0779M9407M8781
$$ 1109927 1155931 1203607 1252741 1302970 1353902 1405488 1457653 1509637 1560416 1609823 1658604
63038A658604M8607M8003M6933M6155M5930M5623M4513M2268L8679L3790K8233
$$ 1658604 1707211 1755214 1802147 1848302 1894232 1939855 1984368 2026636 2065315 2099105 2127338
63027B127338K2673J6789R572P89q670j8031k7318l6383m4156m9629n3038n5377
$$ 2127338 2150011 2166800 2176372 2177161 2168491 2150460 2123142 2086759 2042603 1992974 1939936 1884559
63015A884559n7036n7512n6220n3054m8368m2916l7589l2712k7735k1998j5664
$$ 1884559 1827523 1770011 1713791 1660737 1612369 1569453 1531864 1499152 1471417 1449419 1433755
63004A433755r410l457K501Q452J3817J8181K1762K4956K7762K9965L1493L2443
$$ 1433755 1424345 1420888 1423389 1431841 1445658 1463839 1485601 1510557 1538319 1568284 1599777 1632220
62992A632220L2896L3026L3167L3468L3534L2731L0884K8468K5924K2946J8747
$$ 1632220 1665116 1698142 1731309 1764777 1798311 1831042 1861926 1890394 1916318 1939264 1958011
62981A958011J3038O478n4o378j2958k0133k7706l5257m2424m8739n3679n7058
$$ 1958011 1971049 1977527 1977473 1971095 1958137 1938004 1910298 1875041 1832617 1783878 1730199 1673141
62969A673141n9143o0225o0353n9550n7914n5434n2109m8534m5710m3882m2073
$$ 1673141 1613998 1553773 1493420 1433870 1375956 1320522 1268413 1219879 1174169 1130287 1088214
62958A088214l9314l5980l3204l1318k9665k7770k5849k4113k2417k0865j9922
$$ 1088214 1048900 1012920 979716 948398 918733 890963 865114 841001 818584 797719 777797
62947G77797j9532j8785j7053j4965j3665j3347j3100j2141j0668r417q719q257
$$ 777797 758265 739480 722427 707462 693797 680450 667350 655209 644541 635124 626405 618148
62935F18148p583o694n946n462m939m213l695l780m068l783k954k431k556k591
$$ 618148 610565 603871 597925 592463 587524 583311 579616 575836 571768 567985 565031 562600 560044 557453
62921E57453j896j029j000j881k860l406l693l950m049l807l252k514j876j773
$$ 557453 555557 554528 553528 551647 548787 545381 541688 537738 533689 529882 526630 524116 522240 520467
62907E20467k324k887k701j956j705k455l404l413k358j164o54q11j085j139j106
$$ 520467 518143 515256 512555 510599 508894 506439 503035 499622 497264 496100 495446 494635 493550 492411 491305
62892D91305j226j353j059k29O20Q44L67l51r17j281j481j487j273q62k81K77
$$ 491305 490079 488726 487667 487438 488058 488902 489269 488918 488001 486720 485239 483752 482479 481617 481336 481613
62876D81613M10o4p17r91r23r99j343j612j694j808j843j260j8J091J421J273
$$ 481613 482023 481959 481242 480251 479328 478329 476986 475374 473680 471872 470029 468769 468751 469842 471263 472536
62860D72536J256J357J207Q18M92L33L72Q98J955K826K687J672O38pn05q82p06
$$ 472536 473792 475149 476356 477174 477666 477999 478371 479269 481224 484050 486737 488409 489047 489040 488535 487653 486947
62843D86947O1O68M00o65j891k660k533j469j45M25J7n37n03j80k49n86m81K13
$$ 486947 487008 487676 488076 487411 485520 482860 480327 478858 478713 479138 479155 478618 478115 477935 477686 477100 476619 476832
62825D76832P82O51J41Q4R27K316L442L711L259K793K833L180L297L071K896L052
$$ 476832 477614 478265 478406 478490 479417 481733 485175 488886 492145 494938 497771 500951 504248 507319 510215 513267
62809E13267L351L528L722M344N481O653P245P143O867P017P778Q945J0285J1619
$$ 513267 516618 520146 523868 528212 533693 540346 547591 554734 561601 568618 576396 585341 595626 607245
62795F07245J2731J3608J4727J6674J9323K1898K3999K6112K8813L2002L5417
$$ 607245 619976 633584 648311 664985 684308 706206 730205 756317 785130 817132 852549
62784H52549L9378M4247M9454N3943N7579O1266O5517O9672P2906P5266P7138
$$ 852549 891927 936174 985628 1039571 1097150 1158416 1223933 1293605 1366511 1441777 1518915
62773A518915P8264P7931P5888P2360O7320O0325N1177M0297K8377J5951L423
$$ 1518915 1597179 1675110 1750998 1823358 1890678 1951003 2002180 2042477 2070854 2086805 2090228
62762B090228q874k0714l1880m1985n0614n7717o3639o8601p2338p4357p4480
$$ 2090228 2081354 2060640 2028760 1986775 1936161 1878444 1814805 1746204 1673866 1599509 1525029
62751A525029p3034p0621o7729o4548o1065n7342n3580m9873m6110m2272l8676
$$ 1525029 1451995 1381374 1313645 1249097 1188032 1130690 1077110 1027237 981127 938855 900179
62740I00179l5610l2813k9742k6378k3392k1298j9832j8352j6615j4804j3006
$$ 900179 864569 831756 802014 775636 752244 730946 711114 692762 676147 661343 648337
62729F48337j1090r057p165n626m428l512k857k313j512j69J610L398M869O022
$$ 648337 637247 628190 621025 615399 610971 607459 604602 602289 600777 600608 602218 605616 610485 616507
62715F16507P033Q044R199J0747J2922J5546J8001J9909K1737K4428K8287L2594
$$ 616507 623540 631584 640783 651530 664452 679998 697999 717908 739645 764073 792360 824954
62703H24954L6493L9959M3596M7699N1946N5910N9462O2595O5262O7411O8955
$$ 824954 861447 901406 945002 992701 1044647 1100557 1160019 1222614 1287876 1355287 1424242
62692A424242O9623O9120O7414O4488N9803N2502M2462L0721J8578O573n367j7080
$$ 1424242 1493865 1562985 1630399 1694887 1754690 1807192 1849654 1880375 1898953 1905526 1900159 1883079
62680A883079k8003l7704m6115n3222n8949o3355o6611o8657o9164o7985o5463
$$ 1883079 1855076 1817372 1771257 1718035 1659086 1595731 1529120 1460463 1391299 1323314 1257851
62669A257851o2235n8824n5455n2087m8578m4864m1055l7285l3672l0486k8168
$$ 1257851 1195616 1136792 1081337 1029250 980672 935808 894753 857468 823796 793310 765142
62658G65142k6816k5801k4255k1932j9358j7154j5509j4289j3241j2074j0717
$$ 765142 738326 712525 688270 666338 646980 629826 614317 600028 586787 574713 563996
62647E63996r548r003q863q392p307o199n657n505n182m583l998l557l170k890
$$ 563996 554448 545445 536582 528190 520883 514684 509027 503522 498340 493757 489759 486202 483032 480142
62633D80142k876l031l070k879k532k029j387q79p82q95o91KP98J270J402J431
$$ 480142 477266 474235 471165 468286 465754 463725 462338 461459 460677 459782 459091 459093 459891 461161 462563 463994
62617D63994J565J916K426K817K839K643K682L190M025N050O315P751R062J0078
$$ 463994 465559 467475 469901 472718 475557 478200 480882 484072 488097 493147 499462 507213 516275 526353
62603E26353J1028J2244J3873J5961J8568K1489K4180K6295K8174L0433L3089
$$ 526353 537381 549625 563498 579459 598027 619516 643696 669991 698165 728598 761687
62592G61687L5442L6890L7561L7925L7985L7176L5058L1843K7984K3455J7813
$$ 761687 797129 834019 871580 909505 947490 984666 1019724 1051567 1079551 1103006 1120819
62581A120819J1027L856k809q727j4166j9220k3675k7355l0144l1809l2311l2244
$$ 1120819 1131846 1135702 1132893 1124166 1110000 1090780 1067105 1039750 1009606 977797 945486 913242
62569I13242l2387l2693l2275l0607k8218k5904k3821k1781j9948j8630j7674
$$ 913242 880855 848162 815887 785280 757062 731158 707337 685556 665608 646978 629304
62558F29304j6591j5235j3806j2326j0563q583o914o039n946o193o227n706m750
$$ 629304 612713 597478 583672 571346 560783 552200 545286 539247 533301 527108 520881 515175 510425
62545E10425l860l430l312l065k440j486l90M95O85R5n85m68N23J680K448K897
$$ 510425 506565 503135 499823 496758 494318 492832 492442 492937 493622 493717 493132 492664 493187 494867 497315 500212
62529E00212L289L714M358N623P628R918J1937J3591J5156J6885J8951K1503K4436
$$ 500212 503501 507215 511573 517196 524824 534742 546679 560270 575426 592311 611262 632765 657201
62516F57201K7210K9296L0822L2555L5105L8167M0674M1692M1268M0227L9089
$$ 657201 684411 713707 744529 777084 812189 850356 891030 932722 973990 1014217 1053306
62505A053306L7407L4392K9992K4853J9387J3433P033R34m050p821j0704j2744
$$ 1053306 1090713 1125105 1155097 1179950 1199337 1212770 1219803 1220737 1216687 1208866 1198162 1185418
62493A185418j3747j3846j3489j2906j1998j0735r279p588n351k557J24J766J836
$$ 1185418 1171671 1157825 1144336 1131430 1119432 1108697 1099418 1091830 1086479 1083922 1084046 1085812 1087648
62480A087648L82k219n403q448j0831j2724j4894j7966k1743k5422k8288l0011
$$ 1087648 1088030 1085811 1080408 1071960 1061129 1048405 1033511 1015545 993802 968380 940092 910081
62468I10081l0461k9739k8443k7476k7163k6827k5565k3344k0958j9025j7420
$$ 910081 879620 849881 821438 793962 766799 739972 714407 691063 670105 651080 633660
62457F33660j5677j3635j1591j0005q976p851n665k413M06J226L45k95O22K512
$$ 633660 617983 604348 592757 582752 573776 565925 560260 557847 558253 559479 559824 559529 560151 562663
62443E62663M081M916N367N606N570N445N423N231M512L451K416J204o68l047
$$ 562663 566744 571660 577027 582633 588203 593648 599071 604302 608814 612265 614681 615885 615217 612170
62429F12170n211o753p795q354q190p461o801o541o363n971n624n657n966o216
$$ 612170 606959 600206 592411 584057 575867 568406 561605 555064 548701 542730 537106 531449 525483 519267
62415E19267o248n962n201m060l022k468k210j840j297q23n24l15j55k2L17J179
$$ 519267 513019 507057 501856 497796 494774 492306 490096 488256 486959 486136 485612 485297 485142 485120 485437 486616
62399D86616K580M176N587O620P235P466P475P477P556P607P582P680Q144Q820
$$ 486616 489196 493372 498959 505579 512814 520280 527755 535232 542788 550395 557977 565657 573801 582621
62385E82621R076Q375O886N323M195L446K910K734L001L291L040K316J785J921
$$ 582621 591697 600072 606958 612281 616476 619922 622832 625566 628567 631858 634898 637214 638999 640920
62371F40920K658L779N244O963Q683J0340J2230J4637J7497K0551K3558K6248
$$ 640920 643578 647357 652601 659564 668247 678587 690817 705454 722951 743502 767060 793308
62359G93308K8394L0229L2412L5180L7735L8920L8457L7018L5080L2162K7565
$$ 793308 821702 851931 884343 919523 957258 996178 1034635 1071653 1106733 1138895 1166460
62348A166460K1487J5040R180M082l87m109p060r889j3408j7459k0870k2876k4032
$$ 1166460 1187947 1202987 1212167 1216249 1215862 1211753 1204693 1194804 1181396 1163937 1143067 1120191 1096159
62335A096159k5241k6374k6566k5605k4288k3309k2510k1450k0167j9067j8437
$$ 1096159 1070918 1044544 1017978 992373 968085 944776 922266 900816 880649 861582 843145
62324H43145j8324j8566j8729j8357j7516j6822j6700j6836j6625j5873j4891
$$ 843145 824821 806255 787526 769169 751653 734831 718131 701295 684670 668797 653906
62313F53906j4043j3428j2879j2103j0928r485q075o863n842n042m480m007l401
$$ 653906 639863 626435 613556 601453 590525 581040 572965 566102 560260 555218 550738 546731 543330
62300E43330k615j694n85O07J448J691J807K305K767K393J428J100J930L113L896
$$ 543330 540715 539021 538436 539043 540491 542182 543989 546294 549061 551454 552882 553982 555912 559025 562921
62285E62921M515N207N340M423L195K776L266M034M824N613N922N383M774N344
$$ 562921 567436 572643 577983 582406 585601 588377 591643 595677 600501 606114 612036 617419 622193 627537
62271F27537P214R333J1023J2575J4244J5689J6717J7884J9854K2654K5781K8753
$$ 627537 634751 644084 655107 667682 681926 697615 714332 732216 752070 774724 800505 829258
62259H29258L1397L3858L6367L8819M0717M1776M2232M2177M0982L7970L3330
$$ 829258 860655 894513 930880 969699 1010416 1052192 1094424 1136601 1177583 1215553 1248883
62248A248883K7797K1786J5563R709M541n93o369j2216j7075k1215k5812l0784
$$ 1248883 1276680 1298466 1314029 1323738 1328279 1327686 1321317 1309101 1292026 1270811 1244999 1214215
62236A214215l4569l6359l7097l7702l7654l6152l3587l0880k8288k5627k3042
$$ 1214215 1179646 1143287 1106190 1068488 1030834 994682 961095 930215 901927 876300 853258
62225H53258k0654j8186j5634j3674j2648j1862j0622r276q395p651o522n433
$$ 853258 832604 814418 798784 785110 772462 760600 749978 740702 732307 724656 718134 712701
62213G12701n125n272m902l920l163k987k841k313j682j278r90n30J97J126K015
$$ 712701 707576 702304 697402 693482 690319 687332 684491 682178 680496 679218 678228 677698 677895 679021 681036
62198F81036K590L000L796M990N675N276M651N065O421P561P974Q106Q102P521
$$ 681036 683626 686626 690422 695412 701087 706363 711014 716079 722500 730061 738035 746141 754243 761764
62184G61764O435N641N430N159M432L756L501L198K496K033K612M070N702P429
$$ 761764 768199 773840 779270 784429 788861 792617 796118 799316 801812 803845 806457 810527 816229 823658
62170H23658R735J2699J5708J8171K0053K1725K3508K5277K6399K6170K4415K1468
$$ 823658 833393 846092 861800 879971 900024 921749 945257 970534 996933 1023103 1047518 1068986
62158A068986J7650J3174Q617M796J801j270n154r369j2862j5369j7573j9969
$$ 1068986 1086636 1099810 1108427 1113223 1115024 1113754 1108600 1099231 1086369 1071000 1053427 1033458
62146A033458k2265k3952k4976k5523k5427k4189k1621j8302j5209j2920j1334
$$ 1033458 1011193 987241 962265 936742 911315 887126 865505 847203 831994 819074 807740
62135H07740j0121r170q432p658o713n942n832o317o820o866o313n095l320j567
$$ 807740 797619 788449 780017 772359 765646 759704 753872 747555 740735 733869 727556 722461 719141 717574
62121G17574n12j04L85J360K512L440M091M252L406J479p86k603l857m630m670
$$ 717574 717062 716958 717343 718703 721215 724655 728746 732998 736404 737883 737097 734494 730637 726007 721337
62106G21337l922l112l151m166n657p283q818r664r191p645o004m854l911k789
$$ 721337 717415 714303 711152 706986 701329 694046 685228 675564 666373 658728 652724 647870 643959 641170
62092F41170j620o94L4Q02J639K457L288M213N083N605N772O081P092Q694J0029
$$ 641170 639550 638856 638890 639692 641331 643788 647076 651289 656372 661977 667749 673830 680922 689616 699645
62077F99645J0445J0412J1008J2499J3962J4555J4633J5061J5915J6557J6772
$$ 699645 710090 720502 731510 744009 757971 772526 787159 802220 818135 834692 851464
62066H51464J7149J8175J9515K0339K0053J8631J6529J4307J2169R785O790L299
$$ 851464 868613 886788 906303 926642 946695 965326 981855 996162 1008331 1018116 1024906 1028205
62054A028205k56l593o569q962j0717j2368j4625j7569k0621k3243k5143k5936
$$ 1028205 1027949 1024356 1017787 1008825 998108 985740 971115 953546 932925 909682 884539 858603
62042H58603k5397k4160k3446k3687k4032k3585k2563k1702k1034j9975j8364
$$ 858603 833206 809046 785600 761913 737881 714296 691733 670031 648997 629022 610658
62031F10658j6641j5101j3537j1815j0234r131q499q137p922p748p473p127o945
$$ 610658 594017 578916 565379 553564 543330 534199 525700 517563 509641 501893 494420 487293 480348
62018D80348o957o776o074n177m763m907m818l815k331j488j678k030j480j8J451
$$ 480348 473391 466615 460541 455364 450601 445694 440876 437061 434730 433242 431564 429534 428054 428036 429487
62003D29487K319K841L524M380M948M845M086K971J822P56k73j210j771j849j904
$$ 429487 431806 434647 438171 442551 447499 452344 456430 459401 461223 461979 461706 460496 458725 456876 454972
61988D54972k602l966n273n939o177o460o711o491n800n139m720m191l399k903
$$ 454972 452370 448404 443131 437192 431015 424555 417844 411353 405553 400414 395694 391503 388104 385201
61974C85201l228l913l876k779j493j001j268j516j339j011q47p31m73j57J51
$$ 385201 381973 378060 374184 371405 369912 368911 367643 366127 364788 363777 362930 362199 361726 361569 361720
61959C61720O86J657K785L521L748L946M589N589O451O886P126P672Q756J0156
$$ 361720 362406 364063 366848 370369 374117 378063 382652 388241 394692 401578 408704 416376 425132 435288
61945D35288J1566J3015J4743J6676J8322J9267J9578J9608J9604J9640J9650
$$ 435288 446854 459869 474612 491288 509610 528877 548455 568063 587667 607307 626957
61934F26957J9367J8532J7358J6459J6026J5410J3906J1677R416P333N090K594
$$ 626957 646324 664856 682214 698673 714699 730109 744015 755692 765108 772441 777531 780125
61922G80125K68j564k956l958m394m174l385k042j42J991L974N932Q252J0647
$$ 780125 780393 778829 775873 771915 767521 763347 759962 757920 757778 759769 763743 769675 777927 788574
61908G88574J2239J2742J2849J3039J2761J1356R121O732M113P53l081o335q382
$$ 788574 800813 813555 826404 839443 852204 863560 872681 879413 883526 884279 881198 874863 866481
61895H66481r653j0969j2674j4445j5624j5779j5246j4909j5131j5213j4392j3036
$$ 866481 856828 845859 833185 818740 803116 787337 772091 757182 742051 726838 712446 699410
61883F99410j2175j2008j1760j0959j0020r403q962q449p951p444o504m931l156
$$ 699410 687235 675227 663467 652508 642488 633085 624123 615674 607723 600279 593775 588844 585688
61870E85688j621k06J283K529L189L614M460N790P220Q719J0613J2812J4802J6485
$$ 585688 584067 583861 585144 587673 590862 594476 598936 604726 611946 620665 631278 644090 658892 675377
61856F75377J8432K0958K3532K5534K7140K8941L0888L2268L2680L2468L2011
$$ 675377 693809 714767 738299 763833 790973 819914 850802 883070 915750 948218 980229
61845I80229L1001K8856K5646K2122J8855J5673J2050P775L063j609n512p734
$$ 980229 1011230 1040086 1065732 1087854 1106709 1122382 1134432 1142207 1145270 1143661 1138149 1130415
61833A130415p745o048l892k192p99J089L892P147R837J1160J0974R647P503M531
$$ 1130415 1122670 1116622 1112730 1110538 1109739 1110828 1114720 1121867 1131704 1142864 1153838 1163485 1170988 1175519
61819A175519O51l902q666j3366j7992k2434k6269k9039l0595l1180l1217l1009
$$ 1175519 1176170 1172268 1163602 1150236 1132244 1109810 1083541 1054502 1023907 992727 961510 930501
61807I30501l0504k9391k7585k5505k3616k1849j9869j7829j6285j5263j4019
$$ 930501 899997 870606 843021 817516 793900 772051 752182 734353 718068 702805 688786
61796F88786j2123j0214r164q852q404p512o780o690o818o389n252m017l372l480
$$ 688786 676663 666449 657285 648433 640029 632517 625737 619047 612229 605840 600588 596571 593199 589719
61782E89719l931m179m050l839l814l738l115j957r41o76j017j331j238q47l76
$$ 589719 585788 581609 577559 573720 569906 566168 563053 561096 560155 559479 558462 557131 555893 555046 554670
61767E54670J87R05J607J966J825J370R61Q65J181J868K665L115K846J949Q56
$$ 554670 554857 555762 557369 559335 561160 562530 563491 564356 565537 567405 570070 573185 576031 577980 578836
61752E78836j38j043j809k206k260k497l281m171m385l942l706m177m703m316
$$ 578836 578698 577655 575846 573640 571380 568883 565602 561431 557046 553104 549398 545221 540518 536202
61738E36202l021j780j307j307j064m59o6l53j043j438j202o05j9M76R29J190
$$ 536202 533181 531401 530094 528787 527723 527264 527198 526845 525802 524364 523162 522557 522538 523014 523943 525133
61722E25133J049O05K36K27N54R58J047M80o70j863k619l051l531l993m018l617
$$ 525133 526182 526787 527023 527250 527804 528762 529809 530289 529619 527756 525137 522086 518555 514562 510544 506927
61706E06927l369l611l988m054l872l719l598l463l593m235n048n355m929m164
$$ 506927 503558 499947 495959 491905 488033 484314 480716 477253 473660 469425 464377 459022 454093 449929
61692D49929l509l107k901k760k497k104j906k151k503k376j791j487j986k928
$$ 449929 446420 443313 440412 437652 435155 433051 431145 428994 426491 424115 422324 420837 418851 415923
61678D15923l533l413k734j858j090o80p63j278j993k550k518j653k99P21P75
$$ 415923 412390 408977 406243 404385 403295 402615 401852 400574 398581 396031 393513 391860 391561 392282 393057
61663C93057k1j042j737j915j620j004l07K27N07O17P82J210J878K438K583K527
$$ 393057 393036 391994 390257 388342 386722 385718 385411 385638 386145 386762 387544 388754 390632 393070 395653 398180
61647C98180K787L404L716L276K609K564L100L346K839K055J506R63L8r92j588
$$ 398180 400967 404371 408087 411363 413972 416536 419636 422982 425821 427876 429382 430345 430383 429391 427803
61632D27803j868k468l492m283m362m007l658l277k670k014j585j256p44j72J16
$$ 427803 425935 423467 419975 415692 411330 407323 403665 400388 397718 395704 394119 392863 392119 391947 392063
61617C92063J54K28J96m49j733k941l448l365l159l033k971l048l293l531l584
$$ 392063 392217 392445 392641 392192 390459 387518 384070 380705 377546 374513 371542 368494 365201 361670 358086
61602C58086l467l138k438j555j115j422j969k138k053k179k401k210j582r80
$$ 358086 354619 351481 349043 347488 346373 344951 342982 340844 338791 336612 334211 332001 330419 329439
61588C29439n77j91M0k36p99r95q15r08j329j242l82K39j87r42q50PO52P96R26
$$ 329439 328862 328671 328711 328475 327676 326681 325866 324958 323629 322387 322005 322244 322057 321115 320265 320272 320924 321720 322646
61569C22646J075P85K49L11J085J631J422J138J444J864J647J110J169J823K062
$$ 322646 323721 324506 324755 325066 326151 327782 329204 330342 331786 333650 335297 336407 337576 339399 341461
61554C41461J346M29M02J340K180J885N11q15j002q3R23J204R64Q78J104J197
$$ 341461 342807 343236 343638 344978 347158 349043 349554 348739 347737 347654 348577 349781 350745 351623 352727 353924
61538C53924Q90N01M89R25J499J832J664R02k64j349j847j615r70m27k99m94o84
$$ 353924 354814 355315 355804 356729 358228 360060 361724 362626 362362 361013 359166 357551 356581 356154 355855 355361 354677
61521C54677o62n47o40j061j578j751j352o26j10j33m91p06n08J2O52J293J769
$$ 354677 354015 353468 352828 351767 350189 348438 347086 346460 346350 346217 345726 345020 344512 344524 345176 346469 348238
61504C48238J818J313M73k31m14K6Q42J582J890J858J943K367K747K524J747J153
$$ 348238 350056 351369 351842 351611 351197 351223 352065 353647 355537 357395 359338 361705 364452 366976 368723 369876
61488C69876J379K209K813K629J913J362J291J283P36k95r96o30N71J569J645
$$ 369876 371255 373464 376277 378906 380819 382181 383472 384755 385491 385196 384200 383570 384141 385710 387355
61473C87355J085O91P75R80R75Q42O69K34m71p58L2J407K002J245J28JR47J895
$$ 387355 388440 389131 389906 390886 391861 392703 393372 393606 393135 392377 392409 393816 395818 397063 397191 397192 398139 400034
61455D00034K018J468R12Q47J382K176K547K048J028L58N05J216K008K567K694
$$ 400034 402052 403520 404432 405279 406661 408837 411384 413432 414460 414818 415323 416539 418547 421114 423808
61440D23808K309J724J413J402J273Q98P17J003J333J153N46N2k7J66L50K79r1
$$ 423808 426117 427841 429254 430656 431929 432827 433544 434547 435880 437033 437579 437631 437604 437770 438120 438399 438308
61423D38308m23k26M62R62P54R7n13r97j375j301o10j3m07j655k776l281l468
$$ 438308 437885 437659 438121 439083 439837 439934 439421 438424 437049 435748 435138 435125 434718 433063 430287 427006 423538
61406D23538l440k786j573p02p76j242j302j046j008j025m36P05J429J054Q1l99
$$ 423538 420098 417312 415739 415037 414261 413019 411717 410671 409663 408638 408202 408907 410336 411390 411471 411072
61390D11072J03J097J743J654J141P64P31Q56J072J670K755L735L754K668J316
$$ 411072 411175 412272 414015 415669 416810 417574 418305 419161 420233 421903 424658 428393 432147 434815 436131
61375D36131O95J080J955K570K416J478L11k35K84J399K105J893J273J171J893
$$ 436131 436826 437906 439861 442431 444847 446325 446636 446401 446685 448084 450189 452082 453355 454526 456419
61360D56419K896L520L692L879M523N704P127Q314Q846Q630P910O973N945M928
$$ 456419 459315 462835 466527 470406 474929 480633 487760 496074 504920 513550 521460 528433 534378 539306
61346E39306M147L742L576L433L284L152K868K279J508P61o7j154k260k956l326
$$ 539306 543453 547195 550771 554204 557488 560640 563508 565787 567295 568056 567989 566835 564575 561619 558293
61331E58293l922m871n537n331m450l490k714k094j757j848k055j760p60M98J444
$$ 558293 554371 549500 543963 538632 534182 530692 527978 525884 524127 522279 520224 518464 517704 518202 519646
61316E19646K001K535L330M277N106N793O581P524Q317Q810R380J0264J0710R589
$$ 519646 521647 524182 527512 531789 536895 542688 549269 556793 565110 573920 583300 593564 604274 613863
61302F13863P009M547L465L297K734J327l70j879l118l861l808l276l094l553
$$ 613863 620872 625419 628884 632181 634915 636242 635872 633993 630875 627014 623206 619930 616836 613283
61288F13283m151m463m645m802m559l731k849k500k445j932p26O88J791K491K905
$$ 613283 609132 604669 600024 595222 590663 586932 584083 581583 579138 577206 576480 577168 578959 581450 584355
61273E84355L110L206L347L585L828M019M283M827N715O736P512P846P973Q293
$$ 584355 587465 590671 594018 597603 601431 605450 609733 614560 620275 627011 634523 642369 650342 658635
61259F58635Q829R059Q477P153N585M141K871J704O06n07j685k780l524l879m083
$$ 658635 667464 676523 685000 692153 697738 701879 704750 706454 707060 706553 704868 702088 698564 694685 690602
61244F90602m253m166l624k889k481k507k472j947j194q67j163j468r99M11K240
$$ 690602 686349 682183 678559 675670 673189 670682 668210 666263 665069 664202 663039 661571 660572 660983 663223
61229F63223L795M707N032N060N116N437O127P178Q408R485J0103J0278J0304
$$ 663223 667018 671725 676757 681817 686933 692370 698497 705675 714083 723568 733671 743949 754253
61216G54253J0481J0893J1443J1860J1771J1095J0425J0560J1447J2097J1916
$$ 754253 764734 775627 787070 798930 810701 821796 832221 842781 854228 866325 878241
61205H78241J1675J2522J4379J6016J6690J6905J7514J8723K0299K2061K3728
$$ 878241 889916 902438 916817 932833 949523 966428 983942 1002665 1022964 1045025 1068753
61194A068753K4702K4581K3607K2293K0781J8975J7069J5571J4849J4844J5111
$$ 1068753 1093455 1118036 1141643 1163936 1184717 1203692 1220761 1236332 1251181 1266025 1281136
61183A281136J4950J3823J1917J0050Q753P644O084M131K375R61o04k617m734
$$ 1281136 1296086 1309909 1321826 1331876 1340629 1348273 1354357 1358488 1360863 1361824 1361220 1358603 1353869
61170A353869o562q238j0130j2209j4087j5592j7032j8717k0387k1270k0902j9786
$$ 1353869 1347307 1339069 1328939 1316730 1302643 1287051 1270019 1251302 1230915 1209645 1188743 1168957
61158A168957j9028j9207j9818j9953j9246j7986j6677j5793j5704j6304j6912
$$ 1168957 1149929 1130722 1110904 1090951 1071705 1053719 1037042 1021249 1005545 989241 972329
61147I72329j7049j7164j8006j9334j9984j9385j8250j7389j6533j5014j3057
$$ 972329 955280 938116 920110 900776 880792 861407 843157 825768 809235 794221 781164
61136G81164j1520j0538r324p397n332l916l111k323j330m61R5O74J716L186M573
$$ 781164 769644 759106 749782 742385 737053 733137 730026 727703 726373 725912 726007 726681 728397 731583 736156
61121G36156N470O028O846Q326J0113J1313J1360J0611R995J0085J0673J1152
$$ 736156 741626 747654 754500 762826 772939 784252 795612 806223 816218 826303 836976 848128
61109H48128J1098J0440R284P785O158M560K986J304n68k570m586o445p959r098
$$ 848128 859226 869666 878950 886735 892893 897453 900439 901743 901175 898605 894019 887574 879615 870517
61095H70517j0125j1333j2603j3431j3521j3164j2823j2512j1902j0952j0048
$$ 870517 860392 849059 836456 823025 809504 796340 783517 771005 759103 748151 738103
61084G38103r488r103q601p969p394o919o480o114n865n571n041m424m043l814
$$ 738103 728615 719512 710911 702942 695548 688629 682149 676035 670170 664599 659558 655134 651091 647277
61070F47277l187j901m83K99L09J15L16J113K349L605M298M200L897M294N497
$$ 647277 644090 642189 641706 642005 642314 642429 642745 643858 646207 649812 654110 658310 662207 666501 671998
61055F71998O678P253P607Q318R208R832J0463J1740J3505J4825J5311J5584J6262
$$ 671998 678676 685929 693536 701854 711062 720894 731357 743097 756602 771427 786738 802322 818584
61042H18584J7150J7874J8612J9670K0749K1312K1421K1692K2476K3606K4899
$$ 818584 835734 853608 872220 891890 912639 933951 955372 977064 999540 1023146 1048045
61031A048045K6423K8289L0517L3141L6104L8942M0976M2019M2847M4693M8244
$$ 1048045 1074468 1102757 1133274 1166415 1202519 1241461 1282437 1324456 1367303 1411996 1460240
61020A460240N3177N8807O5162P3182Q3650R6205J09914J24848J42697J65709
$$ 1460240 1513417 1572224 1637386 1710568 1794218 1890423 2000337 2125185 2267882 2433591
61010B433591J95438K32371K75939L24677L77330M34620M99528N75355O63948
$$ 2433591 2629029 2861400 3137339 3462016 3839346 4273966 4773494 5348849 6012797
61001F012797P66002Q82131J013126J159932J321569J485844J615119J645293
$$ 6012797 6778799 7660930 8674056 9833988 11155557 12641401 14256520 15901813
60993A5901813J515438J215575Q10680M12295J18667k6530l2899N7645J80468
$$ 15901813 17417251 18632826 19443506 19855801 19974468 19947938 19915039 19972684 20153152
60984B0153152K50150J81820o4235m49869q73625j225673j440416j512295j476524
$$ 20153152 20403302 20585122 20520887 20071018 19197393 17971720 16531304 15019009 13542485
60975A3542485j379727j260033j140106j028441r24720q25980p30625o39279n53903
$$ 13542485 12162758 10902725 9762619 8734178 7809458 6983478 6252853 5613574 5059671
60966E059671m76735m09393l52245l04505k64793k31564k03350j79244j59161
$$ 5059671 4582936 4173543 3821298 3516793 3252000 3020436 2817086 2637842 2478681
60957B478681j43119j30155j18509j07056r6085q6474p8543p2003o6633o2483
$$ 2478681 2335562 2205407 2086898 1979842 1883757 1797283 1718740 1646737 1580104 1517621
60947A517621n9548n7534n5938n4244n2156m9692m6973m3981m0757l7755l5575
$$ 1517621 1458073 1400539 1344601 1290357 1238201 1188509 1141536 1097555 1056798 1019043 983468
60936I83468l4250l3187l1864l0260k8506k6543k4379k2252k0309j8411j6553
$$ 983468 949218 916031 884167 853907 825401 798858 774479 752227 731918 713507 696954
60925F96954j5082j4194j3471j2353j0891r647q936q493p911p121o350n696m894
$$ 696954 681872 667678 654207 641854 630963 621316 612380 603887 595976 588855 582505 576809 571915
60912E71915l650k158j068p02n91j54M14M63j4l19q9K87L76J19o32k195m195n394
$$ 571915 568265 566107 565039 564337 563746 563592 564006 564469 564455 564136 564047 564334 564710 564829 564197 562002 557807 552413
60894E52413m976l603k568k354k493k459k118j571j105j006j123r22l78k59j040
$$ 552413 547437 543834 541266 538912 536419 533960 531842 530271 529166 528160 527037 526115 525737 525478 524438
60879E24438k076k536k637l079l731l810l226k727k750k926k877k659k340j812
$$ 524438 522362 519826 517189 514110 510379 506569 503343 500616 497866 494940 492063 489404 487064 485252
60865D85252j206r37j141j569k020k454k652k379j851j537j483j391j290j499
$$ 485252 484046 483109 481968 480399 478379 475925 473273 470894 469043 467506 466023 464632 463342 461843
60851D61843j924k070j770j371j124j097j563k708l902m155l478k936l140l574
$$ 461843 459919 457849 456079 454708 453584 452487 450924 448216 444314 440159 436681 433745 430605 427031
60837D27031l729l921m444m823m564l978l539l014k050j064p61r92r16j68P59
$$ 427031 423302 419381 414937 410114 405550 401572 398033 395019 392969 391905 391144 390152 389236 389068 389827
60822C89827J299J442J564J948K516K800K370J388N17J18j18n26r35j068j071
$$ 389827 391126 392568 394132 396080 398596 401396 403766 405154 405671 405789 405671 405145 404210 403142 402071
60807D02071j200j363j443j672k258k857k957k600k248k160k284k557k860k916
$$ 402071 400871 399508 398065 396393 394135 391278 388321 385721 383473 381313 379029 376472 373612 370696
60793C70696k615k335k492k950l238l211l040k704k003j042l29l24j054k062k582
$$ 370696 368081 365746 363254 360304 357066 353855 350815 348111 346108 345066 344737 344413 343359 341297 338715
60778C38715k042o54O81J252J091N46j81p47n90L06J127J317J495K459L741M160
$$ 338715 336673 336019 336700 337952 339043 339589 339408 338661 338071 338377 339504 340821 342316 344775 348516 352676
60762C52676L565K992L087L382L340L133L080L105L174L564M234M548M067L204
$$ 352676 356241 359233 362320 365702 369042 372175 375255 378360 381534 385098 389332 393880 397947 401151
60748D01151K630K488K476K354J974J192J52o95j198j743k566l261l409l286l373
$$ 401151 403781 406269 408745 411099 413073 414265 414417 413722 412524 410781 408215 404954 401545 398259 394886
60733C94886l482l120k506k496l307m059l902l104k584k688k942k914k812l046
$$ 394886 391404 388284 385778 383282 379975 375916 372014 368910 366326 363638 360696 357782 354970 351924
60719C51924l501l615l099k321j860j771j557q99k40m04j594k935l276k407j231
$$ 351924 348423 344808 341709 339388 337528 335757 334200 333301 333061 332657 331063 328128 324852 322445 321214
60704C21214o82p33p41m57k22k94m76n38n29m40L2R84J927K268K035J746J689
$$ 321214 320532 319799 319058 318601 318379 318085 317609 317071 316542 316102 316134 317118 319045 321313 323348 325094 326783
60687C26783J680J494J196J068J375K122K977L506L635L684L833L885L714L540
$$ 326783 328463 329957 331153 332221 333596 335718 338695 342201 345836 349520 353353 357238 360952 364492
60673C64492L423K954J910Q72N40P03N24k86j260j972k354k242j463n11l17j005
$$ 364492 367915 370869 372779 373651 374191 374894 375418 375132 373872 371900 369546 367304 365841 365330 365013 364008
60657C64008j558j127r5O61J023J515K243K639K200J087m4n42k29L39K42q57k271
$$ 364008 362450 361323 361228 361889 362912 364427 366670 369309 371509 372596 372552 372010 371781 372120 372362 371505 369234
60640C69234k973k705k049j575j247q08l69l62r75j815k208j829r30KO81J071
$$ 369234 366261 363556 361507 359932 358685 357877 357508 357146 356171 354356 352148 350319 349389 349391 350072 351143
60624C51143J159R54O67N66O31N74L15K51P63J596J960J341R8q60r51l92K00M95
$$ 351143 352302 353256 353923 354489 355120 355694 356009 356260 357023 358619 360579 361920 362018 361158 360207 359815 360015 360510
60606C60510N97O52O52O18O34O30L99K8n7L82J099J739K155K189J699J064J113
$$ 360510 361107 361759 362411 363029 363663 364293 364692 364720 364663 365045 366144 367883 370038 372227 373926 374990 376103
60589C76103J973K582K085J162J132K007K502J958J128Q84J080J190J231J490
$$ 376103 378076 380658 382743 383905 385037 387044 389546 391504 392632 393516 394596 395786 397017 398507
60575C98507J875K075K124K350K949L800M541M780M474M147M375N163O114P002
$$ 398507 400382 402457 404581 406931 409880 413680 418221 423001 427475 431622 435997 441160 447274 454276
60561D54276P582P210N528L516K707L184L430K484J186P08R21J063J146J610K248
$$ 454276 461858 469068 474596 478112 480819 484003 487433 489917 491103 491811 492732 493795 494941 496551 498799
60546D98799K547K775L653N190O659P682Q556R597J0858J2442J4431J6577J8588
$$ 498799 501346 504121 507774 512964 519623 527305 535861 545458 556316 568758 583189 599766 618354
60533F18354K0595K2678K4102K3788K1622J8598J5529J2242Q266L718p49m580
$$ 618354 638949 661627 685729 709517 731139 749737 765266 777508 785774 789492 788743 784163
60521G84163p579r805j1388j2389j2763j2537j1911j0997r647p781n694l789k134
$$ 784163 776584 766779 755391 743002 730239 717702 705791 694794 685147 677366 671672 667883 665749
60508F65749n32J141K937N009P453J0160J3041J6238J9754K3231K6430K9710L3510
$$ 665749 665217 666358 669295 674304 681757 691917 704958 721196 740950 764181 790611 820321 853831
60495H53831L7619M1359M4287M6177M6530M4848M1394L7088L2542K7698K2471
$$ 853831 891450 932809 977096 1023273 1069803 1114651 1156045 1193133 1225675 1253373 1275844
60484A275844J7060J1395M749l586j3409k3609l2945m0683m6618n0720n2932n3257
$$ 1275844 1292904 1304299 1309048 1305462 1292053 1268444 1235499 1194816 1148198 1097478 1044546 991289
60472I91289n1904m9230m5666m1888l8678l6173l3412k9444k4840k1272j9421
$$ 991289 939385 890155 844489 802601 763923 727750 694338 664894 640054 618782 599361
60461E99361j8236j6639j4884j3558j2269j0453q606p563p095o395n551n247n355
$$ 599361 581125 564486 549602 536044 523775 513322 504716 497153 490058 483663 478112 472865 467510
60448D67510n150m654m443m284l503k604k904m250m809l703k237j695j423l10
$$ 467510 462360 457706 453263 448979 445476 442872 439968 435718 430909 427206 424969 423274 421851 421541
60434D21541J073J251J18j032j336j100q84p62n71j62N03J151J265P90L83M72
$$ 421541 422614 423865 423983 422951 421615 420515 419631 418869 418298 418136 418639 419790 421055 421845 422228 422700
60418D22700N89J87l41k31M74J120J482J810J983J585Q14M93R41J559J729J514
$$ 422700 423289 423476 423135 422904 423378 424498 425980 427790 429773 431358 432172 432665 433606 435165 436894 438408
60402D38408J245R35N21L12P08J600K410K734K769K956L296L239K428J344R07
$$ 438408 439653 440588 441109 441421 442129 443729 446139 448873 451642 454598 457894 461133 463561 464905 465812
60387D65812J378K093K414K456K677L086L332L273L096K927K712K387J981J566
$$ 465812 467190 469283 471697 474153 476830 479916 483248 486521 489617 492544 495256 497643 499624 501190
60373E01190J304J376J759K215K625L044L349L194K541J910J782K079K466K820
$$ 501190 502494 503870 505629 507844 510469 513513 516862 520056 522597 524507 526289 528368 530834 533654
60359E33654L147L356L544M148N344O618P350P612P839Q012P676O637N079L059
$$ 533654 536801 540157 543701 547849 553193 559811 567161 574773 582612 590624 598300 604937 610016 613075
60345F13075N06k238m374n393n600n746o276o912o892n811m297l569m065m903
$$ 613075 613581 611343 606969 601576 595976 590230 583954 577042 570150 564339 560042 556473 552408 547505
60331E47505n023m498m221m553m964m852m123k940j415K85J901L196L907L847
$$ 547505 542482 537984 533763 529210 524246 519394 515271 512331 510916 511201 513102 516298 520205 524052
60317E24052L306L195M228O055P571P983P216N614L778K428J779J170n1j457k036
$$ 524052 527358 530553 534781 540836 548407 556390 563606 569220 572998 575426 577205 578375 578324 576867 574831
60302E74831j613r04k92M90J345J572R36O1p41k072m258o437p611p921q048p894
$$ 574831 573218 572314 572022 572512 573857 575429 576365 576426 575685 573613 569355 562918 555307 547386 539338 531444
60286E31444o902n334m153l733l509l088k858l245l972m423m365m000l657l584
$$ 531444 524542 519208 515055 511322 507813 504725 501867 498622 494650 490227 485862 481862 478205 474621
60272D74621l809l999l654k649j437o13l85n14o14m16P6N44N85J87j07K58J145
$$ 474621 470812 466813 463159 460510 459073 458460 458075 457561 456947 456531 456607 457151 457736 457923 457816 458074 459219
60255D59219J776J647J191J229J792J972J138r6o07j93L30L77J85M7k83r56j355
$$ 459219 460995 462642 463833 465062 466854 468826 469964 469868 469261 469068 469398 469775 469960 470007 469724 468768 467413
60238D67413q10K91Q23L33m32m85L40J457K245K481K354K278K574L251M002M471
$$ 467413 466603 466894 467717 468050 467618 467133 467473 468930 471175 473656 476010 478288 480862 484113 488115 492586
60222D92586M490M175L928M198M997N759N864N273M513M131M291M764N060M793
$$ 492586 497076 501251 505179 509377 514374 520133 525997 531270 535783 539914 544205 548969 554029 558822
60208E58822M222M154M916N636N176L657K363K134K544K823K740K216R52q96k340
$$ 558822 563044 567198 572114 577750 582926 586583 588946 591080 593624 596447 599187 601403 602355 601459 599119
60193E99119k660k413k598l143l199k609k092k011j995j866j990k356k314j647
$$ 599119 596459 594046 591448 588305 585106 582497 580405 578394 576399 574533 572543 570187 567873 566226
60179E66226j067j119j322j045n61m41n38l55j0N0l0K37O81O52J23k47k14k22
$$ 566226 565159 564040 562718 561673 561112 560671 560133 559778 559768 559818 559788 560025 560706 561358 561481 561234 561020 560798
60161E60798m69n68l45j91k44j4P06J225R13K37J42Q01J513J715J444J031P95
$$ 560798 560329 559761 559416 559225 558981 558967 559673 560898 561811 562048 562190 562991 564504 566219 567663 568694 569489
60144E69489R97J623K238K446K433K716L419M206M855N426N827N703M985M140
$$ 569489 570486 572109 574347 576793 579226 581942 585361 589567 594422 599848 605675 611378 616363 620503
60130F20503L636L367K947K279J562P65l60j629k263j805r50q29j500j854j244
$$ 620503 624139 627506 630453 632732 634294 635059 634699 633070 630807 629002 628052 627223 625723 623869 622625
60115F22625m75n67j230j463j323j908l516m906m914l912l064k811k769k707k776
$$ 622625 622150 621583 620353 618890 617567 615659 612143 607237 602323 598411 595347 592536 589767 587060 584284
60100E84284l004l134k952k378j362r3R32J418J708K278K967L152K558J548O36
$$ 584284 581280 578146 575194 572816 571454 571361 572293 573711 575419 577697 580664 583816 586374 587922 588558
60085E88558J20J02M82R78J336J509J454R80N2r98j836k513l255m118n054o010
$$ 588558 588678 588780 589262 590240 591576 593085 594539 595519 595571 594573 592737 590224 586969 582851 577797 571787
60069E71787o690o629n823m938m454m090l554l261l662m304m399m004l740l584
$$ 571787 565097 558468 552645 547707 543253 539163 535609 532348 528686 524382 519983 515979 512239 508655
60055E08655k904j627m36K74P85J341J835K292K881L346L261K917L040L516L407
$$ 508655 505751 504124 503688 503962 504747 506088 507923 510215 513096 516442 519703 522620 525660 529176 532583
60040E32583K503J779J738J461K4j971l234l473l349l270l236l517m472n778o624
$$ 532583 535086 536865 538603 540064 540088 538117 534883 531410 528061 524791 521555 518038 513566 507788 501164
60025E01164o705o424o170n958n749n534n138m449l770l423l130k401j472j134
$$ 501164 494459 488035 481865 475907 470158 464624 459486 455037 451267 447844 444714 442313 440841 439707
60011D39707j525j884j700j365j293j078k05Q44J005J08q26q33l6Q00J247J368
$$ 439707 438182 436298 434598 433233 431940 430862 430657 431501 432506 432614 431788 430955 430919 431719 432966 434334
59995D34334J323J276J552K306L108L250K618J824J358J080P84P75J361K057J962
$$ 434334 435657 436933 438485 440791 443899 447149 449767 451591 452949 454029 454813 455588 456949 459006 460968
59980D60968Q44n63j447j652j520j336j136q00k35M32Q49Q85R52J602K788L846
$$ 460968 461812 461249 459802 458150 456630 455294 454158 453358 453123 453555 454404 455289 456241 457843 460631 464477
59964D64477M231L992L558L308L415L802M109L892K972J526l4j197j640j603j733
$$ 464477 468708 472700 476258 479566 482981 486783 490892 494784 497756 499282 499248 498051 496411 494808 493075
59949D93075k229k515k158j660j712k087k013j458j067r51n05M48J362J990K758
$$ 493075 490846 488331 486173 484513 482801 480714 478701 477243 476176 475225 474720 475168 476530 478520 481278
59934D81278L747M240L752K689J584M20q29j792k368k994l709l803l007k207k080
$$ 481278 485025 489265 493017 495706 497290 497710 496881 495089 492721 489727 486018 482215 479208 477001 474921
59919D74921j887o19J296K606L058L460M203M868N218N502N718N558N151M994
$$ 474921 473034 472415 473711 476317 479375 482835 487038 491906 497124 502626 508344 513902 519053 524047
59905E24047N020M613L680K827K247J336k27j706k248j960j581j438j258q01k04
$$ 524047 529067 533680 537360 540187 542434 543770 543543 541837 539589 537629 536048 534610 533352 532551 532347
59890E32347K69N65Q02J075J373J756K459L555M583M915M609M377M439M106K987
$$ 532347 532616 533181 533983 535058 536431 538187 540646 544201 548784 553699 558308 562685 567124 571230 574217
59875E74217J975K121L022L311K525J412M96m56j346j355k60Q21O96n00j821k783
$$ 574217 576192 578313 581335 584646 587171 588583 589079 588623 587277 585922 585662 586483 587179 586679 584858 582075
59859E82075l439l691l340k649k074j555p38J94N91M03N37J796L839N579O390
$$ 582075 578636 574945 571605 568956 566882 565327 564589 564783 565374 565777 566314 568110 571949 577528 583918
59844E83918O504O263N475L836J768L98N11J763L126L926M181M020L168J264j456
$$ 583918 590422 596685 602160 605996 607764 608162 608673 610436 613562 617488 621669 625689 628857 630121 628665
59829F28665m088n844o774p509q338q850q643p980p344o645n519m215l381k986
$$ 628665 624577 618733 611959 604450 596112 587262 578619 570639 563295 556650 551131 546916 543535 540549
59815E40549k306j244o86j041j330n72O85J158P13M17R37J877K615K942K794K206
$$ 540549 538243 536999 536313 535272 533942 533370 534055 535213 535926 536343 537280 539157 541772 544714 547508 549714
59799E49714J603J524J859J954J506Q57M14L06N31Q98R07L27l19m37l46p58j473
$$ 549714 551317 552841 554700 556654 558160 559017 559431 559737 560268 561166 562073 562400 562081 561644 561298 560540 559067
59782E59067j579r24l19k51l67m22o67r96p66J03Q26J006J235J961K742L190L683
$$ 559067 557488 556564 556245 555994 555627 555205 554538 553542 552776 552879 553705 554711 555946 557907 560649 563839 567522
59765E67522M473N026N062N274O177P045P080O832P371Q621R693J0390J1122J1626
$$ 567522 571995 577021 582083 587357 593534 600579 607659 614491 621862 630483 640176 650566 661688 673314
59751F73314J1148R854Q924R002R543R817R716R339Q663P850P159O340M767K410
$$ 673314 684462 694316 703240 712242 721785 731602 741318 750657 759320 767170 774329 780669 785436 787846
59737G87846Q9j496k366k721k546k111k196l289m882o003o241n897n457n238n320
$$ 787846 787935 786439 784073 781352 778806 776695 774499 771210 766328 760325 754084 748187 742730 737492 732172
59722G32172n496n417m982m442m002l550l002k605k589k651k160r52L44R36P72
$$ 732172 726676 721259 716277 711835 707833 704283 701281 698676 696087 693436 691276 690324 690668 691604 692376
59707F92376O83J480L012M289M593M235L979M069M067L642L018K624K588K688
$$ 692376 693059 694539 697551 701840 706433 710668 714647 718716 722783 726425 729443 732067 734655 737343
59693G37343K663K397J970J532J109N61r5m80k64K13P7j185l200n108o312o721
$$ 737343 740006 742403 744373 745905 747014 747575 747480 747000 746736 746949 747026 745841 742641 737533 731221 724500
59677G24500o575o249o078o102o045n730n461n656o106n963m730l049k070k123
$$ 724500 717925 711676 705598 699496 693451 687721 682260 676604 670498 664535 659805 656756 654686 652563
59663F52563k439k293j843j537j205l42R53J998K479K747L088L282L084K643K139
$$ 652563 650124 647831 645988 644451 643246 642904 643857 645855 648334 651081 654169 657451 660535 663178 665317
59648F65317J460M63p31j932k989l585l405k754k480k939l477l348k604j785j217
$$ 665317 666777 667240 666509 664577 661588 658003 654598 651844 649364 646425 642948 639600 636996 635211 633994
59633F33994j125j838l234m437m790m835n553o924q015q284p977p371o515n753
$$ 633994 632869 631031 627797 623360 618570 613735 608182 601258 593243 584959 576982 569611 563096 557343
59619E57343n608n927n893n141m238l791l693l529l180k749k274j820j487j182
$$ 557343 551735 545808 539915 534774 530536 526745 523052 519523 516343 513594 511320 509500 508013 506831
59605E06831p21k57o0J22Q30J851K182J430N65P01J607K159J890J349J141J249
$$ 506831 506110 505853 505793 505915 506745 508596 510778 512208 512773 513474 515081 517240 519130 520479 521620 522869
59589E22869J393J442J322R36L86N0K34Q19J315J229M92m11q40o87n46j037k011
$$ 522869 524262 525704 527026 527962 528348 528398 528632 529451 530766 531995 532487 532076 531236 530549 530003 528966 526955
59572E26955k657k426j664j232j558k219k489k152j627j276j023o78l81l53m89
$$ 526955 524298 521872 520208 518976 517418 515199 512710 510558 508931 507655 506632 505954 505573 505220 504731
59557E04731n47n58o39n72n4O98J169J318J580K064K407K562L072M204N455O330
$$ 504731 504184 503626 502987 502415 502361 503059 504228 505546 507126 509190 511597 514159 517231 521435 526890 533220
59541E33220P096Q356J0201J2283J4157J5130J4168J0772N813J000k447m246m649
$$ 533220 540316 548672 558873 571156 585313 600443 614611 625383 631196 632196 629749 625503 620854
59528F20854m138l410k907k419j599q19q27j599k206k028j537j601k460l713m923
$$ 620854 616716 613306 610399 607980 606381 605562 604735 603136 600930 598902 597365 595764 593304 589591 584668
59513E84668n862o408o511o245n747n225m991n204n488n191m192l118k546k302
$$ 584668 578806 572398 565887 559642 553895 548670 543679 538475 532987 527796 523604 520486 517940 515638
59499E15638j857j163o50n06m43j71J75L15K68L33O81J126J334J199R70R33J083
$$ 515638 513781 512618 511968 511462 511019 510848 511023 511338 511606 511939 512620 513746 515080 516279 517249 518182 519265
59482E19265J130R26P53J063J965K997L542L436L121L117L338L170K288J258J020
$$ 519265 520395 521321 522074 523137 525102 528099 531641 535077 538198 541315 544653 547823 550111 551369 552389
59467E52389J821K905L307K805J975J529J697K197K653L023L581M397N023M980
$$ 552389 554210 557115 560422 563227 565202 566731 568428 570625 573278 576301 579882 584279 589302 594282
59453E94282M499M351M821N279N042M300L725L468L075K329J603J236J090R29
$$ 594282 598781 603132 607953 613232 618274 622574 626299 629767 632842 635171 636774 638010 639100 640029
59439F40029Q35R52J143J266J556K285L171L547L199K777L112M349N851O954P649
$$ 640029 640864 641816 642959 644225 645781 648066 651237 654784 657983 660760 663872 668221 674072 681026 688675
59424F88675Q400R336R923R622Q809Q548R389J0743J1701J2120J2500J3008J3130
$$ 688675 697075 706411 716334 725956 734765 743313 752702 763445 775146 787266 799766 812774 825904
59411H25904J2251J0083O538J733l493p521q926p569m615j425J410M048O545Q053
$$ 825904 838155 848238 854776 856509 853016 845495 836569 829000 824385 822960 824370 828418 834963 843016
59397H43016P108K938l385r448j3350j4953j5319j5248j4703j3389j1452r453
$$ 843016 850124 853062 849677 840229 826879 811926 796607 781359 766656 753267 741815 732362
59385G32362p862o714n746m779l917l256k523j263M57J850K124J284M6r17j423
$$ 732362 724500 717786 712040 707261 703344 700088 697565 696302 696759 698609 700733 702017 702063 701146 699723
59370F99723j574j499j271r44n68k87l28o79q60l08R58K235K880K972L127L669
$$ 699723 698149 696650 695379 694435 693867 693580 693252 692573 691713 691405 692363 694598 697478 700450 703577 707246
59354G07246M253M355M093M272N491P289Q466Q254O981N500M316L419K753K365
$$ 707246 711499 715854 719947 724219 729710 736999 745465 753719 760700 766200 770516 773935 776688 779053
59340G79053K172J787P56j083l427n638p145p885q243q537q722q650q393q099
$$ 779053 781225 783012 783768 782685 779258 773620 766475 758590 750347 741810 733088 724438 716045 707946
59326G07946p749p290o843o560o360o053n593n030m350l665l298l345l373k941
$$ 707946 700197 692907 686064 679504 673144 667091 661498 656468 652118 648453 645155 641810 638437 635496
59312F35496k254j832j625j039J13J328K272L293M762O331P378P876Q419R458
$$ 635496 633242 631410 629785 628746 628859 630187 632459 635752 640514 646845 654223 662099 670518 679976
59298F79976J0876J2140J2476J0991P216J830l397o783p908p596o836n941m732
$$ 679976 690852 702992 715468 726459 733675 735505 732108 725325 717417 709821 702985 697044 692312
59285F92312l187j539N5J626L065M066M514M736N185O065P341Q786R853R944R150
$$ 692312 689125 687586 687641 689267 692332 696398 700912 705648 710833 716898 724239 733025 742878 752822 761972
59270G61972Q375Q291Q455P943O586N058L849K854J870Q87k21j703l463n116o510
$$ 761972 770347 778638 787093 795036 801622 806680 810529 813383 815253 816140 815919 814216 810753 805637 799127
59255G99127p751q663q891q605q346q043p030n379m315m676n681o003n367m328
$$ 799127 791376 782713 773822 765217 756871 748828 741798 736419 732104 727428 721747 715744 710377 706049
59241G06049l067j560n29r17k305l094k565j788j968k774l144l011l258m224n202
$$ 706049 702982 701422 700893 699976 697671 694577 692012 690224 688256 685482 682338 679327 676069 671845 666643
59226F66643n508n220m668l865k902k359k671l358l512l000k582k755l127l266
$$ 666643 661135 655915 651247 647382 644480 642121 639450 636092 632580 629580 626998 624243 621116 617850
59212F17850l481m206n068n334n067m970n147m894l968l136l085l388l233k647
$$ 617850 614369 610163 605095 599761 594694 589724 584577 579683 575715 572579 569494 566106 562873 560226
59198E60226k266k250k130j616r54n04m08o10p72l35Q64K100K502K168K014K412
$$ 560226 557960 555710 553580 551964 551010 550506 550098 549488 548716 548381 549245 551345 553847 556015 558029 560441
59182E60441K736K390J681J266J240J215J004P33M62J36k08m18m37l12q4J39J79
$$ 560441 563177 565567 567248 568514 569754 570969 571973 572706 573168 573304 573096 572678 572241 571929 571845 571984 572163
59165E72163J2j35j90m88j323k312k646k050j141p46j082j767k381k767k954l032
$$ 572163 572175 572040 571850 571362 570039 567727 565081 563031 561890 561144 560062 558295 555914 553147 550193 547161
59149E47161l121l267l334l152k753k332j959j513r36n01n51j088j659j759j249
$$ 547161 544040 540773 537439 534287 531534 529202 527243 525730 524794 524293 523742 522654 520995 519236 517987
59134E17987l85M88J185J735K204K614K928L104L134L112L285L948N101O298P063
$$ 517987 517602 518090 519275 521010 523214 525828 528756 531860 534994 538106 541391 545339 550440 556738 563801
59119E63801P485Q151R334J0485J0846J0394R832R702R809R668R161Q522P890
$$ 563801 571286 579437 588771 599256 610102 620496 630328 640030 649839 659507 668668 677190 685080
59106F85080P172O351N609N039M398L324J786J70j170k200k985l349l065k317
$$ 685080 692252 698603 704212 709251 713649 716973 718759 718929 717759 715559 712574 709225 706160 703843
59092G03843j630j281j097r03p75p23n80n14j166k729m339n005m859m772m979
$$ 703843 702213 700932 699835 698932 698157 697434 696854 696340 695174 692445 688106 683101 678242 673470 668491
59077F68491m956m595m484m839n122n089n316o064o459n627m058l006k909l241
$$ 668491 663535 658940 654456 649617 644495 639406 634090 628026 621567 615940 611882 608876 605967 602726
59063F02726l543l774l796l468l195l546m258m433l864l289l161k962k170j163
$$ 602726 599183 595409 591613 588145 584950 581404 577146 572713 568849 565560 562399 559437 557267 556104
59049E56104n40j60M36J051J034L80o0M38J697K954L577L452K939K655L013L926
$$ 556104 555564 555404 555840 556891 557925 558305 558245 558683 560380 563334 566911 570363 573302 575957 578970 582896
59033E82896M986N933O799P706Q720R892J1184J2349J3145J3663J4137J4369J3684
$$ 582896 587882 593815 600614 608320 617040 626932 638116 650465 663610 677273 691410 705779 719463
59020G19463J1733R030O450M357K486N35j482l372m861n576n363m688m306m340
$$ 719463 731196 740226 746676 751033 753519 754054 752572 749200 744339 738763 733400 728712 724406 720066
59006G20066m050k827j114P2L40K70N28J075J368J084M65k1k12m10r82j833k489
$$ 720066 716016 713189 712075 712147 712487 712757 713285 714360 715728 716812 717277 717256 717044 716634 715652 713819 711330
58989G11330k666k570k478k376k199k144k302k271j489J12K151M310O371P913
$$ 711330 708664 706094 703616 701240 699041 696897 694595 692324 690835 690947 693098 697408 703779 711692
58975G11692Q607Q794R235J0100J0756J0707J0224R815R597R511R635R850R495
$$ 711692 720299 729093 738328 748428 759184 769891 780115 789930 799527 809038 818673 828523 838018
58962H38018P949N449K944J140r9j431l307n531p478q768r626j0436j1104j1305
$$ 838018 845967 851416 854360 855500 855401 853970 850663 845132 837654 828886 819260 808824 797720 786415
58948G86415j1166j1185j1389j1218j0424r373q258o725m744l100k380k046j311
$$ 786415 775249 764064 752675 741457 731033 721660 713402 706677 701933 698833 696453 694407 693096
58935F93096m33k32o48p80l05J07n7m74p52j128j968l069l885m119l797l085k319
$$ 693096 692663 692431 691783 691003 690698 690805 690748 690274 689522 688394 686426 683357 679472 675353 671556 668471 666152
58918F66152j946k037k123j739j027m90l30k30K90J525L426N521P145P976Q408
$$ 666152 664206 662169 660046 658307 657280 656790 656460 656230 656520 658045 661471 666992 674137 682113 690521
58903F90521R091J0186J1237J1867J2249J2710J3148J3166J2708J2195J2039J2296
$$ 690521 699612 709798 721035 732902 745151 757861 771009 784175 796883 809078 821117 833413
58891H33413J2922J3900J4914J5252J4488J2965J1272R428P120M490K144L71j030
$$ 833413 846335 860235 875149 890401 904889 917854 929126 938554 945674 950164 952308 952679 951649
58878I51649k256l335m485n918p214p541o754n671n028m797m733m848m984m718
$$ 951649 949393 946058 941573 935655 928441 920900 914146 908475 903447 898650 893917 889069 884085 879367
58864H79367m176m255n346o478o498n602m960n198o005o867p397p254o513n938
$$ 879367 875191 870936 865590 859112 852614 847012 842052 836854 830849 823982 816585 809331 802818 796880
58850G96880o176o904p457p936q911j0204j1056j1339j1595j1818j1293r920q692
$$ 796880 790704 783800 776343 768407 759496 749292 738236 726897 715302 703484 692191 682271 673579
58837F73579q369q385p695o154m525l485l087l007k831k231j152J15J195J909
$$ 673579 665210 656825 649130 642976 638451 634966 631879 628872 626041 623810 622658 622773 623968 625877
58823F25877K327K640K973L214L130K703K178J745J406J312J639J963J362k98
$$ 625877 628204 630844 633817 637031 640161 642864 645042 646787 648193 649505 651144 653107 654469 654171
58809F54171j745j774q50m15q83j380j368j423k175l376m399m997n276n412n666
$$ 654171 652426 650652 649802 649387 648504 647124 645756 644333 642158 638782 634383 629386 624110 618698 613032
58794F13032o150o431n887m566l209k341j840j451j136q08l19J71L64M66R76J808
$$ 613032 606882 600451 594564 589998 586789 584448 582608 581157 580021 579213 578894 579065 579429 579895 580871 582679
58778E82679K320K349K423K686K430J173n23j831k732l711m792n412n139m150
$$ 582679 584999 587348 589771 592457 594887 596060 595537 593706 590974 587263 582471 577059 571920 567770
58764E67770l071k425k118j548m52N37O72K01K6M36R00J098J230J300R99M86L54
$$ 567770 564699 562274 560156 558608 558156 558693 559365 559566 559592 560028 560928 562026 563256 564556 565555 566041 566395
58747E66395N99O27N43J312L117M713N086M781M783N068N224N612O683P713P526
$$ 566395 566994 567621 568164 569476 572593 577306 582392 587173 591956 597024 602248 607860 614543 622256 629782
58732F29782O230N099M843M987M970M867M844M700M274L783L518L482L532L578
$$ 629782 636012 641111 645954 650941 655911 660778 665622 670322 674596 678379 681897 685379 688911 692489
58718F92489L686M033M690N290N132L938K242P83l24j508l123n148p356r432j1061
$$ 692489 696175 700208 704898 710188 715320 719258 721500 722283 721959 720451 717328 712180 704824 695392 684331
58703F84331j2096j2613j2757j2741j2938j3570j4283j4415j3751j2551j0909
$$ 684331 672235 659622 646865 634124 621186 607616 593333 578918 565167 552616 541707
58692E41707q827o896n990n973n648m467l387l398m014m040l144j888p78j17j96
$$ 541707 532880 525984 519994 514021 508373 503906 500519 497121 493107 489067 485923 484035 483257 483140 482944
58677D82944p15n42R41K698L329L180L899N977P990Q619Q368Q640R836J0932J0665
$$ 482944 482229 481687 482628 485326 488655 491835 495734 501711 509701 518320 526688 535328 545164 556096 566761
58662E66761Q654N483K044j089l694n513o234n992n481n285n325n263n078m889
$$ 566761 575415 580898 582942 581853 578159 572646 566412 560420 554939 549654 544329 539066 533988 529099
58648E29099m549l914l229k843k694k458j967j231k76O19R55N83K8j74j06j45
$$ 529099 524550 520636 517407 514564 511870 509412 507445 506214 505938 506557 507512 508095 508123 507949 507843 507698
58632E07698m09q79j598k306k398j765j195j297j535r92K48J256J501J318J327
$$ 507698 507289 506410 504812 502506 500108 498343 497148 495851 494316 493324 493572 494828 496329 497647 498974
58617D98974J965L300M778N419M839L728K840K062J146O74J284K349K563J691
$$ 498974 500939 504239 509017 514436 519275 523003 525843 527905 529051 529725 531009 533358 535921 537612
58603E37612O75J48j60m70m74o3L45M91O22R60J361J745K290L029L744M378N201
$$ 537612 538287 538435 538275 537805 537331 537268 537613 538104 538726 539686 541047 542792 545082 548111 551855 556233 561434
58586E61434O390P749Q874R417R284Q805Q420Q060P258O161N693O240O957P166
$$ 561434 567824 575573 584447 593864 603148 611953 620373 628433 635691 641852 647545 653785 660742 667908
58572F67908P631R377J1876J3733J4820J6267J8428K0291K1062K1089K0873K0202
$$ 667908 675539 684916 696792 710525 725345 741612 760040 780331 801393 822482 843355 863557
58560H63557J8698J6327J3092R040M854J596l84j629k600l335m023m869n314m608
$$ 863557 882255 898582 911674 920714 925568 927164 926780 925151 922551 919216 915193 910324 905010 900402
58546I00402l497l966o697r911j1620j2055j2819j4407j5795j6113j5630j5035
$$ 900402 896905 892939 886242 876331 864711 852656 839837 825430 809635 793522 777892 762857
58534G62857j4485j3672j2315j0499q663p312o569o109n569m876m143l559l391
$$ 762857 748372 734700 722385 711886 703223 695911 689342 683233 677664 672788 668645 665086 661695
58521F61695l787m456m763m385l621l050k977l260l442l123k356j582j047n76
$$ 661695 657908 653452 648689 644304 640683 637633 634656 631396 627954 624831 622475 620893 619846 619270
58507F19270j47j75q31j459j316n51J53O21J130J569J562J251J260J821K729L965
$$ 619270 619123 618948 618117 616658 615342 614791 614944 615565 616695 618264 619826 621077 622337 624158 626887 630852
58491F30852N541O839P129O783P057Q399R853J0400J0130R770R793J0312J1094
$$ 630852 636393 643232 650361 657144 664201 672600 682453 692853 702983 712753 722546 732858 743952
58478G43952J1379J0274P754M788K245J86j633l126m044m335m088l480k824k292
$$ 743952 755331 765605 773359 778147 780392 780578 778945 775819 771775 767440 763352 759872 757048 754756
58464G54756j634o01M54J006J216J738K730L806M869O111P174P183N863L894J968
$$ 754756 753122 752521 752975 753981 755197 756935 759665 763471 768340 774451 781625 788808 794671 798565 800533
58449H00533J37j669l212m268m835m927m578m123l905l700l041k038j226p22j77
$$ 800533 800670 799001 795789 791521 786686 781759 777181 773058 769153 765453 762412 760374 759148 758426 758249
58434G58249N20J236K067L119L950M087L949M333N151N561N226M454L320J705
$$ 758249 758769 760005 762072 765191 769141 773228 777177 781510 786661 792222 797448 801902 805222 806927
58420H06927P7r29j545k383l129l033k552k915m051m559m004l573m007m416l795
$$ 806927 807004 806075 804530 802147 799018 795985 793433 790518 786467 781908 777904 774331 770324 765908 762113
58405G62113k371p86P99K173K761K526K161K033J952K286L825O101P272O432M741
$$ 762113 759742 758956 759755 761928 764689 767215 769376 771409 773361 775647 779472 785573 792845 799277 804018
58390H04018L614L078K672K648L232L874M094M213M466M462M147M229M817M838
$$ 804018 807632 810710 813382 816030 819262 823136 827230 831443 835909 840371 844518 848747 853564 858402
58376H58402L752K720L079M552N928O717P233P715Q263R029R804J0022R623R225
$$ 858402 862154 864874 867953 872505 878433 885150 892383 900098 908361 917390 927194 937216 946839 956064
58362I56064R113Q882Q412Q113P938P297O287N714N544M774L316K469K918L786
$$ 956064 965177 974059 982471 990584 998522 1005819 1012106 1017820 1023364 1028138 1031454 1033923 1036841 1040627
58348A040627M351N112O325P140P156P358Q485R917J1076J2368J3719J3942J2770
$$ 1040627 1044978 1050090 1056415 1063555 1070711 1078069 1086554 1096471 1107547 1119915 1133634 1147576 1160346
58335A160346J1890J2524J3547J3347J2103J0773R328P575O285N886N315L848
$$ 1160346 1172236 1184760 1198307 1211654 1223757 1234530 1243858 1251433 1257718 1263604 1268919 1272767
58323A272767K766L504N317O546P056P658Q212Q222Q427R842J1843J2939J2962
$$ 1272767 1275533 1279037 1284354 1290900 1297956 1305614 1313826 1322048 1330475 1340317 1352160 1365099 1378061
58310A378061J2969J3498J4271J5112J5940J6430J6654J7218J8004J7872J6645
$$ 1378061 1391030 1404528 1418799 1433911 1449851 1466281 1482935 1500153 1518157 1536029 1552674
58299A552674J5891J6614J7665J7761J7610J8359J9450J9761J9586J9798K0228
$$ 1552674 1568565 1585179 1602844 1620605 1638215 1656574 1676024 1695785 1715371 1735169 1755397
58288A755397K0560K1447K3108K4243K4104K4230K6167K8898L0615L1628L3364
$$ 1755397 1775957 1797404 1820512 1844755 1868859 1893089 1919256 1948154 1978769 2010397 2043761
58277B043761L5662L7399L8710M0376M1960M2638M3024M4142M5561M6402M7196
$$ 2043761 2079423 2116822 2155532 2195908 2237868 2280506 2323530 2367672 2413233 2459635 2506831
58266B506831M8868N0968N2675N4340N6188N6974N5995N4932N5667N7537N8876
$$ 2506831 2555699 2606667 2659342 2713682 2769870 2826844 2882839 2937771 2993438 3050975 3109851
58255C109851N9796O1388O3682O6447P0408P5538P9995Q2886Q6178R1558R7583
$$ 3109851 3169647 3231035 3294717 3361164 3431572 3507110 3587105 3669991 3756169 3847727 3945310
58244C945310J02419J07121J13325J19981J25398J30503J37057J44650J52391
$$ 3945310 4047729 4154850 4268175 4388156 4513554 4644057 4781114 4925764 5078155
58235E078155J61266J71830J82155J91204K01497K15067K29765K43253K57526
$$ 5078155 5239421 5411251 5593406 5784610 5986107 6201174 6430939 6674192 6931718
58226F931718K75413K95763L16477L39100L65795L95084M25410M59588N00646
$$ 6931718 7207131 7502894 7819371 8158471 8524266 8919350 9344760 9804348 10304994
58217A0304994N46944N96728O53645P21848P99858Q85843R84955J104657J247155
$$ 10304994 10851938 11448666 12102311 12824159 13624017 14509860 15494815 16599472 17846627
58208A7846627J414132J614945J862830K168079K544103L016035L613126M352320
$$ 17846627 19260759 20875704 22738534 24906613 27450716 30466751 34079877 38432197
58200C8432197N231003O227337P305259Q439425R654906J1033956J2666119J4592507
$$ 38432197 43663200 49890537 57195796 65635221 75290127 86324083 98990202 113582709
58192A13582709J6799542J9248353K1908529K4788867K7885663L0903712L2850919
$$ 113582709 130382251 149630604 171539133 196328000 224213663 255117375 287968294
58185B87968294L2033711K6895587J7283352M994544p074102j6527144k2488239
$$ 287968294 320002005 346897592 364180944 369175488 362101386 345574242 323086003
58178C23086003k5420559k6295318k5956540k4951740k3585681k1988784k0199325
$$ 323086003 297665444 271370126 245413586 220461846 196876165 174887381 154688056
58171A54688056j8261166j6264196j4309897j2472583j0798027r311319q014503
$$ 154688056 136426890 120162694 105852797 93380214 82582187 73270868 65256365
58164F5256365o892727n931552n120900m444209l877815l403169l009329k683070
$$ 65256365 58363638 52432086 47311186 42866977 38989162 35585993 32576664 29893594
58156B9893594k407132k169253j964083j785761j626787j484188j358760j247849
$$ 29893594 27486462 25317209 23353126 21567365 19940578 18456390 17097630 15849781
58148A5849781j145781j050996r65761q89129q16958p48429o86017o29187n74550
$$ 15849781 14704000 13653004 12687243 11798114 10981156 10232727 9546710 8917523 8342973
58139H342973n22296m76353m37873m04013l73301l46858l24088l02243k80730
$$ 8342973 7820677 7344324 6906451 6502438 6129137 5782279 5458191 5155948 4875218
58130D875218k61375k44183k27096k09954j94566j80869j67092j53580j42457
$$ 4875218 4613843 4369660 4142564 3932610 3738044 3557175 3390083 3236503 3094046
58121C094046j33555j24517j14919j06605j00024r3800q7792q3101p9181p4365
$$ 3094046 2960491 2835974 2721055 2614450 2514426 2420626 2332834 2249733 2170552 2096187
58111B096187o9019o4907o1897n8496n5147n3491n2843n0939m7817m5367m3463
$$ 2096187 2027168 1962261 1900364 1841868 1786721 1733230 1680387 1629448 1581631 1536264 1492801
58100A492801m0336l6520l4504l4299l3171l0189k7387k5896k4375k2077k0166
$$ 1492801 1452465 1415945 1381441 1347142 1313971 1283782 1256395 1230499 1206124 1184047 1163881
58089A163881j9178j8122j6864j6615j7350j7470j6693j6585j7611j8307j8055
$$ 1163881 1144703 1126581 1109717 1093102 1075752 1058282 1041589 1025004 1007393 989086 971031
58078I71031j8052j8748j8932j8182j7751j8125j8004j6669j5191j4496j4139
$$ 971031 952979 934231 915299 897117 879366 861241 843237 826568 811377 796881 782742
58067G82742j3665j3272j2548j0674q434p823q982r674q560o933o341o545o809
$$ 782742 769077 755805 743257 732583 724149 716326 707344 697670 689110 682177 675836 669291 662482
58054F62482p274p980q184p683p319p382p047o146n823o595p326p031o253n724
$$ 662482 655208 647228 639044 631361 624042 616660 609613 603467 597644 591049 583723 576692 570439 564715
58040E64715n172m384m074m628n155m840m168l947m005l846l709m150n096o018
$$ 564715 559543 555159 551085 546457 541302 536462 532294 528347 524342 520496 516787 512637 507541 501523
58026E01523o519o336n382m072l084k594k327k275k660l271l628l718l736l377
$$ 501523 495004 488668 483286 479214 476130 473536 471209 468934 466274 463003 459375 455657 451921 448544
58012D48544k341j256r95j354j449j113p03j8J171J982J421K01r4N68Q86O11O95
$$ 448544 446203 444947 443952 442598 441149 440036 439333 439315 440486 442468 443889 444090 443996 444564 445450 446061 446756
57995D46756J116O99n60j179o93n11j488k594k756k396k225k016j538j316j605
$$ 446756 447872 448571 448011 446832 446139 445628 444140 441546 438790 436394 434169 432153 430615 429299 427694
57980D27694j793j597j634k177k537k307k045k131k106j690j284j008n64l84j367
$$ 427694 425901 424304 422670 420493 417956 415649 413604 411473 409367 407677 406393 405385 404821 404437 403070
57965D03070l003l434k121p66p60j330j326j151j567j989j493m62J24K18L17L54
$$ 403070 400067 396633 394512 393746 392986 391656 390330 389179 387612 385623 384130 383668 383792 384010 384327 384681
57949C84681J87L91J377K402K553K166K229K970M004N243O683P715P655O681N532
$$ 384681 384868 385259 386636 389038 391591 393757 395986 398956 402960 408203 414886 422601 430256 436937 442469
57934D42469M632M058L857L830L474K640J670N86j103l351n249o270o935p652
$$ 442469 447101 451159 455016 458846 462320 464960 466630 467216 466113 462762 457513 451243 444308 436656
57920D36656p875p238o516o505o724o253n216m420m109l951l821l716l352k603
$$ 436656 428781 421543 415027 408522 401798 395545 390329 385909 381800 377849 374028 370312 366960 364357
57906C64357k000k054k460k544k092j314m61O0j86q94j085m20K98M68O33J336
$$ 364357 362357 360303 357843 355299 353207 351893 351432 351492 351306 350412 349327 348907 349205 349673 350306 351642
57890C51642J932J523M01l59k92L17J096J587J172r5j048o88M02P83o5j398k281
$$ 351642 353574 355097 355498 355139 354847 355164 356260 357847 359019 358924 357876 357188 357590 358373 358308 356910 354629
57873C54629k235j207K87J195Q87l3l53M20J789K973L486L371L258L812M862N593
$$ 354629 352394 351187 351474 352669 353556 353523 353170 353590 355379 358352 361838 365209 368467 372279 377141 382734
57857C82734N800O201P144P841P556O670N945N417M803M255M013L862L703L965
$$ 382734 388534 394735 401879 409720 417276 423946 429891 435308 440111 444366 448379 452241 455944 459909
57843D59909M714N010M117K704J971K121K522K860L237L584L827M206M708M700
$$ 459909 464623 469633 473750 476454 478425 480546 483068 485928 489165 492749 496576 500782 505490 510190
57829E10190L879K969K655K506J826Q85K61l74j571k759k903k221j911k348k657
$$ 510190 514069 517038 519693 522199 524025 524910 525171 524797 523226 520467 517564 515343 513432 511084 508427
57814E08427k179j282p08r20k031l640m889n338n464n656n349m033k494j847j833
$$ 508427 506248 504966 504258 503338 501307 497667 492778 487440 481976 476320 470971 466938 464444 462597 460764
57799D60764j372m47L5M6N78J888L022L393L554M021M473M586M666M971N204N139
$$ 460764 459392 458945 458980 459026 459604 461492 464514 467907 471461 475482 479955 484541 489207 494178 499382 504521
57783E04521N037N089N034M686M238L832L366K837K369J789P72n46j666k426l100
$$ 504521 509558 514647 519681 524367 528605 532437 535803 538640 541009 542798 543570 543024 541358 538932 535832
57768E35832l804m424n030n710o111n856n268m961m865m486l962l923m359m540
$$ 535832 532028 527604 522574 516864 510753 504897 499629 494668 489803 485317 481355 477432 473073 468533
57754D68533m128l414k531j378l40m1k79j84M58J039J362J892K590K650J817Q39
$$ 468533 464405 460991 458460 457082 456742 456701 456422 456238 456696 457735 459097 460989 463579 466229 468046 468885
57738D68885K66j33l57K20J614K696K682K247K436L200L861M217M414M325L862
$$ 468885 469151 469018 468661 468881 470495 473191 475873 478120 480556 483756 487617 491834 496248 500573 504435
57723E04435L423L349L403L313L280L409L264K652K195K451L034L337L538M055
$$ 504435 507858 511207 514610 517923 521203 524612 527876 530528 532723 535174 538208 541545 545083 549138
57709E49138M547M379L731L272L048K575J821J265J026Q26P43J136J763J809J020
$$ 549138 553685 558064 561795 565067 568115 570690 572511 573776 574802 575628 576371 577507 579270 581079 582099
57694E82099J33j15J24K03r6m24l33K48R74J400J497J737K567L853N162O419P972
$$ 582099 582232 582117 582241 582444 582348 581924 581591 581839 582813 584213 585710 587447 590014 593867 599029 605448 613420
57677F13420J0042J2434J4876J7363K0069K3101K6429K9957L3725L8086M3386
$$ 613420 623462 635896 650772 668135 688204 711305 737734 767691 801416 839502 882888
57666H82888M9012N2756N1616M3687K9511J1838n728k0126k9625l4047l4450l2486
$$ 882888 931900 984656 1036272 1079959 1109470 1121308 1115580 1095454 1065829 1031782 997332 964846
57654I64846k9685k7032k4939k3399k2080k0453j8177j5540j3294j1877j0916
$$ 964846 935161 908129 883190 859791 837711 817258 799081 783541 770247 758370 747454
57643G47454r764q375p280o766o410n596m198k729j895j985k486k447j552o56
$$ 747454 737690 729315 722035 715269 708859 703263 699065 696336 694441 692456 689970 687523 685971 685315
57629F85315p88j695k032j131J43N98J98k02j96j68m67q39q56n08j40l0j58l00
$$ 685315 684527 682832 680800 679669 679812 680410 680608 680406 680210 680042 679575 678736 677880 677372 677232 677202 677044 676744
57611F76744k23J99R56J917K833L428L579L385L013K531J977J442R46M29%L0O77
$$ 676744 676521 676720 677676 679593 682426 685854 689433 692818 695831 698362 700339 701781 702727 703156 703156 703186 703863
57594G03863J546K108K322K409K301J812J229J089J407J684J780K033K393K233
$$ 703863 705409 707517 709839 712248 714549 716361 717590 718679 720086 721770 723550 725583 727976 730209
57580G30209J344M85M13Q84J187J183J260J547J854K132K435K570K308J950K100
$$ 730209 731553 732038 732451 733335 734522 735705 736965 738512 740366 742498 744933 747503 749811 751761 753861
57565G53861K814L403L288K705K395K737L428L918M050M091M224M200L746L128
$$ 753861 756675 760078 763366 766071 768466 771203 774631 778549 782599 786690 790914 795114 798860 801988
57551H01988K933L345M020M670N352N989O184N755N110M780M910N435O352P416
$$ 801988 804921 808266 812286 816956 822308 828297 834481 840236 845346 850126 855036 860471 866823 874239
57537H74239P967P504O273N004M274M323N095N968N990M918L735L549M192M649
$$ 874239 882206 889710 895983 900987 905261 909584 914679 920647 926637 931555 935290 938839 943031 947680
57523I47680M634M891N881O991P382O961O217N540N114N085N435N874O122O212
$$ 947680 952314 957205 963086 970077 977459 984420 990637 996177 1001291 1006376 1011811 1017685 1023807 1030019
57509A030019O325O510O692O815O833O728O610O596O530O136N531N251N501N785
$$ 1030019 1036344 1042854 1049546 1056361 1063194 1069922 1076532 1083128 1089658 1095794 1101325 1106576 1112077 1117862
57495A117862N577N079M922N283N798O209O556O742O473N829N351N280N171M681
$$ 1117862 1123439 1128518 1133440 1138723 1144521 1150730 1157286 1164028 1170501 1176330 1181681 1186961 1192132 1196813
57481A196813M326M835O030P020P409P612P881P829P288O862P089P588P757P835
$$ 1196813 1201139 1205974 1212004 1219024 1226433 1234045 1241926 1249755 1257043 1263905 1270994 1278582 1286339 1294174
57467A294174Q407R150R073Q068P267P530Q437R154R557R884R897R254Q389Q197
$$ 1294174 1302581 1311731 1320804 1328872 1336139 1343669 1352106 1361260 1370817 1380701 1390598 1399852 1408241 1416438
57453A416438Q836R520R565R134Q765Q678Q784R013R283R398R283R231R614J0340
$$ 1416438 1425274 1434794 1444359 1453493 1462258 1470936 1479720 1488733 1498016 1507414 1516697 1525928 1535542 1545882
57439A545882J0861J0827J0545J0591J1069J1453J1283J0765J0468J0598J0804
$$ 1545882 1556743 1567570 1578115 1588706 1599775 1611228 1622511 1633276 1643744 1654342 1665146
57428A665146J0746J0516J0445J0694J1090J1267J0898J0041R286R263R926J0542
$$ 1665146 1675892 1686408 1696853 1707547 1718637 1729904 1740802 1750843 1760129 1769392 1779318 1789860
57416A789860J0596J0452J0869J2001J3184J3691J3472J3084J2992J3064J2863
$$ 1789860 1800456 1810908 1821777 1833778 1846962 1860653 1874125 1887209 1900201 1913265 1926128
57405A926128J2349J2091J2547J3356J3765J3616J3445J3552J3614J3395J3294
$$ 1926128 1938477 1950568 1963115 1976471 1990236 2003852 2017297 2030849 2044463 2057858 2071152
57394B071152J3701J4288J4554J4626J4951J5343J5161J4354J3618J3408J3483
$$ 2071152 2084853 2099141 2113695 2128321 2143272 2158615 2173776 2188130 2201748 2215156 2228639
57383B228639J3618J4062J4850J5354J5175J5016J5866J7413J8197J7431J5992
$$ 2228639 2242257 2256319 2271169 2286523 2301698 2316714 2332580 2349993 2368190 2385621 2401613
57372B401613J5205J5267J5402J5198J5074J5475J6237J6877J7206J7349J7510
$$ 2401613 2416818 2432085 2447487 2462685 2477759 2493234 2509471 2526348 2543554 2560903 2578413
57361B578413J7788J8110J8249J8142J8148J8745J9844K0818K1296K1492K1628
$$ 2578413 2596201 2614311 2632560 2650702 2668850 2687595 2707439 2728257 2749553 2771045 2792673
57350B792673K1491K0953K0417K0284K0320K0088J9657J9340J9064J8658J8550
$$ 2792673 2814164 2835117 2855534 2875818 2896138 2916226 2935883 2955223 2974287 2992945 3011495
57339C011495J9281K0465K1098K1009K1106K1949K2856K2899K2112K1220K0719
$$ 3011495 3030776 3051241 3072339 3093348 3114454 3136403 3159259 3182158 3204270 3225490 3246209
57328C246209K0644K0803K0823K0376J9685J9438J9855K0388K0680K1194K2324
$$ 3246209 3266853 3287656 3308479 3328855 3348540 3367978 3387833 3408221 3428901 3450095 3472419
57317C472419K3457K3787K3511K3448K3696K3662K3273K3166K3559K3824K3529
$$ 3472419 3495876 3519663 3543174 3566622 3590318 3613980 3637253 3660419 3683978 3707802 3731331
57306C731331K3175K3443K4264K5013K5304K5124K4557K3819K3387K3619K4225
$$ 3731331 3754506 3777949 3802213 3827226 3852530 3877654 3902211 3926030 3949417 3973036 3997261
57295C997261K4438K3847K2910K2564K3265K4483K5204K5061K4762K5238K6432
$$ 3997261 4021699 4045546 4068456 4091020 4114285 4138768 4163972 4189033 4213795 4239033 4265465
57284D265465K7284K6959K5762K4692K4350K4508K4531K3994K2911K1672K0795
$$ 4265465 4292749 4319708 4345470 4370162 4394512 4419020 4443551 4467545 4490456 4512128 4532923
57273D532923K0533K0716K1054K1593K2598K3914K4795K4710K4160K4112K4650
$$ 4532923 4553456 4574172 4595226 4616819 4639417 4663331 4688126 4712836 4736996 4761108 4785758
57262D785758K4757K3807K2656K2669K3899K5047K5153K4586K4166K4041K3856
$$ 4785758 4810515 4834322 4856978 4879647 4903546 4928593 4953746 4978332 5002498 5026539 5050395
57251E050395K3473K3007K2441K1750K1210K1096K1282K1423K1374K1108K0438
$$ 5050395 5073868 5096875 5119316 5141066 5162276 5183372 5204654 5226077 5247451 5268559 5288997
57240E288997J9353J8412J8299J8964J9718K0115K0300K0438K0357J9967J9554
$$ 5288997 5308350 5326762 5345061 5364025 5383743 5403858 5424158 5444596 5464953 5484920 5504474
57229E504474J9365J9272J9084J8889J8730J8220J6996J5473J4669J5083J6072
$$ 5504474 5523839 5543111 5562195 5581084 5599814 5618034 5635030 5650503 5665172 5680255 5696327
57218E696327J6520J5991J5029J4507J4874J5854J6646J6523J5525J4570J4496
$$ 5696327 5712847 5728838 5743867 5758374 5773248 5789102 5805748 5822271 5837796 5852366 5866862
57207E866862J5051J5287J5031J5315J6941J9245K0960K1886K2792K3865K4309
$$ 5866862 5881913 5897200 5912231 5927546 5944487 5963732 5984692 6006578 6029370 6053235 6077544
57196F077544K3731K2896K2665K2826K2503K1263J9258J6852J4564J3028J2313
$$ 6077544 6101275 6124171 6146836 6169662 6192165 6213428 6232686 6249538 6264102 6277130 6289443
57185F289443J1671J0481R083Q095P349O320N290N117N910O851P387P745Q413
$$ 6289443 6301114 6311595 6320678 6328773 6336122 6342442 6347732 6352849 6358759 6365610 6372997 6380742 6389155
57172F389155J0526J6863L0368M9758O7511P4312O6382M7905K6575P899o438j6877
$$ 6389155 6399681 6416544 6446912 6496670 6564181 6638493 6704875 6752780 6779355 6787254 6780816 6763939
57160F763939k4448l0262l5024l8737m1322m3369m5680m8284n0709n3020n5753
$$ 6763939 6739491 6709229 6674205 6635468 6594146 6550777 6505097 6456813 6406104 6353084 6297331
57149F297331n8836o1397o2911o3739o4283o4391o4000o3585o3432o3056o1959
$$ 6297331 6238495 6177098 6114187 6050448 5986165 5921774 5857774 5794189 5730757 5667701 5605742
57138E605742o0457n9131n7940n6528n5058n4037n3541n3189n2757n2279n1744
$$ 5605742 5545285 5486154 5428214 5371686 5316628 5262591 5209050 5155861 5103104 5050825 4999081
57127D999081n1078n0270m9259m8035m7017m6817m7264m7370m6702m6024m6069
$$ 4999081 4948003 4897733 4848474 4800439 4753422 4706605 4659341 4611971 4565269 4519245 4473176
57116D473176m6409m6183m5014m2442l7346k9058j8298o063P747K3945M3445O8003
$$ 4473176 4426767 4380584 4335570 4293128 4255782 4226724 4208426 4202363 4210110 4234055 4277500 4345503
57104D345503J00365J42683J96281K64231L52277M65430O05135P70713R60153
$$ 4345503 4445868 4588551 4784832 5049063 5401340 5866770 6471905 7242618 8202771
57095H202771J166624J377265J579200J764782J929190K068100K180257K260952
$$ 8202771 9369395 10746660 12325860 14090642 16019832 18087932 20268189 22529141
57087B2529141K283383K204180K020616J826016J768335J913502K151267K263353
$$ 22529141 24812524 27016704 29037320 30863336 32631671 34545173 36696440 38959793
57079C8959793K096658J667057J108181N49858N3067l72463p29707j021960j259311
$$ 38959793 41056451 42723508 43831689 44381547 44434614 44062151 43332444 42310484 41051173
57070D1051173j461219j649294j835531k012948k156990k239867k246281k177659
$$ 41051173 39589954 37940660 36105129 34092181 31935191 29695324 27449043 25271384
57062B5271384k046717j872354j676466j478284j288982j113150r54664q18290
$$ 25271384 23224667 21352313 19675847 18197563 16908581 15795431 14840767 14022477
57054A4022477p06485o18330n51950n05135m73411m50613m32637m18814m09154
$$ 14022477 13315992 12697662 12145712 11640577 11167166 10716553 10283916 9865102 9455948
57045I455948m02133l95729l88754l80484l70466l59326l48524l38694l28973
$$ 9455948 9053815 8658086 8269332 7888848 7518382 7159056 6810532 6471838 6142865
57036F142865l17975l04392k86948k65372k41694k19213j99764j82801j66992
$$ 6142865 5824890 5520498 5233550 4968178 4726484 4507271 4307507 4124706 3957714
57027C957714j51342j34959j17674j01912r2684r4244j06491j24454j40928j50215
$$ 3957714 3806372 3671413 3553739 3451827 3359143 3264899 3158408 3033954 2893026 2742811
57017B742811j50855j45571j38256j30921j23593j16224j09294j02798r6119q9134
$$ 2742811 2591956 2446385 2308129 2177208 2053615 1937391 1828097 1725299 1629180 1540046
57007A540046q2312p5523o7970n9729n2183m6422m1995l7861l3730k9965k6778
$$ 1540046 1457734 1382211 1314241 1254512 1202329 1155907 1113912 1076051 1042321 1012356 985578
56996I85578k4139k1959j9915j7492j4588j1693r223p107n219l664k331p13J408
$$ 985578 961439 939480 919565 902073 887485 875792 866569 859462 854243 850579 848248 847535 848943
56983H48943L421M363L623J040l252q599j3732j7346j8908j8793j7780j6439j4940
$$ 848943 852364 856727 860350 861390 858138 849539 835807 818461 799553 780760 762980 746541 731601
56970G31601j3278j1532r782p890n705l469j596R0K302N227Q175J0698J3353J6442
$$ 731601 718323 706791 697009 689119 683414 679945 678349 678439 680741 685968 694143 704841 718194 734636
56956G34636J8558J7442J2324M581l735j1204j6901k0129k0884k0034j8600j7018
$$ 734636 753194 770636 782960 787541 783806 772602 755701 735572 714688 694654 676054 659036
56944F59036j5248j3194j0862q345n795l298p70J902M663P447J0319J3370J6650
$$ 659036 643788 630594 619732 611387 605592 602294 601524 603426 608089 615536 625855 639225 655875
56931F55875K0202K3490K4680K1372J2897J474r541j8117k3869k6871k7397k6457
$$ 655875 676077 699567 724247 745619 758516 759990 750449 732332 708463 681592 654195 627738
56919F27738k5300k4287k3060k1610k0266j8770j6478j3583j1154r810r152q560
$$ 627738 602438 578151 555091 533481 513215 494445 477967 464384 453230 443420 434268 425708
56907D25708p797o774n593m811m754m620l264r61P22J044R31J331J912K027K033
$$ 425708 417911 411137 405544 400733 395979 391359 388095 387134 387856 388900 389831 391162 393074 395101 397134
56892C97134K702M020N419O814Q680J1209J3801J5312J4698J1746P373K848j245
$$ 397134 399836 403856 409275 416089 424769 435978 449779 465091 479789 491535 498908 501756 500511
56879E00511m922p842r276r070p906o341m415k315n52R01K800N475Q262J0589
$$ 500511 495589 487747 478471 469401 461495 455154 450739 448424 447872 448773 451573 457048 465310 475899
56865D75899J2901J5869J9374K2960K6625L0403L3499L4500L2183K5817J5411
$$ 475899 488800 504669 524043 547003 573628 604031 637530 672030 704213 730030 745441
56854G45441K561r429j7410k0631k0743j9733j8290j6050j2717q709m875j651
$$ 745441 748002 738573 721163 700532 679789 660056 641766 625716 612999 604290 599415 597764
56842E97764J568N933J1823J8266K4040K9104L4563M1357M9120N6037N9384N6413
$$ 597764 599332 605265 617088 635354 659394 688498 723061 764418 813538 869575 928959 985372
56830I85372M5580K7686O073j4598l0457m0054m4219m4473m1880l7461l2820k9313
$$ 985372 1030952 1058638 1064711 1050113 1019656 979602 935383 890910 849030 811569 778749 749436
56818G49436k6654k3274j8224j2062n793K72O325J2497J8878K5472L1705L6355
$$ 749436 722782 699508 681284 669222 663429 663701 670026 682523 701401 726873 758578 794933
56806G94933L8173L6102K9053J6573L88j5650k8053l5815l9727m0508l8549l4954
$$ 794933 833106 869208 898261 914834 915222 899572 871519 835704 795977 755469 716920 681966
56794F81966l1416k8794k6508k3562j9658j5225j0787o577k564J386N358R360
$$ 681966 650550 621756 595248 571686 552028 536803 526016 519439 516875 518261 523619 532979
56782E32979J3258J6518J8129J7130J3265O926j243j0158j7908k2621k4117k4028
$$ 532979 546237 562755 580884 598014 611279 618205 616962 606804 588896 566275 542158 518130
56770E18130k3864k3548k2286k0135j8013j6493j5358j4197j2849j1275r421p417
$$ 518130 494266 470718 448432 428297 410284 393791 378433 364236 351387 340112 330691 323274
56758C23274n682m744m796n310n355m693m216m696n408m928l232j886j937k736
$$ 323274 317592 312848 308052 302742 297387 292694 288478 283782 278374 273446 270214 268328 266391 263655
56744B63655l226l256l007k264j127n40j090j968k092j619j412j577j597j370
$$ 263655 260429 257173 254166 251902 250775 250235 249145 247177 245085 243466 242054 240477 238880 237510
56730B37510j176r30m68j83m19n68J03J089J260O56M28R93J482J247Q62J166K136
$$ 237510 236334 235404 234936 234753 234334 233766 233869 234958 236218 236874 237302 238295 239777 241024 241886 243052 245188
56713B45188L115L556L260K447J809J939K563K865K651K535K797K871K236J184
$$ 245188 248303 251859 255119 257566 259375 261314 263877 266742 269393 271928 274725 277596 279832 281016
56699B81016K95l45r30j350j367j104r86j186j508j685j667j525j252p55j53J11
$$ 281016 281311 280966 280036 278686 277319 276215 275229 274043 272535 270850 269183 267658 266406 265651 265498 265609
56683B65609k55q26q64l72j83p11j232r69l84n50j569k431k360j558n90J74L93
$$ 265609 265354 264528 263664 263292 263109 262398 261166 260197 259813 259263 257694 255263 252903 251345 250755 250929 251322
56666B51322j86j196j754j399n71O7L75N38N76M07J84K07N33Q99J029R45R01J046
$$ 251322 251136 249940 248186 246787 246216 246283 246658 247196 247772 248179 248363 248570 249103 250002 251031 251976 252877 253923
56648B53923J234J303J388J727K155K214J836J517J617J875J866J490Q23m1p66
$$ 253923 255157 256460 257848 259575 261730 263944 265780 267297 268914 270789 272655 274145 274968 274927 274161
56633B74161r07o44q05j698k514k445j882j756k196k620k795k969l121k861k014
$$ 274161 273254 272610 271805 270107 267593 265148 263266 261510 259314 256694 253899 250930 247809 244948 242934
56618B42934q14L11P75R2j255j811q20O26J018N10L66P52N89l99j017m43N11O85
$$ 242934 242120 242431 243206 243298 242043 240232 239412 240038 241056 241566 241932 242684 243273 242874 241857 241414 241925 242610
56600B42610J21l72m99n48o20m77K2O76J086R63M40R4K97O92O91L00J1J8J81N24
$$ 242610 242731 242359 241860 241312 240692 240215 240237 240913 241999 242962 243402 243496 243793 244485 245176 245476 245487 245505 245686 246210
56580B46210J097J482J189M71n5m36j085j623j148J88J061Q38M37Q03J574K004
$$ 246210 247307 248789 249978 250449 250394 249958 248873 247250 246102 246290 247351 248189 248626 249429 251003 253007
56564B53007K255K885L649L794L263K799K915L345L555L378L101L051L088K601
$$ 253007 255262 258147 261796 265590 268853 271652 274567 277912 281467 284845 287946 290997 294085 296686
56550B96686J301j28o58j35O04Q49O13J14o41j448j779j450r28p14q26j040j201
$$ 296686 297987 297859 297201 297066 297670 298519 299132 299246 298605 297157 295378 293928 293000 292286 291460 290420 289219
56533B89219j116o77k22l03r25j534j867k113k203j690o20K48M29K63J84K11M37
$$ 289219 288103 287426 287204 286901 285976 284442 282575 280462 278259 276569 275949 276197 276626 276889 277073 277284 277721
56516B77721J147J977J774N0k089l135k823j975j231p19n68r00j374j382p78p3
$$ 277721 278868 280845 282619 282669 280580 277445 274622 272647 271416 270697 270129 269229 267855 266473 265695 265622
56500B65622J18m16j314j849j481m00O90J302J409J087M36j22j46J06k1m72m45
$$ 265622 265740 265324 264010 262161 260680 260280 260970 262272 263681 264768 265204 265082 264936 265042 265021 264549 264104
56483B64104K81Q60O75K20J81L75L07J07J96M06K35l63j016j461j558j108j60
$$ 264104 264385 265245 265920 266140 266321 266696 267003 267110 267306 267712 267947 267584 266568 265107 263549 262441 262281
56466B62281P51J193J292J312J148O51N2m12q30j179j001r3R01J144O34M0k31
$$ 262281 263032 264225 265517 266829 267977 268628 268680 268268 267438 266259 265258 265165 266066 267210 267844 267884 267653
56449B67653l68o52j032j131n74N26J435J561J269J334J665J470P28M05Q31J004
$$ 267653 267285 266633 265601 264470 263896 264422 265857 267418 268687 270021 271686 273156 273884 274289 275120 276124
56433B76124K03p89r87p34r15j334j099j80N79Q06R21J173J248R24M92M12Q92
$$ 276124 276327 275538 274551 273817 272902 271568 270469 270289 270868 271674 272595 273768 275016 275940 276432 276844 277736
56416B77736J718K245J913J019M73N39M28l42j034p82J08Q24J282J817K163J857
$$ 277736 279454 281699 283612 284631 285104 285643 286071 285729 284695 283913 284021 284845 286127 287944 290107 291964
56400B91964J238J031J221J295J247J343J155O4j428k016j339l81N8K89P81J249
$$ 291964 293202 294233 295454 296749 297996 299339 300494 300558 299130 297114 295775 295394 295452 295741 296522 297771
56384B97771J219Q89Q64J280J608J287L39n72p55j43P74J579K130K252J850J368
$$ 297771 298990 299879 300743 302023 303631 304918 305257 304685 303930 303787 304561 306140 308270 310522 312372 313740
56368C13740J401J599R46m70j007L31K236K753J903J352J878K500K136R44j64
$$ 313740 315141 316740 317686 317216 316209 316540 318776 321529 323432 324784 326662 329162 331298 332242 332078
56353C32078n60k08M19P02N09L41N04N93L32K54Q36J453J200L35r3J80M45L11
$$ 332078 331518 331310 331729 332431 332940 333281 333785 334378 334710 334964 335800 337253 338453 338788 338695 338875 339320 339631
56335C39631K07O02J467K504L309L419K796K015J540J207R34J266K330L076K595
$$ 339631 339838 340440 341907 344411 347720 351139 353935 355950 357490 358697 359631 360897 363227 366303 368898
56320C68898J634J548K244K497K037J817K304K839K859K586K305K036J959K264
$$ 368898 370532 372080 374324 376821 378858 380675 382979 385818 388677 391263 393568 395604 397563 399827
56306C99827K571K445K390L296M981O303O656O332N645M728M121M315M852N044
$$ 399827 402398 404843 407233 410529 415510 421813 428469 434801 440446 445174 449295 453610 458462 463506
56292D63506N323O529Q054Q360P376O717P238Q019Q235Q411R021R408R023Q586
$$ 463506 468829 475358 483412 491772 499148 505865 513103 521122 529357 537768 546789 556197 565220 573806
56278E73806R024J0101J1032J1666J2321J3025J3652J4316J5162J6135J7274J8719
$$ 573806 582830 592931 603963 615629 627950 640975 654627 668943 684105 700240 717514 736233
56266G36233K0318K1863K3734K6650L0683L5262M0125M5433N0967N6223O1366
$$ 736233 756551 778414 802148 828798 859481 894743 934868 980301 1031268 1087491 1148857
56255A148857O7161P3835Q0978Q8524R6728J05174J12978J20062J26986J33444
$$ 1148857 1216018 1289853 1370831 1459355 1556083 1661257 1774235 1894297 2021283 2154727
56245B154727J38222J40804J41670J40759J37093J30242J20777J08815R3588P5039
$$ 2154727 2292949 2433753 2575423 2716182 2853275 2983517 3104294 3213109 3306697 3381736
56235C381736N4527L3405J2173q507k7411m4097n9300p3375q5667r5902j04773
$$ 3381736 3436263 3469668 3481841 3473334 3445923 3401826 3342526 3269151 3183484 3087582 2982809
56224B982809j12353j17501j19680j19914j19079j16715j12609j07974j03747
$$ 2982809 2870456 2752955 2633275 2513361 2394282 2277567 2164958 2056984 1953237
56215A953237r9166r3408q7393q2363p7781p2301o6075o0484n6093n2322m8692
$$ 1953237 1854071 1760663 1673270 1590907 1513126 1440825 1374750 1314266 1258173 1205851 1157159
56204A157159m5201m1729l8176l4920l2224k9672k6893k4286k2217k0255j8057
$$ 1157159 1111958 1070229 1032053 997133 964909 935237 908344 884058 861841 841586 823529
56193H23529j6249j5388j4819j3617j2041j0897j0049q705o856n303m483m205
$$ 823529 807280 791892 777073 763456 751415 740518 730469 721764 714908 709605 705122 700917
56181G00917m245m372m076l023j587l72M82J078J354J410J621K023K203K212K746
$$ 700917 696672 692300 688224 685201 683614 683242 683724 684802 686156 687566 689187 691210 693413 695625 698371
56166F98371L903M774M863N013O058P547Q627R286R912J0444J0874J1724J3179
$$ 698371 702274 707048 711911 716924 722982 730529 739156 748442 758354 768798 779672 791396 804575
56153H04575J4586J5701J7423K0414K3957K7256L0795L5264M0104M4535M9212
$$ 804575 819161 834862 852285 872699 896656 923912 954707 989971 1030075 1074610 1123822
56142A123822N5434O3228P1384P8923Q5245Q9420R0460Q8090Q2500P3938O3497
$$ 1123822 1179256 1242484 1313868 1392791 1478036 1567456 1657916 1746006 1828506 1902444 1965941
56131A965941N3499M5966M1019L7467L4183L0117K4037J5699O635j301p724j3161
$$ 1965941 2019440 2065406 2106425 2143892 2178075 2208192 2232229 2247928 2254563 2253262 2245538 2232377
56119B232377j7720k1511k5685l1714l9912m9537n9640o8936p5617p8525p8067
$$ 2232377 2214657 2193146 2167461 2135747 2095835 2046298 1986658 1917722 1842105 1763580 1685513
56108A685513p5217p0447o4328n8059n2296m6413l9978l3882k8921k4479j9869
$$ 1685513 1610296 1539849 1475521 1417462 1365166 1318753 1278775 1244893 1215972 1191493 1171624
56097A171624j5822j3182j1249q943o641n218m223k592m63J281K506L484L930
$$ 1171624 1155802 1142620 1131371 1122428 1115787 1110569 1106346 1103754 1103291 1104572 1107078 1110562 1114492
56084A114492L787M072N493P125P874Q213R036R915J0151J0432J1697J3453J4826
$$ 1114492 1118279 1122351 1127844 1134969 1142843 1151056 1160092 1170007 1180158 1190590 1202287 1215740 1230566
56071A230566J6130J7618J8056J6595J4778J4548J5377J5631J5536J6295J7306
$$ 1230566 1246696 1264314 1282370 1298965 1313743 1328291 1343668 1359299 1374835 1391130 1408436
56060A408436J6915J5313J4188J4107J4444J5220J6628J7487J6702J5551J6066
$$ 1408436 1425351 1440664 1454852 1468959 1483403 1498623 1515251 1532738 1549440 1564991 1581057
56049A581057J7772J8607J8393J8715J9910K0941K1884K3698K5798K6605K6447
$$ 1581057 1598829 1617436 1635829 1654544 1674454 1695395 1717279 1740977 1766775 1793380 1819827
56038A819827K7302K9656L1991L3408L4431L5428L6398L7998M0656M3097M3973
$$ 1819827 1847129 1876785 1908776 1942184 1976615 2012043 2048441 2086439 2127095 2170192 2214165
56027B214165M4196M5408M7107M7783M7965M9220N1077N1935N2188N3428N5339
$$ 2214165 2258361 2303769 2350876 2398659 2446624 2495844 2546921 2598856 2651044 2704472 2759811
56016B759811N6641N8246O1981O6887P0421P2741P6211Q1107Q5590Q9506R4361
$$ 2759811 2816452 2874698 2936679 3003566 3073987 3146728 3222939 3304046 3389636 3479142 3573503
56005C573503R9828J04056J07349J11814J17593J23063J28437J35353J43318J50397
$$ 3573503 3673331 3777387 3884736 3996550 4114143 4237206 4365643 4500996 4644314 4794711
55995D794711J57002J65169J74637J83725J93226K05198K18793K31817K45429
$$ 4794711 4951713 5116882 5291519 5475244 5668470 5873668 6092461 6324278 6569707
55986F569707K62438K82056L01524L21837L46261L74269M02862M33052M68876
$$ 6569707 6832145 7114201 7415725 7737562 8083823 8458092 8860954 9294006 9762882
55977I762882N10943N57303O09536O71353P42459Q21145R11567J020802J150571
$$ 9762882 10273825 10831128 11440664 12112017 12854476 13675621 14587188 15607990 16758561
55968A6758561J300619J478912J699497J972710K308642K729327L265529L938977
$$ 16758561 18059180 19538092 21237589 23210299 25518941 28248268 31513797 35452774
55960C5452774M753043N694229O732754P834546Q997833J0278174J1757343J3485349
$$ 35452774 40205817 45900046 52632800 60467346 69465179 79743353 91500696 104986045
55952A04986045J5464927J7682714K0138564K2859315K5870995K9006992L1527038
$$ 104986045 120450972 138133686 158272250 181131565 207002560 236009552 267536590
55945B67536590L1918485K8420885K0221966Q390639m414631j5342029k2708860
$$ 267536590 299455075 327875960 348097926 356488565 352073934 336731905 314023045
55938C14023045k6374100k7197265k6301057k4622496k2752667k0931203j9155694
$$ 314023045 287648945 260451680 234150623 209528127 186775460 165844257 146688563
55931A46688563j7356034j5515240j3678528j1911922j0277566q822029p562055
$$ 146688563 129332529 113817289 100138761 88226839 77949273 69127244 61565189
55924F1565189o485581n572971m809383m176652l649708l208410k842554k540814
$$ 61565189 55079608 49506637 44697254 40520602 36870894 33662484 30819930 28279116
55916B8279116k285489k062775j868751j700613j550703j413374j289645j180562
$$ 28279116 25993627 23930852 22062101 20361488 18810785 17397411 16107766 14927204
55908A4927204j082548r92726r12346q41477p76148p13789o56175o04353n55765
$$ 14927204 13844656 12851930 11939584 11098107 10321959 9608170 8951995 8347642 7791877
55899G791877n08782m65247m26287l90211l56440l26934l01960k78824k56446
$$ 7791877 7283095 6817848 6391561 6001350 5644910 5317976 5016016 4737192 4480746
55890D480746k36812k20344k04263j87275j71653j58857j47028j34680j23172
$$ 4480746 4243934 4023590 3819327 3632052 3460399 3301542 3154514 3019834 2896662
55881B896662j13746j05609r8546r3975r1846q9685q6171q2635p9851p6518p2107
$$ 2896662 2782916 2677307 2578761 2484786 2392940 2303255 2217084 2134449 2054598 1978080 1905973
55870A905973o8060o4838o0868n5613n0648m6583m1993l6822l3661l4108l6480
$$ 1905973 1837913 1773075 1712207 1656594 1605946 1559363 1517370 1480548 1446887 1412779 1376299
55859A376299l8557m0011m0795l9856l7047l3997l1780k9737k7558k6249k6078
$$ 1376299 1337742 1297731 1256936 1217080 1180033 1146036 1114256 1084519 1056961 1030712 1004634
55848A004634k5828k5066k4805k5094k4466k2672k1470k1596k1451j9952j8269
$$ 1004634 978806 953740 928935 903841 879375 856703 835233 813637 792186 772234 753965
55837G53965j7490j6911j5932j5326j5336j4659j2686j0739r800r043p804o936
$$ 753965 736475 719564 703632 688306 672970 658311 645625 634886 625086 616043 608239 601303
55825F01303o947o805n924n436o089o784o539o125o311o231n015l489k767k495
$$ 601303 594356 587551 581627 576191 570102 563318 556779 550654 544343 538112 533097 529608 526841 524346
55811E24346j838r42k19N80J574K225K468L021L812L655K293J078O41k88k642
$$ 524346 522508 521566 521347 521927 523501 525726 528194 531215 535027 538682 540975 542053 542694 542406 539764
55796E39764n310p004q151r547j0540j0133q727p359o128m614k919j332Q3Q67
$$ 539764 534454 527450 519299 509752 499212 489079 480352 472993 466865 462251 459332 458000 458083 458950
55782D58950K93j046j235N42K932M749O855J0536J5412K0129K3841K5652K3959
$$ 458950 459243 458197 456962 457504 460436 465185 472040 482576 497988 518117 541958 567610 591569
55769E91569J7852Q406k457j3382k2933k9015l0490k8632k5728k2999k0702j9073
$$ 591569 609421 617827 615370 601988 579055 550040 519550 490918 465190 442191 421489 402416
55757D02416j7994j6652j4702j2917j1849j0864r488q460q371q437p806o905o338
$$ 402416 384422 367770 353068 340151 328302 317438 307950 299490 291119 282682 274876 267971 261633
55744B61633n641m463l768m372n329n340m740m539m419l445k062j570k017k250
$$ 261633 255992 251529 247761 243389 238060 232720 227980 223441 219022 215577 213515 211945 209928 207678
55730B07678j782j161p63n47o98j311j712j279o04o74j278j401r06n49n61l47
$$ 207678 205896 204735 203972 203425 202727 201416 199704 198425 197821 197147 195869 194468 193562 193013 192452 192105
55714A92105M76J720L122M313M590L599J954M13j064k591l398k754j365n73n58
$$ 192105 192581 194301 197423 201736 206326 209925 211879 212292 211228 208637 205239 202485 201120 200547 199989
55699A99989n28l90p74j618k047j797j509j452j114l02L64M76M70Q22J291J396
$$ 199989 199461 199071 198297 196679 194632 192835 191326 189874 188760 188458 188822 189298 189768 190590 191881 193277
55683A93277J167J020J197J593K000K324K563K590K136J219M15J61k3q91k034
$$ 193277 194444 195464 196661 198254 200254 202578 205141 207731 209867 211086 211501 211662 211639 210748 208714
55668B08714k205j246n24q72j267m86J024J995K248K490K750K420J527P88L87
$$ 208714 206509 205263 204739 203867 202600 202114 203138 205133 207381 209871 212621 215041 216568 217356 217743
55653B17743k62j463k678l178k813k185k301l706n650o614o063n004m439m116
$$ 217743 217481 216018 213340 210162 207349 205164 202863 199157 193507 186893 180830 175826 171387 167271
55639A67271l465k888l038l538l478k709j732p19K81O58j14j397j918j287k38
$$ 167271 163806 160918 157880 154342 150864 148155 146423 145704 145985 146643 146529 145132 143214 141927 141689
55624A41689M16L31n22j773k643k736k520k465k277j629r70p37m86J88O25J52
$$ 141689 142105 142436 141914 140141 137498 134762 132242 129777 127500 125871 124901 124164 123678 123866 124491 124643
55608A24643n31m22m9o42j813j889n90L17m83k113k893k379j375o93n27n73l55
$$ 124643 124112 123690 123641 122999 121186 119297 118707 119024 118541 116428 113535 111156 109781 109088 108561 107988 107633
55591A07633K68Q18P31R4n44r11j112j166j024p59k88P16K044K642J858N04j86
$$ 107633 107901 108719 109450 109544 109000 108089 106977 105811 104787 104028 103740 104456 106500 109142 111000 111504 111318
55574A11318k39n42j181j379p78J96J157J902J988J288P05J160K048J980R38L04
$$ 111318 111079 110537 109356 107977 107199 107395 108552 110454 112442 113730 114435 115595 117643 119623 120561 120865
55558A20865O83J131Q33K40L1R6J20K62O98J167J444J623J725J594J352J331J435
$$ 120865 121548 122679 123512 123752 123783 123879 123999 124261 124959 126126 127570 129193 130918 132512 133864 135195 136630
55541A36630J263Q12L68j90j089j746j269L5P72K69p48j461j937k433k777k807
$$ 136630 137893 138705 139073 138883 137794 136048 134779 134814 135586 135855 135107 133646 131709 129276 126499 123692
55525A23692k668k307j497n70k84p64j360j706k014k213j862j187j024j466j627
$$ 123692 121024 118717 117220 116650 116366 115602 114242 112536 110522 108309 106447 105260 104236 102770 101143
55510A01143j202j020j540j952j460m68K73P31J062R35K48k57J3N00L55k81o72
$$ 101143 99941 98921 97381 95429 93969 93501 93774 94505 95567 96502 96750 96493 96506 97006 97361 97080 96408
55493I6408o84o96p26m51P1L47R6m95r94j016n09N1J06k71n28n38o94r90q53j36
$$ 96408 95724 95028 94302 93851 93922 94269 94365 93870 92876 91860 91351 91402 91508 91237 90709 90171 89477 88487 87634 87498
55473H7498N11O41N88O69O09K43rR1J30j33k64K8K81J04j72k74n72j130j124o1
$$ 87498 88009 88650 89238 89907 90516 90759 90750 90841 90971 90838 90574 90602 90883 90987 90815 90541 89969 88839 87715 87654
55453H7654J124J243M80j43l55n15m49L19J370J649R40J06k20k55k18J19P96J228
$$ 87654 88778 90021 90501 90358 90003 89488 89039 89358 90728 92377 93317 93423 93203 92948 92730 92849 93645 94873
55435I4873Q81l1p68p36J6Q10Q98L11l1N30J467J654P73m50j187j211p38j27K38
$$ 94873 95754 95723 94955 94219 94235 95045 95943 96254 96223 96753 98220 99874 100647 100197 99010 97799 97061 96934 97172
55416I7172J92kP3M87R62J219J133P31L07L03P38R98N06n75j635k283k407j910
$$ 97172 97364 97362 97435 97922 98884 100103 101236 101967 102274 102577 103315 104313 104819 104244 102609 100326 97919 96009
55398I6009r18k7J90j27l59k18M2J31Q4J18L76P60Q95M32l90q46n48J25N93P07
$$ 96009 95091 95064 95254 95127 94768 94550 94592 94723 94807 94925 95301 96061 96956 97388 96998 96152 95604 95729 96322 97029
55378I7029M97j10r42j328q25J31P48P84M66m3n68o22M4Q15Q29J35m32m61l85
$$ 97029 97526 97416 96474 95146 94321 94452 95200 95984 96450 96407 95839 95217 95261 96076 96905 97040 96608 96147 95762
55359I5762o86j222j523j295n53L84J010J063Q39P51P18L48l50r05r92p47m51
$$ 95762 95076 93854 92331 91036 90483 90867 91877 92940 93779 94530 95248 95596 95246 94341 93349 92602 92151
55342I2151k70k86n03p28p47n19j15M00Q37R24O49L34Q7l55r31q96J81J498J855
$$ 92151 91881 91595 91092 90364 89617 89098 88983 89383 90220 91144 91793 92127 92214 91859 90928 90032 90213 91711 93566
55323I3566J190N41N68R31J131J153J004M06o58j547j604r76m30m94r21j051n06
$$ 93566 94756 95297 95865 96796 97927 99080 100084 100490 99832 98285 96681 95705 95275 94781 93860 92809 92303
55306I2303M03R85Q74K99l17p38q67o57k86m9Q8L88O74L19o35j085k65R94J275
$$ 92303 92706 93691 94565 94864 94547 93809 92942 92285 91999 91950 92038 92426 93100 93419 92784 91699 91434 92428 93703
55287I3703M48l62m00Q0O11R85R08J74o84p70n8N57N77M18M26L33L9K0M31N87
$$ 93703 94151 93789 93389 93469 94080 95065 95973 96147 95463 94693 94635 95192 95769 96187 96613 96946 96985 97005 97436 98023
55267I8023J4o59n81J8J51n38j318j262j65J301K095J682O28JJ07K37j47n93m93
$$ 98023 98037 97378 96797 96815 96966 96428 95110 93848 93683 94984 97079 98761 99389 99390 99497 99734 99587 98994 98501
55248I8501p4N7p7J9L77N67M97N00O06M39q0m75l77jK44K02j09o82j302j539j206
$$ 98501 98427 98484 98407 98426 98803 99370 99867 100367 100973 101412 101332 100857 100480 100479 100723 100925 100816 100134 98832 97293 96087
55227I6087o70l96l75k25K04O10O41L29L4O8M02P09O94M08J62J56K26R7j66j31
$$ 96087 95417 95021 94646 94421 94625 95235 95876 96205 96239 96307 96709 97418 98112 98520 98682 98838 99064 99161 98995 98864
55207I8864M76J357J890J785J254O25j6n96q17m85Ko0p59j301r57r5J80n80j489
$$ 98864 99340 100697 102587 104372 105626 106251 106235 105639 104822 104337 104339 104279 103520 102219 101262 101167 101347 100767 99278
55188I9278j353j07J105J271N38k04m37l52k47n5L97R59J253J060M48l48j013
$$ 99278 97925 97818 98923 100194 100732 100528 100091 99739 99492 99437 99834 100793 102046 103106 103554 103206 102193
55171A02193j228q91l04L4p0k52L3Q83J732J889J283M78m1l72p66j017p20l8L41
$$ 102193 100965 100074 99770 99804 99734 99482 99515 100398 102130 104019 105302 105780 105739 105367 104601 103584 102864 102826 103167
55152A03167J38j42mL84O02O30O37M90J8m37l75M1J25k93n65k23L19L66j05n99
$$ 103167 103305 103163 103159 103543 104145 104775 105412 105902 105920 105483 105108 105149 105274 104981 104416 104193 104512 104878 104773 104174
55132A04174q91j114j144n25P79K069K590K267J482M75n32j013n95J70K36n55
$$ 104174 103283 102169 101025 100500 101279 103348 105938 108205 109687 110162 109630 108617 108022 108192 108428 107873
55116A07873j216j040n66n53o79j56Q12J162N39k50m50j98O2K51M35N06M49M42
$$ 107873 106657 105617 105051 104498 103819 103663 104475 105637 106176 105926 105476 105278 105340 105591 106026 106532 106981 107423
55098A07423M61K69o2j42P0K02J96L91P27O26L4k87M7L48Rn19n35j84P9L92R95
$$ 107423 107884 108153 108091 107949 108019 108221 108417 108808 109535 110161 110195 109908 109955 110303 110312 109793 109258 109074 109153 109545 110540
55077A10540J434J275J050J467K073J878R62L05J94L5k62m5P52J224Q68K82M1
$$ 110540 111974 113249 114299 115766 117839 119717 120679 120984 121178 121213 120951 120906 121658 122882 123750 124032 124073
55060A24073j90p96j365j383j155j275j591j412n58L88Q15N97l3p49j212j182
$$ 124073 123883 123087 121722 120339 119184 117909 116318 114906 114348 114736 115551 116148 116115 115366 114154 112972
55044A12972o63J00P77J157J248J158Q79L54k20m86m24m07n00k06O70J393J144
$$ 112972 112309 112409 113186 114343 115591 116749 117628 117982 117762 117276 116852 116445 115945 115739 116409 117802 118946
55027A18946J90n21o95p78r35q28m46l09n75o90k18O19J395J876J792Q68o09j790
$$ 118946 119136 118615 117920 117142 116207 115379 114933 114624 114049 113359 113141 113760 115155 117031 118823 119691 119082 117292
55009A17292k120j733r19K04J292J755J495J127J028P99N5p71r18l35L17M91K27
$$ 117292 115172 113439 112520 112724 114016 115771 117266 118393 119421 120220 120275 119504 118586 118251 118568 119059 119286
54992A19286p5o7K04L13k3m57l74K66Q59R80P96O14N34O25Q93R69M72k03j59O57
$$ 119286 119211 119144 119348 119661 119638 119181 118807 119073 119932 120912 121708 122322 122856 123481 124374 125343 125815 125612 125453 126110
54972A26110J180O74k75o80l80K14R53J799K312K041J150J62o58j161j029k37
$$ 126110 127290 127964 127689 127009 126629 126843 127796 129595 131907 133948 135098 135260 134602 133441 132412 132175
54956A32175N34O62M19M48O30L28l81o71k70J8n06j332j321j76J161J560Q38k03
$$ 132175 132709 133371 133790 134238 134868 135196 134815 134144 133874 133892 133386 132054 130733 130557 131718 133278 134116 133913
54938A33913o85m10K73J030J720K214K399K416K541K778K910L009L473M434N471
$$ 133913 133228 132818 133091 134121 135841 138055 140454 142870 145411 148189 151099 154108 157581 162015 167486
54923A67486O057N981N221L859K231Q39j29q96j637k331l083m046m883m935m198
$$ 167486 173543 179524 184745 188604 190835 191674 191545 190649 189012 186681 183598 179552 174669 169734 165536
54908A65536l502l418l573l455l166k888k324j360o55p18q88k40Q84J237N57k
$$ 165536 162034 158616 155043 151588 148422 145534 143210 141850 141195 140477 139589 139349 140233 141470 142027 142025
54892A42025M62J429J845J590J431J898K696L257L479L751M281M666M392L601
$$ 142025 142487 143916 145761 147351 148782 150680 153376 156633 160112 163863 168144 172810 177202 180803
54878A80803K959K674K232J294K68m14j051k076l116l443l111k936l357l985m300
$$ 180803 183762 186436 188668 189962 190230 189816 188765 186689 183573 180130 177019 174083 170726 166741 162441
54863A62441m216l801l098k401k197k526k767k360j529r98j143j626j867j655
$$ 162441 158225 154424 151326 148925 146728 144202 141435 139075 137546 136548 135405 133779 131912 130257
54849A30257j271j056r95q14m60k20k90m32k60K73P86Q67M51j57n63o36n59m82
$$ 130257 128986 127930 126935 126121 125661 125441 125151 124719 124459 124732 125518 126385 126836 126679 126116 125480 124921 124439
54831A24439l03mP1l18p00l63O07J285J028J07q10j220q18L47J460J536O41q1
$$ 124439 124136 124132 124203 123885 123185 122822 123429 124714 125742 125849 125039 123819 123001 123348 124808 126344 126985 126904
54813A26904k4J15l75j046j081o08k63j14J89N65P01P62J069J340J071M78L14
$$ 126904 126880 126995 126620 125574 124493 123885 123622 123508 123697 124262 124963 125725 126794 128134 129205 129683 129997
54796A29997Q04J419J650J438J002O96Q04J020N47p02j574j013M40J420J542J467
$$ 129997 130801 132220 133870 135308 136310 137006 137810 138830 139377 138675 137101 136088 136528 137948 139490 140957
54780A40957J551J543J539K075L156M151M854N741P011Q136Q583Q355P730P045
$$ 140957 142508 144051 145590 147665 150821 154972 159826 165567 172578 180714 189297 197652 205382 212427
54766B12427O693O627N936L793P77j547k451k589k716k891l153l922n238o400
$$ 212427 219120 225747 231683 235476 236253 234706 232255 229666 226950 224059 220906 216984 211746 205346
54752B05346o871o848o642o165n386m642m028l150j881q10n01p72j050j015o13
$$ 205346 198475 191627 184985 178820 173434 168792 164764 161614 159733 158923 158422 157650 156600 155585 154972
54737A54972Q8P92J159J337J797K525K931K805K681K979L408L542L419L197K776
$$ 154972 155060 155852 157011 158348 160145 162670 165601 168406 171087 174066 177474 181016 184435 187632 190408
54722A90408K083J334O24k43j349k450l321l889l985l574l231l553m100l866k879
$$ 190408 192491 193825 194449 194206 192857 190407 187086 183197 179212 175638 172407 168854 164754 160888 158009
54707A58009k254k402k386j653j094j517k201k076j444j254j411j099l73l6j84
$$ 158009 155755 153353 150967 149314 148220 146703 144502 142426 140982 139728 138317 137218 136845 136809 136625
54692A36625q3M65Q23O43L55K72J33j89l04kL02J63k86o62q42r42j032j156j351
$$ 136625 136542 137007 137830 138473 138828 139100 139233 139044 138740 138738 139040 139203 138917 138255 137413 136471 135439 134283 132932
54673A32932j499j335p89j07M24P23Q26O84K60k75n44l22J84M79L64K02L93P51
$$ 132932 131433 130098 129309 129202 129626 130349 131175 131859 132119 131844 131300 130978 131162 131641 132005 132207 132600 133351
54655A33351O93J8q38j319j188n45K03N03K10q7J43M57K0r87j386n91O63J429
$$ 133351 134044 134062 133224 131905 130717 130172 130375 130878 131088 131001 131144 131601 131621 130634 129248 128657 129320 130749
54637A30749J537J232P18M23P98J426J243J37p04n63k39n40r59q35p67j477k233
$$ 130749 132286 133518 134236 134659 135457 136883 138126 138263 137559 136996 136757 136217 135258 134423 133656 132179 129946
54620A29946j861p20p8k8K91Q10N87k80n64M3M49J28nP20J570J730J506J338Q46
$$ 129946 128085 127365 127287 127259 127550 128360 128947 128667 128103 128146 128595 128723 128718 129438 131008 132738 134244 135582 136428
54601A36428k21r67m91O22J043N44J7k5j9m26j014j266r71k94L85P03N89L37K18
$$ 136428 136207 135240 134749 135371 136414 136958 136975 136950 136931 136505 135491 134225 133254 132960 133345 134048 134637 134974 135192
54582A35192J83O8n5J9L36P19Q92O00j25p98q67l77R4J83R2L8o6k42k24O7K90
$$ 135192 135375 135443 135388 135407 135743 136462 137354 137954 137829 137031 136164 135787 135881 136064 136156 136194 136128 135886 135662 135729 136019
54561A36019K94M54R88J362J003L09J89P47J097O72N8K37J270K234K341J819J490
$$ 136019 136313 136767 137755 139117 140120 140429 140618 141365 142462 143134 143192 143429 144699 146933 149274 151093 152583
54544A52583J636J643Q63m53j417j599j398j351j460j406j074o11k14l2r6k06
$$ 152583 154219 155862 156725 156272 154855 153256 151858 150507 149047 147641 146567 145956 145742 145710 145614 145408
54528A45408j09J10J50L5J91P11R76M34n84j235j204q78o58n36l78j84L4L07N69
$$ 145408 145299 145409 145559 145594 145785 146496 147472 147906 147322 146087 144883 144005 143347 142811 142433 142249 142283 142590 143159
54509A43159O88O58N58L26j67p53r65n41K49Q88J073Q76N49L08J57j66r03j818
$$ 143159 143847 144505 145063 145389 145222 144469 143504 142963 143212 144100 145173 146049 146598 146906 147063 146897 145994 144176
54491A44176k174j398J93J571J944J460Q75O94Q13R18R58J021R86O11k9m30k00
$$ 144176 142002 140604 140797 142368 144312 145772 146647 147341 148154 149072 150030 151051 152037 152648 152619 152189 151989
54474A51989M39Q05N07j71o40p03o49o83n07K02J122J426P70k52p80n87l4N51
$$ 151989 152428 153233 153740 153569 152929 152226 151577 150894 150387 150589 151711 153137 153907 153655 152875 152288 152254 152805
54456A52805J046J256R17P9q07j257j124o40k51l77j006j595j623j177o95l29
$$ 152805 153851 155107 156024 156103 155296 154039 152915 152275 152024 151647 150641 149046 147423 146246 145551 145222
54440A45222N1L08J02l96m99M8O45P06M78N31Q42R08N53L8m73r86j247q46J22
$$ 145222 145273 145581 145683 145287 144788 144836 145481 146187 146665 147196 148038 148946 149499 149537 149064 148078 146831 145985 146107
54421A46107R42J052N99J16o7Q1M67Q65R66O83K82O8L8L7M9R8J23J04K72Q41J585
$$ 146107 147049 148101 148700 148816 148749 148830 149297 150162 151128 151811 152093 152161 152199 152236 152285 152383 152506 152610 152882 153723 155308
54400A55308J977J774J219P16M73M98O22M97j12r22j286r41k96J63M34P21R43
$$ 155308 157285 159059 160278 160994 161467 161965 162587 163084 162972 162050 160764 159823 159527 159690 160124 160845 161788
54383A61788Q96P20P45J025J398J862K404K624K155J404J267J925K516K270J431
$$ 161788 162684 163404 164149 165174 166572 168434 170838 173462 175617 177021 178288 180213 182729 184999 186430
54368A86430P66O32Q74J158J058K34j030j836j652r83o11o25p16r59j543k013
$$ 186430 187196 187828 188702 189860 190918 191152 190122 188286 186634 185651 185040 184415 183699 182740 181197 179184
54352A79184j688p74k65n63j029j001o69m96n06m94m87n62n68m40n59j235k075
$$ 179184 177496 176722 176457 175894 174865 173864 173195 172699 172193 171699 171212 170650 170082 169642 169083 167848 165773
54335A65773k231j335Q8J143J325Q32K56J0J6o1k99m63l63p4K62N88P71O16Q4
$$ 165773 163542 162207 162295 163438 164763 165595 165851 165861 165877 165816 165517 165054 164691 164617 164879 165467 166238 166854 166938
54316A66938o18j277j727j699r69J76R55Q82L18m9l0N9L4O8K59L55R8l87p16o77
$$ 166938 166320 165043 163316 161617 160648 160824 161779 162661 162979 162930 162900 162959 162993 163061 163320 163675 163773 163386 162670 161993
54296A61993m20k38k53l69m06k46Q5L66K73k04m92R7J419K373K037P26m33p94
$$ 161993 161573 161335 161082 160713 160307 160061 160146 160512 160785 160581 160089 160186 161605 163978 166015 166741 166308 165514
54278A65514o05k84J17N53O94L43j58k52J41N67N65J37k46j27M18Q06O40K23J30
$$ 165514 164909 164625 164742 165295 165989 166332 166174 165922 166063 166630 167195 167332 167086 166959 167377 168183 168823 169046 169176
54259A69176L93N59N10O42J142J587J548J120N62j41r60j494j365p90k65M2K31
$$ 169176 169569 170128 170638 171280 172422 174009 175557 176677 177239 177098 176138 174644 173279 172489 172224 172266 172497
54242A72497J96j81n75n28j88j71n67o65j9P64P72P5l45J05Q62R82L21l38k72
$$ 172497 172693 172512 171937 171409 171221 171050 170483 169818 169799 170563 171335 171410 171065 171170 172032 173014 173335 172997 172725
54223A72725L79Q97Q49M75J80r6p80j911k799k753j968j313j118p90Q8Q13M46
$$ 172725 173104 174001 174850 175325 175505 175409 174629 172718 169919 167166 165198 163885 162767 161977 162065 162878 163324
54206A63324o32j022k34O67O87K39K18N30M51j8k58k19m77j078j290o80K77R39
$$ 163324 162692 161670 161436 162103 162790 163029 163247 163777 164228 164210 163952 163733 163256 162178 160888 160208 160485 161424
54188A61424J109Q27K04k71KR02J642J873J997K118J601J92j168j463q84l17L
$$ 161424 162533 163360 163564 163293 163295 164197 165839 167712 169709 171827 173428 173620 172452 170989 170105 169788 169791
54171A69791L91O93L88l36n30K30J240J627J395J254J684K462K918K593J682Q72
$$ 169791 170182 170875 171263 170927 170397 170627 171867 173494 174889 176143 177827 180289 183207 185800 187482 188354
54155A88354N84N43K37l98r97j361j645j964k169k031j528q37k54qp2j76j00J33
$$ 188354 188938 189481 189718 189320 188323 186962 185317 183353 181184 179153 177625 176788 176534 176526 176454 176278 176178 176311
54137A76311M24P22Q92P47M36N23J298K250K599K294K002K188K575K637K250J621
$$ 176311 176735 177457 178349 179096 179532 180055 181353 183603 186202 188496 190498 192686 195261 197898 200148 201769
54121B01769Q52j26j204j944j951j412r93j126j602k010k271k407k143j323n60
$$ 201769 202621 202495 201291 199347 197396 195984 194991 193865 192263 190253 187982 185575 183432 182109 181549
54106A81549o45j304j343l25P29P82J77l4M14R42J148J091P63O4p65j259j304
$$ 181549 180904 179600 178257 177932 178661 179443 179620 179586 180000 180942 182090 183181 183944 184008 183243 181984 180680
54089A80680j184j099j010q40n01J13P72Q80K18m97l04Q85K274L081K988K106
$$ 180680 179496 178397 177387 176547 176046 176159 176931 177811 178029 177532 177228 178113 180387 183468 186456 188562
54073A88562R69L06K93K96j21m10J8N62J99q32j219m94L62M55J06N8M33Q98J190
$$ 188562 189531 189837 190130 190426 190305 189895 189913 190475 190674 189842 188623 188129 188491 188946 189052 189110 189543 190441 191631
54054A91631J105N76R7M40J612K681K948K686K434K215J922J843K239K867L438
$$ 191631 192736 193312 193409 193849 195461 198142 201090 203776 206210 208425 210347 212190 214429 217296 220734
54039B20734M069M822N264N009M326L724L287K944K971L618M464M787M458L960
$$ 220734 224803 229625 234889 239898 244224 247948 251235 254179 257150 260768 265232 270019 274477 278437
54025B78437L573L127K504J900J448R68L02l02l93O1M73J63q10j563j371o29m43
$$ 278437 282010 285137 287641 289541 290989 291957 292259 291957 291564 291625 292098 292261 291451 289888 288517 287888 287445
54008B87445j338k707l582l522k718j687j030j066j453j420n72Q02K163L181L687
$$ 287445 286107 283400 279818 276296 273578 271891 270861 269795 268342 266922 266350 267152 269315 272496 276183
53993B76183L660L353K972K173M19k124m609o477p724q128p160n118l412l063
$$ 276183 279843 283196 286168 288341 288760 286636 282027 275550 267826 259698 252538 247420 244008 240945
53979B40945l549l774l532l289l083k514j565o93k43l44j007j841k056j356m81
$$ 240945 237396 233622 230090 226801 223718 221204 219639 218946 218703 218359 217352 215511 213455 212099 211618
53964B11618k41m55n04m06n09n40L7R64J483J521J637J896J801J351J146J332
$$ 211618 211377 210922 210418 210012 209503 208963 209000 209964 211447 212968 214605 216501 218302 219653 220799 222131
53948B22131J420J340J727K798L821M118L894L705L755L994M360M639M646M698
$$ 222131 223551 224891 226618 229416 233237 237355 241249 244954 248709 252703 257063 261702 266348 271046
53934B71046N236N907N785M746L803L702M090M474N092O122O875O610N684N084
$$ 271046 276282 282189 287974 292720 296523 300225 304315 308789 313881 320003 326878 333488 339172 344256
53920C44256N129N354N327N003M565M469N281O834P944P558N927M105K649J516
$$ 344256 349385 354739 360066 365069 369634 374103 379384 386218 394162 401720 407647 411752 414401 415917
53906D15917P69N13L19m41j703k818l465l756l643l122k843l605n099o089o069
$$ 415917 416686 417199 417518 417077 415374 412556 409091 405335 401692 398570 395727 392122 387023 380934 374865
53891C74865n786n849n773n062m319m463n294n791n587n321n502n784n557m783
$$ 374865 369079 363230 357457 352395 348076 343613 338319 332528 326941 321620 316118 310334 304777 299994
53877B99994l973l576l639l921m096l945l451k869k591k876l489l793l336k407
$$ 299994 296021 292445 288806 284885 280789 276844 273393 270524 267933 265057 261568 257775 254439 252032
53863B52032j803j975k582k957k759k136j440r70q61j000j120j075r86j054j259
$$ 252032 250229 248254 245672 242715 239956 237820 236380 235410 234549 233549 232429 231354 230368 229314 228055
53848B28055j332j012l61J98K44j41l82j06L95N43J84m23j081j608j545n44Q29
$$ 228055 226723 225711 225350 225548 225792 225651 225269 225163 225558 226101 226285 225862 224781 223173 221628 221084 221913
53831B21913J417Q50J4k20p0j77m86n05k75k62m07j56N67J173J351J550K144K706
$$ 221913 223330 224180 224194 223974 223904 223727 223241 222736 222461 222199 221792 221636 222203 223376 224727 226277 228421 231127
53813B31127K598J919J394J407J619J627J630K191L395M580N061N005N157N724
$$ 231127 233725 235644 237038 238445 240064 241691 243321 245512 248907 253487 258548 263553 268710 274434
53799B74434O068N705N120N063N411N339M503L369K397J591R78Q44J210J501J172
$$ 274434 280502 286207 291327 296390 301801 307140 311643 315012 317409 319000 319978 320822 322032 323533 324705
53784C24705K73p82j699k313k508k401k361k605k999l407l842m149m006l515l346
$$ 324705 324978 324196 322497 320184 317676 315275 312914 310309 307310 303903 300061 295912 291906 288391 285045
53769B85045l796m196l704k409j136m80n40j258k362l183l165k553k019j731j408
$$ 285045 281249 277053 273349 270940 269804 269324 268784 267526 265164 261981 258816 256263 254244 252513 251105
53754B51105j096j108j221q12j9J45p48j740j705q12j03p7l60m86l20J26O33O90
$$ 251105 250009 248901 247680 246868 246849 246994 246246 244506 242801 241989 241886 241809 241449 240963 240643 240769 241402 242092
53736B42092J9p82p50J63R69Q69J19n23o78l19N37J618K236J972J338J222J763
$$ 242092 242111 241329 240579 240742 241711 242580 242699 242176 241498 241179 241716 243334 245570 247542 248880 250102 251865
53719B51865K266K256J996J850J703J361J061J208J803K488K943K992K590K029
$$ 251865 254131 256387 258383 260233 261936 263297 264358 265566 267369 269857 272800 275792 278382 280411
53705B80411J916K511L235L337K898K626K772K863K585K297K414K786L056L130
$$ 280411 282327 284838 288073 291410 294308 296934 299706 302569 305154 307451 309865 312651 315707 318837
53691C18837L014K551J753J106J095J548J789J348L27o97j060n35K89N21O1k75
$$ 318837 321851 324402 326155 327261 328356 329904 331693 333041 333368 332671 331611 331076 331365 331886 331947 331672
53675C31672O7N83N75K65L07N94M25k78q21q45p75r93j239j136p71l73P2O25J097
$$ 331672 331739 332322 332897 333162 333469 334063 334488 334210 333389 332544 331769 330776 329537 328401 327630 327257 327329 327954 329051
53656C29051J283J241J105Q86N91L20J77J94M08P12P31K33l76l90L01J117J649
$$ 329051 330334 331575 332680 333566 334157 334477 334654 334848 335256 335968 336699 336932 336556 336166 336467 337584 339233
53639C39233K053K429K373J535K16q96j359j166o31k06j05l6L13N88J95n25m17
$$ 339233 341286 343715 346088 347623 347839 346943 345584 344418 343787 343581 343476 343440 343753 344341 344536 344011 343594
53622C43594Q29K008J992J250J011J536K182K685L265L658L230K213J812K660
$$ 343594 344423 346431 348423 349673 350684 352220 354402 357087 360352 364010 367240 369453 371265 373925
53608C73925L911M418M139L809L685L326K531J809J774K352K918L009K696K294
$$ 373925 377836 382254 386393 390202 393887 397213 399744 401553 403327 405679 408597 411606 414302 416596
53594D16596J934J617J392J237Q83J67n03m80J69N93K67k68k11L95P94N06l62
$$ 416596 418530 420147 421539 422776 423659 423826 423323 422843 423012 423605 423872 423604 423393 423788 424582 425088 424726
53577D24726j514k624l238l115k624k329k181j673p77j40k07o75j018j142j243
$$ 424726 423212 420588 417350 414235 411611 409282 407101 405428 404651 404511 404304 403629 402611 401469 400226
53562D00226j367j346j004k90O27J349J568J400J130P07o1q63j042n20K8J74L56
$$ 400226 398859 397513 396509 396219 396846 398195 399763 401163 402293 403000 402939 402076 401034 400514 400542 400716 401072
53545D01072J017J674J552Q47N74J133J717J485Q07Q53K087L690M566M615M665
$$ 401072 402089 403763 405315 406162 406736 407869 409586 411071 411878 412731 414818 418508 423074 427689 432354
53530D32354N310O204O678O689O793P343Q162Q976R752J0489J1021J1313J1575
$$ 432354 437664 443868 450546 457235 464028 471371 479533 488509 498261 508750 519771 531084 542659
53517E42659J1934J2250J2539J3230J4628J6257J7273J7461J7385J7515J7657
$$ 542659 554593 566843 579382 592612 607240 623497 640770 658231 675616 693131 710788
53506G10788J7510J7313J7589J8386J9250J9891K0457K1061K1426K1251K0659
$$ 710788 728298 745611 763200 781586 800836 820727 841184 862245 883671 904922 925581
53495I25581J9999J9382J8774J8377J8454J8746J8603J7916J7458J7853J8629
$$ 925581 945580 964962 983736 1002113 1020567 1039313 1057916 1075832 1093290 1111143 1129772
53484A129772J8754J7929J6859J6277J6305J6708J7214J7424J6976J6085J5464
$$ 1129772 1148526 1166455 1183314 1199591 1215896 1232604 1249818 1267242 1284218 1300303 1315767
53473A315767J5357J5078J3977J2421J1220J0265Q607N934L221J452K65j525m332
$$ 1315767 1331124 1346202 1360179 1372600 1383820 1394085 1402692 1408626 1411847 1413299 1413564 1412039 1407707
53460A407707p293r319j0126j0143r911r874j0345j1306j2350j3164j3903j4827
$$ 1407707 1400414 1391095 1380969 1370826 1360915 1351041 1340696 1329390 1317040 1303876 1289973 1275146
53448A275146j5728j6119j5977j5822j6012j6370j6647j6915j7153j6851j5504
$$ 1275146 1259418 1243299 1227322 1211500 1195488 1179118 1162471 1145556 1128403 1111552 1096048
53437A096048j3407j1471j0227r328q143o563n067m135l800l686l401k769j764
$$ 1096048 1082641 1071170 1060943 1051615 1043472 1036909 1031842 1027707 1023907 1020221 1016820 1014051 1012287
53424A012287l55J389L151M590N785P120Q638R850J0466J0949J1990J3644J5384
$$ 1012287 1011932 1013321 1016472 1021062 1026847 1033967 1042605 1052455 1062921 1073870 1085860 1099504 1114888
53411A114888J6789J7756J8227J8307J8596J9771K1698K3520K4797K5976K7485
$$ 1114888 1131677 1149433 1167660 1185967 1204563 1224334 1246032 1269552 1294349 1320325 1347810
53400A347810K9039L0312L1757L4032L6880L9378M1128M2538M3811M4507M4531
$$ 1347810 1376849 1407161 1438918 1472950 1509830 1549208 1590336 1632874 1676685 1721192 1765723
53389A765723M4799M6273M8533N0078N0022M8918M7830M7097M6368M5321M3913
$$ 1765723 1810522 1856795 1905328 1955406 2005428 2054346 2102176 2149273 2195641 2240962 2284875
53378B284875M2096L9844L7439L5335L3578L1713K9348K6552K3580K0481J7170
$$ 2284875 2326971 2366815 2404254 2439589 2473167 2504880 2534228 2560780 2584360 2604841 2622011
53367B622011J3653R872N516K85n661j1736j7415k2535k7120l1098l4276l6598
$$ 2622011 2635664 2645536 2651052 2651337 2645676 2633940 2616525 2593990 2566870 2535772 2501496 2464898
53355B464898l8351m0019m1789m3266m3862m3509m2731m1965m1091l9830l8322
$$ 2464898 2426547 2386528 2344739 2301473 2257611 2214102 2171371 2129406 2088315 2048485 2010163
53344B010163l7055l6363l6288l6721l7422l7919l7801l7103l6201l5274l4106
$$ 2010163 1973108 1936745 1900457 1863736 1826314 1788395 1750594 1713491 1677290 1642016 1607910
53333A607910l2475l0586k8922k7681k6443k4543k1890j9230j7374j6252j5226
$$ 1607910 1575435 1544849 1515927 1488246 1461803 1437260 1415370 1396140 1378766 1362514 1347288
53322A347288j4254j4121j5205j6664j7311j6898j5963j4865j3678j2782j2635
$$ 1347288 1333034 1318913 1303708 1287044 1269733 1252835 1236872 1222007 1208329 1195547 1182912
53311A182912j2931j2686j1373r402p373n465l807k746k328j926q46Q94K697M104
$$ 1182912 1169981 1157295 1145922 1136520 1129147 1123682 1119875 1117129 1114801 1112875 1112029 1112923 1115620 1119724
53297A119724N132O116P449R282J1287J2909J4041J5195J6818J8661K0083K0784
$$ 1119724 1124856 1130972 1138421 1147703 1158990 1171899 1185940 1201135 1217953 1236614 1256697 1277481
53285A277481K0956K0828K0456J9926J9433J9023J8489J7696J6822J6086J5236
$$ 1277481 1298437 1319265 1339721 1359647 1379080 1398103 1416592 1434288 1451110 1467196 1482432
53274A482432J3630J0988P842M986K619M43j575l173m637o901j0321j3861j6207
$$ 1482432 1496062 1507050 1514892 1519878 1522497 1522940 1521365 1518192 1513555 1506654 1496333 1482472 1466265
53261A466265j7311j8132j9172k0130k0893k1859k3080k3910k3929k3544k3281
$$ 1466265 1448954 1430822 1411650 1391520 1370627 1348768 1325688 1301778 1277849 1254305 1231024
53250A231024k3078k2703k2394k2464k2688k2591k2208k2035k2294k2657k2696
$$ 1231024 1207946 1185243 1162849 1140385 1117697 1095106 1072898 1050863 1028569 1005912 983216
53239I83216k2372k1995k1887k2046k2102k1655k0678j9485j8332j7242j6231
$$ 983216 960844 938849 916962 894916 872814 851159 830481 810996 792664 775422 759191
53228G59191j5399j4644j3661j2354j1024j0049r485r193r147r430j0005j0668
$$ 759191 743792 729148 715487 703133 692109 682060 672575 663382 654235 644805 634800 624132
53216F24132j1245j1751j2291j2772j2830j2299j1684j1647j1957j1568j0122
$$ 624132 612887 601136 588845 576073 563243 550944 539260 527613 515656 504088 493966
53205D93966q695q393q841r019q972r472j0246j0063q720p541p388p515p031o372
$$ 493966 485271 476878 468037 459018 450046 440574 430328 420265 411545 404004 396616 389101 382070 375698
53191C75698o407o963p265p148o935o640o155n767n683n421m560l667l635m331
$$ 375698 369291 362328 355063 347915 340980 334340 328185 322418 316735 311314 306754 303087 299452 295121
53177B95121m719m214l166k153j466j193j268j443j612j902k152j802q63k80o33
$$ 295121 290402 286188 283022 280869 279403 278210 276942 275499 273887 271985 269833 268031 267168 266888 266255
53162B66255j083o49J00j71j395k148j825j377j542j765j399q66p94r11o22j72
$$ 266255 265172 264523 264623 264452 263057 260909 259084 257707 256165 254400 253001 252135 251341 250430 249808 249636
53146B49636k52q42j236j099q45q39q27l41N38J214J286J070J172J670K027J887
$$ 249636 249384 248542 247306 246207 245362 244523 243696 243355 243893 245107 246393 247463 248635 250305 252332 254219
53130B54219J470J030M41l00o33j68O11J016J229J859K675K774K015J280J160
$$ 254219 255689 256719 257160 256860 256227 256059 256670 257686 258915 260774 263449 266223 268238 269518 270678
53115B70678J253J078P48L79l15j294j828j475q71q77j398j721j587j268q68k58
$$ 270678 271931 273009 273757 274136 273821 272527 270699 269224 268353 267476 266078 264357 262770 261502 260634 260376
53099B60376M14P47O19K85k6k16j96mK0l62q46r36o80o31j021j442j497j336j305
$$ 260376 260790 261537 262156 262441 262415 262199 262003 261999 262019 261657 260811 259875 259195 258564 257543 256101 254604 253268 251963
53080B51963j331j071n63l45p27j256j135k08Q11J116O30j33p47j178j471j513
$$ 251963 250632 249561 248998 248653 247926 246670 245535 245327 246138 247254 247884 247751 247004 245826 244355 242842
53064B42842j164n13J40N22O22O37O33L09n63j527j696q22L39J012J311J668J857
$$ 242842 241678 241165 241305 241827 242449 243086 243719 244028 243465 241938 240242 239420 239759 240771 242082 243750 245607
53047B45607J373N25K61P90J185O64l10o78j09O97R54O55M16N90O88J7j198j741
$$ 245607 246980 247505 247766 248556 249741 250405 250095 249417 249308 250005 250959 251614 252030 252620 253308 253325 252127 250386
53029B50386q51P65J779J754J250P99N29M94N96L61l98q72k40Q58R42j01p48j26
$$ 250386 249535 250300 252079 253833 255083 255882 256411 256905 257501 257862 257464 256592 256352 257210 258152 258051 257303 257177
53011B57177P87Q07K50J0jm06j024j099n18J07L63K28k65q11o22O67K097K329
$$ 257177 257964 258771 259021 259031 259030 258624 257600 256501 255983 256090 256453 256681 256416 255605 254983 255650 257747 260076
52993B60076J362M39L03M36K17j08nM92R76J318J672K069K309K141J463M48m03
$$ 260076 261438 261877 262180 262616 262833 262725 262720 263212 264188 265506 267178 269247 271556 273697 275160 275608 275205
52976B75205n46Q3R58J463J495J525J979K627K763K119J333J120J210P31m14j307
$$ 275205 274659 274742 275700 277163 278658 280183 282162 284789 287552 289671 291004 292124 293334 294065 293651 292344
52960B92344j351j029r45r25o79o61j323k057j826p33M8j78r27j458j599j423
$$ 292344 290993 289964 289019 288094 287415 286754 285431 283374 281548 280815 280863 280685 279758 278300 276701 275278
52944B75278q70j1P52J048Q42L16k25l78l4K55j72j108j593j186n81o30j199j431
$$ 275278 274408 274397 275149 276197 277039 277355 277130 276752 276718 276973 276801 275693 274100 272914 272333 271703 270504 269073
52926B69073q65J04P71Q75P06O08N40K42k06m01k80l71r90j579j403o29o6L2J49
$$ 269073 268208 268312 269083 269958 270664 271272 271812 272054 271848 271447 271167 270796 269806 268227 266824 266195 266129 266161 266310
52907B66310M97O22K11l92p86j071j370j370p69J50Q16J021R61Q69Q69J017J209
$$ 266310 266807 267429 267640 267248 266462 265391 264021 262651 261882 262032 262848 263869 264830 265699 266568 267585 268794
52890B68794J265J172J070Q66K79n40r15m64L05O03L08j13k71j11K52N94O73O14
$$ 268794 270059 271231 272301 273167 273446 272906 271991 271527 271832 272435 272743 272630 272359 272248 272500 273094 273767 274381
52872B74381R41J795K461K198J322Q03Q75Q13J48o40r36q47q20r04q91q79j156
$$ 274381 275322 277117 279578 281776 283098 283901 284776 285589 285737 285097 284161 283314 282494 281590 280699 279820 278664
52855B78664j698k258k802l369l536k684j010K27q1j636l037l246k511j786j566
$$ 278664 276966 274708 271906 268537 265001 262317 261307 261534 261453 259817 256780 253534 251023 249237 247671
52840B47671j480r37L8P93Q78O29O58R47Q67J95m17k86L66Q24Q98R59J070Q65
$$ 247671 246191 245254 245292 246085 246963 247592 248250 249197 250064 250259 249842 249556 249922 250746 251644 252603 253673 254538
52822B54538L90L22R37J483J163K97p5M55J377K144K592K484J403m91k174k726
$$ 254538 254928 255250 256187 257670 258833 259130 259055 259510 260887 263031 265623 268107 269510 269019 266845 264119
52806B64119k357k017k163k397k267j886j652j614j481j088o38m71p35j233j509
$$ 264119 261762 259745 257582 255185 252918 251032 249380 247766 246285 245197 244559 244088 243353 242120 240611
52791B40611j183k73P16J198R46J46q08j410j172q0J083J342O71M1J64O31O61
$$ 240611 239428 239155 239871 241069 242015 242161 241353 239943 238771 238691 239774 241116 241787 241828 241992 242623 243284
52774B43284K10k71o98j199j377p03L37N73k03p88l15M83M66j93l86K17Q76J017
$$ 243284 243494 243223 242525 241326 239949 239246 239583 240156 239953 239165 238850 239333 239799 239606 239220 239437 240313 241330
52756B41330R14J013J286J518J648J661J502J348J587K282K880K759J941J106
$$ 241330 242244 243257 244543 246061 247709 249370 250872 252220 253807 256089 258969 261728 263669 264775
52742B64775Q67J120J210P75L12N66J460K075J867J351J198J165N76m36r79o79
$$ 264775 265642 266762 267972 268747 269059 269625 271085 273160 275027 276378 277576 278741 279317 278881 277902 277223
52726B77223k01k81p81j059p89j99L34N39L05k59q24j077r55o34l04j2K40L13
$$ 277223 277022 276741 275960 274901 274112 273913 274247 274786 275091 274832 274008 272931 271976 271342 271038 271026 271266 271579
52708B71579m0p84j402j375q73n51o18n24J02P80Q39L77J6l3l6n5P2J42l51j393
$$ 271579 271539 270755 269353 267978 267105 266554 265936 265412 265514 266294 267133 267510 267526 267493 267457 267402 267474 267616 267265 265872
52688B65872k201k075j169k17K29J33k65p16j029r66k22J164K425K550J442K01
$$ 265872 263671 261596 260427 260210 260439 260572 260307 259591 258562 257596 257374 258538 260963 263513 264955 265156
52672B65156j24K70M82K07r5o8J84N39R55J189R79N42L85O34J048J549K151K481
$$ 265156 265032 265302 265784 265991 265896 265828 266012 266551 267506 268695 269674 270216 270601 271235 272283 273832 275983 278464
52654B78464K102J279P03M64O4n46p86m98k98n27p31n50l84o64j096j137o99%
$$ 278464 280566 281845 282548 283012 283076 282530 281744 281246 280948 280421 279690 279140 278756 278092 276996 275859 275160 275160
52636B75160P90J399J492J314J557K315K757K435K066K301K458J479l64j774k232
$$ 275160 275950 277349 278841 280155 281712 284027 286784 289219 291285 293586 296044 297523 297159 295385 293153
52621B93153k409k760k789k066j080o47q28r46m50N07J257J238N02l19o54n22
$$ 293153 290744 287984 285195 283129 282049 281402 280574 279628 279178 279685 280942 282180 282682 282363 281709 281187
52605B81187l87n77j022j405j405q39J28R29R68J83q00j133m99N45J085R25Q25
$$ 281187 280800 280223 279201 277796 276391 275552 275680 276609 277577 277760 276960 275827 275328 275873 276958 277883 278708
52588B78708J459K317K292J256L24L47Q40P89K7p43r72q16p59r68j040l59J040
$$ 278708 280167 282484 284776 286032 286356 286703 287543 288332 288359 287616 286644 285828 285069 284101 283061 282702 283742
52571B83742K092J681Q6j187j228o79n14o07k32N55Q76K02j044j997k046j182
$$ 283742 285834 287515 287601 286414 285186 284507 283993 283386 283154 283709 284585 284787 283743 281746 279700 278518
52555B78518OP37P29L21j56o75j036p94k6L46k86j327j775j469r13l17M37J190
$$ 278518 278524 279261 279990 280311 280155 279480 278444 277650 277624 277970 277684 276357 274582 273113 272200 271883 272320 273510
52537B73510J643J840J912J700J193R03J116J256Q04L29N46Q87K53j017j412m88
$$ 273510 275153 276993 278905 280605 281798 282701 283817 285073 285877 286206 286752 287639 287892 286875 285463 284975
52521B84975N62Q11P74J187J800K080K128K212K162J842J642J827J987J726J310
$$ 284975 285537 286348 287122 288309 290109 292189 294317 296529 298691 300533 302175 304002 305989 307715 309025
52506C09025J099Q05k4j205k181k733k955k808k276j682j349j159q28m25k09j53
$$ 309025 310124 310929 310905 309700 307519 304786 301831 299023 296747 295065 293716 292557 291729 291304 291095 290942
52490B90942KL20O29P24M82k4l72j27N79J133J278J358J477J139J01r26j099n31
$$ 290942 290944 291264 291893 292617 293099 293075 292703 292576 293155 294288 295566 296924 298401 299540 299641 298715 297616 297085
52472B97085P1M59Q83J324J413J110Q02P18P00O44O48P23P31O58N76L13m25j486
$$ 297085 297156 297615 298498 299822 301235 302345 303147 303865 304565 305209 305857 306580 307311 307969 308545 308858 308433 306947
52454C06947k238k258j759j205q43o79p16r08j092j140j103j100j130j116j045
$$ 306947 304709 302451 300692 299487 298644 297965 297249 296341 295249 294109 293006 291906 290776 289660 288615
52439B88615j011j111j318j453j254o24J89O85N14j56o90m95M36J524K179K229
$$ 288615 287604 286493 285175 283722 282468 281844 282033 282718 283232 283076 282386 281891 282327 283851 286030 288259
52423B88259J841J255P98Q57J430J897J678J110J106J930K865L246L318L680M405
$$ 288259 290100 291355 292153 293010 294440 296337 298015 299125 300231 302161 305026 308272 311590 315270 319675
52408C19675N118N648O098O496O762O866O636N586L426O50j782l330m129m433
$$ 319675 324793 330441 336539 343035 349797 356663 363299 368885 372311 372961 371179 367849 363720 359287
52394C59287m285l794l389l477l975m292l856k661j375q09j102j541j348m66N23
$$ 359287 355002 351208 347819 344342 340367 336075 332219 329558 328183 327374 326272 324731 323383 322917 323440
52379C23440J153J393J398J246J052J070J488K195K823L040K884K763L003L377
$$ 323440 324593 325986 327384 328630 329682 330752 332240 334435 337258 340298 343182 345945 348948 352325
52365C52325L312K631J830J386J141O52p6o05p22o62o38n44k44J46M36O31Q97
$$ 352325 355637 358268 360098 361484 362625 363277 363201 362596 361874 361212 360574 360030 359786 359932 360368 360999 361896
52348C61896J300J685J838J745J650J754J909J891J959K703M077N048M767L755
$$ 361896 363196 364881 366719 368464 370114 371868 373777 375668 377627 380330 384407 389455 394222 397977
52334C97977L324L927M860N574O417P708Q871R177Q933R140J0134J1236J1825
$$ 397977 401301 405228 410088 415662 422079 429787 438658 447835 456768 465908 476042 487278 499103
52321D99103J2065J2389J2758J2895J2923J3295J4139J5071J5749J6306J7073
$$ 499103 511168 523557 536315 549210 562133 575428 589567 604638 620387 636693 653766
52310F53766J8030J8765J8970J8826J8826J9217J9699J9733J9179J8489J8152
$$ 653766 671796 690561 709531 728357 747183 766400 786099 805832 825011 843500 861652
52299H61652J8028J7486J6225J4682J3423J2379J0972Q907O527M377K739J636
$$ 861652 879680 897166 913391 928073 941496 953875 964847 973754 980281 984658 987397 989033
52287I89033R25K94o24j844k901l296l013k475k131k179k537k856k640j607m2
$$ 989033 989958 990252 989628 987784 984883 981587 978574 976099 973968 971789 969252 966396 963756 962149 962107
52272I62107J315J853J601J186J287K100L360M759O189P492Q360Q654Q767R262
$$ 962107 963422 965275 966876 968062 969349 971449 974809 979568 985757 993249 1001609 1010263 1019030 1028292
52258A028292J0294J1618J3019J4337J5177J5148J4450J3684J3019J2069J0728
$$ 1028292 1038586 1050204 1063223 1077560 1092737 1107885 1122335 1136019 1149038 1161107 1171835
52247A171835R504Q699P832O372M560K990J752N93m16j034j464k202l338m552
$$ 1171835 1181339 1190038 1197870 1204242 1208802 1211792 1213544 1214137 1213721 1212687 1211223 1209021 1205683 1201131
52233A201131n712o960q204r104r535r602r195q191p115o911p768q680q597p569
$$ 1201131 1195419 1188459 1180255 1171151 1161616 1152014 1142819 1134628 1127513 1120602 1112834 1104154 1095557 1087988
52219A087988o456n825n511n036m068k641j193k78m8o9J20N11Q55J207J848K730
$$ 1087988 1081532 1075707 1070196 1065160 1061092 1058451 1057258 1056980 1056932 1056863 1056983 1057494 1058349 1059556 1061404 1064134
52203A064134L434L794M242N209O359O802O187N193M756M963N085M550L458K149
$$ 1064134 1067568 1071362 1075604 1080813 1087172 1093974 1100161 1105354 1110110 1115073 1120158 1124708 1128166 1130315
52189A130315Q33k55q72j200j847k959l865m025l850m004m358m423m438n006n804
$$ 1130315 1131148 1130893 1130021 1128821 1126974 1124015 1120150 1116125 1112275 1108271 1103913 1099490 1095052 1090046 1084242
52174A084242n756m672l676l598l905l681k939k263j821j404r90o08n1O60R46
$$ 1084242 1078486 1073814 1070138 1066540 1062635 1058954 1056015 1053752 1051931 1050527 1049537 1048929 1048878 1049538 1050484
52159A050484M37k88m65l32p03j535j907j430p69m85k50L42Q67O41k04q85j081
$$ 1050484 1050921 1050633 1050168 1049836 1049133 1047598 1045691 1044261 1043492 1043007 1042757 1043099 1043966 1044607 1044403 1043518 1042437
52142A042437j297k021k962l333k728j575p12n81p92m82P95K568L942M610N224
$$ 1042437 1041140 1039119 1036157 1032824 1030096 1028521 1027809 1027228 1026436 1025954 1026749 1029317 1033259 1037869 1043093
52127A043093O608Q679J0533J1609J2407J3661J5119J5744J5143J4213J4159J5314
$$ 1043093 1049701 1058380 1068913 1080522 1092929 1106590 1121709 1137453 1152596 1166809 1180968 1196282
$$ [...]
##END NTUPLES=NMR SPECTRUM
##END=
