##TITLE=AC1439_TOLAH13248_7790592_PwNFgrWFyy
##JCAMPDX= 6.0         $$ Bruker NMR JCAMP-DX V2.0
##DATA TYPE= NMR SPECTRUM
##DATA CLASS= NTUPLES
##ORIGIN= BRUKER
##OWNER= Administrator
$$ 1.72 TOPSPIN		Version 2.1
$$ 2013-04-16 20:48:05.378 -0700  Administrator@X
$$ Compression mode = diff/dup
##.OBSERVE FREQUENCY= 400.02188249412
##.OBSERVE NUCLEUS= ^1H
##.ACQUISITION MODE= SIMULTANEOUS (DQD)
##.ACQUISITION SCHEME= undefined
##.AVERAGES= 8
##.DIGITISER RES= 22
##SPECTROMETER/DATA SYSTEM= spect
##.PULSE SEQUENCE= zg30
##.SOLVENT NAME= COFFEE_meoh
##.SHIFT REFERENCE= INTERNAL, COFFEE_meoh, 1, 14.98509
##AUDIT TRAIL= $$ (NUMBER, WHEN, WHO, WHERE, PROCESS, VERSION, WHAT)
$$ ##TITLE= Audit trail, TOPSPIN		Version 2.1
$$ ##JCAMPDX= 5.01
$$ ##ORIGIN= Bruker BioSpin GmbH
$$ ##OWNER= Administrator
$$ $$ E:\/data/COFFEE/nmr/AC1439_TOLAH13248_7790592_PwNFgrWFyy/10/pdata/1/auditp.txt
$$ ##AUDIT TRAIL=  $$ (NUMBER, WHEN, WHO, WHERE, PROCESS, VERSION, WHAT)
(   1,<2013-04-16 20:47:58.425 -0700>,<Administrator>,<X>,<go>,<TOPSPIN 2.1>,
      <created by zg
	started at 2013-04-16 20:46:52.144 -0700,
	POWCHK enabled, PULCHK disabled,
       configuration hash MD5:
       33 CF 6A 21 5C D3 B9 40 6C 15 AA 8D 27 A2 4F 13
       data hash MD5: 64K
       1D 37 04 4F 2B C2 7B E7 C9 5D B6 18 66 6A 92 F3>)
(   2,<2013-04-16 20:48:01.456 -0700>,<Administrator>,<X>,<proc1d>,<TOPSPIN 2.1>,
      <Start of raw data processing
       efp LB = 0 FT_mod = 6 PKNL = 1 PHC0 = 0 PHC1 = 0 SI = 32K 
       data hash MD5: 32K
       02 B0 98 3E 64 81 11 7E 97 32 3D DF F1 FE 4E 07>)
(   3,<2013-04-16 20:48:01.753 -0700>,<Administrator>,<X>,<proc1d>,<TOPSPIN 2.1>,
      <pk PHC0 = 99.11316 PHC1 = 0 
       data hash MD5: 32K
       C1 07 FD C6 4A B3 02 95 BB 68 46 80 F4 1E 0D AD>)
(   4,<2013-04-16 20:48:01.863 -0700>,<Administrator>,<X>,<proc1d>,<TOPSPIN 2.1>,
      <abs ABSG = 1 
       data hash MD5: 32K
       F1 1D 7B 9A 96 2B B4 8F BE EF 05 2A 51 CC B8 F9>)
(   5,<2013-04-16 20:48:01.956 -0700>,<Administrator>,<X>,<proc1d>,<TOPSPIN 2.1>,
      <abs ABSG = 2 
       data hash MD5: 32K
       2B 9A 65 8B 5E 0B C4 44 33 E6 A5 9F 3F 2E CE 84>)
(   6,<2013-04-16 20:48:02.034 -0700>,<Administrator>,<X>,<proc1d>,<TOPSPIN 2.1>,
      <abs ABSG = 3 
       data hash MD5: 32K
       46 BC 4E FA 37 F7 83 BD E9 1F 28 D8 77 F9 8D 4F>)
(   7,<2013-04-16 20:48:02.113 -0700>,<Administrator>,<X>,<proc1d>,<TOPSPIN 2.1>,
      <abs ABSG = 4 
       data hash MD5: 32K
       95 4F FD 1D FD 6C 6C BF 3C D9 8C F1 04 04 B5 81>)
(   8,<2013-04-16 20:48:02.175 -0700>,<Administrator>,<X>,<proc1d>,<TOPSPIN 2.1>,
      <abs ABSG = 5 
       data hash MD5: 32K
       03 24 74 8C 06 60 78 5E 5F A2 CE F9 37 5C 5C F1>)
$$ ##END=
$$ 
$$ $$ hash MD5
$$ $$ 43 B3 0A 60 B3 30 15 39 17 D0 C3 0A 25 51 53 8A
##$RELAX= 
##$RELAX= 
##$RELAX= 
##$RELAX= 
##$RELAX= 
##$RELAX= 
##$RELAX= 
$$ Bruker specific parameters
$$ --------------------------
##$DU= <E:\>
##$EXPNO= 10
##$NAME= <AC1439_TOLAH13248_7790592_PwNFgrWFyy>
$$ [...]
##$TP= (0..7)
150 150 150 150 150 150 150 150
##$TP07= 0
##$TPNAME0= <>
##$TPNAME1= <>
##$TPNAME2= <>
##$TPNAME3= <>
##$TPNAME4= <>
##$TPNAME5= <>
##$TPNAME6= <>
##$TPNAME7= <>
##$TPOAL= (0..7)
0.5 0.5 0.5 0.5 0.5 0.5 0.5 0.5
##$TPOFFS= (0..7)
0 0 0 0 0 0 0 0
##$TUNHIN= 0
##$TUNHOUT= 0
##$TUNXOUT= 0
##$USERA1= <user>
##$USERA2= <user>
##$USERA3= <user>
##$USERA4= <user>
##$USERA5= <user>
##$V9= 5
##$VALIST= <valist>
##$VCLIST= <CCCCCCCCCCCCCCC>
##$VD= 0
##$VDLIST= <DDDDDDDDDDDDDDD>
##$VPLIST= <PPPPPPPPPPPPPPP>
##$VTLIST= <TTTTTTTTTTTTTTT>
##$WBST= 2048
##$WBSW= 25
##$XGAIN= (0..3)
0 0 0 0
##$XL= 0
##$YL= 0
##$YMAX_a= 606627
##$YMIN_a= -517712
##$ZGOPTNS= <>
##$ZL1= 120
##$ZL2= 120
##$ZL3= 120
##$ZL4= 120
##$ABSF1= 14.98509
##$ABSF2= -5.573092
##$ABSG= 5
##$ABSL= 3
##$ALPHA= 0
##$AQORDER= 0
##$ASSFAC= 0
##$ASSFACI= 0
##$ASSFACX= 0
##$ASSWID= 0
##$AUNMP= <proc_prof1d_extract_pilot.lims>
##$AXLEFT= 0
##$AXNAME= <>
##$AXNUC= <1H>
##$AXRIGHT= 0
##$AXTYPE= 0
##$AXUNIT= <>
##$AZFE= 0.1
##$AZFW= 0.1
##$BCFW= 0
##$BC_mod= 0
##$BYTORDP= 0
##$COROFFS= 0
##$CY= 15
##$DATMOD= 1
##$DC= 0
##$DFILT= <>
##$DTYPP= 0
##$F1P= 0
##$F2P= 0
##$FCOR= 0.5
##$FTSIZE= 32768
##$FT_mod= 6
##$GAMMA= 0
##$GB= 0
##$INTBC= 1
##$INTSCL= 1
##$ISEN= 128
##$LB= 0
##$LEV0= 0
##$LPBIN= 0
##$MAXI= 10000
##$MC2= 0
##$MEAN= 0
##$ME_mod= 0
##$MI= 0
##$NCOEF= 0
##$NC_proc= -8
##$NLEV= 6
##$NOISF1= 0
##$NOISF2= 0
##$NSP= 0
##$NTH_PI= 0
##$NZP= 0
##$OFFSET= 14.98509
##$PC= 1
##$PHC0= 99.11316
##$PHC1= 0
##$PH_mod= 1
##$PKNL= yes
##$PPARMOD= 0
##$PPDIAG= 0
##$PPIPTYP= 0
##$PPMPNUM= 2147483647
##$PPRESOL= 1
##$PSCAL= 4
##$PSIGN= 0
##$PYNMP= <proc.py>
##$REVERSE= no
##$SF= 400.02
##$SI= 32768
##$SIGF1= 0
##$SIGF2= 0
##$SINO= 400
##$SIOLD= 32768
##$SPECTYP= <>
##$SREGLST= <1H.CDCl3>
##$SSB= 0
##$STSI= 32768
##$STSR= 0
##$SW_p= 8223.68421052631
##$SYMM= 0
##$S_DEV= 0
##$TDeff= 65536
##$TDoff= 0
##$TI= <>
##$TILT= no
##$TM1= 0
##$TM2= 0
##$TOPLEV= 0
##$USERP1= <user>
##$USERP2= <user>
##$USERP3= <user>
##$USERP4= <user>
##$USERP5= <user>
##$WDW= 1
##$XDIM= 32768
##$YMAX_p= 471317142
##$YMIN_p= -687428
##$CURPLOT= <Network HP LaserJet P1505>
##$CURPRIN= <$Network HP LaserJet P1505>
##$DFORMAT= <normdp>
##$LAYOUT= <+/1D_H.xwp>
##$LFORMAT= <normlp>
##$PFORMAT= <normpl>
##$SURQMSG= 1
$$ End of Bruker specific parameters
$$ ---------------------------------
##NTUPLES= NMR SPECTRUM
##VAR_NAME=  FREQUENCY,     SPECTRUM/REAL,   SPECTRUM/IMAG
##SYMBOL=    X,             R,               I
##VAR_TYPE=  INDEPENDENT,   DEPENDENT,       DEPENDENT
##VAR_FORM=  AFFN,          ASDF,            ASDF
##VAR_DIM=   32768,         32768,           32768
##UNITS=     HZ,            ARBITRARY UNITS, ARBITRARY UNITS
##FACTOR=    0.250966925370066, 1,           1
##FIRST=     8223.43324360094, -255129,      82411
##LAST=      0,             -10496,          -49339
##MIN=       0,             -687428,         0
##MAX=       8223.43324360094, 471317142,    0
$$ Real data points
##PAGE= N=1
##DATA TABLE= (X++(R..R)), XYDATA
$$ [...]
23858 160774 35214 65738 63848 -60597 -111223 210647 196003 257520 248045 32286 61459 15800
23845 260129 -96537 178141 -131686 120634 97289 -57920 -107847 -109041 86029 191417 177334
23834 177334 18237 200484 -18273 -202532 52840 26965 22048 -47271 -345069 19551 -477333
23822 -97012 313552 22100 142199 -35548 -302719 -292537 -285376 109697 186033 14904 23600
23811 23600 21716 -158159 -4861 -8984 -114220 76264 -317270 74196 342028 69547 126044
23800 126044 -106834 -73548 77436 44984 350895 229407 -16850 -70479 -199671 -116367 -165942
23789 -165942 -131543 -30608 11359 85305 177583 129672 -130418 -313892 109860 59782 -52132
23777 -103391 -35982 274771 -384963 -40538 97941 1801 68619 53942 -73374 -131349 64025
23765 -95593 -155723 -500507 -242841 -80914 -160615 7974 -53279 233516 99875 -276436 -19116
23753 -252674 -172951 129311 122840 41894 -160758 30720 -81613 -119254 310459 -9292 10558
23741 3552 -288840 -147439 58200 247052 -96660 26153 -88300 -161803 159391 176098 -63498
23729 176423 -76326 67818 -126851 11148 20319 72978 -130791 223478 -140617 -136232 -24074
23717 150503 157348 118398 -111537 -71977 11236 -198343 39972 -34635 -345498 46311 2644
23705 10636 178779 -108979 -69377 -118779 -191595 182906 120902 100040 151085 -194503 -46194
23693 -136645 -5130 -77672 -104147 -188717 60510 78827 117065 -130981 -206763 -133558 -180275
23682 -180275 -225102 36880 -98834 -220083 -291071 151392 -137522 -113730 345116 -117170
23671 -119674 215011 57808 -3510 95140 153428 -110285 67093 172217 86571 -74270 244655
23659 -22021 158629 -56477 332116 161255 81017 -313725 172275 203056 -281239 -29740
23648 62822 233673 -97926 62297 -110118 51125 -64807 101034 -373269 104498 -90799 -31607
23636 -61308 60669 171077 50606 86639 198042 -27680 -438312 -229391 -241314 -105732 121310
23624 -260158 -50029 27425 41073 -261893 115565 -10068 55010 -177543 12202 310295 -223973
23612 70612 -52 127493 -24147 39145 198534 293858 -130670 -95869 -303841 -106784 -62218
23601 -62218 37689 -198232 143811 -98507 255692 -139089 -9501 151020 -93285 184693 -231000
23589 -81796 144085 155600 197948 244558 -357927 186436 -101619 -127709 90770 -73469 158317
23577 -88357 274128 -403250 -168303 -20967 -114317 -75732 -196258 175 -231707 293327 -162234
23565 -83564 39547 189958 479071 -155415 -12170 18119 18360 -71961 76185 -173172 -375217
23554 -375217 162615 27928 -168774 294998 233905 23944 43656 222573 71848 -157853
23543 -21415 -192025 -69343 254635 -58357 -9109 -36838 -182898 205921 -157124 -38145 26756
23531 18018 22807 -107698 80388 -218026 -432033 39289 145607 111381 -204562 -217345 115931
23519 365359 -328785 -161328 120695 -311326 -92081 483561 -329625 -191901 -33045 241529
23508 -52427 -44073 -12246 370298 -206691 -195874 135803 142134 -314920 -16098 -170891 1193
23496 -68633 -65935 -15589 -139079 -265649 -228280 -633575 16442 -171776 -189088 -318957 -76395
23484 100772 -58895 -278947 -1521 399384 -40520 48298 309880 180747 54997 45487 182095
23473 182095 5085 -152158 -209108 203491 241503 77577 31257 -224823 -143395 87567 124218
23462 124218 59231 -161121 143118 -36742 -238847 -75602 -131015 10868 95421 -117786 -179351
23451 -179351 212061 -3237 -160547 22703 87907 -107315 3749 -83905 -358979 300623 367327
23440 367327 313001 -210835 178203 125648 215745 -60351 -18665 188161 155969 -131198 -402585
23429 -402585 -351492 -52310 -57660 346219 -94298 8978 73894 102251 66979 155535 -164819
23417 -129065 181123 -113935 4218 242340 -216161 260865 103883 -128591 -343825 -139409
23406 -36772 -94269 461553 -95952 -4693 -548389 -250943 -146935 -54452 -130028 -204286 40753
23394 -50528 -458474 182539 202212 -76352 79948 -260833 -147415 -125272 -137667 272302 -30366
23382 161446 -56604 80306 75489 28798 -354048 -27861 60462 -10167 -107166 -230450 -8003
23370 84090 91696 140302 -29645 -417126 -48248 -80766 -107558 98433 -121948 102372 -99653
23358 12378 52189 117196 17376 225162 -122247 139249 -267117 -71094 15621 -37695 -195285
23347 -195285 -150926 -14955 73651 -123440 454082 -100979 90935 21244 -195824 -70338 -75639
23336 -75639 127704 -190812 -119554 7567 416536 231006 -282313 269624 62921 14264 180104
23325 180104 -247486 -28255 191209 15267 -311516 -72335 -156209 93119 -208567 -23111 300208
23313 -83572 -372318 -119037 56774 127307 -79239 167109 287761 -139463 -274238 15694
23302 102580 -74981 -77382 155950 -44272 81599 -13039 113962 94567 -13160 -140910 268139
23290 394996 -337497 209218 277396 -46620 299162 -69697 443427 -71714 -105250 -136664 46914
23278 364863 113888 -66225 88965 157406 -202887 -180747 67918 234982 -62000 -30473 73556
23266 9518 154902 -386853 -258756 -138075 -11641 35092 292227 -65900 185541 -84324 114706
23254 -96253 160165 119464 223792 -73981 45861 -74207 -7994 -210742 -197685 -94489 20385
23242 46470 225923 -227508 -281142 150273 -29680 144625 -51069 -56363 -19967 203451 320123
23231 320123 47926 -266321 -131681 -41841 -24431 49805 -131221 43239 -336934 -76073 207231
23219 202632 -171346 -59085 -23359 292785 -23270 36768 263608 -40673 -302258 -435153
23209 -435153 -297921 66927 20938 47034 -26574 -25879 -124460 40174 -320010 -222175 -265049
23198 -265049 109825 54026 90878 93454 -19438 -317427 58719 109336 235733 -60039 37924
23186 258164 -98923 -33932 286596 -253483 270439 8081 88753 -37840 124291 -102061 192170
23174 208650 7674 -281582 118104 -197581 34723 273227 192248 -112530 -160306 110747
23163 -23489 -160385 -27095 -375727 81503 -87280 68612 130038 181828 250384 -110884 -9176
23151 173778 82536 21940 -152821 165135 -20107 -83354 108901 -73888 167061 -41637 124006
23139 -213651 -144690 -352042 87206 97745 120618 -69482 161401 -60725 13898 28736 -46903
23127 -200634 -19951 -332482 -58528 -139950 -139272 -76505 -131512 -35918 95498 17496 -61421 102462
23114 81431 1768 -63715 -253972 127884 -400794 -41960 281883 116663 18634 -10805 -34584
23103 -34584 83127 92575 -130280 -205116 -200760 -254104 -50377 -247895 -204386 69379 325418
23092 325418 -147657 -32549 169845 -267721 14585 146799 178139 158262 249321 -19138 204356
23080 -6227 -260460 131774 -86138 -417086 -40710 22278 22204 -141832 -163113 401478 -178565
23068 -237821 -40369 270614 -72237 191728 106078 -197394 -50919 116831 -58924 -171401
23058 -171401 -148122 -15195 -290138 -145486 162375 43199 -212120 45040 -164666 -100520
23048 -100520 7640 27131 337997 -331356 57281 -152647 -125458 220530 -130408 93977 -184434
23036 98256 59873 -68473 156032 98186 10741 -214169 -69506 69460 -47892 437919 -85433
23024 -61811 202841 151981 -31221 -361098 266538 222827 -62615 227478 -59709 -40241 -25370
23013 -25370 142398 -455748 -101156 -140970 286825 -54143 -106810 -113014 -161791 114505 10617
23001 50500 -191165 88913 -277098 -423974 343953 -255527 99057 76461 -195602 -74690
22990 -75676 186662 -1626 149612 166210 191182 -91601 -78826 108450 -227087 -305923 -133218
22978 17485 -143781 -61299 55622 -52161 91363 176996 -172534 36960 40201 84067 -215434
22966 -176191 389396 -32232 44617 203682 4948 -45298 199153 148454 -109221 19959 -302379
22954 22771 -292799 17136 -229182 -478917 -98577 -258676 -101435 71218 29396 -416175
22943 -139172 90093 311575 -141009 45424 245157 93461 19745 -26301 -362520 97072 43766
22931 304455 -123624 298611 125015 -33040 -111236 -12239 188919 -2435 84655 247079 63951
22919 -325804 -64773 -19017 -150090 -52827 17854 122654 -182390 -72248 -266955 257902
22908 330673 208852 -125009 -81022 -238226 -226743 -153020 175863 -176242 223513 190333
22898 190333 -56111 -384276 105816 7428 -133714 -356044 164773 199021 94463 -23762 1010
22886 363376 -35819 78497 -161930 -88794 -313600 198425 294167 -102838 238119 -123931
22875 12872 120677 119066 139362 20354 3891 -27569 -274928 -286135 161490 43855 33377
22864 33377 -229309 -261997 21741 -149276 -21674 -269587 37907 -227620 -202467 -157693 212758
22852 -81079 222915 -317911 -152836 -268463 135858 -23935 -97954 -28521 -57306 -18194 87410
22840 83611 -183615 -318204 -231810 186637 -8562 -125184 198051 -153462 -210693 -60012 -76491
22829 -76491 126933 152213 -30862 -81185 18894 -137400 -368559 -158441 188750 -177316
22818 102527 -202590 155062 55524 -54887 289691 387257 -146048 8206 5211 -12982 -398487
22807 -398487 183613 -135109 -96241 199939 -46793 5660 76541 -171850 -111813 -198652 44703
22795 -70582 -154961 117096 -103847 253795 -98383 267700 -147939 -133510 -96072 -157340 -119293
22784 -119293 -143670 -160215 242872 -99979 141536 459889 147180 137812 299938 -148034
22773 114176 119167 80682 131570 -532063 -37680 417402 -80216 446471 -10970 124244 70134
22762 70134 130368 147983 190395 147511 72657 153780 -108266 -382662 -112276 98373 -116174
22750 -10729 -122385 122805 33129 -27112 270930 264473 -178187 148017 -215690 8489 -126136
22738 237628 -191668 -241877 -122916 -322252 249638 -364414 24388 168458 99217 -86998
22727 17439 -198391 103614 -34755 49292 -78838 -42145 319791 -106150 1879 252263 -72050
22715 -245579 -102245 19345 -62803 -37678 -317377 12761 166161 -46486 79243 -7608 15927
22703 46653 104103 -53782 -70634 -32433 53901 100264 16892 -115168 -226673 -34749 -177431
22692 -177431 -66855 -45669 -46853 120603 388571 -388059 -167101 -256921 54260 -120745 -87616
22681 -87616 107336 -294515 109848 -257581 -249910 -132254 178012 -657842 -67687 157363
22670 -173902 -148025 -33742 -417732 64072 -51746 196959 29938 -445931 230360 81639 -262824
22658 -270257 -2083 -232299 1629 -173676 28011 -45121 -14313 43395 -453126 104332 -234092
22646 82059 117940 17829 199637 239328 -215551 57327 171219 153190 253074 -33423 -126482
22635 -126482 -61595 215706 -156618 -51398 -221394 -62319 -139513 401519 -397438 13178
22624 -344906 7561 -272225 128437 -45496 -38256 -170582 -18008 61323 1672 -131526 -109425
22613 -109425 139727 -122207 11146 40384 -113388 -177879 49793 86605 38312 67053 131548
22602 131548 230076 -98744 -14807 -156648 116500 66012 -378223 15885 -274436 -31264 -137949
22591 -137949 -176449 147740 -31773 276281 382631 136650 -714 -123147 -102584 25413 94239
22580 94239 55516 226468 214409 16214 86581 -36696 175227 -60269 312140 -39717 -77451
22569 -77451 -237386 -158443 395258 -88188 153631 -85268 -68898 78271 -59490 -87973 -185988
22558 -185988 -102064 72192 -322318 -201659 -360716 -108409 40039 104099 -268553 -223223
22548 -223223 11003 239718 -129191 42588 -41457 -337692 -93900 -146965 87631 -280854 -2517
22536 113808 -319552 186096 147982 -57072 -194073 118080 -94477 -159756 4602 248287 142877
22525 142877 -71548 131320 74210 172940 -381030 -143700 221735 -284228 -141612 -67978
22514 91713 -91654 216820 -62700 49161 -14556 204268 -101968 122973 -287039 17037 356717
22503 356717 205982 -119918 194031 -64416 -136921 -71612 -148679 -140107 244802 -229661 -64927
22491 -191891 -242797 34552 118161 211580 -67129 -9859 -135583 -10536 25335 129759 -88028
22479 -94598 231992 45668 -75738 -132329 166558 26575 158890 -57963 -156947 -155965 -221831
22468 -221831 92066 -571 -318840 77588 -48471 -139876 -21532 -77452 -28132 -121380 -203050 -137986
22456 -137986 -49922 -275541 -109603 -237937 -44704 -121483 260779 -41084 236303 145554
22446 145554 -86662 -23929 106563 -252234 41852 138624 -19242 -152990 -184610 208686 106833
22435 106833 -60736 -120706 -345190 -13700 85559 205567 127603 86093 155486 91857 -316720
22423 4198 -161583 -154184 108222 93040 44515 -60683 -110734 -59058 76325 -361699 -40296
22411 190035 155676 -192623 -60829 -196916 53851 -310165 79144 -92119 33952 -169166 90476
22399 -72848 128719 105216 -62161 -214964 -203133 -226285 -122525 -62158 2760 253492 76278
22387 132305 60909 -86957 -243423 106536 12182 206145 -37265 -16711 -72438 235810 74576
22375 -334233 -59581 14716 105559 -37052 -521478 424870 -101754 -90840 34024 -455658 71595
22363 122591 -188891 -74 -262121 18129 -132186 -45014 -57681 252257 141849 64327 -18000
22351 127557 215815 172677 -127490 142946 -8308 281189 -353277 -263759 9460 82829 -32293
22339 -188908 -238146 242113 -305732 -44035 132074 596833 79179 -114606 143453 -93989
22328 97829 -92596 -198154 -174877 58056 193989 17190 286834 -163497 142886 -193142
22317 30890 -142380 226162 -61251 16994 226760 129032 -158176 -92023 -112299 231473 40793
22305 79614 338251 309134 -114671 91488 -157492 -113911 131567 62166 -27009 -72494 198842
22293 -249563 146915 -142410 41578 110366 94548 -28971 -219170 -491 40714 -159120 18109
22281 62782 463874 -40522 -379642 -126108 -318233 -33741 5427 -239771 60350 -30504 34787
22269 -204718 -231540 -286080 -170556 158773 -116173 236446 80308 -154564 36289 -306956
22258 272619 -121951 -249243 -166808 6883 54296 -91704 -50186 -312057 -88246 -156706 -8921
22246 -175142 15727 -225560 192462 -257435 -254195 32161 -139929 -202354 -331965 182389
22235 110094 -279428 -238158 -452362 -242334 -64442 32091 255775 -178011 5638 241078
22225 241078 67142 41700 -68058 -73235 -19117 -297682 202918 -20933 -112192 -182052 -143501
22214 -143501 -67957 -164939 -267310 -78582 -271595 96148 128708 -25791 9789 214548 -212295
22202 217808 -26596 -20388 -118727 -208754 -26670 -351721 135146 -194419 -35065 2806 51904
22191 51904 -164723 -90835 105947 205980 -372423 -201314 -168112 64153 -188119 134475
22180 -146207 -48580 46559 141302 -225464 -139212 -87867 -159939 91916 -57851 16794 132664
22169 132664 58963 190453 -25595 219387 -62237 -24855 -20365 125082 144921 60567 -62266
22157 -238538 -374558 58957 -900 153540 -187077 -37399 175945 -73968 52537 -213193 89119
22145 45497 -81576 -106165 163350 -301634 129027 -51131 -134698 -109597 169464 -15049 -258427
22134 -258427 110335 -98996 168019 64383 69465 -214787 -147360 87729 -244076 2109 -87118
22122 -195773 -24704 122728 -47891 -261459 461107 -65705 -4383 -460833 124310 -178050
22111 269823 -121263 203770 94244 22643 -35483 -269258 -95799 -6278 153854 -82659 134113
22099 59673 51729 -207229 -48470 -35564 -12793 -355829 -196763 -49044 -149565 68057 -21669
22087 -330126 -237056 -85465 433546 129092 12137 -305196 -106196 -347433 149113 -85659
22076 -120810 70621 -126965 -258176 151104 -75787 -150989 117355 -84591 282727 202143
22066 202143 -209161 -211034 16186 -124916 268726 -300417 -39888 -158073 -52889 258035
22055 -105472 -285729 131698 99237 -164706 40674 -72553 -245933 23888 -25327 -7258 -19264
22044 -19264 -40541 101859 109107 28385 -316421 -37451 -109018 -50222 -132335 -43977 -303617
22033 -303617 146794 89089 -3077 -199005 -304898 294655 -15458 149487 337542 -92619
22022 -57157 -34052 -65411 -143594 16257 197743 -17711 -175373 -53377 97414 -94092 -92067
22011 -92067 -229578 135704 -182239 -26625 -170814 -40420 -100929 -116780 -205244 10527 -60419
21999 87265 -209832 93370 -56431 -138032 -97789 -204073 -142249 179488 -631658 -335990 -2710
21987 -275906 198592 62979 76826 99071 -214938 -213620 112307 -25482 -52735 -61178 223946
21975 -87940 -169792 -110097 -408882 -93567 43796 -30930 162273 -269626 -71655 184541 -509593
21963 -53350 124801 -92625 -111299 -61513 -159865 -42737 66999 -83751 -97684 -321674 380788
21951 -343545 -265212 -18865 173040 -118477 304256 229992 226217 -212804 -64130 293085 -208707
21939 -5459 213748 64738 -175693 -510610 -138254 -270773 -46409 -118650 122735 -221108
21928 103348 97741 -158181 133509 -20895 -190170 -122741 -6197 286573 -219611 157149 -12248
21916 -180650 -54145 175815 76646 -28446 230676 38267 -145496 -110373 276465 138266
21906 138266 9284 286290 -225264 -77035 -185369 258741 -23625 18661 74007 103634 -152272
21894 -22915 -79279 -275780 -168974 137430 -38705 146022 46338 18458 -161585 69549 -23810
21882 -24542 -203231 109619 327172 -5340 -27646 -513740 -122646 -9077 -40314 -61703 4525
21870 -7937 41404 -59503 46954 -323777 90111 -291930 5323 23611 -184427 -126829 266427
21858 81776 -404608 -23194 -28744 -195274 -264060 252522 -128412 -71697 -273838 -282919 -218007
21847 -218007 118336 338070 41882 84338 5576 160569 -74687 513665 -206333 -193169 84478
21835 -190300 -18190 -132781 131429 199947 124888 -428862 13969 19749 -434645 152154 -117797
21823 -362461 -62912 29496 -47192 -218175 159102 -113070 -236297 -149882 -255401 -186509
21813 -186509 -200156 108843 -9914 6459 -155565 -166496 295733 22378 222442 -83833 90879
21801 129612 -259591 -218654 -74693 -180730 48413 -368160 81087 84134 -34280 131081 23642
21789 -69828 837 309225 94680 71836 -337329 63233 -277260 169031 -110890 3621 -380167
21777 134059 22323 -259110 13525 -90770 -30203 17092 -162573 -253215 309264 25541 -93638
21765 -79502 147987 105507 -39443 17943 70865 246866 -53963 113291 134822 -137552 -414348
21754 -414348 -179220 308157 -32452 -117744 -22738 -70931 230494 200534 -323806 25369 248537
21743 248537 9780 140231 217022 -135466 4378 -189917 41943 98589 61272 273819 -214112
21731 60754 251436 -26429 -76946 -103936 -62408 -9861 53664 23613 116962 -219173 70187
21719 -2831 104902 63972 99433 222218 81464 -105644 184024 -94799 -39020 -2392 -17940
21708 -17940 38713 -1683 235384 -97426 -7674 -28487 12188 -51432 -20239 16125 -86900 -236298
21696 -236298 140098 105156 5998 9634 308750 40984 46486 82426 -368331 203951 -263027
21684 169831 -63802 44224 -71082 -201252 -81779 214565 -73619 135589 -144141 342517
21673 287866 -57529 -169256 -206610 20342 -57749 -234615 67369 140020 -34883 72573 221712
21662 221712 -206117 88072 -336794 -67791 -47029 117430 262946 -72544 411449 210399
21652 210399 25235 132330 -101769 121409 -41126 -155694 37871 -101357 166849 98548
21642 98548 -295709 -221387 85953 151303 295654 -118218 81987 -11526 -74636 -185224 -285343
21631 -285343 -337146 60434 -98609 128495 108577 -128168 -55607 -93299 -532514 -167549 -149780
21620 -149780 110137 427288 338488 285042 -221482 156848 -25614 2939 -113617 41802 199958
21609 199958 -354235 29585 -234834 -295117 -208492 88303 -370092 -79361 229652 40724 70075
21598 70075 228849 -205754 -45220 101957 -55610 3364 -155354 -26183 289118 -77395 -335451
21587 -335451 -418961 -59233 157006 103768 224230 -54877 -217623 -200178 -21815 116603 -145878
21575 -317020 -305974 -187485 -297212 333534 -268020 -32679 177369 -341830 46621 -438184
21564 -341322 -94781 -353963 -23347 -280766 -197066 106881 225331 -147379 -67232 89626
21553 -107198 60217 5143 40394 203445 127012 -282734 -235464 128198 3150 -63053 -262056
21542 -262056 87467 8486 -237034 -261239 -210159 -397635 -440385 -129532 -200074 222428 -175615
21530 176543 120531 16272 279173 -234833 26278 -6423 -43931 -149167 62193 21747 309268
21519 309268 -16623 50752 187440 -283252 -123943 -75250 164722 41121 85053 -140185
21508 -183908 158108 -141683 131880 -17330 -121733 20940 -50840 195096 -3460 -161664
21498 -161664 307467 -34993 -66518 -235328 -257145 -232858 -64655 -10644 -310051 12599 -187693
21486 145940 -29828 65004 -1534 -125370 -181203 -358037 -206935 -98790 -27734 80971 139854
21475 139854 -195878 -67251 -60933 -241767 -431542 126258 96258 -40019 -123135 148588 -64984
21463 61964 -266139 -87079 8051 -230114 116688 -149578 -348547 -164735 -95596 26777 295822
21452 295822 -259111 -108074 -97178 -177987 323420 119307 19859 31576 115736 -67604 287580
21440 9717 187138 -5014 181076 -162652 471403 158886 231183 13978 158715 -148120 147311
21428 18090 -107873 78200 -218174 88488 178287 85155 83098 -57037 -453036 30247 1584
21416 61866 93264 106310 92646 -115849 -259772 27824 -140435 7914 -226522 -178669 -27608
21404 -83099 28754 274141 -171866 303271 -174801 -139196 -32810 -142337 -303259 -180860
21394 -180860 40382 -205271 101387 -42005 -58978 -199000 4947 -390458 -126443 189535
21383 -294553 -343935 138388 69898 -216857 90362 -241262 50043 -226562 210749 -120989
21372 -40356 -154138 -58496 18269 -105274 -29997 229908 -205788 13698 57562 41894 40752
21361 40752 -266618 230418 29888 96236 -156672 150656 165145 -61351 -123758 7800 -209723
21349 -232510 -119189 -185611 -144154 -305869 -35530 -56838 -97648 -92753 -428737 339337 -254268
21337 -114155 272608 -491234 -36382 -6189 -98655 1917 -142862 388272 -23851 -285145 -281198
21326 -281198 159887 -285363 -247183 -189544 81494 -198056 58494 338348 53791 -93710 -99695
21315 -99695 -279324 -309720 122445 -11690 185996 -33619 -83702 -184988 -340898 35344 94897
21304 94897 185401 99739 -140419 -116499 200344 -38096 -243007 -124553 10765 312456 -36509
21292 168272 -168036 62449 -56138 -116341 -19621 121072 -246399 240000 -30686 -39931 -123797
21281 -123797 -124948 268439 -12213 78014 -305100 141023 -95124 -191653 27063 -263775 59335
21269 -65491 -234691 102116 -285332 -262117 160813 177970 57320 -276250 196311 -49002
21258 -32557 -133663 -290863 -28583 30590 76561 31659 -23383 -56942 -682 55620 3463 60644
21246 60644 -164631 231512 -21534 -23188 -233069 14993 -280681 -215806 -85509 -420547 -22202
21234 -295092 -159555 122125 387388 -356876 161290 121512 -83227 -50981 7934 111682
21224 111682 -82357 -253937 -46360 217943 22574 -244627 104503 -19174 -117615 -63625 74112
21212 117826 308895 140873 -146475 -35616 18881 -204595 -166086 -47203 94287 -55853 -308191
21201 -308191 114582 -79447 280884 56043 -168441 49476 78103 -101584 -15726 178038
21190 141707 -336426 -11040 -86060 -138512 -236948 -150099 -123842 321142 -258626 -152005 -86505
21179 -86505 -160864 -110370 58803 120152 32395 -123628 -25513 95101 -113645 -39930 -115818
21168 -115818 -89247 31456 -11085 -46013 -220796 46653 10506 89771 -200318 34542 -131961
21156 -68884 -519786 88630 52447 9401 -311558 -21564 115827 22625 293522 -15931 -95592
21145 -95592 -18635 92412 -357465 -276165 -118071 425900 -288739 23629 75339 -180906 -136614
21134 -136614 -41334 52465 -435149 -47782 261933 -105851 226624 193375 86301 6727 -19302
21122 87593 -262695 -165777 84284 10356 -252080 -71634 33176 128396 55775 164152 -101722
21110 -57098 -80119 208698 -110794 10107 29294 -415731 -237019 -23827 -327390 231524
21099 35851 35989 -105031 83745 -143275 -91685 11230 -253353 40268 -136297 -271529 -162069
21088 -162069 -386426 -358459 -150479 -24540 185676 -12616 -150421 -151145 -140310 -177671 32062
21076 -133773 101421 -36721 -152009 333858 -292240 -215111 -145901 -383208 -123043 -158440
21066 -158440 49014 178966 163378 -73141 -245978 -42924 -141600 -203830 172662 -3436 193995
21054 32446 122356 -41686 39805 -310701 -32914 -263201 -146229 241913 -243497 -44198 -20875
21042 106852 -155286 87841 37746 -91352 -22383 -243694 -103261 30486 -79561 6784 -304693
21030 11549 253090 83199 80856 109515 -125271 -130787 -179165 69422 50824 -144521 168499
21018 -58490 -50147 -88038 265210 2834 31648 -59495 114986 -75564 -275965 5560 -310410
21006 20878 -188808 227585 -243081 21351 -249936 -112726 -327276 305358 36370 140026
20996 140026 44818 149734 -203108 -192048 -168162 -71644 57 -15461 39185 -84216 -40118 -22433
20984 -22433 -64658 67559 -173237 45747 327657 331503 -49299 293435 -274975 -181770 118658
20972 -59932 -44675 95519 168639 -307387 165066 77117 124552 -262626 -336895 -222931 -106126
20960 -79516 -67941 3510 -34863 -32657 -61698 4386 151433 135157 -99285 -291978 54187 -153202
20947 73886 172220 88546 18407 -45905 -166703 153338 66492 54188 -35442 -91647 95073
20935 5151 -52347 -124334 210456 147551 -433351 41721 287676 -109874 123176 90201 -246671
20923 -41870 198994 -87258 -78607 -198378 -92931 36193 4176 236168 -188112 -82897 116590
20911 -95413 -415969 35571 -218077 80474 -142540 -153356 -49993 -150267 52902 97927 -22033
20899 13602 175449 -22654 -420455 -314533 -156008 38569 -165662 -132687 -73420 -366253
20889 -366253 -147564 -423772 -35925 101236 235463 -25105 -4129 -27338 -44200 78019 -216770
20877 10145 -420727 81076 -32696 135293 -144535 358265 148899 -183799 -359403 -86748
20866 159312 69334 -246978 -110824 -32301 -62869 -8187 -178199 -135448 -133707 49201 152312
20855 152312 43891 -79791 -564463 -141471 -270951 30075 37502 291973 23267 -43641 -101697
20844 -101697 42968 95772 -57160 32547 -22557 -75821 -29612 61942 -303146 -103057 -401997
20833 -401997 8802 -82614 -297369 -84389 37269 -148576 72207 -459169 -116293 -40067 -16905
20821 -315890 -306939 -60951 25328 -204715 -363456 -19064 -129692 207889 -490091 -181707
20810 -266147 21605 -286085 13530 16895 -9550 212988 274168 162622 -78851 -71057 7869 -199322
20797 -178670 -19793 54301 -198916 -224700 324101 -191555 -215329 -155139 61325 -156939 237746
20785 278534 113386 -93734 2084 82343 76062 13873 -81234 -599363 -125306 -93008 -122684
20774 -122684 96311 235552 211193 8793 149560 8914 81156 10186 -196201 166478 -180813
20762 -362558 13694 -167265 -199567 -101194 -40900 -4423 192316 107864 103769 -343935 -30891
20750 -350373 -248130 -52036 130474 46852 31527 -61586 217311 131097 -312293 -136073
20739 110482 -215250 -374448 -310458 -149137 -163894 60210 -281003 -278420 -337612 44193 -148915
20727 -6286 64911 -146763 304572 -122130 -176253 -14309 -136766 -207312 -103600 198543 11506
20715 -6114 -174572 -94963 80969 -2368 -155370 -344534 123289 -492646 -309764 3561 -128049
20703 -300403 211760 133278 268991 -69934 -127694 -62927 472 -224216 -110266 -200621 -122469
20692 -122469 -179512 -80896 -308560 178627 -400911 96873 81214 57549 135394 -129565 -308655
20681 -308655 140514 125226 116042 -96283 -79741 65325 -106454 64056 -21061 -204740 -35189
20669 222281 -7453 -200807 294790 122782 -102910 -100811 -76014 205066 -21346 92269 -99413
20657 -25205 335208 6394 162585 73337 62383 18303 -372635 -193009 39572 12576 -10876
20645 -261437 -3069 19832 -151882 144173 -32737 -76584 -55160 -102711 24202 -281786 -254217
20634 -254217 -369939 402124 76373 -123017 250650 -121237 -194380 65399 -147243 -183198
20624 -183198 -113084 -39228 -90992 102661 -179754 -31852 -230040 -110500 -184671 -90692 -102255
20613 -102255 308059 16868 -354877 -48299 -26805 -290626 -309547 71827 -254663 -132742
20603 -132742 11946 -177640 -332707 118460 243980 -26978 -83856 -46572 199131 -171025
20592 45860 -150457 35835 47666 -8657 101659 46490 20852 -75564 32922 -175574 -119314
20581 -119314 105655 3643 -74040 -281009 123962 8952 -33356 -21166 124967 -407153 -328233
20570 -328233 -26750 -1071 -325873 -112330 -114121 20370 -238212 -104090 92311 -50807 -318942
20559 -318942 -229779 -73459 -87403 -292283 173213 87739 -78819 -6001 -153177 15373 174771
20548 174771 -280154 -28690 -186928 95737 -194862 -6002 51693 -112858 -168777 -222221 -3056
20536 44697 420574 -477004 -220164 -378828 -87625 174510 -67939 136672 -288575 100167
20525 -552052 -32732 30005 -68419 -73972 -111777 -889 213280 444391 132092 190904 -382053
20513 -21620 220314 12344 248163 -117639 36654 -61084 -56904 -377884 65133 160475 -14870
20501 -67291 67595 -68100 -118320 -68313 -73966 -113045 -450088 -304082 234482 -88858 38835
20489 237569 100676 -52433 103149 27184 200982 -211852 36610 10289 -30871 -18426 -108594
20478 -108594 233762 -1990 30950 -43944 78027 -11238 -34496 -108423 -75730 -328948 -51624
20466 67287 -111846 -166665 -315204 -42902 33055 107417 -236551 57549 -212535 -48149 -209793
20455 -209793 -81364 257215 -16025 -3093 -112592 129877 -243872 -208935 94244 -348144 -56243
20443 -299611 53038 -146510 -120682 115536 -37546 71547 -166180 -34054 142793 -91633 39239
20431 -153567 -328321 7901 -38887 -294159 -42139 246865 306045 320487 -128543 -582070 104116
20419 109930 6251 28580 -186343 -370201 26058 -54018 -169362 8475 -511621 161975 -381957
20407 100255 85657 215151 -126837 -229491 26758 22906 -9235 114737 -220469 83347 138862
20396 138862 -109148 105611 -98776 -58222 33007 115031 117098 4978 163229 -274713 48694
20384 -5377 148109 -8584 -72039 -181019 27265 63316 99259 95339 -41821 114479 -109392
20372 -155547 -129301 -114827 -499253 -88200 -720 -108101 -101840 200380 -24055 -160238 -175021
20361 -175021 -274106 146106 -131193 48780 -217321 -93060 -145254 -129940 60368 -53142 -45066
20350 -45066 57310 74479 -161189 -219296 -403566 80753 -423303 103514 214401 -150807
20339 -254758 -140070 19673 -34619 -18824 125048 44569 -17358 23880 62458 -12493 -319733
20328 -319733 212185 -361972 26786 3922 -90711 -215658 -63821 15403 -128176 -230221 22139
20316 -153049 -130542 256494 -316583 -43494 -195742 -268952 198112 -180893 -305663 291223
20305 -104957 -149740 -271236 -25483 394846 -225598 2368 -73729 -210169 -193943 -209726 -292812
20294 -292812 -4931 269373 214287 621873 88236 -79705 92099 -177787 -145656 -233881 -149065
20283 -149065 61782 -60740 -39122 -91195 -101472 105850 -303514 -3553 113532 113988 -33428
20271 -120813 54371 57660 157603 -137515 -224074 -289275 -167240 98132 -124002 -42609 199064
20259 -183388 -337006 -55389 -398796 -52951 -91994 -247288 -60897 -20045 -28570 -51687 211835
20247 -301157 -202922 -50501 176153 -125794 -291873 11511 18499 -317442 -262358 125522 -289930
20235 -35800 -289404 -197629 77143 -238366 38177 -180992 95752 -15556 -362429 -120054 -116999
20224 -116999 -273576 -47924 37245 -149877 -534275 -219750 -17328 -38193 -60681 20444 163803
20213 163803 -212938 -132215 -176276 -271244 -55464 184668 -350448 -206553 -4398 122572 -101616
20201 -226660 -104489 -159402 -111855 73884 -93379 -325479 221230 -212707 -138888 87037 39567
20189 81297 -46027 -194845 -376467 -130432 -154242 303303 -12002 -256122 56059 -282533
20178 138106 -289563 78467 -98736 -110409 186000 -16474 -126176 185027 -133037 373180
20167 149241 -107375 -164948 -43625 -224376 252813 42253 72072 -326759 -6840 -144175 -293846
20156 -293846 226999 -39078 -24381 -125576 145456 -129287 243669 185645 -45081 112034
20145 -247340 213617 168044 117048 88094 251110 234731 -350909 -76129 -220472 -228235 218941
20133 211750 -351505 126486 17681 -9367 -142609 361446 58346 -119609 -21400 -280531
20123 -280531 -110856 -21696 -318439 -13392 -418201 -28556 -321903 -120909 -169192 -71666
20112 275665 -105777 80239 -46075 -51813 60661 -228576 -91777 78198 81747 -142887 -216194
20101 -216194 -531160 21216 157236 -244470 -213558 -170276 171485 252434 -15434 359133
20090 1476 59201 -118463 -52213 -73484 -66899 107770 152875 -177078 -161732 -236799 -108124
20078 101321 -169934 -194531 202990 -5856 12578 -396807 -56762 149444 -273023 -43001 196281
20066 -400069 -155020 -219379 13492 118207 -280415 104736 -200586 -213039 -91275 -20920
20055 -129041 239895 -119323 183458 33605 430589 -132495 250947 -208631 -73648 48206
20044 -79494 255263 -186523 -109611 129834 -182399 -204853 49361 -84419 -221472 89212 -75016
20032 -33982 79031 67986 -252970 -173751 -367637 -7165 -62541 120450 -117092 -111596 -312961
20021 -312961 204882 242122 -124001 -58560 56252 -195057 -90475 -108609 -157327 43026 -43059
20009 25491 140779 209736 15789 -79200 -61501 200681 -97377 -81709 52692 340422 -218654
19997 -328234 -136727 136057 285312 -197904 -9460 -195837 185231 -285993 168027 88302
19987 88302 124302 -58479 -225917 -47677 190415 -108504 -108283 33443 258444 -214468 -41113
19975 142479 74369 -152 -89098 -190276 -242497 202937 17161 -166852 -120549 14943 84692
19964 84692 -69905 23132 180249 -11157 -136578 -367678 -45517 -168523 -79567 127718 -125291
19952 71735 127988 135643 5046 210378 179375 214121 -4540 -88924 -93336 -29847 -552527 -291684
19940 -291684 93789 133592 -35403 -7621 -9695 78082 -4767 -167443 131076 -208157 81102
19928 -136237 -94953 -6470 23743 127569 120030 112914 -120869 102228 128702 -110470 39849
19916 -246821 -172110 -149074 49742 -69042 56944 416882 -283278 107876 322448 86696 -28128
19904 -52567 -34243 -443878 251341 -288272 -146633 -31896 -126851 -59900 70817 -635341 -208661
19892 -306223 -140483 -174937 -242739 134249 39326 -301036 -118551 -348990 195509 103660
19882 103660 41293 119616 -157670 -118331 -195545 44196 -41287 103962 -70305 -165814 -112167
19871 -112167 -101116 25917 160704 163001 79750 -28354 -219473 -16178 218509 -327194 26365
19859 -88898 -409351 -296273 -285952 43692 -202665 31803 227844 -368392 -35094 -14204 -116211
19848 -116211 -105065 101135 -285273 -17316 -339080 -252729 -182407 -294787 -152613 -53533
19837 -15544 192903 -109104 -62497 -34771 185956 -144160 49044 35286 133941 -21826 246286
19825 -131225 969 -10880 -77370 -64946 -32221 -115792 231108 15749 -338194 -189792 -302930
19814 -302930 -119078 -136040 -13798 43670 76269 -298850 -140347 -167745 -76773 -180058 -30973
19802 -58739 247949 -404533 -257742 -224037 -182408 -168033 66460 -261783 12077 35309 -171298
19790 -256693 -35477 176071 104745 -32195 -94880 -209845 65393 311061 -142132 -273941
19780 -273941 146998 -83917 123185 84000 129086 -117454 -63840 -179022 -237795 101765
19769 113912 -37501 127693 -208748 -168584 86968 286861 -178297 200771 198191 -47613 -164574
19758 -164574 -127145 -106542 -12720 -53501 -158512 138056 -134949 65702 -32157 -103209 -6636
19746 122225 3183 189568 -293620 -83878 -96771 -248491 -150988 161206 -277264 -238041 123384
19734 156565 -156512 -504262 -394233 -101680 -87860 -2621 -43165 -137799 269897 -61623 163346
19722 292482 -12263 -164933 -211505 -260943 86894 -56513 -309531 123941 -310743 22596 -152791
19710 -184662 195974 515429 -85625 267366 2316 243243 -179016 -341475 44738 -34742
19699 -12781 -230816 -200992 -7273 24475 -213617 -228711 -93543 -325651 -255572 155261 230901
19688 230901 -13348 -18766 -135630 89186 -340041 107814 140532 -118427 70636 -503344 -12384
19676 -478529 -15886 -18352 -203516 -86664 -80661 -80559 -9070 39112 -201735 60135 -303724 84612
19663 181256 -33124 181583 -111881 -102309 -91982 -229734 202857 -95179 4792 -33567 209281
19651 168922 5855 3577 -214371 -152575 -143478 -159207 -52941 60377 231966 -16501 173226
19639 -53420 -166216 207898 -166081 -88446 -303806 -195209 -165114 41386 20575 -230722
19628 109228 163456 374668 -82742 264512 -85646 100765 -194299 412899 -91334 -100248 129942
19616 126094 14638 -308754 102863 104519 -168893 -220015 -181384 9009 63266 -2686 -112585
19605 -112585 20948 81474 53513 -44927 -66509 219990 -206006 92794 -164823 -246706 162933
19593 -169482 17384 10729 -127106 59209 -76983 -188431 -353732 -452120 -337766 50564 -128465
19581 -114582 247455 44043 93494 -10359 105611 -55405 137995 -3184 -28722 -45174 240989
19569 102305 2828 126564 -326409 -56491 156537 931 -293056 69204 62117 -148773 -176952
19558 -176952 -59675 -41361 -160336 -178068 -311708 -265895 314998 -81239 -86667 48517 273544
19547 273544 197934 160111 109335 -128993 -202630 37846 -168204 -190277 40513 -115451 -213307
19536 -213307 -187193 -798 13345 -86732 26258 -68265 19912 162672 -5107 -27773 -427117 -52634
19523 139302 82565 -189303 -184696 -155100 -262277 186745 -13750 144286 241539 -267866 132944
19511 297824 -83114 -60423 -72031 -9602 1512 -43834 -158108 -38144 -247702 -152936 -90898
19500 -90898 289010 25558 -101364 -89789 -121852 -49568 -199614 -208697 -24715 -126258 -198706
19489 -198706 -432324 -185208 -82584 73091 40495 230886 166529 68460 -153 272456 -163921
19477 41681 -272233 -81403 -37794 7448 -221273 -62817 55698 -41067 146808 127521 18883
19465 -26435 87278 -37178 -113343 169081 -238295 38396 -61703 201399 -196959 165969 135569
19454 135569 -24146 -474494 -36227 40379 -350056 -117435 94505 -6518 71143 -56368 -180335
19443 -180335 128965 57858 47735 -287124 -435283 -76885 33225 97582 -128595 133800
19432 -273179 -344942 15362 20330 205879 92792 14348 -521149 135597 -105022 -282830 72730
19420 -287975 -320388 -131627 -144733 36990 -50863 -98629 -137153 4292 -240108 -262875 -117960
19408 201391 -209676 -113846 -139154 5283 16135 854 -245261 -182441 -260085 -175756 -121965 73417
19395 21678 231982 -61137 5459 -179559 204408 -215977 -21094 9739 151063 68556 59115
19384 59115 86612 -75876 -204525 32956 25848 -281589 -253067 368560 -134965 -129857 -52561
19372 -216751 176282 91883 116748 -227829 -78760 261738 239790 139636 -158321 52272
19361 11735 26915 -198926 -113893 -40542 143361 -203213 126028 71956 -44272 114661 -396922
19349 -44953 -117606 -178890 -322822 -123199 -93513 -228210 -217287 -3166 3753 -241273 60810
19337 -350526 213760 48918 336939 306405 259578 26555 -342761 -157414 -134984 -124753 59440
19325 -21784 -78046 101329 110217 102735 -112575 -201228 -157763 -163529 24126 27540 45705 -6642
19312 65789 -281596 -284330 -341092 -64761 -417157 9752 -40096 106222 -27212 95864 -221016
19300 -18409 -1867 12425 -24837 142346 78137 239291 63638 74465 53393 31444 124679
19289 124679 -200934 -440074 -90377 -34117 -146391 -97526 61165 -133912 -83591 -99285 659
19277 -253220 -233610 80526 90444 -133024 -350450 61381 108890 -103049 152671 -60873 -288175
19266 -288175 100753 -145340 -102740 -210469 -116075 153099 -150298 -57928 7969 -176553
19255 -252787 -62879 -115385 87093 139767 32458 -48219 141985 153225 -191203 -451312 -268710
19244 -268710 187032 -266604 54176 67579 -114739 -105235 -99513 71529 62459 64719 -118290
19232 229039 -34013 -269862 -57213 120943 -251048 82960 -111805 -102891 -361104 7199 -59352
19220 -55135 -211138 -72144 35812 -169902 143761 52720 86826 -135731 -41071 -34 152770
19208 -55125 -211312 -118426 68724 339496 214044 -146894 192939 -162556 3858 -284342
19197 -182594 269164 55194 -32166 -66008 -48485 -186380 43486 355727 -266172 44347 -33132
19185 -145838 -325926 -23761 -148134 -352759 110759 104880 -129919 90427 91952 -254359 200479
19173 132615 107329 -286830 -148214 -56236 -264 -1345 -70451 14709 -201 366511 -13847 352975
19160 -1577 -103864 280843 -342457 5345 -109327 80794 265729 -202807 -154305 -566297 -121884
19148 -84230 -244624 -204472 -321164 38868 -131287 -130649 4655 40616 -92843 -160989 -163497 -202751
19136 -202751 -156229 -32619 -254012 -84571 -124214 -16048 -255719 175749 100575 -27452 29885
19124 30406 10283 -147821 124769 339493 228194 -159589 -73982 -69385 102574 -67793 157472
19112 -342421 -63472 136960 33030 6704 -55479 142044 188 -454782 -149526 -212703 37972
19100 34621 -8874 7192 -127474 71287 -38274 197127 -177440 -133269 250831 134458 -46479
19088 -116813 -46937 -215610 -506859 31467 -6213 -199189 -61972 -219710 -357059 121073
19077 328188 -267110 -197326 -144301 219331 239900 19566 -415033 38758 -58146 -62673 15316
19065 -265029 217699 -44685 237338 -153743 450497 283160 -7313 -213772 -17556 -87917
19055 -87917 -91670 91986 -315050 -124090 -255980 -115192 -368108 -308938 -165056 -103195 -54370
19044 -54370 -96276 178032 -3768 -292626 104814 86390 108942 157831 -9476 -36868 78974
19032 -229265 51408 -187343 167272 63929 52577 -177362 220803 -178341 -89176 -215904
19022 -215904 -13636 -167738 -204591 -367109 182869 96439 -138493 98075 82479 -187509
19011 -137050 -217554 54230 -180870 89196 116545 206110 28256 -99153 -84489 93234 -27014
18999 -67431 305187 255051 210156 -146561 81930 -149963 -166940 -44309 120412 58955 -42493
18987 -108958 -124772 -18135 -284519 35596 -147840 -44965 101455 -17771 -38606 -404306 -321577
18976 -321577 -326172 204725 -49114 -38333 -72472 -44672 -164678 86592 -36982 130961 160197
18965 160197 -65844 -233533 19865 22977 119503 317970 -13600 18129 114730 -141273 154769
18953 -184040 -97196 5040 27743 -155285 -174046 -47304 94367 -8317 234442 -51836 86068
18941 291142 13150 -229343 -70819 106323 -184503 57026 90672 -130948 -45597 39244 72521
18930 72521 -421382 -266944 -164404 -350616 194847 -71623 79023 219939 53577 -151444
18919 -111789 121797 255373 -117930 -24271 208414 80512 -143163 -102093 100631 -201803
18908 -7406 -199126 3163 55965 -69031 234781 112076 -130616 -200175 -45456 139624 -80121
18896 -50772 156093 3271 353497 -138479 -153546 -224377 298801 -350988 -47572 -192920 -6049
18884 -127237 127940 -142824 70987 -154281 -125964 -104316 -274432 34131 99502 67187 16098
18872 -183764 55820 -209616 57411 83887 5351 -106879 -50465 274043 -9511 111555 -237706
18860 121116 -196487 -39565 -21348 -177717 -299541 288925 -153443 80514 -141574 -228609
18850 -228609 -163199 295725 -7350 -404685 125756 -31362 -21808 117774 -93182 99426 -218548
18838 -28348 177269 -228457 -259749 2271 -130258 -195790 129045 40042 -262886 229884 17075
18826 -136311 132358 -26505 -39177 -266787 220727 -126264 277963 313172 -40117 74098
18815 35990 78502 73844 -253145 -118981 -98659 419350 500380 128995 314997 140720 -61089
18803 -38434 -350462 26887 9305 201837 -126793 -43872 293057 -14215 -230406 -527053 46067
18791 -125984 -281738 -280929 -292662 -149293 -7928 113002 -142254 -316778 -69527 319140 86084
18779 -83743 137107 183545 278247 -113902 -148552 -172357 -22304 -282108 120267 -199589 210789
18767 139534 182225 33263 100940 -233006 299414 -163306 -18461 -34196 -42679 -166458 -208745
18756 -208745 93306 -108184 -178934 -142668 -162927 11508 -357090 -98696 -258380 29480 107901
18745 107901 -604996 111302 201788 -97754 -99609 275626 -248391 -264536 8938 -131763 -198000
18734 -198000 75599 19514 -253086 231623 -302737 -101885 -2852 -287236 -554885 -26665
18723 251481 -86978 -213377 -155420 166702 49646 48796 -259294 -199523 -208424 115182 15289
18711 -237626 -111934 -96375 299359 -24067 -307961 -559528 -71155 131357 -121321 -260604
18701 -260604 -132109 -22738 47100 -61535 -41658 -98021 -154070 100997 161575 -77963 -396768
18690 -396768 -329840 -312415 -411086 -35287 -477206 -78451 -305748 -34835 -20852 -52943 -304135
18679 -304135 -47863 -301363 -113786 58952 -107801 -18460 -182169 87298 343737 -2813 38592
18667 -208327 112803 204248 -284213 -7825 -129292 1580 255155 164657 -157965 -67154 -135089
18656 -135089 -7408 -72345 103804 97641 -168035 -182557 3194 80765 -8666 -240534 -112188
18644 262451 -15714 30226 113686 -78030 10783 -187994 -22913 -89526 90626 137246 -169529
18632 -60079 -18637 -201685 -54151 -54582 7114 69531 -48467 -120305 -268556 -184694 43487 -295775
18619 -417928 -45494 -248501 -227580 33438 106683 90230 39423 -101741 -167212 -347241 112657
18607 59630 -13550 63101 -87705 -97201 116238 -534942 -197060 236661 -338720 -156336 101059
18595 234868 -62363 -51252 -183628 -118492 165884 -33849 -130190 109699 147731 77158 -47249
18583 -110897 -150848 -175428 107586 3995 -28126 82002 67068 -128005 -240525 -102138 -122071
18572 -122071 21715 -35007 -13682 1534 227251 -11278 -157483 243930 -87219 -176578 -193818
18561 -193818 -43101 116747 -6547 -107103 130774 -510201 -23083 222313 -465398 165926
18550 -287255 142931 90855 298417 67889 -409461 -328898 -216140 36879 -162434 -96446
18540 -96446 280373 -85622 -124411 122494 -324753 -97665 -100601 54144 248771 -278627 -60531
18528 262745 -114096 84209 197817 -39930 8576 10143 99541 -282847 -189613 -201109 13895
18516 129225 -147617 274000 -102649 -934 85188 -93791 19435 -193876 149492 128251 -12801
18504 -250634 288831 -272505 -133268 330205 39835 109119 180167 -218635 407801 182957
18493 167693 -4819 65821 -94409 -48872 251014 -306493 -177348 -168438 -156286 -160757 -40998
18481 -46767 -94292 -73592 234348 165310 188007 -97732 90469 166821 -211182 -60654 103117
18469 20697 -223904 149132 -83317 -40272 -242329 -111802 -20098 -362274 -94564 -62854 97705
18457 -201721 -126343 73836 17211 32996 -208020 -71633 117303 -111254 173660 -93932 -30612
18445 -333317 -148058 -179733 15383 88413 -202903 59587 58431 -285435 -246888 -83799 -31176
18433 -88773 -97518 256442 369670 -151121 103604 -104725 -235992 161960 -353536 -188586
18423 -188586 -226432 -234339 -14430 146515 -5470 -275541 -245018 58231 -195715 46577 231104
18412 231104 -248661 -182676 62779 -317895 -21510 133845 22200 -373864 -82869 154981
18401 -16724 -159433 348877 -1769 -112793 197964 180508 -161780 -154430 -127377 -196172 181660
18389 81440 -286679 -36879 331554 67562 -209946 132164 -18381 71674 -111019 -88049 93025
18377 -26960 -79135 -392124 -50826 -187911 -220771 213019 -79561 73119 28213 -147922 -22811
18365 332951 358985 -27075 -326694 128840 -14514 230222 -225974 -185149 -102707 -76246 -149038
18354 -149038 -99777 115312 3531 -67683 8325 -79638 -253869 81575 29102 -63373 90931
18342 -244483 396930 384796 188675 9092 161134 -201684 61721 106413 180261 -179491 -45746
18330 -57391 -166802 -402255 12791 -2302 -95606 132891 109447 -16255 -502571 125840 20710
18318 54072 14080 192024 -161615 33269 -116505 181704 -479002 -212633 -21218 57770
18307 98389 -366093 -44089 -141116 48345 74794 -72555 -219041 -100200 -225317 5339 -58020
18295 -17444 112261 43878 113340 -347453 -394406 -230799 -54184 -96955 -68640 -8761 191376
18283 -121346 137008 -142547 75339 -140978 161615 -22275 -14531 -143207 127593 -180580
18272 -35588 -226815 -91476 -251517 -218518 -218870 -486935 328221 13205 -86709 153231 -42848
18260 239492 97170 -439642 -341835 -7895 -270035 -79778 -127131 -393004 -7344 -48858 -78285
18249 -78285 25078 -139789 221442 -83589 -50277 -247538 119848 -204063 -125021 132936
18238 -59317 -29880 -252918 52635 -13804 65584 141652 -133489 -149807 -61325 -364667 151434
18226 -119424 -78300 -175562 -410962 -139865 50244 -105391 -384023 85952 -12645 122983
18215 166716 -167695 39912 -90218 -229105 -67852 -270536 231816 -240891 17767 -198214
18204 -194129 -151630 -74617 1705 -60342 -242333 -70316 -64530 219578 -16269 -388859 -192219
18192 -137801 122675 -432690 -252837 174474 -96428 397880 87403 -38 -19076 180870 67879
18180 15549 -228758 179324 -208034 116941 89958 -233545 -47915 112309 -141460 212142
18169 -220039 -272608 -76054 -159519 -206169 -194382 407880 -208027 -124673 -421431 -279276 -89705
18157 211408 73227 -101078 126074 -120549 151765 19279 -269843 136544 -642 101280
18146 -191081 52028 -58126 -87176 186752 -234013 -103425 121327 -280958 37442 -19261
18135 -19264 246784 -33544 49479 41226 -165194 -101932 1338 105149 -33014 70423 40749
18124 40749 -275127 188070 146002 53432 -46910 138279 -30075 418487 -30022 116678 102209
18113 102209 127469 -359476 52750 -150038 -90445 -124414 -235066 -179431 -114563 -151090 -433630
18102 -433630 -151176 400103 -224172 158210 -142996 356466 108070 -123544 314181 74549
18091 -128798 -80760 -236242 -27520 -208691 -337606 -79725 -192950 -4364 54863 -336405 138881
18079 -231813 -151718 165449 -263257 196595 -418878 84687 72568 249039 -393428 -90552
18068 71576 -34931 123064 69328 -240040 -263338 -89346 -131378 25298 -134380 -114327 -137377
18057 -137377 70731 -308542 72062 -17125 29077 131817 -263770 93763 -258443 -218395 -105015
18045 86512 -37687 -49441 195869 -197318 81312 -70504 38685 -17705 270040 -16254 42987
18033 26199 -350747 -313895 55671 -157251 -236829 70602 27316 -58468 -3744 310984 -54549
18021 122095 -195286 99915 -446548 176117 49494 -228278 -87991 -55638 53840 37231 102315
18010 102315 -94033 -105017 -218981 -192159 25737 120849 -82596 7432 -342880 -81526 240944
17998 -180446 18614 20582 414131 -79919 -281953 212655 250669 31514 -63139 -99226 -225105
17987 -225105 -323738 -253506 -341575 227337 -18195 129246 -130052 82198 18026 -232903 257379
17975 -53310 219429 10813 191526 -194102 63649 -236589 -273281 -83309 -182917 194124 -267607
17963 46886 -510593 -234899 59667 -268422 -68606 -51302 92625 64066 -109142 256329 -214766
17951 -135536 181518 -84041 -134595 282368 -31371 -128438 238824 201864 -181742 -280971 177699
17939 205106 -118686 -158701 -96270 108369 36676 90379 -46512 -160330 -165809 -52658 286935
17927 -92428 -230115 -175861 276677 388605 254441 101515 77492 49788 72469 239897
17917 239897 43463 160400 -117752 -35516 161944 68822 25591 -216104 88602 -229586
17906 -97307 92320 -89711 -281693 118893 -79013 -466539 -264445 -1437 -268487 19725 -295319
17894 -168580 399589 -51590 -226390 273689 59438 -137948 -303982 -9584 -219532 -281600
17884 -281600 -24208 40024 230798 63705 45572 39355 13432 -16508 -43066 -59028 -82029
17873 -82029 41857 180402 35126 -160270 113719 -236930 -236738 -61869 -15524 258842 -259759
17861 -72118 115528 -201534 -5238 -57539 -222579 -145951 -229033 -196461 -190341 85706 -34582
17849 -69113 -4059 -185909 -228251 -53567 -272877 11014 72420 377500 -169218 11848 -57651
17837 -152015 -6160 48334 286209 90380 -195704 66897 -63586 -77880 -113845 -100907 134308
17825 281690 -133525 233949 191370 118302 -155129 -63087 355263 -44677 156883 -147023
17814 51591 237781 155531 253012 55414 61134 -37721 -117263 -287802 -32063 -189868 -15621
17802 -91366 -33535 -43633 69068 180799 -22887 -94234 -169947 -185729 -97560 -213906 -183365
17791 -183365 -89719 -224963 140978 -39351 137556 -144167 -108538 78042 50793 113043 64553
17780 64553 174938 -144639 -55877 103048 45956 -59327 -167720 -37224 137354 161924 235825
17769 235825 177460 -258003 48952 -9109 -186143 280454 69426 -751 -90720 -61471 334561
17757 -175828 -131690 -155833 317147 -279257 -404035 101653 -33228 -74615 -43227 -60446 -54791
17746 -54791 -134679 -169147 332927 212478 7174 142643 -107089 117833 -122440 -85554 -179470
17735 -179470 -25590 -29269 -17617 -214956 -49253 178908 -218242 247442 8343 49061 -45258
17723 -354675 202271 -365384 13816 -178489 -101938 -88222 217226 -48062 -155192 168195
17712 73575 -84988 -72558 85477 20835 -127099 150110 -171372 -255311 107185 14739 -204158
17700 65860 63813 -18099 67695 72673 -125130 182876 -444900 -60782 -256096 49764 -484 -35329
17688 -35329 -193484 -209644 89348 88399 177791 -204263 211070 -46525 229114 -142800 -78099
17677 -78099 -283669 131783 -226391 67807 -17985 -420767 181896 26800 123941 -52637 -61671
17666 -61671 303251 30625 55093 -141578 -50020 -63881 -275282 49116 238965 163553 -203517
17654 -250330 149054 86759 -166736 -267725 -205683 -118 -112201 -67927 -78465 -293715 -259287
17643 -259287 85858 -177752 115345 474515 388070 -217882 9783 -87542 62121 449750 -225866
17631 126977 212265 15581 -29773 103822 287529 31195 -136169 -85455 340316 199017
17621 199017 -202035 193028 -55268 -28026 -17 182291 156119 -89036 -93391 88616 -6087 195184
17608 -313184 -16432 64929 70319 -262234 -75156 92443 -286580 243781 -78919 75960 -19265
17596 83044 -79469 79722 -75853 -140034 -355368 151179 -132273 45623 60947 196964 -65557
17584 -81378 -41045 210888 -75123 130700 111609 57979 195942 19132 331380 -22915 -462592
17573 -462592 -165958 -5829 -173082 -134300 -34589 -389658 -105236 -92486 96382 -150850 -7813
17561 414104 -208960 -179937 -155507 181534 242456 150463 28069 160020 40304 92202 177697
17550 177697 -152224 202643 92893 -33510 -300707 -137661 212396 -175410 249832 -208933
17539 179760 -198449 497779 -223861 26492 -233640 6793 -131930 93351 -194373 51713
17528 354555 15061 228217 -283109 -151230 84409 -212486 -47005 373342 199511 119642
17518 119642 114186 127672 -23119 83885 269382 -84450 234154 123453 -54210 44118 184269
17507 184269 -303421 91985 198081 77688 72555 216363 -89611 231513 -53148 257459 104871
17495 23136 198367 217617 121027 -192257 -299349 19824 410377 35837 -157498 -256575 255835
17483 192937 -92801 -105994 -57836 204826 296855 117056 205225 -184469 157552 11609 120620
17472 120620 31933 52656 -198837 144120 112640 68991 -203009 -4124 96787 316855 170669
17461 170669 137583 -74253 -179986 150976 -114983 249021 181218 -39292 249644 433848
17451 433848 55395 102225 188697 165746 414604 429233 161459 324981 -204053 122893
17440 279006 -79670 351138 257663 142666 208417 80812 405830 35314 211486 242032 247658
17429 247658 489886 260994 73291 -78760 204275 293527 125691 284146 147374 519442
17419 519442 280559 281947 -24077 214064 148412 470973 -6179 93308 315369 -40576 194027
17407 248604 -144965 247658 159017 -11070 -2646 -16159 46888 183028 16369 188698 56013
17395 -65638 440622 1909 147548 41868 249654 124272 -20703 -18706 1258 130689 169207
17384 169207 247166 -202935 113835 -236421 -19618 58351 -192502 45028 -25583 59489 172455
17373 172455 289267 -28545 179049 13226 168371 209261 -148873 67060 215568 -67337
17362 83065 19585 48261 -11627 83136 -95798 133187 151858 342271 274174 127125 292035
17351 292035 202148 84810 192878 212249 195265 164011 -34796 148068 56158 -320820 94435
17339 84256 290816 126663 52815 154119 -340245 261345 204364 250824 55554 587596
17329 587596 -322674 60498 -76335 -14405 45135 178784 -1281 -147807 292159 365399 275465
17318 275465 44530 -156570 154312 845 305973 -11733 242821 -31508 -47901 294369 53060
17306 58916 242385 -46112 22931 336374 -141145 40493 32583 337150 155376 -14993 94635
17294 81578 -39637 89207 -118149 140231 -2187 112380 303847 -256359 179406 -40890 131280
17282 309166 132531 -164069 283016 140413 312382 -140692 147903 114957 235515 42941
17271 406238 -15673 64498 -133638 -168298 21014 305108 -13018 387274 -117465 393715
17260 97614 -105738 345572 410248 414325 -179650 180860 387833 -15397 91095 107197 10317
17248 301387 85253 234040 334417 195295 81066 353850 287316 291493 289694 14421 95252
17237 95252 -8718 86808 306679 -38473 133405 283637 116491 117699 249315 21710 146631
17226 146631 216549 297867 366250 1703 -51703 148577 -154006 20999 467744 187615 298564
17215 298564 23039 70073 176074 181945 382724 127115 209398 324284 297641 80769 208832
17204 208832 262563 214100 596768 307788 506852 46588 296447 -102886 -74315 406095
17193 172424 128305 120316 287694 -219665 265830 230729 238622 238515 65812 65499 149693 157203
17181 157203 -26217 338753 -27761 438973 249872 348846 204260 357922 236620 -125270
17170 -247205 9263 288663 409613 358507 43113 110572 185152 203591 90177 164627 262546
17159 262546 222692 523669 223825 228558 -68412 56401 -59035 289313 -77893 388495 315343
17148 315343 -99229 418769 312622 130726 484953 259220 446341 287449 418651 308294
17138 308294 91300 223708 550375 -120895 117632 301761 207954 87494 396667 460660
17128 460660 450232 239421 294912 391395 376472 87818 346595 426515 411254 191070 340253
17117 340253 247609 173519 450233 337426 376955 519597 476403 136623 139504 437325 343777
17106 343777 422787 60671 258413 408339 418230 50709 506672 178758 310596 347191 609476
17095 609476 702602 286675 404787 551983 351322 345512 426988 592767 561405 319530
17085 319530 695454 142234 402053 240680 47970 291302 163997 451754 242334 86603
17074 287103 437853 -95162 329284 909832 610357 295508 717412 499320 371768 345297
17064 345297 350237 352999 447881 264927 452160 465484 418951 262196 473489 926403 756473
17053 756473 128470 474671 407488 440667 342792 470234 435297 375752 284265 533797 613463
17042 613463 476211 702580 470984 488115 195616 339754 327901 824737 366884 330265
17032 330265 560230 441958 562893 335899 360487 296334 132682 683197 674447 117144
17021 597596 667259 640863 828001 766793 817003 509423 627297 605217 432951 -3815 485579
17009 590102 376817 373599 577678 443519 799342 765181 609231 421860 691753 689731
16999 689731 772940 550871 792346 418278 671108 405739 640754 887246 644596 513970
16989 513970 828233 507241 549832 519309 808871 573462 732101 532889 293904 1092045
16979 1092045 851101 547068 801288 1019450 618814 372651 1064006 797399 431906
16970 431906 459716 412329 930274 681118 419026 687577 748945 763393 658067 740403
16960 740403 823630 595309 1041266 662391 1028245 902876 936780 885833 1092680 1077575
16950 1077575 1309283 943366 912262 943577 976174 884884 1020311 1033811 695092 732987
16940 732987 716104 1043826 715091 939206 807070 871688 1187676 1294181 977992 919095
16930 919095 934203 1061497 825680 1219164 1320381 1208375 1068730 1155324 1085005 1263415
16920 1263415 1146486 1183236 1008325 1031057 1128973 1419060 1299875 1212568 1118560 1436091
16910 1436091 1303440 1383651 1390298 1484742 1336830 1339410 1152860 1360201 1305048 1670627 1806759
16899 1806759 1369814 1238673 1634220 1661253 1425292 1395653 1559627 1523965 1645614 1729025
16889 1729025 1716353 1494351 1858733 1853953 1844393 1932679 1777341 1640423 1767926 1930449
16879 1930449 2162445 1679436 1610294 2096413 2267623 2212810 2014638 1742476 2072403 2049189
16869 2049189 1833917 2203261 2040479 2187834 1968351 2085888 2361670 2058316 2381364
16860 2381364 2348580 2217334 2005242 2379852 2162982 2146586 2659264 2505158 2744876 2361435
16850 2361435 2786563 2764954 2774492 2850020 2939833 2642915 2989073 2804658 3133054 3040884
16840 3040884 2967236 2805082 3024895 3011474 3430920 3006724 3366729 3726300 3756088 3675436
16830 3675436 3932284 3746278 3795812 4051820 4013960 3942341 3968159 4433255 4133303 4759254
16820 4759254 4450782 4006790 4828722 4544627 4874879 4884401 4667903 5024582 5197608 4844636
16810 4844636 5193177 5600804 5412089 5316161 5838144 5994027 5997531 5965818 6398597 6203362
16800 6203362 6645511 6581577 6612482 7103814 6980159 7278681 7492111 7638965 7787698 7857488
16790 7857488 8076925 8588609 8589854 8818134 8776817 9575426 9623383 10048606 10220284 10514162
16780 10514162 10438229 11050954 11035531 11869061 12108166 12439035 12789814 12887657 13424642 13827122
16770 13827122 14502069 14830655 15534582 15997850 16305703 16979099 17703437 18300202 19275032
16761 19275032 19744495 20834624 21910245 22103117 23353104 24248384 25429641 26678089
16753 26678089 27876003 28994883 30466088 31955760 33720859 35342396 37314221 38808589
16745 38808589 41234450 43583566 45872333 48427612 50992959 54262076 57422293 60751478
16737 60751478 64782431 68663106 73421215 78096889 83386932 89024124 94720495 101056747
16729 101056747 108132251 115442797 122998962 131246002 139532093 147820808 156550406 165078567
16721 165078567 173066488 180887587 187349130 192807028 197467294 200293999 201391898 200918284
16713 200918284 198510344 194976315 189565196 183475579 176108301 168305291 159603170 150948691
16705 150948691 142220853 133377233 125591198 117597804 109590621 102349241 95637148 89572603
16697 89572603 83870557 78520665 73460644 68756907 64522669 60753700 57092938 53404969
16689 53404969 50257001 47297168 44859603 42709710 39968060 37924343 35815873 34314665
16681 34314665 32392044 30794438 29199667 27833233 26603513 25270178 24231107 22947921
16673 22947921 22151451 21410490 20206551 19613503 18683413 17901583 17327255 17135171 15772934
16664 15772934 15520353 15079459 14321753 13721137 13876409 12953834 12570742 11852639 11874121
16655 11874121 11149728 11329566 10749435 10258882 10058391 9502061 9196521 9240387 8619766
16646 8619766 8455811 8399800 8138019 7958338 7165013 7545339 7132531 7260097 6727104 6485737
16636 6485737 6608068 6009852 6165547 6240137 6205514 5605499 5719049 5366269 5368837 5187533
16626 5187533 4834960 4798070 4732407 4722202 4565297 4485972 4457360 4011274 4433702 4258429
16616 4258429 3810503 3731316 3673485 3846077 3337464 3449826 3525903 3488570 3380597 3234938
16606 3234938 3331580 3307307 3124457 2987426 2685504 2884249 2984500 2657103 2432549 2510926
16596 2510926 2319269 2478786 2537966 2565377 2486411 2541695 2496114 2316848 2234165 2288347 1827956
16585 1827956 2347306 2055233 2409111 1833880 1943501 1864421 1926227 1889672 1998150 1839876
16575 1839876 1767269 1993023 1664371 1526835 1551953 1532297 1859588 1727136 1849538 1563536
16565 1563536 1495522 1512414 1306629 1377500 1924429 1275171 1488016 1674349 1431758 1299583
16555 1299583 1648192 1262110 1413845 1358120 1134663 1229230 1078711 863977 1561720 1209921
16545 1209921 1247534 935705 1264903 1280620 1034416 1395508 1091722 1200559 1086693 1108075
16535 1108075 1038886 1122836 1066327 916234 949697 937400 1240623 673427 991868 932589
16525 932589 941612 924235 908116 982166 1042919 1001589 533307 945232 1178775 592754 688358
16514 688358 858849 791293 374787 598338 693974 731309 1057941 639046 969664 778010
16504 778010 574320 1038479 646262 941740 501071 669087 914999 654626 788787 716914
16494 716914 397676 536233 1005941 490243 793785 595657 610644 358265 504703 521969
16484 521969 443891 750223 752501 476687 786840 507673 263938 364290 656337 374447
16474 374447 277679 520554 421611 463362 754245 454061 441568 319106 523011 487143
16464 487143 584345 310353 137413 559078 576553 583134 511253 503022 487035 690623 419615
16453 419615 453856 251217 357197 331092 630298 318306 286673 266908 519766 134350
16442 581970 436044 11007 471362 249814 143980 374192 32591 274265 488478 421329
16432 421329 373544 248193 352521 75703 496794 428336 374453 204137 480635 199803
16421 276980 278442 469658 424007 306374 -36880 380752 293790 197286 628083 525620 451419
16410 451419 576836 562264 369572 165493 368784 415709 380354 377141 221538 84205 255363
16399 255363 116883 227997 258759 349500 229227 -92279 -128114 314346 257696 225053 534334
16388 534334 109339 251288 511648 342380 296181 76374 109769 380723 44339 269543
16378 269543 281003 78194 254076 225388 308791 38753 371935 -179000 -19913 371681 441859
16367 441859 318115 120157 336304 -181550 444784 279546 353838 239663 310599 537481
16357 537481 62615 132761 174890 2510 -72558 -171882 265781 200260 143615 -50115 -37076
16346 -37076 661279 -67820 147440 199192 -136236 -27298 -12770 359393 168504 -29993 97586
16334 55000 149150 261219 55865 -267251 -83845 451106 -136266 155311 224912 110280
16323 167777 120439 41996 237163 207607 -154292 19630 57126 -178375 -159684 -24138 264410
16311 -83015 -37155 54989 253211 220216 376059 -124658 23295 203701 282921 280881 -34330
16299 -127489 -95266 157921 144448 -165503 -9945 -95126 -196678 191259 282354 144139 48278
16287 7333 241819 72398 323318 -33026 -133618 -658 427908 184924 319665 -135744 163780
16275 124537 373099 -175000 -197714 91909 -218632 -106522 90118 266031 319865 46721
16264 143702 20289 176382 62252 79717 123751 92603 270496 72853 330253 73186 312131
16253 312131 2287 -170559 93122 -24716 368277 -367210 -171822 99908 -208126 85756 -149831
16241 236987 10975 337783 26753 10458 192767 268643 273852 -116209 -140883 -77990 86225
16229 -51672 432290 -77723 58942 260692 -3901 -23334 3729 156766 183955 78172 53371
16218 53371 -317414 146164 31728 112915 150016 -130995 -22371 -177401 -263605 98126 240240
16207 240240 54398 21419 23355 -38455 241151 108481 -197990 -45222 -84037 174204 244897
16196 244897 108516 -73697 -138528 -30596 -4639 41716 211788 90911 -144875 231418 -87211
16184 -214074 130519 160603 248876 145968 29938 182477 -48989 64767 91021 -122381 -579058
16173 -579058 116603 -202456 121975 167622 214877 187130 95326 -172194 35405 -61887 -274927
16162 -274927 -125814 -129743 -663728 147643 -138795 114700 20215 155757 22092 72263
16152 72263 -172155 -219860 206480 -242084 -19186 -360451 60878 218933 -205977 53957
16141 16559 -60038 56613 -255552 -111525 -403681 125833 123996 -264626 -210529 57963 366
16129 -77349 -176654 -184400 -82830 -361083 -158481 -169835 351383 -147243 137779 104615 103868
16118 103868 -95123 -152610 -105029 109716 -67759 -40248 -1255 129867 9239 -521102 -103289
16106 -221675 -224133 -28144 85789 -99910 74651 56223 93864 -77182 200321 209080 -412574
16094 -1909 86531 90317 -59266 -313935 -54448 -96604 51998 -293041 30057 -37355 80124 -12121
16081 150314 -83538 -225510 4529 4118 268055 18510 -61393 4113 -48024 220294 -196223
16069 -312819 1252 12022 79469 170404 -15893 104202 117468 -23414 233037 20055 -221181
16057 143179 -23957 -31060 137266 -353736 118543 -161579 117337 9402 74023 173644 -231485
16045 127576 22711 -176032 -230092 -117979 246323 -88984 24974 306261 38666 91314 12585
16033 -228286 290593 -118896 132728 109567 -288548 -507970 106913 -279840 51340 223714
16023 223714 118362 -162383 152341 74 -85433 90691 -358062 20943 -107151 -12649 -155329
16012 -155329 -127535 -169920 89799 322000 178390 359012 9453 -41514 -67045 -254119 185020
16000 310280 -231924 -60907 81622 28989 -217343 -28953 243224 37381 130970 -211037 -198435
15989 -198435 -91573 65847 -87462 264580 134484 315705 316384 306457 23415 157556 275597
15978 275597 255768 -55096 171269 20774 -370779 -245002 -125776 -41052 -97630 -229051
15968 -229051 378032 -347482 -92880 132354 -72156 -108767 178687 400436 -8026 213171
15957 199127 56693 -141475 -122490 133522 -102832 -27402 7622 284987 -290709 237248
15946 -266044 -238218 -101207 -100982 155646 -34505 164167 5534 23526 -168093 -71490 118107
15934 -106361 -60431 -67155 -250268 -208577 -27507 -91402 131640 -16350 121004 -37522 -182097
15923 -182097 49824 -298247 -242517 -167026 198271 -202174 -47515 26770 -160451 -337968
15913 -337968 -338698 35474 -242863 -148371 176411 -417526 125654 -86095 -284631 -81992 -70378
15902 -70378 -112486 279782 120174 -146299 -51436 -203179 -271183 71404 -325083 100400
15891 -257154 -89693 -247179 -78539 -16479 -124903 299422 102548 256205 -82589 -55129
15881 -55129 507730 311290 17130 -1077 16987 -249364 -49218 -135040 -123311 -11099 -14362
15870 -14362 -34349 124534 -251618 96873 -277517 -95589 -225963 -47415 -220990 -124911 -212670
15859 -212670 9157 -53795 -185317 63978 -208128 32958 175904 -154096 -46307 383955 -56296
15847 133148 100744 65882 -124356 -41707 -109629 -171561 -85732 -192418 55489 -121629 69191
15835 -18154 -271705 31864 19598 -417250 -125392 -500700 -42865 150072 -92282 -303491
15825 -303491 2572 -203717 27430 -187242 37332 -366424 164580 -213950 -41196 333665
15814 -159470 -100713 185328 -204242 89170 131348 -47573 158946 -253655 -429210 297752
15803 384261 -300715 40644 -126344 -22206 -181597 201091 37719 -111541 -188331 115664
15792 -107214 -19888 -236198 195123 125889 -121164 217182 -1508 -289906 -26360 -197522
15782 -197522 89440 21696 1598 317908 13678 105015 -226945 -527816 -95107 127023 167565
15771 167565 -498374 -125805 -5176 -73724 -24305 135713 -401520 -5784 27253 -7960 -314318
15760 -314318 178164 170716 132857 110466 -12672 -71349 99757 48957 89323 138816 135842 -19554
15747 201428 126396 -230789 -130373 87343 59838 46975 -144422 127713 15595 -36618 -529654
15736 -529654 32607 -39841 45549 -205284 154424 -258625 33153 7496 51822 -32069 -17838
15725 -17838 -365135 -91745 -399593 28884 -145422 -166803 -12175 165116 117981 -122781 239165
15713 28932 65913 264940 -224344 -211328 -227489 15112 -199497 65915 -152176 -232987 -310241
15702 -310241 -205114 224318 4150 65382 -255153 101398 257046 -6904 47757 137865 220608
15691 220608 204335 142979 -125672 145264 115506 255752 -7201 -2985 -218154 -13163 -172714
15680 -172714 -168141 227317 -89143 -257103 -155596 -56982 213576 -28262 -84923 -483073 -192464
15668 258070 53646 -244368 -54307 -326782 -304004 -91170 -220194 194956 -117597 205083
15657 -236254 90050 89518 137755 -137928 50468 -27519 -156360 -273742 -125290 183244 102629
15646 102629 -47409 -79535 -484659 -51902 36246 -111222 190492 -323605 168562 189591
15636 189591 117867 -130984 -135596 -186612 34438 -75611 36283 -232124 -160788 499203 166902
15624 -38553 81195 10876 82548 171530 184216 194730 220818 -72984 -21752 157337 -104634
15612 31939 125784 33604 -79246 55228 107866 -7566 -127656 -180320 155767 -140007 227185
15600 215614 163202 -44765 -97547 13861 -90633 318502 -168534 -17059 -74304 -99332 -154444
15589 -154444 22713 202363 -291245 -261369 104062 259039 127878 -64404 392526 -101515
15578 -36383 -175921 268487 -158247 -176918 132214 -140592 1528 -293914 -25786 153419
15567 -115213 -89067 123442 -124259 -81299 290634 244751 83695 10937 -264720 -241306 -134541
15556 -134541 87851 189982 -91457 -202543 450403 -261369 -44150 259414 -174979 22986
15545 -159696 -140829 610347 -174494 66220 -139550 252776 -14417 -163954 -192449 -55852
15534 123388 118317 33400 11506 78083 -245651 400009 -63756 -79970 -53625 -74437 -114197
15523 -114197 40368 38206 351359 45083 156561 159281 10553 -19560 -198027 -192998 -123114
15512 -123114 99695 58755 -219106 25836 -525032 -121756 -236540 -211617 29562 -361883
15501 259944 105880 135507 -25915 -255139 41643 48706 -37981 58862 15016 -90270 -20254
15489 -36614 -40265 -125428 -65875 -349107 -234201 -54440 -242670 20115 46224 -152510 -179197
15478 -179197 -153372 -227886 42226 268518 -133561 -198962 227775 -64017 25873 -212168 -162338
15467 -162338 -269460 -79905 168470 287485 58520 -146946 -55857 -49357 148 -76268 254436
15455 399702 -32407 -190772 -12555 -206109 -185370 159844 -19938 -133751 -172779 -326275
15445 -326275 241342 101131 190934 -226273 189555 155585 237923 113147 -151792 -375689
15435 -375689 37177 81904 12010 108931 55299 -239224 -200230 -38807 168281 -51995 173222
15423 9531 267914 -120612 -67328 -8175 -93894 -120595 -343827 -361925 -177408 32926 108941
15412 108941 -10112 -48005 299099 -203979 -169221 -269679 70796 -60063 93039 -161451 -140507
15401 -140507 66317 304337 223303 -203010 20902 124626 -97339 263136 -66112 159706
15390 -178902 -122544 -191341 -108899 309268 -22737 125057 40100 88232 -195135 30567 -105651
15378 -111038 223385 -137474 154217 -111143 -18449 -185435 55586 -99231 -30267 -64820
15368 -64820 -117257 105679 87205 -2368 -4141 31948 -457384 132867 -74290 -211845 47696
15356 -213441 305927 2228 -302697 -76128 113895 86454 -14889 -43275 -34855 -27056 48985
15344 120739 -115513 -42808 239449 145291 136430 -91822 -81450 155381 -116407 -178594 59105
15332 -193460 199635 -186315 136524 25870 -94684 -291906 408793 81484 -106919 -80312
15322 -80312 131519 -123118 113455 274550 123044 158277 84532 128927 30971 19411 30326
15311 30326 -204189 -168002 200414 58234 -31227 -61462 -90578 177499 -73708 435392 -102584
15299 -49181 -36008 496535 47915 220919 76208 -131194 567027 30161 -205590 -154510 94316
15287 -249348 -36871 67691 -34169 -66840 -248871 74149 49104 227338 -297553 133089 117513
15276 117513 158707 72194 -159055 -28328 17293 85648 17078 164893 -109017 202564 56535
15264 -22246 -83494 161782 49785 -284643 168880 126909 -74306 302702 -296826 140829
15253 202463 364424 -48492 207350 252032 174041 305576 998467 1886003 1063319 1711960
15243 1711960 817638 -11181 555345 -79543 76423 36891 229265 84788 -45732 136735
15232 -167375 263914 -192759 88925 373658 117445 44277 177137 -250389 -57667 -226503
15222 -226503 11658 25573 456948 148623 318791 199593 -143648 -69444 137524 39203
15211 295154 136331 194030 -20163 291228 -121952 -127149 -145702 193587 333736 -233464
15200 5071 127886 231627 -128542 65875 71520 -132504 -264495 161520 227137 -113723 158561
15188 272190 16255 126666 514263 -1793 32684 227910 -64684 -120076 -103553 44090 -142696
15176 133344 48811 111446 261110 182240 -104163 81830 25458 -313781 36772 -157186 41075
15164 118830 133120 -231646 -183123 -32239 -11700 126084 -26931 -7505 -42432 90873 -135071
15152 -53122 504262 1799 -37 -51846 -82043 94129 30047 -275253 -158218 -40074 191516 326069
15140 326069 122673 -301662 180324 -122532 147688 429594 32313 143549 -100167 68931
15129 -206127 -2690 -154718 22748 -3228 -166139 4848 423989 -57445 27384 -308450 183868
15117 285960 165913 171220 -82828 -334341 -27217 -5957 25881 106089 186282 -136820 185856
15105 -171425 -133173 -57669 -83731 60295 148074 35007 77395 -33388 22921 -2835 236364
15093 145263 229182 226358 82030 106150 -194164 -89869 -81494 -225831 -83210 154981 205304
15082 205304 -146025 36140 55662 -240663 107437 24391 -87988 -182634 -28698 -175285 172546
15070 67205 302839 67849 -29465 112166 181565 219761 348463 -15787 16013 41242 80886
15059 80886 53197 -67664 313920 259457 181699 -2450 85594 -55055 368374 81516 287060
15048 287060 -217413 399835 48190 197112 26544 313588 264162 423727 353999 72815
15037 12540 145293 366023 93281 94751 313420 244777 73571 96952 94704 -4988 -15794 299323
15024 102104 357483 255591 -111959 -112263 211762 600354 345506 282518 111943 353456
15014 353456 52372 172188 81334 476644 454631 338748 204474 369534 246244 173031
15004 173031 134811 101786 251586 194633 424167 307559 22933 335680 -32459 72250 189686
14993 189686 164427 101725 218828 428051 -89163 -202616 349424 117088 269458 257752
14983 257752 383635 182032 17123 105293 232053 135428 36049 354073 258325 85126 153552
14972 153552 -61575 30252 -32350 75871 38861 339395 -166880 635634 274292 77221 353884
14961 353884 -17482 556954 -101246 367802 329932 119134 73682 9890 4420 30247 323167
14950 323167 819072 7618 109372 -86181 -193757 138371 284154 482351 -47276 -143373
14940 -143373 241903 350201 315439 176355 243725 129563 140724 378002 701885 311146
14929 145209 339179 124280 118918 338844 122486 111389 13133 261517 441428 316729
14919 316729 237063 303162 334553 -21672 282257 207444 310537 -191770 456445 109614
14908 416428 276244 407634 245662 567891 336987 619036 147332 346795 370451 310785
14898 310785 321531 340124 277318 296504 309067 -51171 280840 313254 406138 23644 -42248
14886 210528 332104 414441 252198 513901 75593 509852 378838 389971 163268 39531
14875 317394 320198 400536 290600 326180 331073 -82617 466325 730513 185336 444685 362138
14864 362138 369035 220262 294808 199062 54756 368511 510873 213099 460741 325552
14854 325552 483169 585499 45044 114076 513611 93588 280376 687140 164134 819487
14844 819487 229664 306890 398096 570042 624567 294621 139926 35488 454274 393287
14834 393287 573530 462233 284163 557822 475624 496291 563123 335109 332653 508999
14824 508999 553739 564920 540090 262702 550565 541423 219753 166344 457727 296164 119463
14812 285870 107922 411755 568496 409164 18606 674071 226895 353666 322810 330952
14802 330952 270048 382958 271401 431383 314159 333020 136897 364855 426702 468161
14792 468161 302236 530174 421760 450123 516030 444712 478016 320796 709622 485201
14782 485201 566558 41368 332833 470799 13779 542102 851224 457152 497951 459510
14772 459510 587387 403152 497583 516228 477603 268256 484693 355101 445832 442085 339791
14761 339791 450162 609807 473706 737614 431168 331160 329380 583136 522422 480746
14751 480746 606117 514024 569781 380735 712024 262364 613525 588946 773784 925725
14741 925725 473406 346699 603725 466369 657596 734494 729116 395144 574636 577133
14731 577133 448316 540266 250536 722577 371223 463319 435100 738374 535528 896943
14721 896943 712923 713070 630336 567509 742049 427105 610757 498952 723846 782700 812373
14710 812373 520268 836427 869951 564318 855954 590871 585999 506130 481065 700134
14700 700134 778489 837949 684063 859520 1066183 817270 845315 802673 746593 755108 859127
14689 859127 548630 883351 964360 679653 354685 956186 930879 873005 525906 606599
14679 606599 751066 706921 944607 693450 835362 711979 943597 714665 938986 747838
14669 747838 596118 983305 654737 801582 564381 1146052 1025805 723600 576300 831512
14659 831512 1024949 1061352 986747 939399 966887 842085 921766 1174732 1065002 1080012 1148752
14648 1148752 832702 1018917 620833 789556 1014853 905178 1307552 1056109 1195836
14639 1195836 816348 810693 1101030 1076274 744171 766171 1006304 1078632 1091107 1173355 996257
14628 996257 668587 765396 990562 1157252 750836 1159087 1227914 1104251 1251489 1301016
14618 1301016 1020581 1059963 1154993 1274832 1370894 1552957 1448395 1296223 1373837 1188697
14608 1188697 1392008 1367813 1543208 1516195 1581681 1240670 1394555 1286083 1022852 1220895
14598 1220895 1586044 1536688 1114914 1484951 1381322 1357205 1594794 1217755 1657853 1086650
14588 1086650 1596441 1501032 1612291 1454861 1408722 1527903 1460844 1705330 1708869 1973843
14578 1973843 1843827 1914399 1700474 1537238 1630575 1715441 1543985 1933192 1634298 1832497
14568 1832497 1852978 2076189 1892688 1925363 1953092 2138956 2055199 2122574 2275223 1931975
14558 1931975 2329067 2133430 3028382 2576156 3246102 3148713 3277539 4389396 4540547
14549 4540547 6253303 9670244 18317471 40285693 46958525 17960083 9823772 5336907
14541 5336907 2908472 2017322 1634396 1985188 1422040 1759987 1481250 1665590 1382297
14532 1382297 1903314 1727944 1964155 1533365 1657142 1977931 2204899 1998937 1907505 2010730
14522 2010730 1862182 1980139 1902854 1878767 2274223 1732288 2012228 2320795 2371390 2066240
14512 2066240 1974600 2339077 2293521 2109595 2423782 2254686 2382116 2263949 2560099 2378904
14502 2378904 2736427 2604825 2572773 2615657 2368409 2426071 2545138 2763344 2975864 2743814
14492 2743814 2759485 2834997 3084457 3034290 2978948 2856766 2860955 2928532 2724793 3208684 3400795
14481 3400795 3194853 3625859 3235286 3004856 3407951 3353631 3449004 3300871 3325390 3451380
14471 3451380 3715473 3619393 3597756 3771975 3951430 3591763 3839793 3714380 3739628 4187461
14461 4187461 3874220 3934777 4184309 3999458 4132059 4461743 4398778 4229940 4411420 4480432
14451 4480432 4587105 4640388 4409749 4490005 4876663 4717161 4670531 4897242 4988676 5027053
14441 5027053 5103991 5052085 5034463 5358270 5239721 5025839 5719786 5502443 5620868 5471755
14431 5471755 5369908 5942080 5696551 6188087 5942008 5904429 6384534 6011605 6671620 6403191
14421 6403191 6615421 6650755 6604658 6914655 6885178 7189719 7384012 7311971 7240450 7502315
14411 7502315 7576294 7828284 7455937 7906707 8281613 8052102 8329206 8569095 8143668 8877024
14401 8877024 8951741 9317869 9014066 9192730 9299597 9926089 9623998 9914328 9995244 10269456
14391 10269456 10414159 10648031 10513030 10997765 10853579 11524467 11612305 11415410 11758759
14382 11758759 12255656 12126733 12722534 12980742 12644104 13224021 13576351 13618480 14215338
14373 14215338 14238556 14481206 14742365 15266207 15559869 15913881 15826987 16144147 16632901 16885410
14363 16885410 17505141 17721162 18247049 18486062 18824171 19153451 19825567 20166385 20745634
14354 20745634 21005336 21683679 22440324 22916620 23419004 23540481 24350172 25301791 25852970
14345 25852970 26082433 26837345 27579846 28262853 29088367 29811967 30878389 31624530 32550263
14336 32550263 33341702 34248836 35421324 36538021 37375768 38850847 40044532 41063887
14328 41063887 42574976 43595708 45168520 46828646 48519582 50189166 51979450 53960406
14320 53960406 55745069 58055667 59749100 62247400 64625495 66877921 69422807 72560286
14312 72560286 75909525 78484205 82021603 85444233 89396997 93653611 97640627 102152882
14304 102152882 106924869 112090872 117667632 123263474 129189482 135960616 142795229 150759171
14296 150759171 158539957 167172629 176456100 185978209 196521115 207460934 219082373
14289 219082373 231552153 244699745 258675310 273427426 288742388 304580085 320912314
14282 320912314 337599978 354949934 371764246 388645423 404815633 420391938 434785376
14275 434785376 447859674 459386798 467424883 470464578 471317142 470264709 469355817 467154211
14267 467154211 462421727 455125465 445112272 433267070 418845020 403627830 387715606
14260 387715606 370343298 352812190 335559097 318483417 301815262 285413104 270388121
14253 270388121 256969523 243123104 230174814 217325762 205908280 194560641 184183773
14246 184183773 174694867 165634995 157697803 149748942 142115318 135121732 128364190 122672927
14238 122672927 117003230 111980988 106707055 101663612 97340523 93233318 89432149 86230158
14230 86230158 82419807 79214334 75673581 72728079 69936156 67061126 64723943 62471846
14222 62471846 59861177 57870814 56288478 54187048 52243626 50577083 48860665 47064056
14214 47064056 45938886 44729958 42987655 41507168 40203641 39116610 38098243 37641725
14206 37641725 36554986 35274889 33959371 32951453 31929751 31831539 31118069 29649847
14198 29649847 28946427 27820648 27480855 26748773 26042351 25443821 24783840 23885480 23661972
14189 23661972 22839026 22452788 21772466 21101904 20604495 20239515 19596240 19649838 18860095
14180 18860095 18543592 18407594 17977917 17321567 17045627 16445834 16400248 16123121 15817255
14171 15817255 15324361 14968727 14985791 14557806 14165808 13874740 13697483 13217858 13102017
14162 13102017 13065193 12929985 12260126 12250464 12470243 11516126 11569612 11250457 11085968 10645429
14152 10645429 11017631 10888505 10386098 10662586 10121821 9769548 9529341 9746354 9554834
14143 9554834 9481581 9107374 9255812 9275340 8558411 8798375 8815375 8717812 8476194 8427828
14133 8427828 8176623 8032544 7545762 7882251 7580933 7718523 7839516 7448308 7237903
14124 7237903 7440121 7138508 6841472 6634446 6804496 6695027 6126945 6400010 6580226
14115 6580226 6575828 6314730 6164797 6105007 6252285 5615458 5930798 5611240 5818505 5578357
14105 5578357 5470401 5594833 5289061 5305065 5321239 5267804 5202982 5200516 5128062 4954416 4690291
14094 4690291 5101945 4768610 4612505 4644869 4702690 4421249 4408065 4538145 4630092 4233012
14084 4233012 4336566 4295856 4524759 4215241 4318137 4361657 3982065 4054550 4136492 4214413
14074 4214413 4274986 3974944 4157946 3638997 3911231 3972402 4055861 3852837 3754966 3749714
14064 3749714 3710328 3552262 3341235 3692440 3526459 3668090 3817692 3569402 3469403 3456774
14054 3456774 3226848 3361010 3320001 3169552 2786560 3526909 3284992 3258065 3107393 3000775
14044 3000775 3055829 3113255 3057480 2848028 2772851 2815134 2921326 3127480 2922658 2887720
14034 2887720 2891047 2562392 2657487 2843800 2595890 2624088 2676690 2766448 2545807 2603868 2358565
14023 2358565 2360365 2305723 2541122 2208665 2465478 2518953 2316000 2209871 2371153 2179543
14013 2179543 2277825 1818119 2223652 1988001 2215429 2185859 1555415 1946181 1920408 2021527
14003 2021527 1924015 1897770 1603024 1746828 1890992 1939722 2059396 1609955 1854049 1883183
13993 1883183 1815868 1904421 2022081 1914298 2689663 5074340 11741718 33148431 49476923
13984 49476923 23335622 11796057 6850811 4950594 4079197 3367076 3367624 2687672 2538251
13975 2538251 2704253 2459797 2580740 2018234 2399689 2335041 2514869 1908468 2202959 2121157
13965 2121157 1909505 1944051 1916053 1953426 2066955 1911395 2005322 1688408 1858043 1804530
13955 1804530 1939867 1662251 1612667 1627105 1290306 1970052 1759920 1713623 1904662 1804381
13945 1804381 1470569 1591594 1779910 1602860 1521265 1616971 1431133 1325111 1339159 1461827
13935 1461827 1391407 1785372 1737154 1924467 1622940 1355435 1875430 1453657 1386573 1473620
13925 1473620 1199222 1276991 1252830 1468915 1498412 1676326 1516477 1266419 1487019 1542433
13915 1542433 1182937 1198313 1284864 1296149 1461073 1251233 1224749 1142582 1552538 1092138
13905 1092138 1102274 1251583 1177057 1392995 1374097 1288615 1201903 1130075 941927 1481249
13895 1481249 1262237 882362 1304930 1101384 1070785 1096083 1003180 1175251 950185 934701
13885 934701 971114 1155809 773745 1081731 1126780 1124432 1225160 1423974 1134651 1157949
13875 1157949 943551 1025181 995740 924487 1223994 902059 1185812 1003523 898903 1166650
13865 1166650 778196 896246 872838 798548 862081 1118479 807332 897975 663476 1186630
13855 1186630 863348 1116063 847247 962111 703915 956211 688921 884369 648873
13846 648873 906399 1155665 657726 905805 850754 980652 901991 790920 1134447 872777
13836 872777 1055384 1240038 1071449 831823 819691 535147 750229 950016 956109 888565
13826 888565 376517 748762 948720 652659 1002732 846138 903341 976124 851294 878505
13816 878505 828435 1237019 533232 717523 852115 437503 913448 885397 962383 576055
13806 576055 923835 752359 803515 1059008 962629 836531 704451 450451 736052 771841
13796 771841 781347 735201 851232 679687 523352 586141 770797 855620 972895 514143
13786 514143 814851 773447 649159 815491 737275 498816 628029 768045 703611 863350
13776 863350 822192 613910 599809 684646 668179 580090 382437 477149 685875 569708 526190
13765 526190 410219 837500 531830 717324 428605 664994 533068 633882 580297 87433
13754 778156 709881 534647 590348 654360 229388 448758 426966 567299 282981 768836
13744 768836 450031 730194 949026 594152 753615 365053 677326 637840 877407 508028
13734 508028 780235 280116 461192 562827 449070 637674 558678 311086 810435 308088
13723 440904 304090 331997 679734 773590 352776 435925 659628 412795 580330 375256
13713 375256 556250 544478 492221 606041 550169 801184 767988 515519 360771 359617 356716
13702 356716 361310 560991 516442 234266 362440 319231 558929 205625 282152 718711
13692 718711 249803 347293 437467 794064 399896 644878 266800 239936 541126 390195
13682 390195 361436 779040 404349 411052 574190 462689 309076 415196 736654 601780
13672 601780 388918 -12327 83965 494514 641804 383073 304426 -47625 647545 656908 681678
13661 681678 559998 450379 639862 261568 275573 186687 510595 488532 520389 424771
13651 424771 506939 240476 355388 377748 678759 580940 457528 382300 315681 384452 323547
13640 323547 474479 320178 486275 605437 722135 559554 326667 441096 264338 317408
13630 317408 242905 242674 161079 687446 293077 31340 479504 265059 183602 50362 595242
13619 595242 503180 381428 745204 268558 336641 332193 797412 539080 -6779 378124 421581
13608 421581 247700 312977 536580 407094 461664 374345 393813 318027 527784 246909
13597 223637 515726 429877 612408 331383 254392 358882 442734 379652 661759 224609
13586 303525 320271 21488 195287 398712 558017 324276 246429 522594 309030 243147
13576 243147 77777 285916 203182 463712 480959 234346 337669 210525 328255 378206
13566 378206 289621 303142 206659 211720 324921 535883 230094 380465 218469 365195
13556 365195 321194 435862 323022 196410 123368 355437 190902 127684 302082 406994
13546 406994 449671 383035 65735 380481 297541 227383 380261 374617 17643 236440 158118
13535 158118 -56771 436465 39376 356860 8328 313770 53325 250806 83165 131925 502514
13524 502514 620211 170312 304977 243013 286454 419639 -43167 220061 408203 327914
13514 327914 653264 137876 -26042 -108237 310704 349729 327339 183734 262159 324580 181286
13503 181286 215269 196927 321896 548536 203855 407206 347391 159863 292810 219259
13493 219259 115713 -84172 167735 351934 574152 284697 154338 169573 -8960 467704
13482 249589 167607 374286 363974 354025 50784 434918 -86395 329062 114815 332104 215720
13471 215720 152241 89313 -49248 91081 6537 -65419 31304 133060 -15237 288849 297861
13460 297861 13258 40920 46316 232141 8786 244968 299203 347688 41122 235787 134620
13449 134620 174782 183526 548364 382558 288468 51431 47742 348715 105209 92520 48002
13438 48002 138604 138878 73097 131247 233593 17623 62334 -131642 265519 429870 44428
13426 225272 210934 293009 -194518 23732 47086 388839 293042 299232 217092 167665 504542
13415 504542 137217 287881 517621 73545 321123 176599 157149 143263 347757 137841
13404 269988 323360 64122 -58698 549926 194620 299220 224904 -69407 266747 -415167
13393 36762 196016 171315 -331699 354690 172131 -6994 305523 269737 28973 239392 54437
13381 406043 54988 -91198 191991 214812 198054 203921 315087 -80957 47913 136450 -79619
13369 103256 456079 25727 318053 427528 24354 120840 209780 267879 160265 260815
13359 260815 229450 245962 7110 140471 -29805 164986 -296308 143033 190140 420064 225769
13348 225769 405920 425297 311912 425979 -44834 175299 450159 290437 312764 278624
13338 278624 225569 312938 138856 344527 11846 454467 395934 538534 193635 175339
13328 175339 247300 197559 257586 43427 277274 153868 424742 301249 8799 446141 256709
13317 256709 110288 31664 -57564 126295 197867 212818 292910 133388 514716 124387
13306 185848 -36093 -101364 64248 190285 -273204 153680 73943 136024 201453 33386 -53764
13294 157336 106256 310133 -66217 23632 51235 -37447 198685 344505 363976 84525 60746
13283 60746 93165 -13554 97596 115225 122186 30075 178016 131945 270754 -79758 61346
13271 -16823 458482 264863 -144710 -23868 -147307 -115795 -57406 543375 -61910 6285 61334
13260 61334 -143048 -228005 71706 -108056 81026 -27392 -88515 127203 255975 18020 296133
13249 296133 153870 -27265 139458 74336 112838 -85713 -168822 147741 -57521 573235 -154620
13237 414452 262044 -197851 160073 -111349 183912 98999 -77056 87870 278249 362981
13227 362981 300010 357494 -7267 -84986 -126749 68978 141798 212178 151213 -256501 543334
13215 400759 23937 -116611 206228 198134 53977 162205 460355 -2753 413717 128060 179511
13204 179511 -65106 199986 67083 23931 116322 256372 147048 -259770 26649 276878
13194 276878 -172308 564815 248186 6853 181636 91808 -35044 -43617 -69967 103566 -263647
13182 -146988 90784 -77883 13442 90849 118503 -35733 92863 -83421 99172 205605 -217341
13170 118174 210771 189660 207046 204519 206206 277568 158631 280541 67604 76304 -33786 375621
13157 94945 -237739 226405 249950 -42819 -130374 -22990 -43736 179774 294874 130692 74271
13146 74271 64666 184704 -81013 36146 181462 208070 245701 -92222 84186 83832 219755 449083
13134 449083 33961 107916 100235 57671 -96069 -152401 188498 102140 -428 31543 331799 -26022
13121 57411 265286 324957 -28473 286972 194520 -147403 233958 41001 302902 240796 -58879
13109 172837 157905 259474 -19329 143524 167686 -141038 329044 -74801 436460 285912
13099 285912 124455 344449 6239 362344 230040 -341869 276822 -130679 116335 369337
13089 369337 57481 -2911 -35117 -8024 579822 17623 160202 -48099 150662 -63270 136506
13077 -56526 -89349 301670 180395 56966 72453 -353872 -72025 -138043 31986 -65000 97754
13065 141860 168049 512528 267656 -131187 -55989 314900 315612 -49231 210792 524454 132337
13053 90406 62124 -84335 -12689 -131839 107859 70074 179284 466396 380422 -319520 320563
13041 112109 448872 123330 113261 279092 106919 -23910 -67291 102443 16373 -2574 -43494
13030 -43494 205842 174005 247543 7905 193736 -172977 397637 -113268 272086 37491 217117
13019 217117 -255788 191817 40782 124308 156497 -148814 28523 291071 73457 66163 64690
13008 64690 478906 338008 139507 -50017 -33236 -244492 89215 -103455 92310 100917 -20412
12996 11304 -147695 187245 -363035 251081 -220800 -81381 8129 212012 -183429 107106
12985 444356 194550 -156990 -282603 110450 -234127 169184 -64668 140358 -1328 230110
12974 -58907 165293 -209058 449157 186159 -93990 -37563 -9021 239245 -140540 74986 -310695
12962 -258843 185842 193391 10294 412526 19478 53092 71029 128839 181427 -134844 121921
12950 220104 45400 -163244 -503253 71246 59178 291585 256317 458715 -108626 34555
12939 -9732 170865 -192155 341659 275083 68949 252676 135757 117318 -62021 176141 23901
12927 22070 -208791 -169406 152307 21421 -88517 -47075 262037 -14245 120322 56052 -112582
12915 170303 226690 96065 179223 -75749 144991 -241464 -165892 113533 108825 40115 -57556
12903 93938 -43014 -102297 -26827 -197004 96007 -77186 -7886 225273 -146862 227462 138788
12892 138788 -131826 12903 224374 -97062 -26919 -40353 333880 249867 8092 207992 156878
12881 156878 414010 91417 161479 -45808 2151 -67812 24311 88916 114110 133834 73428
12870 73428 -492899 105767 130383 201255 371050 77137 154660 123886 -316863 203978 -177791
12858 192984 266891 170896 6902 39428 56893 138419 -256279 78975 16674 126010 -137231
12846 -106706 155562 384773 177252 87809 181821 -124682 229294 90193 33054 -175758
12835 -93665 94362 111182 124673 69547 225053 -136007 -85909 -90288 240179 -179380 306909
12823 -56135 68937 -295320 -71827 120337 -293537 375318 -17266 9344 226413 -89511 68182
12811 282477 71374 157406 -40519 76792 -142367 -34450 85319 272928 -149066 317387 -77973
12799 -45914 20508 -170260 -37918 -135445 -43385 170839 179666 45100 128705 -217473 -106039
12787 139127 -94769 322298 216148 177618 -188958 -182232 369757 -318191 -243203 -286578 270203
12775 -78238 -14461 45989 139248 -158894 -146667 49889 -364407 -246999 -23840 48732 74418
12764 74418 -6012 -108644 300088 30754 142595 -106380 -2608 -128362 -122136 45483 61712
12753 61712 -132490 122316 -188043 -204701 132225 148628 286173 169962 -99674 -115931
12743 -115931 285352 -38203 -228157 186103 -116931 -189534 189499 56092 131013 3846 122771
12732 122771 176774 -60442 -26772 72912 235341 -86019 270661 223156 155290 83942 61569
12721 61569 30362 -130960 -397502 -52244 -173057 170364 4150 548697 91913 84745 66780
12710 66780 158088 465741 96992 515650 431065 128722 282079 428237 544965 133914
12699 69053 -23209 -65962 -30286 204266 87648 68578 49640 85104 -105001 328818 -155163
12687 -139480 -171866 259810 -55731 268281 227708 -120213 306935 193436 341556 169343
12676 171323 212271 212223 -42763 20341 -10153 257384 420547 -11518 91635 177877 32273 -187601
12663 340933 -42064 249414 161505 -280146 -5292 -88478 240695 337918 561724 97476 257443
12652 257443 159965 198996 18334 191562 41444 113262 225588 281506 -184657 225859 166661
12641 166661 1396 377349 225768 115001 109762 -9649 86849 62431 24729 111785 344791
12630 344791 109497 171858 73101 172000 149858 -20623 -187468 9989 193597 221600 -197822
12618 141482 440607 120465 36346 56359 242389 -40904 -136865 -138652 -93449 35112 -255079
12606 -156034 -362074 -4336 23094 81469 -55678 289179 -258251 212822 105651 282870
12596 282870 112236 53339 244471 46222 -142293 188403 134306 35711 272575 102267
12585 8842 168579 50349 -143108 54260 16256 32735 261896 -79567 280728 62683 -326032
12573 372038 -60974 -35089 -180412 -96533 71629 -245130 -153872 11656 -7883 -47207 83917
12561 174719 -60063 56859 358831 -55486 217097 323155 -49637 -67746 -823 -82345 -245337
12550 -245337 258954 -92596 120606 172493 -153889 -42499 -31430 -183532 -86556 -21274 259331
12538 182027 -116335 104792 -187848 -42129 345231 -247046 -266892 384043 -336909 -23446
12527 119388 239771 104988 263945 -19385 -111314 -207370 -63681 -13870 -1725 -40744 9587
12515 46290 -214887 224721 371444 -19384 50499 -95173 111127 92175 36643 -75268 -35408
12503 -41194 -216237 115735 109683 12716 166742 -245248 1072 58854 174833 2303 -5117
12491 137759 150180 -274064 -49925 163128 219716 176735 -14547 -108638 255327 45762 -84702
12479 7602 309762 111642 330502 243475 -75583 85974 -179505 351286 110470 128464 129686
12468 129686 260831 -164081 251260 -94310 -263430 -186405 226736 169238 289332 -147785
12457 -158976 -44122 -24986 6502 30066 -76208 -57928 -111655 14844 -43102 32532 287177
12446 287177 -69345 36939 189490 -15212 52795 118679 34206 272652 -250710 -95841 50746
12434 168165 88473 130977 17696 141585 -128284 287557 -114816 236936 -129188 376174
12423 74105 -241515 -94799 130957 -6101 1944 87331 -38622 1528 -37480 28424 93083 180308
12411 180308 -175185 -207399 260061 344388 -201036 91049 -337591 -64608 359901 -270824
12400 43235 31916 122717 -24809 -55553 -53744 45969 -217035 29675 -14275 288794 -296488
12388 -28142 290444 -184104 -35277 -51483 22750 20166 -29220 215625 -9944 230238 -33110
12376 41407 -178610 153785 -115792 10862 -98541 191405 -349852 -43359 -64294 -288464
12366 -288464 -81138 36236 232253 184757 68320 31083 51050 50629 -283523 119944 37413
12354 183972 -14542 -366173 130424 -24667 -65000 -198212 -115476 -48375 236463 236501 87788
12342 -261947 237825 -182239 -107784 -57485 135239 28660 119449 -93734 29737 -89717 -194464
12331 -194464 184377 268600 -58240 -69554 229131 483237 -208775 27597 193347 291963
12321 291963 184046 -68070 4924 437908 39740 26919 180144 169187 393139 466524 99094
12309 -144753 65499 -34048 345263 -300974 3145 -119123 -430301 -36074 -125439 -343902 168432
12297 -257954 -56223 -198076 109952 -101214 162078 -75141 -36590 -50171 -76290 116709
12286 148725 217986 21864 -19559 473802 -100532 275039 121027 -288192 158776 -265017
12275 380204 268356 162979 387704 472055 46465 253227 606424 -60769 179782 119545
12265 119545 114809 -278737 126852 244668 202029 -170391 110653 7905 -86946 58382 321708
12254 321708 75315 43142 270169 159675 44903 -28986 137143 106813 301101 39906 388965
12243 388965 -97358 59840 203276 -131468 430732 236276 19391 174200 -154996 6114
12232 100266 201533 353077 -194430 213110 69419 123263 348500 44980 43449 24506 302095
12221 302095 -203271 325113 379827 256100 328283 -162072 501137 146600 381712 317339
12211 317339 167533 246285 284550 117196 105050 351960 182294 157694 -167605 181808
12200 77838 360929 -40838 399491 218992 216603 -17764 114982 264568 27318 52892 164551
12189 164551 369086 -273366 -78022 58350 303888 21229 -187889 162737 -114611 418836
12178 -247057 215922 291646 -105691 118973 285818 378368 -15121 -32764 303865 258235
12168 258235 7006 119392 205480 338354 289587 30898 236667 -257065 98703 118083 -23262
12156 173461 109589 12400 -137502 -104888 139907 99456 301915 184551 -93942 72934 -132232
12144 8204 202162 674 105685 573130 306564 -145024 107971 21077 302733 -106524 -34549
12132 157351 413994 -198522 187517 -50535 170051 151490 -27046 29050 -40833 -271914
12122 -271914 66110 -53376 39472 -79185 86584 -67416 279872 146171 62470 -15017 53282
12110 183588 289021 152917 288558 -84966 -350813 -176936 -218339 -82355 145310 -12063
12099 31091 272497 109965 60434 90876 -203016 -64714 260874 110369 -312193 526 -16457
12087 92136 335843 71718 297381 336585 69915 58304 -71407 17833 -127368 161461 297004
12076 297004 644623 1758495 2249519 800323 582260 -196047 350227 55700 -189385 215197
12065 166521 6435 154564 105435 94698 -139242 124792 33621 78549 -39449 179425 361830
12054 361830 88554 -130935 215142 45951 -56156 -147373 218771 192492 -228411 64446 -290197
12042 68335 46963 -53858 -105086 223667 -200770 -169444 -176812 85018 -105397 -275226 180431
12030 72986 -205358 37161 -15790 -306944 21044 204133 -216394 -240948 55551 135147 60731
12018 168858 40483 -159244 160216 65112 -121903 84644 135704 -10820 -267130 51672 476253
12007 476253 -211729 171096 417296 68596 103847 -9924 -396414 -241693 -162840 81309 -118392
11995 45532 -27861 -386696 122059 4367 -219956 273328 -612576 -74540 37521 -167545 -338342
11984 -338342 -31585 -105657 74466 -16418 480537 -238732 -83340 -436189 -240452 -16407 8573
11972 -172596 17072 -230870 6490 95871 104292 43494 23629 270205 -275226 131939 19763
11960 203405 -45617 -116458 1350 5945 251881 189077 131892 -213077 -115492 -86978 -124978
11949 -124978 56492 210563 -130211 436047 -111521 465415 -18136 295105 -9292 299648
11938 92985 18666 45492 185878 237141 -219513 -47588 -215136 -24908 45018 260401 72463
11926 -208649 28883 -211760 -284201 -176568 138722 121769 14721 -106423 -123491 16790 179504
11915 179504 -162511 99960 209486 -124264 486121 -45656 170143 -340260 -131713 258429
11904 310040 -30091 143497 -28721 225189 -83557 45093 -327949 85127 14800 17921 -152265
11892 -10390 -115555 28381 -156052 50774 180075 166792 353337 66845 63301 -94700 59172
11880 -23119 14112 -174276 209193 150120 -241983 174739 -17332 113123 -250379 227461
11869 113586 -85253 -61735 -224807 39206 -107155 7449 -293817 -236746 127080 -155865 54056
11857 84110 -61313 -53729 325579 -37512 -128176 -3109 -100728 -338534 57798 296636 -78298
11845 -53331 377666 11186 2751 -204017 22324 -311888 3683 -139013 -181581 -137554 -337777
11834 -337777 23694 -141668 249902 262530 -333855 112586 -175851 36776 290369 -44381
11823 -124850 -93942 136844 -97782 -28119 53170 100081 -217247 -79062 179735 -81897 -83843
11812 -83843 111827 -213422 93917 327946 33554 131123 -77877 230779 295281 -104999 -266254
11801 -266254 -29025 192287 -7399 -196875 151580 42469 -220943 29994 185322 -214590
11790 34311 -128734 6669 176654 -105054 133262 213380 113720 112353 -440425 158673 48625
11778 25934 -25349 -98864 42407 -26796 -39631 84826 175011 60519 87508 -32694 -115165 256785
11765 -77186 19189 -210435 16912 79883 127811 -319435 -76948 202630 -265234 -140493 -64316
11753 -80187 -97901 116078 -68925 -44562 119096 -68187 60786 68327 178719 23704 -62563
11741 -120516 281935 -30726 316787 -168074 208745 -39427 171706 -228275 162886 17192
11730 382929 -312780 214452 -162191 135739 -185999 -119040 -152608 34251 301940 -155094
11719 292429 -191574 306329 79773 233054 -21855 -163833 -277361 132575 106211 -102895
11708 -116663 470467 236021 374148 -19030 -313793 -1992 419162 75499 492620 -97747
11697 -118362 63144 174769 97218 86670 -198249 10492 28394 -112285 -104586 69891 198302
11686 198302 -101522 115645 -93620 -201306 119253 -144128 63222 -262752 -37750 44168
11675 -130264 -111748 -154460 -105011 -112754 361373 -16176 81839 -87156 -231694 -226977 95436
11663 -169916 229536 -43710 79362 -111729 -185956 253424 -41203 119894 298996 60932
11652 114225 -110399 78213 -346130 178453 -93410 -47013 84751 -49572 -104063 -34778 -31767
11641 -31767 74645 187390 84885 -46743 120168 252775 83928 -50146 103370 -413513 -28353
11629 119025 2920 -81034 14982 -10911 56835 -327648 203097 179078 399378 29252 193644
11618 193644 -207473 -207090 -460543 -3329 -59410 53686 -21964 115366 255858 -176850 65180
11606 480144 -77012 -44076 -104725 32721 -195872 10728 27841 264964 55753 -114813 91080
11594 198988 -147516 221700 59459 -148682 69827 9879 -43328 373669 373467 -191550 55743
11582 295744 292254 -23086 -82285 208298 -209000 -122457 120596 144199 20239 84644 210436
11571 210436 -64760 5570 379865 -74058 99464 289743 103283 69506 6449 -149541 112637
11559 486462 174387 -233107 208023 25847 83753 278540 169664 44978 -36747 57111
11548 283300 277505 127818 -322785 248616 186331 36555 -15175 282179 69069 160280 -103233
11536 263991 87470 232380 398593 96911 127890 180801 331767 -327481 253375 -125166
11525 437809 -69537 126106 305595 182523 441810 -182692 301760 -28853 -144596 -47191
11514 -256234 250004 153748 127087 232750 2081 209864 -33794 270750 -124105 33040 259588
11503 259588 97769 150754 -159888 -8233 -25623 172706 116938 -43182 51868 373306 -5084
11491 -126525 -116743 236916 -227794 -109570 354230 31978 185344 264914 -175341 354928
11480 143633 277686 11059 183290 -55234 98975 321257 103505 2762 100977 396988 191416
11468 279898 248530 276709 -150313 -17712 97423 322303 171528 41651 -65870 353348 -128281
11456 467907 357595 366952 142290 133440 -104788 317247 99982 19391 420606 6695 -105691
11444 285573 235171 344630 124360 -80552 -13445 -4212 227714 289518 -34925 466278 -106426
11432 -33616 -121609 110668 -241368 216748 -121921 -13154 259228 74892 81744 -29611 203608
11420 159597 -53414 -175472 113952 -276236 43457 -46757 125889 154314 -51082 -49018 206790
11408 24522 -217420 101386 -41304 232081 225974 196106 50410 -3883 223775 86183 222734
11397 222734 64384 180279 -16472 -145943 34853 235251 159916 -130857 -218870 -72164 -156973
11386 -156973 -346168 -7450 -88067 79250 219698 -79432 -83824 -98284 34340 213179 -203346
11374 380060 -208595 -54770 8872 5012 -39722 107006 -133426 -201290 -178124 4413 -2061 -18754
11362 -18754 -182992 96190 -96899 -4160 150244 -145590 -38781 125957 -261338 -68510 -281061
11351 -281061 -212161 -242470 -250956 201358 30538 -9334 -70458 -22053 23189 -52861 263646
11339 35522 4459 34657 -28337 -45699 -34252 -52589 -170276 -60060 -177311 37738 -177697
11327 -85502 168668 -224250 -175459 -6673 -2828 -335153 96838 -42494 -184936 101769 212190
11316 212190 193460 141041 18899 455079 -435410 140516 -127640 60912 -21961 -94272 293191
11304 -307298 102367 102919 132861 22186 -178641 43633 16871 23452 348597 -158940 -15628
11292 63768 -273992 -319167 293381 -20318 206084 278302 22143 -59746 -62639 -197729 35165
11280 -104034 -66258 433218 139973 -42062 206911 -109774 88835 351576 114781 -42605
11269 -7014 -133670 -346282 140015 191412 -110847 128264 36582 67177 -150601 244466
11258 -183594 -53343 -34843 -43484 3120 -80200 294739 -19753 32054 263827 -45580 133631
11246 100190 366731 -123035 181026 162486 200055 -257797 55004 -234816 107584 -241532
11235 97546 -271282 -23682 -182217 -54999 -13692 -180118 -260343 11835 28631 -172562 92494
11223 -105122 49222 -28655 265308 -60855 -191184 333166 -128192 44650 -59226 -156923 101544
11211 204123 -352807 -1707 125986 361315 230023 39723 -157996 121353 77784 -212778
11200 -174449 57268 25959 -145631 4374 -178366 -5602 -103111 12547 -85750 44942 60344
11189 60344 -152769 -208232 -240822 28426 27109 914 -156018 -208972 -369603 -228684 -196922
11178 -196922 -10862 305814 158541 106785 145509 145871 148943 -93792 175950 116962 173606
11167 173606 -409686 -192522 -37233 -58679 -103623 -93757 -115725 -148497 -82584 361207 -197029
11155 57616 -57361 -403232 81978 -20443 -64334 7391 62392 -126347 -108333 -133675 -129848 216370
11142 -201640 45134 427715 29584 169128 185956 -43284 -225200 -296253 -189118 -20459 23311
11130 -30970 -24758 -120359 128258 -65857 -228833 166935 -140090 -146717 -176719 -58548 -177311
11119 -177311 -127911 -109306 265193 74197 123842 395625 94377 167160 48218 95723 -31229
11107 123657 175880 -45925 209828 97780 229853 -23198 199776 175301 -5706 129779 243286
11096 243286 88775 349108 49847 -29234 -18717 317750 44236 -160005 67020 -116419 115721
11084 299183 185180 76895 393624 381862 -271009 346162 121387 -120129 73651 377655
11074 377655 302355 398176 400803 160008 343174 533900 540014 228202 297839 451710 565629
11063 565629 456759 250844 -80813 548371 498184 839795 326273 503141 444268 605688
11053 605688 1057308 638281 728040 669160 491759 610039 750144 564854 540801 895238
11043 895238 900143 508925 644224 670364 845502 641310 398245 868353 639912 781825
11033 781825 575523 535803 1154486 644682 877874 814535 746684 973496 778001 682629
11023 682629 582205 713668 759599 449296 619157 626597 542020 566383 668152 634441 394511
11012 394511 876196 801781 303905 493557 607608 701510 392515 848265 428619 407367
11002 407367 428256 527092 819500 728300 589602 864374 998293 651411 802796 846875
10992 846875 881941 783976 767652 850540 873278 1128527 710405 977773 1008371 994773 939105
10981 939105 1285200 1101719 1474157 1592175 1491413 2063995 1999750 2348806 2619672 2713652
10971 2713652 2592240 2652334 2717080 2572580 2207354 2217732 1757447 1962155 1738791 1785464
10961 1785464 1489967 1770671 1798191 1986508 1897947 1914094 1825611 1495276 1342329 1173831
10951 1173831 1075261 853700 729188 313306 456391 240160 432553 601656 77387 321777
10941 321777 100671 260739 312745 136733 278999 241572 169387 86503 236382 246753
10931 246753 209229 -24028 323146 -170593 33747 21430 -69948 -39995 95043 41765 329555
10920 329555 208910 -446803 35830 199731 90637 -122001 79543 -2186 188275 -98244 -89533
10909 -89533 -114145 107476 -112358 25755 9635 47327 55426 -190320 -14870 177801 63247
10897 -212136 207231 -156506 -59202 -11011 -151794 36586 53221 193101 52795 -159552
10886 -18592 416462 125256 -8963 -5098 -9459 -67808 -191390 239970 62517 -239810 -200670
10875 -200670 -67671 80489 -413161 180141 171075 -83732 -162663 203694 -130230 -66425 125747
10863 120962 246888 -131805 132214 187065 -18962 20921 -153222 -55528 -72413 -136479 81843
10851 3085 -431008 -100061 -37598 47200 67246 222171 279154 -93530 31548 160241 125875
10840 125875 -3087 -187365 -11771 -48790 -233333 53417 -77896 -76240 -62353 -224732 237563
10828 -136507 -141310 -297964 -8435 51604 119665 353128 -895 -29208 151721 9983 -57619 -36240
10816 -36240 16113 80673 -15159 -218932 -150221 -166877 213214 -49404 -331873 290314 -108408
10804 138478 84430 -142492 78578 -185317 -6779 -139641 -41862 165839 -21266 44875 38514
10793 38514 -336268 -99850 5310 -47799 -87323 307684 -70927 -216882 -290623 -131586 -359477
10782 -359477 -25367 62433 -44672 -135937 254176 28518 -80302 -47304 133763 156149 -128495
10770 -360673 116167 116010 -57650 -116894 -212215 -254571 85388 -142345 110026 -326528 -9683
10758 101598 -294210 -47863 -199915 -62751 -240051 -149266 -41322 9009 79909 466823 221217
10746 206954 -11796 -90267 108493 -240285 208688 -307347 -191036 205744 -345622 -145559
10735 -270450 -158993 -32657 -116190 151279 219548 -92238 159979 -40884 10148 -121328 6026
10723 -221895 584901 14112 -2246 61469 37117 -82225 -139428 157323 -184927 148046 45416
10711 289121 2038 -84006 141729 -184092 -133484 -270712 30382 -121709 -276365 -234964 -110622
10699 201280 -138860 -27727 122456 -365550 90590 41899 -75207 -126751 -170064 354532 44226
10687 19825 31994 -387840 -13596 174850 -9727 -166630 -231131 214165 109676 -136869 -21200
10675 -14224 56355 64960 -204553 -512890 -157377 32502 83325 180916 443665 -127085 -208522
10664 -208522 -135219 -265417 -269941 -173740 229664 89336 213334 -9591 -251935 18664 -304334
10652 -13861 -168219 191544 -168142 264046 -86449 -151334 223295 11707 -343700 293330
10641 -167179 -177410 -307024 -133349 -96855 -176167 225492 9305 -12032 -179199 22438 -12867
10629 -97427 -3902 -29296 54558 390359 -285182 -176724 -114091 -31601 -190364 114348 167055
10618 167055 21949 -136119 -182608 -244897 -209300 -21778 -105526 52269 28693 12081 -308770
10606 -120134 -118811 -18567 -46165 -24235 -47876 -52813 42419 -158786 -82524 -162402 32264 96721
10594 96721 98517 239016 -101346 219786 -74886 163325 -243159 -109280 110930 340990
10584 340990 -22918 132488 -235595 -108427 -73631 382673 -20009 43143 29421 84107 -57117
10572 176142 -201668 -233470 -53761 -207144 -62554 -367753 -172497 98987 71789 -377200
10561 -227970 25568 57761 -197356 35402 -283602 -120907 -125369 116824 -400673 -154887
10550 78568 -253467 -55229 102176 -100463 2873 -31433 -31234 -118318 89249 -248217 54462
10538 153169 90402 -323642 -50787 -273845 141645 -100451 185317 -439458 50548 35757
10528 35757 97146 -257067 251175 171409 15172 109542 -98581 128083 -264852 -183041 -13861
10516 14792 8623 26652 377876 184036 -12791 14235 72520 105914 -140916 346973 -104504
10504 108307 -208294 -71133 88618 270364 -140460 -353 -864 -447181 -102981 -125687 10563
10492 -98830 -155077 258912 6479 -62648 -56829 238657 -154753 101704 336542 46774 80326
10481 80326 457737 446858 884288 328289 90287 114705 338082 -240978 156652 380803
10471 380803 208571 6894 169354 34179 249832 188983 218161 -402971 33763 22662 -219045
10459 359251 111893 157870 7570 -687428 -224466 142851 429789 -107525 -4769 -46558 150053
10447 41366 372411 -6853 98326 -89207 -370010 -132365 5161 31941 -81103 -121069 -218600
10436 -218600 -55803 113503 -53694 93486 -119797 19153 -48790 306396 -39998 -22281 45900
10424 273256 -43883 150797 -204819 92571 311943 39541 -69829 -112928 -72147 -341946 -259032
10413 -259032 172818 -303664 132312 -100933 -52866 57740 -374732 -177406 55936 -107667
10402 214482 -35987 211757 6018 128688 181150 272576 -199024 183254 93568 192052 48131
10390 -22450 -16675 332305 438141 -74220 190276 220172 142731 -239541 206870 -15482 153531
10378 50761 379365 675460 287459 -80546 158954 -14912 71783 302600 547213 689948
10368 689948 269831 328214 116397 294627 121539 453923 151871 200704 117289 433991
10358 433991 105490 76781 -32965 313367 -1215 99833 380711 658547 534571 426451
10348 426451 651056 689343 223181 513510 494979 192350 554014 -40692 -8707 144866
10337 309541 -123814 127835 74173 121210 209724 -138020 -114970 194567 138655 267217
10327 267217 -125075 377916 -35993 233961 439472 31370 33039 298845 108524 56872
10317 56872 345727 186130 161543 174620 115195 -52153 -44392 161386 186574 -184385 -131251
10306 -131251 189538 -95171 -16009 -15026 -94378 137911 86620 145155 -38629 -131780 343838
10294 -88518 -121663 -44766 -259211 170858 -98988 198697 -255003 236695 1320 46432 -42090
10282 -238682 -99902 109224 117315 35477 -259288 83981 16347 22684 -184806 -192443 102650
10270 94053 367867 124114 54185 -49771 -234294 119053 328746 -238311 277835 -49106
10259 144262 315699 203188 367848 24300 160245 -104704 -104048 183489 213105 -14927 77021
10247 -55693 175538 32917 17410 -98332 -348672 -233761 1138 120382 -25732 -1444 60311
10235 -275042 -173439 -168916 40808 11101 -217637 -174892 -157977 -371718 145630 16256 18210
10224 18210 -171078 394 -81029 -13805 303086 -2250 -188483 127963 23449 -30498 -368005
10213 -368005 -18477 58507 91593 107890 7438 -307025 -102643 112872 28188 220947 5274
10201 63945 -115382 -260269 -143823 -48416 -526675 98471 -60574 -333149 -343537 -60735 3825
10189 -31690 53241 157137 -160105 22621 149522 -229652 49848 -130767 -319991 -125228
10178 -16857 -70796 107092 -44253 344718 39571 290289 58747 -197210 -162094 113290 -230618
10166 -188106 141044 158129 170633 -133921 -175781 -183372 -53901 -34238 -31040 -75594 -19897
10154 133185 140463 21892 121883 -204739 -85251 44421 -232602 -414091 -296671 -60976 -334403
10143 -334403 46857 220103 -60119 -90656 -88212 -22145 -110832 -169684 -544152 -113796 -182145
10132 -182145 103143 -191033 -176134 -19764 59295 53449 -204261 -207120 61075 -265945 224896
10120 75494 -430009 94005 -175565 293472 -124706 -50309 -108180 -11444 -355549 -63254 -283668
10109 -283668 79975 -5833 -17759 -174952 -19741 132105 -77390 -14185 -51088 -59499 -208900
10098 -208900 -335139 84858 57952 152763 -219998 69069 -225999 4723 65966 -110241 20907
10086 -159270 -44487 -18227 -283956 -333182 43935 -44474 -179516 -285677 172606 -173802
10075 -122015 -110703 -95307 181042 161116 92253 -77779 -292439 -23690 -363150 243235 61640
10063 -18378 236 77786 11721 -165526 -427575 -23760 137807 -149986 -113955 2613 6107 -66325
10050 -53899 -210553 285268 -136575 -156496 -124339 -211533 -24627 -331497 12571 -23883 86082
10038 33475 -113385 -205454 -172574 -212279 -24884 -193305 -100771 352052 -190527 -299392 -115632
10026 -174135 -68090 -191334 220253 -71084 -235821 86224 -40820 67533 54526 10063 -243422
10014 -77364 -95467 151361 -191211 56085 72977 100994 8697 121798 -58612 -220294 -79458
10002 -3470 -95326 -142673 301093 160231 -73475 -275831 130926 54093 155624 -97569 50464
9990 115830 -184562 -209117 64334 -249010 -8033 -84262 -144524 -261025 233418 -338601 -36211
9978 -138555 -138492 -51274 -288935 303573 -219434 -58513 -2525 226501 149516 19690 160348
9967 160348 -52153 -43542 48012 -355048 -69692 93187 -59523 56896 -223066 -107784 -39354
9955 -178525 6799 19458 -182867 -38544 -220741 -274165 277035 306214 45572 38787 97272
9944 97272 -137203 -19925 76476 -73397 131742 -224613 -375695 -293742 97800 204954 338020
9933 338020 17312 138603 -100218 -181275 -225555 -12854 312935 -44579 -192914 -216764 180930
9921 -241034 168120 -22018 44335 -252027 49984 -425960 162373 -100717 331559 138561
9910 16937 -75711 97182 -25469 -189066 192056 59631 -324587 -261740 -104524 -190275 15431
9898 -248073 10269 -2900 -101215 -238976 115990 -361828 -124051 -274737 -50780 97504 -2702
9886 -7807 -108829 229783 -56469 -82867 -196676 -70738 29371 -342859 226135 -76828 -288753
9875 -288753 -64171 101330 24263 17718 -21874 427 -76406 -91430 54512 -261205 55703 -314769
9862 -301220 146428 -448258 142925 -34680 -327027 -128402 234805 191289 23287 57931
9852 57931 -52839 -139038 -8392 232268 161107 -392793 193748 4216 -131443 130765 -16256
9840 -147861 127689 -230488 -297659 -26612 -196547 -112903 -32607 3282 137079 -410538 134247
9828 29784 69575 -169054 -310391 -28400 -76538 -190379 -286204 367 89902 47944 -94430 69115
9815 -186510 152456 147573 -76344 -360420 -113791 119190 -98675 -53547 -137668 -299621 -240024
9804 -240024 118735 -185968 14641 -39787 -17410 -393342 -145192 195066 -247468 -412015
9794 -412015 -170798 -233565 -226611 -11868 -33658 -64243 26435 -92325 -134617 264441 364 53574
9782 53574 -476675 -147135 -322785 -53764 -183749 273412 13774 -377366 -2912 163175 -48214
9770 -320982 -369480 -239515 181813 351485 -98124 59507 75379 -108954 3275 -220438 198513
9758 55228 -193692 -162097 216028 147517 -259951 -163845 -5888 -9154 -16435 -224462 170156
9746 -53043 94273 -51235 95456 -175810 -276117 91397 122717 252253 65193 -305153 -238393
9735 -238393 -134886 -141426 79059 -372236 59694 -55844 -50233 181194 78213 -273845 -79165
9723 45026 -31111 -80714 49851 328700 -189956 -3042 219557 19550 -39021 -172987 -110839
9712 -110839 -253087 134436 -194801 -110836 -231487 155988 -45829 37826 -254319 -195523
9702 -195523 -92809 214195 -68252 113585 179582 62310 40684 63185 -70075 -156667 112651
9690 -127901 -97919 -12718 292502 46279 176513 158821 28626 164812 -422992 -50695 115516
9678 90864 -441 -174779 -260728 111801 -142153 -235949 -37648 -230720 -65300 -151676 -308522
9667 -308522 -181824 -263940 -371892 12686 -99367 -279772 -74530 37801 -64873 -183009 17344
9655 -115507 -49095 -197390 -350045 110566 174489 -187329 -20203 79272 -75810 82401 -100525
9643 19821 199436 -86565 -215209 125934 -225944 -77692 -107899 -188307 80839 -120957 138721
9631 -101391 -45761 61762 94959 -397891 -217816 -143560 5670 330969 180215 -21299 -139817
9620 -139817 -16849 310142 260186 -182360 227427 206942 -144244 -254721 125339 309876
9610 309876 -307551 -648227 -158023 -125021 3904 136660 121359 -254478 72777 -104791 -226614
9599 -226614 -97471 -230230 -72695 -188023 -311283 -76235 -143542 157522 -116272 -126277 -342689
9588 -342689 -125797 -54675 -229655 32216 233616 -16462 -3411 -70142 -264748 219292 -208747
9576 57662 -8211 -220838 -99249 -68486 -39963 88714 218580 -260682 -10635 19782 21293 -19122
9563 148618 -9597 -268905 203002 -480589 -13626 -325579 -267278 54215 -245490 146835 145027
9552 145027 -52570 -14889 57815 -100651 89445 -353273 332237 -252010 -276700 -80223 73273
9540 -51268 -53054 -81663 352911 -254417 92448 -129597 -8778 31149 -8310 167795 -11078 -353367
9528 -353367 -245215 -253467 -141217 53599 21425 45751 -119673 -179539 -427374 -195764 49126
9516 -109630 -121292 250807 -68271 -229824 -97445 -485146 -406921 -281146 -31920 -180251 -3682
9504 -573532 -26538 -35930 -164366 19961 -276259 14986 119983 -106167 79767 98876 -353119
9492 -199192 121989 114073 72216 -32615 -180167 92820 -240470 -136114 -58682 -47041 61065
9480 419662 -226077 65748 33409 -53053 -310757 -218828 8183 -201710 -242603 -137783 -27849
9468 -69013 84576 142576 94031 20299 -103701 -446187 -31453 12177 198301 -138388 -113235
9457 -113235 -211782 -165946 -263859 -73235 -366690 111146 62235 -421437 -363159 -23108 -70496
9446 -70496 51125 53970 -265165 184189 -330918 -58041 -103740 -339101 102422 30338 -253172
9434 378951 -89123 395156 -22192 32965 46392 125084 -78182 -402835 295186 -386660 -160915
9422 4028 -186721 137456 -186199 -86793 -24950 -377568 -38747 -211123 -87085 106247 29364
9410 -108748 -98643 -240962 48922 151796 -41339 -212404 -280185 -175735 -215889 98408 333255
9399 333255 -154781 283152 193674 -361330 -111478 -169973 192587 85511 -20570 148611
9388 -21755 -163135 105908 -22788 129497 -69203 181828 54872 51859 -350636 -346468 -154104
9376 -92017 265229 165516 -72741 -107898 -29835 242348 -127916 65803 -122235 -120916 -64460
9365 -64460 -4089 -155506 144407 109199 -63986 -431426 -155562 87528 -145866 191087 -201926
9353 79975 113789 -133790 -253860 55187 -37061 3826 28525 -97181 -279336 -69457 -305465
9342 -305465 38741 -2221 -635427 111213 -127856 -148307 14336 43132 53525 -5067 -72091
9331 -72091 -184556 -251737 -130405 185731 -76465 46278 85070 -201999 -58168 -46763 -48167
9320 -48167 -52690 -120753 -141388 -166787 -315250 -216469 -106923 358050 -99006 -54914 125015
9308 -324856 -56104 -234584 -93357 -191930 -167439 281738 80005 -30648 -134608 119976 68554
9297 68554 150843 -107205 -105099 -705 -154522 -193763 -447032 -42468 -12576 -383062 -75476 -4405
9284 -300582 -153106 -129070 132905 -57895 281009 241068 -486901 -243678 5397 -114122 116783
9272 -106793 -144061 -70816 294309 -330064 -92558 317404 102328 -308142 -161549 -120342
9262 -120342 142985 133259 -19600 -232104 -287998 164527 -278699 53631 -237005 -144188 -354406
9251 -354406 -60376 -253429 -262501 -279007 82946 -86841 -205767 -376409 -315714 26572 -389724
9239 176522 51041 286051 -262394 -14058 -134160 -164018 445232 41713 2581 26629 -153387
9227 78275 67975 99823 -59925 -126055 -68668 -168103 1805 -170592 -126715 -390338 19862 -43064
9214 -70898 -225879 -202759 -22978 -22709 -180574 171130 -287855 -369018 -155631 -216365 -113545
9203 -113545 -265649 -78693 -29849 66021 198077 70134 -108742 8055 -43116 -83713 -131371
9192 -131371 -166332 201487 -152542 -251167 -92289 55763 -36488 384014 50346 -389065 326724
9180 -187559 93203 -238547 -89528 -219794 -261215 197622 95878 -222910 240465 214089 -75379
9168 94593 12002 -244481 118654 -33277 53126 -161865 -188060 -47853 804 -111312 445081
9156 268191 -50302 -264673 -195473 -284685 -290902 71216 -349077 207372 -330584 -427222 14187
9144 25328 169768 -135440 197731 19298 -174637 -425665 -94736 -17566 -281097 200986
9133 58519 63904 99559 81515 248100 -101493 56781 -26464 -433882 17315 -182114 -274044
9122 -274044 63330 -327720 137357 -157133 -209847 -167577 -128297 -65908 205923 -163736 -190482
9111 -190482 -180452 -192238 -134936 -15178 136052 -129979 -36708 -34823 -70092 -65946 -36450 -153176
9099 -153176 50145 -88855 74875 -203256 -181174 -49500 -46688 336116 127672 -134748 -18210
9087 -225701 -126301 8687 -140843 -429296 206822 -222355 26544 -97116 190532 -53763 71270
9075 -29644 37857 -15556 -176955 -197840 247748 201463 260332 -91587 41772 -102991 201506
9063 121957 104767 237473 -115512 -323978 -67501 239213 146514 -55389 53209 -195937 -71019
9051 -144479 15143 -39662 -159027 27333 -41498 -202297 110858 -320417 -216593 -62245 29426
9039 -61104 159988 -134368 22619 -107948 -271667 -180980 279926 -118823 59663 134576 7354
9027 -166428 -280667 -244994 -102828 99379 39565 37809 -50742 -227450 -119382 -356881 -114891
9015 84771 -116662 107800 409813 39075 38571 168429 -107275 -73233 37843 -405231 -241455
9004 -241455 155642 83269 51027 46858 -218099 -52637 -183784 -165174 -205509 -146221 -78562
8993 -78562 140317 74510 -221545 -96102 31637 -73089 -84235 -114205 16055 -82155 -262025
8982 -262025 -66649 -169967 -172141 -340862 218561 -443818 105558 -35262 -152673 -102186 -229789
8971 -229789 -100745 -227616 -148238 -214432 -226248 -207527 194704 -143393 135918 -211552
8960 16615 129064 -39136 40903 277310 102644 -82686 -238048 227685 -79271 -391781 79423
8948 -187193 -105169 -362101 194451 -113040 -218238 -87707 -370478 56053 -94123 -35835 -59337
8937 -59337 125107 -293495 -215445 61058 -255146 10112 -156465 -121435 -138522 50875 -185849
8925 -173520 -147600 445786 568280 2758170 1286612 348534 -86716 122525 94384 -145317
8914 -247399 -93086 -243742 121842 -299273 423755 -130911 211222 392303 230280 -89969
8903 206533 -87946 5852 -51907 -151610 -166138 430841 -190315 169388 -3973 144782 -20483
8891 -252079 -277996 -88110 -50057 -156371 80159 -106162 -235109 -147103 -5802 247140 192215
8880 192215 -98015 -287397 -166758 -360763 77534 -409128 91424 -71868 -261058 -185562 -72768
8868 -144021 -243107 59886 -1435 -43761 -168889 184291 -41365 111241 -317396 -12696 91139
8856 111246 -217200 -17085 307760 -284481 18564 95901 -150904 31754 -501589 -76214 -67832
8845 -67832 -74851 76653 286497 -145284 -96103 -37344 -325527 -90870 162889 62667 117860
8834 117860 -276811 -88728 16119 -138677 92702 3652 -48430 279 25199 -210508 -246048 -158247
8822 -158247 -58507 -40670 227349 119529 -528017 59508 -22260 189217 170222 -170945 -17442
8810 -9184 -5731 237070 107010 -65897 -21180 -157482 -78931 -24301 53937 -4168 -41303 -92331
8798 -92331 299283 -36169 80136 -231084 -110255 -308707 -250128 -30642 -71783 -282946 -132569
8786 89521 -250482 -215353 -238169 288948 -57059 51235 -108810 -133260 95736 -32120 -97726
8775 -97726 88416 -149491 -80314 -112691 -21053 -269570 210670 158457 96451 -29953 -49853
8764 -49853 178639 -63073 -111430 -148471 -273481 -45224 -530670 48697 -161139 -145826 -177601
8753 -177601 -164301 247013 56701 -131664 25070 -282540 -251560 -95379 82445 63391 -251221
8741 113351 455927 53930 -362282 31040 199971 114930 76480 124142 -169863 -230801 -180904
8730 -180904 -153776 92755 -148474 -134717 -158249 -22371 -24597 -147935 40068 362145 37099
8718 -89115 -58789 -225914 -379442 22957 87797 -363009 -48253 -56036 -273808 -211583 101185
8706 355262 -78738 121353 -48710 -404817 -123404 -160663 -133135 -43321 -194796 11014 262643
8695 262643 106105 -211494 -21071 -193928 264656 -359165 -146984 -180688 -101214 -159128
8685 -159128 -313977 -20141 -128605 40839 -49591 -292662 -16687 233846 -133125 -102926 5275
8673 42325 -139467 42050 -70573 -532910 12058 -4900 -155223 -107931 46885 166497 -296252
8661 -65418 -29371 83536 -235868 145591 -155837 -276904 -99678 -167873 203349 -259232 335243
8649 -302234 -218718 -238671 -228634 35593 -54800 -99030 -1333 -62571 -31660 -167271 31975 -77734
8636 -103150 67136 -232311 120862 47309 -105653 -101628 345700 -116842 107559 224792
8626 224792 -463754 -35074 69755 238676 97286 -19313 -276203 133829 -82109 -232030 338938
8614 -320719 -36912 68560 -41325 -158587 87324 -96441 130140 -140945 -67389 -65149 132186
8602 -28956 93988 53436 211440 168814 -322784 196055 -250831 102313 -206054 -276779 -200187
8591 -200187 -30145 -226481 -335835 -12566 -142060 270574 -334271 -262680 350003 -20524
8580 -232702 120832 -161883 80980 -47212 244399 -265531 -224007 -358854 23614 37691 215724
8569 215724 131494 -139087 92426 247722 -260938 74234 400691 44236 -490868 -255120
8559 -255120 -296059 135830 216676 -50516 591 -184535 84474 -117876 -253975 7380 -114291
8547 22811 -330903 88524 -309552 60782 270997 76273 179556 -102760 30765 -85366 -390135
8536 -390135 262464 -30448 -221741 -104274 -69256 -114985 108556 84929 344231 -12989 -360999
8525 -360999 -9595 104610 131677 -385002 -185778 -154729 -289177 35952 -161144 92802 -187236
8513 -246973 -156408 -94672 -163423 -118416 -233298 -206723 -240663 52053 -83471 -59627 -5864 -416063
8501 -416063 -357939 19567 264703 -125463 -258655 -33788 -366548 -12366 -230897 -160016 -167295
8490 -167295 127990 -278959 -340780 46436 54312 131744 -53793 225576 -2719 -192706 32074
8478 33243 69384 -155374 1242 175593 -190559 -318628 169018 -273912 -53794 2039 -166177
8466 -200302 -293024 -241458 213678 -23121 69938 -110441 -13647 -247136 116479 -122033 -14277
8454 278545 109510 199782 95405 -117488 44686 -398095 -381237 20692 -44221 -115369 60071
8442 71659 -344873 93323 -174076 125159 129022 -206746 186272 118862 -49367 -173478 149938
8430 -388299 -113328 72839 -7090 -154125 36725 -57625 -122555 -258332 56719 57469 -50483 78764
8417 49730 -61355 -180740 11637 -190692 -286030 163401 111640 180973 -173481 236145 -42587
8405 -43317 -115235 15145 -306406 -187055 55767 66864 -910 -151673 24314 152668 -168031
8393 167238 -141508 -63118 -118488 -95259 -46717 -77805 -87912 500869 -90772 303722 52260
8381 -86862 253152 24207 9529 -119304 317599 3014 -142970 22714 166483 -27356 -17430
8370 -17430 -138891 -266334 29584 -70752 406330 62675 -343821 5961 -10570 105712 -255447
8358 -35286 4307 -72482 -159237 -102621 -35152 141708 72471 -245683 -379465 -106707 385294
8346 -115057 -59209 95572 -334558 82405 -30822 284978 -173875 -74998 -237870 256680 240171
8335 240171 -133045 -27622 -365588 274617 109041 33005 -300721 -58269 -391009 -80387
8324 -83393 171747 -76358 45254 205785 7175 -157861 -18152 -43289 -269772 51017 96224
8313 96224 -18353 197532 156887 39755 6007 200639 84690 -186520 -183828 20125 320768
8302 320768 111481 52560 -123003 113007 -176378 -245110 -308858 27811 47631 -8658 259112
8290 -324977 77168 -7343 -200900 -258054 200088 -217986 -161832 -205673 61571 -73697 -20102
8278 -120141 -236189 -124355 54894 52953 -175677 -155869 57487 -163516 -54401 129676 -152927
8266 -57846 -100095 -255795 -190852 123289 -23512 -109819 129723 -18768 123771 165646 139985
8255 139985 66495 194697 -91746 -341322 -141334 158317 282571 -484320 -180746 -62801
8244 -109264 -100311 47331 23462 78621 -231160 -6928 -100875 -114980 -206574 38103 -58688 13171
8231 -137115 -89053 -15603 -44572 -78903 -230168 -96794 27380 -50587 55861 -129820 6570
8219 -100885 46988 -19173 -10586 -482496 60346 -211455 168891 86684 43621 2585 -81843
8207 -179054 -258791 -149308 -120357 194486 -68417 103053 -394061 -418592 84472 219633 -103877
8195 -269569 97035 157680 -91862 -36471 -172983 -261170 500058 -187531 -85408 263635 -4756
8183 -131111 11622 -10307 -125212 -297206 342890 45287 -76442 -187821 114408 -31890 -257434
8172 -257434 69185 60135 64378 250423 98312 -293677 -363305 -65373 154337 -27139 -103083
8161 -103083 110494 61806 202808 -150265 299863 -268666 -234146 -213409 -63048 240959
8150 -18941 -285953 84934 -60051 -242716 -72790 -284784 399804 -355278 -239121 259614
8139 -100569 185389 33378 -153660 -136078 -105284 -33623 73058 -237717 162341 360553 -150917
8127 -228185 42712 -343053 -24815 183802 -149611 26687 -79830 215906 21255 78370 37761
8115 165419 -66281 -55846 -246121 -113795 -347211 -48451 -187236 -46545 8418 214219 -108106
8103 -3087 -101507 -41519 236073 -25898 -53943 64872 209112 24534 -60631 -24116 -89659 -189476
8091 -189476 -157241 -117323 45922 -181616 75267 -139028 -151023 -202432 48429 -206510 -414799
8080 -414799 6617 236603 290070 355277 308895 -126521 183212 -172290 -292095 -227864 25738
8068 41171 -104830 154479 80431 -147024 -36510 -348705 -188324 333478 -192045 23067
8057 38675 139101 -61642 -48295 136828 -5273 -393180 63695 256571 -183588 126928 -90317
8045 23924 -143244 144889 -3378 236336 102870 189384 -326692 476489 -52637 -179660 200391
8033 -354124 -238687 -304702 -52495 337475 160494 -323263 281549 -86989 -343857 -97153
8022 -103662 257021 -203485 -108637 249684 -292657 76592 -339839 -512758 -57083 -91306
8012 -91306 -89473 -43544 -75403 -61365 339020 -176819 -87567 -453496 -2639 -204756 132479
8000 -288472 -30187 -326076 -98242 196732 45935 -185098 -140028 -145892 -155684 -24946 199200
7988 231335 78349 -68533 -19637 -137514 -401967 -153118 -22641 266715 -214022 -218797 58962
7976 224597 35205 229760 4072 120418 19088 195812 -56074 16998 -63660 -275269 30369
7964 -143099 21521 231729 -207599 -4358 -463602 261171 113014 8008 -193712 236060 -8875
7952 47775 -46514 126021 178433 -63211 33325 -54646 -22904 -87 -92931 -316763 -78078 -140319
7940 -140319 -155149 -231711 96274 119725 155539 -335592 -119158 1814 103208 -151393 -60753
7928 -192184 -123632 -210840 -23951 -169567 154461 -321945 180486 -13299 81057 41792 73947
7917 73947 -122622 -113381 112889 -24751 -62018 -196406 -137811 -109514 27504 22342 -49524 -124948
7905 -124948 -216748 24280 -19519 -176898 -199803 42424 32573 -166931 35192 -176880 -198923
7894 -198923 -229685 16827 161210 163511 -2507 -270449 23410 -17451 -111837 90740 -23162 -293409
7882 -293409 201463 -50677 -58555 229131 8436 -145109 -445065 39449 -125293 148878 18823
7870 -147159 -193826 -316449 -2306 13291 -165795 -129649 88185 216732 -11552 99929 -178128
7858 -15438 -123801 88461 99470 114134 -3699 -53552 -532430 157367 -67494 109246 -92722
7846 46983 -225444 331292 -233733 309014 -108622 -353004 7426 174037 38840 -51513 -62321
7835 -62321 -26314 214765 -62422 -177824 -81348 59556 208885 69205 231647 -217372 -238300
7824 -238300 344024 113764 -240348 -71084 -136553 -22634 -223617 137432 158707 -158171
7813 364150 -231308 246923 136775 -286163 -167825 147462 -31995 367022 175140 -57505
7802 87423 152668 -81997 -358951 77275 222320 220798 -163707 -64624 -285885 -23858 -89498
7791 -89498 -85977 19975 50308 111833 -69859 -119754 -165198 -47363 -82961 -281361 240884 -185313
7778 -284249 -197046 -171223 88016 307891 -364718 337874 -368729 69336 214075 -122495
7767 -103120 269003 10897 -142660 -37331 69219 22831 -226927 27227 -207287 143086 40213
7755 -13434 91825 5987 -269053 246226 -548404 -120629 -291052 41527 -23978 131459 -176901
7743 3301 176387 34463 -8190 227302 115473 -188428 -69181 -131643 33215 -352955 268969
7731 25325 61698 247434 27977 300043 58470 -43861 57161 46395 44909 124683 -101639
7719 -167555 -90419 -177422 12675 251266 302171 -193968 -118693 -46858 -195316 -151735 -291968
7708 -291968 -93557 -109584 -113685 149952 -43242 -205799 -93687 -304613 -104088 90793 -598
7696 -239883 104253 -20693 61521 217546 21514 34974 -473048 -83509 71378 52621 36377
7685 36377 -182396 -407098 157349 -79537 211872 376949 216680 -142644 -229252 -49076
7674 231934 10182 -76496 -231267 -157919 39788 49261 -10400 -25843 -59847 -44645 -477930
7663 -477930 -134491 415 -398477 -148372 241343 -210498 -36024 -312386 128583 -62110 28969
7651 -58967 -493447 153253 200706 -110601 -50546 47273 -169494 40122 -82761 83252 -271772
7639 -50127 177302 -25946 120491 36581 -326499 46675 266227 -34491 -148238 -57312 -37469
7628 -37469 108541 -20253 62895 -38451 -105138 35525 81398 -409384 -116367 -560054 -10233
7616 7871 -94328 11039 55140 -6449 51548 88335 40319 -114293 103728 -64314 104778 -188425
7603 202196 -125171 103130 -33153 93856 -283147 140745 389288 77272 -55602 270957
7592 -58093 -130283 -39639 -167958 -202089 185391 -216639 -582800 -115815 -473575 4924 -115893
7580 -4596 -149727 270336 31037 361254 97759 -474171 -72155 220996 -255184 -160606 -402478
7569 -402478 156294 -41326 -232119 -84535 60632 -97739 -155274 32996 -239937 -50875 -16757
7557 -261163 -416111 -122510 -1586 -48275 -51350 -373803 30971 -21131 238620 233989 -229991
7545 -77334 -288816 -161281 -394785 58741 218142 -50915 92205 -166070 212717 -21653 -270085
7534 -270085 -153021 91374 -33576 -227591 105826 310298 75728 80530 60172 -64344 10022
7522 -194406 -57737 -9678 -59159 -76199 24147 390919 322644 217512 20936 -116013 34752
7510 324740 -188600 55045 65636 -110044 307647 145609 76194 171240 -12554 -169473 211168
7498 -273850 55735 164085 -168797 -272255 106366 -64778 -311016 -190922 -120352 -34182
7487 223221 76917 100499 -21940 -206451 -375569 106282 -97185 -159840 169449 92207 -105899
7475 -494899 56815 55578 -453125 -359992 -146436 -41193 227033 -142627 155975 -19646 265921
7463 -23948 -3921 -276858 -62833 19162 19806 -118491 47584 -55632 -61700 20766 165721 -167691
7450 265112 -58926 -148283 55682 120134 -185945 -305130 992 272728 41078 -118342 89234
7438 -30277 -124602 -135145 -28061 161842 -113103 37518 -154612 -146487 -65786 -195881 -130565
7427 -130565 -201993 46015 174932 130864 -206950 -266036 16361 83296 -19728 -8026 -88795
7416 -88795 -7896 -46491 24609 -99553 129601 -277093 143234 163362 -211491 -170756 -169048
7405 -169048 267680 -6184 -122787 334562 -6204 -400504 -53987 -76496 -85935 -304043 -91636
7393 -269315 53317 -73501 20719 157391 -233279 181041 233413 62285 -159293 228240 57712
7381 -122911 -174497 96669 -121208 -98204 -189696 71836 -85426 231380 -298030 377670 -75467
7369 54639 32498 132777 28380 166260 -279768 -270603 477252 267295 16631 -162356 259973
7357 -126936 16231 -108958 95420 6939 -148863 52571 -23358 -290387 35643 -105943 -174111
7346 -174111 217883 292732 88272 13173 222414 -62142 -374781 -29088 -180528 -500819 -28246
7334 -77173 131358 -60769 -336849 -306200 -170963 -155343 -187903 -127112 20595 -98607 232236
7322 18132 -100728 105798 -242542 -269494 -106312 69759 -70896 -152190 234994 -134138 27895
7310 -295670 -230562 -10879 223029 90745 -298044 -604593 248158 -446694 -102600 130214
7299 -132332 -250531 75373 110583 -24557 44005 -59056 -271611 -422359 -15305 34958 -133335
7287 24055 226790 266846 306643 17584 -54182 90448 -45605 -259427 -296893 151218 216792
7276 216792 255263 -255250 -124866 18411 271350 -40808 -174603 -271823 42660 -189710 149811
7264 -21849 203972 -113456 -2958 -134171 -23651 171986 45539 61564 -161528 93350 -20960
7252 -245880 -217362 28211 -197806 -35087 -123390 -362855 279159 -183551 -246561 -376761 2781
7240 48075 6979 -105532 330416 -204058 -75122 69473 -57786 -32275 70527 72619 312913
7229 312913 28497 -3178 177039 -67095 87136 129142 -92844 148598 -107585 -72201 29053
7217 -101110 -59100 127998 92996 -189537 -163788 21442 118769 -31464 -92653 198230 -202521
7205 -105346 -11769 97484 -158503 -180870 -99443 55362 -87366 -173227 73741 -220901 22374
7193 -151231 203165 -169771 205821 -151008 -171615 -147001 -131229 218835 -121206 -281200
7183 -281200 -250798 217327 15315 -168703 154789 -173313 -176906 -73885 -223880 42685 -13680
7171 15603 159273 -113883 137136 -251218 -4509 -115 -198438 412345 89797 31836 -128389
7159 -24562 -165496 41483 242446 -94071 -171959 21902 -271423 206417 273675 124683 -94691
7147 -160716 71772 -34083 107052 -52250 -77586 -39878 -282740 -3983 -91153 254489 45049
7135 -97065 -169202 -247509 -431332 140252 6612 -44358 -198845 -190408 -171757 268209 -13860
7123 83220 87459 -294757 -66647 -127068 81725 267660 -71549 160847 164657 85135 189239
7112 189239 137370 150390 -97859 41494 -160969 203220 15133 388638 227739 -22872 104402
7100 -146216 106213 -86167 21627 112341 -25812 -102969 -305202 -45606 203645 -438023 38837
7088 -327693 216894 131614 -91914 168813 283644 -137480 -67107 -84103 116275 -52039 256554
7076 -367361 -206719 -200781 173110 119604 103803 39487 192594 68230 -179643 -214197 -174191
7065 -174191 -183884 -161098 -247352 188953 -208805 -136166 12582 74420 17254 -9608 283388
7053 -135906 176532 -368140 192043 -119529 15045 -156269 -245075 -368977 -243771 -200029
7043 -200029 -441810 -136459 164885 292307 -117814 522846 -113364 -64947 -187170 78302
7032 209857 -112811 -223226 -21464 -210061 -266420 -424151 252560 -33381 -250648 -36108
7021 66709 36727 -269866 29196 120816 -182772 71481 -214490 -31395 -104318 -38246 147997
7009 -87982 118889 187514 -97482 -283244 -176893 127533 120362 154296 214512 -51211 23174
6997 -98533 158595 -92675 162157 -48516 39266 103475 -329176 96563 272572 28803 87232
6986 87232 -4690 -93162 323214 -9406 156672 172478 202337 199971 204744 243397 -15360 102699
6973 -141072 -39733 248407 6 -213687 -226723 -300993 278421 57907 -124774 69318 -320691
6961 -165157 194199 -127565 -8474 46645 51724 -411126 195188 -39506 -245462 31963 -54679
6949 44915 -23153 -102888 -222121 -72898 -24055 -86554 78374 -125163 268006 -40871 429130
6937 -186128 -114439 -358872 15400 134809 136329 255509 45145 -168071 157354 74219 101011
6926 101011 191585 -96316 -100 -53525 -119268 -191326 -17024 -191957 -215421 -191129 -271774 -31024
6913 284945 -127876 -44507 38228 164779 -232358 31051 -39351 -34457 -243504 -32242 -12350
6901 -97710 -110075 -144441 152992 18431 -362426 -37334 -384078 -7828 18092 -380274 3198
6889 72196 -30450 285033 -147490 -304113 -209212 104906 -264105 131868 41926 -119995
6878 -26602 35642 259339 209241 250658 24890 -240662 50855 -240664 84166 104115 -89636
6866 21873 73758 93178 109521 -289187 159687 -125509 -61966 -54014 -65227 19424 -163946
6854 -83925 96220 -268323 105116 -170184 -259979 187371 -73535 -379434 -218001 424647
6843 22030 6624 120946 7758 -114133 58811 70163 87569 183714 -156177 54129 57835 40002
6831 40002 158033 130238 -68844 -194376 113110 123682 293351 -144487 101469 318138
6821 318138 -191784 -230527 -179047 163568 85384 37551 -13088 -116951 -13743 17165 128323
6810 128323 -215321 -7861 -288618 -123212 -120843 -2987 -90660 -483872 -121513 -13789 -161227
6799 -161227 48685 -45980 19749 -364838 -219866 56587 -229233 106320 -410723 43470 -100428
6787 115441 -74757 26985 135727 -379607 -159624 64243 -129409 -313254 17215 -7887 45374
6775 132137 -82081 -60959 67257 63685 -62943 93350 38855 80331 -174384 -27200 90485 332167
6763 332167 -221679 9805 -146572 188853 151362 114472 -223285 -606447 -122623 24984 -3012
6751 -41087 -105074 36942 -259228 162908 -22463 212912 -205269 -16621 -183082 19515 199286
6740 199286 156955 -233870 -17810 99318 -415088 123507 87407 -348220 -71307 -137447 -21418
6728 -444134 -158769 -92866 -194924 107100 341414 199394 99327 156865 26080 -55624 243295
6716 169212 -19632 -186999 431541 -315659 213824 83344 -88709 152909 -116151 181147
6705 32740 -23399 -63205 53216 54981 -22120 442171 -268 -76687 141812 214676 -79677 256029
6692 -140877 75237 22014 39988 -4182 -485211 268286 -13769 -26338 -89353 217982 -60637
6680 -57820 -84589 103678 -142167 -192011 -28963 216805 278418 371802 449653 55557 149596
6669 149596 -8910 -34375 -55433 -196944 -235464 -293544 -139885 -268398 -192527 349910 8488
6657 208085 -193200 86196 98776 41048 -140445 95987 -291349 109707 79955 62386 -207033
6645 -90408 -27433 130803 -82018 29672 -241211 -33086 132262 -128999 299935 141835 1918
6633 84438 -85196 2707 165188 -36219 -172313 21713 -216349 -90493 278282 -10218 -74377
6622 -74377 158632 62513 187902 -191346 -196371 12401 104673 -204861 4538 98874 19956
6610 -136118 410750 -210504 -256602 212390 -28844 -80940 -17844 43326 -79184 91307 109232
6599 109232 -228532 -170316 -10703 62672 194866 408519 -112277 275364 402814 -91215
6588 -59158 12160 -180190 93579 -90235 -162094 -184540 284835 -289330 128685 -220368 -245954
6577 -245954 -271701 36546 92044 122868 264357 -55955 36553 -87319 -6286 -130052 71939
6565 -125896 -464002 512809 -288477 -171747 -270608 -24687 -158907 -57201 -246176 -41924
6554 23997 -217747 -158412 -4187 219519 -169362 -112986 73042 28115 -474360 -322789 -36022
6542 -166813 -27875 -217928 -174991 -154429 70148 -355127 50589 87742 -27813 -49602 298129
6530 -108769 -15188 -198083 -167295 -15709 -164081 161588 -267753 84951 -130848 162205
6519 -31428 -59923 111786 -100753 121855 117081 11231 27307 -39258 -111116 131171 -119039
6507 -143388 -89158 240397 -127403 143548 -36747 303012 -105878 -56377 -444822 -85584
6496 108003 87047 -82333 -6497 87346 -94033 -4966 399585 172658 56048 56789 101155 62934
6484 62934 -316874 124175 -383555 171967 60714 298513 13654 -47498 -39297 -152914 66112
6472 -31470 -199734 -70968 112719 -140866 102194 -249268 158168 -267526 139057 -104005
6461 220913 -131672 -137499 -38264 -163277 -461285 -179234 -73851 106595 185092 -184540 205860
6449 -262231 -535 307959 -265296 32321 -168820 182975 -72228 -147103 -232945 256795 137898
6438 137898 -62027 -78329 -213089 -140411 349502 -199875 40748 -64540 135702 -194838 122678
6426 25572 4503 132739 9961 -160929 -108529 -127042 32746 48726 -224721 268449 -80893
6414 66254 34628 155123 -21165 -442944 181747 182543 -316038 142783 -343503 -25625 -254878
6403 -254878 -80392 267107 -15562 -145961 -173694 53588 50251 -181356 -42956 -143591 105035
6391 20484 109577 87349 79671 125228 -5051 -159732 83901 29886 36722 27764 -303980 -30975
6378 -80274 -392706 -194399 131565 166818 -259815 -292 265707 -278383 -85744 65995 225288
6367 225288 -259467 -189594 386898 -122566 -161832 1786 159179 240128 -36004 46487 244621
6356 244621 -177542 32973 -104571 39128 172432 404699 -175286 -2623 192995 9707 -51825
6344 -371351 163068 147794 -365256 157995 79748 417338 -145564 -11419 -60807 -91201 -289024
6333 -289024 -68810 37141 97361 396210 -156939 -227620 -6599 28361 -128092 -220703 -94635
6321 410722 -130039 -136040 110462 -286978 -71409 -15261 -166821 81878 -99607 308876 192998
6310 192998 336059 -123309 170372 291452 -316717 -156824 -53537 -114784 257553 280494
6300 280494 279831 -2657 99393 186976 -93089 -229140 -133045 -116431 207061 -53403 -89682 23513
6287 32764 297926 -229713 118845 -224302 70469 412351 11920 53571 -93659 46503 58525
6276 58525 3561 -161196 5962 -12290 -33541 196399 -56684 -32273 231064 -187876 5748 -43197
6263 -165178 -255189 -41989 -98757 124366 -325549 -294033 -123725 -204718 -19762 49212 -105768
6251 55955 -106247 -390880 54816 230011 -168316 -215201 -265615 14579 21653 158059 74571
6239 214652 33697 16458 -308529 -186252 190839 148327 -184937 133588 157678 77944 -95496
6227 -304540 66215 234892 -27979 82591 -233479 -205897 5146 -7559 -134663 -142006 -295016
6216 -295016 104919 -357250 140589 91389 7068 -106222 -144849 185523 -3934 -190839 100668
6204 214047 99036 -447712 -58633 -73933 112721 27000 -322921 -158767 3790 196528 -48404
6192 13273 358409 69057 238570 113489 109885 271297 -192483 -28711 132014 70018 16944
6180 147560 -39222 -351902 16839 -25807 -126670 129273 -124894 -23731 -102094 -101086 80633
6168 -76702 42708 -265957 -79805 131537 -180928 124181 60660 292778 -58075 17517 -249831
6156 -151240 -129030 243253 -242866 -65940 -327437 -217530 -49315 -374248 214739 60176
6145 -384691 -132448 -134589 160271 -51259 -36171 -72465 -75777 -141153 -144006 -29803 -96547 167840
6132 -167470 272874 231852 -147485 -33749 -35210 -103960 -1759 -39756 45739 203866 -120941
6120 -201010 -50122 204285 -101917 271158 199246 7047 30519 -72602 -343301 -10612 -137626
6109 -137626 118454 -42931 175031 230947 -53650 -231739 4715 -140713 -144113 -116949 1233
6097 -165808 217906 -26791 161436 218005 -146877 72173 96687 -186169 -21727 -233017 78895
6085 -7884 -287159 13709 65006 116591 77225 25990 -256437 8946 95888 148553 274045 69471
6072 29511 -43643 -144946 6160 -10614 45616 -106210 -142045 219923 13817 55592 -300568
6060 80412 185572 -46071 -156671 66286 -150182 256579 -132215 -182846 -57507 291273 -214029
6048 2727 110609 21921 130266 -72751 113629 -208629 313656 -135446 23844 -62954 67194
6036 58040 -146056 -147452 -57471 -309598 -201116 -227050 -43228 118974 -27515 94469 64876
6025 64876 133992 -147836 -241907 137523 125704 -138526 -127703 -144683 -52739 -93191 -413151
6014 -413151 -2948 84828 47629 -76176 124272 -22532 84239 -262726 416397 54950 -98134
6002 -118290 -36849 -38465 130402 73396 4394 -89933 -223572 190383 235648 45444 -286319
5990 -125734 53148 178177 28178 14901 257609 102066 238968 -37761 236028 -326457
5979 -245120 -14454 -75399 -72172 295153 188625 32669 193447 201942 19915 30264 131937
5968 131937 -87046 62911 -86122 124370 240739 45021 208421 203685 74544 -110920 93378
5956 270043 174620 14198 -43220 -63541 -4090 30631 52176 93556 48476 232105 -61348 -78041
5944 -78041 161847 -214010 -325175 -29438 -34587 -15929 65444 -111705 53165 -294479 374340
5932 -162173 155688 155193 119986 -291895 200643 -39650 127228 -395535 -269289 -118753 25099
5920 -333142 13755 2218 -319461 -307780 -255920 182986 -216351 64315 -264644 -374157 120525
5908 -129982 219605 -102758 179082 78155 5493 -175451 -145085 -255376 443814 -249514
5897 810 51232 -99901 -75114 -29231 71072 18203 80474 -123738 -220753 -480964 91881 -13867
5884 -187747 64920 254218 -58656 29311 27581 24212 -99885 294808 -179422 151396 94302
5873 94302 139819 7289 391141 -104152 -306619 -62688 204366 216393 183006 263675 -26503
5861 41679 105897 -261003 205493 -61572 -293161 264695 -162666 -188463 89858 -113302 -71844
5850 -71844 201796 157089 267846 -240503 -210248 66726 173950 65309 156300 -42356 121587
5838 12154 -46469 44980 -400683 -244941 -77096 -23069 -189338 -18309 -113394 175017 291492
5827 291492 -516713 113457 81102 -262552 -167401 -88232 42479 271146 -105610 -153211 -53861
5815 -109888 29726 -68866 6462 148395 19962 -78094 -220366 -334496 212314 62802 116009
5804 116009 85162 326203 291342 -279025 -47763 302820 -243419 111162 -172717 -33927
5793 14068 -190191 62868 250877 162578 258179 121034 -136009 54367 108846 -50836 19410
5781 41182 -23062 -114870 -269925 218435 -212487 -104252 160756 174832 -171181 -2347 49848
5769 388228 -14007 -35938 54411 -62403 106152 -13287 -41706 285860 108103 273401 -2164
5757 -217419 311770 286960 394778 -17631 18575 -342407 -130143 226739 134483 -283577
5746 146957 -50664 43667 -220364 -112372 -104618 -96507 99787 -186479 -165222 32636 115546
5735 115546 -34689 -125067 -59576 -158614 -69551 99749 -24064 -67151 53693 111049 -438135
5723 -190731 -128790 -9949 -106586 -261562 -68373 -52888 -9867 -56584 129282 -196540 -28812
5711 81150 -61532 52381 -1196 102544 -357734 151665 -44228 -57888 -109049 -81746 -179289
5700 -179289 -40932 -192645 198974 -13125 -60649 83462 177233 380536 -78013 -167450 292840
5688 -220565 84274 -82986 -506314 -292979 -142050 159827 76785 191358 42494 63299 91910
5677 91910 115603 -51178 -75725 -60237 -77483 -38761 26730 261565 233787 -145680 385179
5665 -261556 -41617 -7791 -127045 -99748 -230308 81394 -83574 187541 198969 -212693 -66420
5653 -183019 -32385 -74384 -57307 -338939 -11041 -328733 -174345 97331 46867 151630 -108184
5641 -12871 150073 29275 180964 166784 147743 -180053 73552 -8195 111524 23940 -194180
5629 240685 210330 -241306 389223 43972 -126811 94156 59484 113435 -69041 -21979 -128403
5618 -128403 120819 344138 189147 -65809 220563 138575 -21575 -235786 -134407 23375
5607 -58171 -282590 3029 183957 -27417 8601 41658 -57400 253457 196246 52741 -13386 22002
5594 60776 -130005 -246027 32026 78011 -153624 159861 -149946 -38910 298595 -242096
5583 -22728 -2842 -30863 265295 80361 318703 123984 23698 -265405 -15757 18801 57800
5572 57800 -187446 26426 107956 331834 -22906 -405813 167693 48377 -59772 -136043 -188850
5561 -188850 88661 105547 -204443 213873 -35629 -140871 -24937 144562 88089 70047 -251866
5549 181112 -33616 -102414 -286647 -355437 10270 -136841 -279419 -203552 16083 -471490 -11873
5537 -386805 58638 -255905 -53395 40815 19133 33306 369907 -318111 -28892 -149185 -190295
5526 -190295 -227906 173807 -210372 127962 140748 95243 -165863 -38718 85708 119529 -51967
5514 -21419 -175287 -216983 89164 17707 -98368 -22085 100293 93265 -5192 134063 -9858 182418
5501 193481 168999 100069 106506 -160658 36599 58865 -54363 24742 3491 -407619 -363188 429244
5488 -165943 114965 8532 171261 145426 73157 -75960 -144525 -191712 -2914 199439 -25725
5476 132715 175812 -57210 304772 142916 275805 176506 -258093 31595 20610 -110110 -93540
5465 -93540 49471 -207188 314130 -378630 90763 9240 -158041 250275 -166549 -29909 -50866
5454 -50866 -83655 -296621 -193187 34378 90780 -32524 -30633 -180113 47769 376585 -326762
5442 -217368 -110997 -193428 15074 44052 -74367 -114799 106700 -198422 -115006 86087 130709
5431 130709 -39681 -27861 35300 269547 91337 94889 -206138 -207696 -18678 -35411 -150086
5420 -150086 3257 -47474 -13946 -243305 309427 -59384 196647 85531 -115783 6058 -447618
5408 111697 -221556 -180296 -29036 71738 60045 248641 258717 -19773 55836 114110 158829
5397 158829 -20167 -59962 245740 -55872 250128 278993 154423 -85401 69629 327052 208333
5386 208333 -156688 251044 40126 100678 -107326 -124318 229277 73345 181645 71122 -260657
5374 90685 302963 127653 -358488 437256 95127 -195068 -287852 -298359 -76411 -185918 -62256
5362 123985 -90198 -78606 294297 -44018 -137644 -67265 -45422 77900 -409328 -164382 90675
5350 386189 70297 29264 187557 -57951 111669 -32912 -142663 124090 194097 -96430 -173055
5339 -173055 59992 194006 295501 -297459 -287902 31690 87949 177572 -9399 -56237 -96704
5328 -96704 -64968 80060 -159429 148502 336336 -247202 -65292 82867 -80935 154918 -224262
5316 137135 17599 -92607 -15603 103586 158829 -158830 -107019 -136381 -88870 -66925 -9983
5304 208164 -154906 80757 30202 -104906 -141614 -52707 33751 -187476 -50931 65505 -93875
5292 6946 -236824 389640 -682 130825 35165 -226925 150419 -74179 -58874 -217276 11009
5280 119041 151483 117272 10801 288353 419650 290287 59430 -53376 -44259 -203343 -68153
5268 -74271 27107 -101925 291480 -20677 61695 206564 -59867 97501 -8030 404624 -21785
5256 -57645 -132735 5138 211887 301313 -146449 -3670 -19058 -154042 221968 16596 7905 82883
5244 82883 -95911 -208610 -46900 2534 148514 -157551 48261 264394 22719 4684 3017 143952
5232 143952 278417 -62173 -137830 298187 172093 23390 12020 43899 14633 140871 -150724
5220 -72618 -134634 13277 293165 82711 32981 228647 -313041 -154491 -238088 -263837 -132683
5209 -132683 53895 -301033 -122534 -56061 -55496 -4738 183825 111592 -94975 -206799 3003 168523
5197 168523 -114952 17225 107174 -176751 177296 28726 155433 -148196 -116215 -13809 335610
5185 55253 157123 57568 -7588 -46508 -331892 -122096 -105267 -282250 60146 66641 368204
5174 368204 187785 -185700 -52352 -213309 37536 -304970 -161655 -126083 -87398 104719
5163 120878 -232278 125861 272998 137361 111306 117835 -121994 -140524 85733 59599 468572
5152 468572 129302 -222762 178641 268824 17087 104210 -33634 186644 -399253 80342 69416
5141 69416 369577 -10961 121244 -51104 -220725 184283 297758 4613 -35266 49043 -217106
5129 -138447 -351519 -135090 -269666 -107306 100366 -148075 -118701 -54026 -38430 112580
5118 -118029 37117 68298 115151 -130786 -81599 -256782 279302 -310251 128159 168156 33954
5106 60542 3944 -8542 11188 98824 67155 50792 -313649 -35678 84288 -261487 348538 85889
5093 -42135 -37660 -41602 127508 -293302 435356 -206640 351122 26753 47978 96439 54114
5082 54114 -222833 -221964 -360591 -39900 124864 -157854 -193076 -48696 47737 85119 149791
5071 149791 -170807 1291 -154529 -83470 21240 -202517 -41510 -107037 85224 32467 154594
5060 154594 -99123 -304078 30503 661188 -24018 283 -53494 -61249 96405 40248 -106756 -46887
5047 -348553 -450772 -42471 -126446 4244 159645 -262132 -116215 -349310 96652 110907 -127842
5035 -94430 -103581 188273 -214945 -140357 30422 458025 93354 -204140 228647 -88474 -124888
5024 -124888 80441 197227 -116676 49568 -108419 96089 -310975 -9298 32694 68512 198256
5013 198256 40432 125372 -206040 227444 -106116 -113361 -27589 -228273 11348 -93945 -275091
5002 -275091 -91977 23119 173149 -327534 21306 -155797 -90624 -1475 -39351 99072 -444937
4990 94921 -66369 -62099 182847 -238130 -212884 -324374 241646 163694 243153 -83599 115786
4978 -125027 -222271 19167 -294647 133727 -103284 -32859 81058 -203693 -167139 143280 -395240
4966 44455 -173195 -103356 11570 146327 -82932 133396 -37917 23201 106036 362204 -161846
4954 226537 -148312 -43386 36656 -10974 38388 -169602 39345 111723 269584 73214 17817
4942 126477 -2996 -33365 -392172 -284320 -60314 158872 -75759 49568 42912 92443 -110388
4930 157349 131937 343448 -111154 -28480 -60883 -343959 316369 58660 202562 243657 -128016
4918 -507945 -44540 64691 95701 194764 15119 -3640 273999 41908 218421 -106448 -112531
4907 -112531 208979 -259988 46664 62635 29324 -4603 174134 293390 -74363 398488 -56486
4895 245560 184816 -9607 114808 27859 186227 129625 -326226 -25119 73041 155085 113227
4884 113227 81688 -81132 -10536 17780 260326 50436 -195301 250133 149020 -331017 173434
4872 184949 -307151 188257 -161472 -48801 45556 -74486 -11090 -48208 86582 -65097 -102327
4861 -102327 -313737 45111 -335627 261200 39715 236793 -187220 -48113 118573 -187736
4850 280444 -2673 -100918 112648 101605 195438 -86574 -91213 131453 266037 -106409 13210
4838 -122174 -127090 -286763 102421 104278 139604 56396 141737 211191 116062 118830 26765 141775
4826 141775 -203626 187676 -84233 -27053 -4018 -191733 356582 -291246 -82276 -308072 -81834
4814 135099 -64045 116944 -85580 179354 -311665 50096 62364 -92366 -146901 -22504 -208064
4803 -208064 -35395 -155118 -94632 -215753 258508 -341345 -51501 -56389 463713 144032 11801
4791 113701 -129050 482195 129333 4139 -34488 5977 -400812 81854 194806 139748 -224481
4779 116870 85662 105707 25537 -57490 -40000 -170858 -253918 141436 4074 -114088 110849
4767 -98047 -62648 -46978 19265 33383 -220268 25580 93097 -114935 245049 78395 -37759
4755 195976 -359170 -328348 108952 153765 -126754 -104106 -123062 -15453 -55726 -134370 -183255
4744 -183255 27730 50606 -88115 -29035 275042 -27818 19231 -139893 48358 139067 -106889
4732 -104951 166875 -135997 383250 -367671 -67989 74890 -53853 167353 -354193 9066 201926
4721 201926 -294785 -95035 41952 -43360 8917 -145532 -239 -92778 -94871 41702 111661 253746
4709 253746 142773 353042 -89024 105552 39 -93160 237581 353062 212026 -319003 -75421
4697 -232864 -93872 -204139 326503 247148 -123388 -244897 134767 -76119 -9192 227541 -87989
4685 118982 -238958 -81860 -140301 -21186 179642 202276 -299956 -54864 15536 13846 -323960
4673 8922 69960 86506 -5597 94983 -108225 25250 -160616 31388 284035 71601 73465 71579
4661 71579 132539 -198589 28876 86846 120163 -160690 -139975 -34174 -43944 -94201 182936
4649 15885 -267818 -52591 3701 -42099 888 278622 -364231 12476 224677 87885 -72155 276516
4636 -75418 157190 -191380 -214888 -167016 -237187 69785 -39494 -87533 131614 -108791 164328
4624 -125466 7139 167356 -103704 -185450 -241561 -181813 -38426 -196629 214384 141689 -179559
4612 -73713 -71134 73224 67509 28537 58089 276407 -106720 298631 30725 -174986 -330700
4601 -330700 -60001 191355 -145679 42875 167059 -157135 286286 -255627 178183 317141
4591 317141 245734 -101210 213051 -53350 -96029 -14842 -35236 -343240 -127059 195669 -231303
4579 153760 194463 203138 205818 121577 65877 202934 -108424 -190901 -3384 18803 147259 81093
4567 81093 -4738 -165618 237484 184413 46808 30370 -97161 172252 230555 233128 81858 401133
4555 401133 33507 -161710 129620 214690 167091 174955 8100 -166443 -80366 -428638 117985
4543 361422 211084 -249005 -279054 -96385 -66224 -4262 137480 -79009 96755 -108090 -122315
4532 -122315 -37711 -43263 -146293 -77317 -214573 111051 -39573 303680 -78088 -65289 -171717
4521 -171717 9737 -16804 78728 150819 -308984 57793 -20540 -149433 -182425 -67548 -83708
4510 -83708 -131440 136649 398528 248197 -42342 174166 -202204 182696 133797 90727 -88130
4498 20210 -29935 -201306 -115877 536364 -202723 116744 248320 66801 -87710 299523 -128828
4486 -100015 119855 229937 177929 -54967 -48362 48027 -80312 -219643 203769 319527 2669
4474 -64717 288536 -243713 -159905 123978 3975 -147401 -23546 -68192 -26958 192831 169257
$$ [...]
##END NTUPLES=NMR SPECTRUM
##END=
