##TITLE=AC1439_TOLAH13248_7790592_PwNFgrWFyy
##JCAMPDX= 6.0         $$ Bruker NMR JCAMP-DX V2.0
##DATA TYPE= NMR SPECTRUM
##DATA CLASS= NTUPLES
##ORIGIN= BRUKER
##OWNER= Administrator
$$ 1.72 TOPSPIN		Version 2.1
$$ 2013-04-16 21:01:05.255 -0700  Administrator@X
$$ Compression mode = diff/dup
##.OBSERVE FREQUENCY= 400.02188249412
##.OBSERVE NUCLEUS= ^1H
##.ACQUISITION MODE= SIMULTANEOUS (DQD)
##.ACQUISITION SCHEME= undefined
##.AVERAGES= 64
##.DIGITISER RES= 22
##SPECTROMETER/DATA SYSTEM= spect
##.PULSE SEQUENCE= noesygpps1d.comp
##.SOLVENT NAME= COFFEE_meoh
##.SHIFT REFERENCE= INTERNAL, COFFEE_meoh, 1, 14.96075
##AUDIT TRAIL= $$ (NUMBER, WHEN, WHO, WHERE, PROCESS, VERSION, WHAT)
$$ ##TITLE= Audit trail, TOPSPIN		Version 2.1
$$ ##JCAMPDX= 5.01
$$ ##ORIGIN= Bruker BioSpin GmbH
$$ ##OWNER= Administrator
$$ $$ E:\/data/COFFEE/nmr/AC1439_TOLAH13248_7790592_PwNFgrWFyy/12/pdata/1/auditp.txt
$$ ##AUDIT TRAIL=  $$ (NUMBER, WHEN, WHO, WHERE, PROCESS, VERSION, WHAT)
(   1,<2013-04-16 21:01:00.114 -0700>,<Administrator>,<X>,<go>,<TOPSPIN 2.1>,
      <created by zg
	started at 2013-04-16 20:49:30.191 -0700,
	POWCHK enabled, PULCHK disabled,
       configuration hash MD5:
       33 CF 6A 21 5C D3 B9 40 6C 15 AA 8D 27 A2 4F 13
       data hash MD5: 64K
       8B 51 39 54 72 9F 0E 3F F7 78 1D 1A 92 E8 3E 8B>)
(   2,<2013-04-16 21:01:03.146 -0700>,<Administrator>,<X>,<proc1d>,<TOPSPIN 2.1>,
      <Start of raw data processing
       efp LB = 0.3 FT_mod = 6 PKNL = 1 PHC0 = 0 PHC1 = 0 SI = 128K 
       data hash MD5: 128K
       30 BD 93 62 F8 4D 3D D8 35 94 9A C9 D2 9B 88 6C>)
(   3,<2013-04-16 21:01:04.177 -0700>,<Administrator>,<X>,<proc1d>,<TOPSPIN 2.1>,
      <pk PHC0 = -78.88184 PHC1 = 0 
       data hash MD5: 128K
       E2 45 6A 91 72 D6 25 8B 87 5A 21 CB 0A AE 83 97>)
(   4,<2013-04-16 21:01:04.599 -0700>,<Administrator>,<X>,<proc1d>,<TOPSPIN 2.1>,
      <abs ABSG = 1 
       data hash MD5: 128K
       27 E7 AC 66 75 FE DF 35 F8 5F 01 44 5B A7 C9 7D>)
(   5,<2013-04-16 21:01:04.724 -0700>,<Administrator>,<X>,<proc1d>,<TOPSPIN 2.1>,
      <abs ABSG = 2 
       data hash MD5: 128K
       1F 11 32 B7 A9 31 6E 54 F6 9F C7 EF 88 97 F1 BE>)
(   6,<2013-04-16 21:01:04.833 -0700>,<Administrator>,<X>,<proc1d>,<TOPSPIN 2.1>,
      <abs ABSG = 3 
       data hash MD5: 128K
       53 97 06 59 44 AD 72 45 85 11 E4 A2 4A 42 A2 CF>)
(   7,<2013-04-16 21:01:04.989 -0700>,<Administrator>,<X>,<proc1d>,<TOPSPIN 2.1>,
      <abs ABSG = 4 
       data hash MD5: 128K
       10 C8 D5 3F 35 60 F1 0E E6 5E 09 79 6F 95 AD 5A>)
(   8,<2013-04-16 21:01:05.083 -0700>,<Administrator>,<X>,<proc1d>,<TOPSPIN 2.1>,
      <abs ABSG = 5 
       data hash MD5: 128K
       7D C7 48 E8 1C CE EC E7 AA DC ED D5 3C 0D 4B A7>)
$$ ##END=
$$ 
$$ $$ hash MD5
$$ $$ B5 6F 77 DD B2 AA 85 36 FC 8A C6 7D 13 A6 3C 94
##$RELAX= 
##$RELAX= 
##$RELAX= 
##$RELAX= 
##$RELAX= 
##$RELAX= 
##$RELAX= 
##$RELAX= 
$$ Bruker specific parameters
$$ --------------------------
##$DU= <E:\>
##$EXPNO= 12
$$ [...]
##$TP07= 0
##$TPNAME0= <>
##$TPNAME1= <>
##$TPNAME2= <>
##$TPNAME3= <>
##$TPNAME4= <>
##$TPNAME5= <>
##$TPNAME6= <>
##$TPNAME7= <>
##$TPOAL= (0..7)
0.5 0.5 0.5 0.5 0.5 0.5 0.5 0.5
##$TPOFFS= (0..7)
0 0 0 0 0 0 0 0
##$TUNHIN= 0
##$TUNHOUT= 0
##$TUNXOUT= 0
##$USERA1= <user>
##$USERA2= <user>
##$USERA3= <user>
##$USERA4= <user>
##$USERA5= <user>
##$V9= 5
##$VALIST= <valist>
##$VCLIST= <CCCCCCCCCCCCCCC>
##$VD= 0
##$VDLIST= <DDDDDDDDDDDDDDD>
##$VPLIST= <PPPPPPPPPPPPPPP>
##$VTLIST= <TTTTTTTTTTTTTTT>
##$WBST= 2048
##$WBSW= 25
##$XGAIN= (0..3)
0 0 0 0
##$XL= 0
##$YL= 0
##$YMAX_a= 6027876
##$YMIN_a= -13212292
##$ZGOPTNS= <>
##$ZL1= 120
##$ZL2= 120
##$ZL3= 120
##$ZL4= 120
##$ABSF1= 14.96075
##$ABSF2= -5.597432
##$ABSG= 5
##$ABSL= 3
##$ALPHA= 0
##$AQORDER= 0
##$ASSFAC= 0
##$ASSFACI= 0
##$ASSFACX= 0
##$ASSWID= 0
##$AUNMP= <proc_prof1d_extract.lims>
##$AXLEFT= 0
##$AXNAME= <>
##$AXNUC= <1H>
##$AXRIGHT= 0
##$AXTYPE= 0
##$AXUNIT= <>
##$AZFE= 0.1
##$AZFW= 0.1
##$BCFW= 0
##$BC_mod= 0
##$BYTORDP= 0
##$COROFFS= 0
##$CY= 15
##$DATMOD= 1
##$DC= 0
##$DFILT= <>
##$DTYPP= 0
##$F1P= 0
##$F2P= 0
##$FCOR= 0.5
##$FTSIZE= 131072
##$FT_mod= 6
##$GAMMA= 0
##$GB= 0
##$INTBC= 1
##$INTSCL= 1
##$ISEN= 128
##$LB= 0.3
##$LEV0= 0
##$LPBIN= 0
##$MAXI= 10000
##$MC2= 0
##$MEAN= 0
##$ME_mod= 0
##$MI= 0
##$NCOEF= 0
##$NC_proc= -2
##$NLEV= 6
##$NOISF1= 0
##$NOISF2= 0
##$NSP= 0
##$NTH_PI= 0
##$NZP= 0
##$OFFSET= 14.96075
##$PC= 1
##$PHC0= -78.88184
##$PHC1= 0
##$PH_mod= 1
##$PKNL= yes
##$PPARMOD= 0
##$PPDIAG= 0
##$PPIPTYP= 0
##$PPMPNUM= 2147483647
##$PPRESOL= 1
##$PSCAL= 4
##$PSIGN= 0
##$PYNMP= <proc.py>
##$REVERSE= no
##$SF= 400.020009736729
##$SI= 131072
##$SIGF1= 0
##$SIGF2= 0
##$SINO= 400
##$SIOLD= 131072
##$SPECTYP= <>
##$SREGLST= <1H.CDCl3>
##$SSB= 0
##$STSI= 131072
##$STSR= 0
##$SW_p= 8223.68421052631
##$SYMM= 0
##$S_DEV= 0
##$TDeff= 65536
##$TDoff= 0
##$TI= <>
##$TILT= no
##$TM1= 0
##$TM2= 0
##$TOPLEV= 0
##$USERP1= <user>
##$USERP2= <user>
##$USERP3= <user>
##$USERP4= <user>
##$USERP5= <user>
##$WDW= 1
##$XDIM= 131072
##$YMAX_p= 415021574
##$YMIN_p= -11171
##$CURPLOT= <Network HP LaserJet P1505>
##$CURPRIN= <$Network HP LaserJet P1505>
##$DFORMAT= <normdp>
##$LAYOUT= <+/1D_H.xwp>
##$LFORMAT= <normlp>
##$PFORMAT= <normpl>
##$SURQMSG= 1
$$ End of Bruker specific parameters
$$ ---------------------------------
##NTUPLES= NMR SPECTRUM
##VAR_NAME=  FREQUENCY,     SPECTRUM/REAL,   SPECTRUM/IMAG
##SYMBOL=    X,             R,               I
##VAR_TYPE=  INDEPENDENT,   DEPENDENT,       DEPENDENT
##VAR_FORM=  AFFN,          ASDF,            ASDF
##VAR_DIM=   131072,        131072,          131072
##UNITS=     HZ,            ARBITRARY UNITS, ARBITRARY UNITS
##FACTOR=    0.0627417313425164, 1,          1
##FIRST=     8223.62146879497, -378,         -57811
##LAST=      0,             1107,            -58727
##MIN=       0,             -11171,          0
##MAX=       8223.62146879497, 415021574,    0
$$ Real data points
##PAGE= N=1
##DATA TABLE= (X++(R..R)), XYDATA
$$ [...]
61576C49843J11k67j239j794j685j646j938j924j291n80j91J30N09N97L58L36
$$ 349843 349954 349687 348448 346654 344969 343323 341385 339461 338170 337590 337399 337529 338038 338635 338993 339329
61560C39329P37J022Q00M89O29J128J507J541J357J187J233J411J307P08R4J23
$$ 339329 340066 341088 341888 342377 343006 344134 345641 347182 348539 349726 350959 352370 353677 354385 354479 354602
61544C54602P82J562K253K812K731J492k27r21j26J006J395J442K117L376M211
$$ 354602 355384 356946 359199 362011 364742 366234 366007 365086 364960 365966 367361 368803 370920 374296 378507
61529C78507L993L074K159J501P47o10k541m253m827m139k912j907j357j106q86
$$ 378507 382500 385574 387733 389234 389981 389371 386830 382577 377750 373611 370699 368792 367435 366329 365443
61514C65443n10j02r0n80r11m14N68J031O62J39KK7j20k85k36j18j45k35k44k15
$$ 365443 364933 364831 364741 364161 363250 362836 363404 364435 365097 365236 365238 365265 365145 364860 364624 364506 364361 364126 363882 363667
61494C63667j61N9L67M12P3k53j32M32J085J462J351Q64N11P46J416J983K307
$$ 363667 363506 363565 363932 364344 364417 364164 364032 364464 365549 367011 368362 369226 369737 370483 371899 373882 376189
61477C76189K688L117L063K257J228O68O19N79K05m02r33j170j060o64m9O24J017
$$ 376189 378877 381994 385057 387314 388542 389210 389829 390408 390613 390211 389278 388108 387048 386384 386335 386959 387976
61460C87976Q50L94L10P29R19L40m39m93J11N62O72J040J822K331K125J689J615
$$ 387976 388826 389220 389530 390259 391178 391518 391079 390586 390697 391259 391931 392971 394793 397124 399249 400938 402553
61443D02553J764J685J395J241J330J476J510J433J403J596J889J720O81p60j658
$$ 402553 404317 406002 407397 408638 409968 411444 412954 414387 415790 417386 419275 420995 421676 420916 419258
61428D19258j672j351j230j185p94J20J400K621L204K889K154J741J778J805J574
$$ 419258 417586 416235 415005 413820 413026 413146 414546 417167 420371 423260 425414 427155 428933 430738 432312
61413D32312J260R12L36m31j135j769k420k759k391j713j497j660j390o83o17
$$ 432312 433572 434484 434820 434389 433254 431485 429065 426306 423915 422202 420705 419045 417655 416972 416355
61398D16355j691k863k925j966q51J1O80J069J041P46L32k45p39m86O92K014K696
$$ 416355 414664 411801 408876 406910 406059 406070 406750 407819 408860 409606 409938 409693 408954 408468 409160 411174 413870
61381D13870K819K803K614K156J828K019K467K796L137L556L488K580J525J134
$$ 413870 416689 419492 422106 424262 426090 428109 430576 433372 436509 440065 443553 446133 447658 448792
61367D48792J012L24n15k21J298K514K257J104L64M68J036J853L041M489N651
$$ 448792 449804 450128 449613 449392 450690 453204 455461 456565 456929 457397 458433 460286 463327 467816 473467
61352D73467O078N963O080P032Q440R186Q718P846P709Q264Q441P692O545N542
$$ 473467 479545 485508 491588 498620 507060 516246 524964 532810 540519 548783 557224 564916 571461 577003
61338E77003M468L045J671R17P53P23N28l9j270k988m237m165l188k498k470k311
$$ 577003 581471 584516 586187 587104 587857 588580 589108 589069 587799 584811 580574 576409 573221 570723 568253 565942
61322E65942j422l48J11Q9K94Q67J344J628K233L400M655N539O334P614R336J0811
$$ 565942 564520 564172 564283 564372 564666 565533 566877 568505 570738 574138 578793 584332 590666 598280 607616 618427
61306F18427J1496J1530J1530J2049J3160J4336J4753J3862J1681Q554M834R09
$$ 618427 629923 641453 652983 665032 678192 692528 707281 721143 732824 741378 746212 747121
61294G47121k671n429p282q516r450j0242j0844j1056j0776j0272r983r947r696
$$ 747121 744450 739021 731739 723223 713773 703531 692687 681631 670855 660583 650600 640653 630957
61281F30957q839p507n983m311k580j189l81K54J312K720L828M276M297M255M232
$$ 630957 622118 614611 608628 604317 601737 600548 600167 600421 601733 604453 608281 612557 616854 621109 625341
61266F25341M093L698L056K504K622L637N086O303P072P556P885Q197Q685R136
$$ 625341 629434 633132 636188 638692 641314 644951 650037 656340 663412 670968 678853 687050 695735 704871
61252G04871Q718O885M271K078P07l38j365k119k503k909l616m414m989n229n044
$$ 704871 713589 720474 724745 726823 727530 727192 725827 723708 721205 718296 714680 710266 705277 700048 695004
61237F95004m368l470k807k457k080j453o71J04P69J249J759K825M562O217P115
$$ 695004 690636 687166 684359 681902 679822 678369 677698 677802 678571 679820 681579 684404 688966 695183 702298
61222G02298P634Q503R425R490Q748Q133P871P236O142N605O096O659O383N684
$$ 702298 709932 718435 727860 737350 746098 754231 762102 769338 775480 781085 787181 793840 800223 805907
61208H05907N267M787L567J969R92Q61R70J021J423K587M366O266P900R348J1135
$$ 805907 811174 815961 819528 821497 822489 823350 824320 825341 826764 829351 833717 839983 847883 857231 868366
61193H68366J3603J6223J8070J8972J9506J9630J8325J5078J0914P267M508K355
$$ 868366 881969 898192 916262 935234 954740 974370 992695 1007773 1018687 1025954 1030462 1032817
61181A032817R68O46Q51N27p04k419m193n828p031p732q533j0087j2047j3409
$$ 1032817 1033785 1034431 1035282 1035809 1035105 1032686 1028493 1022665 1015634 1007902 999369 989282 977235 963826
61167I63826j3858j4059j4563j5191j5613j5916j6273j6631j6920j7189j7238
$$ 963826 949968 935909 921346 906155 890542 874626 858353 841722 824802 807613 790375
61156G90375j6575j5055j3296j2063j1298j0116p905n161k966j593j39K102M210
$$ 790375 773800 758745 745449 733386 722088 711972 704067 698906 695940 694347 694208 696310 700520
61143G00520M362K032j271l688m805n324n638n502m817l878k935j983j020PJ418
$$ 700520 704882 706914 705643 701955 697150 691826 686188 680686 675869 671991 669056 667073 666053 666060 667478
61128F67478L499N953Q074R562J0841J2523J4808J7424J9898K1884K3464K5120
$$ 667478 670977 676930 685004 694566 705407 717930 732738 750162 770060 791944 815408 840528
61116H40528K7207K9525L1512L2780L3299L3202L2679L1894L0821K9245K7139
$$ 840528 867735 897260 928772 961552 994851 1028053 1060732 1092626 1123447 1152692 1179831
61105A179831K4891K2884K1025J8958J6530J3702J0181N601J64n348j0314j4757
$$ 1179831 1204722 1227606 1248631 1267589 1284119 1297821 1308002 1313603 1313767 1308419 1298105 1283348
61093A283348j8983k2973k6346k8704k9951l0382l0536l0782l0910l0270k8515
$$ 1283348 1264365 1241392 1215046 1186342 1156391 1126009 1095473 1064691 1033781 1003511 974996
61082I74996k6122k4006k2580k1419j9844j7723j5509j3636j2064j0502q813p092
$$ 974996 948874 924868 902288 880869 861025 843302 827793 814157 802093 791591 782778 775686
61070G75686n429l737j899n3J362J970J991K259L431N223O631P021O783O912Q041
$$ 775686 770257 766520 764621 764568 765930 767900 769891 772150 775581 780804 787435 794456 801239 808151 816192
61055H16192R932J1737J2825J3462J4545J6474J8590K0067K1078K2545K4856K7435
$$ 816192 826124 837861 850686 864148 878693 895167 913757 933824 954902 977447 1002303 1029738
61043A029738K9467L0519L0702L0821L2014L4404L6418L6626L5875L6205L7753
$$ 1029738 1059205 1089724 1120426 1151247 1183261 1217665 1254083 1290709 1326584 1362789 1400542
61032A400542L8575L7742L6694L6815L7570L8059L8701M0088M1622M2687M3851
$$ 1400542 1439117 1476859 1513553 1550368 1587938 1625997 1664698 1704786 1746408 1789095 1832946
61021A832946M5563M6938M7155M6868M6968M7394M8423N1542N7441O4758P2381
$$ 1832946 1878509 1925447 1972602 2019470 2066438 2113832 2162255 2213797 2271238 2335996 2408377
61010B408377Q1166R1693J02502J12829J24905J41334J62791J90980K30494K83861
$$ 2408377 2489543 2581236 2683738 2796567 2921472 3062806 3225597 3416577 3647071 3930932
61000C930932L48289M22277N12088O25917P66105R35011J142177J389577J649244
$$ 3930932 4279221 4701498 5213586 5839503 6605608 7540619 8682796 10072373 11721617
60991A1721617J872433K024753K090020K027008J754460J229606N52316m7767
$$ 11721617 13594050 15618803 17708823 19735831 21490291 22719897 23272213 23224446
60983B3224446l66479l70954j85437M3890K34310L26267K23834j58955p84512
$$ 23224446 22857967 22487013 22301576 22345466 22579776 22906043 23129877 22970922 22186410
60974B2186410j463349j970470k192528k164084j988520j751991j502571j268411
$$ 22186410 20723061 18752591 16560063 14395979 12407459 10655468 9152897 7884486
60966G884486j065481q93884p44891o14602n05127m15859l42007k80951k33280
$$ 7884486 6819005 5925121 5180230 4565628 4060501 3644642 3302635 3021684 2788404
60957B788404j97602j69796j47422j30258j16562j03311r0225p9445p1096o2887
$$ 2788404 2590802 2421006 2273584 2143326 2026764 1923453 1833228 1753783 1682687 1619800
60947A619800n4268m7145m2241l8325l5484l5547l8462m1468m2707m2856m2531
$$ 1619800 1565532 1518387 1476146 1437821 1402337 1366790 1328328 1286860 1244153 1201297 1158766
60936A158766m1026l8442l6314l5120l3517l0851k8146k6003k3760k1366j9788
$$ 1158766 1117740 1079298 1042984 1007864 974347 943496 915350 889347 865587 844221 824433
60925H24433j8917j7384j5009j3267j2563j1440r205p122o120n480m592l961l642
$$ 824433 805516 788132 773123 759856 747293 735853 726648 719526 713406 707926 703334 699373 695731
60912F95731k677j029l9j01J37J382K501K693K855L685M314L970L284K834J989
$$ 695731 693054 692025 691986 691885 692022 693404 695905 698598 701453 705138 709452 713422 716706 719540 721529
60897G21529L30j354k457l491m691n272m992m893n580o253o347o498o966o888
$$ 721529 721859 720505 718048 714557 709866 704594 699602 694709 689129 682876 676529 670031 663065 656177
60883F56177o131o210q045j0373j1553j1571j1073r949q252p078p041p077o075
$$ 656177 650046 643836 635791 625418 613865 602294 591221 581272 573020 565942 558901 551824 545749
60870E45749m664m091m331m551m408l795k334k72J146J309J304K261L647M306
$$ 545749 541085 536994 532663 528112 523704 519909 517575 517303 518449 519758 521062 523323 526970 531276
60856E31276M188L901L537L069K984L404L438K504J474J375J879K128K234K716
$$ 531276 535464 539365 542902 545971 548955 552359 555797 558301 559775 561150 563029 565157 567391 570107
60842E70107L166K729J444P4r52j675k146k560l314m371n153n395n342m895l664
$$ 570107 573273 576002 577446 577520 576568 574893 572747 570187 566873 562502 557349 551954 546612 541717 538053
60827E38053k189j804k663l301k796j975j656j282l75J24o53j986k813l399m347
$$ 538053 535864 534060 531397 528096 525300 523325 521669 520387 520012 520136 519483 517497 514684 511285 506938
60812E06938n077m765l923l617l864m082m340m868n054m291l194k788l038l233
$$ 506938 501861 497096 493173 489556 485692 481610 477270 472402 467348 463057 459863 457075 454037 450804
60798D50804l201l103k729k064j772k133k294j607q34q41j065n83J80K68p1Q1
$$ 450804 447603 444500 441771 439707 437935 435802 433508 431901 431067 430226 429161 428578 428758 429026 428955 429036
60782D29036O12O80K49J8J18J74L02R39J931K773L317L506K972J825J074J341
$$ 429036 429648 430328 430577 430595 430713 430887 431189 432128 434059 436832 440149 443655 446627 448452 449526 450867
60766D50867J917K087K374L328M053L496K317J895K057J476o8j382j630j154o56
$$ 450867 452784 454871 457245 460573 464626 468122 470439 472334 474391 475867 475799 474417 472787 471633 470977
60751D70977p24j789l456m306l406j655n28j98L8K15q4n86q80j497k988m537m981
$$ 470977 470253 468464 465008 460702 457296 455641 455113 454915 454953 455168 455084 454498 453618 452121 449133 444596 439615
60734D39615m661m693m969m587l765l503l674l273k397k075k260j874r22o11j138
$$ 439615 434954 430261 425292 420705 416940 413437 409763 406490 404093 402018 399758 397884 396962 396351 395213
60719C95213j287n60N1J2J12P17Q62J0p32k87P61J294J445K064L057L477K950
$$ 395213 393926 393366 393417 393429 393541 394258 395120 395130 394398 394111 394872 396166 397611 399675 402732 406209 409159
60702D09159K108J667J740K029K246K264K111J908J825K053K621L149L071K326
$$ 409159 411267 412934 414674 416703 418949 421213 423324 425232 427057 429110 431731 434880 437951 440277
60688D40277J540J314J592J968K138J910J257O39O97J310J644J418J240J349J153
$$ 440277 441817 443131 444723 446691 448829 450739 451996 452635 453332 454642 456286 457704 458944 460293 461446
60673D61446N53M97J317J778Q76n25j122j255k086l521m527m813m770m274l054
$$ 461446 461999 462496 463813 465591 466467 465942 464820 463565 461479 457958 453431 448618 443848 439574 436520
60658D36520j786j395j666j783j642j392m89J198K222J307l09l31J300K604K689
$$ 436520 434734 433339 431673 429890 428248 426856 426367 427565 429787 431094 430785 430454 431754 434358 437047
60643D37047K452K261J309m60j900k594l316m138m008k812j940k068k143j393
$$ 437047 439499 441760 443069 442609 440709 438115 434799 430661 426653 423841 421901 419833 417690 416297
60629D16297o95r25j400j036M5J006J460J418R49N14P55J414J407M31m79m68Q3
$$ 416297 415602 414677 413277 412241 412286 413292 414752 416170 417119 417633 418388 419802 421209 421640 421161 420693 420776
60612D20776M82P07Q73P59L99L14O11P35M96M67Q86J152Q46M28L52L88K77L10
$$ 420776 421258 421965 422838 423597 423996 424310 424921 425656 426152 426619 427505 428657 429503 429931 430283 430671 430948 431258
60594D31258P52J405K077K773L205K964K371K243K520K193R09l37o24k66j3J7
$$ 431258 432010 433415 435492 438265 441470 444434 446805 449048 451568 453761 454670 454333 453709 453443 453430 453447
60578D53447P9K12M92J161K180L126L877M715N716O726P907R491J0907J1299J0968
$$ 453447 453526 453738 454230 455391 457571 460697 464574 469289 475005 481731 489638 499129 510036 521335 532303
60563E32303J1187J2354J3437J3561J2865J1521R116N626J863j599m885p675q852
$$ 532303 543490 555844 569281 582842 595707 607228 616344 621970 623833 622234 617349 609674 600822
60550F00822q053o488n370m350k481J32K496M019M842N331N975P393R781J2595
$$ 600822 592769 586281 580911 576561 574080 574212 576708 580727 585569 590900 596875 604268 614049 626644
60536F26644J5120J7157J8983K0992K3385K5675K6531K4786K0691J5590J0416
$$ 626644 641764 658921 677904 698896 722281 747956 774487 799273 819964 835554 845970
60525H45970N188j64n405j0256j4108j5710j4492j2075j0975j1606j2039j0954
$$ 845970 851158 850994 845589 835333 821225 805515 791023 778948 767973 756367 744328 733374
60513G33374r187p848o607m854l067j833o52J163L216M783O118Q035J0772J4089
$$ 733374 724187 716339 709732 704878 701811 699978 699326 700489 703705 708488 714606 722641 733413 747502
60499G47502J7990K2539K7448L2518L7982M3882M9524N4045N7022N8223N7308
$$ 747502 765492 788031 815479 847997 885979 929861 979385 1033430 1090452 1148675 1205983
60488A205983N4243M9443M3311L6109K8330K0434J2080K552p865j7998k7384l6598
$$ 1205983 1260226 1309669 1352980 1389089 1417419 1437853 1449933 1452485 1444620 1426622 1399238 1362640
60476A362640m5653n3327n8644o1875o3392o2663n9253n3987m8302m3120l8786
$$ 1362640 1316987 1263660 1205016 1143141 1079749 1017086 957833 903846 855544 812424 773638
60465G73638l5278l1943k7880k3223j9243j6763j5255j3892j2511j1150r678q381
$$ 773638 738360 706417 678537 655314 636071 619308 604053 590161 577650 566500 556822 548441
60453E48441p872p890p317n817m366l625l082k406k238k840l269k897k478k620
$$ 548441 540569 532679 525362 519545 515179 511554 508472 506066 503828 500988 497719 494822 492344 489724
60439D89724k465j149M75R30J44q43j517k003k191j887j454j321j272j035r42
$$ 489724 487259 486110 486585 487515 487659 486816 485299 483296 481105 479218 477764 476443 475171 474136 473194
60424D73194j275j561j345j002r72q97l53K28K83J89P00J805K906L639L850L339
$$ 473194 471919 470358 469013 468011 467039 466142 465789 466017 466300 466489 467189 468994 471900 475539 479389 482728
60408D82728K282J407J188J416J862K507K835K022M41k56P08K120K559K074J314
$$ 482728 485010 486417 487605 489021 490883 493390 496225 498247 498688 498432 499140 501260 503819 505893 507207
60393E07207L42n73l65J300L008L432L154L310L582L026K033J745K203K589K730
$$ 507207 507549 506976 506611 507911 510919 514351 517505 520815 524397 527423 529456 531201 533404 535993 538723
60378E38723K929K870K173J567K022L078L443K872K193J841J660J797K407K789
$$ 538723 541652 544522 546695 548262 550284 553362 556805 559677 561870 563711 565371 567168 569575 572364
60364E72364K122R06M12Q94J493J707J853K221K827L743M739N037M358L786M513
$$ 572364 574486 575392 575804 576698 578191 579898 581751 583972 586799 590542 595281 600318 604676 608462 612975
60349F12975O176P623Q658R743J0370R404O923M298K346N64j653m132o315p726
$$ 612975 619151 626774 635432 645175 655545 664949 671872 676170 678516 679080 677427 673295 666980 659254
60335F59254p980p152o007n228m642l898l387l615m192m376m238m270m320l988
$$ 659254 651274 644122 638115 632887 628245 624347 620960 617345 613153 608777 604539 600269 595949 591961
60321E91961l616l747l941l340k058q94jJ117K482L751N117P008R154J0968J2556
$$ 591961 588345 584598 580657 577317 575259 574365 574364 575481 577963 581714 586831 593839 602993 613961 626517
60306F26517J4377J6237J7675J8867K0119K0894K0493J9110J7006J3354P471O52
$$ 626517 640894 657131 674806 693673 713792 734686 755179 774289 791295 804649 812120 812772
60294H12772m999r204j3310j7547k0449k1100k0212j8590j6131j2908r842p628
$$ 812772 807773 798569 785259 767712 747263 726163 705951 687361 671230 658322 648480 640852
60282F40852n955m353k984k251k292l053m199n029n175n133n414n534m895m112
$$ 640852 634897 630544 627560 625309 623017 619964 615765 610736 605561 600428 595014 589480 584585 580473
60268E80473m196m745m389k983j849j838k410k758k622j952r17k56n33j132j186
$$ 580473 576277 571532 567143 564160 562311 560473 558063 555305 552683 550731 549814 549558 549025 547893 546707
60253E46707j120j857k756k197k41J210J195Q54J215J639J346Q83J026J348J040
$$ 546707 545587 543730 540974 538777 538536 539746 540941 541795 543010 544649 545995 546878 547904 549252 550292
60238E50292K77j55rL63O15O30N64Q80J757K462K155J283J196K240L358L768L819
$$ 550292 550569 550414 550405 550768 551383 552013 552577 553457 555214 557676 559831 561114 562310 564550 567908 571676 575495
60221E75495L988M112M187M728N814O665O776O640O881P479Q253R251J0240J0580
$$ 575495 579483 583595 587782 592510 598324 604989 611765 618405 625286 632765 641018 650269 660509 671089
60207F71089J0178R782R911J0170J0054R676R312Q844Q152P428O783O068N330
$$ 671089 681267 691049 700960 711130 721184 730860 740172 749016 757168 764596 771379 777447 782777
60194G82777M808M278L105J161q72k340l195l688m137n002o462p824q203p798
$$ 782777 787585 791863 794968 796129 795257 792917 789722 786034 781897 776895 770433 762609 754406 746608
60180G46608p682q176q416p733o595n732n174m534l668k675j703r92p03o43n49
$$ 746608 738926 730750 722334 714601 708006 702274 697100 692566 688898 686223 684520 683528 682825 682182 681633
60165F81633n40p70q86n10mK0k48p2O97J561K239K730K826K483K347K943L638
$$ 681633 681093 680323 679437 678927 678923 678943 678695 678623 679320 680881 683120 685850 688676 691159 693506 696449 700087
60148G00087L552L070L247M028M514M761N697P339Q709R590J0821J2687J4666
$$ 700087 703639 706709 709956 713984 718498 723259 728956 736295 745004 754594 765415 778102 792768
60135G92768J6904K0249K4342K7440K8633K8700K8109K5854K1154J4926Q586K563
$$ 792768 809672 829921 854263 881703 910336 939036 967145 992999 1014153 1029079 1037665 1040228
60123A040228l128p901j1186j3106j3809j3046j1026q809p149n760m329l288k978
$$ 1040228 1037100 1029199 1018013 1004907 991098 978052 967026 958217 951068 945308 940979 937691 934713
60110I34713k976k868k962l596m569n698p104q460q921q384p878q137q572q230
$$ 934713 931737 928869 925907 922311 917742 912044 904940 896480 887559 879175 871297 863160 854588 846358
60096H46358o992n299l465j797o15K56J386K765L749M215M932O476Q585J0846
$$ 846358 839366 834067 830602 828805 828190 828446 829832 832597 836346 840561 845493 851969 860554 871400
60082H71400J3150J5287J7014J8678K0683K2190K1586J8453J3874Q553K073n530
$$ 871400 884550 899837 916851 935529 956212 978402 999988 1018441 1032315 1040868 1042941 1037411
60070A037411j2943j9035k3897k7770l0196l0872l0273k8756k6215k3168k0902
$$ 1037411 1024468 1005433 981536 953766 923570 892698 862425 833669 807454 784286 763384
60059G63384j9711j8244j5490j2350j0244r214q301p016n548m167l082k296j262
$$ 763384 743673 725429 709939 697589 687345 678131 669830 662814 657266 653099 650017 647721 646459
60046F46459N88K690L886M291N357P562R485R876R326R054R170R032Q276O756
$$ 646459 647047 649737 653623 657914 663271 670833 680318 690194 699520 708574 717744 726776 735052 741808
60032G41808M394J743k29j395k517l777m620n255o647q500r217q662q926j1144
$$ 741808 746202 747945 747716 746321 743804 740027 735407 730152 723505 715005 705788 697126 688200 677056
60018F77056j3372j3256j1264r572r043q951q698q143o993n255l682k685j672
$$ 677056 663684 650428 639164 629592 620549 611598 602900 594757 587764 582509 578827 576142 574470
60005E74470m02J46n99j449j061J65J110J787K750L621L695L266L074L098L121
$$ 574470 574068 574214 573615 572166 571105 571270 572380 574167 576917 580538 584233 587499 590573 593671 596792
59990E96792L570M622N376N201M994N775O942P341P057O742O015M135J628k30
$$ 596792 600362 604984 610360 615561 620555 626330 633272 640613 647670 654412 660427 664562 666190 665960
59976F65960j031j153p37N7N78N64P52J579K379K974M628P974J1457J3625J5539
$$ 665960 664929 663776 663039 663096 663674 664238 664990 666569 668948 671922 676550 684524 695981 709606 725145
59961G25145J8845K2733K5224K6334K7300K7381K4396J8306J1475N164j625r215
$$ 725145 743990 766723 791947 818281 845581 872962 897358 915664 927139 932303 930678 921463
59949I21463j5687j9263k0387k0451j9962j8906j7661j6593j5561j4416j3297
$$ 921463 905776 886513 866126 845675 825713 806807 789146 772553 756992 742576 729279
59938G29279j2102j0502q665p232o359n544m487l399k447j602q86j23J319L746
$$ 729279 717177 706675 698010 690778 684419 678875 674388 670989 668542 666940 666054 665931 667250 670996
59924F70996O391Q248R290J0062J0545J0464J0253J0574J1175J1335J1189J1519
$$ 670996 677387 685635 694925 704987 715532 725996 736249 746823 757998 769333 780522 792041
59912G92041J2530J3883J5656J8205K1182K3681K5152K5444K4391K2181J9607
$$ 792041 804571 818454 834110 852315 873497 897178 922330 947774 972165 994346 1013953
59901A013953J7002J3592Q831L649q15m810r020j2865j5265j6323j6670j5843
$$ 1013953 1030955 1044547 1053378 1057027 1056212 1051402 1042382 1029517 1014252 997929 981259 965416
59889I65416j3130r433o401m149j658R77K748L880N605P841R218R552J0204J1652
$$ 965416 952286 942853 936452 932303 930645 931622 934370 938250 943855 951696 960914 970466 980670 992322
59875I92322J2684J2561J2084J1927J1618J0797R964R209P803N693M044L485L030
$$ 992322 1005006 1017567 1029651 1041578 1053196 1063993 1073957 1083166 1090969 1096662 1100706 1104191 1107221
59862A107221J470j238m553q196j1805j4764j6987j9057k1057k2194k1976k0869
$$ 1107221 1108691 1107453 1102900 1094704 1082899 1068135 1051148 1032091 1011034 988840 966864 945995
59850I45995j9427j7617j5375j2984j0555p914n199k832p60J396L349M211L632
$$ 945995 926568 908951 893576 880592 870037 862123 856924 854092 853332 854728 858077 862288 865920
59837H65920K001l75l210n455n869m617l096j978o63J061K106J386r29l902o721
$$ 865920 867921 867546 864336 858881 853012 848395 845299 843321 842658 843719 845825 847211 846282 842380 835659
59822H35659q794r902j0484j1080j1390j0759r538q834q871q776q099p321o683
$$ 835659 826865 816963 806479 795399 784009 773250 763712 754878 746007 737231 729132 721811 715128
59809G15128n764m598l959m114m311l935l086j786K00K305L119K065K66q78j143
$$ 715128 709364 704766 700807 696693 692382 688447 685361 683575 683775 686080 689199 691264 691530 690652 689509
59794F89509j110j156j352j692j977j940j711j612j519j099o15o49j132j527j839
$$ 689509 688399 687243 685891 684199 682222 680282 678571 676959 675440 674341 673726 673077 671945 670418 668579
59779F68579k375k639j777j54Q16O79N07J164K214K994L614M391N279O258P498
$$ 668579 666204 663565 661788 661634 662450 663129 663636 664800 667014 670008 673622 678013 683292 689550 697048
59764F97048Q760R535J0006J0937J2435J3810J4909J6483J8872K1403K3455K5238
$$ 697048 705808 715343 725349 736286 748721 762531 777440 793923 812795 834198 857653 882891
59752H82891K7162K9333L1904L4980L7923L9666L9961L9397L8108L5597L1923
$$ 882891 910053 939386 971290 1006270 1044193 1083859 1123820 1163217 1201325 1236922 1268845
59741A268845K7802K3243J7317R796J885n155j1159j6323k0438k3288k5070k5892
$$ 1268845 1296647 1319890 1337207 1347003 1348888 1343733 1332574 1316251 1295813 1272525 1247455 1221563
59729A221563k5641k4601k3447k2422k1369k0534k0443k0879k1041k0741k0340
$$ 1221563 1195922 1171321 1147874 1125452 1104083 1083549 1063106 1042227 1021186 1000445 980105
59718I80105j9637j8137j6400j5594j5542j4830j3133j1728j1186j0344q449o665
$$ 980105 960468 942331 925931 910337 894795 879965 866832 855104 843918 833574 825125 818460
59706H18460o205o370n687m060k563j747j267o92J87J436K742L463L428L185L171
$$ 818460 812255 805885 800198 796138 793575 791828 790561 789869 790056 791492 794234 797697 801125 804310 807481
59691H07481L161K811K133J155k07j699k793l322l457l113k213j413j551k425
$$ 807481 810642 813453 815586 816741 816534 814835 812042 808720 805263 802150 799937 798524 796973 794548
59677G94548l127l525m263n402o318o978p916q906r082q529q214q190p404n644
$$ 794548 791421 787896 783633 778231 771913 764935 757019 748113 739031 730502 722288 714098 706694 701050
59663G01050m042l223k552j704j298j370q12Q00K370K976L059L191L155L047L749
$$ 701050 697008 693785 691233 689529 688231 686861 686049 686849 689219 692195 695254 698445 701600 704647 708396
59648G08396N267N975M681K261K48j092k288l425m413n576o932p695p381o596
$$ 708396 713663 719638 724319 726580 726828 725736 723448 720023 715610 710034 703102 695407 688026 681430
59634F81430o014n489m740l986l282k232j027n88j131j711j867k398l759n000
$$ 681430 675416 669927 665187 661201 657919 655687 654660 654072 652941 651230 649363 646965 643206 638206
59620F38206n184m756m464m089l242k468k463l035l598l907l693k473n38R33J410
$$ 638206 633022 628266 623802 619713 616471 614003 611540 608505 604907 601000 597307 594834 594296 595229 596639
59605E96639J774K836M079M548M051K924J564O52P84J381J256N20N41J510J831
$$ 596639 598413 601249 605328 609876 613927 616851 618415 619067 619851 621232 622488 623008 623549 625059 626890
59590F26890O39p60j004n62m19m24k32m92j634k698k671k067j953k348k744l193
$$ 626890 627529 626769 625765 625203 624784 624360 624128 623636 622002 619304 616633 614566 612613 610265 607521 604328
59574F04328l774l919l270k434j935j414o63l71q62j229o28M49J120J305J253
$$ 604328 600554 596635 593365 590931 588996 587582 586919 586548 585686 584457 583829 584278 585398 586703 587956
59559E87956Q79K72j15k65n05l59R69K668K799J240Q4M25R38O40O97K077L603
$$ 587956 588835 589107 588992 588727 588222 587863 588832 591500 594299 595539 595623 596048 596986 597626 598323 600400 604003
59542F04003M099M489O035Q203R993J1733J3897J5864J7196J8278J8108J3926
$$ 604003 608102 612591 618626 626829 636822 648555 662452 678316 695512 713790 731898 745824
59530G45824N237l870q830r321p762n203j557J978L886M714N712O110M509J890
$$ 745824 751061 747191 738361 729040 721278 716075 714518 716496 720382 725096 730808 736918 741427 743317
59516G43317M07p9j414l773n647o772q220r890j0523j0113r899r966r163p401
$$ 743317 743724 743645 742231 738458 732811 726039 717819 707929 697406 687293 677394 667428 658265 650864
59502F50864n882n044m303l676l690l870l234k155j826k093j692m09Q23J663K370
$$ 650864 644982 639938 635635 631959 628269 624399 621165 619010 617184 615091 613399 612990 613813 615476 617846
59487F17846K559J813J164J907L357L808L330L495M682N769O299O798P125O656
$$ 617846 620405 622218 623382 625289 628646 632454 635784 639279 643961 649730 656029 662827 669952 676608
59473F76608N993O307P097O640M717K813J662O38m14q17o50p61j092p51K72J281
$$ 676608 682601 688908 696005 702645 707362 710175 711837 712475 712061 711244 710594 709833 708741 707990 708262 709543
59457G09543K578N007P964R918J0789J1762J2840J2867J1947J1527J1838J1490
$$ 709543 712121 717128 725092 735010 745799 757561 770401 783268 795215 806742 818580 830070
59445H30070R943Q152O306L208j458o183r715j2252j4003j4308j3007j1112r455
$$ 830070 840013 848165 854471 857679 856221 850038 840323 828071 814068 799760 786753 775641 766186
59432G66186p946o540n659n252m641l618k464j041J025L372N492P958J1553J5616
$$ 766186 758240 751700 746041 740789 736148 732530 730066 729025 730050 733422 738914 746872 758425 774041
59418G74041J8832K1272K3956K6959K9713L2493L5517L7399L6891L5193L3600
$$ 774041 792873 814145 838101 865060 894773 927266 962783 1000182 1037073 1072266 1105866
59407A105866K9558J8958K680j2626k1157k2341j8226j0274l99Q265J4086J8203
$$ 1105866 1135424 1154382 1157062 1144436 1123279 1100938 1082712 1072438 1072039 1080304 1094390 1112593
59395A112593K0981J9368J0241m805j9997l0042l3262l1379k7647k4498k2017
$$ 1112593 1133574 1152942 1163183 1158378 1138381 1108339 1075077 1043698 1016051 991553 969536
59384I69536j9036j5649j3274j2280j1346r668p983o822n612m173l295l026k267
$$ 969536 950500 934851 921577 909297 897951 888283 880300 873478 867866 863693 860398 857372 855105
59371H55105q45j73q57j538j124m17l06j11R27K073K349K122K228K682L316M511
$$ 855105 854260 854087 853230 851692 850568 850151 849845 849734 850661 852734 855083 857205 859433 862115 865431 869942
59355H69942O285P832Q881J0416J3099J6129J8481K0178K1614K2810K3994K5620
$$ 869942 876227 884059 892940 903356 916455 932584 951065 971243 992857 1015667 1039661 1065281
59343A065281K7179K7341K5942K4352K3169K1166J7331J2432P519K472k935p909
$$ 1065281 1092460 1119801 1145743 1170095 1193264 1214430 1231761 1244193 1251712 1254184 1251249 1243340
59331A243340j1801j5123j8390k1147k3021k4459k5476k5124k3219k1240k0247
$$ 1243340 1231539 1216416 1198026 1176879 1153858 1129399 1103923 1078799 1055580 1034340 1014093
59320A014093j9213j6679j3024r848p908o899o399n997n162l896k911k495j990
$$ 1014093 994880 978201 965177 955329 947421 940522 934123 928126 922964 919068 916157 913662 911672
59307I11672r08L33J302K227L205L786L818L768L711L114J996J173R66Q94R79
$$ 911672 910764 911097 912399 914626 917831 921617 925435 929203 932914 936028 938024 939197 940163 941057 942036
59292I42036J930L515M130K566j008o066j2065j7443k0055j9433j7162j4480j1075
$$ 942036 943966 947481 951611 954177 953169 947103 935038 917595 897540 878107 860945 846465 835390
59279H35390o819k803K67L073O266R505J2591J5904J9044K0789K1107K1438K2231
$$ 835390 828571 825768 826035 829108 835374 844879 857470 873374 892418 913207 934314 955752 977983
59266I77983K2131K0412J8146J6031J3177R229N531K762m14m741q470r847r691
$$ 977983 1000114 1020526 1038672 1054703 1067880 1077109 1082640 1085402 1084988 1080247 1071777 1061930 1052239
59253A052239r652r526q231o039l965k147n38Q0n27r03J32J577J909J422J216
$$ 1052239 1042587 1033061 1024830 1018791 1014826 1012679 1012141 1012221 1011694 1010791 1010923 1012500 1014409 1015831 1017047
59238A017047J084L41l38J81J481K238K218K065J744O69j156l404o133r112j1345
$$ 1017047 1018131 1018472 1018134 1018315 1019796 1022034 1024252 1026317 1028061 1028730 1027574 1024170 1018037 1008925 997580
59223I97580j2358j3121j4462j5627j5630j4917j4380j3819j2764j1778j1489
$$ 997580 985222 972101 957639 942012 926382 911465 897085 883266 870502 858724 847235
59212H47235j1288j0403r395r122r185q761q123p892p598o486m976l991l467k740
$$ 847235 835947 825544 816149 807027 797842 789081 780958 773066 765468 758982 754006 750015 746548 743808
59198G43808j798r67j11Q57J505J843K784M626O206O628O700P508Q691R399R810
$$ 743808 742010 741043 740932 741789 743294 745137 747921 752547 758753 765381 772081 779589 788280 797679 807489
59183H07489J0470J1033J0986J0657J0455J0071R425R226R621R522Q290O722N415
$$ 807489 817959 828992 839978 850635 861090 871161 880586 889812 899433 908955 917245 923967 929382
59170I29382L783J777P67J334J960J384N40N03L66r91k737l716m650o610q806
$$ 929382 933165 934942 935709 937043 939003 940387 940927 941430 941796 940805 938068 934352 929702 923092 914286
59155I14286j0034j0956j2698j4490j4935j4456j4295j4155j3102j1708j1070
$$ 914286 904252 893296 880598 866108 851173 836717 822422 808267 795165 783457 772387
59144G72387j0685r519q142p630p321n975m158l153k481r25Q83J494J525K783
$$ 772387 761702 752183 744041 736411 729090 723115 718957 715804 713323 712398 713281 714775 716300 719083
59130G19083N042O303O090N944O731P690Q184Q333P976O843N630N281N455N359
$$ 719083 724125 730428 736518 742462 749193 756883 765067 773400 781376 788219 793849 799130 804585 809944
59116H09944N379O242P264P412P306Q061Q944Q465P110O569O775O214M811L902
$$ 809944 815323 821565 828829 836241 843547 851608 860552 869017 876127 882696 889471 895685 900496 904398
59102I04398L516K210l27k828m724o638q426q958q181p399p259p080o372n365
$$ 904398 907914 910124 909797 906969 902245 895607 887181 878223 870042 862643 855384 848304 841932 836567
59088H36567m064k436j378j790k838k982k480l021n030p145q347q763q492p465
$$ 836567 832503 830067 828689 826899 824061 821079 818599 815578 810548 803403 795056 786293 777801 770336
59074G70336o413o242o522o184n428n252n469n058m067l388k966k152j343j346
$$ 770336 763923 757681 751159 744975 739547 734295 728826 723768 719701 716313 713347 711195 709852 708506
59060G08506j610j143n73j111k053j755o66p10j921k455j877j651k171k100j135
$$ 708506 706896 705753 705180 704069 702016 700261 699595 698885 696964 694509 692632 690981 688810 686710 685575
59045F85575o87j168j109J51J268J288J155J852K932L834M965O595Q149R359J0815
$$ 685575 684888 683720 682611 682762 684030 685318 686473 688325 691257 695091 700056 706651 714800 724159 734974
59030G34974J2858J5207J7912K1384K5321K9051L2914L7644M2413M5253M5507
$$ 734974 747832 763039 780951 802335 827656 856707 889621 927265 969678 1014931 1060438
59019A060438M4071M1154L5770K7615J7602O373n755j7191k5495k9998l2259l3574
$$ 1060438 1104509 1145663 1181433 1209048 1226650 1233023 1227268 1210077 1184582 1154584 1122325 1088751
59007A088751l3749l2595l0670k8087k4332j9805j5878j2958j0074o715l610j330
$$ 1088751 1055002 1022407 991737 963650 939318 919513 903635 890677 880603 873888 870278 868948
58995H68948L31J422J759J870K443K883K083N70l7L75K76r55k335l253m073m474
$$ 868948 869279 870701 872460 874330 876773 879656 881739 882309 882272 882647 882923 881968 879633 876380 872307 867833
58979H67833l329o91J918L627M927O121O867P514Q966J0929J2150J2550J3318
$$ 867833 864504 863813 865731 869358 874285 880406 887273 894787 903753 914682 926832 939382 952700
58966I52700J4651J5370J5018J4489J4249J3747J2739J1435R342N873K026o61
$$ 952700 967351 982721 997739 1012228 1026477 1040224 1052963 1064398 1073740 1079613 1081639 1080978
58954A080978k729o051j0591j4314j6415j8098j9801k0380j9535j8495j7667j5986
$$ 1080978 1078249 1072198 1061607 1047293 1030878 1012780 992979 972599 953064 934569 916902 900916
58942I00916j3287j0898r217p027l941j165Q02K960N559P509Q731J0632J3294
$$ 900916 887629 876731 867514 860487 856546 855381 856183 859143 864702 872211 880942 891574 904868
58929I04868J4760J4099J2894J2370J1365Q416L922r82n838j0121j2871j4141
$$ 904868 919628 933727 946621 958991 970356 978772 982694 981712 975874 965753 952882 938741
58917I38741j5157j6296j6571j5639j4370j2912j0382p114m885m136l174j005
$$ 938741 923584 907288 890717 875078 860708 847796 837414 830300 825415 821279 818105 817100
58905H17100J394L404N955R317J2007J3201J4025J5352J6366J6509J6668J7318
$$ 817100 818494 821898 827853 837170 849177 862378 876403 891755 908121 924630 941298 958616
58893I58616J7499J6843J6579J7360J8130J8342J9233K1575K4089K5358K5562
$$ 958616 976115 992958 1009537 1026897 1045027 1063369 1082602 1104177 1128266 1153624 1179186
58882A179186K5180K3741K0941J7317J2988P548J833k283m656p196j0699j3774
$$ 1179186 1204366 1228107 1249048 1266365 1279353 1286901 1288734 1286451 1281795 1274599 1263900 1250126
58870A250126j5670j7522j9547j9773j7165j3571j0964q947o657m932m732n309
$$ 1250126 1234456 1216934 1197387 1177614 1160449 1146878 1135914 1126967 1120310 1115378 1110646 1105337
58858A105337n599n745n867n050k945o31J237L414O181Q453R680J0534J0773Q770
$$ 1105337 1099738 1093993 1088126 1083076 1080131 1079500 1080737 1084151 1090332 1098785 1108465 1118999 1129772 1138542
58844A138542M149j422p182j4253k2502k9228l2623l3937l4551l3570l0234k6158
$$ 1138542 1142691 1141269 1134087 1119834 1097332 1068104 1035481 1001544 966993 933423 903189 877031
58832H77031k3074k0539j7780j5549j4268j2591r736p044n438l647q98J156J266
$$ 877031 853957 833418 815638 800089 785821 773230 763494 756450 751012 747365 746467 747623 748889
58819G48889R97J981L097K764J950K346L465L910L835L804L066J160m22m73k90
$$ 748889 749886 751867 754964 757728 759678 762024 765489 769399 773234 777038 780104 781264 780842 780369 780079
58804G80079j469l176l812l700l993m452m465m691n681o439o213o035o658o883
$$ 780079 778610 775434 771622 767922 763929 759477 755012 750321 744640 738201 731988 725953 719295 712412
58790G12412n807m767m905m885l234r53M94J837M190O466P144O917P147P396O819
$$ 712412 706605 701838 696933 692048 688814 687861 688355 690192 694382 700848 707992 714909 722056 729452 736271
58775G36271O287O649O532M442J561q5p72j968l502m237m242m022k936n31J912
$$ 736271 742558 749207 755739 760181 761742 761657 760885 758917 755415 751178 746936 742914 739978 739447 741359
58760G41359L282M620P226J0329J2599J4219J5465J5130J2517R066N872J729m068
$$ 741359 744641 749261 756487 766816 779415 793634 809099 824229 836746 845812 851684 853413 849345
58747H49345r252j1563j2077j2805j3027j1067p805n351l757j950l88L8K57J389
$$ 849345 840093 828530 816453 803648 790621 779554 771749 766398 762641 760691 760303 760341 760598 761987
58733G61987K472K461K710M609O579O458N263N391O681P400P625Q489R384R134
$$ 761987 764459 766920 769630 774239 780818 787276 792539 797930 804611 812011 819636 828125 837509 846643
58719H46643Q642R368J0474J0503J0402J1751J3381J3055J1195R765Q599O134
$$ 846643 855285 864653 875127 885630 896032 907783 921164 934219 945414 955179 963778 969912
58707I69912K613n97l753p751j1536j3665j5245j8164k1588k3416k3953k4928
$$ 969912 972525 971928 968175 960424 948888 935223 919978 901814 880226 856810 832857 807929
58695H07929k6007k5568k3916k2503k1058j8522j5710j3938j2320r588p109o755
$$ 807929 781922 756354 732438 709935 688877 670355 654645 640707 628387 618799 611690 604935
58683F04935p348o690n605o146p313o636m747m161m541l452j101k0m46k13J144
$$ 604935 597587 590897 585292 579146 571833 565197 560450 556289 551748 548296 547195 547175 546729 546516 547660
58668E47660K076K661M618P744R961J0878J1897J3036J2906J1493R768P121K614
$$ 547660 549736 552397 557015 564759 574720 585598 597495 610531 623437 634930 644698 651819 654433
58655F54433k018m181m633o136q668r786r140q605q352o902m843m427n457n430
$$ 654433 652415 648234 643601 637465 628797 619011 609871 601266 592914 586012 581169 576742 571285 565855
58641E65855l856k693k481j705p3J120J911L478N157N088L681L044L235K533R83
$$ 565855 561999 559306 556825 555120 555047 556167 558078 561556 566713 571801 575482 578526 581761 584294 585277
58626E85277J06m14k031l823l542j695o98m29J327M408O491P395Q969J0929J1152
$$ 585277 585383 584969 582938 579115 575573 573878 573180 572751 574078 578486 584977 592372 601341 612270 623422
58611F23422J0010R973J0894J0119P406N293M370K663L3j314j208j985l994m885
$$ 623422 633432 643405 654299 664418 671824 677117 681487 684150 684183 682869 681661 679676 675682 670797
58597F70797m100l807m733n155m661m800n391m265j405P98J947M216P919J0647
$$ 670797 666697 662890 658157 653002 648341 643541 638150 633885 632480 633278 635225 639441 647360 658007
58583F58007J1593J2609J4238J4742J3836J3362J3533J2516J0275Q878Q526P424
$$ 658007 669600 682209 696447 711189 725025 738387 751920 764436 774711 783589 792115 799539
58571G99539O034P069J0650J3883J5902J8883K3338K6932K8927L1305L4477L6291
$$ 799539 805573 812642 823292 837175 853077 871960 895298 922230 951157 982462 1016939 1053230
58559A053230L6263L6441L6970L5143K9897K3120J5643O452l390j0521j4066j6264
$$ 1053230 1089493 1125934 1162904 1198047 1227944 1251064 1266707 1273159 1269769 1259248 1245182 1228918
58547A228918j7670j6443j3101j1004j0932j0204q339q542j2128j6487k0074k4427
$$ 1228918 1211248 1194805 1181704 1170700 1159768 1149564 1141225 1132683 1120555 1104068 1083994 1059567
58535A059567k9543l2360l1731l0244k9290k7096k3267k0385j9101j6578j1763
$$ 1059567 1030024 997664 965933 935689 906399 879303 856036 835651 816550 799972 788209
58524G88209p554n768m687l413l689n307m880j599O18p23l053l671l653m310m251
$$ 788209 780655 774887 770200 766787 763098 757791 752911 751312 751930 751207 748154 744483 740830 736520 732269
58509G32269k710j619j944j839n77j47j079j060M80R11n68j277k89l34k348l266
$$ 732269 729559 727940 725996 724157 723580 723433 722354 721294 721774 722685 722117 720840 720551 720217 717869 714603
58493G14603j592j39o42o81J335L073K916K986M784O501P223R092J2759J5530
$$ 714603 713011 712872 712230 711549 712884 715957 718873 721859 726643 733144 740367 749459 762218 777748
58479G77748J6527J8686K3003K5969K5412K3771K2767K0104J4426Q311L299k775
$$ 777748 794275 812961 835964 861933 887345 911116 933883 953987 968413 976724 980023 977248
58467I77248j0472j6054j7378j7180j7441j5907j1484p463n798l623R04M817O137
$$ 977248 966776 950722 933344 916164 898723 882816 871332 863869 858071 854448 855352 860169 866306
58454H66306P835J2067J5897J6837J7194J8695J8195J3178O467J136m207j0824
$$ 866306 874141 886208 902105 918942 936136 954831 973026 986204 992671 993807 989600 978776
58442I78776j5824j7148j7528j9102j9117j5439j1161r269p778m648k279k522
$$ 978776 962952 945804 928276 909174 890057 874618 863457 854188 846410 841762 839483 836961
58430H36961k398M94L447M135N235Q858J1762J1222J0273J1917J3342J1209P577
$$ 836961 834563 835057 838504 842639 847874 856732 868494 879716 889989 901906 915248 926457 934034
58417I34034N272K540k354o460p440q448j2173j5230j4192j1984j2455j3575j1978
$$ 934034 939306 941846 939492 933032 925592 917144 904971 889741 875549 863565 851110 837535 825557
58404H25557r433q875q641o452m458m858n146l059j258j809j509J887M514L264
$$ 825557 816124 807249 798608 792156 787698 782840 777694 774635 773377 771568 770059 771946 776460 779724
58390G79724J771L532N179L140Q31K265M449L390J885L783O121M720K288L228
$$ 779724 781495 785027 790206 793346 794177 796442 800891 804281 806166 809949 816070 820790 823078 826306
58376H26306N454N046M018N710P582O261M747O784R292Q209O591Q776J1843J1261
$$ 826306 831760 836806 840824 846534 854116 860377 865124 871908 881200 889409 896000 904776 916619 927880
58362I27880R841J2337J6233J6610J5373J6753J8495J6328J2500J1049R437L877
$$ 927880 937721 950058 966291 982901 998274 1015027 1033522 1049850 1062350 1073399 1082836 1086713
58350A086713j972k807j420l248o097m779j348q58j479J394N506O051N280Q023
$$ 1086713 1084741 1081934 1080514 1077266 1071169 1066390 1065042 1064184 1062705 1064099 1069605 1075656 1080936 1088959
58336A088959J1959J2177J1062J3705J7787J8050J6446J7736J9576J7081J2787
$$ 1088959 1100918 1113095 1124157 1137862 1155649 1173699 1190145 1207881 1227457 1244538 1257325
58325A257325J1721J1343O793J285N74J917m79m019k866M97K42j313J251N130
$$ 1257325 1269046 1280389 1287182 1288467 1289041 1290958 1290479 1286460 1283594 1284091 1284333 1283020 1284271 1289401
58311A289401M757L224O240J0243Q977O204Q814J3135J1703P989J0037J4933J4363
$$ 1289401 1294158 1297382 1303622 1313865 1322842 1329046 1337860 1350995 1362698 1370687 1380724 1395657 1410020
58298A410020J0582J1666J5608J4646J0962J2471J7140J7159J4556J6866K1481
$$ 1410020 1420602 1432268 1447876 1462522 1473484 1485955 1503095 1520254 1534810 1551676 1573157
58287A573157K0462J6755J9100K4935K5161K1797K3707K8818K8282K4292K5762
$$ 1573157 1593619 1610374 1629474 1654409 1679570 1701367 1725074 1753892 1782174 1806466 1832228
58276A832228L0230K8595K3891K6285L3196L3995L0780L4198M2142M3471L9892
$$ 1832228 1862458 1891053 1914944 1941229 1974425 2008420 2039200 2073398 2115540 2159011 2198903
58265B198903M2698N0483N1938M8425N1494N9964O2012N8226N9787O5463O3747
$$ 2198903 2241601 2292084 2344022 2392447 2443941 2503905 2565917 2624143 2683930 2749393 2813140
58254B813140N6242N5239N9714N7903N1808N4188O2997O4677O1159O6771P9888
$$ 2813140 2869382 2924621 2984335 3042238 3094046 3148234 3211231 3275908 3337067 3403838 3483726
58243C483726Q5370Q3878R0211J03521J08836J07342J14656J29575J36042J35671
$$ 3483726 3569096 3652974 3743185 3846706 3955542 4062884 4177540 4307115 4443157 4578828
58233D578828J45580J64229J73486J74607J86688K09271K23447K30337K49670
$$ 4578828 4724408 4888637 5062123 5236730 5423418 5632689 5856136 6086473 6336143
58224F336143K79438K97924L07016L30759L69129L98232M18482M55099N08021
$$ 6336143 6615581 6913505 7220521 7551280 7920409 8318641 8737123 9192222 9700243
58215I700243N51644N87899O46478P28123Q04126Q76963R81164J118470J257224
$$ 9700243 10251887 10839786 11486264 12214387 13018513 13895476 14876640 15995110 17252334
58206A7252334J403014J600461J857827K146196K482080K927730L500721M176358
$$ 17252334 18655348 20255809 22113636 24259832 26741912 29669642 33170363 37346721
58198C7346721M989529O028120P314399Q817871J0605187J2839465J5616674J8965587
$$ 37346721 42336250 48364370 55678769 64496640 75101827 87941292 103557966 122523553
58190A22523553K2979236K7620499L2275653L5844796L7509239L7038867L3954992
$$ 122523553 145502789 173123288 205398941 241243737 278752976 315791843 349746835
58183C49746835K6861564J4597481j628120j7870786k9824179l5586842l6117813
$$ 349746835 376608399 391205880 389577760 371706974 341882795 306295953 270178140
58176B70178140l3542535k9553790k5167531k1138082j8044218j6056237j4877422
$$ 270178140 236635605 207081815 181914284 160776202 142731984 126675747 111798325
58169A11798325j3981542j2928527j1568909j0042088q576752p284555o152244
$$ 111798325 97816783 84888256 73319347 63277259 54700507 47415952 41263708
58162D1263708n167279m353535l698402l142544k657509k262314j954012j690175
$$ 41263708 36096429 31742894 28044492 24901948 22244439 19982125 18028113 16337938
58154A6337938j451440j258188j112655r83061q57856p60425o96180o36410n68443
$$ 16337938 14886498 13628310 12515655 11532594 10674738 9914313 9218133 8581723 8013280
58145H013280n13375m79969m46395m02041l64647l41661l14723k76627k45873
$$ 8013280 7499905 7019936 6573541 6171500 5806853 5465192 5150469 4873842 4627969
58136D627969k30659k14068j88140j68587j62896j56516j43086j36802j42250
$$ 4627969 4397310 4183242 3995102 3826515 3663619 3507103 3364017 3227215 3084965
58127C084965j42463j29477j17964j16294j12067r8484q8072q7716q5610p5155
$$ 3084965 2942502 2813025 2695061 2578767 2466700 2368216 2280144 2192428 2106818 2031663
58117B031663o7490o8580o7383n8126n1582n3229n2394m3882l8690m2409m4191
$$ 2031663 1964173 1895593 1828210 1770084 1718502 1665273 1612879 1568997 1530307 1487898 1443707
58106A443707l7989l4045l8389m0970l5324l0693l3475l5118k9547k4871k6941
$$ 1443707 1405718 1371673 1333284 1292314 1256990 1226297 1192822 1157704 1128157 1103286 1076345
58095A076345k8245k3704k0870k4229k5568k0033j5913j8483j9811j4552j0486
$$ 1076345 1048100 1024396 1003526 979297 953729 933696 917783 899300 879489 864937 854451
58084H54451j3233j5501j1733q983j2899j6722j4526j2080j4577j6444j3201j0968
$$ 854451 841218 825717 813984 805001 792102 775380 760854 748774 734197 717753 704552 693584
58072F93584j4345j7015j3872j0763j2765j4420j0900p618r431j1213q287n576
$$ 693584 679239 662224 648352 637589 624824 610404 599504 591886 582455 571242 562955 557379
58060E57379p403q666n058j955m289p388o408n258p752r486o801m524o594q200
$$ 557379 549976 541310 536252 534297 530008 522620 516212 510954 503202 493716 486915 482391 475797 467597
58046D67597n271k550m255n865l219q14k910n202l466j858m497p190n690l867
$$ 467597 462326 459776 455521 449656 446437 445623 442713 437511 434045 432187 427690 420500 414810 410943
58032D10943n718p303m768k425m758p975p485o341q353j0189q191n895p128q504
$$ 410943 405225 397922 393154 390729 385971 377996 370511 364170 355817 345628 337437 331542 324414 315910
58018C15910o381m200n450o395l401n02k009m404l200j177k070k822P2K897J302
$$ 315910 309529 305329 299879 293484 290083 289581 287572 283168 279968 278791 276721 273899 273971 276868 278170
58003B78170j595j303j60j762l344j391R05l97k316q49J070p31l426k449J95N26
$$ 278170 276575 275272 275112 273350 270006 268615 269520 269123 266807 265958 267028 266297 262871 260422 260617 261143
57987B61143L47K786N057L426O78J059K400Q14j382j50K191J140j683j873k35
$$ 261143 261490 264276 269333 272759 273437 274496 276896 277710 276328 276178 278369 279509 277826 275953 275718
57972B75718j77p98L95J481l37k637j902o3n31j471L56K885K621J372K500M109
$$ 275718 275541 274743 275138 276619 276282 273645 271743 271680 271149 269678 270034 272919 275540 276912 279412 283521
57956B83521K711P1l26n8k304n120m927l312l698m652l076p27q34j602K29K755
$$ 283521 286232 286303 285977 285919 283615 278495 273568 270256 266558 261906 258830 258103 257269 255667 255896 258651
57940B58651K582J711L831P029P324O291P979J1121J1655J0360J0657J1296Q583
$$ 258651 261233 262944 266775 273804 281128 287419 295398 306519 318174 328534 339191 350487 359070
57927C59070L809J227N49j620m699n466m749n949q380q689p439p843r326q779
$$ 359070 362879 364106 364655 363035 358336 352870 348121 342172 333792 325103 317664 309821 300495 291716
57913B91716o734o106o203m215j213m73j241k24K075K616J863K563L897K958P20
$$ 291716 284982 278876 272673 268458 267245 266772 265531 265307 267382 269998 271861 274424 278321 281279 281999
57898B81999M75J695J427M09J635M182M647L534M057N734N380L400K864L325J785
$$ 281999 282474 284169 285596 286005 287640 291822 296469 300003 304060 309794 315174 318574 321438 324763 326548
57883C26548j016j584j93k96k003k350j470k339m724n482m608n025o633o381m215
$$ 326548 325532 323948 323755 323459 321456 319106 317636 315297 310573 305091 300483 295458 288825 282444 278229
57868B78229l129l438k712j159j358k721k039M93J463N13P47K751L917L930N303
$$ 278229 275100 271662 268950 267791 266433 263712 261673 262166 263629 264142 264889 267640 271557 275487 280790
57853B80790Q007Q998P624O440O308N701M871N516O323M251L70j090K78N92j464
$$ 280790 288797 297795 305419 311859 318167 323868 328739 334255 340578 344829 345199 344109 344387 344979 343515
57838C43515l033k916l310m823n121l715l025l637l388k061k030l434l615k278
$$ 343515 340482 337566 334256 329433 324312 320597 317572 313935 310547 308486 306456 303022 299407 297129
57824B97129k167l697l966k215j282k304k871j836j257k081k420j616j715l373
$$ 297129 294962 291265 287299 285084 283802 281498 278627 276791 275534 273453 271033 269417 267702 264329
57810B64329m431l988l873m864n352m895n195o453o647n397m696m993m477k954
$$ 264329 259898 255910 252037 247173 241821 236926 231731 225278 218631 213234 208538 203545 199068 196114
57796A96114k406k966k517r57n71j491j134R82K326K069K231L226K963J486J760
$$ 196114 193708 190742 188225 187268 186697 185206 184072 185054 187380 189449 191680 194906 197869 199355 201115
57781B01115M463O550O512O520P797Q336P080O054O510O831O024N426N417M373
$$ 201115 205578 212128 218640 225160 232957 241293 248373 254427 260937 267768 273792 279218 284635 289008
57767B89008K295J434J908Q92k345m857n128n381o958p730o310m661m310l773
$$ 289008 291303 292737 294645 295537 293192 288335 283207 277826 270868 263138 256828 252167 247857 244084
57753B44084j987n29k40O22K774M125L590K998L246K338n06k728k757k691m135
$$ 244084 242097 241568 241328 241950 244724 248849 252439 255437 258683 261021 260515 257787 255030 252339 248204
57738B48204n084l647j499q70j088q12o31j028o12J175K408J967J622K717L729
$$ 248204 243120 239473 237974 237104 236016 235204 234573 233545 232933 234108 236516 238483 240105 242822 246551
57723B46551L291K683L017K962J583N66J270K289K231K054K532K236M04j019o25
$$ 246551 249842 252525 255542 258504 260087 260653 261923 264212 266443 268497 271029 273265 273669 272650 272025
57708B72025j15j306l177m108m543n208n244m263l687m050l674j925q55j625k349
$$ 272025 271910 270604 267427 263319 258776 253568 248324 244061 240374 236324 232650 230725 229870 228245 225896
57693B25896j633j107k043k801k208k210m166n689m393k000j272j491m03J564
$$ 225896 224263 223156 221113 218312 216104 213894 209728 204039 199646 197646 196374 194883 194480 196044
57679A96044K624L270N230Q297J1282J4653J9392K4724K9688L5434M3219N1513
$$ 196044 198668 201938 207168 215465 226747 241400 260792 285516 315204 350638 393857 445370
57667D45370N7751O1526O3286O1101N1503L3108P901j9830m4352o0271o6048o4882
$$ 445370 503121 564647 627933 689034 740537 773645 781546 761716 717364 657093 591045 526163
57655E26163o0712n4818m7367l9801l3438k7754k2149j7667j4957j2568r317o421
$$ 526163 465451 410633 363266 323465 290027 262273 240124 222457 207500 194932 185615 179194
57643A79194n171m535l215k088k256k633j779m54j4m6L17M69j30l29O12J226K92
$$ 179194 174023 169488 166273 164185 161929 159296 157517 157063 157049 157003 157320 157789 157659 157330 157942 159168 159460
57626A59460q58p16k81j000k012j948j603k282l197l022k409k494k545j609q13
$$ 159460 158602 157886 157605 156605 154593 152645 151042 148760 145563 142541 140132 137638 135093 133484 132671
57611A32671j538k765k756j952j814k175k021j611j626j563r11m75p77q61l45
$$ 132671 131133 128368 125612 123660 121846 119671 117650 116039 114413 112850 111939 111464 110687 109826 109481
57596A09481o18k119k871j797r26j902k999k374j537k394l437k421n73l68j113
$$ 109481 108863 106744 103873 102076 101150 99248 96249 93875 92338 89944 86507 84086 83513 83145 82032
57581H2032o24L62m51k439k940j728r21j097j068q30j337j921j207j18p00k477
$$ 82032 81408 81770 81319 78880 75940 74212 73291 72194 71126 70296 68959 67038 65831 65713 65013 62536
57565F2536l077k131j407j475j242n57m15o74k23P42J105J097J797K856L124K941
$$ 62536 59459 57328 55921 54446 53204 52647 52232 51558 51335 52077 53182 54279 56076 58932 62056 64997
57549F4997L377L902L256J906J119M39j232k908k790j554j339k006j385R34K992
$$ 64997 68374 72276 75532 77438 78557 78996 77764 74856 72066 70512 69173 67167 65782 66716 69708
57534F9708L557L137K095L17j278j320p9J059J871K938L762L504K984L512M375
$$ 69708 73265 76402 78497 78814 77536 76216 76137 77196 79067 82005 85767 89271 92255 95767 100142
57519A00142L942K612K049K215J793R72J024J600J210K3n08m09r11j783j643o81
$$ 100142 104084 106696 108745 110960 112753 113725 114749 116349 117559 117582 117074 116665 115754 113971 112328 111647
57503A11647m24j057j508j839k943m227m243l299k870k886k248j413j622k160
$$ 111647 111223 110166 108658 106819 103876 99649 95406 92107 89237 86351 84103 82690 81068 78908
57489G8908j423k43q09k609k860j050L47J4n92l45j02m81p33n52o86j196j391
$$ 78908 77485 77242 76433 73824 70964 69914 70261 70275 69683 69338 69236 68755 68022 67470 66784 65588 64197
57472F4197j669l083m944n417m553m217m822m833l804l114l278l149k296j727
$$ 64197 62528 59445 54501 49084 44531 40314 35492 30659 26855 23741 20463 17314 15018 13291
57458A3291j771j565r80q01p81O7J224J199L56M78J450J281k50r70O1J178J154
$$ 13291 11520 9955 8975 8174 7393 7460 8684 9883 10239 10717 12167 13448 13198 12228 12289 13467 14621
57441A4621R04J221J330P04J65L12P45J339K331K936K016K75m69j96m12j062n78
$$ 14621 15525 16746 18076 18780 18945 19257 20002 21341 23672 26608 28624 28899 28430 28234 27822 26760 26182
57424B6182Q88J309L17j80M82O38m47j247r53r01j790k190j213j87k80o44k04
$$ 26182 27070 28379 28696 28516 28998 29636 29189 27942 26989 26088 24298 22108 20895 20708 20428 19784 19580
57407A9580O30J182J559J601O94o90j149o43n43j068r14J11N71M9k04J63J8o32
$$ 19580 20210 21392 22951 24552 25246 24556 23407 22764 22221 21153 20239 20350 20921 20970 20766 20929 20947 20315
57389B0315j99J458K405J888J544K265K752K343K428L615M179K970J368P23K05
$$ 20315 20116 21574 23979 25867 27411 29676 32428 34771 37199 40814 44993 47963 49331 50054 50259
57374E0259j117k303k393k197k644l155l101l059l291k858j531o96j109j589j188
$$ 50259 49142 46839 44446 42249 39605 36450 33349 30290 26999 24141 22610 21914 20805 19216 18028
57359A8028p14r30j156q55o76q35l94P74J336R04R24K117L124K897K172J518K64
$$ 18028 17314 16384 15228 14373 13697 12862 12468 13242 14578 15482 16406 18523 21647 24544 26716 28234 28498
57342B8498j405j782m70N08j15r36o44k17o97j175q50p28j415j493j75P00m47
$$ 28498 27093 25311 24841 25349 25234 24298 23654 23437 22740 21565 20715 19987 18572 17079 16904 17604 17157
57325A7157k148k307j519j460j737r54L79N64m44j145p89J56J139J681J130m07
$$ 17157 15009 12702 11183 9723 7986 7032 7411 7975 7531 6386 5597 5753 6892 8573 9703 9296
57309I296j709j980j765j536q19M34J159Q96N82P50O61J89M65J527J506l83k131
$$ 9296 7587 5607 3842 2306 1487 1921 3080 3976 4558 5308 5969 6158 6623 8150 9656 9273 7142
57292G142j849m51K61K72L64K89j79p1J143K151J787R06P83J131J236J382J740
$$ 7142 5293 4842 5103 5375 5739 6028 5849 5778 6921 9072 10859 11765 12548 13679 14915 16297 18037
57275A8037J436K82l56K11O96J60l40J7J53n82p30O37J804J137k7K89J432J580
$$ 18037 19473 19755 19399 19610 20306 20466 20126 20143 20296 19714 18984 19621 21425 22562 22535 22824 24256 25836
57257B5836R04P06Q67N28J37N00R36N49J16O60J407J200P15J152J921J782J132
$$ 25836 26740 27446 28313 28841 28978 29478 30414 30963 31079 31739 33146 34346 35061 36213 38134 39916 41048
57240D1048J138J634J832J990K557K811K174J675K293L107K887K156J876J582
$$ 41048 42186 43820 45652 47642 50199 53010 55184 56859 59152 62259 65146 67302 69178 70760
57226G0760P52M37J503K649K313J193P91R28Q39J261L096N197N851N349M986M692
$$ 70760 71512 71949 73452 76101 78414 79607 80398 81326 82165 83426 86522 91719 97570 102919 107905 112597
57210A12597L762K781K633K744K354K288L368M375L803K472K186K956L623M051
$$ 112597 116359 119140 121773 124517 126871 129159 132527 136902 140705 143177 145363 148319 151942 155993
57196A55993M538M382L262K806M484P031Q226Q081Q074Q397Q260P932Q205Q767
$$ 155993 160531 164913 168175 170981 175465 182496 190722 198803 206877 215274 223534 231466 239671 248438
57182B48438R035R571J0841J1868J1919J2093J3284J4284J3990J3718J4940J6513
$$ 248438 257473 267044 277885 289753 301672 313765 327049 341333 355323 369041 383981 400494
57170D00494J6691J6219J6823J8158J8985J9813K1624K3425K3922K4302K6460
$$ 400494 417185 433404 450227 468385 487370 507183 528807 552232 576154 600456 626916
57159F26916K9689L1954L3227L4819L6548L7390L7850L8945L9991L9918L9687
$$ 626916 656605 688559 721786 756605 793153 830543 868393 907338 947329 987247 1026934
57148A026934M0795M2632M3852M4874M6564M7919M7805M7438M8285M9263M8819
$$ 1026934 1067729 1110361 1154213 1199087 1245651 1293570 1341375 1388813 1437098 1486361 1535180
57137A535180M8198M9510N2110N4069N5656N8339O1785O4992O8878P4644Q1147
$$ 1535180 1583378 1632888 1684998 1739067 1794723 1853062 1914847 1979839 2048717 2123361 2204508
57126B204508Q6875R2751R9788J05926J08637J08842J08856J08567J07233J07017
$$ 2204508 2291383 2384134 2483922 2589848 2698485 2807327 2916183 3024750 3131983 3239000
57116C239000J10663J17329J24486J32194J41891J53050J64934J79668J99828
$$ 3239000 3349663 3466992 3591478 3723672 3865563 4018613 4183547 4363215 4563043
57107D563043K25062K54842K92026L40046L99546M71948N63285O80496Q27788
$$ 4563043 4788105 5042947 5334973 5675019 6074565 6546513 7109798 7790294 8618082
57098H618082J011309J243200J535734J895152K324979K828380L400628M025957
$$ 8618082 9629391 10872591 12408325 14303477 16628456 19456836 22857464 26883421
57090B6883421M689000N380985O085396O765818P375628P862234Q143294Q101857
$$ 26883421 31572421 36953406 43038802 49804620 57180248 65042482 73185776 81287633
57082H1287633P653204O829237N764947M581188L299140J883561L45199j225071
$$ 81287633 88940837 95770074 101535021 106116209 109415349 111298910 111644109 110419038
57074A10419038k707398m008425n074545n886730o458043o821003p003340p016569
$$ 110419038 107711640 103703215 98628670 92741940 86283897 79462894 72459554 65442985
57066F5442985o866634o566661o138722n613287n030542m434390l859596l326311
$$ 65442985 58576351 52009690 45870968 40257681 35227139 30792749 26933153 23606842
57058B3606842k845573k423631k060325j750002j487229j268591j088890r40446
$$ 23606842 20761269 18337638 16277313 14527311 13040082 11771491 10682601 9742155
57050I742155q17516p17851o39224n77565n28406m86838m46653m03417l58579
$$ 9742155 8924639 8206788 7567564 6989999 6461593 5974755 5528102 5124685 4766106
57041D766106l17094k81224k49757k22236j99657j81197j64213j47794j32908
$$ 4766106 4449012 4167788 3918031 3695795 3496138 3314941 3150728 3002934 2870026
57032B870026j19323j05782r2877q2122p2411o1110m8234l5600k2190n087J4472
$$ 2870026 2750703 2644921 2552044 2469922 2397511 2336401 2288167 2252567 2230377 2225290 2239762
57021B239762L1116M2888N3683O4492O5777M3872m264o4811j16256j44533j50067
$$ 2239762 2270878 2313766 2367449 2431941 2497718 2541590 2537326 2472515 2356259 2211726 2061659
57010B061659j42427j30193j16589j02477q9579p9213p0472o1939n4013m7733
$$ 2061659 1919232 1789039 1672450 1569973 1480394 1401181 1330709 1268770 1214757 1167024
57000A167024m2632l7619l2888k9153k6067k3013k0367j8396j6185j3234j0642
$$ 1167024 1124392 1086773 1053885 1024732 998665 975652 955285 936889 920704 907470 896828
56989H96828r071p055l216J409N137Q145J1130J3011J2216Q791L251m940j5308
$$ 896828 887757 880702 877486 878895 884032 892177 903307 916318 928534 937325 940576 935636 920328
56976I20328k4535k9395l0304k9659k8146k5249k1777j8920j5967j1829p632n023
$$ 920328 895793 866398 836094 806435 778289 753040 731263 712343 696376 684547 676915 671892
56964F71892l021M48M989Q746J1927J6087K0614K3301K3990K4275K3530J8466
$$ 671892 668871 669319 674308 683054 694981 711068 731682 754983 778973 803248 826778 845244
56952H45244P406p273k1321l1390l5840l5101l1630k7921k4399k0357j6047j2277
$$ 845244 852650 845377 824056 792666 756826 721725 690095 662174 637775 617418 601371 589094
56940E89094q731m624k84L650P839J3250J9379K5060L0101L4441L6885L6318L2795
$$ 589094 580363 575739 575455 579105 586944 600194 619573 644633 674734 709175 746060 782378 815173
56927H15173K5775J3385m082k1771l4208m0403m2623m1979l8432l3617k9908k7193
$$ 815173 840948 854333 850251 828480 794272 753869 711246 669267 630835 597218 567310 540117
56915E40117k3748j9720j6777j4919j2734j0292q885q333p388o270n994n767l998
$$ 540117 516369 496649 479872 464953 452219 441927 433042 424709 417321 411051 405057 399290 395292
56902C95292j415j34j19M57J778K357K202K913M798O751Q844J2156J6190J9368
$$ 395292 393877 393743 393624 394081 395859 398216 400418 403331 408129 414880 423724 435880 452070 471438
56888D71438K1931K5403K9306L1401L1042K9231K5291J6932M304q824j8681k4159
$$ 471438 493369 518772 548078 579479 610521 639752 665043 681975 686279 677455 658774 634615
56876F34615k5656k3904k0404j6742j2889p918k361K254O001J0523J6507K3341
$$ 634615 608959 585055 564651 547909 535020 527102 524741 526995 532996 543519 560026 583367
56864E83367L0958L9783M9015N7144O3906O9604P2836P0789O1311M3239J6662
$$ 583367 614325 654108 703123 760267 824173 893777 966613 1037402 1098713 1141952 1158614
56853A158614j4440m1590n7633o2712o1734n7426m9456l8921k8822j9990j0613
$$ 1158614 1144174 1102584 1044951 982239 920505 863079 813623 774702 745880 725890 715277
56842G15277l0J0605K1407L3747M7232O0437P4281R0408J06303J16666J19837
$$ 715277 715247 725852 747259 781006 828238 888675 962956 1053364 1159667 1276333 1396170
56831A396170J17561J07486Q1975L7775j6827o7415j03448j21561j23412j13963
$$ 1396170 1513731 1621217 1703192 1740967 1724140 1656725 1553277 1431716 1308304 1194341
56821A194341r9676q4936p0545n6325m3202l1614k0317q345L740J5769K9091M4405
$$ 1194341 1094665 1009729 939184 882859 839657 808043 787726 779381 783121 798890 827981 872386
56809H72386O0052P3584Q3557Q9006Q8480P9988O0898K9213j2321n3975q4420
$$ 872386 932438 1006022 1089579 1178585 1267065 1347053 1407951 1437164 1424843 1370868 1286448
56798A286448r9146j01475r6225q6122p3887o2760n3304m3326l2391k2941j5796
$$ 1286448 1187302 1085827 989602 903480 829593 766833 713529 670203 637812 614871 599075
56787E99075q381R09J0270J8230K6258L5284M2905M6546M6464M3096L4140J7400
$$ 599075 590694 591603 601873 620103 646361 681645 724550 771096 817560 860656 894796 912196
56775I12196n009k7656m5719n6570n9697n7149n2615m8257m3510l7753l2181k7874
$$ 912196 907187 879531 833812 777242 717545 660396 607781 559524 516014 478261 446080 418206
56763D18206k4187k0369j6940j4299j1896r732q730q698q096o661n928o277n983
$$ 418206 394019 373650 356710 342411 330515 320783 312053 303355 295259 288598 282670 276393 270410
56750B70410m274k737k450k332j586j201j740k095j783j965k885k925j584p23
$$ 270410 266136 263399 260949 258617 257031 255830 254090 251995 250212 248247 245362 242437 240853 240130
56736B40130j341j821r37K9j81p04n69l80m08M54K209K863J603K79J84J48n21
$$ 240130 238789 236968 236031 236060 235879 235175 234606 234226 233818 234272 236481 239344 240947 241226 241410 241558 241037
56719B41037k62J568K717J563j28k94J57l09q27k8J197J441J315J833K174J342
$$ 241037 240775 242343 245060 246623 246495 246201 246358 246049 245222 245194 246391 247832 249147 250980 253154 254496
56703B54496K92J81K96k73p46l96k89j185j760p97O95J424J839K450K281R80J83
$$ 254496 254788 254969 255265 254992 254246 253850 253561 252376 250616 249819 250514 251938 253777 256227 258508 259488 259671
56686B59671Q45J411O41j28M09J076O24J74Q72J460O88j66L04Q69p1j567k057
$$ 259671 260516 261927 262568 262440 262849 263925 264549 264723 265595 267055 267743 267577 267881 268750 268679 267112 265055
56669B65055k104k676k695j117N62N71j91q3K43o09j994k609k872l421l073q81
$$ 265055 262951 260275 257580 256463 257025 257596 257405 257322 257565 256956 254962 252353 249481 246060 242987 242106
56653B42106J610K683L108M101M737M079L613M643N480M288K594K635L240J941
$$ 242106 243716 246399 249507 253608 258345 262424 266037 270680 276160 280448 283042 285677 288917 290858
56639B90858n46j653j320j411j937j412j47J95l94p24r71j936k664j856o32r36
$$ 290858 290312 288659 287339 285928 283991 282579 282432 282627 282233 281509 280538 278602 275938 274082 273450 272514
56623B72514k108k011p46k38q60j378j558k089k556k129j537j844k167j159K40
$$ 272514 270406 268395 267649 267411 266551 265173 263615 261526 258970 256841 255304 253460 251293 250134 250374
56608B50374K79m24K7J356J673P65M2j75p02j286r50lN20P94J448J773Q54m22
$$ 250374 250653 250229 250256 251612 253285 254050 254092 253917 253215 251929 250979 250976 251496 252290 253738 255511 256365 255943
56590B55943o50j38J20M95J514K074J248L54Q33J560R10j00M44J914K414K078
$$ 255943 255293 255155 255275 255770 257284 259358 260606 260960 261793 263353 264263 264163 264607 266521 268935 271013
56574B71013K193K359J553P22J336K559K889L227N118P370P868P596R236J2633
$$ 271013 273206 275565 277118 277840 279176 281735 284624 287851 292969 300339 308207 315803 325039 337672
56560C37672J5225J6305J7324J8377J7751J4863J0756N990P65l432n040m866m802
$$ 337672 352897 369202 386526 404903 422654 437517 448273 454263 455028 451596 446556 441690 436888
56547D36888m906m228l438l875m926n135m895n346n786m997l882l924m295l493
$$ 436888 431982 427754 424316 420441 415515 410380 405485 400139 394353 389356 385474 381550 377255 373762
56533C73762k465k935m065m033l509m104m826l748j881j596k416k177j247j601
$$ 373762 371297 368362 364297 360264 356755 352651 347825 344077 342196 340600 338184 336007 334760 333159
56519C33159k730k563j583k010l527l868l024k975l793l861l387l806m395l316
$$ 333159 330429 327866 326283 324273 320746 316878 313854 310879 307086 303225 299838 296032 291637 288321
56505B88321j463j280k460k694k056k499l663l395j927j415j796j262k71q13k193
$$ 288321 286858 285578 283118 280424 278368 275869 272206 268811 266884 265469 263673 262411 262140 261327 259134
56490B59134j895k02M02j4P05K086J536o71j596p59l07l13J141L228K863L16p82
$$ 259134 257239 257037 257439 257425 258130 260216 261752 261081 259485 258726 258419 258106 259247 262475 265338 265654 264872
56473B64872N12J305L95j05N67M80o47n38J116J820R65P77J629J096j158k236
$$ 264872 265384 266689 267084 266979 267546 268026 267379 266841 267957 269777 270742 271519 273148 274244 273086 270850
56457B70850j109k41q27q77N05J289O00L42J260J440K86r4J125J970J585J666
$$ 270850 269741 269500 268673 267796 268301 269590 270190 270532 271792 273232 273518 273424 274549 276519 278104 279770
56441B79770K716K762J166j48m30j175k431k213o58m74k062k520q40K97o11j541
$$ 279770 282486 285248 286414 286266 285836 284661 282230 280017 279359 278885 276823 274303 273463 273760 273149 271608
56425B71608j081o54r94m78J319K366J969J937K693K376R20P22K011K032K14n78
$$ 271608 270527 269873 268879 268401 269720 272086 274055 275992 278685 281061 281981 282703 284714 286746 286960 286382
56409B86382N76R51m92j078K93Q04r54k182r79L55j35o14O05J794J323O47J100
$$ 286382 286958 287909 287417 286339 286632 287436 286482 284300 283321 283676 283541 282927 283532 285326 286649 287296 288396
56392B88396J406P82Q58K167K437O48r09o76k42o74m24J119K007J620K142M219
$$ 288396 289802 290584 291442 293609 296046 296694 295785 295109 294867 294193 293769 294888 296895 298515 300657 304876
56376C04876N412M821M759N815N104J796n22K62J335K65r96m23L08l59o65O14
$$ 304876 310288 315109 319868 325683 330787 332583 332061 332323 333658 333923 332927 332504 332812 332453 331788 332402
56360C32402J277k4q16P28K335J849Q69J096J124o1m53R66J677J82j047k70K46
$$ 332402 333679 333655 332839 333567 335902 337751 338620 339716 340840 340779 340326 341292 342969 343151 342104 341834 342080
56343C42080j090j730K28K189J733Q72J901L077K449J943L556N252M726L624M162
$$ 342080 340990 339260 339488 341677 343410 344282 346183 349260 351709 353652 357208 362460 367186 370810 374972
56328C74972N028M467L948M990N776M541K941K630K063O4j317q29r01l003m347
$$ 374972 380000 384467 388415 393405 399181 403722 406663 409293 411356 411420 410103 409274 408373 405370 401023
56313D01023k806r23j133j400M23K162J570Q28K370M234M019L543N099O920O841
$$ 401023 398217 397294 396161 394761 395184 397346 398916 399744 402114 406348 410367 413910 419009 425929 432770
56298D32770O553P793Q219N801L258L508M530L554K419L721N427M675L369M719
$$ 432770 439323 447116 455335 461136 464394 467902 472432 475986 478405 482126 487553 492228 495597 500316
56284E00316P364Q093P512Q014R063R132R427J1239J2613J1958J1547J3259J4634
$$ 500316 507680 515773 523285 531299 540362 549494 558921 570160 582773 594731 606278 619537 634171
56271F34171J3566J2870J5423J8787J9684J9863K2280K5356K6436K7280L0677
$$ 634171 647737 660607 676030 694817 714501 734364 756644 782000 808436 835716 866393
56260H66393L5203L8550M2501M9274N6701O2402O8855P8865R0016R9240J08810
$$ 866393 901596 940146 982647 1031921 1088622 1151024 1219879 1298744 1388760 1488000 1596810
56249A596810J21799J35589J46263J55551J66896J78166J84888J87444J88543
$$ 1596810 1718609 1854198 2000461 2156012 2322908 2501074 2685962 2873406 3061949
56240C061949J86790J79172J66799J51857J32154J05134P4096M3956J4144j7812
$$ 3061949 3248739 3427911 3594710 3746567 3878721 3983855 4057951 4101907 4116051 4098239
56230D098239m9216p5621r7977j19381j37861j49578j56163j61648j64995j62871
$$ 4098239 4049023 3973402 3875425 3756044 3618183 3468605 3312442 3150794 2985799 2822928
56220B822928j57127j52172j47463j39773j30412j23000j16537j07828r8380r1808
$$ 2822928 2665801 2513629 2366166 2226393 2095981 1972981 1856444 1748616 1650236 1558428
56210A558428q6879q0095p2566o7403o3088n6587n0039m7032m5178m0052l3541
$$ 1558428 1471549 1391454 1318888 1251485 1188397 1131810 1081771 1034739 989561 949509 915968
56199I15968l0395k9439k6258k1830k0127j9815j6801j2679j2061j3684j2702
$$ 915968 885573 856134 829876 808046 787919 768104 751303 738624 726563 712879 700177
56188G00177r808r452j0902r715o422n212n671m180j744k058l564k022R05L22
$$ 700177 690369 680917 670015 660300 653878 648666 642995 638815 637071 635013 631449 629427 630332 630654
56174F30654k497k212P97J706O40J728M289M112K101K698N007M529K318L276O694
$$ 630654 628157 625945 626742 628448 629088 630816 635105 639217 641318 644016 649023 653552 655870 659146 665840
56159F65840P679O578P737J0319R890P766R198J3502J5587J5882J8986K3920K5876
$$ 665840 673519 680097 687834 698153 708043 715809 725007 738509 754096 769978 788964 812884 838760
56146H38760K6341L1062L9136M4723M8517N6586O8636P8456Q5530R5020J06279
$$ 838760 865101 896163 935299 980022 1028539 1085125 1153761 1232217 1317747 1412767 1519046
56135A519046J12608J12636J11037J07718R7472Q1082O6076N5561M6461L8926
$$ 1519046 1631654 1744290 1855327 1963045 2060517 2141599 2207675 2263236 2309697 2348623
56125B348623L6725L7782L4879K6473J7006P015o541k0715k8731l1649l6943m5924
$$ 2348623 2385348 2423130 2458009 2484482 2501488 2508503 2501962 2481247 2452516 2420867 2383924 2338000
56113B338000n3914o1964p5898r3661j06088j10694j12705j12502j04915r1334
$$ 2338000 2284086 2222122 2146224 2052563 1946475 1835781 1723076 1610574 1505659 1414325
56103A414325p9541p0714n9214m5659l7053l3341k7372j8925j5131j6050j3878
$$ 1414325 1334784 1264070 1204856 1159197 1122144 1088803 1061431 1042506 1027375 1011325 997447
56092I97447p733n000o584n288l88P81k360j943L093M962K382K960P867R348O199
$$ 997447 989714 984714 978130 972842 972454 973235 970875 968932 972025 976987 979369 982329 990196 999544 1005743
56077A005743O343J1160J2647R244Q860J2957J3461Q967Q041J2782J5095J2870
$$ 1005743 1012086 1023246 1035893 1045137 1053997 1066954 1080415 1089382 1097423 1110205 1125300 1138170
56065A138170J3594J8250J8353J2963J1660J6470J7980J3656J2381J6240J5962
$$ 1138170 1151764 1170014 1188367 1201330 1212990 1229460 1247440 1261096 1273477 1289717 1305679
56054A305679R543P100J1590J3078Q123O334J1431J4367J1697J2222J8756K1944
$$ 1305679 1315222 1322322 1333912 1346990 1355113 1361447 1372878 1387245 1398942 1411164 1429920 1451864
56042A451864J8862J8856K4424K5656K0324J9493K6267K9391K5159K4711L1968
$$ 1451864 1470726 1489582 1514006 1539662 1559986 1579479 1605746 1635137 1660296 1685007 1716975
56031A716975L5749L1947L1668L8880M2081L7036L5301M1183M3146L7405L6392
$$ 1716975 1752724 1784671 1816339 1855219 1897300 1934336 1969637 2010820 2053966 2091371 2127763
56020B127763M4160M7675M2590M2591N2529N8093N3502N3044O3042O9387O5611
$$ 2127763 2171923 2219598 2262188 2304779 2357308 2415401 2468903 2521947 2584989 2654376 2719987
56009B719987O5763P6010Q1656P6463P6086Q7641R5377R1797R2793J05882J14650
$$ 2719987 2785750 2861760 2943416 3019879 3095965 3183606 3278983 3370780 3463573 3569455 3684105
55998C684105J11467J13676J29594J41478J40551J44941J63607J77752J78229
$$ 3684105 3795572 3909248 4038842 4180320 4320871 4465812 4629419 4807171 4985400
55989D985400J84978K08136K27621K33448K46778K77604L02920L11753L28746
$$ 4985400 5170378 5378514 5606135 5839583 6086361 6363965 6666885 6978638 7307384
55980G307384L66778M01436M20438M50550N05486N57430N92611O42236P23813
$$ 7307384 7674162 8075598 8496036 8946586 9452072 10009502 10602113 11244349 11968162
55971A1968162Q07694Q78978R73041J109813J256601J399592J584326J839104
$$ 11968162 12775856 13654834 14627875 15737688 16994289 18393881 19978207 21817311
55963B1817311K133123K461653K891424L466185M158264M975262O011610P325107
$$ 21817311 23950434 26412087 29303511 32769696 36927960 41903222 47914832 55239939
55955E5239939Q883370J0718043J2999454J5868055J9351536K3518556K8402419
$$ 55239939 64123309 74841352 87840806 103708861 123060397 146578953 174981372
55948A74981372L3517355L7741065M0054751M0117184L7550361L0945700J8696239
$$ 174981372 208498727 246239792 286294543 326411727 363962088 394907788 413604027
55941D13604027J417547j7030566l1710479l9868097m1975873m0154923l6325420
$$ 413604027 415021574 397991008 366280529 326412432 284436559 244281636 207956216
55934B07956216l1706835k7092927k2929232j9281531j6066872j3296986j1012032
$$ 207956216 176249381 149156454 126227222 106945691 90878819 77581833 66569801
55927F6569801r138733p568590o280559n273577m468138l777116l198582k751798
$$ 66569801 57431068 49862478 43581919 38308342 33840204 30063088 26864506 24112708
55919B4112708k391351k062890j778941j565846j392991j221054j066823r57602
$$ 24112708 21721357 19658467 17879526 16313680 14920689 13699635 12632812 11675210
55911A1675210q70071p72367o81269o22765n77741n18423m59752m25663m00743
$$ 11675210 10805139 10032772 9351503 8728738 8150997 7632574 7172822 6747159 6346416
55902F346416l61587l22037l03126k90181k61805k31407k19635k14074j94720
$$ 6346416 5984829 5662792 5359666 5069485 4807680 4576273 4356638 4142564 3947844
55893C947844j72497j65474j62555j46402j28083j24579j25026j12433r6805r4593
$$ 3947844 3775347 3609873 3447318 3300916 3172833 3048254 2923228 2810795 2713990 2619397
55883B619397r6345q5897p1605o8476o8566n8229m6178m6072m9402m3180l6957
$$ 2619397 2523052 2437155 2365550 2297074 2228508 2170279 2124101 2078029 2028627 1985447 1948490
55872A948490m4784n7261n8361n4105n8142o4242n9373m9839m8722n0643m3691
$$ 1948490 1903706 1846445 1788084 1733979 1675837 1611595 1552222 1502383 1453661 1403018 1359327
55861A359327l3856l3437l7117l2865k5231k5320k8719k5243j9782k2100k6506
$$ 1359327 1325471 1292034 1254917 1222052 1196821 1171501 1142782 1117539 1097757 1075657 1049151
55850A049151k2675j6315j8478k4370k3078j8590k0964k5998k3656j7885j8567
$$ 1049151 1026476 1010161 991683 967313 944235 925645 904681 878683 855027 837142 818575
55839H18575k2083j8937j2704j2786j6067j3771r123j0413j3919j1164n887o820
$$ 818575 796492 777555 764851 752065 735998 722227 713104 702691 688772 677608 671721 664901
55827F64901j0623q831m592n956r512p326l266n859j1461j0914o703p269j0383
$$ 664901 654278 645447 640855 634899 625387 618061 614795 608936 597475 586561 579858 572589 562206
55814E62206q316l717m311p253m562J091J564r07J619P086P697N261P385J2485
$$ 562206 553890 550173 545862 538609 534047 535138 536702 535795 537414 544500 552197 557458 564843 577328
55800E77328J3293J1161J2590J5540J3260P840O041N750L39p541j0370r983j3498
$$ 577328 590621 601782 614372 629912 643172 651012 657053 662803 663142 655601 645231 635248 621750
55787F21750j8883j8624j4270j3379j5057j2443o826n648q728r603q325r994j2904
$$ 621750 602867 584243 569973 556594 541537 529094 522268 516620 507892 498289 489964 479970 467066
55774D67066j0928n634l565l662K36O718R042P800Q823J0484N880l762j0297j2053
$$ 467066 456138 450504 446939 443277 443513 450231 459273 467073 475896 486380 492260 488498 478201 466148
55760D66148j4207j7108j6192j2605j2181j4541j4210j1588j1881j4194j2769
$$ 466148 451941 434833 418641 406036 393855 379314 365104 353516 341635 327441 314672
55749C14672q151o200p000n495k097j844l980l097K01L95k085j737J199J363j118
$$ 314672 306521 300321 293321 287826 285729 283885 279905 276808 277009 277404 275319 273582 274781 276144 275026
55734B75026j154R69L55k226j508J539R00l032l971j475j355m353n171l078k937
$$ 275026 273872 274841 275196 272970 271462 273001 273901 270869 266898 265423 264068 259715 254544 251466 248529
55719B48529n091m559j041L64q54J01L403L948J489J502M864O371M703M267N865
$$ 248529 243438 238879 237838 238202 237348 237449 240852 244800 246289 247791 252655 259026 263729 267996 273861
55704B73861N076J377m24N48m14m391o829o256o381p991p360m253l101m592m369
$$ 273861 278937 280314 279890 280438 280024 275633 268804 262548 256167 248176 240816 236563 233462 228870 224501
55689B24501j474J39l03Q61L621L525M43l63K434M204L306L639O316P206M918
$$ 224501 223027 223166 222863 223724 227345 230870 231313 230950 233384 237588 240894 244533 250849 258055 262973
55674B62973L272L630K523r30k860k042k039l892m092j745n11j502j473K90N67
$$ 262973 266245 269875 272398 271468 268608 266566 264527 260635 256543 254798 254287 252785 251312 251602 252169
55659B52169p10L70L862N042L105K902N913P521N627M124N079N107K456L09M3
$$ 252169 251459 251829 255691 260733 263838 266740 272653 280174 285801 289925 295004 300111 302567 302876 302919
55644C02919j576n526p837o867o427q660j0421r651q842r243q224n259l997n514
$$ 302919 301343 295817 287980 281113 274686 266026 255605 245954 237112 227869 219645 214386 210389 204875
55630B04875n916l568k052l101l252p23R51m20j720p01k2j568k653j398l26j234
$$ 204875 198959 195391 193339 190238 186986 186263 187214 186794 185074 184373 184351 182783 180130 178732 178406 177172
55614A77172j909j148j467l724m645k864j778l219l930j788Q8r40k491j978r77
$$ 177172 175263 174115 172648 168924 164279 161415 159637 156418 152488 150700 150788 149848 147357 145379 144402
55599A44402j296j449m16k19j657k058k11J161N38L11J680K057L12n97Q54J821
$$ 144402 143106 141657 141241 141022 139365 137307 137096 138257 138795 139106 140786 142843 143155 142558 143412 145233
55583A45233O33k4J472K391J075L47K091L554K610J648K653L424K284J719L574
$$ 145233 145866 145842 147314 149705 150780 151127 153218 156772 159382 161030 163683 167107 169391 171110 174684
55568A74684N407N226N149O610O829L952J066R81J473k69k727l600m145n883o948
$$ 174684 180091 185317 190466 197076 203905 207857 208923 209904 211377 211108 208381 204781 200636 194753 187805
55553A87805n721m300m605m833l401k423l498m111k136J0k58j052J25J600Q86
$$ 187805 182084 177784 173179 168346 164945 162522 159024 154913 152777 152787 152529 151477 151602 153202 154088
55538A54088n81l43N94K75k22P37J681P17q24r97q23j874l009k805k550l578m454
$$ 154088 153507 153164 153758 154033 153811 154548 156229 156946 156122 155125 154302 152428 149419 146614 144064 140486 136032
55521A36032l836l260m107m806l913k881k941k537p09M98K8M59L400N908N085
$$ 136032 132196 128936 124829 120023 116110 113229 110288 107751 107042 107540 107568 108027 111427 117335 122420
55506A22420K743J836J699O09k95M35J110j00j583j363p67j460j849k17J547J153
$$ 122420 125163 126999 128698 129307 129012 129447 130557 130457 128874 127511 126744 125284 123435 123218 124765 125918
55490A25918P3N86J483O29q56p63K31M99Q35K257K980J285r32j166m27p48j083
$$ 125918 125991 126577 128060 128689 127833 127070 127301 127800 128635 130892 133872 135157 134225 133059 132632 131884 130801
55473A30801M38K422K309O98o9J66J12j67k55j171l155l963k273m73r66k246j805
$$ 130801 131239 133661 135970 136668 136599 136765 136877 136710 136455 135284 132129 128166 125893 125420 124454 122208 120403
55456A20403m13r0l09L25R74M40k8R30J933J425O90J233J733P57k17K58M91j066
$$ 120403 119990 119900 119591 119916 120890 121330 121302 122232 124165 125590 126280 127513 129246 130003 129786 130044 130535 129469
55438A29469k340j098Q77Q51k84l07J10n99j185M7J564J176j0o5n3j410k265o15
$$ 129469 127129 126031 126908 127759 127475 127168 127278 126679 125494 125541 127105 128281 128271 128206 128153 126743 124478 123863
55420A23863J306M63j636j589P7N07o6N95J949J806Q55J308K321J311j124k149
$$ 123863 125169 125632 123996 122407 122484 122991 122925 123520 125469 127275 128130 129438 131759 133070 131946 129797
55404A29797j531j314j601q92K97K34m07L26J820J920Q71N54Q57M38n4O98J442
$$ 129797 128266 126952 125351 124459 124756 124990 124583 124909 126729 128649 129520 130074 130931 131369 131315 132013 133455
55387A33455K20j747j884p29o08j190m71R46P56p34j249o45n23o57K68J357Q09
$$ 133455 133675 131928 130044 129315 128707 127517 127046 127992 128748 128014 126765 126120 125597 124940 125208 126565 127374
55370A27374m40k64M88n90k859l580k568j871j657n62O93K39j069q55M36M71m11
$$ 127374 126934 126670 127158 126568 123709 120129 117561 115690 114033 113471 114164 114403 113334 112479 112915 113386 112975
55353A12975R6J664J794M67jO44N09l24N0J348J348J37J5J212J706J111Q76Q16
$$ 112975 113071 114735 116529 116996 116995 117639 118148 117824 117874 119222 120570 120707 120722 121934 123640 124751 125627 126443
55335A26443m36j800q96J329J476o51j808r16m47j579k403j812j161r87O1J928
$$ 126443 126007 124207 123311 124640 126116 125465 123657 122741 122294 120715 118312 116500 115339 114352 114413 116341
55319A16341K435R82l13j28M07L57L20M73J35k80K70J018L03j078p61J017J595
$$ 116341 118776 119758 119445 119317 119724 120081 120401 120874 121009 120729 120999 122017 122320 121242 120481 121498 123093
55302A23093M14k87M48J063Q26Q88J390Q59p70j674j272q45p36N1J201J200K95
$$ 123093 123507 123220 123668 124731 125557 126445 127835 128694 127924 126250 124978 124133 123397 123448 124649 125849 126144
55285A26144J89P38K26j008q35O59J128K11l4P08L51j388k116r97j12m55l54R07
$$ 126144 126333 127071 127297 126289 125454 126113 127241 127452 127418 128126 128477 127089 124973 123976 123864 123409 123055 123962
55267A23962J486M89k56N04J443J348J032J187R84K5p15q54j090j178n2J530J391
$$ 123962 125448 125937 125681 126185 127628 128976 130008 131195 132179 132204 131489 130635 129545 128367 128315 129845 131236
55250A31236m47j516q91l64r34j290p13l71p58o82J55L82l33n72R3L62j01l7P52
$$ 131236 130789 129273 128382 128018 127084 125794 125081 124710 123952 123270 123425 123807 123474 122902 122995 123357 123256 123219 123971
55231A23971R50M47N92J211O21r59j265P3Q63K79k5M61M9j495j901l79Q51L98
$$ 123971 124921 125368 125960 127171 127792 126833 125568 125641 126504 126783 126758 127219 127268 125773 123872 123493 124344 124742
55213A24742j76L81R16N37K71N30nj524k123j137m45j006j185l4Q23K42m83k80
$$ 124742 124566 124947 125863 126400 126671 127201 127196 125672 123549 122412 121967 120961 119776 119742 120565 120807 120324 120044
55195A20044r2m76k98O94Q95o8k89Q94J449L48m61L92J228M65o90p43l94m64j3
$$ 120044 119952 119476 119178 119872 120767 120699 120410 121304 122753 123101 122640 123032 124260 124725 124035 123292 122898 122434 122421
55176A22421J423K179J119l57p52o25o99l00O97R47K03K34J625K459J692R44J192
$$ 122421 123844 126023 127142 126785 126033 125408 124709 124409 125106 126053 126256 126490 128115 130574 132266 133210 134402
55159A34402Q37r74k158j140L92N12J42P00J312Q34J71K60O2j096j587k76J085
$$ 134402 135239 134265 132107 130967 131359 131871 132013 132713 134025 134859 135030 135290 135352 134256 132669 132393 133478
55142A33478O55n83r71r77j439j364M6J352J241Q21J232J222l58j856j349J16
$$ 133478 134133 133550 132579 131602 130163 128799 128845 130197 131438 132259 133491 134713 134355 132499 131150 131266
55126A31266M23k95p44j025j583j431J60J707J713J043J038J075L25r0Q43J741
$$ 131266 131689 131394 130650 129625 128042 126611 126771 128478 130191 131234 132272 133347 133672 133582 134425 136166
55110A36166J125J42N03J457J409P77P35P31r4p14J9J009Q89N52J205J672M68
$$ 136166 137291 137433 137936 139393 140802 141579 142314 143045 142951 142237 142256 143265 144154 144706 145911 147583 148051
55093A48051j141j095l9R5m05J5R67R31K24J85L90m02j367p39Q95J293J70o12
$$ 148051 146910 145815 145776 145871 145466 145481 146448 147379 147603 147788 148178 147776 146409 145670 146565 147858 148028 147416
55075A47416j44O62J051J081O11m03j023n61L3l27q72l81N16M70j72k41K3k18
$$ 147416 147272 147934 148985 150066 150677 150274 149251 148690 148723 148396 147524 147143 147659 148129 147957 147716 147739 147521
55057A47521l58N64J630J199l66j355j426j521j763j558j251j638k281k094j072
$$ 147521 147163 147727 149357 150556 150190 148835 147409 145888 144125 142567 141316 139678 137397 135303 134231
55042A34231M6J048J712J118p71k030j136P05J437J084Q78P84J36m69j36M29J29
$$ 134231 134277 135325 137037 138155 137384 135354 134218 134923 136360 137444 138322 139106 139242 138773 138637 139066 139195
55025A39195m84m06k35q47j295m22P20M95l07K04J643K062J231O39P33P09N75
$$ 139195 138711 138305 138070 137223 135928 135506 136226 136721 136414 136618 138261 140323 141554 142193 142926 143635 144210
55008A44210R88J438Q63l23q82r00j234j509p64N09J085J041J126R51n8q54k10
$$ 144210 145198 146636 147499 147176 146294 145394 144160 142651 141887 142396 143481 144522 145648 146599 146541 145687 145477
54991A45477R88J130O01P00R22l7j453j579p02m20n66K69J628J633K91n27k57
$$ 145477 146465 147595 148196 148896 149818 149781 148328 146749 146047 145627 145061 145330 146958 148591 148882 148355 148098
54974A48098j02l93j83M50L30m74n69L11J000J063J101J013J59q93r14j52J51
$$ 148098 147996 147603 147420 147870 148200 147726 147157 147468 148468 149531 150632 151645 151804 150911 149997 149845 149996
54957A49996M9M33P90r0j494j475k2R92R35Q83J048L92r87j653j299j033j044
$$ 149996 150045 150478 151268 151178 149684 148209 148187 149179 150114 150997 152045 152437 151450 149797 148498 147465 146421
54940A46421l39R67J525J162J104J562J413N87M01J173J701J542J570K013K102
$$ 146421 146082 147049 148574 149736 150840 152402 153815 154402 154803 155976 157677 159219 160789 162802 164904
54925A64904J993K817M394N170M842M859N858O754O899O949P032O117L902J519
$$ 164904 166897 169714 174108 179278 184120 188979 194837 201591 208490 215439 222471 228588 232490 234009
54911B34009l36k168m155n538o103o517o848o382n251m549m493m157l278k651
$$ 234009 233673 231505 227350 221812 215709 209192 202344 195962 190711 186162 181669 177512 174234 171583
54897A71583k546k358j990j886j695o04R58J738J609J288N11j305k840j896J204
$$ 171583 169037 166679 164689 162803 161108 160504 161462 163200 164809 166097 166608 165303 162463 160567 161771
54882A61771L702M207L983M150M205M016M751O726Q461Q771Q029O614M040N06
$$ 161771 165473 169680 173663 177813 182018 186034 190785 197511 205972 214743 222772 229386 233426 233932
54868B33932k464l895m452n036n705o313o768o414m751k870k476l369l767l116
$$ 233932 231468 227573 223121 218085 212380 206067 199299 192885 188134 185264 182788 179419 175652 172536
54854A72536k591k679k542k025k098k767k772j815j081j056r03m93q41j908k184
$$ 172536 169945 167266 164724 162699 160601 157834 155062 153247 152166 151110 150207 149714 148873 146965 144781
54839A44781j132pL66N78Q94O37K0L37J617K210J493Q06R31Q68M1m54M7N13R0
$$ 144781 143649 143642 144008 144586 145480 146117 146137 146474 148091 150301 151794 152600 153531 154399 154440 153986 154033 154546 154636
54820A54636o06j067j800k744k699j423l95m63n67J82J036J255J433J971K083
$$ 154636 154030 152963 151163 148419 145720 144297 143902 143439 142872 143054 144090 145345 146778 148749 150832
54805A50832J358O86O07M14j45j32O37P99k76j198p90J29M05L13M52M34j1j13
$$ 150832 152190 152876 153483 153897 153752 153620 154257 155056 154780 153582 152792 152921 153326 153639 154091 154525 154514 154401
54787A54401N56J144J025R04J379J787J447P55J90l73p03q0J224J854J433J082
$$ 154401 154957 156101 157126 158030 159409 161196 162643 163398 163588 163215 162512 162432 163656 165510 166943 168025
54771A68025J394J790K365M164O797Q124P437O658P237Q038P673O651N658L859
$$ 168025 169419 171209 173574 177738 184535 192659 200096 206754 213991 222029 229702 236353 242011 245870
54757B45870P53k225l774m679o022p193p345p127p227o791n157l525l085k988
$$ 245870 246623 244398 240624 235945 229923 222730 215385 208258 201031 194240 189083 185558 182473 179485
54743A79485k046r45q38j172q70m23p72j275q07J36L72J51M91J191J397J367J939
$$ 179485 177439 176494 175656 174484 173614 173191 172419 171144 170337 170473 170845 170996 171487 172678 174075 175442 177381
54726A77381K889L382L570M210N248O077O596O865O467N298M096L131J388j739
$$ 177381 180270 183652 187222 191432 196680 202757 209353 216218 222685 227983 232079 235210 236598 234859
54712B34859m973o709p009o852o450n673n057m995m790l824k766k422k381k020
$$ 234859 229886 223177 216168 209316 202866 197193 192136 187141 182351 178527 175761 173339 170958 168938
54698A68938j781k171k538k198j649j456j022J62J187J085M40K64L50J29qK97
$$ 168938 167157 164986 162448 160250 158601 157145 156123 156285 157472 158557 158997 159261 159611 159740 159732 160029
54682A60029K46p25j574j273o09p09r60k26R24J116M83J04l8o39j272r32R6O20
$$ 160029 160275 159550 157976 156703 156094 155385 154425 154199 155123 156239 156722 156826 156788 156149 154877 153945 154041 154661
54664A54661M37K14j9p23j568j783j411r17j15J156J966J402J54m02j50N7O9L32
$$ 154661 155098 155312 155293 154570 153002 151219 149808 148891 148776 149932 151898 153300 153454 153052 152902 152959 153028 153360
54646A53360O82O30M31N49O11R6m45j57P54J482J842J891J243j02j056q64l52
$$ 153360 154042 154672 155103 155652 156263 156359 155914 155757 156511 157993 159835 161726 162969 162867 161811 160947 160595
54629A60595n28j002j058j164j846k242j431k20J67J60P91J571J420P93Q16J082
$$ 160595 160067 159065 158007 156843 154997 152755 151324 151104 151271 151431 152222 153793 155213 156006 156822 157904
54613A57904M93m29l11M68K80r24j553j085o00n61j40Q87J520J234P76P95J019
$$ 157904 158397 157968 157657 158125 158405 157481 155928 154843 154243 153682 153542 154429 155949 157183 157959 158754 159773
54596A59773J066R51N99r9p53q99p44n71j0J031J458M32r57j022M8P00M60J12
$$ 159773 160839 161790 162389 162290 161537 160638 159894 159323 159313 160344 161802 162234 161277 160255 160303 161003 161463 161575
54578A61575r1n74r99n39M36P32L22K56O67N48l16r57r15q45j073j031m31K12
$$ 161575 161484 160910 159911 159372 159808 160540 160862 161118 161785 162333 162017 161060 160145 159300 158227 157196 156765 156977
54560A56977N15O61P35N88L54K07j74r14j188k06J349K128J886J383R54N09L68
$$ 156977 157492 158153 158888 159476 159830 160037 159863 158949 157761 157555 158904 161032 162918 164301 165255 165764 166132
54543A66132P78J096Q11O92J453K076J321J13K96J525J687L53o56k77M13K97k92
$$ 166132 166910 168006 168817 169509 170962 173038 174359 174472 174768 176293 177980 178333 177677 177400 177813 178110 177818
54526A77818p73j285j801j805j359j183j304r47l9N07L00n9k11m45o75l49L90
$$ 177818 177045 175760 173959 172154 170795 169612 168308 167361 167322 167829 168129 168070 167859 167414 166739 166390 166780
54509A66780P85P78R56J153N56o91j456j384j230j281r33j06L81K61K67P66J209
$$ 166780 167565 168343 169299 170452 171008 170317 168861 167477 166247 164966 164033 163927 164308 164569 164836 165602 166811
54492A66811J223J029N67m87j603j658o09L30M65L10L39L31K48N15J050J146O57
$$ 166811 168034 169063 169630 169143 167540 165882 165273 165603 166068 166378 166717 167048 167296 167811 168861 170007 170664
54475A70664K33K63N14Q40J153Q79l14j398j031M42J397J262Q74O61K53r5M49
$$ 170664 170897 171160 171674 172514 173667 174546 174232 172834 171803 172245 173642 174904 175778 176439 176692 176597 177046
54458A77046J549J753P17l09n54o31r12p35R5O19K41l74n73o21p55o57k78j11
$$ 177046 178595 180348 181065 180756 180202 179571 178659 177924 178019 178638 178879 178505 177932 177311 176556 175899 175621 175510
54440A75510j87p9m2p46j651j307L36J554J340O14L52K62M1L42J366J968J214
$$ 175510 175323 175244 175202 174456 172805 171498 171834 173388 174728 175342 175694 175956 175997 176339 177705 179673 180887
54423A80887j79r59q42k06O90J438J435P69K69K21J01k10j39K36O4o34o81K17
$$ 180887 180708 179749 178907 178701 179391 180829 182264 183033 183302 183523 183624 183414 183275 183511 183575 182941 182260 182477
54405A82477P69K05m17o2O35O80M30O69J061Q35K80K88R78J706K043J941J476
$$ 182477 183246 183451 183034 182972 183607 184287 184717 185386 186447 187282 187562 187850 188828 190534 192577 194518 195994
54388A95994R59Q15Q96N06m63j243j339j181j225j322j307j301j074j25J225J881
$$ 195994 196953 197768 198664 199170 198707 197464 196125 194944 193719 192397 191090 189789 188715 188590 189815 191696
54372A91696J556J244J696K497K996L148K968K375J878K247L138L363K809K640
$$ 191696 193252 194496 196192 198689 201685 204833 207801 210176 212054 214301 217439 220802 223611 226251
54358B26251L091K848J313k04o60r38k146l597m014l599l421l604l486k960k436
$$ 226251 229342 232190 233503 233299 232639 231701 229555 225958 221944 218345 214924 211320 207834 204874 202438
54343B02438j981j535j409j710j828j326p46p29r66q13l09J09L06L03L3k26M2
$$ 202438 200457 198922 197513 195803 193975 192649 191903 191174 190208 189395 189086 189195 189501 189804 189837 189611 189653
54326A89653O06M79n60j477j497j066o48J76J553K457K056J037N34N31L55q6m92
$$ 189653 190259 190738 190178 188701 187204 186138 185490 185666 187219 189676 191732 192769 193303 193834 194189 194103 193611
54309A93611q90j265j168o05m90j317k140j871q76l21n18q91j002p19M8R73J213
$$ 193611 192721 191456 190288 189683 189193 187876 185736 183865 182989 182668 182150 181259 180257 179538 179586 180559 181772
54292A81772N31j14R0O32O60M66Q76J733K088J573P19J24J6L78Q46P42j72j270
$$ 181772 182303 182189 182279 182911 183571 184037 184913 186646 188734 190307 191026 191150 191166 191544 192390 193132 192960 191690
54274A91690j806j686j172l42O23J211J171Q30N38K39l4L7M57P42P35Q61J233
$$ 191690 189884 188198 187026 186684 187307 188518 189689 190519 191057 191296 191262 191299 191756 192498 193233 194094 195327
54257A95327J331R06M55L88M80N08N95O75N08M04R30J611J182n47k253k879k634
$$ 195327 196658 197564 198019 198407 198887 199395 199990 200665 201173 201577 202507 204118 205300 204753 202500 199621 196987
54240A96987j886n89P07Q64k0l82M07R90K95p28q86o48q97j125m57O17J030Q03
$$ 196987 195101 194512 195219 196083 196063 195681 196088 197078 197373 196645 195759 195111 194214 193089 192632 193249 194279 195082
54222A95082N44K05l57m30N32J707J925J291O00J1o37r77p84o16p62m70N68J137
$$ 195082 195626 195831 195474 195044 195576 197283 199208 200499 201099 201110 200473 199496 198712 198096 197334 196864 197432 198569
54204A98569K32j151j456q68o01q04p77n94p68r02l38L32Q6o77p09k8K34j31j29
$$ 198569 198801 197650 196194 195326 194725 193921 193144 192550 191782 190880 190542 190874 190960 190283 189574 189546 189780 189649 189520
54185A89520O79J569J917J812J438R17P35J284K056K188J666J143Q58N90L24J08
$$ 189520 190199 191768 193685 195497 196935 197852 198587 199871 201927 204115 205781 206924 207782 208372 208696 208804
54169B08804l54j083j342o92P1j5o94j198j552j995j928q55K48Q7q73j054j86
$$ 208804 208450 207367 206025 205333 205404 205389 204695 203497 201945 199950 198022 197167 197415 197502 196629 195575 195389
54152A95389N73P22J040J864K263J366m02j778j778m50J003J100k44j444j265
$$ 195389 195962 196684 197724 199588 201851 203217 202815 201037 199259 198809 199812 200912 200668 199224 197959
54137A97959l84j16l98l09J27L7p44j477j611j070J47J610K245J571N98M17N63
$$ 197959 197575 197459 197061 196752 196879 196916 196172 194695 193084 192014 192161 193771 196016 197587 198185 198602 199165
54120A99165R9n09j50R22J486J432J655K205K164J367O84M99L73K15N18J304K017
$$ 199165 199264 198755 198605 199527 201013 202445 204100 206305 208469 209836 210520 211019 211392 211607 212125 213429 215446
54103B15446K412K545K132J082L92J100K663L670L959M556N725O559O438N453
$$ 215446 217858 220403 222535 223617 224009 225109 227772 231442 235401 239957 245682 252241 258679 264132
54089B64132L472K93l195n456o092n951n546m650l417k493j930j270o82p76j282
$$ 264132 267604 267897 264702 259246 253154 247203 241657 237007 233590 231097 229167 227897 227215 226439 225157
54074B25157j260n70J32P44J628K405K381K050K517L424L263J894Q90J110J623
$$ 225157 223897 223327 223459 224203 225831 228236 230617 232667 235184 238608 241871 243765 244655 245765 247388
54059B47388J616J567J852J748P37m88j153j476j931k384k557k441j894p25N57
$$ 247388 249004 250571 252423 254171 254908 254420 253267 251791 249860 247476 244919 242478 240584 239859 240416
54044B40416J066Q08P22J273K079K981M233N481N890N523N355N674N842N775O163
$$ 240416 241482 242290 243012 244285 246364 249345 253578 259059 264949 270472 275827 281501 287343 293118 299281
54029B99281O873O744N538M532M454M329L212J702P78L42p4j98K73P29M50l31
$$ 299281 306154 312898 318436 322968 327422 331751 334963 336665 337443 337785 337711 337513 337786 338515 338965 338634
54013C38634r59j381j897k452k838l129l405l506l504l794m433m970n162n214
$$ 338634 337675 336294 334397 331945 329107 325978 322573 319067 315563 311769 307336 302366 297204 291990
53999B91990n097m465l437k665k313j917j390j265j585j626j129q08j130j525
$$ 291990 286893 282428 278991 276326 274013 272096 270706 269441 267856 266230 265101 264293 263163 261638
53985B61638j396j059j084j397j608j597j384r61n68n33o68n26k93n93j304j527
$$ 261638 260242 259183 258099 256702 255094 253497 252113 251152 250584 250051 249383 248857 248564 247971 246667 245140
53969B45140r51k69K0K33O08Q79J026J460K078K198J840J940K847L706L934M216
$$ 245140 244189 243920 243940 244173 244781 245660 246686 248146 250224 252422 254262 256202 259049 262755 266689 270905
53953B70905N318O856Q088R111J0443J2027J3418J4484J5219J5198J3711J0384
$$ 270905 276223 283079 291167 300278 310721 322748 336166 350650 365869 381067 394778 405162
53941D05162N551K83l977o418p377p498o735n042l481l317m164m496l942l567
$$ 405162 410713 410996 407019 400601 393224 385726 378991 373949 370468 367151 362987 358491 354549 350982
53927C50982l726l306j729o3N88O80J286K596M124N509O512O925O973P159P465
$$ 350982 347256 343950 342221 342158 342746 343426 344712 347308 351432 356941 363453 370378 377351 384510 391975
53912C91975P506P483P816P885O627M538L447L757L685J980l16j714k272k618
$$ 391975 399481 406964 414780 422665 429292 433830 437277 441034 444719 446699 446383 444669 442397 439779
53898D39779k517j789j380k077l110l368l173l572m633n619o241o631o697o472
$$ 439779 437262 435473 434093 432016 428906 425538 422365 418793 414160 408541 402300 395669 388972 382500
53884C82500o486o917p066o487n836n753n750n213m565m399m272l586k898l099
$$ 382500 376014 369097 362031 355544 349708 343955 338205 332992 328427 324028 319756 316170 313272 310173
53870C10173l848m053l505k876k540k429k637l160l367k761j913j693j966j995
$$ 310173 306325 302272 298767 295891 293351 290922 288285 285125 281758 278997 277084 275391 273425 271430
53856B71430j727j682j845j737j417j421j758j854j525j176j043q48l18M36J026
$$ 271430 269703 268021 266176 264439 263022 261601 259843 257989 256464 255288 254245 253397 253079 253515 254541
53841B54541J017J75j142k102k168j602r97o56n25l22L13J283J697Q63m64p75
$$ 254541 255558 255733 254591 252489 250321 248719 247722 247066 246541 246219 246532 247815 249512 250375 249911 249136
53825B49136J09Q59P27M63O35N56k00o04K89J666K124J702J435J581J605J453
$$ 249136 249245 250104 250831 251294 251929 252485 252285 251681 251970 253636 255760 257462 258897 260478 262083 263536
53809B63536J519J683J542J413K012L244M212M425M199L997M046M451N088N522
$$ 263536 265055 266738 268280 269693 271705 274949 279161 283586 287785 291782 295828 300279 305367 310889
53795C10889N497N310N322N367N022M161K951J765J210J664K544K764K134J458
$$ 310889 316386 321696 327018 332385 337407 341568 344519 346284 347494 349158 351702 354466 356600 358058
53781C58058J038J63j460k984l784m366n151n525n075m611m902n332n034m400
$$ 358058 359096 359259 357799 354815 351031 346665 341514 335989 330914 326303 321401 316069 311035 306635
53767C06635m222m211l659k945k948l503l711l368k918k416j718j280j564k033
$$ 306635 302413 298202 294543 291598 288650 285147 281436 278068 275150 272734 271016 269736 268172 266139
53753B66139j859j336j398k083k587k570k313j771o59O21J143N92m17j078r18
$$ 266139 264280 262944 261546 259463 256876 254306 251993 250222 249563 250184 251327 251919 251502 250424 249506
53738B49506L0R81Q88j48o51K30J339J218L36K40J080J644J499J533K279L129
$$ 249506 249536 250517 251405 251257 250606 250836 252175 253393 253729 253969 255049 256693 258192 259725 262004 265133
53722B65133L471L365K928K029R45M40Q44J677K237K117J248J44j37R60K630L590
$$ 265133 268604 271969 274897 276926 277871 278311 279155 280832 283069 285186 286434 286578 286441 287401 290031 293621
53706B93621L651L682M137M471M024K852J622J084J554K519L077L077L284M080
$$ 293621 297272 300954 305091 309562 313586 316438 318060 319144 320698 323217 326294 329371 332655 336735
53692C36735M697M356L401K600J986J228M53k53j414l233m672m640l562k662k196
$$ 336735 341432 345788 349189 351789 353775 355003 355456 355203 353789 350556 345884 341244 337682 335020 332824
53677C32824j547o53q7K4j3l07j096j822j642p68k42m54q17q06m34J59P45Q48
$$ 332824 331277 330624 330537 330561 330548 330241 329145 327323 325681 324913 324671 324217 323400 322594 322160 322319 323064 323912
53659C23912L23j79p6K29P8l32m55m44o15n07L79J431J774J706J959K076J144
$$ 323912 324235 324056 323980 324209 324287 323955 323500 323056 322441 321934 322313 323744 325518 327224 329183 331259 332403
53642C32403k63n45N59J653J844J742K005K327K257J957J669J376J160J229J429
$$ 332403 332140 331595 332154 333807 335651 337393 339398 341725 343982 345939 347608 348984 350144 351373 352802
53627C52802J517J785K627L668M174M179M280M531M527M401M640N159N524N844
$$ 352802 354319 356104 358731 362399 366573 370752 375032 379563 384090 388491 393131 398290 403814 409658
53613D09658O492P128P185O941O990O924N843M001K600K101J915J597J146L26
$$ 409658 416150 423278 430463 437404 444394 451318 457161 461162 463762 465863 467778 469375 470521 470847
53599D70847r83j943j644o40k66o66q87o96o73p12k28J74q22k857l901l105j899
$$ 470847 469864 467921 466277 465637 465371 464705 463818 463122 462449 461737 461509 461683 460861 458004 454103 450998 449099
53582D49099j627j797j512j114j360k090k640k837k820k626k395k376k442k272
$$ 449099 447472 445675 444163 443049 441689 439599 436959 434122 431302 428676 426281 423905 421463 419191
53568D19191k027k036j958j289m87l17l15N63J864J988P85p7K09M48k98j072o84
$$ 419191 417164 415128 413170 411881 411394 411077 410762 411325 413189 415177 415962 415885 416094 416542 416244 415172 414488
53551D14488M36J198J485J765J984J882J653J551J478J557K254L466M241M027
$$ 414488 414924 416122 417607 419372 421356 423238 424891 426442 427920 429477 431731 435197 439438 443465
53537D43465L426L351M128N601P210P892P058N892O373Q679J0919J1815J2099
$$ 443465 446891 450242 454370 459971 467181 475073 482131 488023 494396 503075 513994 525809 537908
53524E37908J2696J3129J2738J2169J2369J3147J3779J4293J5189J6500J7946
$$ 537908 550604 563733 576471 588640 601009 614156 627935 642228 657417 673917 691863
53513F91863J9377K0573K1232K1620K2479K3903K5183K5993K6677K7061K6321
$$ 691863 711240 731813 753045 774665 797144 821047 846230 872223 898900 925961 952282
53502I52282K4507K2858K2006K1172J9876J9036J9319J9727J9045J7659J6779
$$ 952282 976789 999647 1021653 1042825 1062701 1081737 1101056 1120783 1139828 1157487 1174266
53491A174266J6708J6987J7466J8104J8397J8050J7666J7815J8047J7619J6690
$$ 1174266 1190974 1207961 1225427 1243531 1261928 1279978 1297644 1315459 1333506 1351125 1367815
53480A367815J5914J5388J4717J3665J2118J0004P758O128N067L559J103j538
$$ 1367815 1383729 1399117 1413834 1427499 1439617 1449621 1457379 1463507 1468574 1472133 1473236 1471698
53468A471698l608n437p593r919j2078j4141j5904j6578j5986j5188j5130j5549
$$ 1471698 1468090 1462653 1455060 1445141 1433063 1418922 1403018 1386440 1370454 1355266 1340136 1324587
53456A324587j5970j6687j7876j8832j9063j9267k0053k0653k0059j8693j7753
$$ 1324587 1308617 1291930 1274054 1255222 1236159 1216892 1196839 1176186 1156127 1137434 1119681
53445A119681j7554j7609j7641j7314j5678j2248q257n537m363l507k118n70M67
$$ 1119681 1102127 1084518 1066877 1049563 1033885 1021637 1013380 1007843 1003480 999973 997855 997285 997752
53432I97752Q50Q83J093J919L207M272M872N658P176R037J0619J1938J3315J4732
$$ 997752 998602 999485 1000578 1002497 1005704 1009976 1014848 1020506 1027682 1036719 1047338 1059276 1072591 1087323
53418A087323J6144J7811J9714K1336K2518K3824K5552K7153K8247K9327L0849
$$ 1087323 1103467 1121278 1140992 1162328 1184846 1208670 1234222 1261375 1289622 1318949 1349798
53407A349798L2419L3619L4731L6039L7323L8656M0653M3187M5124M6086M7264
$$ 1349798 1382217 1415836 1450567 1486606 1523929 1562585 1603238 1646425 1691549 1737635 1784899
53396A784899M9420N1481N2322N2675N3731N4996N5177N4372N3628N3077N2086
$$ 1784899 1834319 1885800 1938122 1990797 2044528 2099524 2154701 2209073 2262701 2315778 2367864
53385B367864N0687M9317M7628M5007M1810L8664L5200L0911K6625K3434K0669
$$ 2367864 2418551 2467868 2515496 2560503 2602313 2640977 2676177 2707088 2733713 2757147 2777816
53374B777816J6679J1323N945J199l496q533j3853j9903k7114l4405l9964m3641
$$ 2777816 2794495 2805818 2811763 2812962 2809466 2800933 2787080 2767177 2740063 2705658 2665694 2622053
53362B622053m6897n0320n2910n4054n4468n4674n4151n2663n1003m9730m8331
$$ 2622053 2575156 2524836 2471926 2417872 2363404 2308730 2254579 2201916 2150913 2101183 2052852
53351B052852m6304m3967m1691l9394l7415l6673l7272l7896l7364l6012l4798
$$ 2052852 2006548 1962581 1920890 1881496 1844081 1807408 1770136 1732240 1694876 1658864 1624066
53340A624066l3777l2294l0109k7597k5144k2918k0972j9109j6949j4455j2233
$$ 1624066 1590289 1557995 1527886 1500289 1475145 1452227 1431255 1412146 1395197 1380742 1368509
53329A368509j0934j0594j0714j0879j1136j1811j2984j4100j4405j3884j3335
$$ 1368509 1357575 1346981 1336267 1325388 1314252 1302441 1289457 1275357 1260952 1247068 1233733
53318A233733j3202j2858j1537r574p922o824n709m243k713j383j84R37J932K917
$$ 1233733 1220531 1207673 1196136 1186562 1178640 1171816 1166107 1161864 1159151 1157768 1157584 1158521 1160453 1163370
53304A163370M124N597P260R070J0817J2170J3336J5113J7770K0396K2029K2943
$$ 1163370 1167494 1173091 1180351 1189421 1200238 1212408 1225744 1240857 1258627 1279023 1301052 1323995
53292A323995K4073K5661K7265K8581K9364K8954K6921K3924K1053J8584J6188
$$ 1323995 1348068 1373729 1400994 1429575 1458939 1487893 1514814 1538738 1559791 1578375 1594563
53281A594563J3896J1875R695O838L653P75k009n181q205j0170j1460j3372j6143
$$ 1594563 1608459 1620334 1630029 1636867 1640520 1641295 1639286 1634105 1625900 1615730 1604270 1590898 1574755
53268A574755j8717k0500k1952k3358k4386k5113k6155k7406k7916k7460k7060
$$ 1574755 1556038 1535538 1513586 1490228 1465842 1440729 1414574 1387168 1359252 1331792 1304732
53257A304732k7438k8039k8173k8048k8086k8032k7499k6662k5771k4668k3286
$$ 1304732 1277294 1249255 1221082 1193034 1164948 1136916 1109417 1082755 1056984 1032316 1009030
53246A009030k2127k1695k1822k2012k2039k1901k1562k0932j9899j8337j6474
$$ 1009030 986903 965208 943386 921374 899335 877434 855872 834940 815041 796704 780230
53235G80230j5020j4349j3725j2134r810q003p287p012o607o333o422o522o565
$$ 780230 765210 750861 737136 725002 715192 707189 699902 692890 686283 679950 673528 667006 660441
53222F60441p337r396j1992j3768j4204j3876j3583j3664j3936j3929j3302j2165
$$ 660441 653104 643708 631716 617948 603744 589868 576285 562621 548685 534756 521454 509289
53210E09289j0903r665q341p011o033n616n643n957o487p124p757q366q839q900
$$ 509289 498386 488721 480380 473369 467336 461720 456077 450120 443633 436509 428752 420386 411547 402647
53196D02647q511q054p701p036n767m434l733l533l337l313l879m549m263k921
$$ 402647 394136 386082 378381 371345 365578 361144 357411 353878 350541 347228 343349 338800 334537 331616
53182C31616j596j168j545k318l224l880l867l345k929k747k365j609q30l05l7
$$ 331616 330020 328852 327307 324989 321765 317885 314018 310673 307744 304997 302632 301023 300193 299888 299851
53167B99851j70p42j084l73J081J937J445J76r68j665j853j392n04J29P1m09q21
$$ 299851 299681 298939 297855 297482 298563 300500 301945 302121 301153 299488 297635 296243 295739 295868 295939 295530 294709
53150B94709r16o64k67k12p57j388j367p44k07m0J8rl49p57o23M2N85P41Q89J207
$$ 294709 293793 293129 292862 292650 291893 290505 289138 288394 288187 288147 288165 288156 287807 287050 286427 286469 287054 287795 288684 289891
53130B89891J332J033M97j35p86j045n81J14K32j09n3O08J262J658K155K707K770
$$ 289891 291223 292256 292753 292618 291832 290787 290206 290320 290552 290443 290390 290998 292260 293918 296073 298780 301550
53113C01550K405K318K575K398J544O67mj049k422k977k182j165j176j959k501
$$ 301550 303955 306273 308848 311246 312790 313457 313453 312404 309982 307005 304823 303658 302482 300523 298022
53098B98022k481k112j404n62m42j537k922l177k056m82Q36J842K452K246J154
$$ 298022 295541 293429 292025 291463 291021 289484 286562 283385 281329 280847 281683 283525 285977 288223 289377
53083B89377j41p17k78O58J271J185O56L2n69r44o44L27R87L82j104k125j989
$$ 289377 289236 288519 288241 288899 290170 291355 292011 292043 291474 290530 289886 290213 291200 291582 290478 288353 286364
53066B86364j194n12k89n76j150j435j119p44r09j145n66O35J419J543J700K008
$$ 286364 285170 284658 284369 283793 282643 281208 280089 279345 278436 277291 276725 277360 278779 280322 282022 284030
53050B84030J733P29j6K15J002J619J764J231k9j321j677j225r97j248j157m58
$$ 284030 285763 286492 286476 286691 287693 289312 291076 292307 292278 290957 289280 288055 287058 285810 284653 284195
53034B84195L3j08k30J00M09M34O03Q94N42m64r41l11M98O90P14R16N99m46q99
$$ 284195 284228 284120 283890 283990 284399 284833 285436 286330 286872 286408 285467 285156 285654 286344 287058 287974 288573 288127 287228
53015B87228K46J884K290J469O73L83J97J12M84J052J233J074R79Q79N27J75J44
$$ 287228 287474 289358 291648 293117 293790 294173 294370 294482 294966 296018 297251 298325 299304 300183 300710 300885 301029
52998C01029J52p2j26L01O40L05k22j52L71P08R01J367J873J847J451J390J845
$$ 301029 301181 301109 300983 301284 301924 302229 302007 301855 302226 302934 303835 305202 307075 308922 310373 311763 313608
52981C13608K383K704K776K523J985J472J073M28n31j213j227r54p18k84K63J05
$$ 313608 315991 318695 321471 323994 325979 327451 328524 328952 328421 327208 325981 325027 324309 324025 324288 324393
52965C24393r05j442l86J422K306J915J221Q51O48M10M7o76j619j962j310m76
$$ 324393 323488 322046 321660 323082 325388 327303 328524 329375 330023 330433 330480 329804 328185 326223 324913 324437
52949C24437l35n72o05q37j751k532k160j216j015j388j051P3O69K03m09n32o47
$$ 324437 324102 323530 322925 322088 320337 317805 315645 314429 313414 312026 310975 311048 311717 311920 311511 310979 310332
52932C10332j089j387j358j593k254k447j488RR13Q23J34n44o84j04P17J032O68
$$ 310332 309243 307856 306498 304905 302651 300204 298716 298725 299638 300461 300595 300051 299367 299263 299980 301012 301680
52915C01680J47j04r8R9N18R01P79R1o73j022q23j86N68R07N18k56p64p34l07
$$ 301680 301827 301723 301625 301724 302242 303143 303922 304013 303340 302318 301495 301309 301877 302784 303302 303046 302282 301548 301241
52896C01241L11Q37Q22J17p72j238j222r73n66j09R9J35N88J523J942J134q6m82
$$ 301241 301552 302389 303211 303328 302556 301318 300096 299123 298557 298448 298547 298682 299270 300793 302735 303869 303783 303301
52878C03301j78j44l84NJ114J887J727J268J218J446J648K062L038M341N255N150
$$ 303301 303123 302979 302595 302600 303714 305601 307328 308596 309814 311260 312908 314970 318008 322349 327604 332754
52862C32754L915K151P49qo87j758k862l534m020m632m849m038k735k078k275
$$ 332754 336669 338820 339569 339561 338874 337116 334254 330720 326700 322068 317219 313181 310446 308368 306093
52847C06093k598k698k867l106l054k806k756k679j984q89k94l75l75PJ79j48
$$ 306093 303495 300797 297930 294824 291770 288964 286208 283529 281545 280656 280362 279987 279612 279619 279798 279650
52831B79650l54M3N83O62M23L52N09N87L45k30q68j108q11m69n41p28m87pJ28
$$ 279650 279296 279339 279922 280584 281007 281359 281868 282455 282800 282570 281702 280594 279783 279314 278773 278045 277558 277551 277679
52812B77679M3L63R99J222J006J169J974K653K654K353K024J119p44k742l632
$$ 277679 277722 278085 279084 280306 281312 282481 284455 287108 289762 292115 294139 295258 294514 291772 288140
52797B88140l147k076j234q79q91j051j139r82n07J71N91K42p24j357r56K1O25
$$ 288140 284993 282917 281683 280804 279913 278862 277723 276741 276234 276405 276996 277238 276514 275157 274201 274222 274847
52780B74847O76O83Q02O97K95o6k55l58j90L61O76K1j124j427n08N57Q69Q46J177
$$ 274847 275523 276206 277008 277705 278000 277934 277679 277321 277131 277492 278168 278189 277065 275638 275130 275687 276556 277402 278579
52761B78579J525J022l81j721k060j345l18K72L71M62P22P64N08O24J521K428
$$ 278579 280104 281126 280745 279024 276964 275619 275301 275573 275944 276406 277128 277892 278400 279024 280545 282973
52745B82973K415J911K094K975L285K320Q26j73m32j46M94J119J336J267J278
$$ 282973 285388 287299 289393 292368 295653 297973 298799 298626 298194 298048 298542 299661 300997 302264 303542
52730C03542J102K24q40q53L28J401J500J231J231R92Nr96j137r71j627k759k802
$$ 303542 304644 304868 304028 303175 303503 304904 306404 307635 308866 309858 309863 308867 307730 306759 305132 302373 299571
52713B99571j290K56K66r42j799j532p70k14L61J296J928J271l15j219o90J61
$$ 299571 298281 298537 298803 297861 296062 294530 293760 293546 293907 295203 297131 298402 298087 296868 296178 296339
52697B96339P2n48n61l9J9m65m68M24J339J450R56M62J85N5n5m33j245k041k129
$$ 296339 296411 295863 295302 295263 295282 294817 294349 294773 296112 297562 298518 298980 299165 299220 299165 298732 297487 295446 293317
52678B93317j432m09O66J628J895J053j43m48J31M43J27J57J086J995J846R49
$$ 293317 291885 291476 292142 293770 295665 296718 296575 296127 296258 296701 296828 296985 298071 300066 301912 302861
52662C02861L06K37L43L39L60P05J579K705L262K793K102K376L469L991L221J810
$$ 302861 303167 303404 303747 304086 304446 305151 306730 309435 312697 315490 317592 319968 323437 327428 330649 332459
52646C32459M05j197k988m038l669k498j528r15l39R3P1k24l29o4M71J117J537
$$ 332459 332864 331667 328679 324641 320972 318474 316946 316031 315692 315785 315856 315632 315303 315239 315710 316827 318364
52629C18364J361Q07O48J210J928K128J753J027M0j043j873k308k485k367j826
$$ 318364 319725 320532 321180 322390 324318 326446 328199 329226 329266 328223 326350 324042 321557 319190 317364
52614C17364j240j229j624j464l32J022J695J556R87L95J54L79N66J90l65l21
$$ 317364 316124 314895 313271 311807 311475 312497 314192 315748 316735 317130 317284 317663 318229 318419 318054 317733
52598C17733J33J46j65K09J256J615P35j74l5N54N57Q7k49m67o25k00R31J795
$$ 317733 317866 318012 317847 318056 319312 320927 321662 321488 321453 322007 322564 322651 322402 321935 321310 321110 322041 323836
52580C23836J656J178J212J355Q37M9j60n7n30j484j970j680j180q39n70m32o30
$$ 323836 325492 326670 327882 329237 330074 330123 329963 329906 329376 327892 325922 324242 323062 322223 321653 321221 320591
52563C20591r38r86q87j007j278j357j200r44n87k50k87o24n42K07Q22N90j8k26
$$ 320591 319653 318667 317780 316773 315495 314138 312938 311994 311407 311157 310870 310246 309704 309911 310733 311323 311305 311079
52545C11079j23j01J30Q73J369P38n03j033n95m6K16N79J060J100O39L78O77J061
$$ 311079 310956 310855 310985 311858 313227 313965 313462 312429 311834 311788 312004 312583 313643 314743 315382 315760 316437 317498
52527C17498J060P80M55J36OL64J111J752K030K090K058J930J863K045K355K591
$$ 317498 318558 319338 319793 319929 319935 320299 321410 323162 325192 327282 329340 331270 333133 335178 337533 340124
52511C40124K926L592M243M258L654K998K498J683K33j482k856l707m305m914
$$ 340124 343050 346642 350885 355143 358797 361795 364293 365976 366209 364727 361871 358164 353859 348945
52497C48945n431n418m612l356k300j604q72lM80K23l76p91j067j416j605j358
$$ 348945 343514 338096 333484 330128 327828 326224 325352 325349 325829 326052 325676 324885 323818 322402 320797 319439
52481C19439r27o09j38Q14J848K223J874J376J093R34Q22R00J314K104L178M107
$$ 319439 318512 317903 317765 318579 320427 322650 324524 325900 326993 327927 328749 329649 330963 333067 336245 340352
52465C40352M314L838L508L913M571M561L607K032P6k065l866m789m926m835m857
$$ 340352 344666 348504 352012 355925 360496 365057 368664 370696 370772 368707 364841 360052 355126 350291 345434
52450C45434m972n035m812m028k817j795j408j416j363j146q78n81l56l62l91
$$ 345434 340462 335427 330615 326587 323770 321975 320567 319151 317788 316642 315764 315183 314827 314465 314074
52435C14074LO71Q39K18n75j045j433j808j502k45J042J427J291J543K116K199
$$ 314074 314077 314748 315587 315805 315230 314185 312752 310944 309442 309197 310239 311666 312957 314500 316616 318815
52419C18815J523N85o7l1R00K201K673J846Q51J103K676M668O537Q146R165R519
$$ 318815 320338 320923 320856 320825 321725 323926 326599 328445 329296 330399 333075 337743 344280 352426 361591 371110
52403C71110R946J1109J2397J2483J0715P285K613k545o893r442j0289r950q623
$$ 371110 381056 392165 404562 417045 427760 435045 437658 435113 428220 418778 408489 398539 389916
52390C89916o762n454n155m874l713k322j721j598j193q67j166j193K27K321L304
$$ 389916 383154 377700 372545 367671 363958 361636 359915 358317 357124 356257 355091 353898 354125 356446 359750
52375C59750L154L464M680N578N537N411N742N903N423M603L466J642m31j647
$$ 359750 362904 366368 371048 376626 382163 387574 393316 399219 404642 409245 412711 414353 413922 412275
52361D12275j984k515l413l530k508j629j861k464k366j547l41J293K987L638
$$ 412275 410291 407776 404363 400833 398325 396696 394835 392371 390005 388458 388117 389410 392397 396035
52347C96035K872J829J644K051K233K146K176K323K567L293M566N665O051O182
$$ 396035 398907 400736 402380 404431 406664 408810 410986 413309 415876 419169 423735 429400 435451 441633
52333D41633O744P682Q570R310R912J0270J0661J1788J3758J5680J6760J7150
$$ 441633 448377 456059 464629 473939 483851 494121 504782 516570 530328 546008 562768 579918
52321E79918J7233J6877J6026J5299J5263J5604J5758J5841J6380J7400J8436
$$ 579918 597151 614028 630054 645353 660616 676220 691978 707819 724199 741599 760035
52310G60035J9137J9513J9815K0476K1719K3049K3585K3057K2053K1167K0534
$$ 760035 779172 798685 818500 838976 860695 883744 907329 930386 952439 973606 994140
52299I94140K0268K0459K0492J9217J6265J2502Q796N238J841q70k645m036n471
$$ 994140 1014408 1034867 1055359 1074576 1090841 1103343 1112139 1117377 1119218 1118348 1115703 1111667 1106196
52286A106196o530o829o916p487q293q661q578q460q194p235n478l342j175Q42
$$ 1106196 1099666 1092837 1085921 1078434 1070141 1061480 1052902 1044442 1036248 1029013 1023535 1020193 1019018 1019860
52272A019860K364L126L433L976N060O362P426Q139Q770R660J0805J1756J2162
$$ 1019860 1022224 1025350 1028783 1032759 1037819 1044181 1051607 1059746 1068516 1078176 1088981 1100737 1112899
52259A112899J2377J3163J4733J6491J7817J8619J9048J9101J8750J8066J6991
$$ 1112899 1125276 1138439 1153172 1169663 1187480 1206099 1225147 1244248 1262998 1281064 1298055
52248A298055J5281J2755R397N311R63k722n023o238p265q473r499j0118j0604
$$ 1298055 1313336 1326091 1335488 1340799 1341762 1339040 1334017 1327779 1320514 1312041 1302542 1292424 1281820
52235A281820j1222j2002j3009j4183j4981j4867j4203j3839j3915j3834j3411
$$ 1281820 1270598 1258596 1245587 1231404 1216423 1201556 1187353 1173514 1159599 1145765 1132354
52224A132354j3057j2765j1978j0636r392q523p591o402n346m477l297j786n88
$$ 1132354 1119297 1106532 1094554 1083918 1074526 1066003 1058412 1052010 1046664 1042187 1038890 1037104 1036516
52211A036516Q4P63J617K144K375L147M593N564N317M632M377M125L176K053J779
$$ 1036516 1036600 1037363 1038980 1041124 1043499 1046646 1051239 1056803 1062120 1066752 1071129 1075254 1078430 1080483 1082262
52196A082262K371L142L896M878N966O924P930R011R351Q174O029M284L492K927
$$ 1082262 1084633 1087775 1091671 1096549 1102515 1109439 1117369 1126380 1135731 1143905 1149934 1154218 1157710 1160637
52182A160637J597q71m091p100r007r866j0639j1852j2738j2228j0280p770n519
$$ 1160637 1162234 1161363 1157272 1150172 1141165 1131299 1120660 1108808 1096070 1083842 1073562 1065792 1060273
52169A060273m009l430l400l018j892o63L8O43J975L964N745O732O881O234M870
$$ 1060273 1056264 1052834 1049434 1046416 1044524 1043861 1043899 1044542 1046517 1050481 1056226 1062958 1069839 1076073 1080943
52154A080943L178J591K30q72j464j375p91R0J235K345K835K627K395K538K553
$$ 1080943 1084121 1085712 1085942 1085070 1083606 1082231 1081440 1081530 1082765 1085110 1087945 1090572 1092967 1095505 1098058
52139A098058J933J029M23Q3k13k03L98J346K429M062O541R341J1879J4450J7524
$$ 1098058 1099991 1101020 1101443 1101526 1101313 1101110 1101508 1102854 1105283 1109345 1115886 1125227 1137106 1151556 1169080
52124A169080K0636K2927K4480K6148K8229L0122L1177L1279L0636K9601K8487
$$ 1169080 1189716 1212643 1237123 1263271 1291500 1321622 1352799 1384078 1414714 1444315 1472802
52113A472802K7222K5436K3254K1404K0107J8526J6050J3418J1792J1249J1119
$$ 1472802 1500024 1525460 1548714 1570118 1590225 1608751 1624801 1638219 1650011 1661260 1672379
52102A672379J1202J1665J2131J1984J1337J0658R674P647M653J597j122m039
$$ 1672379 1683581 1695246 1707377 1719361 1730698 1741356 1751030 1758677 1763330 1764927 1763805 1759766
52090A759766p686j1979j6589k1096k4712k6527k6387k4981k3049k0907j8721
$$ 1759766 1752080 1740101 1723512 1702416 1677704 1651177 1624790 1599809 1576760 1555853 1537132
52079A537132j6705j4904j3163j1359r468p554n777m196k401J63L247N781P222
$$ 1537132 1520427 1505523 1492360 1481001 1471533 1463979 1458202 1454006 1451605 1451768 1455015 1460796 1468018
52066A468018Q251R658J1257J2591J3905J5534J6870J7080J6452J6058J6307J6690
$$ 1468018 1476269 1485927 1497184 1509775 1523680 1539214 1556084 1573164 1589616 1605674 1621981 1638671
52054A638671J6783J6573J5944J4696J2889J0594P572L884L45k468n130q358j1605
$$ 1638671 1655454 1672027 1687971 1702667 1715556 1726150 1733722 1737606 1737951 1735483 1730353 1721995 1710390
52041A710390j3870j5458j7493j9853k1104k0605j9402j8650j8362j8130j7974
$$ 1710390 1696520 1681062 1663569 1643716 1622612 1602007 1582605 1563955 1545593 1527463 1509489
52030A509489j7899j7459j6404j5140j4195j3760j3971j4894j6015j6398j5745
$$ 1509489 1491590 1474131 1457727 1442587 1428392 1414632 1400661 1385767 1369752 1353354 1337609
52019A337609j4689j3815j3069j2318j1773j1395j0579q930o939n413m683m708
$$ 1337609 1322920 1309105 1296036 1283718 1271945 1260550 1249971 1241041 1234102 1228689 1224006 1219298
52007A219298n546p217r346j1460j3540j5883j8431k0589k1761k1946k1582k0898
$$ 1219298 1213752 1206535 1197189 1185729 1172189 1156306 1137875 1117286 1095525 1073579 1051997 1031099
51995A031099j9652j7701j5625j4243j3556j2720j1258r774r155r682j1123j3103
$$ 1031099 1011447 993746 978121 963878 950322 937602 926344 916570 907415 897733 886610 873507
51983H73507j4920j5669j5202j4549j4752j5733j6737j7346j7465j6903j5769
$$ 873507 858587 842918 827716 813167 798415 782682 765945 748599 731134 714231 698462
51972F98462j4685j3806j2180q965m823j192J416L462N264O947Q974J1436J3121
$$ 698462 683777 669971 657791 648826 644003 642811 644227 647689 652953 659900 668874 680310 693431
51959F93431J2563R961O834L997J158j702m082o169q680j1154j1894j0204p414
$$ 693431 705994 715955 722789 726786 727944 726242 722160 715991 707311 696157 684263 674059 666645
51946F66645m995k837j62K945N841Q373J0700J2700J4288J5864J7688J9211J9638
$$ 666645 661650 658813 658651 661596 667437 675810 686510 699210 713498 729362 747050 766261 785899
51933G85899J8865J7390J5626J3793J2076J0367Q087M746O70l212o308q948j2129
$$ 785899 804764 822154 837780 851573 863649 874016 882103 886849 887519 884307 877999 869051 856922
51920H56922j6545k1772k6384k9129k9821k9034k7325k5130k2858k0441j7174
$$ 856922 840377 818605 792221 763092 733271 704237 676912 651782 628924 608483 591309
51909E91309j2816q471n429l436j134J920M841O961Q504R529R491Q374P094O112
$$ 591309 578493 570022 564593 561157 560023 561943 566784 573745 582249 591778 601269 609643 616737 622849
51895F22849M605J718k175o129r808j3197j5744j6675j5960j4311j2370j0320
$$ 622849 627454 629172 626997 620868 611060 597863 582119 565444 549484 535173 522803 512483
51883E12483q036n338k255P29L039M704O307Q117R792J1074J2207J3285J3792
$$ 512483 504447 499109 496854 497583 500622 505326 511633 519750 529542 540616 552823 566108 579900
51870E79900J3137J1242Q368M797J041k160m425o010p241q007q032p281n877l978
$$ 579900 593037 604279 612647 617444 618485 616325 611900 605890 598649 590642 582610 575329 569452 565474
51856E65474j886N8J795L373M438M463L561K465J534L62j399l419n197o566p451
$$ 565474 563588 563646 565441 568814 573252 577715 581276 583741 585275 585637 584238 580819 575622 569056 561605
51841E61605p685p445p404q037r087r870r765q342n636k484p7J115J545J690J569
$$ 561605 553920 546475 539071 531034 521947 512077 502312 493970 488334 485850 485773 486888 488433 490123 491692
51826D91692J259J097J039M99p70k236l309l921m053l371j866k36Q58J493K030
$$ 491692 492951 494048 495087 495586 494816 492580 489271 485350 481297 477926 476060 475824 476682 478175 480205
51811D80205K419K438K197J971J801J547J037Q2j238k185j977r79n04j066j635
$$ 480205 482624 485062 487259 489230 491031 492578 493615 493697 492459 490274 488297 487318 486814 485748 484113
51796D84113j167l8P18R26J060J084M28r91k494l381l390k555j147K41R91R55
$$ 484113 482946 482908 483626 484552 485612 486696 487124 486133 483639 480258 476868 474313 473166 473407 474398 475353
51780D75353M66o1l89m61l43r4M09J268K270L197M370O348Q975J1255J2435J2710
$$ 475353 475819 475758 475369 474908 474565 474471 474880 476148 478418 481615 485985 492333 501308 512563 524998 537708
51764E37708J2635J2351J1686J0473Q401N145J007k928n807p819r711j1752j3512
$$ 537708 550343 562694 574380 584853 593254 598399 599406 596478 590671 582852 573141 561389 547877
51751E47877j4356j3941j2536j0962r864q916p266m814k451q40L06J513K849M259
$$ 547877 533521 519580 507044 496082 486218 477302 470036 465222 462771 461931 462237 463750 466599 470858
51737D70858N895P552Q518Q505Q155Q097Q121P816P261O455M800K110m56j463
$$ 470858 476753 484305 492823 501328 509483 517580 525701 533517 540778 547233 552033 554143 553687 552224
51723E52224r20L1Q13J740K659K439K59l181o233p691p422o012m132k271q96n91
$$ 552224 551304 551335 552148 553888 556547 558986 559245 556064 549831 542140 534718 528706 524574 522303 521407 520816
51707E20816j688l622n055m988l599j718J86K152M048N278N240L860J668m91j882
$$ 520816 519128 515506 510451 505463 501864 500146 500332 502484 506532 511810 517050 520910 522578 522087 520205
51692E20205k202j663p62L7N39Q47R69L84j611m742p403q107p059n581m254k550
$$ 520205 518003 516340 515578 515615 516154 517001 517970 518354 516743 512001 504598 496491 489432 483851 479597 477047
51676D77047k66J742K647K678K560K515K292J790J357J698L524O769J0219J2523
$$ 477047 476781 478523 481170 483848 486408 488923 491215 493005 494362 496060 499584 506353 516572 529095
51662E29095J3548J4026J3964J2437R092M736J89m386q475j0774j0540q516n800
$$ 529095 542643 556669 570633 583070 592162 596898 597087 592701 584226 573452 562912 554396 548596
51649E48596k614J018M283O252O902O493M424p1o242j1807j4746j4783j3106j1124
$$ 548596 545982 547000 551283 557535 564437 570930 575354 575283 569041 557234 542488 527705 514599 503475
51635E03475r418p682n666l914l099k819j976m04R14J536K207L254L545K062m20
$$ 503475 494057 486375 480709 476795 473696 470877 468901 468497 469411 470947 473154 476408 479953 482015 481595
51620D81595k238k828k830k830k961l249l517l316k655k308k713l180k965k457
$$ 481595 479357 476529 473699 470869 467908 464659 461142 457826 455171 452863 450150 446970 444005 441548
51606D41548k401k613k462j997j603j035N1J159J674K238M110P299J0452J2558
$$ 441548 439147 436534 434072 432075 430472 429437 429488 430647 432321 434559 438669 445968 456420 468978
51592D68978J3761J4439J4460J3377J0703O085J6n740r265j0056q971o971m655
$$ 468978 482739 497178 511638 525015 535718 541803 541819 536079 526814 516758 507787 500816 496161
51579D96161k583r80P96L576P094J0242J2555J4635J7084J9748K2080K3640K4314
$$ 496161 493578 492598 493394 496970 504064 514306 526861 541496 558580 578328 600408 624048 648362
51566F48362K4629K5674K7937L0396L1509L1104L0600L1477L4216L8427M3078
$$ 648362 672991 698665 726602 756998 788507 819611 850211 881688 915904 954331 997409
51555I97409M6610M7674M5965M1755L4782K4432J1093l449j7157k8852l8186m5178
$$ 997409 1044019 1091693 1137658 1179413 1214195 1238627 1249720 1246271 1229114 1200262 1162076 1116898
51543A116898m9918n2394n2648n1230m9099m6538m2763l7211l0794k5092k0689
$$ 1116898 1066980 1014586 961938 910708 861609 815071 772308 735097 704303 679211 658522
51532F58522j7124j4057j1479r098o591m356l042k444j889j519k128l720n317
$$ 658522 641398 627341 615862 606764 600173 595817 592775 590331 588442 586923 584795 581075 575758
51519E75758o338p166q093q711q610p977p169o307n491m851m313l806l638m094
$$ 575758 569420 562254 554161 545450 536840 528863 521694 515387 509896 505045 500732 496926 493288 489194
51505D89194m792n134n189n389n515m950l794k798k137j238M9J059J316J141J020
$$ 489194 484402 479268 474079 468690 463175 458225 454431 451633 449496 448258 448307 449366 450682 451823 452843
51490D52843J086J371J839K047J498M86j10j8J27k38j008j812k343k257j449n02
$$ 452843 453929 455300 457139 459186 460684 461170 461060 461042 461169 460931 459923 458111 455768 453511 452062 451560
51474D51560k03o19j253j969k947l889m190l920l691l571l055k116j335q63k96
$$ 451560 451357 450738 449485 447516 444569 440680 436490 432570 428879 425308 422253 420137 418802 417939 417643
51459D17643L02K90m12j056j227j283j356r34J41J176J582J649J918K527L498
$$ 417643 417945 418235 417823 416767 415540 414257 412901 411967 412108 413284 414866 416515 418433 420960 424458
51444D24458N031P145R581J2254J5127J7560J8501J7532J5039J1371O743K043
$$ 424458 429489 436634 446215 458469 473596 491156 509657 527189 542228 553599 560342 562385
51432E62385j313k688k603j749n92j05j469m498p339q459q122p460p000o640o273
$$ 562385 561072 558384 555781 554032 553440 553335 551866 547368 540029 531570 523448 515988 508988 502348 496075
51417D96075n733m766l561k683k212j632q95n79o62k52Q95J678J263M61M82J129
$$ 496075 490342 485576 482015 479332 477120 475488 474593 474014 473352 473100 473995 475673 476936 477397 477879 479008
51401D79008J300P50L65Q76K137L525M480M773M697M872N661O975Q694J0769J2875
$$ 479008 480308 481058 481423 482299 484436 487961 492441 497214 501911 506783 512444 519419 528113 538882 551757
51386E51757J4665J6540J9425K3575K8329L3285L8864M5401N2508N9622O6244
$$ 551757 566422 582962 602387 625962 654291 687576 726440 771841 824349 883971 950215
51375I50215P1329P3614P3168P1302O8044O0903M7504K8797Q515j0098k5959l9218
$$ 950215 1021544 1095158 1168326 1239628 1307672 1368575 1416079 1444876 1453391 1443293 1417334 1378116
51363A378116n0081n8624o4801o8404o9413o8319o5691o1739n6688n1166m5769
$$ 1378116 1328035 1269411 1204610 1136206 1066793 998474 932783 871044 814356 763190 717421
51352G17421m0564l5505l0784k6407k1967j7493j3913j2013j1347j0885j0236
$$ 717421 676857 641352 610568 584161 562194 544701 530788 518775 507428 496543 486307
51341D86307r579q838p785o594n544m460l181k258k351l055l199k307j083l41
$$ 486307 476728 467890 460105 453511 447967 443507 440326 438068 435717 432662 429463 427156 426073 425732
51327D25732m2M01J263K173K578K398K159K283K462K151J531J242J141K69j574
$$ 425732 425690 426091 427354 429527 432105 434503 436662 438945 441407 443558 445089 446331 447472 447741 446167
51312D46167l105l049j731n02r8k41l97l15l3J26j75p47r76p83q90j733k746l132
$$ 446167 443062 440013 438282 437780 437682 437441 437044 436729 436696 436822 436647 435900 434924 434141 433251 431518 428772 425640
51294D25640k862k398k023j888k117k406k095j153l82j97R2J165K733M280N925
$$ 425640 422778 420380 418357 416469 414352 411946 409851 408698 408316 408119 408211 409376 412109 416389 422314
51279D22314P665Q615Q141O985O188N459L897J841O27O24Q41N14N5J50Q36J758
$$ 422314 429979 438594 446735 453720 459908 465367 469264 471105 471732 472356 473197 473711 473766 473916 474752 476510
51263D76510K653L371L879M193M072K968Q66j317k720l584m601n595n818n344
$$ 476510 479163 482534 486413 490606 494678 497646 498512 497195 494475 490891 486290 480695 474877 469533
51249D69533n105n531o020n939n393m768m138l362k415j433o87m54p20j076j209
$$ 469533 464428 458897 452877 446938 441545 436777 432639 429277 426862 425429 424742 424288 423568 422492 421283
51234D21283j192j167j021p01l99j21M11J115J434J286J391K035K348J652P68
$$ 421283 420091 418924 417903 417202 416803 416682 417093 418208 419642 420928 422319 424354 426702 428354 429122
51219D29122Q75J695J988J493J086J226J460J466J456J457J196P86O81Q36Q22
$$ 429122 429997 431692 433680 435173 436259 437485 438945 440411 441867 443324 444520 445306 445987 446823 447645
51204D47645P82J373K625L788M402M732M886M446L244J804O35l24j252j969k191
$$ 447645 448427 449800 452425 456213 460615 465347 470233 474679 477923 479727 480362 480038 478786 476817 474626
51189D74626j879j201m36L7N6j03j67k85n86o47j23L73r7j386k379k529k407k503
$$ 474626 472747 471546 471110 471147 471203 471100 470933 470648 470062 469415 469292 469665 469568 468182 465803 463274 460867 458364
51171D58364k435j696n21M76R84J042P89N15P04J660L178M583N108M429L038J836
$$ 458364 455929 454233 453712 454188 455172 456214 457003 457518 458222 459882 463060 467643 472751 477180 480218 482054
51155D82054J140M32o38j615k068k428l183l751l218j929j235j696k465k644k334
$$ 482054 483194 483626 482988 481373 479305 476877 473694 469943 466725 464796 463561 461865 459400 456756 454422
51140D54422k103k113k139j933j383o40p3J54L66Q27J209J143R41J147J738K398
$$ 454422 452319 450206 448067 446134 444751 444111 444038 444192 444558 445385 446594 447737 448678 449825 451563 453961
51124D53961L183M117M584M069L154K727K586J973J199J291K137K463J813J117
$$ 453961 457144 461261 465845 469914 473068 475795 478381 480354 481553 482844 484981 487444 489257 490374
51110D90374J081J323J539K085K856K891J896R80J109J781K038J858J588R70k49
$$ 490374 491455 492778 494317 496402 499258 502149 504045 505025 506134 507915 509953 511811 513399 514369 514120
51095E14120j362j435o82j56k83n36m25j43j48n43r69r20k85L93M73O3j79k4O9
$$ 514120 512758 511323 510641 510485 510202 509666 509241 509098 508950 508407 507438 506518 506233 506626 507099 507162 506983 506959 507028
51076E07028j26j67K87R14J306J557J948K494L179M096N122N916O580P708R494
$$ 507028 506902 506735 507022 507936 509242 510799 512747 515241 518420 522516 527638 533554 540134 547842 557336
51061E57336J1355J2898J4651J7343K0855K4302K6616K6788K4223J9493J4355
$$ 557336 568691 581589 596240 613583 634438 658740 685356 712144 736367 755860 770215
51050G70215J0423Q215P703Q974J1423J2922J1140O009J57l703n401p056j0284
$$ 770215 780638 788853 796556 805530 816953 829875 841015 847024 847181 843478 838077 831021 820737
51037H20737j4219j6522j6039j3720j0861p635m177k181l644q067j2437j4429
$$ 820737 806518 789996 773957 760237 749376 741741 737564 735383 731739 723672 711235 696806
51025F96806j4352j3438j1770q961n806l704k886k296j037R58L370N772P617Q775
$$ 696806 682454 669016 657246 648285 642479 638775 635889 633593 632556 633514 636884 642656 650273 659048
51011F59048R904J1576J3244J3891J3514J3148J3340J3436J2545J0564Q050N640
$$ 659048 668952 680528 693772 707663 721177 734325 747665 761101 773646 784210 792260 797900
50999G97900L784K611J757O43q83k431l641m561n352n954o142n761m726l072j077
$$ 797900 801684 804295 806052 806695 805812 803381 799740 795179 789827 783873 777731 771970 767244 764172 763095
50984G63095Q69K673M768P706J1518J5535J8882K1219K2931K4517K5874K6448
$$ 763095 763964 766637 771405 779111 790629 806164 825046 846265 869196 893713 919587 946035
50972I46035K6129K5733K6324K8267L1177L4747L9186M4697N0852N6806O2072
$$ 946035 972164 997897 1024221 1052488 1083665 1118412 1157598 1202295 1253147 1309953 1372025
50961A372025O6743P0984P4637P7443P9282P9891P8676P5312P0240O4075N6778
$$ 1372025 1438768 1509752 1584389 1661832 1741114 1821005 1899681 1974993 2045233 2109308 2166086
50950B166086M8113L8812L0227K2731J5426P868J037m034p549j0075j1301j0870
$$ 2166086 2214199 2253011 2283238 2305969 2321395 2329263 2330300 2326266 2318717 2308642 2297341 2286471
50938B286471r794r812j1569j4446j7804k1294k4227k5954k6828k7754k8928l0067
$$ 2286471 2276677 2266865 2255296 2240850 2223046 2201752 2177525 2151571 2124743 2096989 2068061 2037994
50926B037994l1658l4662l8970m3383m7229n0739n3787n5660n6392n6858n7173
$$ 2037994 2006336 1971674 1932704 1889321 1842092 1791353 1737566 1681906 1625514 1568656 1511483
50915A511483n6289n3719n0336m6809m2653l7652l2965k9776k7773k5928k3967
$$ 1511483 1455194 1401475 1351139 1304330 1261677 1224025 1191060 1161284 1133511 1107583 1083616
50904A083616k2142k0372j8600j7242j6372j5138j3039j1009j0185j0144r516
$$ 1083616 1061474 1041102 1022502 1005260 988888 973750 960711 949702 939517 929373 919857
50893I19857p875n935m145k327o10L92N19L95N89J012J322J493J837K687M004
$$ 919857 911982 906047 901902 899575 898965 899357 899876 900271 900860 901872 903194 904687 906524 909211 913215
50878I13215N289O075O582P448Q762R976J0891J1979J3383J4492J4994J5609J7040
$$ 913215 918504 924579 931161 938609 947371 957347 968238 980217 993600 1008092 1023086 1038695 1055735
50865A055735J8998K0916K2966K5526K8310L0935L3801L7529M1928M6443N1253
$$ 1055735 1074733 1095649 1118615 1144141 1172451 1203386 1237187 1274716 1316644 1363087 1414340
50854A414340N7122O4363P2753Q2078R2078J02190J12148J22429J33383J44278
$$ 1414340 1471462 1535825 1608578 1690656 1782734 1884924 1997072 2119501 2252884 2397162
50844B397162J54021J62403J69754J75753J79559J80757J79125J73759J63455
$$ 2397162 2551183 2713586 2883340 3059093 3238652 3419409 3598534 3772293 3935748
50835C935748J47954J28004J04507P8593N2093K6694K703k0135m0710n6800o7378
$$ 3935748 4083702 4211706 4316213 4394806 4446899 4473593 4476296 4456161 4415451 4358651 4291273
50824D291273p3345p5620p3916o8007n9032m8681l7987k7829j9861j5892j6534
$$ 4291273 4217928 4142308 4068392 4000385 3941353 3892672 3854685 3826856 3806995 3791103 3774569
50813C774569k1228k9377m0759n4845p0346q5649r9582j11718j22091j30679j37157
$$ 3774569 3753341 3723964 3683205 3628360 3558014 3472365 3372783 3261065 3138974 3008295 2871138
50802B871138j41073j42031j39682j33923j25447j15692j05784r5731q5189p4641
$$ 2871138 2730065 2588034 2448352 2314429 2188982 2073290 1967506 1871775 1786586 1711945
50792A711945o5086n6696m8675m0553l2805k5973j9962j4600j0281p417n703m433
$$ 1711945 1646859 1590163 1541488 1500935 1468130 1442157 1422195 1407595 1397314 1389897 1384194 1379761
50780A379761l272k350j851j839k347l276m327n264o186p323q666j0003j1206
$$ 1379761 1376489 1374139 1372288 1370449 1368102 1364826 1360499 1355235 1349049 1341726 1333060 1323057 1311851
50767A311851j2351j3574j4872j5992j6554j6388j5845j5536j5596j5421j4308
$$ 1311851 1299500 1285926 1271054 1255062 1238508 1222120 1206275 1190739 1175143 1159722 1145414
50756A145414j2351j0429r217q438p223n152k563R3K786N565Q259J0946J4316
$$ 1145414 1133063 1122634 1113417 1104979 1097756 1092604 1090041 1090134 1092920 1098485 1106744 1117690 1132006
50743A132006J8870K3951K8391L2127L6334M1725M7611N3040N7999O2990O8015
$$ 1132006 1150876 1174827 1203218 1235345 1271679 1313404 1361015 1414055 1472054 1535044 1603059
50732A603059P2725P7006Q0822Q3810Q5748Q7084Q8354Q9348Q9408Q8375Q6583
$$ 1603059 1675784 1752790 1833612 1917422 2003170 2090254 2178608 2267956 2357364 2445739 2532322
50721B532322Q4046Q0200P4342O5996N4939M1302K5502P976j0632k8852m4596
$$ 2532322 2616368 2696568 2770910 2836906 2891845 2933147 2958649 2966625 2955993 2927141 2882545
50710B882545n6538o4701o9228o9347o4526n6051m6343l6895k7787j9068j1464
$$ 2882545 2826007 2761306 2692078 2622731 2558205 2502154 2455811 2418916 2391129 2372061 2360597
50699B360597n728k199j227l154p797j4576k3321l4115m6195n7775o7264p4110
$$ 2360597 2354869 2352670 2351443 2348289 2340492 2325916 2302595 2268480 2222285 2164510 2097246 2023136
50687B023136p8321p9889p9021p6321p2251o6766n9843n2017m4101l6511k9129
$$ 2023136 1944815 1864926 1785905 1709584 1637333 1570567 1510724 1458707 1414606 1378095 1348966
50676A348966k1755j4539q008k539K190O990J2188J7142K1010K3604K5137K5532
$$ 1348966 1327211 1312672 1304664 1302125 1304315 1311305 1323493 1340635 1361645 1385249 1410386 1435918
50664A435918K4606K2724K0605J8616J6774J5305J4550J4465J4730J5310J6315
$$ 1435918 1460524 1483248 1503853 1522469 1539243 1554548 1569098 1583563 1598293 1613603 1629918
50653A629918J7471J8358J9092K0149K1571K3021K4583K6808K9941L3620L7452
$$ 1629918 1647389 1665747 1684839 1704988 1726559 1749580 1774163 1800971 1830912 1864532 1901984
50642A901984M1358M5320M9265N3143N6656N9085N9946N9674N9013N7918N5788
$$ 1901984 1943342 1988662 2037927 2091070 2147726 2206811 2266757 2326431 2385444 2443362 2499150
50631B499150N2601M9057M5733M2895M0909L9806L8569L5865L1318K4734J4236
$$ 2499150 2551751 2600808 2646541 2689436 2730345 2770151 2808720 2844585 2875903 2900637 2914873
50620B914873k658k4950m6568o0433o3819n9055n0030l9403k8610j8613r910k524
$$ 2914873 2912215 2887265 2840697 2780264 2716445 2657390 2607360 2567957 2539347 2520734 2510824 2508300
50608B508300L399P354Q933Q099M774j398j0517k1825l3960m5842n7013o6996
$$ 2508300 2511699 2519053 2527986 2536085 2540859 2539461 2528944 2507119 2473159 2427317 2370304 2303308
50596B303308p4738p9139q0204p9112p6903p3618o9112o4135n9818n6348n2957
$$ 2303308 2228570 2149431 2069227 1990115 1913212 1839594 1770482 1706347 1646529 1590181 1537224
50585A537224m9183m5430m2130l9105l6076l3190l0690k8334k5562k2087j8125
$$ 1537224 1488041 1442611 1400481 1361376 1325300 1292110 1261420 1233086 1207524 1185437 1167312
50574A167312j4176j0605p317l906k75L077N656P655R640J1715J3518J4932J6279
$$ 1167312 1153136 1142531 1135214 1131308 1131033 1134110 1139766 1147421 1157061 1168776 1182294 1197226 1213505
50561A213505J7804J9374K0824K2188K3620K5225K6861K7966K7960K7143K6655
$$ 1213505 1231309 1250683 1271507 1293695 1317315 1342540 1369401 1397367 1425327 1452470 1479125
50550A479125K7057K7446K6717K5200K4115K3792K3571K3287K3743K5538K8438
$$ 1479125 1506182 1533628 1560345 1585545 1609660 1633452 1657023 1680310 1704053 1729591 1758029
50539A758029L2081L6430M1289M6255N1387N7217O3931P1218P8976Q7265R5528
$$ 1758029 1790110 1826540 1867829 1914084 1965471 2022688 2086619 2157837 2236813 2324078 2419606
50528B419606J02746J08713J14331J20432J27012J33643J39652J43737J44560
$$ 2419606 2522352 2631065 2745396 2865828 2992840 3126483 3266135 3409872 3554432
50519C554432J42121J37591J31356J22281J09388R3172P4554N3595L0141N041
$$ 3554432 3696553 3834144 3965500 4087781 4197169 4290341 4364895 4418490 4448631 4453672
50509D453672k0168m4316o6653q6345j02674j15307j23867j27635j26198j19973
$$ 4453672 4433504 4389188 4322535 4236190 4133516 4018209 3894342 3766707 3640509 3520536
50499C520536j09631r5521p8051n8123l6774j4938O138K4962M0760N3498O2329
$$ 3520536 3410905 3315384 3237333 3179210 3142436 3127498 3133636 3158598 3199358 3252856 3315185
50488C315185O4908N9213M5441K5419Q21k6950n5693q2554j05311j22867j34761
$$ 3315185 3380093 3439306 3484747 3510166 3510987 3484037 3428344 3345790 3240479 3117612 2982851
50477B982851j41077j42746j41098j36913j30416j22068j12697j02952r3143q3627
$$ 2982851 2841774 2699028 2557930 2421017 2290601 2168533 2055836 1952884 1859741 1776114
50467A776114p4787o6614n8833n1540m5367m0885l7983l5775l3047k9029k3937
$$ 1776114 1701327 1634713 1575880 1524340 1478973 1438088 1400105 1364330 1331283 1302254 1278317
50456A278317j8669j3921r816o301l330n38K671O334R778J2486J4652J6648J8541
$$ 1278317 1259648 1245727 1235911 1229610 1226280 1225742 1228413 1234747 1244525 1257011 1271663 1288311 1306852
50443A306852K0444K2685K5160K7122K8019K7848K6343K2753J7199J1447P384
$$ 1306852 1327296 1349981 1375141 1402263 1430282 1458130 1484473 1507226 1524425 1535872 1543256
50432A543256N182L847K916K604K631K192J068p1n60k45P52K191L749N514Q284
$$ 1543256 1548438 1552285 1555201 1557805 1560436 1562628 1563696 1563625 1563065 1562820 1563572 1565763 1569512 1575026 1583310
50417A583310J2696J8208K3672K8684L3751L9316M5409N2040N8997O5324O9848
$$ 1583310 1596006 1614214 1637886 1666570 1700321 1739637 1785046 1837086 1896083 1961407 2031255
50406B031255P2365P3578P3860P2857P0430O7045O2931N7638N0769M2547L3140
$$ 2031255 2103620 2177198 2251058 2323915 2394345 2461390 2524321 2581959 2632728 2675275 2708415
50395B708415K2051Q767o297k1996l7433n2186o5645p6570q3709q6795q6640q4024
$$ 2708415 2730466 2739233 2732936 2710940 2673507 2621321 2555676 2479106 2395397 2308602 2221962 2137938
50383B137938p8684o9928n8220m5523l3654k2764j1921q07R761J8653K4998K8109
$$ 2137938 2059254 1989326 1931106 1885583 1851929 1829165 1817244 1816437 1826198 1844851 1869849 1897958
50371A897958K7606K3770J7230Q219l247j6291k8947l9459m7519n3859n8852o1950
$$ 1897958 1925564 1949334 1966564 1974783 1971536 1955245 1926298 1886839 1839320 1785461 1726609 1664659
50359A664659o2463o0587n7372n3718m9704m5048l9974l5152l0795k6395k1575
$$ 1664659 1602196 1541609 1484237 1430519 1380815 1335767 1295793 1260641 1229846 1203451 1181876
50348A181876j6768j2643r351o765n201n342p464j1067j5188j8748k0759k0659
$$ 1181876 1165108 1152465 1143114 1136349 1131148 1125806 1118342 1107275 1092087 1073339 1052580 1031921
50336A031921j8637j5481j2129r295p229n634m014k277p23N65J983L822N805P463
$$ 1031921 1013284 997803 985674 976379 969150 963516 959502 957225 956502 957067 959050 962872 968677 976140
50322I76140Q596R163R127Q752Q617Q926R156Q742P710O363M778L092J817J327
$$ 976140 984736 993899 1003026 1011778 1020395 1029321 1038477 1047219 1054929 1061292 1066070 1069162 1070979 1072306
50308A072306J436J874K749M026N187O011P194R314J1714J3343J4478J6566K0470
$$ 1072306 1073742 1075616 1078365 1082391 1087578 1093589 1100783 1110097 1121811 1135154 1149632 1166198 1186668
50295A186668K5822L2040L8852M5612N1089N4372N4998N1526M0920K0983o120
$$ 1186668 1212490 1244530 1283382 1328994 1380083 1434455 1489453 1540979 1581899 1602882 1596762
50284A596762l3366n2857o0885n9491n3449m6172l8553l0748k3608j7991j3682
$$ 1596762 1563396 1510539 1449654 1390163 1336714 1290542 1251989 1221241 1197633 1179642 1165960
50273A165960r879o351l488j471o4R59J745K487L236L752L963M272M997N843O489
$$ 1165960 1156081 1149730 1146242 1144771 1144707 1145666 1147411 1149898 1153134 1156886 1160849 1165121 1170118 1175961 1182450
50258A182450P286Q809J1011J3428J5909J8437K0484K1301K0803J9576J8182J6932
$$ 1182450 1189736 1198545 1209556 1222984 1238893 1257330 1277814 1299115 1319918 1339494 1357676 1374608
50246A374608J6136J5897J5802J5361J4617J3816J2684J0679P619L515j767p863
$$ 1374608 1390744 1406641 1422443 1437804 1452421 1466237 1478921 1489600 1497219 1500734 1498967 1491104
50234A491104j3388j7045j9054k0473k1329k0580j7909j4388j1156q601p101p532
$$ 1491104 1477716 1460671 1441617 1421144 1399815 1379235 1361326 1346938 1335782 1327181 1320080 1312548
50222A312548j0463j5508k1819k8429l3929l6764l6501l4255l1386k8391k5314
$$ 1312548 1302085 1286577 1264758 1236329 1202400 1165636 1129135 1094880 1063494 1035103 1009789
50211A009789k2449k0021j7775j5483j3433j1908j0647r324q216p798p951q072
$$ 1009789 987340 967319 949544 934061 920628 908720 898073 888749 880533 872735 864784 856712
50199H56712p761p039o102n233m770m811n028n100n087n144n028m316l072k011
$$ 856712 848951 841912 835810 830577 825807 820996 815968 810868 805781 800637 795609 791293 788221 786210
50185G86210j846k582l525l929l633l035k545k260k155k308k686k917k605j733
$$ 786210 784364 781782 778257 774328 770695 767660 765115 762855 760700 758392 755706 752789 750184 748451
50171G48451o02M77J215J375J144J230K121L405M204M201L840L712M154N170O311
$$ 748451 747849 748326 749541 750916 752060 753290 755411 758816 763020 767221 771061 774773 778927 784097 790408
50156G90408O752O088N042M873O182Q555J1225J3591J5283J6254J6778J7028J6828
$$ 790408 797160 803248 808290 813163 819345 827900 839125 852716 867999 884253 901031 918059 934887
50143I34887J6282J6231J7520K0047K3134K6473L0051L3468L6276L8771M1497
$$ 934887 951169 967400 984920 1004967 1028101 1054574 1084625 1118093 1154369 1193140 1234637
50132A234637M4097M5621M5915M5720M5354M4424M2955M1582M0146L7066L0857
$$ 1234637 1278734 1324355 1370270 1415990 1461344 1505768 1548723 1590305 1630451 1667517 1698374
50121A698374K1639J0747n26j1362k1280l0121l7834m4019m8100n0086n0481m9334
$$ 1698374 1720013 1730760 1730234 1718872 1697592 1667471 1629637 1585618 1537518 1487432 1436951 1387617
50109A387617m6204m1433l6531l2664k9406k5758k1852j8873j7563j7531j7933
$$ 1387617 1341413 1299980 1263449 1230785 1201379 1175621 1153769 1134896 1117333 1099802 1081869
50098A081869j8293j8602j8932j9120j8788j7756j6282j4647j2654j0048p260
$$ 1081869 1063576 1044974 1026042 1006922 988134 970378 954096 939449 926795 916747 909487
50087I09487n102l664k205l56J270J921J625R58M97P34J890L438M338M203L746
$$ 909487 904385 900721 898516 898160 899430 901351 902976 903934 904431 905165 907055 910493 914831 919034 922780
50072I22780L754M134M412M571M821M882M255L031J930J449J337R45q8j478k610
$$ 922780 926534 930668 935080 939651 944472 949354 953609 956640 958570 960019 961356 962301 962213 960735 958125
50057I58125l202l541l945m235m105l789l778m022l951l326k466j641p57L01J586
$$ 958125 954923 951382 947437 943202 939097 935308 931530 927508 923557 920231 917765 916124 915367 915668 917254
50042I17254L254N290P157Q455R708J1623J3670J4520J4113J4002J5272J7186
$$ 917254 920508 925798 932955 941410 951118 962741 976411 990931 1005044 1019046 1034318 1051504
50030A051504J8505J9039J9141J8659J7442J6229J5939J6446J6857J6829J6851
$$ 1051504 1070009 1089048 1108189 1126848 1144290 1160519 1176458 1192904 1209761 1226590 1243441
50019A243441J7446J8718K0522K2500K4032K4524K3643K1109J6771J1270O212
$$ 1243441 1260887 1279605 1300127 1322627 1346659 1371183 1394826 1415935 1432706 1443976 1450188
50008A450188L155K550L831N976P656P435M664k1n466j1069j6727k2145k6680
$$ 1450188 1453343 1455893 1459724 1465700 1473356 1480791 1485455 1485434 1479968 1468899 1452172 1430027 1403347
49995A403347k9753l1150l1143l0520l0064k9772k8943k7276k5390k4020k3199
$$ 1403347 1373594 1342444 1311301 1280781 1250717 1220945 1192002 1164726 1139336 1115316 1092117
49984A092117k2640k2353k2490k2835k2988k2748k2071k0915j9355j7533j5453
$$ 1092117 1069477 1047124 1024634 1001799 978811 956063 933992 913077 893722 876189 860736
49973H60736j3225j1440j0579j0024q618o380m688m345m587m545m509m930n138
$$ 860736 847511 836071 825492 815468 806850 800470 795782 791437 786850 782305 777796 772866 767728
49960G67728m258k611j139J13J792L952O036P863R709J1453J2573J2938J2923
$$ 767728 763470 760859 759720 759833 761625 765577 771613 779476 789185 800638 813211 826149 839072
49947H39072J2826J2695J2469J1798J0007O919L387M78j482k633l080l377m770
$$ 839072 851898 864593 877062 888860 898867 905786 909173 909651 908169 905536 902456 899079 894309
49934H94309p818j1257j3465j4672j6394j8844k0365j9742j7697j5584j3671j1450
$$ 894309 886491 875234 861769 847097 830703 811859 791494 771752 754055 738471 724800 713350
49922G13350q857o432m563l216k174j167Q9J644L184M312M881M985M777M421M191
$$ 713350 704493 698061 693498 690282 688108 686941 687030 688674 691858 696170 701051 706036 710813 715234 719425
$$ [...]
##END NTUPLES=NMR SPECTRUM
##END=
