##TITLE=AC1440_SSAAH13249_7790636_gdzuSHX3Wd
##JCAMPDX= 6.0         $$ Bruker NMR JCAMP-DX V2.0
##DATA TYPE= NMR SPECTRUM
##DATA CLASS= NTUPLES
##ORIGIN= BRUKER
##OWNER= Administrator
$$ 1.72 TOPSPIN		Version 2.1
$$ 2013-04-17 02:30:38.096 -0700  Administrator@X
$$ Compression mode = diff/dup
##.OBSERVE FREQUENCY= 400.02188249412
##.OBSERVE NUCLEUS= ^1H
##.ACQUISITION MODE= SIMULTANEOUS (DQD)
##.ACQUISITION SCHEME= undefined
##.AVERAGES= 64
##.DIGITISER RES= 22
##SPECTROMETER/DATA SYSTEM= spect
##.PULSE SEQUENCE= noesygpps1d.comp
##.SOLVENT NAME= COFFEE_meoh
##.SHIFT REFERENCE= INTERNAL, COFFEE_meoh, 1, 14.96117
##AUDIT TRAIL= $$ (NUMBER, WHEN, WHO, WHERE, PROCESS, VERSION, WHAT)
$$ ##TITLE= Audit trail, TOPSPIN		Version 2.1
$$ ##JCAMPDX= 5.01
$$ ##ORIGIN= Bruker BioSpin GmbH
$$ ##OWNER= Administrator
$$ $$ E:\/data/COFFEE/nmr/AC1440_SSAAH13249_7790636_gdzuSHX3Wd/12/pdata/1/auditp.txt
$$ ##AUDIT TRAIL=  $$ (NUMBER, WHEN, WHO, WHERE, PROCESS, VERSION, WHAT)
(   1,<2013-04-17 02:30:32.744 -0700>,<Administrator>,<X>,<go>,<TOPSPIN 2.1>,
      <created by zg
	started at 2013-04-17 02:19:02.067 -0700,
	POWCHK enabled, PULCHK disabled,
       configuration hash MD5:
       33 CF 6A 21 5C D3 B9 40 6C 15 AA 8D 27 A2 4F 13
       data hash MD5: 64K
       FD 81 33 B4 3A 22 DB 4D 0D 2B 1C 66 92 03 4E 0A>)
(   2,<2013-04-17 02:30:36.116 -0700>,<Administrator>,<X>,<proc1d>,<TOPSPIN 2.1>,
      <Start of raw data processing
       efp LB = 0.3 FT_mod = 6 PKNL = 1 PHC0 = 0 PHC1 = 0 SI = 128K 
       data hash MD5: 128K
       AF C0 65 BB D2 53 06 CB E0 5C C0 74 8C A0 4B C4>)
(   3,<2013-04-17 02:30:37.080 -0700>,<Administrator>,<X>,<proc1d>,<TOPSPIN 2.1>,
      <pk PHC0 = -79.5575 PHC1 = 0 
       data hash MD5: 128K
       6E 77 DB CC 25 D3 12 1C D4 17 03 BB 8C 42 55 69>)
(   4,<2013-04-17 02:30:37.428 -0700>,<Administrator>,<X>,<proc1d>,<TOPSPIN 2.1>,
      <abs ABSG = 1 
       data hash MD5: 128K
       A8 4D 67 E6 55 94 A2 41 2D CD AA AE A7 93 20 88>)
(   5,<2013-04-17 02:30:37.679 -0700>,<Administrator>,<X>,<proc1d>,<TOPSPIN 2.1>,
      <abs ABSG = 2 
       data hash MD5: 128K
       60 16 D1 B0 B2 08 8E 03 4C DB 6C 56 2C AA 73 33>)
(   6,<2013-04-17 02:30:37.790 -0700>,<Administrator>,<X>,<proc1d>,<TOPSPIN 2.1>,
      <abs ABSG = 3 
       data hash MD5: 128K
       85 D9 B3 DB 1C 7F BA 94 BC 1D 81 A7 6E 82 40 D7>)
(   7,<2013-04-17 02:30:37.874 -0700>,<Administrator>,<X>,<proc1d>,<TOPSPIN 2.1>,
      <abs ABSG = 4 
       data hash MD5: 128K
       BF 50 E5 65 29 95 BB 19 EE 8F ED E9 9C 02 A3 D7>)
(   8,<2013-04-17 02:30:37.957 -0700>,<Administrator>,<X>,<proc1d>,<TOPSPIN 2.1>,
      <abs ABSG = 5 
       data hash MD5: 128K
       4B DC 78 37 B9 8B 90 57 8D 44 FA 76 07 A4 F8 8C>)
$$ ##END=
$$ 
$$ $$ hash MD5
$$ $$ 39 85 77 F0 66 01 02 C8 CC D3 F3 39 FD E0 0A FB
##$RELAX= 
##$RELAX= 
##$RELAX= 
##$RELAX= 
##$RELAX= 
##$RELAX= 
##$RELAX= 
##$RELAX= 
$$ Bruker specific parameters
$$ --------------------------
##$DU= <E:\>
##$EXPNO= 12
$$ [...]
150 150 150 150 150 150 150 150
##$TP07= 0
##$TPNAME0= <>
##$TPNAME1= <>
##$TPNAME2= <>
##$TPNAME3= <>
##$TPNAME4= <>
##$TPNAME5= <>
##$TPNAME6= <>
##$TPNAME7= <>
##$TPOAL= (0..7)
0.5 0.5 0.5 0.5 0.5 0.5 0.5 0.5
##$TPOFFS= (0..7)
0 0 0 0 0 0 0 0
##$TUNHIN= 0
##$TUNHOUT= 0
##$TUNXOUT= 0
##$USERA1= <user>
##$USERA2= <user>
##$USERA3= <user>
##$USERA4= <user>
##$USERA5= <user>
##$V9= 5
##$VALIST= <valist>
##$VCLIST= <CCCCCCCCCCCCCCC>
##$VD= 0
##$VDLIST= <DDDDDDDDDDDDDDD>
##$VPLIST= <PPPPPPPPPPPPPPP>
##$VTLIST= <TTTTTTTTTTTTTTT>
##$WBST= 2048
##$WBSW= 25
##$XGAIN= (0..3)
0 0 0 0
##$XL= 0
##$YL= 0
##$YMAX_a= 6281610
##$YMIN_a= -14005548
##$ZGOPTNS= <>
##$ZL1= 120
##$ZL2= 120
##$ZL3= 120
##$ZL4= 120
##$ABSF1= 14.96117
##$ABSF2= -5.597012
##$ABSG= 5
##$ABSL= 3
##$ALPHA= 0
##$AQORDER= 0
##$ASSFAC= 0
##$ASSFACI= 0
##$ASSFACX= 0
##$ASSWID= 0
##$AUNMP= <proc_prof1d_extract.lims>
##$AXLEFT= 0
##$AXNAME= <>
##$AXNUC= <1H>
##$AXRIGHT= 0
##$AXTYPE= 0
##$AXUNIT= <>
##$AZFE= 0.1
##$AZFW= 0.1
##$BCFW= 0
##$BC_mod= 0
##$BYTORDP= 0
##$COROFFS= 0
##$CY= 15
##$DATMOD= 1
##$DC= 0
##$DFILT= <>
##$DTYPP= 0
##$F1P= 0
##$F2P= 0
##$FCOR= 0.5
##$FTSIZE= 131072
##$FT_mod= 6
##$GAMMA= 0
##$GB= 0
##$INTBC= 1
##$INTSCL= 1
##$ISEN= 128
##$LB= 0.3
##$LEV0= 0
##$LPBIN= 0
##$MAXI= 10000
##$MC2= 0
##$MEAN= 0
##$ME_mod= 0
##$MI= 0
##$NCOEF= 0
##$NC_proc= -2
##$NLEV= 6
##$NOISF1= 0
##$NOISF2= 0
##$NSP= 0
##$NTH_PI= 0
##$NZP= 0
##$OFFSET= 14.96117
##$PC= 1
##$PHC0= -79.5575
##$PHC1= 0
##$PH_mod= 1
##$PKNL= yes
##$PPARMOD= 0
##$PPDIAG= 0
##$PPIPTYP= 0
##$PPMPNUM= 2147483647
##$PPRESOL= 1
##$PSCAL= 4
##$PSIGN= 0
##$PYNMP= <proc.py>
##$REVERSE= no
##$SF= 400.02000956713
##$SI= 131072
##$SIGF1= 0
##$SIGF2= 0
##$SINO= 400
##$SIOLD= 131072
##$SPECTYP= <>
##$SREGLST= <1H.CDCl3>
##$SSB= 0
##$STSI= 131072
##$STSR= 0
##$SW_p= 8223.68421052631
##$SYMM= 0
##$S_DEV= 0
##$TDeff= 65536
##$TDoff= 0
##$TI= <>
##$TILT= no
##$TM1= 0
##$TM2= 0
##$TOPLEV= 0
##$USERP1= <user>
##$USERP2= <user>
##$USERP3= <user>
##$USERP4= <user>
##$USERP5= <user>
##$WDW= 1
##$XDIM= 131072
##$YMAX_p= 458678873
##$YMIN_p= -12052
##$CURPLOT= <Network HP LaserJet P1505>
##$CURPRIN= <$Network HP LaserJet P1505>
##$DFORMAT= <normdp>
##$LAYOUT= <+/1D_H.xwp>
##$LFORMAT= <normlp>
##$PFORMAT= <normpl>
##$SURQMSG= 1
$$ End of Bruker specific parameters
$$ ---------------------------------
##NTUPLES= NMR SPECTRUM
##VAR_NAME=  FREQUENCY,     SPECTRUM/REAL,   SPECTRUM/IMAG
##SYMBOL=    X,             R,               I
##VAR_TYPE=  INDEPENDENT,   DEPENDENT,       DEPENDENT
##VAR_FORM=  AFFN,          ASDF,            ASDF
##VAR_DIM=   131072,        131072,          131072
##UNITS=     HZ,            ARBITRARY UNITS, ARBITRARY UNITS
##FACTOR=    0.0627417313425164, 1,          1
##FIRST=     8223.62146879497, 1058,         -58089
##LAST=      0,             2334,            -58418
##MIN=       0,             -12052,          0
##MAX=       8223.62146879497, 458678873,    0
$$ Real data points
##PAGE= N=1
##DATA TABLE= (X++(R..R)), XYDATA
$$ [...]
65035 208083 206334 204909 203372 200897 197231 193085 189454 186666 184249 181630 178777 176160 174249 173197
65021 173197 172909 173215 173811 174215 174092 173655 173492 173886 174600 175493 176957 179365 182354 185139 187517 190080 193402
65004 193402 197429 201810 206419 211280 216196 220687 224265 226754 228466 229933 231250 231842 231352 230600 230981
64989 230981 232793 234862 236153 237036 238488 240741 243533 247147 252127 257927 262838 265511 265939 264724 262086
64974 262086 258061 253146 248084 243206 238425 233831 229771 226287 222849 218909 214601 210630 207534 205211
64960 205211 203235 201420 199824 198324 196536 194301 192007 190281 189433 189280 189297 188866 187687 186133 184949
64945 184949 184419 184161 183969 184364 185787 187647 188881 189337 189839 190881 191999 192596 192736 192821 193112 193905 195564
64928 195564 197854 199666 199967 198821 197097 195461 194097 193067 192365 191732 190973 190420 190618 191602 192937 194445
64912 194445 196383 198882 201709 204703 207939 211274 214257 216805 219558 223180 227627 232563 238213 245228
64898 245228 253699 262851 271895 280794 289888 299040 307498 314548 319973 323903 326512 328053 329001 329884 330940
64883 330940 332005 332707 332633 331275 328033 322537 315076 306650 298461 291275 285221 280131 275977 272900 270914
64868 270914 269782 269186 268863 268509 267747 266392 264627 262718 260634 258077 254795 250639 245416 239045 231952
64853 231952 225070 219340 215274 212888 211679 210653 208832 206027 202941 200421 198880 198500 199459 201510 203724
64838 203724 205203 205953 206573 207264 207663 207631 207627 208141 209164 210399 211606 212612 213315 213894 214727 215925 217287
64821 217287 218906 221421 225335 230369 235887 241739 248282 255708 263837 272570 282183 293034 305240 318627
64807 318627 332675 346441 358808 368945 376319 380268 379971 375123 366398 355015 342077 328568 315696
64794 315696 304636 295777 288530 282039 275907 270171 264916 260153 255958 252446 249646 247538 246163 245553
64780 245553 245658 246514 248360 251376 255334 259800 264635 270050 276157 282857 290261 298837 308871 320034
64766 320034 331744 343662 355520 366694 376451 384594 391515 397584 402820 407149 410669 413509 415629
64753 415629 416842 416930 415878 414189 412729 411841 410657 407783 402713 396040 388269 379103 368234 356312
64739 356312 344587 333904 324433 316091 308736 302170 296417 291972 289345 288478 288868 290095 291790 293228
64725 293228 293555 292541 290782 289086 287983 287797 288749 290724 293268 296051 299276 303465 308899 315167 321177
64710 321177 325680 327993 328167 326378 322422 316178 308392 300447 293279 286850 280695 274597 268630 262953
64696 262953 257807 253458 249953 247097 244761 242986 241750 240896 240366 240265 240640 241530 243269 246319 250696
64681 250696 255905 261634 268173 275940 284953 295013 306063 318126 331194 345364 360674 376424
64669 376424 391013 402896 411412 416325 416954 412525 403434 391517 378820 366323 353990 341731 330081
64656 330081 320031 312283 306703 302576 299420 297339 296524 296673 297256 298201 299996 303160 307848 313910 321099
64641 321099 329223 338385 349077 361869 377000 394313 413393 433560 453826 473110 490431 504818
64629 504818 515326 521580 524180 524180 522098 517673 510612 501287 490634 479616 468788 458199 447667
64616 447667 437274 427580 419212 412308 406523 401478 396970 392760 388402 383386 377421 370650 363640 356958
64602 356958 350623 344110 336992 329327 321315 312990 304579 296769 290099 284339 279041 274541 271749 270946
64588 270946 271443 272560 274381 277250 280982 285023 289206 293975 299834 306671 313683 319990 325318 329972
64574 329972 334132 337476 339592 340410 339998 338313 335562 332420 329354 325989 321636 316152 309748 302353 294020
64559 294020 285657 278442 272491 267036 261872 257656 254615 252098 249790 248301 247999 248164 248068 248071 248825 250019
64543 250019 250884 251543 252856 255036 257288 258889 259985 261147 262583 263877 264249 263085 260521 257503 255014
64528 255014 253287 251876 250374 248922 248181 248851 250934 253430 255152 255972 256806 258290 260111 261941 264237
64513 264237 267469 271147 274377 277129 280257 284472 289873 296290 303508 311295 319746 329400 340574 352773
64499 352773 365276 377961 390929 403547 414543 422823 427569 427829 423014 413925 402498 390356 378139
64486 378139 366221 355212 345513 337100 330116 325117 322345 321193 320749 320494 320218 319578 318124 315665 312457
64471 312457 309106 306172 303579 300475 296127 290980 286462 283764 283214 284687 287884 292012 295931 299093
64457 299093 301922 304894 307641 309402 310028 310070 310024 309892 309462 308762 308211 308423 309701 311644 313385 314418 315163
64440 315163 316678 319844 324754 330686 336703 342479 348627 356157 365689 377285 390800 406140 423412
64427 423412 443245 466768 494827 527296 563673 604313 650621 704165 766280 838619 923300
64416 923300 1021929 1134364 1257977 1387470 1515817 1636948 1748488 1851456 1946822 2032766
64406 2032766 2105395 2161140 2197549 2212596 2204819 2174847 2126335 2064754 1994622 1917085 1829794
64395 1829794 1729689 1616664 1494772 1369956 1247135 1129505 1019573 919587 830900 753657
64385 753657 687227 630596 582513 541885 508066 480408 457666 438421 422073 408801 398450
64374 398450 389986 382264 374868 367927 361464 355230 348984 342672 336417 330422 324762 319200 313445 307667
64360 307667 302564 298779 296364 294906 294066 293841 294413 295902 298329 301802 306629 313043 320779 329099 337452
64345 337452 345968 355031 364336 372616 378404 380932 380329 377249 372540 367128 361810 356920 352282 347676
64331 347676 343419 340303 338856 338812 339490 340586 342317 344835 347865 351040 354263 357507 360376 362090 361895
64316 361895 359543 355587 351185 347299 343980 340625 336980 333453 330305 327008 322822 317680 312043 306148
64302 306148 299931 293605 287747 282741 278518 274966 272184 270180 268651 267351 266487 266521 267612 269477 271802
64287 271802 274646 278344 283033 288426 294151 300244 307072 314753 322884 330935 338751 346593 354849 363837
64273 363837 373601 383720 393498 402598 411282 419772 427473 433118 435685 435062 431999 427686 423223 419213
64259 419213 415824 413294 412120 412494 413741 414679 414399 412437 408377 401822 392838 382061 370275 358144
64245 358144 346288 335192 324888 315131 306081 298553 293277 290090 288082 286489 285241 284697 284997 285756
64231 285756 286363 286501 286389 286571 287535 289393 291663 293365 293712 292938 292181 292321 293179 294136 295121 296450 297863
64214 297863 298422 297432 294934 291240 286638 281792 277850 275551 274535 273972 273701 274277 275975 278217 280126
64199 280126 281395 282431 283782 285603 287718 290142 293372 298075 304607 313038 323526 336261 350956
64186 350956 366855 383573 401557 421213 441657 460770 476493 487737 494094 495294 491267 482428
64174 482428 469553 453574 435761 417782 401020 385772 371487 357878 345433 334732 325666 317678
64162 317678 310576 304725 300491 297718 295790 294093 292443 291140 290523 290455 290522 290831 292204 295215 299293 303269
64146 303269 306643 309806 313147 316567 319896 323107 325933 327857 328762 329045 328770 327297 324233 320246 316397
64131 316397 313067 310155 307999 307246 307841 308853 309517 310006 311061 313275 316850 321667 327347 333488 339976
64116 339976 346930 354358 362128 370350 379479 389936 401739 414560 427894 441132 453630 464834
64104 464834 474270 481477 486188 488653 489668 490248 491324 493666 497857 504167 512375 521641 530660 538213
64090 538213 543798 547581 549764 550287 549181 546684 542707 536713 528699 519939 512039 505340 498846 491591
64076 491591 483433 474584 465208 455751 447000 439382 432521 425792 419006 412407 406384 401420 397851 395368
64062 395368 393091 390482 387973 386375 385911 386103 386415 386767 387537 389278 392248 396072 400048 403981 408467
64047 408467 414206 421346 429718 439340 450253 462111 474506 487683 502418 519043 536934 555177
64035 555177 573410 591702 609718 626397 640554 651547 659117 662763 661790 656289 647826 638743 630712
64022 630712 624090 618549 613881 610038 606655 602803 597290 589313 579004 567263 554840 541647 527360
64009 527360 512570 498817 487262 477777 469655 462739 457363 453452 450311 447411 444885 443106 442055
63996 442055 441420 441135 441536 442924 445154 447797 450629 453892 458071 463461 469892 476679 482975 488513 494155
63981 494155 501327 510679 521592 533303 546124 560992 578046 596322 614868 633423 651813 669417
63969 669417 685749 701172 716566 732549 749438 767707 787947 810395 834964 861810 891572
63958 891572 924966 962375 1004046 1050583 1103160 1163303 1232579 1312545 1404955 1511880 1635506
63947 1635506 1777838 1940703 2126019 2335998 2572966 2838639 3133028 3453749 3796750
63938 3796750 4158110 4534994 4924609 5322543 5722424 6116616 6496291 6850989 7169485
63929 7169485 7442157 7662642 7827426 7934597 7983155 7972583 7902190 7771249 7580590 7334284
63919 7334284 7039674 6706046 6343443 5961986 5571129 5178878 4791598 4414426 4051770
63910 4051770 3707634 3385717 3089034 2819276 2576645 2360422 2169385 2001634 1854545
63901 1854545 1725491 1612558 1514355 1429400 1356032 1292691 1237869 1189922 1147281 1108852 1073969
63890 1073969 1042050 1012415 984253 956642 928857 900861 873221 846420 820630 796328 774524
63879 774524 755906 740167 726678 715382 706487 699713 694675 691734 691638 694435 699558 706952 717246
63866 717246 730590 746112 762852 780620 799590 819655 840572 862244 884438 906573 928173
63855 928173 949128 969040 986678 1000697 1010817 1017822 1022418 1024509 1023610 1019490 1012215 1001881 988617
63842 988617 972745 954698 934802 913228 890096 865442 839092 810878 781098 750630 720403
63831 720403 690851 662067 634320 608112 583755 561163 540048 520071 500872 482359 465024
63820 465024 449605 436297 424646 414260 405155 397298 390383 384330 379455 375780 372678 369609 366746
63807 366746 364387 362286 360161 358411 357541 357149 356289 354666 352758 350844 348662 346027 343120 340060 336796
63792 336796 333436 330112 326566 322500 318345 314951 312390 309722 306135 301749 297185 293027 289842 287957
63778 287957 286871 285577 283810 282401 282073 282536 283182 283968 285061 286129 286612 286353 285448 283918 282036 280586
63762 280586 280136 280322 280381 280185 280152 280397 280596 280594 280601 280807 281242 281924 282718 283132 282820 282305 282673 284398 286807 288842
63742 288842 290097 291074 292690 295579 299667 304338 309041 313598 317853 321380 323970 326102 328431 330891
63728 330891 332877 334310 335917 338273 341109 343866 346552 349684 353582 358035 362547 366688 370300 373603
63714 373603 377020 380712 384273 386994 388388 388409 387249 385117 382286 379224 376491 374421 372930 371726 370693
63699 370693 369974 369694 369813 370323 371403 373212 375684 378685 382231 386257 390289 393666 396116 397832 398983
63684 398983 399474 399326 398901 398517 398069 397333 396503 396028 395961 395834 395350 394840 394724 394729 394109 392689 391251 390594 390527
63665 390527 390245 389618 389596 391110 393888 396617 398091 397930 396345 393609 389918 385557 380950 376479 372318
63650 372318 368486 364984 361771 358633 355292 351847 348999 347513 347415 347953 348463 349055 350302 352463 355231
63635 355231 358185 361301 364969 369547 374933 380641 386407 392539 399435 406890 414279 421396 428642 436250
63621 436250 443937 451641 460124 470292 482216 495369 509646 525591 543708 564065 586490 610711
63609 610711 636331 663237 692067 723703 758174 794515 831767 869435 906619 941168 970230
63598 970230 991526 1004032 1007975 1004693 996292 984923 972223 959270 946612 934105 921124 907264
63586 907264 892516 876510 858149 836585 812213 786133 758947 730832 702630 675960 652108
63575 652108 631477 614225 600694 590824 583727 578355 574276 571588 570493 571304 574378 579476 585418 590890
63561 590890 595563 600117 605311 611325 617846 624497 631248 638740 648078 660111 675039 692891 714037
63548 714037 738864 767225 798641 832913 870233 910970 955653 1004428 1055444 1103832 1143386
63537 1143386 1169791 1182043 1181207 1169205 1149259 1126087 1104098 1085312 1069470 1055705 1043287 1031087
63525 1031087 1017493 1001259 981898 959023 931851 899879 863853 825763 787814 751367 716708
63514 716708 683715 652770 624944 601201 581454 564533 549064 534361 520660 508681 498869 490874
63502 490874 483762 476873 470320 464540 459506 454682 449698 444800 440613 437598 435685 434280 432704 430823
63488 430823 429231 428609 428944 429547 429811 429738 429805 430507 432043 434214 436556 438732 440827 443219 446163 449541
63472 449541 452927 455789 457707 458506 458158 456589 453832 450424 447298 444965 443000 440567 437329 433669 430292
63457 430292 427907 426991 427419 428470 429573 430953 433204 436439 440330 444820 450250 456771 464115 471940 479970
63442 479970 487839 495340 502886 511273 520865 531497 543141 556050 570197 585461 602877 625003
63430 625003 654103 689854 729097 767651 802171 830843 853261 870106 882756 892909 902420 913181
63418 913181 926815 944371 966314 992765 1023705 1058974 1098043 1139610 1181382 1220394 1253712
63407 1253712 1278968 1294555 1299768 1295014 1281910 1263153 1242112 1221856 1203836 1187422 1170956 1153256
63395 1153256 1133848 1112133 1087118 1058118 1025243 989072 950439 910744 871840 835120 800904
63384 800904 768991 739497 712929 689744 670097 653809 640383 629251 620238 613540 609245 607254
63372 607254 607757 611307 618082 627403 638214 649773 661730 674044 687092 701465 717355 734527
63360 734527 753144 774144 798360 825753 855959 889174 925873 965900 1008379 1052224 1096139
63349 1096139 1138187 1175975 1207330 1230592 1244608 1249076 1244955 1234094 1218408 1199640 1179581 1159857
63337 1159857 1141348 1124059 1107405 1090271 1071036 1048184 1021147 990336 956493 920441 883374
63326 883374 846826 812182 780405 752187 727866 707150 689404 674537 663396 657085 655796 658129
63314 658129 661207 661554 656426 644791 627352 605911 582790 560376 540443 523612 509624 498131
63302 498131 489030 482139 476954 472978 470104 468510 468150 468417 468378 467436 465702 463554 460933 457430 453078
63287 453078 448503 444084 439446 434185 428648 423566 419293 415851 413345 411675 410157 408137 405894 404278
63273 404278 403572 403324 403277 403748 404926 406388 407541 408137 408299 408423 409102 410695 412881 414994 416846 418793
63257 418793 421109 423837 427279 431943 437748 443831 449451 454744 460386 466826 474009 481507 488868 496156
63243 496156 504197 513880 525236 537671 551000 565572 581335 597706 614771 633819 656117 681729
63231 681729 710009 740641 773454 807701 842402 877240 912441 947838 982704 1016519 1049320
63220 1049320 1081203 1111983 1141448 1169632 1196824 1223695 1251372 1280786 1311622 1342270 1371095
63209 1371095 1397487 1421366 1441883 1457130 1465176 1465112 1456930 1440772 1416707 1385222 1347559 1305415
63197 1305415 1260522 1214584 1169297 1126089 1085900 1049360 1016918 988548 963667 941881 923703
63186 923703 910009 900783 894979 891775 891467 894859 902209 913088 926854 942836 960241 978295 996512
63173 996512 1014669 1032667 1050543 1068405 1086129 1103232 1119251 1134074 1147721 1159923 1170157
63162 1170157 1177996 1183161 1185251 1183612 1177596 1166860 1151426 1131496 1107294 1079271 1048494 1016594
63150 1016594 984998 954225 924160 894873 866832 840419 815757 793091 772871 755206 739621
63139 739621 725626 713273 702903 694583 688001 682719 678373 674908 672769 672555 674239 676989 680007 683268
63125 683268 687256 692294 698522 706207 715617 726592 738514 750549 761705 770938 777744 782660 786822
63112 786822 790923 794708 797415 798572 798425 797773 797286 796833 795664 793361 790401 787603 785362 783675 782442
63097 782442 781260 779240 775812 771654 768137 765735 763642 761163 758814 757629 757882 759050 760674 762650
63083 762650 764831 767019 769436 772633 776681 780871 784528 787879 791787 796821 802890 809622 816733 824104
63069 824104 831930 840829 851366 863411 876427 890574 906948 926275 947820 970264 993498 1018898
63057 1018898 1047763 1080063 1114878 1151594 1190497 1232641 1279419 1331890 1390105 1453251 1520586
63046 1520586 1592007 1667430 1745903 1825724 1905428 1984381 2062446 2139371 2214660 2287850 2358669
63035 2358669 2426905 2492385 2555317 2616488 2676679 2735828 2793109 2847909 2900007 2948273 2989659
63024 2989659 3020211 3036963 3038439 3023799 2992500 2944801 2881756 2804620 2715052 2616016 2511548
63013 2511548 2405312 2299955 2197922 2101702 2012661 1930654 1855620 1788822 1731699 1684244 1645573
63002 1645573 1615560 1594711 1582623 1577762 1578889 1585828 1598653 1616844 1639364 1664869 1691734 1718593
62990 1718593 1745164 1772042 1799562 1827378 1855169 1883013 1910712 1937368 1962027 1984278 2003761
62979 2003761 2019430 2029718 2033257 2029147 2016869 1996340 1967896 1931892 1888503 1838299 1782832 1724202
62967 1724202 1663990 1602999 1542049 1482528 1425775 1372140 1321072 1272181 1225898 1182978 1143649
62956 1143649 1107437 1073644 1041692 1011165 981931 954241 928393 904223 881228 859231 838566
62945 838566 819480 801701 784756 768389 752512 737144 722690 709872 698948 689250 679897 670797
62933 670797 662616 655907 650691 646751 643861 641702 639842 637940 635907 633989 632699 632388 632677 632640 631744
62918 631744 630272 628504 626027 622359 617908 613637 609948 606490 602902 599116 595058 590771 586828 583937
62904 583937 582029 580300 578257 576124 574128 572078 569891 567968 566702 566074 565970 566363 566918 566989 566426 565901
62888 565901 565916 565904 564905 562882 560786 559473 559054 559271 559876 560565 560994 561103 561184 561442 561755 561991 562296 562786 563132
62869 563132 562764 561537 559916 558433 557180 556019 554995 554227 553469 552220 550444 548827 548110 548352 548997 549481
62853 549481 549654 549886 550897 553162 556188 558721 560023 560616 561360 562153 562162 561128 559690 558380 557045 555475
62837 555475 553981 552974 552379 551803 550950 549623 547686 545417 543684 543357 544529 546507 548479 550061 551346
62822 551346 552648 554266 556438 559409 563359 568079 572881 577128 580818 584430 588262 592256 596391 600797
62808 600797 605473 610405 616017 622952 631104 639425 647109 654573 662747 671685 680619 689363 699030 711004
62794 711004 725541 741684 758434 775711 794237 814842 838109 864545 894703 929024 967735
62783 967735 1011094 1059552 1113517 1173107 1238450 1310158 1389151 1475934 1570228 1671358 1778770
62772 1778770 1892034 2010472 2132833 2257163 2380858 2500900 2614128 2717407 2807697 2882157
62762 2882157 2938202 2973551 2986577 2976876 2945328 2893397 2822567 2734710 2632697 2520129 2400506
62751 2400506 2276941 2152384 2029389 1909506 1793393 1681771 1575985 1477491 1387103 1304864
62741 1304864 1230343 1162904 1101870 1046609 996495 951044 910320 874874 844762 818728 794919
62730 794919 772436 751666 733212 717147 703379 691940 682525 674361 666914 660363 655107 651266 648853
62717 648853 647885 648032 648682 649797 652199 656660 663164 671390 681332 692960 705901 720165 736759 756833
62703 756833 780523 807313 837164 870485 907228 946956 989784 1036365 1086780 1140305 1196559
62692 1196559 1256147 1319698 1386758 1456047 1526323 1596498 1665154 1730465 1790441 1842951 1885662
62681 1885662 1916481 1934131 1938112 1928121 1903904 1865887 1815809 1756445 1690597 1620341 1547132 1472404
62669 1472404 1397786 1324698 1253960 1186026 1121543 1061504 1006701 957131 912047 870679 832876
62658 832876 798968 769039 742552 718783 697424 678490 661778 646810 633312 621332 610672
62647 610672 600570 590230 579539 569042 559365 550879 543737 537896 533111 529149 526030 523950 523032
62634 523032 523340 525014 528093 532044 535642 537603 537442 535765 533644 531699 529816 527678 525351 523182 521357
62619 521357 519910 519080 519304 520778 523309 526645 530683 535271 540202 545550 551722 558921 566777 574727 582614
62604 582614 590813 600014 611018 624344 639761 656458 674079 693458 716047 742772 773719 808773
62592 808773 848081 891827 939907 991943 1047428 1105710 1165904 1226882 1287298 1345679 1400567
62581 1400567 1450531 1493998 1529188 1554328 1568012 1569440 1558576 1536185 1503627 1462498 1414494
62570 1414494 1361510 1305534 1248207 1190578 1133401 1077539 1023979 973557 926740 883615 844088
62559 844088 808255 776567 749361 726192 705915 687573 670956 656262 643562 632755 623633 615658
62547 615658 608035 600390 593268 587590 583729 581370 580074 579551 579391 579011 578099 576897 575862 575121 574434 573659
62531 573659 573053 572955 573251 573450 573428 573837 575557 578987 584144 591123 599941 610145 621268 633757 648823
62516 648823 667171 688432 712045 738057 766760 798104 832026 868945 909340 953013 999178
62505 999178 1047147 1096583 1147163 1198242 1248734 1297060 1341402 1380266 1412778 1438591 1457896
62494 1457896 1471663 1481520 1489255 1496716 1506152 1519897 1539420 1565151 1597369 1636506 1682229 1733128
62482 1733128 1788204 1848184 1914459 1986627 2061146 2131806 2191311 2233851 2257902 2266705 2264810 2253509
62470 2253509 2229621 2188366 2127083 2047012 1952879 1850946 1746357 1641532 1537002 1433569
62460 1433569 1333255 1238540 1151476 1073497 1005282 946572 896538 854358 819150 789712 765114
62449 765114 745451 731178 721623 714916 709545 705347 702868 702439 704092 707666 712661 718460 724936 732376
62435 732376 740645 748973 756781 764160 771242 777525 782085 784069 782878 778392 771247 762450 752450 741010
62421 741010 728103 714430 700789 687452 674465 662078 650538 639845 630041 621371 613801 606679
62409 606679 599292 591573 584045 577319 571820 567684 564633 562162 559945 557888 555825 553715 552279 552730
62395 552730 555436 559270 562850 566088 570028 575358 581644 587940 593669 598848 603819 608946 614417 620290
62381 620290 626700 633912 642039 650845 659979 669339 679090 689412 700314 711574 722690 732984 741968
62368 741968 749760 757234 765793 776781 790808 807563 826425 847328 871045 898703 931077 968271
62356 968271 1009942 1055939 1106698 1162724 1223567 1287660 1353348 1419536 1484813 1546339 1600317
62345 1600317 1643594 1674576 1693139 1700487 1698923 1690740 1676963 1657554 1632680 1603131 1569576 1532332
62333 1532332 1492119 1450358 1408447 1367334 1327920 1291154 1257395 1226334 1197925 1172788 1151295
62322 1151295 1132800 1116186 1100672 1085691 1070450 1054211 1036840 1018773 1000551 982462 964275
62311 964275 945317 925296 905090 886151 869029 853092 837806 823405 810020 797091 784220
62300 784220 771844 760488 750037 740467 732599 727227 723946 721622 719697 718305 717524 717376 718313 720803
62286 720803 724474 728349 731898 735243 738436 741198 743427 745401 747435 749762 752716 756512 760823 765021
62272 765021 768940 773120 778315 784987 793187 802624 812888 823819 835608 848501 862834 879563 900224
62259 900224 925842 956258 991002 1030484 1075698 1127064 1184219 1246699 1314023 1385066 1457924
62248 1457924 1530429 1600274 1664666 1720486 1765149 1797299 1816936 1825204 1823746 1813677 1795151 1768124
62236 1768124 1733135 1690883 1641562 1585467 1524135 1460078 1395437 1331602 1270018 1212380 1159712
62225 1159712 1111934 1068654 1029897 995850 966421 941302 920051 901948 886163 872268 860225
62214 860225 849844 840664 832430 825197 818858 813112 808035 804180 801910 801071 801448 803046 805737 809104
62200 809104 812879 817108 821787 826833 832554 839486 847454 855381 862465 869068 876004 883438 891027 898755
62186 898755 907001 916021 925902 936842 948908 961591 974128 986210 997963 1009218 1019269 1027510
62174 1027510 1034004 1039358 1044311 1049540 1055558 1062639 1070994 1081234 1094626 1112730 1136671 1166670 1202181
62161 1202181 1242416 1286660 1334001 1382881 1431104 1476329 1516423 1549405 1573531 1587826 1592556
62150 1592556 1589027 1578986 1564123 1545643 1523787 1497760 1466604 1430369 1390372 1348363 1305703
62139 1305703 1263420 1222646 1184620 1150247 1119903 1093673 1071544 1053295 1038381 1026073 1015595
62128 1015595 1006085 996679 986972 977329 968405 960266 952175 943460 934421 926262 920159 916451 914573 913654
62114 913654 913211 913399 914648 917091 920488 924597 929381 934723 940138 944887 948249 949593 948400 944511 938425
62099 938425 931404 925303 922004 922448 925850 929988 932497 932000 928298 922042 914481 907027 900516 894867 889661
62084 889661 884947 881272 879095 878428 878916 880083 881672 883992 887887 894242 903585 916031 931132 947699
62070 947699 964379 980860 998104 1017011 1037317 1058369 1080486 1104736 1131630 1160854 1192182
62059 1192182 1225669 1260756 1295964 1329790 1361180 1388713 1410126 1423462 1428557 1426902 1420133 1408973
62047 1408973 1393404 1373277 1348588 1319470 1286121 1248725 1207519 1163074 1116543 1069518 1023536
62036 1023536 979658 938392 899849 863954 830656 800145 772907 749305 728992 710932 694311
62025 694311 679232 666102 654521 643437 632549 622869 615434 609968 605240 600354 595134 589610 583812
62012 583812 577948 572216 566524 560868 555822 552061 549474 547311 545182 543344 542035 541189 540963 541887 544174
61997 544174 547317 550684 554181 558043 562219 566230 569512 571729 572848 573017 572263 570297 566673 561103 553588
61982 553588 544468 534484 524516 514950 505563 496326 487978 481335 476310 472216 468792 466236 464358 462555
61968 462555 460789 459858 460397 462165 464532 467115 469628 471629 472906 473812 474829 475921 476549 476239 475068
61953 475068 473742 473175 473784 475220 476972 479073 481920 485622 490008 495093 500961 507290 513656 520265 527719
61938 527719 536057 544806 554044 564569 576718 589721 602562 614832 626373 636811 645949 654095
61926 654095 661536 668175 674056 679562 684505 687563 687435 684289 679520 674292 668836 662964 656709 650506
61912 650506 645162 641619 640458 641732 645367 651433 659789 669848 680989 692865 705003 716553 726867
61899 726867 736011 744188 750893 755127 756382 755077 752159 748478 744356 739495 733578 727132 721399 717033
61885 717033 713388 709497 705293 701345 697777 694146 690129 685606 680111 672921 663836 653496 642859 632718
61871 632718 623646 615950 609559 604267 600109 597242 595518 594508 594025 594383 596065 599254 603662 608747 614233
61856 614233 620548 628540 638661 650600 663825 678182 693795 710693 728799 747974 767831 787845
61844 787845 807885 828213 848583 867774 884519 898541 910171 919279 925230 927678 926797 922886 916429
61831 916429 908504 900486 893242 887081 882433 880002 880148 882625 887093 893472 901634 911114 921205 931021
61817 931021 939435 945368 948350 948478 945757 939842 930651 918900 905711 891820 877415 862719 848463
61804 848463 835606 824535 814729 805332 795932 786524 776854 766359 754891 743069 731653 720994
61792 720994 711344 703104 696270 690063 683749 677529 672017 667151 662300 657305 652684 648793 645484 642633
61778 642633 640373 638677 637227 635868 634700 633633 632351 630885 629749 629365 629737 630820 632686 635131 637617
61763 637617 639965 642737 646607 651598 657233 663167 669359 675798 682400 689142 695954 702417 707704 710954
61749 710954 711774 710362 707103 702075 695167 686671 677467 668374 659571 650977 642937 636050 630413 625552
61735 625552 621144 617395 614540 612373 610467 608614 606878 605401 604324 603787 603828 604281 604835 605249 605591 606188
61719 606188 607087 607611 606909 605208 604026 604648 606647 608444 609122 609063 608826 608132 606224 602849 598533 594024
61703 594024 589618 584994 579722 573927 568281 563304 558990 555233 552128 549486 546587 542934 538934 535213
61689 535213 531689 528003 524480 521714 519374 516446 512700 508960 505759 502694 499397 496257 493706 491552
61675 491552 489484 487679 486391 485518 484978 484961 485402 485748 485737 485873 486606 487579 488228 488659 489259 489868 490105 490355
61657 490355 491621 494337 497824 501047 503498 505324 506926 508606 510466 512534 514856 517271 519207 520121
61643 520121 520257 520480 521156 521722 521638 521203 520969 520914 520830 521088 522155 523617 524561 524995 526071 528633 532068 534876
61625 534876 535973 535246 533230 530529 527323 523266 518062 512180 506649 502021 497923 493829 489906 486680
61611 486680 484161 481775 479178 476586 474148 471417 467822 463477 459067 455024 451226 447615 444590 442405
61597 442405 440542 438181 435161 431989 428911 425559 421709 417919 415022 413195 411834 410255 408397 406844
61583 406844 406224 406497 406875 406643 405940 405417 405223 404877 404186 403687 403839 404229 403978 402639 400337 397431 394522
61566 394522 392494 391977 392735 394024 395485 397318 399664 402237 404617 406544 407907 408761 409441 410412 411857
61551 411857 413573 415266 416806 418221 419672 421423 423588 425844 427593 428471 428584 428244 427674 427062 426673 426730
61535 426730 427207 427832 428368 428893 429789 431448 433952 437112 440710 444473 447783 449752 449880 448544 446507 444024
61519 444024 440716 436410 431795 427987 425542 424150 423305 423004 423563 424871 426200 426897 427033 427107 427307 427368 427091
61502 427091 426683 426591 427230 428798 431003 433029 434294 435316 437330 440846 445060 448928 452257 455302 457837
61487 457837 459402 460264 461301 462855 464319 465127 465603 466488 468013 469912 472162 475187 479166 483453 487023
61472 487023 489477 491345 493253 494939 495336 493670 490319 486546 483466 481273 479278 476655 473236 469606
61458 469606 466346 463320 460032 456586 453847 452443 451965 451457 450423 449156 448331 448569 450093 452422 454544
61443 454544 455871 456957 458919 462123 465795 468943 471310 473268 475101 476721 478062 479450 481371 483879
61429 483879 486425 488429 489898 491273 492778 494294 495859 497803 500157 502379 504010 505334 506997 509241
61415 509241 511873 514782 517936 520964 523243 524486 524860 524537 523575 522294 521298 520852 520521 519740 518517 517333
61399 517333 516478 515782 515021 514384 514379 515271 516708 518011 518856 519553 520640 522396 524868 528092 531977 536033 539623
61382 539623 542626 545648 549435 554122 559145 563740 567511 570595 573398 576221 579093 581802 583899 584700
61368 584700 583672 581045 577844 574962 572271 568952 564678 560212 556678 554428 552774 550810 548464 546704
61354 546704 546669 548640 551972 555977 560581 566016 572281 579151 586362 593375 599185 602959 604824 605563 605668
61339 605668 605263 604924 605715 607984 610768 612932 614455 615971 617421 618015 617514 616731 616452 616489 616239 615722 615487
61322 615487 615780 616384 617275 618849 621404 624885 629369 635334 643040 651895 660911 669706 678759 688745 700025
61307 700025 712761 727095 743051 760496 779258 798962 818645 836852 852349 864511 872906 876855
61295 876855 875855 870281 861337 850295 838032 825170 812272 799687 787373 775095 762760 750530
61283 750530 738734 727806 718251 710413 704123 698702 693579 688970 685698 684258 684237 684827 685631 686775 688458
61268 688458 690737 693520 696350 698391 699150 699282 700173 702721 706876 712310 718854 726176 733669 741014 748336
61253 748336 755442 761348 764957 765900 764446 761070 756527 751880 747874 744484 741467 739001 737304 735957
61239 735957 734253 732124 730217 729163 729213 730396 732406 734437 735743 736529 737862 740603 744770 749996 756216
61224 756216 763731 772772 783069 793795 804046 813510 822522 831363 839864 847947 856099 864809 873849
61211 873849 882635 891011 899042 906282 912022 916229 919559 922423 924662 926232 927614 929503 932647 937970
61197 937970 946082 956486 968062 980577 995015 1012049 1030906 1050139 1068780 1086020 1100398 1110299
61185 1110299 1115268 1116262 1114650 1111403 1107080 1101976 1096093 1089269 1081474 1072802 1063187 1052373 1040163 1026568
61171 1026568 1011774 996162 980353 964984 950305 936028 921590 906604 891144 875620 860320
61160 860320 845171 830089 815477 802088 790378 780267 771618 764701 760021 757847 757997 759971 763228
61147 763228 767492 772782 778917 784973 789525 791557 791011 788507 784826 780620 776219 771562 766628 762076
61133 762076 759097 758524 760386 764432 770588 778646 788079 798682 811124 826343 844478 864811 886646
61120 886646 909904 934906 961956 991173 1022462 1055582 1090324 1126501 1163609 1200684 1236772
61109 1236772 1271548 1305294 1338388 1370942 1402723 1433132 1461367 1486969 1510241 1531790 1551556
61098 1551556 1568421 1580879 1588106 1590469 1589190 1585500 1580045 1573060 1565017 1556837 1549422 1543313 1538984
61085 1538984 1537103 1538063 1541407 1546172 1551872 1558832 1567500 1577738 1588934 1600581 1612530 1624685 1636582
61072 1636582 1647389 1656302 1662836 1666628 1667194 1664192 1657865 1648765 1636975 1622111 1604285 1584487 1563590
61059 1563590 1541457 1517673 1492829 1468361 1445202 1423228 1402009 1381530 1362102 1344172 1328346
61048 1328346 1315131 1304491 1296092 1290040 1286828 1286433 1288034 1290925 1295218 1301296 1309013 1317805 1327249 1337223
61034 1337223 1347809 1359305 1371965 1385439 1398832 1411666 1424408 1437777 1451998 1467133 1483602
61023 1483602 1501854 1521920 1543902 1568511 1596493 1627853 1662265 1699790 1740396 1783217 1827407
61012 1827407 1873751 1924667 1982861 2050899 2131743 2228177 2341312 2470710 2616332 2779776
61002 2779776 2964192 3174916 3420646 3712428 4061069 4477007 4972708 5562609 6260311
60993 6260311 7079623 8040997 9175424 10523615 12140072 14098270 16462593 19203352
60985 19203352 22104518 24769460 26772024 27862938 28076688 27675589 27012403 26425205 26182348
60976 26182348 26418129 27047252 27741706 28047713 27597617 26273029 24216093 21714930 19068180
60967 19068180 16504945 14165437 12113345 10358800 8882685 7654622 6640980 5807738
60959 5807738 5123866 4563974 4106996 3733366 3424992 3167169 2948700 2760380 2594775
60950 2594775 2447221 2315473 2197881 2092387 1996998 1910344 1831788 1761552 1700274 1647469
60940 1647469 1600463 1555516 1509923 1462627 1413536 1363335 1313687 1266488 1222651 1182109 1144718
60929 1144718 1110398 1078732 1049404 1022899 999872 979920 961907 945388 930736 917875 905956
60918 905956 894473 883675 873677 864113 854941 846704 839570 832927 826360 820277 815134 810735 806762 803411
60904 803411 800889 798718 795994 792100 786926 780675 773681 766104 757681 748111 737709 727205 716896
60891 716896 706561 696245 686404 677126 667953 658821 650485 643591 637912 632921 628627 625323 622863 620603
60877 620603 617821 613976 608928 603228 597923 593879 591460 590744 591539 593124 594659 596061 597960 600667 603825
60862 603825 607217 611144 615685 620329 624795 629560 635049 640895 646539 652013 657597 663202 668594 673753
60848 673753 678433 681848 683388 683307 682247 680598 678845 677903 678190 678634 677476 673897 668172 660485 650587
60833 650587 638759 626283 614457 603585 593218 583114 573623 565193 557737 550681 543709 537318 532308
60820 532308 528664 525334 521292 516537 511853 507896 504763 502100 499310 495897 491918 488008 484792 482456
60806 482456 480884 479852 478938 477759 476558 476169 477056 478709 480230 481170 481586 481792 482418 484242 487451 491347
60790 491347 495086 498422 501445 504092 506368 508621 511050 513222 514526 514839 514338 513011 510894 508503 506453
60775 506453 504712 502626 499604 495545 490829 486199 482307 479022 475513 471393 467477 464990 464316 464900 466031
60760 466031 467232 468208 468966 469882 471219 472697 473867 474689 475393 476008 476344 476240 475596 474408 472953 471623
60744 471623 470433 469199 468293 468466 469601 470430 469988 468621 466952 464727 461553 458018 455015 452468 449814
60729 449814 447347 445985 445938 446655 447889 449773 451965 453832 455539 457955 461334 464957 468202 471105 473729
60714 473729 475949 478132 481241 485780 491106 496029 499651 501541 501744 500862 499676 498452 496986 495283 493637
60699 493637 491961 489625 486239 482198 478269 474906 472087 469512 466913 464351 462178 460544 459243 458227
60685 458227 457885 458381 459189 459814 460514 461617 462659 463128 463727 465817 469623 473927 477580 480490 483122 485912
60669 485912 489236 493116 496800 499310 500376 500122 498097 493705 487673 481917 477655 474635 472438 471354
60655 471354 471394 471513 470739 469477 468992 470022 472377 475441 478491 480903 482594 484113 486010 488269 490444
60640 490444 491971 492293 491105 488667 485542 482003 478098 474206 470933 468454 466559 465296 464913 465130 465253
60625 465253 465077 465013 465279 465759 466651 468347 470519 472250 473207 473797 474076 473657 472935 473108 474497 476005 476884
60608 476884 477802 479390 480919 481472 481456 481825 482543 482954 483034 483105 482864 481868 480609 479949 479777 479340 478754 478998 480438
60589 480438 482416 484474 487017 490465 494536 498715 502851 506919 510598 513402 515052 515651 515681 515748 516114 516551
60573 516551 516889 517513 519051 521780 525662 530750 537134 544648 553024 562183 572078 582489 593372 605201
60559 605201 618462 632885 647491 661234 673218 682554 688600 691367 691256 688467 683091 675854 668251
60546 668251 661682 656615 652759 649885 648362 648843 651555 656078 661882 668881 677227 686867 697823 710761
60532 710761 726615 745610 767301 791652 819249 850019 882391 914173 943636 969254 989111
60521 989111 1001469 1005767 1002545 992782 977872 959787 940387 920515 900289 880165 861216 844456
60509 844456 830398 819162 810576 804186 799591 796773 795929 797164 800633 806823 816362 829706 847189
60496 847189 869097 895494 926349 962074 1003430 1050494 1102146 1156971 1214052 1272257 1329300
60485 1329300 1382418 1429796 1470717 1504734 1531742 1552805 1569935 1584661 1597169 1606588 1611260 1608570
60473 1608570 1595403 1569405 1529840 1477472 1414331 1343744 1269835 1196282 1125501 1058955 997830
60462 997830 943046 894815 852548 815320 782463 753738 728968 707586 688780 672076 657380
60451 657380 644329 632076 620099 608843 599111 591052 584242 578496 574005 570727 568190 565979 563982
60438 563982 562101 560101 557888 555689 553851 552522 551484 550215 548310 545974 543913 542601 541902 541495 541214
60423 541214 540708 539356 537096 534951 534085 534544 535488 536506 537994 540324 543270 546374 549346 551986 554164
60408 554164 556053 558030 560254 562562 564868 567372 570234 573238 575904 577965 579731 581870 584620 587342
60394 587342 589290 590777 592986 596464 600496 604246 607746 611213 614221 616449 618664 621938 626154 630248
60380 630248 633764 637194 640819 644220 647151 650063 653463 657357 661523 665747 669566 672350 673967 675021
60366 675021 676179 677535 678738 679470 679752 680037 681039 683139 686009 689080 692230 695656 699291 702971 707127
60351 707127 712692 720153 729118 738942 749421 760731 772926 785530 797429 807247 814126 818027 819151
60338 819151 817388 812755 805948 797872 788822 778701 767877 757171 747139 737970 729939 723206 717224
60325 717224 711119 704806 699109 694658 691199 688015 684449 680036 674918 670314 667896 668297 670622 673638
60311 673638 677086 681715 688506 698028 710186 724440 740386 757927 776592 795113 812367 828532
60299 828532 844578 860752 876276 890268 901999 910308 913977 912908 907878 898885 884853 865616
60287 865616 843222 820577 799495 780633 764442 751167 740329 731108 723092 716190 710087 704299
60275 704299 698432 691972 684286 675469 666833 659840 654615 650041 645164 639987 635002 630561 626778 623635
60261 623635 620981 618611 616424 614410 612555 610849 609373 608327 608072 609038 611262 614042 616463 618368 620401
60246 620401 622906 625325 626964 627934 628834 629769 630145 629366 627404 624820 622457 620965 620384 620219 620101 620213
60230 620213 620954 622419 624456 627055 630419 634686 639732 645220 650814 656512 662840 670469 679469 689011
60216 689011 697969 705786 712867 720306 729173 739777 751521 763612 775843 788460 801477 814591
60204 814591 827689 840838 853645 865183 874912 883255 890969 898187 904400 909094 912115 913579 913741
60191 913741 912886 911145 908451 904680 899692 893252 885210 875868 865896 855793 845717 835983 827287 820077
60177 820077 813863 807544 800478 793077 786392 781252 777813 775738 774550 773740 772769 771345 769739 768440 767360
60162 767360 765717 762984 759635 756688 754810 754124 754447 755241 755762 755872 756464 758457 761552 764625 767208 769875
60146 769875 773221 777154 781325 785649 790257 795343 801135 807663 814650 821994 830183 839793 850778 862823
60132 862823 876080 890868 906826 923068 938931 953787 966373 975377 980657 982955 982532 979247 974008
60119 974008 968853 965158 962783 961312 961024 962116 964039 966242 968750 971371 973185 973460 972431 970562 967729
60104 967729 963708 958775 953127 946355 938183 929255 920620 912906 906448 901526 897910 894763 891651 889158
60090 889158 887897 887499 887273 887273 887963 889210 890464 891732 893735 897149 902081 908091 914423 920484 926229 931596
60074 931596 935394 935520 930712 921423 908640 892740 874160 854314 834878 816672 799976 785244
60062 785244 772584 761138 750091 739986 732053 726496 722370 718927 716086 713681 711254 708775 706840
60049 706840 705976 706268 707687 710251 713818 718159 723253 729166 735774 742926 750662 758906 767235 775355 783403
60034 783403 791218 797691 801529 802520 801483 799192 795986 792221 788319 784250 779432 773203 765048 754588
60020 754588 741823 727395 712235 697047 682369 668844 657024 647031 638759 632179 627155 623229
60008 623229 619924 617021 614336 611676 609299 607949 608026 609121 610671 612467 614221 615391 616066 617312 619858
59993 619858 623010 625654 627811 630328 633545 637245 641598 647150 653950 661453 669132 676520 682925 687840
59979 687840 691379 693660 694140 692362 688996 685195 681288 677055 672949 669908 668075 666838 666213 667114 670092
59964 670092 674734 680559 687665 696247 706180 717324 729635 742777 756022 768579 779471 787251 790552
59951 790552 789085 783729 775745 766375 756858 748078 740233 733435 728285 725009 722329 718338 712653 706738
59937 706738 701940 698057 694134 689894 685981 683283 682369 683245 685544 689110 694247 701099 709171 717841 726863
59922 726863 735667 742774 746875 748228 748073 747065 745381 744040 744683 747829 752520 757902 764159 771745 780710
59907 780710 791087 802966 815844 828605 840311 850274 857447 860865 860860 858770 855237 849829 842570 834660
59893 834660 827258 820640 815038 811199 809477 809335 810435 813349 818495 825205 832639 840938 850684 861725
59879 861725 873270 884734 895932 906857 917778 929197 941235 953343 964857 975397 984585 992030
59867 992030 997901 1002819 1006797 1008977 1008853 1007041 1004296 1000383 994525 986413 976246 964335 951295 938147
59853 938147 925613 913579 901752 890402 880059 870846 862651 855603 849946 845734 842979 841788 842024
59840 842024 843303 845695 849999 856890 866055 876443 886885 896202 903323 907910 910736 913193 916698 922537
59826 922537 931373 942302 952881 960544 963731 961614 953799 941127 926087 911420 898373 886760
59814 886760 876310 867227 859691 853602 848864 845429 842972 840845 838358 835004 830671 825837 821282 817353
59800 817353 813702 809900 805891 801628 796766 791122 785118 779316 773754 768075 762094 755964 750015 744680
59786 744680 740298 736725 733380 729852 726248 722787 719442 716149 713075 710489 708678 708016 708768 710775 713791
59771 713791 718014 723694 730256 736642 742712 749454 757484 766171 774723 783401 793072 804187 816745 830736
59757 830736 846006 862083 878633 895770 913662 932331 951996 972963 994793 1016373 1037188
59746 1037188 1057722 1078048 1096936 1113095 1126530 1137816 1146744 1152618 1155351 1155251 1152204 1146085 1137694
59733 1137694 1128264 1118216 1107321 1095898 1084940 1075074 1066211 1058210 1051074 1044444 1037723 1030862 1024499
59720 1024499 1019215 1015079 1011875 1009191 1006312 1002574 997981 993081 988282 983705 979610 976411 974262 973009
59706 973009 972612 973257 975054 977901 981556 985530 989078 991745 993920 996522 1000132 1004665 1009734 1015077 1020779
59691 1020779 1027311 1035034 1043267 1050031 1053225 1052100 1047438 1040543 1032432 1023773 1015028 1006453 998109 989836
59677 989836 981156 971493 960762 949629 938961 929103 919779 910472 900864 891230 882503 875526 870091
59664 870091 865155 860247 856174 854056 854132 855787 858291 861159 864239 867853 872504 878140 884100 890016 896130
59649 896130 902440 908201 912780 916326 918942 919824 917903 912898 905058 894414 881197 866639 852420
59636 852420 839322 827089 815497 804927 795894 788605 782972 778656 775146 772092 769392 766713 763262
59623 763262 758375 752084 744854 737179 729705 723109 717380 711767 705985 700857 697147 694365 691513 688531
59609 688531 686167 684808 684325 684788 686428 688977 691819 694697 697732 700868 703823 706338 708047 708548 708171
59594 708171 708085 708888 709666 709368 708574 708781 710256 711835 712691 713061 713099 712208 709926 706675 703295 700424 698433
59577 698433 697349 696666 695805 694811 694023 693163 691389 688274 684143 679543 675053 671474 669378 668373 667529 666547
59561 666547 665891 665799 665963 666235 666841 667716 668310 668308 667946 667421 666560 665336 664280 664162 665455 668045 671161 673842
59543 673842 675919 678320 681988 686902 692792 700155 709606 720733 733054 747997 768227 794151 821901
59530 821901 845393 859986 864285 859873 850271 839464 830171 823187 818338 815655 815322 816977 819518 821564
59516 821564 821984 820262 816528 811142 804279 796099 787088 777777 768289 758611 749182 740661 733188 726411
59502 726411 720212 714813 710234 706228 702770 700073 698142 696835 696285 696673 697635 698565 699465 700886 703053
59487 703053 705752 709105 713633 719348 725438 731121 736361 741626 747389 753922 761063 768147 774663 780961
59473 780961 787861 795682 804172 813110 822196 830475 836717 840431 841845 841041 838075 833962 830413 828293
59459 828293 827116 826395 826626 828612 832537 838207 845645 854964 865915 877789 889554 900253 909719 918701
59445 918701 927688 935831 941767 945167 946527 945667 941735 934768 926013 916478 906456 896820 889398 885196
59431 885196 883271 882084 881136 880540 879967 879025 878160 878361 880374 884783 892329 903386 917553 934385 954164
59416 954164 977359 1003643 1031917 1060941 1089673 1117926 1147535 1182136 1224054 1270691 1314323
59405 1314323 1345927 1359717 1355315 1337136 1312110 1286987 1266375 1252526 1246706 1250410 1264538 1286713
59393 1286713 1309610 1323267 1320477 1300466 1267685 1227871 1185793 1145359 1109547 1079348 1053718
59382 1053718 1031259 1011550 994734 980624 968761 958864 950891 944954 941243 939567 938961 938344 937652
59369 937652 937670 938739 940370 942250 944752 948209 952433 957311 963192 970300 978402 987353 997422 1008798
59355 1008798 1021323 1034890 1049562 1065155 1081375 1098489 1117116 1137199 1157896 1178649 1199503
59344 1199503 1220180 1239803 1257886 1274677 1290120 1303351 1313641 1320899 1324668 1323569 1316518 1303902
59332 1303902 1286905 1266371 1242960 1217724 1191642 1164934 1137506 1109850 1083007 1057857 1034763
59321 1034763 1013587 993870 975420 958903 945271 934521 925598 917710 910909 905157 899707 893902
59309 893902 887846 881871 876062 870720 866515 863727 861981 861093 861284 862178 862598 862041 861482 862003 863412 865018
59293 865018 867045 870417 875747 883451 894478 910031 930377 953966 977271 995552 1005003 1005048 998246
59280 998246 987863 976296 965781 958909 957222 960211 966699 976516 989956 1006431 1024735 1044143
59268 1044143 1064301 1084603 1104573 1124362 1143962 1162329 1178113 1190848 1200628 1207130 1209817 1208838
59256 1208838 1204941 1198791 1190968 1182279 1173481 1164969 1157114 1150321 1144422 1138774 1133449 1129432 1126967 1124655
59242 1124655 1121052 1116360 1111671 1107308 1102848 1097960 1092241 1085005 1076338 1067687 1060248 1053377 1045594 1036461
59228 1036461 1026325 1015078 1002674 990268 979157 968823 957532 944794 931883 919965 909109
59217 909109 899233 890729 883776 878012 873128 869080 865651 862588 860117 858596 857788 857263 857258 858253 859984 861883
59201 861883 864277 867972 872696 877110 880462 883208 885895 888478 890959 893657 896397 898251 898548 897654 896543
59186 896543 896008 896375 897371 898160 898022 897182 896555 896629 896917 896502 894823 892082 889160 886867 885058 882933 880468
59169 880468 878805 878651 879043 878649 877693 877569 878912 881053 883104 884538 884882 883827 881631 878656 874573 868724
59153 868724 861051 851980 841738 830602 819455 809125 799414 789683 780196 771905 765038 758863 752755
59140 752755 746682 740761 735242 730731 727576 725190 722877 721063 720710 721714 723013 724254 726332 730161
59126 730161 735781 742693 750221 757543 764275 771072 778993 788352 798845 810448 823225 836538 849483
59113 849483 862043 874813 887711 899930 911094 921433 930901 939121 946096 952024 956501 958927 959571
59100 959571 959164 957602 954176 948952 942701 935570 927183 918093 909746 902737 896429 890565 885905 882799
59086 882799 880399 877926 875659 873972 872260 869425 864878 858645 851201 843485 836378 829780 822798 815068
59072 815068 807298 800311 794219 788675 783321 777905 772589 768139 765083 762709 759708 755765 751753 748453
59058 748453 746004 744475 743885 743589 742686 741229 740028 739164 737746 735387 732910 731328 730936 731614 733101 734758
59042 734758 735890 736520 737157 737882 738526 739571 741730 744657 747370 750050 754166 760570 768731 778147 789258
59027 789258 802496 817604 834459 853531 875074 898724 924204 951342 978960 1004778 1026859
59016 1026859 1044210 1055745 1059975 1056529 1047041 1033869 1018656 1002531 986576 971272 956171 940890
59004 940890 925968 912403 900941 892144 886470 883877 883864 886065 890197 895380 900359 904543 908066 910837
58990 910837 912478 913185 913647 914036 914128 914327 915227 916106 915429 913209 911404 911542 913413 916697 922240 930706 941265
58973 941265 952722 965016 978621 993358 1008717 1024616 1041047 1057630 1074190 1091079 1108292
58962 1108292 1124956 1140261 1154144 1166516 1176574 1183415 1186605 1185688 1179974 1169395 1154830 1137086
58950 1137086 1116304 1092848 1067981 1043130 1019154 996644 976140 957706 941069 926436 914364
58939 914364 904714 896838 890986 888257 888796 891284 894667 899140 904949 911513 918331 925474 932446 937758
58925 937758 940392 940659 939065 935482 930015 923404 915855 906745 896300 886265 878111 871726 866626 863118
58911 863118 861342 860507 860202 861298 864521 869251 874768 881560 890343 900876 912904 927188 944361 963658
58897 963658 983924 1005057 1027314 1049999 1071913 1092525 1111870 1130124 1148079 1167132 1187942
58886 1187942 1209922 1232663 1256607 1281441 1305145 1325659 1342347 1354939 1362496 1364744 1363087 1358868
58874 1358868 1351784 1341378 1328808 1315529 1301386 1285825 1270047 1256093 1244409 1234051 1224696 1216712
58862 1216712 1209655 1202412 1194677 1186914 1179051 1170473 1161087 1151279 1141092 1130493 1120072 1110594 1102278
58849 1102278 1095283 1090093 1086414 1082459 1076377 1067658 1056276 1041553 1023177 1002378 980654 958219
58837 958219 935114 912855 893242 876213 860548 846160 834018 824277 816135 809206 803580 798898
58825 798898 794801 791901 790927 791380 792384 794299 797929 802705 807363 811988 817596 823944 829580 834036 838231
58810 838231 842555 846074 847933 848203 847165 844962 842130 839354 836546 833051 828739 823959 818569 812069
58796 812069 804653 797228 790377 783979 777580 770614 762772 754896 748811 745498 744188 744050 745660 749632
58782 749632 754987 760435 766366 773885 782658 791479 800341 810044 820142 829034 835795 840241 841539 838627
58768 838627 831961 823252 813555 803079 792588 783287 775411 768501 763044 760303 760540 762843 766613 771828
58754 771828 777942 783933 789323 793785 796048 794815 790653 785502 780440 775412 770968 768527 768812 771420
58740 771420 775945 782173 789311 796474 803838 812062 820769 829016 836854 844872 852574 858928 864254 869736
58726 869736 875248 879622 883022 887059 892329 897670 902222 906597 911738 918093 926071 935785 946140 955667
58712 955667 964396 973414 982543 989979 994301 995321 993004 987239 978704 968275 955457 938972 918975
58699 918975 896997 873761 848905 822943 797581 773780 751311 730480 712416 697284 684001
58688 684001 672101 662156 654002 646397 638891 632264 626626 620810 614267 607876 602314 597231 592616 589382
58674 589382 587913 587438 587406 588136 589718 591709 594399 598942 605812 614486 624907 637737 652828 668890
58660 668890 684889 700178 713026 720827 722355 718457 710373 699026 686049 673442 661663 649762
58648 649762 637759 627069 618175 609922 601782 594838 589761 585662 581804 578738 576851 575467 574270 574121
58634 574121 575579 577958 580533 583276 585851 587336 587576 587393 586981 585661 583554 581776 580469 578488 575706
58619 575706 573818 574052 575803 578267 581812 586920 593304 600765 609446 618719 627388 635382 643578 651583
58605 651583 657700 661519 664468 667249 668955 669448 670219 671800 672540 671228 669001 667367 666169 664759 663472
58590 663472 662774 662674 664047 668824 677697 689239 702172 716649 732443 748020 762754 778010 794551
58577 794551 810652 824310 835622 845577 854155 861206 867746 874886 882734 891578 902887 918015 937207
58564 937207 960672 989056 1021949 1057666 1095386 1135649 1177752 1218621 1255315 1286632 1311172
58553 1311172 1326308 1330865 1326910 1317264 1303108 1285578 1267546 1251703 1238339 1226702 1216941 1208985
58541 1208985 1201094 1191274 1178712 1162456 1140515 1112143 1079497 1045337 1010581 975711 942698 913422
58529 913422 887539 863847 842532 824286 808550 794525 782831 774391 768627 764206 760522 757147
58517 757147 753152 748407 744272 741670 739709 737388 735181 733717 732471 731069 730247 730260 730022 729084 728655 729406
58501 729406 730259 730679 731984 734801 737426 738470 739042 740499 742165 743157 744318 746351 748203 749423 752004
58486 752004 757696 765534 774201 784642 797982 813084 828772 846453 867772 891574 915917 941196
58474 941196 968265 995005 1017619 1034064 1043728 1045407 1038566 1025335 1008612 989440 968549 948711
58462 948711 932691 920318 910336 903690 902177 905357 911761 921816 936492 954290 972613 991049
58450 991049 1010402 1029441 1045448 1056924 1063027 1061593 1050911 1032731 1010754 986941 961835 937312
58438 937312 915971 898448 883947 872626 865043 860267 856997 855566 856533 858694 860926 864439 870611
58425 870611 878291 886089 895490 908331 922772 935184 944695 952342 957077 956461 950584 941774 931029
58412 931029 918009 903860 890668 878639 866724 855304 845353 835887 825326 814476 805284 797730
58400 797730 790959 786108 784651 785154 785079 784724 786042 788808 791491 794644 799696 805440 809529 812411 816094
58385 816094 820118 822682 824729 828743 834299 838835 842223 846508 851744 856078 859448 863283 867114 869426
58371 869426 871315 875419 881780 888571 896157 906413 918772 931105 943912 959461 977344 995008
58359 995008 1012131 1030316 1049018 1065956 1080870 1094718 1105816 1111220 1111357 1109113 1105185 1098766 1091795
58346 1091795 1087631 1086111 1084647 1083443 1084772 1087963 1090457 1093273 1099999 1110755 1122466 1134784 1150161
58333 1150161 1168212 1185643 1201960 1219786 1239360 1258010 1275130 1292200 1307808 1318232 1323313
58322 1323313 1326344 1328082 1326383 1321794 1317733 1314881 1311193 1307580 1307621 1311324 1315235 1319050 1325979 1336203
58308 1336203 1346272 1355577 1367039 1380736 1393309 1404504 1417842 1433896 1449329 1463433 1479109
58297 1479109 1496443 1512005 1525529 1540641 1557925 1574050 1588810 1606034 1626283 1645665 1663257
58286 1663257 1682734 1705219 1727520 1748820 1772044 1797321 1821322 1844368 1870825 1901150 1931015
58275 1931015 1959560 1990717 2025142 2058859 2091282 2126418 2164801 2202679 2240513 2283502 2332176
58264 2332176 2381526 2430963 2485760 2546970 2609588 2672368 2739228 2808973 2874336 2933711 2993208
58253 2993208 3054633 3112596 3166262 3222418 3283686 3345383 3407397 3477075 3556567 3639464 3723843
58242 3723843 3816173 3918388 4024166 4132275 4250218 4380116 4514806 4652665 4801972 4965696
58232 4965696 5136996 5314967 5509051 5722224 5946423 6180662 6436252 6717419 7015071
58223 7015071 7327107 7665786 8037068 8433004 8853562 9314867 9826061 10380200 10978709
58214 10978709 11641508 12381464 13193871 14084229 15080480 16204294 17458925 18861394 20457270
58205 20457270 22288247 24380119 26783787 29594281 32910663 36819344 41441487 46950913
58197 46950913 53517690 61288468 70458687 81306965 94124447 109194004 126904861
58190 126904861 147826495 172666701 202347127 238133564 281037181 329995637 380024568
58183 380024568 422570206 448770729 453523721 437383727 405350839 364114586 319777061
58176 319777061 276808168 237901820 204293595 176298281 153803085 136458284 123572655
58169 123572655 113991935 106227603 98860607 90992549 82441497 73561717 64869351 56770106
58161 56770106 49497747 43150140 37714981 33100662 29194960 25902123 23130585 20781666
58153 20781666 18772421 17051017 15576061 14299850 13183817 12209784 11360998 10608312
58145 10608312 9927136 9311154 8756530 8247787 7771271 7327921 6920501 6541339 6183918
58136 6183918 5853641 5555648 5283443 5030000 4798811 4593740 4408586 4236364 4078360
58127 4078360 3934440 3794738 3651013 3507251 3369998 3237252 3105748 2980182 2865835
58118 2865835 2759848 2658284 2564168 2480425 2402505 2326032 2254466 2191518 2133254 2075319 2020768
58107 2020768 1973123 1928574 1882660 1837967 1797668 1757950 1714452 1670108 1629197 1589527 1547785
58096 1547785 1506896 1470814 1437369 1403344 1371380 1344882 1321158 1296443 1272782 1253178 1234825
58085 1234825 1214046 1193344 1176662 1161836 1144430 1125089 1106704 1088228 1067599 1047008 1029060
58074 1029060 1011343 990844 970092 952921 937730 920922 903563 888592 874790 859599 844936
58063 844936 834173 826000 817005 807726 800665 794865 787858 780469 774406 767613 757324 745385 735377
58050 735377 726745 716797 706233 697660 690717 683556 677085 673026 669806 665041 659953 656733 653706 647831
58036 647831 639988 633158 627309 620667 614087 609435 605341 599055 590936 582865 574067 562890 550921 540926
58022 540926 532302 522877 513553 506818 502186 497379 492521 489018 485804 480924 475470 471832 469465 466363
58008 466363 463149 461597 460686 458371 455856 455817 457769 459386 461027 464476 468441 469879 469035 468744 469451 469170
57992 469170 467759 466974 466668 465005 462241 460540 460256 459895 459314 459474 459506 457579 454291 451860 450405 448341
57976 448341 445867 444633 444434 443559 442004 441193 441111 440834 441156 443417 446418 447800 447798 448320 449128 448435 446607
57959 446607 445654 445538 444530 442783 441946 441550 439312 434893 430018 425111 419186 412878 408202 405366 402992
57944 402992 401220 401319 402518 402795 402785 405389 411367 418642 426177 435185 446160 457878 469816 482527
57930 482527 495183 505544 512766 517702 520336 519681 516216 511610 505905 497770 487607 477519 468046
57917 468046 457766 446304 434975 424317 413802 404121 396985 392383 388681 385524 383963 383785 383548
57904 383548 383287 384272 386016 386421 384999 383056 380748 377038 372590 369419 367453 364769 361608 360677 362824
57889 362824 365805 368207 371329 376090 381210 385630 389948 394292 397555 399860 403077 407727 411902 414391
57875 414391 416352 418772 420778 421700 422487 423857 425191 426355 428500 432098 436232 440571 445818 451478 455585
57860 455585 457530 458848 460420 461323 461316 461863 463650 465543 467098 469524 472982 475535 476134 476192 476631 475870 472469
57843 472469 467564 462854 458136 452740 447576 443857 441186 438551 436027 434127 432675 431513 431081 431358 431667
57828 431667 432323 434835 439570 444954 449863 454936 460527 465463 469118 472726 477158 481187 483470 484550
57814 484550 485323 485128 483030 479592 475731 471077 465075 458591 452919 448059 443220 438027 432083 424373 414367
57799 414367 402899 391124 379515 368613 359473 352436 346633 341489 337532 335044 333356 332229 332385
57786 332385 333773 334939 335202 335867 338164 341500 344928 348792 353624 358876 364122 370122 377245 384115 389249
57771 389249 392944 396153 398621 399474 398622 396306 392302 386855 381415 377097 373266 368765 363591 358293 352753
57756 352753 346870 341555 337805 335547 334465 335149 338283 343289 348736 353641 357842 361936 367263 374870
57742 374870 383903 392117 398355 403219 406999 408823 408701 408444 409328 410448 410611 410200 409856 408964 407007 404913
57726 404913 403391 401294 397419 392755 389174 386857 384741 382659 381350 380982 381129 381585 381943 381195 379002
57711 379002 376600 375167 374160 372441 370122 367960 365853 363373 361004 359551 359058 359405 361029 363824 366434
57696 366434 368034 369889 373671 379070 384472 389067 392884 395620 397055 397881 398670 398757 397525 395958 395415
57681 395415 395690 395846 396282 398333 402483 408564 417140 429120 444476 462877 485241 513325 548257
57668 548257 590783 642494 705553 781459 870356 969406 1069479 1154423 1206764 1215879 1181490
57657 1181490 1111527 1018598 916747 817495 726940 646791 577547 519513 471793 432610 400849
57646 400849 376037 357085 342516 331624 324001 318278 312883 307720 303612 300307 296604 292269 288354
57633 288354 285707 284410 284410 285337 286029 285595 284599 283873 282768 280164 276617 273652 271299 268285 264453 260989
57617 260989 258190 255004 251072 247424 244758 242657 240894 240001 240077 240459 240965 242187 244155 245932 246878 247197
57601 247197 247009 246026 244437 243022 242126 241406 240641 239817 238516 236302 233592 231054 228360 224839 221110 218566
57585 218566 217335 216343 215374 215368 216415 217142 216579 215183 213522 211329 208431 205375 202521 199578 196475 193714
57569 193714 191450 189225 186881 184712 182509 179575 175980 172691 170160 167904 165741 164208 163373 162407 160869
57554 160869 159351 158380 157650 156812 156109 155853 156132 157353 160115 164143 168193 171296 173274 173908 172705 169852
57538 169852 166470 163529 161285 159884 159466 159465 158866 157503 156151 155172 154126 152981 152485 152906 153537 154035 155195
57521 155195 157757 161243 164611 167386 169659 171604 173463 175435 177280 178564 179399 180358 181643 183001 184422
57506 184422 186038 187406 187848 187540 187316 187373 187159 186566 186082 185769 185192 184451 184052 183669 182298 179865 177419
57489 177419 175541 173834 172226 171346 171233 171087 170730 170920 171678 171766 170588 169278 169086 169808 170590 171153 171341
57472 171341 170503 168260 165119 161648 157847 153910 150658 148528 146919 145098 142880 139955 135759 130759
57458 130759 126798 125216 125404 125888 126010 125768 124970 123557 122183 121627 121990 122919 124052 124884 124949 124584 124764
57441 124764 125816 127121 128356 129930 131825 133155 133505 133594 134022 134433 134595 135116 136306 137403 137772 137870 138178
57424 138178 138237 137617 136822 136326 135669 134405 132991 131830 130444 128585 127131 126790 126876 126500 126036 126281 127080
57407 127080 128028 129636 132432 135631 138022 139518 140541 140570 138810 135854 133276 131853 131393 131874 133373
57392 133373 135099 135902 135759 135725 136522 138122 140431 143305 146065 148117 149980 152696 156360 160141 163614
57377 163614 167066 170541 173549 175705 176857 176698 175065 172503 169758 166861 163462 159800 156464 153404
57363 153404 150167 146999 144698 143332 142062 140445 139136 139037 140287 142254 144170 145723 147278 149387 151870
57348 151870 153797 154683 155205 156272 157972 159957 162165 164424 165966 166260 165840 165467 164956 163804 162420 161601
57332 161601 161185 160407 159314 158634 158302 157327 155228 152605 150175 148095 146290 144607 142645 140224 138032
57317 138032 136940 136721 136347 135566 135220 135789 136567 136629 135943 135167 134859 135168 135906 136786 137808 139329 141433 143544
57299 143544 145110 146282 147302 147697 146977 145816 145503 146283 147295 148139 149439 151614 154098 156259 158378
57284 158378 161183 164873 168959 172750 175750 177862 179435 180927 182545 184343 186425 188709 190709 192028
57270 192028 192829 193448 193836 193954 194394 195916 198515 201572 204755 208135 211562 214655 217348 219898 222430
57255 222430 225051 228203 232288 237092 242130 247290 252504 257143 260693 263848 267973 273475 279516 285350
57241 285350 291071 297011 303267 309988 317328 324879 331879 338135 344108 349939 355209 359909 364880 370821
57227 370821 377416 383951 390421 397599 406131 415848 425889 435416 444254 452835 461624 470889 481043 492567
57213 492567 505280 518206 530640 542882 555501 568581 582305 597485 614501 632254 649263
57202 649263 665414 681456 697159 711316 723540 734680 745277 754842 763056 770651 778603 787312
57190 787312 796967 807911 820161 833219 846837 861462 877626 895359 914362 934204 954142 973332
57178 973332 991419 1008534 1024690 1039829 1054518 1069762 1085806 1101755 1116713 1130834 1144949
57167 1144949 1159653 1175023 1190873 1206993 1223399 1240454 1258546 1277671 1297682 1318783 1341262
57156 1341262 1364857 1389040 1413896 1440043 1467566 1495639 1523318 1550221 1576353 1601866 1627210
57145 1627210 1652960 1679282 1705813 1732135 1757994 1783137 1807483 1831510 1855932 1880832 1905540
57134 1905540 1929460 1952708 1975939 1999986 2025750 2054038 2085306 2119737 2157599 2199331 2245283
57123 2245283 2295513 2349746 2407569 2468874 2534143 2603937 2678186 2756570 2839716 2929305 3026827
57112 3026827 3133049 3249069 3376951 3518740 3675721 3849357 4042345 4258283 4501249
57103 4501249 4776716 5092665 5459760 5891580 6405274 7020833 7758584 8637555 9676304
57094 9676304 10894903 12317590 13976663 15914052 18174840 20794673 23790778 27160604
57086 27160604 30882867 34919124 39218983 43719136 48315216 52812671 56909042 60254908
57078 60254908 62568741 63722826 63745892 62765430 60947256 58460545 55461189 52083671
57070 52083671 48441409 44633147 40748334 36869443 33073803 29433794 26012509 22857841
57062 22857841 20000402 17454746 15220138 13281837 11615776 10194222 8988017 7966718
57054 7966718 7100775 6364653 5736901 5198061 4730504 4320101 3956432 3631495 3339503
57045 3339503 3077260 2842900 2634123 2448411 2284092 2139530 2011792 1897636 1795485
57036 1795485 1704982 1625011 1553617 1489486 1431974 1380017 1332543 1289823 1252899 1221716 1195129
57025 1195129 1172716 1155245 1143387 1137327 1137758 1146087 1163642 1191990 1234331 1295048 1376090 1472473
57013 1472473 1570246 1648955 1688837 1679441 1623701 1534331 1426446 1312659 1202061 1100327 1009676
57002 1009676 929931 860378 800492 749362 705495 667411 634025 604675 579318 558407 541986
56991 541986 529246 519385 512327 508115 506325 506843 510492 518038 529245 543543 560463 578031 591628
56978 591628 596182 589611 573329 550152 523043 495271 469839 448187 430184 415384 403631 394828
56966 394828 389035 386553 387180 389934 394399 401653 412838 427618 445395 467309 495079 527638 560077
56953 560077 585935 599831 598812 583228 556811 524766 491328 459297 430871 407358 388369 372809
56941 372809 360695 352924 349575 349835 353467 360963 372356 387299 406428 431374 463249 501907 545926
56928 545926 591400 630790 655266 659576 644371 614113 574203 530044 486565 446920 411944 381363
56916 381363 355013 332766 314180 298715 285816 274762 265033 256784 250269 245006 240289 236249 233393
56903 233393 231375 229348 227378 226302 226285 226717 227567 229587 233117 237790 243473 250407 258465 267511 278467
56888 278467 292850 311289 333654 360342 391511 424604 454095 474463 482774 478755 464263 443188
56876 443188 420247 398723 379838 364292 353078 346518 344000 345335 351305 362349 377855 397332
56864 397332 421340 450814 486576 530037 583309 647660 721703 800368 874345 931203 959980
56853 959980 956816 926224 877072 818265 757475 700883 652085 611984 580748 559111 547462 545035
56841 545035 550998 565424 588644 620894 663369 718450 788044 872844 973574 1090381 1218096
56830 1218096 1342202 1441675 1497632 1500983 1454620 1370626 1264974 1152220 1042663 942555
56820 942555 855416 782641 723988 678636 645921 625015 614704 614025 622797 641294 670004 710002
56808 710002 762942 830205 911743 1004223 1098271 1177833 1225404 1230802 1195646 1129881 1045370 952652
56796 952652 860624 775870 701670 638617 586318 544229 511668 488025 472883 465556 465022 470686
56784 470686 482647 500992 525711 557662 598260 646724 697688 742069 770448 776394 758537 720936
56772 720936 671020 616063 561037 509008 461967 420646 384539 352979 325770 302592 282779
56761 282779 266090 252709 242033 232579 223679 216141 210541 205972 201306 196681 192838 189910 187764
56748 187764 186626 186364 185928 184485 182522 181023 180243 180051 180670 182077 183314 183374 182412 181363 180785 180660 180852
56731 180852 181212 181646 182399 183738 185225 186135 186679 187692 189004 189513 189280 189903 192124 194681 196502 198397
56715 198397 201354 204641 207032 208675 210254 211431 211671 211668 212359 213383 213955 214519 215959 217812 218792 218617
56699 218617 217937 216985 215683 214567 214251 214333 214124 213961 214522 215331 215351 214729 214594 215414 216785 218552 220868 223288
56681 223288 225012 225998 226944 228353 230343 232923 235658 237631 238602 239480 240693 241005 239246 236452 234710
56666 234710 234430 234301 233557 232674 232015 231311 230623 230508 231039 231645 231923 231764 230917 229400 228096 227986 228982 230372
56648 230372 232009 234021 235800 236439 236019 235485 235432 235878 236810 238019 238828 238898 238880 239347 239636 238746 236722 234151
56630 234151 231030 227321 223884 221467 219451 216988 214694 213612 213074 211353 208112 204599 201725 199545
56616 199545 198321 198296 198505 197566 195674 194238 193537 192456 190684 189428 189513 190255 190725 190860 190838 190516 189984 189792
56598 189792 190255 191202 192453 193811 194727 194877 194942 195937 197969 200527 203523 207021 210368 212915 215224 218276
56582 218276 221780 224597 226504 228110 229334 229590 229352 229924 231578 233361 234778 236200 237627 238577 239424
56567 239424 241394 244893 248996 252841 256536 260711 266247 274290 285402 298862 313891 330980 350388
56554 350388 369718 384853 393397 395820 393563 387933 380867 374577 369732 365312 360600 355967 351647 347329
56540 347329 343152 339605 336241 332011 327018 322365 318167 313413 307975 302989 298867 294665 289890 285283
56526 285283 281370 277822 274678 272626 271630 270902 270643 272095 275303 278463 280113 280441 279914 278325 275859
56511 275859 273494 271447 268680 264655 260216 256110 252100 248244 245520 244304 243583 242528 241600 241320 241131
56496 241131 240279 238769 236851 234613 232536 231302 230670 229855 229272 230353 233182 235924 237253 237799 238450 238874
56480 238874 238623 238279 238449 238775 238803 238801 239026 239252 239601 240656 242250 243370 243719 244061 244670 244959 245075 246188
56462 246188 248534 250778 252052 253009 254111 254561 253904 253109 253070 253408 253722 254540 256100 257575 258528 259786 261967
56445 261967 264456 266720 269160 271785 273483 273660 273184 272763 271835 270077 268472 267637 266509 264029 260930
56430 260930 258607 257302 256551 256400 256995 257900 258706 259469 259842 258967 256984 255402 255165 255563 255803 256294 257556
56413 257556 259253 261169 263765 266872 269255 270354 271087 272038 272367 271496 270401 270177 270676 271479 272818 274621
56397 274621 276018 276631 276914 276669 275054 272714 271752 272597 273098 272018 271172 272574 275524 278250 280482 282591
56381 282591 284015 284454 285073 286669 288161 288597 289002 290446 291895 291972 291305 291193 291355 290972 290542 290713 290591
56364 290591 289330 288181 288873 291053 293293 295518 298403 301366 303286 304410 305747 307305 308614 310095
56350 310095 312289 314583 316218 317607 319278 320637 321193 321753 322950 324008 324503 325703 328471 331452 333255
56335 333255 334851 337778 341555 344995 348549 352976 357039 358962 359116 359117 359425 359994 361892 365889 370588 374266
56319 374266 377454 381385 385227 387364 388235 389343 390486 390580 390172 390474 390925 390445 390182 392102 395590 398352
56303 398352 400203 403105 407777 413110 418859 426296 436014 447203 458977 470473 480055 486571 491108
56290 491108 495651 500485 504798 509017 514369 520791 527475 534818 543736 553713 563643 573804 584911 596203
56276 596203 606746 617625 630362 644213 657602 671254 687094 704890 722906 741203 761389
56265 761389 783686 807167 832472 861369 893956 929110 967426 1010985 1060440 1115134 1175903
56254 1175903 1245128 1324155 1413075 1512684 1624192 1747441 1881906 2028747 2189134 2361155
56244 2361155 2541252 2728085 2921915 3120571 3319101 3513062 3699053 3872176 4026189
56235 4026189 4156383 4259747 4332679 4371591 4375844 4347488 4288436 4200586 4088116 3956435 3809055
56224 3809055 3648349 3478835 3306416 3134578 2964420 2797928 2637792 2484401 2336639
56215 2336639 2195638 2064253 1942956 1829804 1724418 1628233 1540660 1458840 1381679 1310604
56205 1310604 1245913 1185904 1130060 1079594 1034285 992206 953080 918520 888444 860642 834440
56194 834440 811377 791727 773746 757023 743131 732282 722548 712996 704473 696920 689268 682304 678111
56181 678111 676244 673937 670455 667657 665921 663454 660116 658010 657483 656516 654906 655152 658209 662146 665924
56166 665924 670711 676496 681338 685076 690076 697239 704965 712983 723260 736087 749197 761937 776395
56153 776395 793232 810422 827457 846806 869809 894995 921822 952201 986922 1024507 1065102
56142 1065102 1111751 1166441 1228723 1299449 1381699 1476450 1581254 1694524 1816698 1945225
56132 1945225 2072365 2190043 2293740 2380919 2450402 2505386 2553060 2598780 2643103 2684703 2721638
56121 2721638 2748877 2759859 2752980 2732997 2704938 2670763 2632444 2592304 2547926 2491627 2417579
56110 2417579 2325632 2217335 2094009 1960973 1828158 1703334 1588691 1485575 1397103 1323711
56100 1323711 1261486 1207887 1164357 1130969 1103752 1080048 1061418 1048588 1038682 1030223 1025492 1025042
56088 1025042 1025184 1023941 1024194 1027851 1032220 1035292 1039226 1045388 1051351 1056007 1062178 1070985 1079328 1086140
56074 1086140 1095180 1108170 1121294 1132223 1144352 1160061 1176166 1190323 1205677 1224544 1243744
56063 1243744 1260962 1279474 1301497 1322922 1339942 1355073 1371353 1386353 1397397 1407113 1418413
56052 1418413 1429388 1438300 1448113 1461018 1474102 1485385 1498257 1515014 1532279 1547892 1565727 1588369
56040 1588369 1611803 1632958 1655484 1682208 1709101 1733036 1758334 1788944 1821248 1851393 1882596
56029 1882596 1918279 1955247 1990762 2028978 2073014 2118104 2160064 2202975 2250836 2299589 2345456
56018 2345456 2393076 2446993 2503144 2557410 2614270 2678142 2744617 2809459 2877603 2953770 3033172
56007 3033172 3111329 3193758 3285578 3381096 3474604 3571748 3678849 3791005 3902742 4020194
55997 4020194 4150183 4287680 4427162 4575695 4740999 4917444 5098222 5290129 5501375
55988 5501375 5726491 5959182 6208162 6483523 6779583 7088626 7418949 7781189 8170371
55979 8170371 8581002 9026060 9520536 10060834 10642153 11280627 11995112 12783895 13644862
55970 13644862 14601374 15681606 16891821 18240110 19766821 21520467 23527688 25824955
55962 25824955 28498090 31653358 35378694 39779140 45019906 51282814 58715809 67487827
55954 67487827 77857905 90126439 104576688 121565308 141636158 165490103 194003207
55947 194003207 228414978 270024666 318589988 370146951 416566523 448286562 458678873
55940 458678873 446804919 416871771 375551880 329387149 283401427 240755502 202980845
55933 202980845 170494819 143119648 120388092 101675534 86318804 73728717 63409318
55926 63409318 54919441 47879173 42004031 37085148 32939038 29405882 26376925 23779654
55918 23779654 21539172 19581698 17862845 16358845 15036033 13855852 12800607 11865963
55910 11865963 11033997 10278259 9588541 8966548 8402935 7881206 7398710 6961962 6565832
55901 6565832 6197323 5855043 5545441 5264092 4999248 4749801 4522114 4313074 4113296
55892 4113296 3923340 3750273 3591649 3438702 3291929 3158122 3035212 2915166 2799020
55883 2799020 2694323 2600220 2509197 2421358 2343231 2274460 2208936 2147298 2095645 2053528 2015310
55872 2015310 1981428 1955978 1934681 1907090 1869715 1826216 1776687 1718326 1655265 1596218 1542848
55861 1542848 1490721 1440447 1397261 1360556 1324424 1288041 1255532 1226186 1194872 1161879 1132697
55850 1132697 1108040 1083215 1057140 1032967 1009981 983878 955240 929204 906589 883498 859605
55839 859605 838635 820624 801751 782001 765206 751413 736780 721130 708158 698129 687740
55828 687740 677180 669966 665771 660659 654413 650407 648175 643449 635737 628672 622589 614013 602941 593491
55814 593491 586689 579573 572050 567682 566781 565567 563244 563369 567132 571781 576905 585695 598395 610669
55800 610669 620348 630206 642282 654598 664985 673159 677684 675794 667599 656042 641951 623729 602414
55787 602414 582032 564140 546865 530022 516311 506759 499778 495290 494823 496822 496955 493958 490532
55774 490532 487897 484556 481261 482052 489142 501506 519318 544648 576160 607582 632802 648516 651595
55761 651595 639209 613355 580852 547137 513727 482175 455588 434651 416513 399322 384135
55750 384135 371376 359511 348376 339748 333452 326927 319707 314243 311217 308205 304171 301160 300298 300275
55736 300275 301008 304509 310544 315481 317145 317061 316526 314363 310150 305793 302142 297564 291359 285105 279345
55721 279345 272636 265239 259895 257388 255147 251927 250098 251433 254294 257045 260812 266794 273982 281528
55707 281528 290404 300809 310697 318530 324733 329037 329421 325161 318056 309343 298444 285968 274604
55694 274604 265467 256789 247735 240310 235868 233023 230756 230302 232106 234065 234861 236099 239234 243217 247120
55679 247120 252263 259671 267964 275540 282350 287983 290809 290738 290023 289635 287672 283117 278304 275688 274919
55664 274919 274932 276080 278174 279271 278669 278598 280833 284085 286739 289550 293432 297120 299472 301770 305352
55649 305352 308898 310282 309290 306633 302211 296174 289724 283126 274938 264872 255185 247598 241103 234462
55635 234462 228308 222980 217024 210078 204595 202223 200849 197861 194083 191727 190482 188580 186098 184309
55621 184309 183014 181160 179102 177895 177232 176129 174664 173200 170978 167289 163081 159787 157635 156375
55607 156375 156331 157321 157991 157624 157134 157071 156374 154470 152664 151918 151214 149735 148613 148672 148527 146943 145123 144546
55589 144546 144394 143409 142550 143337 144970 145478 144599 143433 142435 141727 142190 144270 146761 148525 150156 152354
55573 152354 154240 155169 156604 160049 164567 168473 172129 176862 182398 187639 192831 198661 204128 207458
55559 207458 208350 207460 204683 199906 194504 190021 186139 181687 176812 172442 168626 165098 162442 161015 159853
55544 159853 158349 157754 159161 161379 162834 164239 167043 170403 172239 172534 173166 174869 176551 177358 177506
55529 177506 177243 176555 175601 174207 171550 167506 163362 159997 156583 152466 148833 146727 144790 141062 135907
55514 135907 131146 127382 124210 121994 121154 120584 118974 117032 116325 116637 116477 115488 114352 113068 111355 110074
55498 110074 110268 111426 112605 114345 117438 120742 122496 123034 123866 124797 124484 123312 123056 123881 124156 123259
55482 123259 122279 121847 121512 121374 122241 123847 124837 124829 124872 125618 126568 127291 127915 128309 128069 127302 126304 124726 122286
55463 122286 119825 118342 117502 116489 115626 115584 115688 114836 113532 113139 113577 113685 113472 114016 115349 116393 116880
55446 116880 117473 118104 118034 117518 117590 118173 118112 117153 116232 115781 115308 114673 114257 113885 113062 112249 112452 113594 114695
55427 114695 115500 116556 117853 118815 119423 120024 120304 119824 119151 118969 118563 116792 114216 112604 112646 113719 115424
55410 115424 117645 119503 120112 120123 120839 122110 122772 122638 122237 121183 118879 116399 115379 115336 114414 112622 111923
55393 111923 113070 114742 116029 117366 118672 118932 118216 117914 118307 117996 116400 114735 113796 112751 111088 109848
55377 109848 109853 110342 110436 110514 111126 111817 112081 112388 113400 115021 116973 119407 122358 125281 127549 128829 128924 128069
55359 128069 127259 127278 127517 126817 125258 123879 122894 121671 120293 119554 119442 119200 118880 119161 119615 118940 117173
55342 117173 115903 115907 116214 115891 115186 114467 113589 112809 112860 113661 114261 114419 114910 115958 116825 117241 117772 118468 118602
55323 118602 118130 117993 118552 119057 118982 118527 117650 116052 114323 113661 114196 115045 116025 117658 119428 119998 119461 119424
55305 119424 120397 121058 120673 120275 120635 120883 120067 118503 116756 114842 113160 112636 113160 113405 112957 113024 114307
55288 114307 115790 116539 117102 118165 119303 120069 120913 122060 122766 122550 121869 120838 118784 115903 113809 113383
55272 113383 113536 113137 112688 112990 113581 113748 113832 114264 114454 113884 113299 113569 114302 114670 114786 115176 115690 115898 115880
55253 115880 115876 115880 116147 117157 118538 119126 118658 118267 118685 119307 119684 120470 121963 123097 122992 122299 121933 121698 121225
55234 121225 121076 121717 122423 122392 122042 122126 122474 122584 122561 122556 122212 121514 121181 121384 121216 120334 119827 120398 121021 120667
55214 120667 120135 120684 121893 122412 122063 121718 121709 121727 121825 122219 122508 122095 121032 119728 118417 117613 118188 120097
55196 120097 121858 122271 121853 121662 121705 121544 121486 121951 122425 122300 122051 122416 123058 123173 122834 122604 122420 121900 121217
55177 121217 120683 120013 118989 118207 118233 118652 118900 119354 120544 121963 122683 122681 122608 122811 123414 124700 126546 128121
55159 128121 129013 129902 131307 132519 132651 131865 130613 128685 126113 124027 123304 123171 122496 121697 122011 123467
55143 123467 124937 125732 125952 125721 125263 125275 126146 127219 127712 127740 127589 126843 125372 124297 124630 125704 126236 126204
55125 126204 126321 126400 125830 125096 125237 126137 126764 126772 126545 126071 125239 124852 125848 127731 129169 129947 130956 132430
55107 132430 133635 134276 134864 135611 136078 136028 135645 134993 134180 133871 134678 136212 137566 138457 139008 138942 138079 137222
55089 137222 137430 138697 140332 142130 144074 145487 145826 145830 146516 147464 147551 146963 146878 147362 147256 146171 145021 144423
55071 144423 144051 143801 144225 145459 146827 147826 148466 148541 147641 146109 144969 144687 144754 144569 143882 142508 140594
55054 140594 139103 139018 140018 140823 140793 140258 139498 138472 137476 136942 136620 135984 135379 135694 136917 138076 138594 138679
55036 138679 138378 137418 136057 135095 134889 135203 135962 137177 138247 138413 137928 137792 138338 139003 139411 139664 139702 139460
55018 139460 139540 140663 142492 144017 144896 145360 145137 143843 142204 141371 141066 139915 137786 136184 136035 136573
55002 136573 136928 137371 138372 139629 140760 141990 143512 144942 145931 146638 147315 148087 149186 150627 151664 151558
54986 151558 150827 150635 150987 150839 150086 149978 151140 152596 153301 153429 153462 153181 152344 151491 151298 151792 152686 153713
54968 153713 154239 153385 151197 149009 148173 148887 150521 152353 153725 154250 154245 154396 154819 155089 155123 155158 154865 153618
54950 153618 151873 151073 151814 153180 154298 155383 156683 157540 157336 156524 155903 155566 155220 154923 154801 154575 153999
54933 153999 153436 153550 154746 157128 160544 164479 168422 172456 176967 181773 186380 191121 197094 204668 212960
54918 212960 221072 228995 236923 244460 250889 255505 257404 255797 250968 244226 236626 228408 219871 211823
54904 211823 204813 198727 193475 189220 185644 181951 178014 174660 172463 171158 170548 170839 171576 171425 169901
54889 169901 168366 168475 170351 173037 175965 179086 182190 185093 188208 192239 197529 204147 212088 220968
54875 220968 230002 238804 247621 256220 263133 266746 266799 264222 259800 253593 245490 235833 225517 215644
54861 215644 206917 199255 192222 185780 180266 175830 172460 170380 169681 169578 168937 167536 166006 164533 162666
54846 162666 160512 158899 158003 156932 155215 153654 153100 153230 153200 152678 151708 150282 148630 147225 146036 144534
54830 144534 142856 142087 142810 144216 145273 145962 146769 147709 148613 149674 150949 151889 152074 151919 152102 152712 153398
54813 153398 153853 153770 152969 151947 151601 152052 152472 152419 152434 152842 153006 152498 152053 152537 153705 154832 155908 157292
54795 157292 158757 159722 160098 160234 160397 160747 161313 161600 160869 159321 158320 158884 160604 162472 164030 165214
54779 165214 165965 166645 167962 169802 171030 171162 171371 173009 176049 179871 184635 190706 197511 204265 211382
54764 211382 220014 230383 241428 251760 260241 266100 269313 270432 269397 265202 257550 248100 239025
54751 239025 230892 223006 215170 207886 201259 195106 189940 186631 185015 183866 182334 180600 179104 177941
54737 177941 177096 176653 176675 177275 178649 180670 182823 184916 187384 190350 193010 194709 196202 199128 204501
54722 204501 212190 221348 230746 239309 246993 254473 261272 265143 264344 259760 253614 246787 238770 229691
54708 229691 220743 212706 205436 198913 193546 189286 185489 181863 178678 176013 173655 171802 170920 170842 170802
54693 170802 170453 170094 169835 169319 168319 167004 165587 164333 163727 163915 164142 163516 162242 161345 161242 161385 161195
54676 161195 160541 159415 157986 156999 157280 158699 160272 161316 161804 161718 160917 159742 158961 158860 158928 158559 157573
54659 157573 156070 154301 152733 151761 151351 151318 151751 152667 153520 153692 153338 153189 153648 154510 155389 155941 155953 155671
54641 155671 155650 155905 155784 155224 155318 156740 158398 158817 158268 158172 158785 158979 158204 157182 156451 155583 154265 153046
54623 153046 152585 152962 154019 155552 156882 157073 155950 154318 153018 152345 152399 153163 154052 154184 153419 152598 152559
54606 152559 153407 154811 156394 157771 158711 159375 160003 160510 160790 161101 161542 161543 160666 159551 159192 159557 159883 160061
54588 160061 160576 161202 161034 159972 159070 159168 160061 161215 162365 163178 163221 162581 161824 161240 160797 160747 161360 162062 161859
54569 161859 160765 159836 159702 160014 160438 161105 161828 161938 161329 160757 160772 161146 161549 161925 162016 161495 160841 161032 162106
54550 162106 163057 163447 163997 165162 166322 167031 168000 169986 172598 174964 176811 178159 178662 178146 177256 176765
54534 176765 176606 176238 175626 175280 175553 176333 177171 177420 176576 174784 172735 170946 169472 168335 167681 167449 167412
54517 167412 167595 168035 168286 167951 167667 168544 170468 172029 172378 172147 172141 172177 171804 171186 170626 169963 169056 168262 167937
54498 167937 168066 168681 169860 170974 170913 169543 168104 167635 167864 168203 168844 170094 171463 172233 172312 171892 171003
54481 171003 170064 170054 171334 172958 173927 174400 174969 175538 175842 176369 177706 179509 181026 182192 183323 184268 184805
54464 184805 185421 186723 188418 189770 190668 191337 191450 190651 189691 189852 191221 192472 192439 191099 189058 186904
54448 186904 185191 184292 184029 183892 183663 183394 182907 181876 180387 178950 177977 177558 177553 177536 176932 175720 174694 174485
54430 174485 174669 174394 173577 172794 172363 172291 172884 174460 176543 178183 179128 179923 180849 181599 182172 183263 185364
54413 185364 187983 190138 191218 191198 190426 189470 188837 188558 188237 187636 187006 186745 186986 187625 188560 189763 191250
54396 191250 192996 194759 196069 196606 196586 196604 197105 198142 199569 201179 202626 203466 203479 202925 202344 202014 201664
54379 201664 200928 200049 199796 200475 201415 201857 202030 202734 204126 205716 207439 209808 212848 215811 218240 220452
54363 220452 222555 223932 224331 224641 225754 227253 228040 227806 227017 225828 223920 221257 218288 215454 213133
54348 213133 211858 211872 212475 212400 210928 208310 205234 202323 199969 198189 196699 195448 194878 195259 196116 196773
54332 196773 197234 197916 198810 199541 200138 201038 202285 203343 203827 203940 204082 204420 204937 205585 206257 206840 207308 207568
54314 207568 207332 206393 204940 203399 202073 201113 200616 200441 200100 199181 197749 196146 194577 193157 192156 191799
54298 191799 191990 192414 192791 192871 192492 191918 191809 192525 193660 194486 194588 193905 192596 191201 190526 190968 192206 193786
54280 193786 195550 197221 198221 198404 198455 198965 199592 199735 199560 199602 199739 199363 198408 197477 197093 197340 198027 198654
54262 198654 198582 197858 197566 198621 200537 202172 203369 204869 206808 208419 209363 210335 211909 213577 214342 213799
54246 213799 212328 210652 209479 209210 209657 210182 210146 209169 207178 204618 202386 201123 200658 200489 200507 200756 200885
54229 200885 200657 200796 202413 205491 208740 211082 212569 213656 214338 214418 214101 213886 214126 214921 216077 217030 217138
54212 217138 216205 214511 212351 209947 207801 206556 206305 206392 206060 205051 203521 201767 200152 198922 197991 197129
54196 197129 196341 195752 195189 194391 193673 193856 195325 197446 199177 200030 200346 200794 201725 202864 203648 203935 204200
54179 204200 204827 205544 205909 206105 206750 208039 209596 211051 212248 212898 212649 211609 210352 209268 208318 207490
54163 207490 207055 207148 207409 207244 206307 204722 202951 201433 200224 199143 198312 198191 198808 199373 199142 198351 197787
54146 197787 197708 197700 197406 196829 196123 195637 195904 196998 198130 198532 198510 198895 199741 200440 200894 201566 202412 202840 202915 203490
54126 203490 204761 205708 205513 204759 204568 205177 206022 206766 207592 208774 210478 212834 215848 219353 223291 227833
54110 227833 233108 239086 245794 253269 261084 268227 273628 276578 276689 273931 268953 262918 256759 250801
54096 250801 245155 240027 235459 231163 226899 222801 219211 216402 214517 213526 213267 213713 215018 216916 218348
54081 218348 218416 217613 217370 218316 219727 220827 221796 223109 224668 226159 227695 229523 231451 233107 234478 235750
54065 235750 236838 237493 237758 237940 238190 238295 237863 236632 234753 232840 231567 231175 231452 232061 232666 232945 232941 233224
54047 233224 234216 235510 236501 237591 239954 243972 248650 252849 256393 259687 262963 266460 270748 276248 282656
54032 282656 289223 295402 301042 306334 311819 318014 324700 330915 335946 340004 343664 347017 349731 351633
54018 351633 352887 353809 354696 355624 356232 355998 354902 353507 352306 351253 350024 348279 345537 341302 335585
54003 335585 329016 322347 316150 310927 306835 303182 298899 293834 289030 285476 283217 281991 281907 282856 283817
53988 283817 283524 281618 278649 275288 272017 269314 267571 266816 266812 267289 267942 268492 268957 269579 270364 271068 271746
53971 271746 272839 274570 276947 280600 286860 296424 308382 320862 331973 339711 342039 338314 330377
53958 330377 321305 313015 305604 298663 292361 287277 283904 282385 282270 282534 282367 281976 282198 283393 285176
53943 285176 287201 289669 292955 297084 301746 306637 311677 316989 322569 327922 332293 335376 337481 338805
53929 338805 338991 337849 336138 335107 335410 336929 339407 342691 346423 350115 353690 357577 362189 367564 373528
53914 373528 379928 386628 393465 400307 407077 413786 420663 428105 436342 445170 454016 462127 468734 473310
53900 473310 475811 476541 475846 474192 472302 470607 468634 465644 461937 458660 455972 452371 446538 439120 431847
53885 431847 425441 419253 412540 405079 396761 387634 378419 370095 362783 355767 348813 342730 338274 335080
53871 335080 332168 329145 326421 324302 322310 319558 315713 311363 307338 303775 300175 296319 292663 289596
53857 289596 286781 283616 280074 276659 273743 271328 269318 267628 266137 264835 263902 263373 262962 262526 262476 263271
53841 263271 264666 265886 266496 266670 266668 266439 265822 264853 263782 262901 262246 261459 260177 258744 258157 258942 260409
53824 260409 261449 261840 262275 263213 264247 264687 264375 263760 263418 263654 264488 265901 267893 270190 272136 273320
53808 273320 274194 275503 277117 278191 278694 279947 283094 287710 292557 297169 301940 307164 312802 318900 325395
53793 325395 331687 337189 342128 347099 351998 356243 359947 363928 368426 372645 375811 377986 379508 380285
53779 380285 380023 378704 376432 373177 369025 364431 359871 355325 350355 344695 338623 332783 327633 323063
53765 323063 318650 314282 310345 307186 304640 302273 299869 297460 295100 292858 290842 288989 287018 284735
53751 284735 282189 279455 276652 274304 273126 273121 273417 273342 273110 272992 272461 270867 268545 266520 265424 265281 265937
53734 265937 266974 267616 267541 267522 268442 270013 271259 271936 272522 273064 273165 273022 273343 274161 274802 275204 276216 278273
53716 278273 280684 282613 283957 284955 285721 286570 288068 290316 292772 295093 297573 300471 303565 306675 309923
53701 309923 313204 316107 318727 321802 325617 329530 333131 337123 342322 348306 353806 358113 361441 364162
53687 364162 366336 367848 368559 368375 367499 366431 365437 364268 362692 360944 359399 358168 357359 357247 357710 357913
53671 357913 357185 355962 355258 355392 355860 356316 356939 357704 357964 357209 355909 355195 355689 356808 357271 356326 354498
53654 354498 353081 352857 353459 354062 354493 355352 357120 359454 361512 362759 363325 363694 364268 365218 366512 367930
53638 367930 369202 370347 371737 373615 375716 377708 379851 382680 386034 389091 391528 393955 396852 399785
53624 399785 402280 404794 407981 411527 414649 417440 420677 424446 427970 430843 433428 435921 438033 439863
53610 439863 442133 445102 448089 450596 453172 456529 460418 464032 467063 469750 472275 474739 477455 480660
53596 480660 484044 487035 489417 491214 492160 491810 490239 488240 486691 485883 485548 485292 484841 483896 481998 478876
53580 478876 474943 471111 467881 464931 461840 458863 456498 454719 453243 452209 451735 451068 449196 446324 443702
53565 443702 441781 439641 436726 434065 432961 433291 433981 434591 435511 436948 438659 440546 442667 444628 445615
53550 445615 445282 444256 443645 444182 445763 447621 449000 449763 450276 450777 451302 452271 454448 457953 461944 465810
53534 465810 470147 475828 482481 488811 494374 500222 507596 516592 526389 536330 546407 556981 568366
53521 568366 580620 593521 606720 620008 633416 647076 661106 675705 691266 708215 726641
53510 726641 746259 766927 789067 813101 838477 863905 888931 914686 942339 971263 999579
53499 999579 1026301 1051877 1076595 1099689 1120527 1139750 1158464 1177006 1195206 1213363 1232063
53488 1232063 1251236 1270103 1288119 1305538 1323086 1341393 1360637 1380461 1400273 1419746 1438863
53477 1438863 1457531 1475570 1493180 1510738 1527770 1542730 1554427 1563245 1570349 1576030 1579476 1579924
53465 1579924 1577291 1571707 1563194 1552043 1539073 1525245 1511187 1497104 1482884 1468277 1453210 1437927
53453 1437927 1422629 1406977 1390249 1372007 1352499 1332385 1312255 1292423 1273029 1254214 1236084
53442 1236084 1218491 1201069 1183697 1166862 1151330 1137584 1125930 1116936 1111178 1108423 1107588 1107715 1108596
53429 1108596 1110298 1112598 1115167 1117947 1121102 1124909 1129880 1136582 1145092 1154931 1165703 1177480 1190527
53416 1190527 1205140 1221811 1240950 1262243 1284897 1308708 1334188 1361387 1389410 1417487 1445784
53405 1445784 1474670 1504115 1534519 1567215 1603070 1641161 1679872 1719008 1759851 1803431 1849801
53394 1849801 1898798 1950366 2003913 2058314 2112915 2167995 2224037 2281036 2338608 2396219 2453134
53383 2453134 2508627 2562408 2614600 2665205 2713813 2759788 2802469 2841306 2876119 2907101 2934280
53372 2934280 2957179 2975283 2988565 2997180 3001018 3000019 2994497 2984468 2968925 2946534 2916906 2880585
53360 2880585 2838128 2790152 2738251 2684786 2631337 2577948 2524122 2469974 2416109 2363009 2311033
53349 2311033 2260771 2212992 2168249 2126555 2087306 2049605 2012880 1976982 1941459 1905183 1867446
53338 1867446 1829285 1792895 1759622 1729164 1700816 1674613 1650802 1628972 1608506 1589640 1573371
53327 1573371 1560310 1549964 1541133 1532625 1523524 1513101 1500850 1486693 1470981 1454212 1436818 1419348
53315 1419348 1402604 1387160 1372764 1358777 1345320 1333450 1323829 1315803 1308350 1301493 1296178 1293010
53303 1293010 1291822 1292292 1294269 1297549 1301969 1307836 1315687 1325563 1336996 1349798 1364368 1381139 1400165
53290 1400165 1421379 1444757 1470025 1496536 1523625 1550912 1578119 1604821 1630392 1654012 1674872
53279 1674872 1692656 1707826 1721119 1732727 1742116 1748501 1751251 1750073 1745217 1737496 1727776 1716450 1703500
53266 1703500 1688778 1671978 1652746 1631226 1608191 1584181 1558933 1532173 1504489 1476662 1448480
53255 1448480 1419235 1389211 1359619 1330933 1302368 1273328 1244484 1216901 1190760 1165475 1140593
53244 1140593 1116037 1091827 1067992 1044651 1021927 999930 978856 958832 939629 920899 902690
53233 902690 885347 868917 853223 838582 825808 815205 806113 797786 790238 783813 778264 772692 766229
53220 766229 758388 748941 737816 725179 711402 696879 681812 666117 649665 632770 616277 600909
53208 600909 586650 573109 560374 549080 539591 531518 524065 516545 508541 499952 490960 481733 472195
53195 472195 462317 452479 443097 433992 424618 414920 405553 397185 389964 383675 378015 372673 367453 362362
53181 362362 357397 352374 347262 342425 338139 334153 330267 327017 325050 324039 322993 321560 320203 319105
53167 319105 317843 316380 315496 315846 317155 318697 319985 320713 320533 319342 317479 315469 313760 312657 312029
53152 312029 311165 309511 307577 306484 306556 307038 307252 307246 307099 306442 305095 303537 302297 301335 300357 299271 298142
53135 298142 297166 296867 297697 299215 300271 300344 300130 300503 301516 302740 303993 305266 306390 307253 307998 308758 309570
53118 309570 310791 313111 316830 321436 326102 330270 333716 336538 339148 341764 343891 344863 344842 344557 344046
53103 344046 342580 339965 336953 334148 331477 329013 327256 326151 324851 322990 321206 319860 318286 315997
53089 315997 313592 311609 309494 306715 304045 302581 302175 301895 301548 301574 301893 301917 301507 300986 300458 299932 299830
53072 299830 300449 301217 301325 300934 300935 301694 302715 303407 303459 302663 301016 298898 296629 294167 291666 289823 289051
53055 289051 288851 288682 288847 289708 290653 290913 290893 291553 292793 293686 294113 294930 296535 298378 299993 301487 302907
53038 302907 303996 304689 305067 304840 303704 302102 300739 299488 297808 296130 295619 296465 297646 298548 299611 301017
53022 301017 302021 302169 302017 301994 301569 300393 299387 299682 301057 302380 303210 304100 305522 307249 308791 309888
53006 309888 310550 310928 311163 311220 311010 310780 311038 311988 313380 315068 317230 319764 321921 322976 322946 322292 321292
52989 321292 320174 319567 320179 321984 324194 326194 328174 330624 333434 335833 337201 337609 337332 336122 333543
52974 333543 330019 326988 325653 325958 327100 328562 330182 331697 332925 334243 336168 338556 340769 342573
52960 342573 344265 345958 347337 348168 348536 348578 348401 348170 347785 346692 344634 342371 340877 339995 338818 337265
52944 337265 336188 335814 335290 334133 332953 332164 331095 329240 327451 326823 327046 326969 326364 325985 326065 325915 325159
52927 325159 324406 324312 324612 324549 323845 322915 322344 322441 323114 323970 324599 324871 324936 324932 324818 324538 324270 324359 325001 325977 326780
52906 326780 327030 326748 326246 325858 325835 326270 326888 327024 326127 324364 322531 321361 321058 321406 322072 322854 323821 325166
52888 325166 326707 327675 327376 326036 324621 323817 323520 323332 323142 323189 323858 325431 327659 329584 330253 329757 329232
52871 329232 329761 331651 334769 338931 343655 348020 351267 353380 354805 355816 356354 356258 355422 353847 351693
52856 351693 349083 345810 341531 336474 331677 328219 326287 325081 323515 320961 317573 314008 310745 307700
52842 307700 304632 301759 299567 298095 296952 296070 295836 296223 296384 295589 294227 293333 293310 293555 293354 292787 292598
52825 292598 293338 294762 296128 297025 297707 298473 299002 298694 297579 296402 295784 295720 296005 296706 298033 300005 302387
52808 302387 304634 305926 305768 304709 303990 304240 304890 305062 304570 303781 302947 302077 301121 299903 298148 295928 293835
52791 293835 292355 291339 290395 289581 289297 289680 290465 291309 291922 292034 291604 291052 290985 291604 292545 293251 293446 293314
52773 293314 293337 293808 294419 294481 293674 292455 291648 291723 292477 293226 293280 292479 291333 290551 290460 290977 291874 292715 292849 292155
52753 292155 291661 292678 295184 297748 299209 299691 299833 299936 300325 301608 303769 305696 306422 306431 306941 308372 310332
52736 310332 312688 315562 318408 320159 320513 320300 320396 320915 321700 322882 324625 326767 329058 331387 333563 335196
52720 335196 336020 336056 335338 333919 332247 331076 330590 330015 328538 326389 324595 323728 323398 323001 322571 322597 323216
52703 323216 323904 324008 323380 322413 321639 321407 321799 322614 323391 323672 323355 322744 322205 321903 321836 322011 322452 323071 323527
52684 323527 323270 321963 320032 318563 318278 318742 318971 318729 318675 319167 319509 318770 316996 315253 314631 315375 316798
52667 316798 317865 318060 317863 318206 319447 321115 322612 323681 324151 323862 323154 322893 323597 324974 326663 328903
52651 328903 331912 335127 337758 339795 341793 343839 345434 346244 346270 345345 343271 340536 338196 336728 335608
52636 335608 334258 332881 332009 331721 331773 332176 333170 334682 336245 337481 338502 339845 342060 345234 348638 350946
52620 350946 351092 349040 345686 342057 338728 335943 333915 332728 332031 331191 329887 328426 327415 327225 327821
52605 327821 328885 330003 330923 331790 332861 333879 334122 333369 332423 332171 332435 332442 332157 332337 333283 334396 335082 335342
52587 335342 335200 334413 333181 332405 332769 334134 336230 339152 342575 345320 346606 347181 348297 349938 351044
52572 351044 351182 350918 350596 349821 348428 347065 346345 345955 345046 343199 340759 338427 336625 335122 333315 331054
52556 331054 328991 327805 327375 327125 326975 327311 328167 329083 329809 330529 331299 331860 332103 332170 331953 331103 329780 328840
52538 328840 328871 329432 329643 329275 328928 329279 330426 331889 333062 333670 333921 334280 335176 336865 339243 341632 343116
52521 343116 343504 343725 344809 346683 348460 349705 350754 351877 352892 353762 354906 356721 359327 362932 367761
52506 367761 373289 378166 381413 383230 384223 384275 382766 379603 375418 370828 365974 360820 355546 350558 346276
52491 346276 342944 340503 338708 337392 336558 336164 336029 335980 335913 335654 335075 334462 334421 335262 336758 338656 341011
52474 341011 343691 345976 347248 347883 348915 350786 352970 354908 356841 359408 362792 366661 370783 375243
52460 375243 379964 384340 387614 389489 390117 389559 387578 384102 379623 374919 370440 366202 362136 358265 354535
52445 354535 350805 347138 343893 341338 339283 337272 335103 333014 331312 329957 328737 327808 327735 328741 330077
52430 330077 330626 330149 329507 329508 329964 330234 330238 330398 330823 331175 331354 331742 332586 333580 334299 334862 335952 338183 341461
52411 341461 344922 347660 349726 352204 356026 360877 365686 370115 375019 381423 389547 399048 409691 421245
52397 421245 432816 442615 448591 449417 445193 437430 428255 419335 411333 404163 397649 391964 387565 384631
52383 384631 382634 380708 378557 376740 375889 375975 376690 378122 380520 383628 386901 390372 394666 400046 406001
52368 406001 411897 417529 422807 427393 430929 433245 434093 433076 430191 426207 422231 418994 416671 415102
52354 415102 413965 413032 412527 413031 414762 417081 418966 419939 420389 421021 422182 423727 425410 427298 429719 432821
52338 432821 436390 440158 444071 448072 451942 455651 459629 464339 469786 475889 483080 491947 502409 513876
52324 513876 526158 539527 553849 568400 582759 597212 611965 626628 640829 654752 668640
52313 668640 682359 695973 710316 726410 744611 764709 786464 809466 832901 856166 879659
52302 879659 904282 930209 956683 983077 1009592 1036667 1064016 1090499 1114803 1136155 1154517
52291 1154517 1170229 1183518 1194324 1202575 1208454 1212338 1214579 1215398 1214895 1213149 1210421 1207168 1203585 1199256
52277 1199256 1193668 1187083 1180435 1174233 1168102 1161643 1155238 1149594 1145026 1141688 1140101 1140698 1142960 1145640
52263 1145640 1147953 1150184 1153176 1157746 1164597 1174197 1186355 1200218 1215100 1231245 1249531 1270399
52251 1270399 1293262 1317053 1341126 1365217 1388543 1409397 1426205 1438833 1448369 1455641 1460556 1463034
52239 1463034 1463934 1464446 1464806 1464059 1461029 1455266 1447196 1437610 1426961 1415036 1401436 1386351 1370530 1354375
52225 1354375 1337537 1319701 1301319 1283183 1265634 1248626 1232174 1216182 1200215 1184184 1169121
52214 1169121 1156427 1146228 1137150 1128040 1119288 1112095 1106840 1102757 1099070 1095977 1094340 1094574 1096036 1097581
52200 1097581 1098640 1099650 1101395 1104211 1107975 1112589 1118026 1123973 1129945 1135941 1142624 1150522 1159220 1167627
52186 1167627 1174904 1180816 1185252 1187878 1188557 1187734 1185911 1182772 1177360 1169322 1159566 1149355 1139146 1128753
52172 1128753 1118365 1108740 1100394 1093202 1086910 1081556 1077257 1074069 1072278 1072318 1074104 1076824 1079755 1082993
52158 1082993 1087078 1092163 1097794 1103168 1107302 1109335 1109083 1107212 1104661 1102079 1099952 1098789 1098793 1099682 1101223
52143 1101223 1103661 1107236 1111652 1116470 1121643 1127104 1132042 1135353 1136732 1136801 1136264 1135576 1135435 1136887 1140633
52128 1140633 1146646 1154636 1164550 1176464 1190334 1206036 1223472 1242604 1263582 1286746 1312050 1338489
52116 1338489 1364539 1389384 1413374 1437147 1460705 1483579 1505523 1526609 1546863 1566237 1584985
52105 1584985 1603769 1623239 1643652 1664992 1687291 1710635 1734808 1759130 1782733 1804923 1825146
52094 1825146 1842788 1857252 1868099 1874818 1876570 1872694 1863606 1850778 1835573 1818465 1799527 1779172
52082 1779172 1757987 1736288 1714402 1693127 1673321 1655111 1637941 1621317 1605110 1589277 1573826
52071 1573826 1559116 1545774 1534303 1525022 1518248 1514081 1512075 1511645 1512843 1516375 1522820 1532198 1544251
52058 1544251 1558557 1574332 1590742 1607789 1626432 1647407 1670166 1693226 1715305 1735776 1754231
52047 1754231 1770153 1783104 1793027 1800149 1804619 1806321 1805044 1800858 1794263 1785966 1776520 1766202 1755152
52034 1755152 1743508 1731381 1718740 1705351 1690931 1675470 1659315 1642735 1625521 1607274 1588042
52023 1588042 1568218 1547884 1526792 1505182 1483955 1463626 1443693 1423580 1403724 1385023 1367590
52012 1367590 1350879 1334898 1320386 1307608 1295732 1283710 1271264 1258642 1245789 1232096 1216802
52001 1216802 1199502 1180417 1160233 1139590 1118772 1098122 1078565 1061290 1046827 1034659 1023706
51990 1023706 1012980 1001850 990043 977382 963403 947404 929154 909261 888555 867499 846663
51979 846663 827199 809905 793998 777817 760774 743782 727696 712441 698066 685610 676233 670112
51967 670112 666827 666298 668664 673615 680477 688662 697585 706468 714750 722364 729043 733643 734802 732280
51953 732280 727186 720995 714706 708772 703362 698645 695137 693722 695084 699396 706891 718383 734561 754884
51939 754884 777959 803204 831542 864067 900250 937501 971996 999698 1017322 1023299 1018208 1004093
51927 1004093 983170 957183 927695 896436 865005 834316 804566 775732 747938 721371 696148
51916 696148 672488 650858 631697 615043 600703 588767 579587 573095 568468 564896 562573 562551 565453
51903 565453 570624 576754 583137 590057 597928 606345 613999 619325 621178 619200 613827 605812 595564 583079
51889 583079 568694 553660 539527 527115 516482 507766 501467 497868 496838 498289 502192 507863 513992
51876 513992 519959 526577 534988 545281 556761 569054 582048 594937 606171 614440 619159 620169 617730
51863 617730 612877 607115 601485 596262 591509 587468 584420 582659 582616 584534 587933 591784 595206 597699 598994
51848 598994 599177 598665 597306 593771 586747 576729 565733 555206 545164 535409 526381 518300 510575 502847
51834 502847 495895 490784 487702 486194 485967 486794 488225 490041 492552 495678 498219 498811 497380 494970 492413
51819 492413 489874 487498 485663 484536 483976 483945 484611 486054 488237 491111 494306 496837 497689 496754 494836 492797
51803 492797 491041 489739 488995 488756 488923 489616 490980 492735 494317 495507 496613 497912 499190 499930 499721 498517
51787 498517 496746 495241 494748 495355 496548 497843 499161 500504 501559 501904 501534 500864 500198 499445 498618 498386
51771 498386 499685 502731 506951 512165 519273 529145 541094 553143 563774 572740 580194 585805 588993
51758 588993 589433 586971 581531 573451 563547 552628 541298 530330 520555 512102 504330 496920 490466 485596
51744 485596 482096 479423 477514 476389 475472 474103 472536 471789 472634 475280 479750 485913 493238 501107 509326
51729 509326 517877 526231 533334 538271 540632 540584 539077 537790 538269 540996 545449 550701 555481 558120 557337
51714 557337 553248 547175 540534 534366 529659 527224 526955 527681 528020 527104 524589 520519 515565 511155 509085
51699 509085 510698 515963 523075 529278 532585 532760 530614 526871 522137 517417 513866 512102 512168 513801 516094
51684 516094 517314 516031 512467 507994 503406 498529 493509 489391 486982 485934 485475 485516 486515 488641 491517
51669 491517 494666 497861 501123 504450 507607 510429 513656 519108 528363 541200 555750 569928 582079
51656 582079 590526 593755 591559 585407 577249 568474 560222 553837 550397 550175 553030 558856 567150 576526
51642 576526 585141 591456 594407 593450 589029 582574 575361 567450 558231 547792 537165 527259 518128 509354
51628 509354 500698 492265 484403 477733 472948 470306 469250 468709 467811 466331 464500 462493 460235 457651 454898
51613 454898 452210 449614 446965 444130 441030 437679 434440 432084 431222 431669 432611 433391 433953 434631 435850 437970
51597 437970 441083 444956 449446 454877 461752 470289 480632 493218 508145 524028 538111 547814 551954
51584 551954 550646 544885 536533 527963 520953 515956 512683 511121 511737 515047 521390 530930 543502 558480
51570 558480 574962 592138 609556 627304 646041 666517 688834 712226 735503 757656 778352
51559 778352 798410 819810 844686 874061 907688 944805 984319 1024141 1061092 1091910 1114088
51548 1114088 1125888 1126363 1115935 1096472 1070354 1039577 1005747 970277 934247 898595 864711 834256
51536 834256 807923 784846 763639 743535 724229 705313 686583 668486 651587 635814 620749
51525 620749 606331 592803 580300 568993 559230 550956 543359 535692 528106 521061 514363 507591 501152
51512 501152 495972 492253 489391 487035 485348 484126 482607 480413 477993 475874 474083 472550 471448 470796
51498 470796 470251 469657 469423 470033 471541 473739 476378 478982 480917 481992 482721 483654 484768 485774 486680 487694
51482 487694 488779 489677 490203 490188 489240 486899 483106 478388 473581 469406 466172 463698 461503 459083 456017
51467 456017 452020 447144 441930 437052 432777 428936 425455 422540 420300 418513 417000 415959 415705 416218 417136
51452 417136 418054 418733 419204 419888 421474 424499 429037 434831 441601 449202 457740 467681 479706 494291 511383
51437 511383 530338 549784 567552 581351 590058 594358 595929 596134 595550 594159 591334 585774 576219 562648
51423 562648 546623 530309 515342 502506 492012 483734 477338 472441 468624 465329 462064 458943 456754
51410 456754 456179 457017 458439 459888 461359 462925 464463 466023 468030 470749 473752 476340 478448 480799 484148
51395 484148 488648 494103 500522 508158 517040 526749 536777 547000 557765 569606 583038 598587 616832
51382 616832 638231 662953 691036 722752 758703 799495 845322 895780 949987 1006903 1065679
51371 1065679 1125389 1183882 1236815 1278553 1304784 1314318 1308295 1288188 1255209 1211240 1159238 1102236
51359 1102236 1042427 981397 920762 862169 807015 756449 711252 671442 636398 605825 580262
51348 580262 560215 545038 533222 523616 515788 509295 503335 497403 491824 487302 484149 482121 480692
51335 480692 479209 477060 474037 470524 467078 463835 460486 456875 453389 450636 448752 447155 445078 442328
51321 442328 439428 436970 434994 433180 431510 430379 429973 429900 429762 429817 430708 432579 434951 437581 440945 445430
51305 445430 450334 454214 456292 457116 457684 458326 458675 458403 457530 456059 453755 450471 446543 442719 439616 437237
51289 437237 435011 432438 429706 427530 426368 426019 426140 426870 428683 431836 436309 442189 449740 458983 469383
51274 469383 479877 489071 495588 498700 498755 496912 494420 492152 490495 489292 488107 486957 486739 488479 492167
51259 492167 496644 500553 502988 503457 501874 498757 494876 490573 485869 481236 477539 474939 472479 469169
51245 469169 465035 460728 456639 452900 449851 447960 447402 448048 449606 451455 452695 452870 452450 452221 452344 452322
51229 452322 451677 450278 448234 445938 444044 442983 442529 442176 441794 441566 441427 441020 440222 439362 438880 439054 440033
51212 440033 441830 444198 446701 448976 450953 452952 455675 459809 465350 471401 476836 481194 484901 488748
51198 488748 493244 498251 503154 507422 510890 513296 513861 512001 508382 504486 500964 497236 492994 489118
51184 489118 486524 484949 483684 482859 482976 483699 484149 484173 484358 484917 485459 485774 485905 485461 483784 480951 477811
51167 477811 474855 471777 468337 464946 462110 459919 458341 457521 457551 458320 459755 461793 464078 466152 467933
51152 467933 469535 470689 470964 470581 470316 470524 470941 471497 472526 473941 475020 475418 475717 476530 477611 478287 478333
51135 478333 478065 477935 478248 478886 479160 478516 477541 477540 478859 480294 480620 480012 479528 479870 481262 483884 487615 491694
51117 491694 495313 498339 500950 502998 504351 505514 507166 509263 511208 512841 514584 516613 518417 519364
51103 519364 519431 519325 520032 522105 525176 528283 530794 532797 534533 535924 536912 537731 538466 538738 538287 537470 536760
51086 536760 536172 535606 535296 535329 535236 534726 534399 534938 535952 536517 536619 537073 538112 539090 539712 540606 542333 544633
51068 544633 547068 549790 553246 557663 563185 570088 578506 588294 599496 612648 628422 647238 669290
51055 669290 694435 721653 748861 773469 793042 805770 811229 811226 809433 809472 813016 819427 826629 832328
51041 832328 835226 835698 835044 833713 830538 823978 813715 800808 786977 774364 765302 760971 759903 758445
51027 758445 753144 742784 728504 712705 697842 685467 675859 668692 664145 663053 665857 671919 680177
51014 680177 690148 701815 714739 727843 740215 751742 762715 772948 781588 787833 791706 793972
51002 793972 795357 795907 795130 792590 788291 782698 776525 770443 764732 759306 754245 750238 748151 748161 749708
50987 749708 752457 756917 763797 773049 783944 795963 809153 823761 840060 858676 880547 906207
50975 906207 935350 967344 1001696 1037581 1073265 1106964 1138653 1170624 1205890 1246223 1291847
50964 1291847 1342577 1398620 1460310 1527639 1600315 1677942 1759829 1844810 1931517 2018755 2105311
50953 2105311 2189501 2269230 2342550 2407893 2463817 2509054 2543196 2566970 2581363 2586583 2582444 2569790
50941 2569790 2551002 2528881 2505408 2481736 2458662 2436327 2413658 2388972 2361456 2331732 2300811
50930 2300811 2269015 2236266 2202943 2169741 2136620 2102401 2065674 2025784 1982677 1936070 1885386
50919 1885386 1830624 1772980 1714306 1656105 1599181 1543985 1490934 1440411 1392833 1348771 1308699
50908 1308699 1272490 1239413 1208788 1180402 1154179 1129747 1106679 1085014 1065202 1047477 1031529
50897 1031529 1016788 1002926 990120 978930 969854 962962 957994 954797 953376 953438 954170 954787 955120 955464
50883 955464 956111 957329 959506 962939 967577 973343 980546 989529 1000075 1011628 1024062 1037753 1052838
50870 1052838 1068925 1085630 1103024 1121473 1141421 1163388 1187711 1214152 1242138 1271583 1303138
50859 1303138 1337557 1375280 1416820 1463071 1514906 1572839 1637442 1709847 1791519 1883689 1987166
50848 1987166 2102450 2229757 2369099 2520451 2683551 2857386 3040222 3230289 3426100
50839 3426100 3625936 3827405 4027693 4223587 4410718 4583174 4734551 4859518 4954447 5017419
50829 5017419 5048515 5049886 5024680 4975692 4905471 4817612 4717246 4610112 4501551 4396390 4299018
50818 4299018 4212961 4140251 4081013 4033301 3993351 3956584 3918794 3876438 3826189 3765006 3691023
50807 3691023 3604002 3504617 3393582 3271760 3140811 3003268 2862002 2719795 2579201 2442524
50797 2442524 2311859 2189317 2076963 1976186 1887069 1808650 1739903 1680334 1629681 1587357
50787 1587357 1552404 1523825 1500759 1482332 1467541 1455383 1445138 1436554 1429786 1425029 1421995 1419695
50775 1419695 1416836 1412533 1406674 1399647 1391880 1383661 1375170 1366453 1357318 1347340 1335985 1322834 1307907
50762 1307907 1291887 1275847 1260573 1246240 1232766 1220198 1208570 1197686 1187458 1178315 1170982 1165980
50750 1165980 1163726 1164905 1170162 1179403 1191900 1207197 1225481 1247036 1271872 1300113 1332212 1368498
50738 1368498 1408951 1453719 1503377 1558268 1617979 1682011 1750792 1825522 1907095 1995420 2089634
50727 2089634 2188485 2290514 2394238 2498413 2602123 2704653 2805216 2902602 2995014 3080464
50717 3080464 3157239 3223544 3276575 3312471 3327644 3320132 3289864 3238534 3169872 3089429 3003157
50706 3003157 2915913 2831414 2753042 2683795 2625390 2577906 2540367 2511404 2489489 2472993 2460076
50695 2460076 2448274 2434436 2415506 2389314 2354398 2309511 2254041 2188847 2115987 2037563 1955431
50684 1955431 1872008 1790572 1714188 1644641 1582564 1528145 1481339 1441744 1408757 1381987 1361433
50673 1361433 1347281 1339494 1337465 1340174 1346941 1357855 1373123 1392051 1413096 1434923 1456932 1478684
50661 1478684 1499379 1518291 1535449 1551533 1567266 1583100 1599306 1616109 1633750 1652511 1672601
50650 1672601 1693952 1716313 1739625 1764195 1790368 1818200 1847646 1879050 1913325 1951526 1994169
50639 1994169 2040969 2091252 2144532 2200562 2258891 2318690 2379084 2439311 2498484 2555608 2610109
50628 2610109 2661956 2710896 2755999 2796634 2833882 2870488 2909083 2949951 2989473 3020091 3032844
50617 3032844 3022038 2988771 2940199 2885412 2831890 2784530 2745962 2716849 2696559 2684368 2679864
50606 2679864 2682058 2688687 2696842 2703938 2707739 2705788 2695354 2673991 2640178 2593808 2536203 2469375
50594 2469375 2395128 2315068 2231313 2146382 2062051 1978831 1896932 1817338 1741532 1670574 1604929
50583 1604929 1544874 1490575 1441792 1397889 1358163 1322156 1289952 1262245 1239705 1222056 1208196
50572 1208196 1197477 1190381 1187497 1188305 1191651 1197076 1204955 1215418 1227904 1241972 1257913 1276161 1296372
50559 1296372 1317523 1338864 1360593 1383477 1407847 1433069 1458133 1482737 1507678 1534100 1562580
50548 1562580 1592909 1624396 1656121 1687161 1717021 1745886 1774326 1802811 1831704 1861626 1893513
50537 1893513 1928227 1966296 2008152 2054549 2106572 2165144 2230585 2302789 2381709 2467382 2559481
50526 2559481 2657398 2761238 2872352 2992213 3120785 3256508 3397740 3543350 3691645 3839555
50516 3839555 3983410 4120082 4246851 4360625 4458018 4536173 4593063 4627170 4637407 4623550
50506 4623550 4586508 4528061 4450379 4355735 4246640 4126411 3999729 3872441 3750639 3639772
50496 3639772 3544227 3467038 3409706 3372618 3355820 3359049 3380937 3418623 3468327 3525709 3585270
50485 3585270 3639954 3682113 3704987 3703406 3674014 3615821 3530615 3422310 3295809 3156429 3009710
50474 3009710 2860784 2713637 2571099 2435123 2306617 2185359 2071017 1964386 1867172 1780509
50464 1780509 1704198 1637347 1579143 1528747 1485015 1446808 1413547 1385221 1361922 1343438 1329326
50453 1329326 1319360 1313838 1313129 1316900 1324183 1334419 1347953 1365079 1385091 1406966 1430681 1457060
50441 1457060 1486416 1518188 1552019 1588248 1626766 1665674 1701459 1730356 1749703 1758740 1758709 1752040
50429 1752040 1741173 1728094 1714732 1703027 1694179 1688157 1684287 1682121 1681581 1682713 1685823 1691680 1701123
50416 1701123 1714440 1731439 1752125 1777064 1807081 1842893 1885087 1934112 1990013 2052175 2119436
50405 2119436 2190499 2264148 2339115 2413891 2486906 2556909 2623044 2684538 2740473 2789897 2831801
50394 2831801 2864716 2886501 2894952 2888702 2867369 2831051 2780060 2715390 2639269 2555147 2467118 2379093
50382 2379093 2294108 2214211 2141031 2076345 2021890 1978771 1947385 1927805 1919721 1921891 1932172 1948471
50370 1948471 1969379 1993456 2018002 2038958 2052114 2054355 2044057 2020911 1985788 1940710 1888564
50359 1888564 1832547 1775610 1720170 1668076 1620732 1579177 1543892 1514156 1487370 1459284 1425678
50348 1425678 1384569 1337123 1286550 1236216 1188648 1145620 1108323 1077126 1051534 1030760 1014377
50337 1014377 1002281 994096 988870 985551 983753 983849 986207 990433 995531 1000706 1005750 1010690 1015429 1019893
50323 1019893 1024226 1028625 1033201 1038278 1044581 1052749 1062703 1073761 1085317 1097119 1108923 1120237 1130549
50310 1130549 1139639 1147551 1154442 1160602 1166554 1173009 1180649 1190002 1201552 1215932 1233851 1255652 1281039
50297 1281039 1309589 1341692 1378998 1423946 1478668 1543288 1613602 1679724 1728175 1747561 1734042
50286 1734042 1692415 1632599 1564921 1497196 1433986 1377193 1327234 1284132 1247919 1218418 1195090
50275 1195090 1177226 1164177 1155371 1150248 1148186 1148459 1150455 1154106 1160005 1168815 1180586 1194728 1210472
50262 1210472 1227160 1244315 1261768 1279713 1298346 1317484 1336707 1355819 1374935 1394104 1412997
50251 1412997 1430939 1447185 1461310 1473434 1483833 1492141 1497151 1497557 1492591 1481858 1465173 1443222
50239 1443222 1418137 1392728 1369055 1348094 1330603 1317701 1310383 1308604 1310709 1313434 1312781 1305657 1291129
50226 1291129 1270285 1245219 1218318 1191895 1167579 1145880 1126569 1109283 1093470 1078279 1063285
50215 1063285 1049089 1036442 1024973 1013669 1002455 992258 983395 974989 966385 958093 950723 943780
50203 943780 936346 928409 920777 913942 907670 901491 895058 888136 880709 873106 865821 859248 853672 849188
50189 849188 845397 841493 836930 831856 826755 821956 817665 814146 811533 809689 808414 807642 807308 807298 807638
50174 807638 808404 809329 809892 809915 809658 809220 808361 807160 806236 805920 805747 805259 804908 805622 807769 811055 815165 820000
50156 820000 825456 831477 838328 846490 856451 868781 884131 902754 924306 948438 975351 1005282
50144 1005282 1037698 1071452 1105718 1140350 1175418 1210708 1245577 1279031 1310239 1339351 1367703
50133 1367703 1396821 1427318 1458882 1490838 1521939 1549728 1570816 1582197 1582215 1570564 1547910 1515705
50121 1515705 1476060 1431542 1384932 1338736 1294514 1252832 1214079 1179071 1148491 1122062 1098853
50110 1098853 1078243 1060045 1043830 1028859 1014805 1002005 990873 981472 973724 967525 962516 958211
50098 958211 954534 951689 949203 945608 939595 931307 922133 913397 905567 898572 892333 886763 881559 876377
50084 876377 871268 866738 863288 861018 859856 859898 861091 862676 863618 863969 865271 869065 875270 882555 890034
50069 890034 897907 906567 915889 925628 935814 946391 956881 966757 975748 983505 989386 993092 995251
50056 995251 996839 998122 998594 997938 996473 994527 991820 987934 983302 979238 976779 975687 974816 973451 972060
50041 972060 971747 973202 976325 980659 985972 992489 1000768 1011332 1024286 1039335 1056325 1075617 1097673
50028 1097673 1122381 1149158 1177794 1208767 1242397 1277859 1313415 1347624 1380003 1410477 1438583
50017 1438583 1463618 1485444 1504730 1522244 1538159 1552024 1562984 1569695 1570500 1564327 1551420 1532686
50005 1532686 1508309 1477548 1440071 1397061 1350808 1303688 1257801 1215087 1177166 1145027 1119019
49994 1119019 1098927 1083837 1072187 1062367 1053374 1044879 1036928 1029652 1022853 1015619 1006670 995324 981844
49981 981844 966669 949942 932181 914782 899029 884913 871608 858881 847252 836970 827788 819784
49969 819784 813521 809061 805540 802105 798665 795297 791528 786813 781448 776473 772792 770735 770290 771366
49955 771366 773854 777710 782972 789576 797286 806035 816158 827909 840690 852977 863183 870543 875243
49942 875243 877912 879156 879421 878989 877888 875914 872899 868913 864053 858094 850624 841538 831134 819657
49928 819657 807040 793315 779026 765076 752372 741746 733833 728630 725376 723151 721494 720350 719812
49915 719812 720223 722094 725404 729266 732832 736270 740287 744959 749767 754678 760383 767404 775775 785694
49901 785694 797647 811462 825927 839911 853350 866622 879337 890430 899299 906303 912079 916669
49889 916669 919279 918648 913718 904364 891652 877307 862709 848249 833550 818391 803454 790091
49877 790091 779195 770391 762481 754559 746497 738660 731600 725933 721920 719070 716559 714211 712753 713003
49863 713003 715198 719174 724737 731624 739541 748569 759248 771910 786109 800964 815911 830890 845846
49850 845846 860191 872748 882269 888277 891432 892936 893639 893873 893844 893436 891611 886719 877935 866099 852934
49835 852934 839794 827365 816039 806010 797214 789548 783045 777651 773144 769560 767377 766897 767668 768997
49821 768997 770883 774042 779019 785669 793536 802420 812427 823551 835285 846669 856852 865597 873138
49808 873138 879611 885003 889661 894272 898920 902437 903192 900504 895060 888165 881003 874531 869462 865825
49794 865825 862495 857500 849227 837644 824333 811169 798978 787550 776675 766712 758218 751535 746779
49781 746779 743788 741951 740605 739827 740388 742619 745727 748598 750953 753481 757214 763036 771322 781502
49767 781502 792225 802365 811738 820572 828664 835549 841232 846217 850873 855156 858832 861545 862785 862159
49753 862159 859679 855493 849431 841167 830813 819146 807307 796412 787197 779789 773943 769599 766889
49740 766889 765492 764518 763459 762767 762952 763568 763756 763545 763920 765776 769505 775435 783784 793924 804293
49725 804293 813363 820516 826135 831351 837681 846287 857349 870411 885146 901246 917750 933381 947848
49712 947848 962013 976240 988940 997298 999287 994848 985484 973127 959253 944688 930057 916313
49700 916313 904707 896365 892103 892416 897024 904212 911038 914727 913997 909310 902237 894675 888240 883943
49686 883943 882252 883283 886760 892011 898401 905774 914263 923787 934188 945720 958938 974233 992162
49673 992162 1014237 1042347 1076429 1112751 1144962 1167163 1176498 1173774 1162418 1146816 1130884 1117342
49661 1117342 1107550 1101717 1099677 1101949 1109734 1123074 1138837 1151195 1154596 1146400 1127262 1100044 1068648
49648 1068648 1036873 1007335 981188 958836 940409 925513 913282 903211 895574 890717 888427 888350
49636 888350 890438 894351 898873 902544 904669 905243 904265 901705 897865 893004 886768 878640 869004 859177 850331
49621 850331 842739 836062 829932 824229 819134 814924 811539 808588 806088 804795 805304 807098 809145 811200
49607 811200 813779 817040 820584 824389 828922 833996 838419 841298 843017 844357 845267 845286 844715 844535 845232 846332
49591 846332 847110 847180 846429 844965 843361 842482 842736 843673 844517 844938 845117 845300 845541 845880 846487 847567 849257 851696
49573 851696 855025 859151 863617 867973 872349 877450 883918 891873 901209 912086 924819 939334 954959
49560 954959 970608 984946 996584 1004602 1009003 1010386 1009143 1005327 999270 991845 983906 975899 968226
49547 968226 961534 956233 952161 949232 948126 949664 953524 958187 962257 965276 967186 967742 967045 966191 966660
49532 966660 969089 973063 978082 984244 991934 1001412 1013022 1027332 1044628 1064447 1086192 1110226 1137928
49519 1137928 1170360 1206770 1244136 1277833 1303138 1317272 1320918 1317738 1311887 1305827 1300491 1296862
49507 1296862 1296501 1300374 1307693 1316202 1323248 1326430 1323836 1314388 1298124 1275994 1249453 1220371 1191123
49494 1191123 1164190 1141276 1122638 1107223 1093567 1080828 1069172 1059216 1051188 1044797 1039851 1036597
49482 1036597 1035302 1035799 1037656 1040492 1043878 1047210 1050117 1052782 1055407 1057553 1058503 1058294 1057905 1058330 1059826
49467 1059826 1062086 1064684 1067325 1070087 1073629 1078659 1084967 1091375 1096953 1101910 1106972 1112260 1117257 1121627
49453 1121627 1125529 1129062 1131749 1132664 1131007 1126768 1120949 1114881 1109070 1102951 1096094 1089284 1083926 1080579
49439 1080579 1078675 1077607 1077466 1078528 1080606 1083259 1086376 1090334 1095749 1103238 1113282 1126154 1142013
49426 1142013 1160958 1182821 1206935 1232247 1257524 1281521 1303858 1326558 1353980 1389088 1428560
49415 1428560 1462441 1480159 1477579 1458572 1430796 1400847 1372783 1349210 1332173 1322762 1320494 1323735
49403 1323735 1331012 1341893 1356344 1373438 1391272 1408332 1424425 1440022 1455254 1469967 1484181
49392 1484181 1497721 1509769 1519569 1527370 1533825 1538585 1540399 1538723 1534304 1527843 1518980 1507163 1492904
49379 1492904 1477484 1461866 1446521 1432018 1419036 1407856 1398411 1390884 1385800 1383526 1384047 1387250 1392993
49366 1392993 1400779 1409722 1419009 1428204 1437050 1445240 1452533 1458769 1463492 1465704 1464347 1459051 1450277 1438821
49352 1438821 1425462 1411106 1396887 1383813 1372369 1362655 1354740 1348570 1343680 1339457 1335838 1333314 1332001
49339 1332001 1331114 1329691 1327583 1325295 1323088 1320719 1317992 1315053 1312137 1309557 1308039 1308704 1312597 1320612
49325 1320612 1333658 1351998 1373798 1394876 1410601 1418251 1417647 1410234 1398191 1383991 1369745 1356427
49313 1356427 1343890 1331591 1319044 1305710 1291142 1275631 1260455 1247124 1236383 1228045 1221631 1216998
49301 1216998 1214333 1213699 1214689 1216568 1218766 1221238 1224365 1228540 1233758 1239393 1244336 1247569 1248773 1248243 1246176
49286 1246176 1242332 1236593 1229505 1221767 1213338 1203613 1192597 1181413 1171359 1162805 1155396 1149149 1144887
49273 1144887 1143505 1145035 1148527 1152705 1156704 1160380 1164086 1168110 1172196 1175586 1177744 1179026 1180419 1182389
49259 1182389 1184123 1184299 1182678 1180740 1180710 1184320 1192541 1205887 1224239 1246487 1271033 1296791 1323081
49246 1323081 1348214 1368738 1380897 1383000 1376084 1362379 1343614 1320988 1296176 1271655 1249779 1231643
49234 1231643 1216897 1204613 1194354 1186659 1182606 1182885 1187200 1194468 1203510 1213424 1223450 1232896 1241454
49221 1241454 1249477 1257695 1266619 1276295 1286481 1296934 1307559 1318509 1330004 1341810 1352937 1362234
49209 1362234 1369428 1375418 1381518 1388692 1397530 1408507 1421865 1437403 1454624 1473034 1492159 1511478
49197 1511478 1530566 1549217 1567236 1584317 1600285 1615229 1629107 1641493 1652097 1661393 1670221 1678800
49185 1678800 1686546 1692857 1697683 1701344 1704403 1707930 1713419 1722068 1734351 1750408 1770429 1794399 1821950
49172 1821950 1853028 1888545 1929967 1978404 2034245 2096987 2164242 2230713 2289059 2332759 2358596
49161 2358596 2367011 2361121 2345858 2327093 2309929 2296890 2287694 2280783 2274947 2269721 2264949 2260606 2257017
49148 2257017 2254932 2255179 2258199 2263837 2271553 2280949 2292140 2305512 2320959 2337526 2354022 2370014 2386067
49135 2386067 2403002 2421109 2440094 2459560 2479310 2499247 2519184 2538869 2558196 2577350 2596688
49124 2596688 2616392 2636255 2655959 2675739 2696659 2720066 2746656 2776202 2808251 2843051 2881767
49113 2881767 2925885 2976586 3034718 3101279 3177820 3266582 3370805 3495524 3647987 3835490
49103 3835490 4059413 4308456 4558446 4783971 4976447 5152649 5341185 5553650 5764977
49094 5764977 5923043 5982126 5932776 5804292 5640695 5472101 5302850 5120449 4913272 4682180
49084 4682180 4440139 4204268 3988373 3800175 3642113 3512949 3409125 3326202 3260114 3207576
49074 3207576 3165693 3131651 3102880 3077355 3053750 3031512 3010819 2992281 2976462 2963540 2953170
49063 2953170 2944543 2936706 2928997 2921192 2913225 2905000 2896567 2888171 2879870 2871391 2862720 2854649 2848219 2843668
49049 2843668 2840417 2838183 2837634 2839657 2844210 2850015 2855054 2857251 2855114 2848309 2837775 2825209 2812418
49036 2812418 2800990 2792113 2786307 2783374 2782881 2784746 2789289 2796739 2806725 2818153 2829576 2839829 2848469
49023 2848469 2855570 2861058 2864459 2865450 2864556 2863091 2862318 2862715 2864030 2865950 2868685 2872796 2878390 2884635 2890370
49008 2890370 2895207 2899793 2904949 2910861 2917256 2923972 2930950 2937834 2944052 2949338 2953894 2957919 2961201 2963280
48994 2963280 2963907 2963219 2961547 2959103 2955856 2951712 2946817 2941573 2936263 2930763 2924800 2918419 2912036 2905921
48980 2905921 2899751 2892746 2884290 2874541 2864465 2855142 2846855 2838840 2830023 2819921 2808716 2796709 2784058
48967 2784058 2771081 2758419 2746653 2735909 2726058 2717266 2710230 2705881 2704906 2707469 2713310 2722080 2733541
48954 2733541 2747340 2762776 2779143 2796430 2815432 2836936 2860980 2887091 2914975 2944554 2975436
48943 2975436 3006735 3037508 3067038 3094761 3120492 3145030 3170087 3197106 3226297 3257137 3289529
48932 3289529 3323933 3360516 3398892 3438845 3480643 3524385 3569625 3616115 3664493 3715651 3769672
48921 3769672 3826006 3884522 3945715 4009782 4076022 4143290 4210622 4277300 4342882 4407469 4471581
48910 4471581 4535495 4598988 4661852 4724171 4785704 4845394 4901996 4955015 5004706 5051443 5095581
48899 5095581 5137593 5177578 5214567 5246978 5274035 5296338 5314931 5330272 5342377 5351476 5357981 5361962
48887 5361962 5363105 5361265 5356779 5350116 5341314 5329819 5314951 5296582 5275349 5252039 5226787 5199074
48875 5199074 5168505 5135221 5099381 5060519 5017786 4970765 4919814 4865717 4809245 4751060 4691745
48864 4691745 4631875 4572153 4513487 4456721 4402209 4349822 4299519 4251738 4207021 4165308 4125862
48853 4125862 4088025 4051892 4018055 3986736 3957471 3929717 3903570 3879688 3858644 3840562 3825308
48842 3825308 3812773 3802941 3795875 3791657 3790155 3790858 3793243 3797378 3803922 3813390 3825651 3840248 3856902
48829 3856902 3875434 3895454 3916473 3938252 3960672 3983303 4005420 4026609 4047211 4068058 4089817
48818 4089817 4112560 4135832 4159079 4182095 4205102 4228400 4251998 4275600 4298881 4321689 4344032
48807 4344032 4365967 4387483 4408574 4429568 4451317 4474688 4499687 4525464 4551481 4578393 4607256
48796 4607256 4638009 4669241 4699433 4727964 4754765 4779533 4801704 4820955 4837441 4851558 4863694
48785 4863694 4874171 4883283 4891344 4898545 4904576 4908413 4908740 4904650 4895720 4881501 4861383 4835247 4803896
48772 4803896 4768525 4729882 4688202 4643704 4596781 4547728 4496637 4443664 4389162 4333513 4277034
48761 4277034 4220121 4163280 4106838 4050724 3994754 3939171 3884778 3832462 3782642 3735348 3690772
48750 3690772 3649448 3611663 3576872 3543975 3512133 3481168 3451348 3423209 3397593 3375347 3356682
48739 3356682 3341144 3328459 3319147 3313898 3312497 3313728 3316308 3319634 3323649 3328356 3333595 3339130 3344808
48726 3344808 3350722 3357246 3364801 3373497 3383072 3393235 3404005 3415601 3427908 3440132 3451121 3460158
48714 3460158 3467333 3473039 3477322 3480077 3481744 3483310 3485403 3487768 3489894 3491848 3494134 3497018 3500381 3504137
48700 3504137 3508322 3512805 3517284 3521639 3526022 3530571 3535365 3540731 3547275 3555408 3565037 3575807 3587392
48687 3587392 3599278 3610515 3620150 3628085 3635297 3643001 3651686 3661135 3671257 3682501 3695316 3709513
48675 3709513 3724429 3739498 3754313 3768433 3781793 3795416 3811147 3830486 3853974 3881608 3912841
48664 3912841 3945507 3975269 3997052 4007121 4003602 3985585 3952710 3905758 3846924 3779174 3705506
48653 3705506 3628751 3551460 3475696 3403125 3335311 3273643 3218883 3171079 3129936 3094928 3065066
48642 3065066 3038895 3014894 2991744 2968380 2944305 2919904 2896027 2873109 2850986 2829652 2809674
48631 2809674 2791564 2775051 2759215 2743142 2726330 2708761 2690832 2673004 2655353 2637671 2620154
48620 2620154 2603756 2589580 2578021 2568658 2560912 2554650 2550156 2547559 2546351 2545740 2545618 2546802 2549783 2553369
48606 2553369 2555204 2553734 2549218 2542767 2535109 2526660 2518140 2510551 2504726 2501205 2500193 2501201 2502976 2504211
48592 2504211 2504237 2502755 2499235 2493062 2484160 2473084 2460486 2446690 2431660 2415110 2396824 2377057 2356438
48579 2356438 2335215 2312985 2289641 2266282 2244526 2225035 2207364 2191327 2177676 2167091 2159171
48568 2159171 2153039 2148623 2146636 2147365 2150065 2153675 2157547 2161134 2163320 2162596 2157830 2148573 2134789 2116896
48554 2116896 2096166 2074514 2053389 2033171 2013967 1996617 1982236 1970761 1960567 1949684 1937043
48543 1937043 1922542 1906491 1889456 1872321 1855923 1840529 1825827 1811533 1797961 1785986 1776396
48532 1776396 1769232 1763849 1759707 1756920 1755844 1756475 1758666 1762850 1770050 1781181 1796735 1816981 1841635
48519 1841635 1868766 1894294 1913066 1920923 1916400 1901336 1879970 1856809 1834765 1815107 1798710 1786572
48507 1786572 1779111 1775824 1776072 1779730 1786790 1796873 1809459 1824082 1840012 1856438 1873491 1892302
48495 1892302 1913063 1933109 1947569 1952042 1944666 1926452 1900558 1871025 1841068 1811976 1783618 1755812
48483 1755812 1728878 1703217 1679119 1657074 1637743 1621484 1608173 1597532 1589206 1582498 1576456 1570443
48471 1570443 1564458 1558884 1554130 1550530 1548229 1547014 1546393 1545943 1545533 1545328 1545751 1547399 1550665 1555346 1560791
48456 1560791 1566561 1572785 1579682 1586720 1592445 1595332 1594793 1591259 1585441 1577902 1569359 1560777 1552708 1544894
48442 1544894 1536915 1528899 1521010 1512603 1502686 1491144 1478771 1466144 1453244 1440205 1427562 1415571
48430 1415571 1404068 1393215 1383571 1375084 1366882 1358527 1350737 1344359 1339256 1334762 1330574 1326590 1322374
48417 1322374 1317458 1311926 1306221 1300654 1295322 1290194 1284982 1279363 1273497 1267900 1262672 1257483 1252427 1248100
48403 1248100 1244588 1241200 1237585 1234290 1231736 1229436 1226732 1223565 1220109 1216421 1212921 1210343 1208642 1206703
48389 1206703 1203663 1199796 1195723 1191733 1188359 1186510 1186324 1186808 1187275 1188237 1190288 1193133 1196249 1199427 1202044
48374 1202044 1203129 1202952 1203310 1205463 1208984 1213333 1219002 1226210 1234162 1242835 1253995 1269198 1288273 1310851
48360 1310851 1337347 1366733 1395019 1417898 1433704 1442577 1444771 1441772 1437164 1433986 1432492 1432364 1435262
48347 1435262 1443001 1454969 1469805 1488018 1510576 1536779 1566000 1599669 1639013 1683016 1731388
48336 1731388 1787114 1852938 1927878 2010733 2104464 2213470 2339621 2485214 2656856 2861921
48326 2861921 3104858 3392195 3737150 4153374 4648975 5233919 5928117 6754168 7729438
48317 7729438 8876887 10237611 11864452 13824078 16229834 19231781 22864278 26819086
48309 26819086 30391242 32748036 33350133 32188063 29686909 26431555 22941731 19580849
48301 19580849 16552855 13935721 11730980 9907447 8420455 7216206 6240738 5450494
48293 5450494 4811477 4292329 3865117 3510706 3217086 2973127 2768072 2595012 2449887
48284 2449887 2327808 2223715 2135082 2060477 1996867 1941367 1893914 1855089 1822940 1795020 1771856
48273 1771856 1755170 1744058 1736004 1730401 1728062 1728397 1730051 1733421 1739679 1748022 1756475 1764803 1774313 1785464
48259 1785464 1798044 1813102 1832380 1855928 1881786 1907274 1928921 1942311 1944349 1935598 1919072 1897556
48247 1897556 1873453 1849806 1829147 1811855 1797287 1785706 1777457 1771271 1765418 1759816 1755239 1751300
48235 1751300 1747161 1743452 1741478 1741071 1741098 1741441 1742486 1743160 1741532 1737094 1730674 1722477 1712049 1699819 1686759
48220 1686759 1672662 1656485 1638197 1618536 1597078 1572353 1543928 1512811 1479844 1445245 1409697
48209 1409697 1374335 1339487 1304791 1270584 1237890 1207069 1177701 1149732 1123468 1098597 1074532
48198 1074532 1051592 1030560 1011254 992934 975965 961551 949724 938985 928112 917186 906757
48187 906757 897178 888811 881705 874952 867401 859102 851145 844185 838157 833163 829444 826519 823488 820169
48173 820169 816993 814039 811243 809200 808475 808329 807451 805746 804053 802375 799994 797238 795488 795169 795177 794571
48157 794571 793490 792240 790848 789847 790132 791583 792949 793441 793438 793470 793679 794418 796101 798233 799743 800573 801760
48140 801760 803794 806145 808598 811628 815123 818139 820450 823006 826344 829795 832853 835989 839461 842514
48126 842514 844589 846225 848036 849773 851139 852525 854072 854946 854434 853131 852283 852555 854012 856568 859860
48111 859860 863326 866952 871339 876651 882280 888008 894552 902383 910885 919396 928297 938343 949671 962133
48097 962133 975868 990832 1006456 1022529 1039761 1058692 1078695 1098816 1119070 1140116 1162191
48086 1162191 1185141 1209002 1233674 1258435 1282537 1306038 1329368 1352418 1374748 1396376 1417584
48075 1417584 1438099 1457176 1474487 1490404 1505486 1520041 1534114 1547630 1560702 1573899 1587836
48064 1587836 1602284 1616216 1629087 1641523 1654215 1666566 1677017 1684530 1689332 1692436 1694827 1696870
48052 1696870 1698159 1697984 1696035 1692382 1686856 1679150 1669764 1660172 1651536 1643598 1635100 1624845 1612192 1597233
48038 1597233 1580938 1564490 1547993 1530327 1510689 1489601 1467928 1445646 1422325 1398206 1373956
48027 1373956 1349695 1325088 1300156 1275245 1250375 1225333 1200346 1176030 1152679 1130042 1107797
48016 1107797 1085886 1064486 1043991 1024873 1007283 990853 975108 959846 944983 930430 916413
48005 916413 903523 892017 881332 870620 859596 848704 838801 830796 825036 820731 816502 811909 807963
47992 807963 805687 804753 804042 803096 802347 802215 802599 803078 803252 803065 803021 803683 804733 805141 804608 804143 804655 805633
47974 805633 805874 804942 803183 800903 798439 796499 795407 794322 792225 789473 787365 786310 785451 784122 782647
47959 782647 781499 780622 779905 779544 779537 779423 778937 778521 778878 780334 782779 785819 788924 791841 795081 799587 805709
47942 805709 812820 820113 827501 835578 844910 855493 866768 878134 889563 901628 914713 928367
47930 928367 941705 954300 966329 978023 989440 1000679 1011809 1022447 1031853 1039565 1045645 1050190
47918 1050190 1052870 1053144 1050813 1046313 1040530 1034248 1027628 1020290 1011992 1002971 993454 983232 972118 960529
47904 960529 949086 937840 926517 915481 905701 897521 890104 882537 875176 869360 865879 864139 862957
47891 862957 861806 861001 860878 861258 861925 863167 865426 868671 872635 877533 883937 891902 900842 910371 920619
47876 920619 931539 942626 953632 964887 976495 987874 998539 1008681 1018405 1027045 1033932 1039212
47864 1039212 1043132 1045067 1044235 1040993 1036470 1031116 1024490 1016244 1006443 995094 982323 968917 955723
47851 955723 942548 928582 913898 899597 886419 874251 863185 853944 846783 840914 835555 830823
47839 830823 827095 824192 821780 820027 819291 819635 821117 824078 828620 834217 840286 846734 853488 860023 865998
47824 865998 872030 879126 887531 896637 905887 915194 924555 933928 943643 954398 966567 979788 993542
47811 993542 1007980 1023883 1041770 1061309 1081819 1103242 1126171 1150737 1175858 1200024 1222597
47800 1222597 1243774 1263311 1279951 1292296 1299772 1302550 1300993 1295608 1287099 1276006 1262404 1246295
47788 1246295 1228197 1209091 1189986 1171705 1154888 1139908 1126904 1116115 1107878 1102094 1097997 1094903
47776 1094903 1093003 1092863 1094188 1095628 1096001 1095291 1094199 1093094 1091773 1089971 1087574 1084258 1079364 1072432 1063714
47761 1063714 1053967 1043826 1033532 1023121 1012599 1001945 991228 980838 971386 963250 956336 950374
47749 950374 945248 940999 937703 935569 934962 936055 938516 941728 945311 949291 953872 959201 965360 972468
47735 972468 980792 990775 1002852 1017100 1033170 1050564 1068871 1087630 1106264 1124432 1142451 1161165
47723 1161165 1181278 1202692 1224418 1245224 1264515 1282498 1299281 1314011 1325346 1332727 1336670 1337846
47711 1337846 1336462 1332674 1326875 1319152 1309082 1296515 1282021 1266081 1248323 1228221 1206211 1183575
47699 1183575 1161497 1140710 1121622 1104192 1087970 1072826 1059338 1047972 1038339 1029958 1023276 1019087
47687 1019087 1017293 1017234 1018967 1023195 1029992 1038700 1049132 1061797 1076704 1092976 1110049 1128388 1148574
47674 1148574 1170382 1193163 1216496 1240048 1263349 1286018 1307745 1327813 1345257 1359802 1372052
47663 1372052 1382491 1390901 1396974 1400721 1401877 1399696 1393947 1385519 1375429 1363693 1349752 1333596 1315883
47650 1315883 1297232 1277916 1258000 1237410 1216227 1195257 1175856 1158737 1143392 1129234 1116868
47639 1116868 1107579 1101819 1098833 1097617 1097649 1098844 1101404 1105802 1112496 1121575 1132941 1146697 1163079 1182153
47625 1182153 1203899 1228399 1255519 1284462 1313967 1342945 1370742 1396914 1420971 1442248 1459834
47614 1459834 1472793 1480545 1482755 1478755 1467632 1449278 1424932 1396163 1363669 1327565 1288473 1247575
47602 1247575 1205790 1163670 1122164 1082720 1046343 1013027 982351 954227 928798 906023 885692
47591 885692 867765 852398 839676 829376 820887 813370 806183 799215 792689 786637 780754 774795 768887
47578 768887 763352 758368 753982 750304 747403 745009 742544 739684 736806 734643 733429 732566 731182 728848
47564 728848 725636 721814 717731 713772 710002 706010 701444 696568 691909 687514 683108 678816 675069 671755
47550 671755 668197 664158 660158 656512 652732 648340 643715 639610 636335 633868 632224 631036 629267 626196
47536 626196 622528 619753 618457 617871 617061 615933 614933 614411 614497 615171 616126 616871 617195 617396 617861 618532 618947
47519 618947 618788 618351 618351 619169 620386 621300 621904 622854 624354 625587 625702 624994 624546 624919 625708 626297 626505 626464 626376
47500 626376 626577 627470 629125 631078 632607 633219 632998 632643 633018 634375 636039 637005 636789 635636 634169 633084
47484 633084 632944 633835 635289 636797 638231 639560 640485 640922 641603 643523 646717 650159 652992 655333 657718
47469 657718 660313 663063 666138 669720 673475 676722 679199 681406 684101 687589 691525 695324 698696 701808
47455 701808 704982 708291 711489 714290 716599 718449 719874 721014 722377 724813 728979 734829 741862 749975
47441 749975 759760 771730 785549 800480 816382 833683 852410 871909 891677 911793 932132 951708
47429 951708 969370 984800 998356 1010194 1020008 1027389 1031947 1033287 1031445 1027309 1022102 1016377 1009805
47416 1009805 1001961 992969 983386 973740 964244 954790 945252 935851 926967 918448 909464 899492 889101 879248
47402 879248 869989 860496 850301 839918 830119 821095 812598 804513 797030 790370 784551 779336 774423 769817
47388 769817 765952 763222 761514 760388 759684 759679 760707 762924 766414 771274 777458 784660 792341 799888 807013
47373 807013 814126 822024 830920 839998 848255 855488 862032 867787 872064 874376 874922 874266 872892 870969 868156
47358 868156 863600 856599 847312 836522 824754 812007 798333 784207 770218 756725 743910 731830
47346 731830 720289 708914 697510 686229 675476 665750 657363 650089 643293 636689 630689 625673 621268
47333 621268 616916 612868 609893 608144 607009 606082 605565 605599 605872 606096 606306 606562 606944 608005 610525 614463
47317 614463 618683 622053 624464 626530 628751 631236 633751 635705 636456 636031 635234 634809 634828 635089 635686 636733
47301 636733 637905 638704 639083 639542 640698 642868 645825 648874 651472 653951 657264 661949 667785 674635 683029
47286 683029 693521 705884 719443 733862 749152 765285 782447 801626 824351 851564 882613
47275 882613 914994 944797 967961 982014 987161 985688 980384 973396 966075 959230 953333 948669 945291
47262 945291 942818 940474 937699 934645 931918 929829 928073 926051 923345 919852 915554 910183 903267 894748
47248 894748 885481 876699 868833 861227 853242 845192 837880 831545 825792 820365 815395 810854 806271 801223
47234 801223 795859 790789 786611 783652 781893 780991 780502 780323 780869 782653 785684 789487 793753 798727 804743
47219 804743 811578 818714 826178 834598 844294 854793 865545 876625 888174 899563 909709 917992 924250
47206 924250 928080 928973 927144 923557 918955 913509 907412 901075 894513 887271 879365 871613 864688 858392
47192 858392 852336 846803 842385 839187 836940 835660 835730 837457 840806 845353 850368 855362 860776 867687 876586
47177 876586 886968 898412 911407 926613 943917 962778 982966 1004250 1025849 1047039 1068024
47166 1068024 1089438 1111163 1132367 1152480 1171407 1188865 1204350 1217731 1229171 1238409 1244874 1248588
47154 1248588 1250275 1250472 1249127 1246218 1242043 1236661 1229696 1221043 1211305 1201191 1190916 1180549 1170575
47141 1170575 1161680 1154161 1147768 1141976 1136272 1130495 1125129 1121039 1118727 1118034 1118643 1120534 1123749 1128081
47127 1128081 1133362 1139836 1147822 1157043 1166581 1175561 1183690 1191127 1197981 1204015 1208700 1211496 1212066 1210290
47113 1210290 1206134 1199580 1190677 1179645 1166881 1152817 1137707 1121606 1104619 1087147 1069691 1052474
47101 1052474 1035440 1018674 1002572 987478 973372 960010 947199 934841 922945 911703 901321
47090 901321 891705 882644 874297 867083 860976 855478 850501 846656 844338 843232 843293 845424 850268 856876 863667
47075 863667 870331 877615 885385 892343 897920 903149 909083 915411 921398 927231 933485 939916 945801 951070
47061 951070 956148 960847 964393 966620 968322 970146 971785 972556 972378 971872 971775 972496 974068 976288 979105 982898
47045 982898 988174 994835 1002047 1009120 1016375 1024774 1034694 1045412 1055868 1065615 1074795 1083553 1091952 1100342
47031 1100342 1109247 1118713 1128164 1137167 1145994 1155158 1164716 1174409 1184240 1194468 1205201 1216396 1228140
47018 1228140 1240478 1253021 1265140 1276516 1287049 1296339 1303767 1309157 1312791 1314700 1314419 1311651 1306692
47005 1306692 1300027 1291988 1283051 1273902 1264788 1255250 1244913 1234232 1223996 1214509 1205785 1198271 1192718
46992 1192718 1189350 1187690 1187222 1187761 1189132 1191017 1193333 1196380 1200413 1205359 1211139 1218007 1226294 1235952
46978 1235952 1246650 1258248 1270902 1284630 1298992 1313472 1328088 1343343 1359390 1375493 1390712
46967 1390712 1405077 1419664 1435337 1451715 1467649 1482372 1495840 1508226 1519638 1530338 1540673
46956 1540673 1550594 1559512 1566836 1572380 1576140 1578042 1578218 1577290 1575979 1574502 1572723 1570874 1569705 1569772 1570864
46941 1570864 1572461 1574624 1578173 1583876 1591582 1600188 1608528 1616339 1624417 1633768 1644545 1655906 1666904
46928 1666904 1677444 1688347 1700599 1714554 1729679 1744970 1759819 1774592 1790082 1806209 1821613
46917 1821613 1834931 1846058 1855623 1863415 1868145 1868770 1865221 1857652 1845870 1830058 1811367 1791084 1769661
46904 1769661 1747270 1724819 1703591 1684046 1665835 1648926 1633917 1621258 1611015 1603585 1599808 1599949
46892 1599949 1603228 1608841 1617053 1628789 1644467 1663572 1685177 1708546 1733423 1759986 1788358 1817975
46880 1817975 1847694 1876556 1904105 1929858 1953041 1973234 1990783 2006149 2019243 2029947 2038855
46869 2038855 2046710 2053361 2058123 2061252 2064253 2068464 2073955 2080199 2087221 2095478 2104987 2115306 2126372
46856 2126372 2138841 2153425 2170240 2188950 2209151 2230300 2251459 2271593 2290236 2307613 2323932
46845 2323932 2338725 2351096 2360508 2367062 2371032 2372395 2370970 2366798 2360141 2351225 2340232 2327595 2314134
46832 2314134 2300757 2288074 2276280 2265320 2255085 2245596 2237188 2230532 2226242 2224359 2224456 2226497 2231445
46819 2231445 2240649 2254518 2272029 2291615 2312272 2333712 2355818 2378318 2400756 2422408 2442308
46808 2442308 2459673 2474258 2486002 2494487 2499173 2500109 2497955 2493181 2485671 2475248 2462168 2446847 2429428
46795 2429428 2409968 2388834 2366611 2343811 2320937 2298712 2277799 2258231 2239395 2220805 2202815
46784 2202815 2186409 2172219 2159815 2148132 2136661 2126075 2117443 2110981 2105866 2101288 2097281 2094323
46772 2094323 2092436 2090946 2089060 2086472 2083484 2080733 2078757 2077644 2077059 2076582 2076032 2075571 2075683 2077092 2080378
46757 2080378 2085517 2091851 2098677 2105794 2113530 2122401 2132797 2144761 2157931 2171838 2186359 2201696
46745 2201696 2217789 2233991 2249481 2263841 2277040 2289058 2299778 2309165 2317306 2324326 2330414 2335873
46733 2335873 2340942 2345586 2349671 2353277 2356669 2359998 2363240 2366454 2369949 2374101 2379121 2385099 2392216 2400772
46719 2400772 2410840 2421900 2432956 2443267 2452975 2462857 2473360 2483934 2493358 2500642 2505555 2508399
46707 2508399 2509420 2508442 2505014 2498790 2489618 2477326 2461681 2442778 2421255 2397868 2373003 2346847
46695 2346847 2319827 2292422 2264611 2236012 2206623 2176963 2147450 2118159 2089355 2061680 2035485
46684 2035485 2010516 1986627 1964360 1944301 1926183 1909163 1892700 1876637 1860769 1845091 1830410
46673 1830410 1817897 1807766 1798946 1790276 1781572 1773278 1765691 1759127 1754492 1752929 1754706 1758916 1764551
46660 1764551 1771602 1780846 1792768 1807116 1823460 1841723 1861878 1883507 1906050 1929305 1953248 1977375
46648 1977375 2000697 2022389 2042041 2059212 2073266 2083952 2091769 2097397 2101012 2102426 2101678 2099249 2095917
46635 2095917 2092651 2090407 2089777 2091012 2094542 2101103 2111110 2124337 2140604 2160386 2184149 2211377 2240837
46622 2240837 2271687 2303738 2336720 2369857 2402149 2432426 2459110 2480546 2495848 2505010 2508144 2505140
46610 2505140 2496248 2482370 2464345 2442296 2416109 2386203 2353448 2318532 2281916 2244412 2207298
46599 2207298 2171590 2137395 2104214 2071906 2041149 2012828 1987095 1963328 1940997 1920211 1901202
46588 1901202 1883674 1867034 1851013 1835647 1820801 1806209 1791878 1777922 1764085 1749963 1735789
46577 1735789 1722369 1710054 1698326 1686624 1675105 1664171 1653658 1642986 1631961 1621114 1611340
46566 1611340 1603371 1597361 1592749 1588719 1584956 1581764 1579327 1577271 1575239 1573480 1572466 1572196 1572291 1572580 1573097
46551 1573097 1573675 1574074 1574479 1575413 1577118 1579424 1582307 1586135 1591191 1597282 1604017 1611260 1619113 1627660 1636903
$$ [...]
##END NTUPLES=NMR SPECTRUM
##END=
