##TITLE=AC1441_CSSAH13250_7790727_DKqfx0IcuA
##JCAMPDX= 6.0         $$ Bruker NMR JCAMP-DX V2.0
##DATA TYPE= NMR SPECTRUM
##DATA CLASS= NTUPLES
##ORIGIN= BRUKER
##OWNER= Administrator
$$ 1.72 TOPSPIN		Version 2.1
$$ 2013-04-17 03:36:39.832 -0700  Administrator@X
$$ Compression mode = diff/dup
##.OBSERVE FREQUENCY= 400.02188249412
##.OBSERVE NUCLEUS= ^1H
##.ACQUISITION MODE= SIMULTANEOUS (DQD)
##.ACQUISITION SCHEME= undefined
##.AVERAGES= 64
##.DIGITISER RES= 22
##SPECTROMETER/DATA SYSTEM= spect
##.PULSE SEQUENCE= noesygpps1d.comp
##.SOLVENT NAME= COFFEE_meoh
##.SHIFT REFERENCE= INTERNAL, COFFEE_meoh, 1, 14.96096
##AUDIT TRAIL= $$ (NUMBER, WHEN, WHO, WHERE, PROCESS, VERSION, WHAT)
$$ ##TITLE= Audit trail, TOPSPIN		Version 2.1
$$ ##JCAMPDX= 5.01
$$ ##ORIGIN= Bruker BioSpin GmbH
$$ ##OWNER= Administrator
$$ $$ E:\/data/COFFEE/nmr/AC1441_CSSAH13250_7790727_DKqfx0IcuA/12/pdata/1/auditp.txt
$$ ##AUDIT TRAIL=  $$ (NUMBER, WHEN, WHO, WHERE, PROCESS, VERSION, WHAT)
(   1,<2013-04-17 03:36:34.535 -0700>,<Administrator>,<X>,<go>,<TOPSPIN 2.1>,
      <created by zg
	started at 2013-04-17 03:25:04.985 -0700,
	POWCHK enabled, PULCHK disabled,
       configuration hash MD5:
       33 CF 6A 21 5C D3 B9 40 6C 15 AA 8D 27 A2 4F 13
       data hash MD5: 64K
       29 C7 3D CA 26 95 29 94 2E D8 83 33 5E 58 8F 40>)
(   2,<2013-04-17 03:36:37.535 -0700>,<Administrator>,<X>,<proc1d>,<TOPSPIN 2.1>,
      <Start of raw data processing
       efp LB = 0.3 FT_mod = 6 PKNL = 1 PHC0 = 0 PHC1 = 0 SI = 128K 
       data hash MD5: 128K
       DB AB 27 0C FB 94 F1 9B 94 FE C6 60 C1 3D ED F6>)
(   3,<2013-04-17 03:36:38.520 -0700>,<Administrator>,<X>,<proc1d>,<TOPSPIN 2.1>,
      <pk PHC0 = -79.18396 PHC1 = 0 
       data hash MD5: 128K
       88 7B 7B 54 57 16 31 0A 05 C7 A4 C8 AD 64 C5 6D>)
(   4,<2013-04-17 03:36:39.223 -0700>,<Administrator>,<X>,<proc1d>,<TOPSPIN 2.1>,
      <abs ABSG = 1 
       data hash MD5: 128K
       CC 4F D6 1B 48 A7 09 0D 94 20 5B A0 AD FE 34 A1>)
(   5,<2013-04-17 03:36:39.348 -0700>,<Administrator>,<X>,<proc1d>,<TOPSPIN 2.1>,
      <abs ABSG = 2 
       data hash MD5: 128K
       4B F3 65 3A 55 EA 28 CC 26 6E BF 0A E9 5C C6 02>)
(   6,<2013-04-17 03:36:39.442 -0700>,<Administrator>,<X>,<proc1d>,<TOPSPIN 2.1>,
      <abs ABSG = 3 
       data hash MD5: 128K
       06 66 6C 1E 25 E5 A2 E4 DA 88 6A 69 FD 44 67 4D>)
(   7,<2013-04-17 03:36:39.520 -0700>,<Administrator>,<X>,<proc1d>,<TOPSPIN 2.1>,
      <abs ABSG = 4 
       data hash MD5: 128K
       E8 5C 5B 28 77 5D C6 06 8E 77 FC C9 E3 AD F4 18>)
(   8,<2013-04-17 03:36:39.613 -0700>,<Administrator>,<X>,<proc1d>,<TOPSPIN 2.1>,
      <abs ABSG = 5 
       data hash MD5: 128K
       17 66 90 4A AC B0 E3 43 95 71 74 85 BB 3F 4B 4A>)
$$ ##END=
$$ 
$$ $$ hash MD5
$$ $$ 93 99 38 F0 4F 84 74 48 38 50 46 D8 20 2A 40 73
##$RELAX= 
##$RELAX= 
##$RELAX= 
##$RELAX= 
##$RELAX= 
##$RELAX= 
##$RELAX= 
##$RELAX= 
$$ Bruker specific parameters
$$ --------------------------
##$DU= <E:\>
##$EXPNO= 12
$$ [...]
##$TP07= 0
##$TPNAME0= <>
##$TPNAME1= <>
##$TPNAME2= <>
##$TPNAME3= <>
##$TPNAME4= <>
##$TPNAME5= <>
##$TPNAME6= <>
##$TPNAME7= <>
##$TPOAL= (0..7)
0.5 0.5 0.5 0.5 0.5 0.5 0.5 0.5
##$TPOFFS= (0..7)
0 0 0 0 0 0 0 0
##$TUNHIN= 0
##$TUNHOUT= 0
##$TUNXOUT= 0
##$USERA1= <user>
##$USERA2= <user>
##$USERA3= <user>
##$USERA4= <user>
##$USERA5= <user>
##$V9= 5
##$VALIST= <valist>
##$VCLIST= <CCCCCCCCCCCCCCC>
##$VD= 0
##$VDLIST= <DDDDDDDDDDDDDDD>
##$VPLIST= <PPPPPPPPPPPPPPP>
##$VTLIST= <TTTTTTTTTTTTTTT>
##$WBST= 2048
##$WBSW= 25
##$XGAIN= (0..3)
0 0 0 0
##$XL= 0
##$YL= 0
##$YMAX_a= 6550387
##$YMIN_a= -14016779
##$ZGOPTNS= <>
##$ZL1= 120
##$ZL2= 120
##$ZL3= 120
##$ZL4= 120
##$ABSF1= 14.96096
##$ABSF2= -5.597221
##$ABSG= 5
##$ABSL= 3
##$ALPHA= 0
##$AQORDER= 0
##$ASSFAC= 0
##$ASSFACI= 0
##$ASSFACX= 0
##$ASSWID= 0
##$AUNMP= <proc_prof1d_extract.lims>
##$AXLEFT= 0
##$AXNAME= <>
##$AXNUC= <1H>
##$AXRIGHT= 0
##$AXTYPE= 0
##$AXUNIT= <>
##$AZFE= 0.1
##$AZFW= 0.1
##$BCFW= 0
##$BC_mod= 0
##$BYTORDP= 0
##$COROFFS= 0
##$CY= 15
##$DATMOD= 1
##$DC= 0
##$DFILT= <>
##$DTYPP= 0
##$F1P= 0
##$F2P= 0
##$FCOR= 0.5
##$FTSIZE= 131072
##$FT_mod= 6
##$GAMMA= 0
##$GB= 0
##$INTBC= 1
##$INTSCL= 1
##$ISEN= 128
##$LB= 0.3
##$LEV0= 0
##$LPBIN= 0
##$MAXI= 10000
##$MC2= 0
##$MEAN= 0
##$ME_mod= 0
##$MI= 0
##$NCOEF= 0
##$NC_proc= -2
##$NLEV= 6
##$NOISF1= 0
##$NOISF2= 0
##$NSP= 0
##$NTH_PI= 0
##$NZP= 0
##$OFFSET= 14.96096
##$PC= 1
##$PHC0= -79.18396
##$PHC1= 0
##$PH_mod= 1
##$PKNL= yes
##$PPARMOD= 0
##$PPDIAG= 0
##$PPIPTYP= 0
##$PPMPNUM= 2147483647
##$PPRESOL= 1
##$PSCAL= 4
##$PSIGN= 0
##$PYNMP= <proc.py>
##$REVERSE= no
##$SF= 400.02000965438
##$SI= 131072
##$SIGF1= 0
##$SIGF2= 0
##$SINO= 400
##$SIOLD= 131072
##$SPECTYP= <>
##$SREGLST= <1H.CDCl3>
##$SSB= 0
##$STSI= 131072
##$STSR= 0
##$SW_p= 8223.68421052631
##$SYMM= 0
##$S_DEV= 0
##$TDeff= 65536
##$TDoff= 0
##$TI= <>
##$TILT= no
##$TM1= 0
##$TM2= 0
##$TOPLEV= 0
##$USERP1= <user>
##$USERP2= <user>
##$USERP3= <user>
##$USERP4= <user>
##$USERP5= <user>
##$WDW= 1
##$XDIM= 131072
##$YMAX_p= 433048755
##$YMIN_p= -12097
##$CURPLOT= <Network HP LaserJet P1505>
##$CURPRIN= <$Network HP LaserJet P1505>
##$DFORMAT= <normdp>
##$LAYOUT= <+/1D_H.xwp>
##$LFORMAT= <normlp>
##$PFORMAT= <normpl>
##$SURQMSG= 1
$$ End of Bruker specific parameters
$$ ---------------------------------
##NTUPLES= NMR SPECTRUM
##VAR_NAME=  FREQUENCY,     SPECTRUM/REAL,   SPECTRUM/IMAG
##SYMBOL=    X,             R,               I
##VAR_TYPE=  INDEPENDENT,   DEPENDENT,       DEPENDENT
##VAR_FORM=  AFFN,          ASDF,            ASDF
##VAR_DIM=   131072,        131072,          131072
##UNITS=     HZ,            ARBITRARY UNITS, ARBITRARY UNITS
##FACTOR=    0.0627417313425164, 1,          1
##FIRST=     8223.62146879497, 4357,         -61050
##LAST=      0,             6216,            -60630
##MIN=       0,             -12097,          0
##MAX=       8223.62146879497, 433048755,    0
$$ Real data points
##PAGE= N=1
##DATA TABLE= (X++(R..R)), XYDATA
$$ [...]
61508D15509J126R87R05Q02N62K32J21N04J147J438J102O20O30J159J686J860
$$ 415509 416635 417622 418527 419329 419891 420123 420244 420748 421895 423333 424435 425055 425685 426844 428530 430390
61492D30390J855J991K301K531K495K203J747J177N65P9q6J88Q81J842K737L120
$$ 430390 432245 434236 436537 439068 441563 443766 445513 446690 447255 447334 447248 447436 448317 450159 452896 456016
61476D56016K812K210J930K095K160J605N85l22p94j014j326j871k502k880k766
$$ 456016 458828 461038 462968 465063 467223 468828 469413 469091 468297 467283 465957 464086 461584 458704 455938
61461D55938k353k145k334k481k098j314o37k29P9K38K7k74P1J264K578L279L461
$$ 455938 453585 451440 449106 446625 444527 443213 442576 442347 442426 442664 442691 442417 442488 443752 446330 449609 453070
61444D53070L549L456K908K268K268K906L356L074K450K102K115K254K455K659
$$ 453070 456619 460075 462983 465251 467519 470425 473781 476855 479305 481407 483522 485776 488231 490890
61430D90890K529J833R40M98O67J067J341J420J372J360J684K418L066K971K129
$$ 490890 493419 495252 496192 496690 497357 498424 499765 501185 502557 503917 505601 508019 511085 514056 516185
61415E16185J184N68J69j07oN88J270J638J836K152K395K081J187K85j07n2k3
$$ 516185 517369 517937 518106 517999 517993 518581 519851 521489 523325 525477 527872 529953 531140 531425 531318 531266 531243
61398E31243m18j179j845k025j854j830k083k186j795j166p48o00n80q06j397
$$ 531243 530825 529646 527801 525776 523922 522092 520009 517823 516028 514862 514114 513514 512934 512128 510731
61383E10731j972j955j380q47o40m30M7N31O97O70P50R37R98Q67P52Q58J188J451
$$ 510731 508759 506804 505424 504577 503937 503507 503554 504085 504782 505452 506202 507139 508137 509004 509756 510614 511802 513253
61365E13253J206L30o19q43l00J62q0n15j76J044K342L173L848M782N766O369
$$ 513253 514459 514789 514170 513327 513027 513189 513109 512594 512418 513462 515804 518977 522825 527607 533373 539742
61349E39742O667P049P532P756P567P127O454N374M039L017K648K653K626K548
$$ 539742 546409 553458 560990 568746 576313 583440 589894 595268 599307 602324 604972 607625 610251 612799
61335F12799K536K528K475K471K301J348n03k236k751k243j784j739j470o43J74
$$ 612799 615335 617863 620338 622809 625110 626458 625955 623719 620968 618725 616941 615202 613732 613089 613263
61320F13263N01O52J053J483J556J402J446J959L076M784O611P890Q735J0044
$$ 613263 613764 614416 615469 616952 618508 619910 621356 623315 626391 631175 637786 645676 654411 664455
61306F64455J2180J4297J5573J6315J7053J7206J5657J2386Q514M958J813j043
$$ 664455 676635 690932 706505 722820 739873 757079 772736 785122 793636 798594 800407 799364
61294G99364l580n893q154j0178j1541j2124j2153j1866j1510j1367j1302j0641
$$ 799364 795784 789891 781737 771559 760018 747894 735741 723875 712365 700998 689696 679055
61282F79055r140p648p033o837n973m444l292k832k139n34J440K869L481L447
$$ 679055 669915 662267 655234 648397 642424 637980 634688 631856 629717 629183 630623 633492 636973 640420
61268F40420K941K282J960K138K567L095L733M239M415M821O219Q181R253Q807
$$ 640420 643361 645643 647603 649741 652308 655403 659136 663375 667790 672611 678830 687011 696264 705071
61254G05071P714O697N182K663J10j101j103j173j828k428k504k413k491k448
$$ 705071 712785 719482 724664 727327 727437 726336 725233 724060 722232 719804 717300 714887 712396 709948
61240G09948j911r92n8O64J027R08M39K8j2K80P50J439K521M029N688P048P727
$$ 709948 708037 707045 706987 707651 708678 709586 710025 710053 710041 710321 711071 712510 715031 719060 724748 731796 739523
61223G39523P706P358P212P527Q018Q072P427O629O460O859O838N763M285L457
$$ 739523 747229 754587 761799 769326 777344 785416 792843 799472 805932 812791 819629 825392 829677 833134
61209H33134L306K984K109J162N52J39j28J69J291K856M324N579O896Q648J1188
$$ 833134 836440 839424 841533 842695 843247 843386 843258 843427 844718 847574 851898 857477 864373 873021 884209
61194H84209J4446J7520J9210J9142J7923J6124J3780J1020Q395O140L887J543
$$ 884209 898655 916175 935385 954527 972450 988574 1002354 1013374 1021769 1027909 1031796 1033339
61182A033339j59o64n64r94k437m573o850q638r383r281r399j0422j1631j1866
$$ 1033339 1033180 1032516 1031952 1030958 1028521 1023948 1017098 1008460 999077 989796 980397 969975 958344 946478
61168I46478j1199j0787j1175j1624j1301j0417r801r801j0063j0132r923r481
$$ 946478 935279 924492 913317 901693 890392 879975 870174 860373 850310 840178 830255 820774
61156H20774q601o956m708k610j120K93K437N130P357Q645R449R951R459P545
$$ 820774 812173 805217 800509 797899 796779 797072 799509 804639 811996 820641 830090 840041 849500 857045
61142H57045M968K773J114k51r46m09J035K456L604N086P321J0049J2790J5205
$$ 857045 862013 864786 865900 865649 864703 864294 865329 867785 871389 876475 883796 893845 906635 921840
61128I21840J7026J8346J9884K2365K5561K8560L0966L3246L5866L8723M1534
$$ 921840 938866 957212 977096 999461 1025022 1053582 1084548 1117794 1153660 1192383 1233917
61117A233917M4202M6575M8399M9702N0811N1785N2217N1883N1049M9971M8372
$$ 1233917 1278119 1324694 1373093 1422795 1473606 1525391 1577608 1629491 1680540 1730511 1778883
61106A778883M5858M2574L9054L5481L1401K6239J9883J2680M996k974j0983j8549
$$ 1778883 1824741 1867315 1906369 1941850 1973251 1999490 2019373 2032053 2037049 2034075 2023092 2004543
61094B004543k5268l1122l6269m0593m3794m5848m7032m7549m7589m7655m8152
$$ 2004543 1979275 1948153 1911884 1871291 1827497 1781649 1734617 1687068 1639479 1591824 1543672
61083A543672m8534m7603m4997m1758l9005l6659l4089l1330k8874k6743k4598
$$ 1543672 1495138 1447535 1402538 1360780 1321775 1285116 1251027 1219697 1190823 1164080 1139482
61072A139482k2564k1046j9868j8367j6427j4664j3500j2707j1991j1444j1104
$$ 1139482 1116918 1095872 1076004 1057637 1041210 1026546 1013046 1000339 988348 976904 965800
61061I65800j0563r379p612n787m396l552k947k143j046K9Q72J776L169N013O941
$$ 965800 955237 945858 938246 932459 928063 924511 921564 919421 918375 918404 919276 921052 924221 929234 936175
61046I36175Q766J0539J2177J3473J4436J5260J6042J6796J7666J8728J9679K0115
$$ 936175 944941 955480 967657 981130 995566 1010826 1026868 1043664 1061330 1080058 1099737 1119852
61034A119852K0178K0506K1499K2877K4004K4443K4224K3824K3914K4906K6689
$$ 1119852 1140030 1160536 1182035 1204912 1228916 1253359 1277583 1301407 1325321 1350227 1376916
61023A376916K8850L1118L3426L5735L7892L9628M0739M1568M3280M7282N4064
$$ 1376916 1405766 1436884 1470310 1506045 1543937 1583565 1624304 1665872 1709152 1756434 1810498
61012A810498O2933P2958Q3776R5260J07042J18964J31988J48366J70962K02252
$$ 1810498 1873431 1946389 2030165 2125425 2232467 2351431 2483419 2631785 2802747 3004999
61002C004999K43689K96113L61123M41632N40462O59529Q02312R76230J188583
$$ 3004999 3248688 3544801 3905924 4347556 4888018 5547547 6349859 7326089 8514672
60993H514672J437684J708161J972163K186526K285156K188607J849223J306815
$$ 8514672 9952356 11660517 13632680 15819206 18104362 20292969 22142192 23449007
60985B3449007O97613J91342r7634j52938l3306J69996L50915L93594K04158k32441
$$ 23449007 24146620 24337962 24240328 24087390 24054084 24224080 24574995 24968589 25172747 24940306
60975B4940306q24032j412187j856339k093987k140288k048881j876323j667558
$$ 24940306 24116274 22704087 20847748 18753761 16613473 14564592 12688269 11020711
60967A1020711j453428j250877j066155r00977p56512o32890n28108m39451l65284
$$ 11020711 9567283 8316406 7250251 6349274 5592762 4959872 4431764 3992313 3627029
60958C627029l04784k56728k19247j90099j66756j46889j29256j13770j00499
$$ 3627029 3322245 3065517 2846270 2656171 2489415 2342526 2213270 2099500 1999001
60949A999001q9038p8813o9429o0715n2990m7184m3968m2850m2745m3256m4438
$$ 1999001 1909963 1831150 1761721 1701006 1648016 1600832 1556864 1514014 1471269 1428013 1383575
60938A383575m5582m5400m3593m1185l9100l7293l5400l3280l0730k7685k4832
$$ 1383575 1337993 1292593 1249000 1207815 1168715 1131422 1096022 1062742 1032012 1004327 979495
60927I79495k2990k1751j9885j7292j5269j4483j4012j3045j2167j2005j1890
$$ 979495 956505 934754 914869 897577 882308 867825 853813 840768 828601 816596 804706
60916H04706j0937r569q765q479p910o878n919n292m776m250l816l520l446l739
$$ 804706 793769 784200 775435 766956 759046 752168 746249 740957 736181 731931 728115 724595 721149 717410
60902G17410m139m065l561l444l998m308l753l327m381o589q291q597q064p478
$$ 717410 713271 709206 705645 702201 698203 693895 690142 686815 682434 675845 667554 658957 650893 643415
60888F43415p039o750o612o255n219l755k741k605k890l044l048l084l051k698
$$ 643415 636376 629626 623014 616759 611540 607785 605044 602439 599549 596505 593457 590373 587322 584624
60874E84624k032j336r01p44n46jP42J279J614K135K800K960K335J634J652K290
$$ 584624 582592 581256 580355 579611 579065 579064 579806 581085 582699 584834 587634 590594 592929 594563 596215 598505
60858E98505L043L876M876N501N071L823K581J595N32m94q96o82o16j021j298
$$ 598505 601548 605424 610300 615801 620872 624695 627276 628871 629403 628909 628013 627331 626715 625694 624396
60843F24396j017p35j225k442l797n078o510q081r336r819r458q579p732p370
$$ 624396 623379 622644 621419 618977 615180 610102 603592 595511 586175 576356 566898 558319 550587 543217
60829E43217p453p409o723n551m566m198m224m167l928l791l853l744l087k089
$$ 543217 535764 528355 521632 516081 511515 507317 503093 498926 494998 491207 487354 483610 480523 478434
60815D78434j391j352j696j922j819j524j287j257j328j143m40N32J175J198R21
$$ 478434 477043 475691 473995 472073 470254 468730 467443 466186 464858 463715 463275 463807 464982 466180 467101
60800D67101Q62J225J885K595L018K807J932Q59K28L21Q67J293J206O95J44l26
$$ 467101 467963 469188 471073 473668 476686 479493 481425 482284 482512 482833 483700 484993 486199 486894 487038 486712
60784D86712r80j910k635k680k339k408l153m074m587m531l992l152k375j988
$$ 486712 485732 483822 481187 478507 476168 473760 470607 466533 461946 457415 453423 450271 447896 445908
60770D45908j888j776j654j636j397n15O49J177Q29K79jk49n90n91m0O11J013
$$ 445908 444020 442244 440590 438954 437557 437042 437691 438868 439697 439976 439975 439726 439136 438545 438505 439116 440129
60753D40129J390J741J423K15q87p97K11R11P51L13M05J201K154K412J525K5j044
$$ 440129 441519 443260 444683 444898 444011 443214 443425 444336 445087 445400 445805 447006 449160 451572 453097 453122 452078
60736D52078j282j122q47k46M54M45k81m24P84K188K250J273P72J182J619J648
$$ 452078 450796 449674 448827 448581 449035 449480 449199 448775 449559 451747 453997 455270 456042 457224 458843 460491
60720D60491J777K094J848Q00j45k13J57J05m41r29j084j094j141j190j194j221
$$ 460491 462268 464362 466210 467010 466865 466652 466809 466914 466473 465544 464460 463366 462225 461035 459841 458620
60704D58620j365j656k036k471k985l461l539l012k317k084k167j801q67k28l83
$$ 458620 457255 455599 453563 451092 448107 444646 441107 438095 435778 433694 431527 429726 428859 428631 428248
60689D28248n96r9N85M65l16p38m29R2N76J390K592L554L792L549L339L373L518
$$ 428248 427652 427553 428138 428603 428287 427549 427120 427212 427788 429178 431770 435324 439116 442665 446004 449377 452895
60672D52895L539L296K971K927L081K752J506k27j744k869l593l534k568j521
$$ 452895 456434 459730 462701 465628 468709 471461 472967 472740 470996 468127 464534 461000 458432 456911
60658D56911j297j596j441o68K9L77P33J139J207J018J169J799K388K633K642
$$ 456911 455614 454018 452577 451909 451938 452315 453048 454187 455394 456412 457581 459380 461768 464401 467043
60643D67043K263J180k04j033j322j905k887l223k386j351j192j556j402n62J90
$$ 467043 469306 470486 470282 469249 467927 466022 463135 459912 457526 456175 454983 453427 452025 451463 451653
60628D51653L04l8m08n14k84R4K93K52K42L98N01L81J63m8l66p75r24n45J99R25
$$ 451653 451957 451919 451511 450997 450713 450807 451100 451352 451594 451992 452493 452874 453037 452989 452623 451848 450924 450379 450578 451503
60608D51503J378J439J105N65J25q8j30n6N2N1j4K32R58J669J761J348J016J013
$$ 451503 452881 454320 455425 455990 456115 456027 455897 455841 455893 455944 455930 456162 457120 458789 460550 461898 462914 463927
60590D63927J205J641K355K876K703K179K014K034J420K32m05N2P75Q29L82J81
$$ 463927 465132 466773 469128 472004 474707 476886 478900 480934 482354 482586 482181 482233 483008 483837 484219 484400
60574D84400N57J470K818M217N073N323N643O494P617Q722R966J1308J2151J2211
$$ 484400 484957 486427 489245 493462 498535 503858 509501 515995 523612 532334 542300 553608 565759 577970
60560E77970J2078J2213J1899R968O362K301r38k933m028m774n426n716n218l965
$$ 577970 590048 602261 614160 624128 630490 632791 631853 628920 624892 620118 614692 608976 603758 599793
60546E99793k423q63P97K412L482L855M089M780O019P673R733J2095J4483J6870
$$ 599793 597370 596507 597304 599716 603198 607053 611142 615922 621941 629614 639347 651442 665925 682795
60532F82795J9448K2008K3926K5033K5745K6017K4927K1844J7343J2336O917Q76
$$ 682795 702243 724251 748177 773210 798955 824972 849899 871743 889086 901422 908339 909215
60520I09215n161r962j3005j4836j6196j7206j7427j6387j4132j1467r388q083
$$ 909215 904054 894092 881087 866251 850055 832849 815422 799035 784903 773436 764048 755965
60508G55965o821n013k953j201L10K060M230O657R323J2473J6390K1196K6586
$$ 755965 749144 744131 741178 739977 740287 742347 746577 753234 762557 775030 791420 812616 839202
60495H39202L1718L5833L9097M2260M5244M6839M6232M4085M1472L8371L4075
$$ 839202 870920 906753 945850 988110 1033354 1080193 1126425 1170510 1211982 1250353 1284428
60484A284428K8717K3533J9639J7124J5311J3353J0608O722J422n782j5224k6177
$$ 1284428 1313145 1336678 1356317 1373441 1388752 1402105 1412713 1419435 1420857 1415075 1399851 1373674
60472A373674l6813m5500n1819n6085n8381n8551n6726n3356m8993m4330m0059
$$ 1373674 1336861 1291361 1239542 1183457 1125076 1066525 1009799 956443 907450 863120 823061
60461H23061l6220l2212k7846k3882k0995j8788j6539j4405j3064j2477j1876
$$ 823061 786841 754629 726783 702901 681906 663118 646579 632174 619110 606633 594757
60450E94757j0808r496q201o941n789m869m055l150k301j807j624j469j312j336
$$ 594757 583949 574453 566252 559311 553522 548653 544598 541448 539147 537340 535716 534247 532935 531599
60436E31599j522j708j882k084k161j973j687j480j235q80o83p78p69l46O3j41
$$ 531599 530077 528369 526487 524403 522242 520269 518582 517102 515867 514987 514304 513526 512757 512411 512474 512333
60420E12333p44r39l68O08J488J961J845J289R44J411K493L412L636L173K318
$$ 512333 511589 510650 510282 510890 512378 514339 516184 517473 518417 519828 522321 525733 529369 532542 534860
60405E34860J545J407K036K873L314L346L218K860K172J477J138J086J230J887
$$ 534860 536405 537812 539848 542721 546035 549381 552599 555459 557631 559108 560246 561332 562562 564449
60391E64449L087L965L711K776K244K330K446K482K876L549L811L497L161L030
$$ 564449 567536 571501 575212 577988 580232 582562 585008 587490 590366 593915 597726 601223 604384 607414
60377F07414K732K235K103K538L012L074K740J951O05n45j60J886L910M280L251
$$ 607414 610146 612381 614484 617022 620034 623108 625848 627799 628404 627859 627699 629585 633495 637775 641026
60362F41026K230J872J745J467J271J542K354L553M879O089P151Q180R103R668
$$ 641026 643256 645128 646873 648340 649611 651153 653507 657060 661939 668028 675179 683359 692462 702130
60348G02130R924J0166J0162R059O534L521J192m38k161m096n421n654n374n405
$$ 702130 712054 722220 732382 741441 747975 751496 752688 752250 750089 745993 740572 734918 729544 724139
60334G24139n819o176o329o448o527o356n978n667n393m789l908l476l951m635
$$ 724139 718320 712144 705815 699367 692840 686484 680506 674839 669446 664657 660749 657273 653322 648687
60320F48687m398l128j798r96j63J375L301M780N613O383P644R421J1291J2574
$$ 648687 644289 641161 639363 638367 638204 639579 642880 647660 653273 659656 667300 676721 688012 700586
60306G00586J2720J1940J1198J1159J1383J1081J0309R729R382Q459O359L359
$$ 700586 713306 725246 736444 747603 758986 770067 780376 790105 799487 807946 814305 817664
60294H17664R8l099o218r259j2095j4368j5524j5273j3916j1953r600p079n078
$$ 817664 817762 814663 808445 799186 787091 772723 757199 741926 728010 716057 706457 699378 694300
60281F94300m290m521m896m929m821m798m871n229o196p441p992p325o032n078
$$ 694300 690010 685489 680593 675664 670843 666045 661174 655945 649749 642308 634316 626991 620959 615881
60267F15881m768m778m708m404l941l554l362l099k397j309k12P51J634K141J842
$$ 615881 611113 606335 601627 597223 593282 589728 586366 583267 580870 579561 579349 580100 581734 583875 585717
60252E85717R73M13N45Q68J023J436K426L332L299K509J810J374N52q76k113k278
$$ 585717 586690 587103 587648 588516 589539 590975 593401 596733 600032 602541 604351 605725 606277 605401 603288 601010
60236F01010j481o22l81o94j029q96q8J264K702L629L732L350L260L942N086N923
$$ 601010 599529 598907 598526 597832 596803 595907 595819 597083 599785 603414 607146 610496 613756 617698 622784 628707
60220F28707N989N480M940M861N465O656Q075R377J0455J1349J2051J2499J2722
$$ 628707 634696 640176 645116 649977 655442 662098 670173 679550 690005 701354 713405 725904 738626
60207G38626J2797J2739J2531J2163J1580J0742R806R060Q464P636O468N481N073
$$ 738626 751423 764162 776693 788856 800436 811178 820984 830044 838508 846144 852612 858093 863166
60194H63166M771L721J815k15j808l097m383n559o358o802p214p863q759r665
$$ 863166 867937 871658 873473 873258 871450 868353 863970 858411 852053 845251 838037 830174 821415 811750
60180H11750j0232j0237r671q673p461o413n846n577m983l805k597k053k146k293
$$ 811750 801518 791281 781610 772937 765476 759063 753217 747640 742657 738852 736255 734202 732056 729763
60166G29763k174k017k135k528k892k820k195j480j266j441j311p19k82j63M70
$$ 729763 727589 725572 723437 720909 718017 715197 713002 711522 710256 708815 707504 706785 706503 706340 706810
60151G06810K055L497L529K587K111K399K434J731J054J157K003L397N286P184
$$ 706810 708865 712362 715891 718478 720589 722988 725422 727153 728207 729364 731367 734764 740050 747234
60137G47234Q255Q402Q438Q923R587J0166J0861J1650J1969J1471J0353Q707O344
$$ 747234 755489 763891 772329 781252 790839 801005 811866 823516 835485 846956 857309 866016 872360
60124H72360L663J719R65P03K79O3O76J894K973L488L380K750K062K015K716L411
$$ 872360 876023 877742 878707 879410 879689 879752 880428 882322 885295 888783 892163 894913 896975 898990 901706 905117
60108I05117L386K592J093j227m024o225p159p231p024o447n434m648m589m614
$$ 905117 908503 911095 912188 910961 906937 900712 893553 886322 879298 872851 867417 862769 858180 853566
60094H53566l852k620j990k234k712l045l399l697l474k640j675r73n71m96o93
$$ 853566 849714 847094 845104 842870 840158 837113 833714 830017 826543 823903 822228 821255 820684 820188 819495
60079H19495p05j40M89K02j062k251k782l523n527q319j0273j0553r928r548r598
$$ 819495 818790 818650 819139 819341 818279 816028 813246 809723 804196 795877 785604 775051 765123 755575 745977
60064G45977r576r310r055q742p963o724n600m891m238l453k908k674j977m04
$$ 745977 736401 727091 718036 709294 701331 694607 689007 684116 679878 676425 673517 670843 668866 668462
60050F68462J039J114K60J75J646L918O113Q003R317R601R115Q760Q669Q047O785
$$ 668462 669501 670615 670875 671050 672696 676614 682727 690730 700047 709648 718763 727523 736192 744239 751024
60035G51024N986O161O159M854K839J404N93n57k487m880p494j0156j2280j3370
$$ 751024 757010 763171 769330 774184 777023 778427 779020 778463 775976 771096 763602 753446 741166 727796
60021G27796j3836j4419j4999j4755j3368j1481r966r249r071q548o889m481k721
$$ 727796 713960 699541 684542 669787 656419 644938 634972 625723 616652 608104 601215 596734 594013
60008E94013k243k062j103J76O56L50J23J39j28n54l77L95P65K11n10l81P96K420
$$ 594013 591770 589708 588605 588781 589437 589787 589910 590049 589921 589367 588990 589385 590150 590361 589851 589470 590266 592686
59990E92686L659L940L470L266M102N479O283O243N968N671M837L254J437j77
$$ 592686 596345 600285 603755 607021 611123 616602 622885 629128 635096 640767 645604 648858 650295 650118
59976F50118j744l356m592n029m789m328m019l940l721k690p38J195K125K402
$$ 650118 648374 645018 640426 635397 630608 626280 622261 618321 614600 611910 611172 612367 614492 616894
59962F16894L265N029O714P507P739P942P876P058N597L899K024m1j877k936l189
$$ 616894 620159 625188 631902 639409 647148 655090 662966 670024 675621 679520 681544 681503 679626 676690 673501
59947F73501l005k631k175j907k145k762l185l000k455k196k505k867k480j198
$$ 673501 670496 667865 665690 663783 661638 658876 655691 652691 650236 648040 645535 642668 640188 638990
59933F38990L15J448K311L330M494N449O084O536O733O300M912K468p38l729n113
$$ 638990 639305 640753 643064 646394 650888 656337 662421 668957 675690 681990 686902 689370 688632 684903 679790
59918F79790m367k661j703j834j848p25J224K992M090M740N357O120O826P077
$$ 679790 675423 672762 671059 669225 667377 666652 667876 670868 674958 679698 685055 691175 698001 705078
59904G05078O708N967N075L887K271N28j078k771m631n798n208l052o64J038K176
$$ 705078 711786 717753 722828 726715 728986 729514 728436 725665 721034 715236 710028 706976 706312 707350 709526
59889G09526K972L260L203L598M851O332P223P474P479P356P104P018P381P912
$$ 709526 712498 715758 718961 722559 727410 733742 740965 748439 755918 763274 770378 777396 784777 792689
59875G92689Q038P565O784N984N128L951K306N24p18j145j362k085l011l182k516
$$ 792689 800727 808292 815076 821060 826188 830139 832445 832969 832251 831106 829744 827659 824648 821466 818950
59860H18950k157k892m021m324l659k885k574k507k310j931j428p61O7R61J930
$$ 818950 816793 813901 809880 805556 801897 799012 796438 793931 791621 789690 788262 787501 787568 788529 790459
59845G90459L135M654O320P837Q996R764J0181J0106R123O916L878J201J51J165
$$ 790459 793594 798248 804568 812405 821401 831165 841346 851452 860575 867491 871369 872570 872721 873886
59831H73886L569O111P745P984O638L571r66n883r691j1778j2831j3736j4435
$$ 873886 877455 883566 891311 899295 905933 909504 908538 902655 892964 881186 868355 854619 840184
59818H40184j4276j3138j1499r632p449n104l155k012j639j830k314k612k363
$$ 840184 825908 812770 801271 791639 784190 779086 775931 773919 772280 770450 768136 765524 763161
59805G63161j774j337j019l55P47J826K509K703K161O34j364k762l189l305l571
$$ 763161 761387 760050 759031 758676 759423 761249 763758 766461 768622 769256 767892 765130 761941 758636 755065
59790G55065l552k960k584l290m611n321n113m838n074n380n155m529l983l576
$$ 755065 751513 748553 745969 742679 738068 732747 727634 722796 717722 712342 707187 702658 698675 695099
59776F95099l014k270j594j037l78L72Q14P93Q50J646L070M378N133N466N530
$$ 695099 692085 689815 688221 687184 686806 687178 687992 688785 689635 691281 694351 698729 703862 709328 714858
59761G14858N376N509O667Q577R793R511Q849R413J1165J2860J4060J5399J6878
$$ 714858 720234 725743 732410 740987 750780 760291 769140 778553 789718 802578 816638 832037 848915
59748H48915J7459J6671J5478J4863J4534J3641J2079J0395Q910P523N964L897
$$ 848915 866374 883045 898523 913386 927920 941561 953640 964035 972945 980468 986432 990329
59736I90329J218j412k958l305l547m482n505n677n249n180n571n554m746l862
$$ 990329 991547 990135 987177 983872 980325 975843 970338 964661 959412 954232 948661 943107 938361 934499
59722I34499l648l916m027l904m048m695n425n718n620n495n277m445k920j428
$$ 934499 930851 926935 922908 919004 914956 910261 904836 899118 893498 888003 882726 878281 875361 873933
59708H73933n69L2J054K368L340L971M830N905O586O909P758R396J0820J1190
$$ 873933 873364 873396 874450 876818 880158 884129 888959 894864 901450 908359 916117 925513 936333 947523
59694I47523J1089J1549J2446J2682J1566R228O015K321j123l530m764n386n985
$$ 947523 958612 970161 982607 995289 1006855 1016083 1022098 1024419 1023296 1019766 1015002 1009616 1003631
59681A003631o765p672q537r162r522r823j0194j0538j0822j1238j1758j1867
$$ 1003631 996866 989194 980657 971495 961973 952150 941956 931418 920596 909358 897600 885733
59669H85733j1069r476p680o191n208m629m082l186k004r73k96K52Q28J382K152
$$ 885733 874664 865188 857508 851317 846109 841480 837398 834212 832208 831235 830939 831191 832019 833401 835553
59654H35553L584N465O729O694N901N222M664L712K340Q16j037l545o277q328
$$ 835553 839137 844602 851331 858025 863926 869148 873812 877524 879864 880680 879643 876098 869821 861493
59640H61493r507j0488j1683j2641j2697j1671r814p600n705m689m453m327l947
$$ 861493 851986 841498 829815 817174 804477 792806 782992 775392 769687 764998 760545 756218 752271
59627G52271l710m177n292o413o959o878o573o447o559o690o712o643o387n686
$$ 752271 748561 744384 739092 732679 725720 718842 712269 705822 699263 692573 685861 679218 672831 667145
59613F67145m558l465k784k295j480j86J258K433L139L443L618L886M037L586
$$ 667145 662587 659122 656338 654043 652563 652377 653635 656068 659207 662650 666268 670154 674191 677777
59599F77777K512J481R99O97J8p25o27M66J613J979J804J824K145K207J678Q73
$$ 677777 680289 681770 682769 683466 683484 682759 682132 682598 684211 686190 687994 689818 691963 694170 695848 696721
59583F96721J81n11j461k369k590k144j981k834m187m897m659m183m022l903l417
$$ 696721 696902 696391 694930 692561 689971 687827 685846 683012 678825 673928 669269 665086 661064 657161 653744
59568F53744k659j874r91RO58N00k18p41n95J4N00M04k32q68j036q93r37j127
$$ 653744 651085 649211 648220 648229 648887 649387 649169 648428 647833 647847 648347 648751 648519 647651 646615 645722 644785 643658
59550F43658p73N28K211L289L287K551J973K398L883N508O484P368R393J2550
$$ 643658 642885 643413 645624 648913 652200 654751 656724 659122 663005 668513 674997 682365 691758 704308
59536G04308J5436J7273J8721J9899J8899J3814N667k026o570p842p040n106k691
$$ 704308 719744 737017 755738 775637 794536 808350 814017 811991 805421 797579 790539 785433 782742
59523G82742n19R39J735K039J853J263N61j18r22j989l274m741o353p816q740
$$ 782742 782223 783162 784897 786936 788789 790052 790613 790495 789573 787584 784310 779569 773216 765400 756660
59508G56660r103r254r325r036q158o964n997n504n253m827m113l337k591j581
$$ 756660 747557 738303 728978 719942 711784 704820 698823 693319 688066 683239 679126 675789 673198 671617
59494F71617j67J056J369J105J427K699L893M062L643L634M143M605M853N136
$$ 671617 671450 672506 673875 674980 676407 679106 682999 687061 690704 694338 698481 703086 707939 713075
59480G13075N380N343N287N724O612P552Q441R236R319Q138O240M705L615K143
$$ 713075 718455 723798 729085 734809 741421 748973 757414 766650 775969 784107 790347 795052 798667 800810
59466H00810K17j090j222j048j521k261k228j163L38J861L523N386P118Q335R009
$$ 800810 801027 799937 798715 797667 796146 793885 791657 790494 790832 792693 796216 801602 808720 817055 826064
59451H26064R491J0118J0830J1171J0832J0046R195Q160O425L752M72k856n622
$$ 826064 835555 845673 856503 867674 878506 888552 897747 905907 912332 916084 916556 913700 908078
59438I08078p177p183o074m748l749l032k487k142j824j216l76K52N70J092K244
$$ 908078 900901 893718 887644 882896 879147 876115 873628 871486 869662 868446 868070 868322 868892 869984 872228
59423H72228L919N915Q423J1619J5121J8268K0794K2928K4953K7010K9265L1953
$$ 872228 876147 882062 890485 902104 917225 935493 956287 979215 1004168 1031178 1060443 1092396
59411A092396L5059L7938L9187L6982K9931J8199M066q779j7086j9805j8205j4266
$$ 1092396 1127455 1165393 1204580 1241562 1271493 1289692 1293758 1284979 1267893 1248088 1229883 1215617
59399A215617q997k567M245R366J0455O322k561j4177k5332l2908l5757l5214
$$ 1215617 1206620 1204053 1208298 1217664 1228119 1234441 1231880 1217703 1192371 1159463 1123706 1088492
59387A088492l3240l0466k6584k2015j8030j5252j3078j0745q257o014m183k726
$$ 1088492 1055252 1024786 998202 976187 958157 942905 929827 919082 910825 904811 900628 897902
59375H97902j561m52Q36K068K656K466K133K358L144L912M165L984L993M776O182
$$ 897902 896341 895889 896725 898793 901449 903915 906048 908406 911550 915462 919627 923611 927604 932380 938562
59360I38562P334P588P269P127P328P504P635Q147R158J0202J0855J1187J1454
$$ 938562 945896 953484 960753 967880 975208 982712 990347 998494 1007652 1017854 1028709 1039896 1051350
59347A051350J1780J2209J2712J3067J3070J2862J2630J2079J0611Q054M791J156
$$ 1051350 1063130 1075339 1088051 1101118 1114188 1127050 1139680 1151759 1162370 1170424 1175215 1176371
59335A176371k705o479r685j2203j4372j6431j8234j9515k0105j9919j9203j8608
$$ 1176371 1173666 1167187 1157502 1145299 1130927 1114496 1096262 1076747 1056642 1036723 1017520 998912
59323I98912j8520j8377j7330j5457j3698j2532j1566j0486r551q854p938o639
$$ 998912 980392 962015 944685 929228 915530 902998 891432 880946 871395 862541 854603 847964
59311H47964n624n546o142o663o705o150m831k878j133m38o13o04L50K088M077
$$ 847964 842340 836794 830652 823989 817284 811134 806303 803425 802292 801854 801241 800637 800987 803075 807152
59296H07152O120Q365J0887J3442J5664J7279J7952J6933J3200O591j258p590
$$ 807152 813272 821637 832524 845966 861630 878909 896861 913794 926994 933585 932327 924737
59284I24737j0646j0924j0185r386p988n211j447K049M656O981R788J2809J5222
$$ 924737 914091 903167 892982 883596 875608 870397 868950 870999 875655 882636 892424 905233 920455
59271I20455J6899J8377J9631J9930J9168J8383J8290J8108J6686J4136J1360
$$ 920455 937354 955731 975362 995292 1014460 1032843 1051133 1069241 1085927 1100063 1111423
59260A111423Q511N013R96k479m717o014o874p441p895q582r427r858r597r000
$$ 1111423 1119934 1124947 1125943 1123464 1118747 1112733 1105859 1098418 1090523 1081941 1072514 1062656 1053059 1044059
59246A044059q456p961p532p474p924q506q700q276p311o073m946m171l629l088
$$ 1044059 1035603 1027642 1020110 1012636 1004712 996206 987506 979230 971919 965846 960900 956729 953100 950012
59232I50012k608k436k694l434m663n950o508o219o040o668p376p143o391o339
$$ 950012 947404 944968 942274 938840 934177 928227 921719 915500 909460 902792 895416 888273 881882 875543
59218H75543o913o762n437m094l625l452k749j735j032o18k11N1l2j98j99l40
$$ 875543 868630 861868 856431 852337 848712 845260 842511 840776 839744 839126 838915 838966 838934 838736 838537 838197
59202H38197r59j810k373k506k415k340k518l126l965m582m725m397l473j908
$$ 838197 837238 835428 833055 830549 828134 825794 823276 820150 816185 811603 806878 802481 799008 797100
59188G97100k50O44N43p2q08j485j670j027k00l32j479k455k439j748q48K47J223
$$ 797100 796850 797494 798037 797965 797157 795672 794002 792975 792775 792443 790964 788509 786070 784322 783474 783721 784944
59171G84944J350P01L77R07J446J322J276K145L309L559K854K056J433N02q84
$$ 784944 786294 786995 787372 788279 789725 791047 792323 794468 797777 801336 804190 806246 807679 808181 807297
59156H07297k281l413m399n282n944o486p164q008q739q998q541p471o353n712
$$ 807297 805016 801603 797204 791922 785978 779492 772328 764320 755581 746583 738042 730571 724218 718506
59142G18506n374m839m212m074m381m462m181m056m007l188j557l40k40l14M48
$$ 718506 713132 708293 704081 700007 695626 691164 686983 682927 678920 675732 674175 673835 673595 673281 673729
59127F73729J579K220K761M104N981P333P914Q410R225J0190J1193J2197J2906
$$ 673729 675308 677528 680289 684393 690374 697707 705621 714031 723256 733446 744639 756836 769742
59114G69742J3159J3392J3892J4084J3335J2003J0815R689Q164O550N547M925
$$ 769742 782901 796293 810185 824269 837604 849607 860422 870111 878275 884825 890372 895297
59102H95297L782J985L51o13j285k155l208m182m801m878m686m918n605n558l801
$$ 895297 899079 901064 901415 900802 899517 897362 894154 889972 885171 880293 875607 870689 865084 859526 855725
59087H55725j327k62j272k889l586l521l827m944o296p116p175o821o585o655
$$ 855725 854398 854136 852864 849975 846389 842868 839041 834097 827801 820685 813510 806689 800104 793449
59073G93449o696o291n518m884m790n192n648n586m802l826l426l621l645l045
$$ 793449 786753 780462 774944 770060 765270 760078 754430 748844 744042 740216 736790 733169 729524 726479
59059G26479k249j755j392r22p31j265k253l046l402l379k890j948r62k40L83
$$ 726479 724230 722475 721083 720161 719430 718165 715912 712866 709464 706085 703195 701247 700285 700045 700428
59044G00428R14P82k87j468j718j066l20J86P41J446K053K498K954L457L955M567
$$ 700428 701342 702124 701837 700369 698651 697585 697265 697451 698192 699638 701691 704189 707143 710600 714555 719122
59028G19122N392O375P728R936J2935J5809J7859J9365K0674K1217K0234J7910
$$ 719122 724514 730889 738617 748553 761488 777297 795156 814521 835195 856412 876646 894556
59016H94556J4929J1503P649L951J003j443l922o244p962r342j0773j1660j0994
$$ 894556 909485 920988 928637 932588 933591 932148 928226 921982 914020 904678 893905 882245 871251
59003H71251q855o317m058k041k67J110K306L499M141L592K304J372J077Q69N49
$$ 871251 862396 856079 852021 849980 849713 850823 853129 856628 860769 864361 866665 868037 869114 869983 870532
58988H70532L86K00n18j595k282k378k266j907q60P12K125L301M767O479P803
$$ 870532 870918 871118 870600 869005 866723 864345 862079 860172 859312 860024 862149 865450 870217 876696 884499
58973H84499Q735J0039J1864J3367J4069J4534J5244J5689J5206J4023J2899J2152
$$ 884499 893234 903273 915137 928504 942573 957107 972351 988040 1003246 1017269 1030168 1042320
58961A042320J1448J0213Q057N071J850j130m034p188j0303j2798j4744j6740
$$ 1042320 1053768 1063981 1072038 1077109 1078959 1077829 1073795 1066607 1056304 1043506 1028762 1012022
58949A012022j8809k0173k0227j9154j7540j5869j4475j3428j2437j1143r506
$$ 1012022 993213 973040 952813 933659 916119 900250 885775 872347 859910 848767 839261
58938H39261p569n206k492j8J709K787L418L371K628J938J907K080J728J049N75
$$ 839261 831692 826486 823994 823976 825685 828472 831890 835261 837889 839827 841734 843814 845542 846591 847166
58923H47166pj316k967m021m453m922n363n098m235l657l579l252k203p16R10
$$ 847166 847159 845843 842876 838855 834402 829480 824117 819019 814784 811127 807548 804296 802093 801377 802287
58908H02287K557L817M384M867O218Q459J0925J3437J6033J7914J8149J7314J6907
$$ 802287 804844 808661 813045 817912 824130 832589 843514 856951 872984 890898 909047 926361 943268
58895I43268J7114J6733J5410J4304J4204J4602J5115J6271J8207J9931K0651
$$ 943268 960382 977115 992525 1006829 1021033 1035635 1050750 1067021 1085228 1105159 1125810
58884A125810K0671K0273J8863J6048J2625R684P357N080K502l79l372o022p934
$$ 1125810 1146481 1166754 1185617 1201665 1214290 1223974 1231331 1236411 1238913 1238534 1235162 1229140 1221206
58871A221206r356j0847j2290j2971j2641j1695j0324q480o681n835o104o860
$$ 1221206 1211850 1201003 1188713 1175742 1163101 1151406 1141082 1132602 1125921 1120086 1113982 1107122
58859A107122p781r007j0261j1022j1573j2598j3652j3435j1838j0347r929r903
$$ 1107122 1099341 1090334 1080073 1069051 1057478 1044880 1031228 1017793 1005955 995608 985679 975776
58847I75776r371q569q220q620r814j1732j3709j4815j4990j4924j4740j3913
$$ 975776 966405 957836 949616 940996 931182 919450 905741 890926 875936 861012 846272 832359
58835H32359j2554j1422j0578r366p898p024o581n352l180j395n94K41J700K778
$$ 832359 819805 808383 797805 788439 780541 773517 766936 761584 758404 757009 756415 756656 758356 761134
58821G61134K689K190K104J959J268P86J313K413L281L829L981L134J281m38j251
$$ 761134 763823 766013 768117 770076 771344 772130 773443 775856 779137 782966 786947 790081 791362 790924 789673
58806G89673j671k114k026j380j508l187n130n768n385n196n383n457n617o237
$$ 789673 788002 785888 783862 782482 780974 777787 772657 766889 761504 756308 750925 745468 739851 733614
58792G33614o775o526n769n079m226k840j323L5J829M267O117O319N778O079P196
$$ 733614 726839 720313 714544 709465 705239 702399 701076 701111 702940 707207 713324 719643 725421 731500 738696
58777G38696P969Q129Q288Q326P374N177K255j033m412p017q036p828p455p337
$$ 738696 746665 754794 763082 771408 778782 783959 786214 785181 780769 773752 765716 757888 750433 743096
58763G43096p231p060o808o032m502k877j811r03M23J600J697J118J116J832K083
$$ 743096 735865 728805 721997 715965 711463 708586 706775 705872 706295 707895 709592 710710 711826 713658 715741
58748G15741J223N0l45J73R83J575K019K801M166N592O271O198O194O609O890
$$ 715741 716964 717014 716669 716842 717825 719400 721419 724220 728386 733978 740249 746447 752641 759250 766140
58733G66140O716O672P249P991Q258Q069P671P096O617O788P418P528O896O586
$$ 766140 772856 779528 786777 794768 803026 811095 818766 825862 832479 839267 846685 854213 861109 867695
58719H67695P263Q174Q563Q912R784J0605J0668J0256R779Q789O926M715K424
$$ 867695 874958 883132 891695 900607 910391 920996 931664 941920 951699 960488 967414 972129 974553
58706I74553p07m844q563j0887j2992j6227j9585k1121k1031k1296k2704k4092
$$ 974553 973846 969002 960439 949552 936560 920333 900748 879627 858596 837300 814596 790504
58694G90504k4289k3187k1027j8161j5449j3606j2266j0699r048p863p005o184
$$ 790504 766215 743028 722001 703840 688391 674785 662519 651820 642772 634909 627904 621720
58682F21720n842o248o367n130l273k294k169j687o79j95n70r24n60M72K148M486
$$ 621720 615878 609630 603263 598133 594860 592566 590397 588710 588031 587836 587266 586342 585782 586254 588402 592888
58666E92888O815Q285R106J0187J1636J2615J2542J1422R155N608J314k759n964
$$ 592888 599703 607988 617094 627281 638917 651532 664074 675496 684651 690259 691573 688814 682850
58653F82850p991q646q373q250q591q455p390o614p185q076p578n754l861k243
$$ 682850 674859 666213 657840 649590 640999 632544 625154 618540 611355 603279 595701 589947 586086 583843
58639E83843n63O06M84n3O55K509L772L659L021K494J734O26k89q68j478j995
$$ 583843 583280 583886 584370 584317 584972 587481 591253 594912 597933 600427 602161 602787 602498 601630 600152 598157
58623E98157j922j507j541j959j787n44J290L054M268M635M625N437P321Q634
$$ 598157 596235 594728 593187 591228 589441 588897 590187 593241 597509 602144 606769 612206 619527 628161
58609F28161P889N929M618M120L316K237K057K869L434L087K253J127n05k129
$$ 628161 636050 641979 646597 650717 654033 656270 658327 661196 664630 667717 669970 671097 670592 668463
58595F68463k791k575k374k305j715n61O35J995M051O534Q766J0838J3010J4433
$$ 668463 665672 663097 660723 658418 656703 656142 656777 658772 662823 669357 678123 688961 701971 716404
58581G16404J4137J2818J2013J1921J1669J1182J0918J0315Q581O714O625Q451
$$ 716404 730541 743359 755372 767293 778962 790144 801062 811377 819958 826672 833297 841748
58569H41748J0705J2880J5778J9459K3024K6422L0383L4452L7196L8425L9169
$$ 841748 852453 865333 881111 900570 923594 950016 980399 1014851 1052047 1090472 1129641
58558A129641L9381L7686L3611K8026K1293J3102M357k867p713j0983j3109j3575
$$ 1129641 1169022 1206708 1240319 1268345 1289638 1302740 1307097 1304230 1296517 1285534 1272425 1258850
58546A258850j2601j1419j0546r620r078j0087j2601j5460j8436k2201k6249k8974
$$ 1258850 1246249 1234830 1224284 1214664 1205586 1195499 1182898 1167438 1149002 1126801 1100552 1071578
58534A071578l0011l0386l0275k8869k6499k4516k2809j9996j6345j3906j3210
$$ 1071578 1041567 1011181 980906 952037 925538 901022 878213 858217 841872 827966 814756
58523H14756j2440j0559q708p691o599m953l805l656l461k725k473l131l480k792
$$ 814756 802316 791757 783049 775358 768759 763806 760001 756345 752884 750159 747686 744555 741075 738283
58509G38283k012j817j476o02p3k75k81L27O76M69O87J535J679M71r06j412j403
$$ 738283 736271 734454 732978 732376 732303 732028 731747 732074 732750 733219 733906 735441 737120 737591 736685 735273 733870
58492G33870j148o1J774L235M108N497P641R411J0583J2367J4963J6938J7982
$$ 733870 732722 732661 734435 737670 741778 747275 754916 764327 774910 787277 802240 819178 837160
58479H37160J9755K2921K5724K6728K6655K6131K3973J9205J2805O100p04p233
$$ 837160 856915 879836 905560 932288 958943 985074 1009047 1028252 1041057 1047157 1046453 1039220
58467A039220j2187j5072j6767j7435j6033j2857j0113q703o892l434L94L420
$$ 1039220 1027033 1011961 995194 977759 961726 948869 938756 930053 923161 919727 920121 923541
58455I23541O592J0686J4344J6281J7311J8222J7703J4317Q786K630l712r863
$$ 923541 930133 940819 955163 971444 988755 1006977 1024680 1038997 1047783 1050413 1046701 1036838
58443A036838j4535j7224j9071k0576k0411j7969j4941j2779j0753q139o025n053
$$ 1036838 1022303 1005079 986008 965432 945021 927052 912111 899332 888579 880440 874415 869362
58431H69362l634n45K724M347N049O482Q491J0012J1112J2120J2211J0671Q191
$$ 869362 865728 865183 867907 872254 877303 883785 892276 902288 913400 925520 937731 948402 956593
58418I56593N381J781k381n383o613p810j0101j2013j2253j2096j2824j3128j1407
$$ 956593 961974 963755 961374 955991 949378 941568 931467 919454 907201 895105 882281 869153 857746
58405H57746q742p107o360n325m196l570k715r54O67J138J386K542L922M558M989
$$ 857746 849004 841897 835537 830212 826016 822446 819731 818777 819444 820582 821968 824510 828432 832990 837979
58390H37979N719N700M326L038L049L270K434J395J326J530R80J79l09j249k815
$$ 837979 843698 849398 853724 856762 859811 863081 865515 866910 868236 869766 870746 870925 870616 869367 866552
58375H66552l386k050j75J165K938N580P434P789Q636J1164J3358J3521J3282
$$ 866552 863166 861116 860941 862106 865044 870624 878058 885847 894483 905647 919005 932526 945808
58362I45808J4458J5818J5826J5802J7267J8726J8138J6104J3769J0316N577K182
$$ 945808 960266 976084 991910 1007712 1024979 1043705 1061843 1077947 1091716 1102032 1107609 1109791
58350A109791J726J609p25l216k701l39O85O12J913M575O640P992R737J1311J1786
$$ 1109791 1111517 1113126 1112401 1109185 1106484 1106145 1106830 1107442 1109355 1113930 1120570 1128562 1138299 1149610 1161396
58335A161396J2491J4943J7746J8866J9126K0159K0912J9694J7567J6221J4537
$$ 1161396 1173887 1188830 1206576 1225442 1244568 1264727 1285639 1305333 1322900 1339121 1353658
58324A353658J0887O670L974J933q81k853k032j48J34k81Q01K468K751K843M911
$$ 1353658 1364545 1371215 1375189 1377122 1376241 1373388 1371356 1371208 1371342 1371061 1371862 1374330 1377081 1379924 1384835
58309A384835P849R381J0236J2092J3795J3797J3826J5765J7521J6601J4913J5337
$$ 1384835 1392684 1402065 1412301 1424393 1438188 1451985 1465811 1481576 1499097 1515698 1530611 1545948
58297A545948J6370J5286J3727J4680J6660J6578J5775J7396K0158K0757K0185
$$ 1545948 1562318 1577604 1591331 1606011 1622671 1639249 1655024 1672420 1692578 1713335 1733520
58286A733520K1603K4115K4671K4158K5522K7814K8142K7521K8793L0797L0685
$$ 1733520 1755123 1779238 1803909 1828067 1853589 1881403 1909545 1937066 1965859 1996656 2027341
58275B027341K9855L1385L3886L4208L3802L5953L9257M0560M1618M5850N1193
$$ 2027341 2057196 2088581 2122467 2156675 2190477 2226430 2265687 2306247 2347865 2393715 2444908
58264B444908N3517N4393N7874O2397O3811O3604O5828O8594O7250O3483O2447
$$ 2444908 2498425 2552818 2610692 2673089 2736900 2800504 2866332 2934926 3002176 3065659 3128106
58253C128106O3335O1847N9476O0926O4764O6254O7055P2206P9915Q4575Q7544
$$ 3128106 3191441 3253288 3312764 3373690 3438454 3504708 3571763 3643969 3723884 3808459 3896003
58242C896003R4381J03703J09722J13495J20485J29401J35022J39519J48929J61057
$$ 3896003 3990384 4094087 4203809 4317304 4437789 4567190 4702212 4841731 4990660 5151717
58232E151717J69477J76657J89836K06794K19734K30447K46750K66888K83215
$$ 5151717 5321194 5497851 5687687 5894481 6114215 6344662 6591412 6858300 7141515
58223G141515K98561L22254L52490L80012M06683M42086M84530N24955N67026
$$ 7141515 7440076 7762330 8114820 8494832 8901515 9343601 9828131 10353086 10920112
58214A0920112O22488O89374P56951Q29377R20529J028689J142718J270361J431944
$$ 10920112 11542600 12231974 12988925 13818302 14738831 15767520 16910238 18180599 19612543
58205A9612543J629411J853666K119826K460434K887358L401003M034877M845710
$$ 19612543 21241954 23095620 25215446 27675880 30563238 33964241 37999118 42844828
58197D2844828N862662P100916Q624782J0532890J2879907J5692950J9067750
$$ 42844828 48707490 55808406 64433188 74966078 87845985 103538935 122606685
58190A22606685K3125920K7809256L2776040L7464749M1007388M1941246L8360389
$$ 122606685 145732605 173541861 206317901 243782650 284790038 326731284 365091673
58183C65091673K9013425J4651576j787865j6604488k7193007l2865052l4373082
$$ 365091673 394105098 408756674 406968809 390364321 363171314 330306262 295933180
58176B95933180l2990656k9933249k6203985k2586654j9610047j7480819j6062799
$$ 295933180 262942524 233009275 206805290 184218636 164608589 147127770 131064971
58169A31064971j4992112j3914721j2677205j1321366r947845q627888p410913
$$ 131064971 116072859 102158138 89480933 78159567 68211722 59583834 52172921
58162E2172921o336977n415367m624158l944545l373161k899086k497447k152568
$$ 52172921 45835944 40420577 35796419 31851874 28478713 25579627 23082180 20929612
58154B0929612j864425j627607j425674j250558j106952r92971q95281q07221
$$ 20929612 19065187 17437580 16011906 14761348 13654396 12661425 11766144 10958923
58146A0958923p33850o75224o21475n68247n21136m81288m41388l99347l61759
$$ 10958923 10225073 9549849 8928374 8360127 7838991 7357703 6916315 6516968 6155209
58137F155209l30658l00159k68999k43398k24896k07853j91358j81228j77631
$$ 6155209 5824551 5524392 5255393 5011995 4787099 4579246 4387888 4206660 4029029
58128D029029j72757j63480j54900j49033j41297j30611j21956j16301j08616
$$ 4029029 3856272 3692792 3537892 3388859 3247562 3116951 2994995 2878694 2770078
58119B770078r8284r0994q7921q3328p5457o9552o7474o4334n8348n4165n3486
$$ 2770078 2671794 2580800 2492879 2409551 2334094 2264542 2197068 2132734 2074386 2020221 1966735
58108A966735n1769m7446m5150m6524m6773m3699m1548m2442m2338l9111l6530
$$ 1966735 1914966 1867520 1822370 1775846 1729073 1685374 1643826 1601384 1559046 1519935 1483405
58097A483405l6567l5463l1251k7752k7444k7221k4809k2689k2263k0755j7150
$$ 1483405 1446838 1411375 1380124 1352372 1324928 1297707 1272898 1250209 1227946 1207191 1190041
58086A190041j4848j5219j4977j2894j2677j5907j8605j8167j7448j8572j8881
$$ 1190041 1175193 1159974 1144997 1132103 1119426 1103519 1084914 1066747 1049299 1030727 1011846
58075A011846j6704j5176j6440j7635j6442j5279j6215j6892j5251j3509j3661
$$ 1011846 995142 979966 963526 945891 929449 914170 897955 881063 865812 852303 838642
58064H38642j3667j1672r614r159q395n996m402n493p103p120p108q650r988r489
$$ 838642 824975 813303 803689 794530 786135 780139 775737 770244 763141 756021 748913 740263 730275 720786
58050G20786q764r287r434p832o176n956n839m786m249m882m781l424l431n845
$$ 720786 712022 702735 693301 685469 679293 673337 667498 662712 658463 653581 648800 645376 641945 636100
58036F36100p600o498m786m979n850n661n623o996q164p684p055p540p472n682
$$ 636100 628500 622002 617216 612237 606387 600726 595103 588107 579943 572259 565204 557664 550192 544510
58022E44510m367n443p127p128o291o161n808m142k592k531k616j411j22n4o0
$$ 544510 540143 534700 527573 520445 514154 507993 502185 498043 495451 492920 490304 488893 488771 488717 488657
58007D88657R39J593Q64L22J168J820J116R58K856M751M345K968K964L683L159
$$ 488657 489596 491189 492053 492375 493543 495363 496479 497437 500293 505044 509389 512357 515321 519004 522163
57992E22163J569J0k017m981p235p358o611o513o185m602l195l405l903l041j885
$$ 522163 523732 523742 521725 516744 509509 502151 495540 489027 482842 478240 475045 471640 467737 464696 462811
57977D62811k038k589k029j171j262j337k07R41P73N37J670K809K218J112J370
$$ 462811 460773 458184 456155 454984 453722 452385 452178 453119 453892 454429 456099 458908 461126 462238 463608
57962D63608J899O94j185j185M76J385P29m25j640l020l730l229k910m002n136
$$ 463608 465507 466201 465016 463831 464307 465692 466421 465996 464356 461336 457606 454377 451467 447465 442329
57947D42329m533l089k647k681j585J46J064J742L589N826O743O973Q438J0827
$$ 442329 437796 434707 432060 429379 427794 427940 429004 430746 434335 440161 446904 453877 462315 473142
57933D73142J2186J2267J2373J2407J1004Q149N045J873j740m703n643n601o845
$$ 473142 485328 497595 509968 522375 533379 541528 546573 548446 546706 542003 536360 530759 523914
57920E23914r316j0862j0727j0243j0275j0273r828r027p466m947k716k091k305
$$ 523914 514598 503736 493009 482766 472491 462218 452390 443363 435897 430950 428234 426143 423838
57907D23838j753o74m83j084j177p72r95j815k210k270k947l972m171l547l027
$$ 423838 422085 421411 420928 419844 418667 417895 416900 415085 412875 410605 407658 403686 399515 395968 392941
57892C92941k474j060P61J733K003K767L993M535M234L910L533K472J252J073
$$ 392941 390467 389407 390168 391901 393904 396671 400664 405199 409433 413343 416876 419348 420600 421673
57878D21673J674J630O66j64m09n85p57m81J19P24J836L803N494N731N348N948
$$ 421673 423347 424977 425643 425479 425070 424485 423728 423247 423366 424090 425926 429729 435223 440954 446302 452250
57862D52250P232P658P056O496O095N297M747N578P020P178N945M937M639L983
$$ 452250 459482 467140 474196 480692 486787 492084 496831 502409 509429 516607 522552 527489 532128 536111
57848E36111K655J482M32j473l980n537n686n606n969o175n931n789n905n865
$$ 536111 538766 540248 540680 539207 535227 529690 524004 518398 512429 506254 500323 494534 488629 482764
57834D82764n785n932n506l595j119J56L47J047K476L322L323L612M276M068K914
$$ 482764 476979 471047 465541 461946 460827 460983 461330 462377 464853 468175 471498 475110 479386 483454 486368
57819D86368K368K971L440L077K836L260L436K839K292K299K213J779J645J584
$$ 486368 488736 491707 495147 498224 501060 504320 507756 510595 512887 515186 517399 519178 520823 522407
57805E22407J10l137o273p511p247o883o918p122p398p570p244o539o057n738
$$ 522407 522517 519380 513107 505596 498349 491466 484548 477426 470028 462458 455214 448675 442618 436880
57791D36880m815l204j804j097o86l47l17k75N45J922K731K752L062M236N539
$$ 436880 432065 428861 427057 425960 425274 424927 424610 424335 424880 426802 429533 432285 435347 439583 445122
57776D45122O288O656O770O320N474M843M208K613L2k343l786m695n372n647n943
$$ 445122 451410 458066 464836 471156 476630 481473 485681 488294 488326 485983 482197 477502 472130 466483 460540
57761D60540p058q500q667p218n691n200n007m075k516q50Q77K444L178L075L054
$$ 460540 453482 444982 436315 429097 423406 418206 413199 409124 406608 405758 406635 409079 412257 415332 418386
57746D18386L618M271M657N047N350N052M485M670N475N477M190K910K656K796
$$ 418386 422004 426275 430932 435979 441329 446381 450866 455536 461011 466488 470678 473588 476244 479040
57732D79040K524K192K284K374K026J652J632J651J553J719J989J413k08j701
$$ 479040 481564 483756 486040 488414 490440 492092 493724 495375 496928 498647 500636 502049 501841 500140
57718E00140k180k100k078j923j558j622k355l002l111l257l741l827l102k382
$$ 500140 497960 495860 493782 491859 490301 488679 486324 483322 480211 476954 473213 469386 466284 463902
57704D63902k333k289j381J26J433K179K214J426N36Q14K182K880J962Q55J298
$$ 463902 461569 459280 457899 458025 459458 461637 463851 465277 465813 466627 468809 471689 473651 474506 475804
57689D75804K809L598L151K528K621L259L896M258M403M639N177N828O502P986
$$ 475804 478613 482211 485362 487890 490511 493770 497666 501924 506327 510966 516143 521971 528473 536459
57675E36459J1154J5397J9052K1815K5439L1512L9681M8639N7557O5687P1500
$$ 536459 547613 563010 582062 603877 629316 660828 700509 749148 806705 872392 943892
57664I43892P2845O7312N2594K8421j164k9070n0009o3209p0089p1283o7218n9853
$$ 943892 1016737 1084049 1136643 1165064 1163900 1134830 1084821 1021612 951523 880240 813022 753169
57652G53169n1840m4570l8198l2717k7859k2898j7778j3624j1106r232o917m706
$$ 753169 701329 656759 618561 585844 557985 535087 517309 503685 492579 483347 476430 471724
57640D71724l655l338k471q62M76P56j8j377k384k028n41M65M0q42r95q75j479
$$ 471724 468069 464731 462260 461398 461874 462630 462612 461235 458851 456823 456282 456747 456787 455945 454950 454075 452596
57623D52596k430k658k169j679j110m1R33Q14j58q77j063j269j408q67J05M86
$$ 452596 450166 447508 445339 443660 442550 442509 443442 444256 444098 443221 442158 440889 439481 438614 438719 439205
57607D39205P4k01K54R54J263J185J089J245J684K053J748P07l06p36j020j653
$$ 439205 439279 439078 439332 440286 441549 442734 443823 445068 446752 448805 450553 451260 450954 450218 449198 447545
57591D47545k074j468k30M29J49k94k75N9M81J060J667J769J042j26q92o52L60
$$ 447545 445471 444003 443773 444202 444351 444057 443782 443841 444322 445382 447049 448818 449860 449734 448842 448190 448550
57574D48550J132P99l84j355j540j314j164j107j119j268j265p07N7K52J8K45
$$ 448550 449682 450481 450097 448742 447202 445888 444724 443617 442498 441230 439965 439258 439315 439567 439585 439830
57558D39830Q94Q67K8k28Q35K072K433K602L445M288M249M117N035O229N830L561
$$ 439830 440724 441591 441619 441391 442226 444298 446731 449333 452778 457066 461315 465432 470467 476696 482526 486087
57542D86087J057k34j53Q27K079K892L070L246L847M295M050L699L932M323M227
$$ 486087 487144 486910 486757 487584 489663 492555 495625 498871 502718 507013 511063 514762 518694 523017 527244
57527E27244M128M752N600N738N487N870O803P277O974O418N872N318N147N608
$$ 527244 531372 536124 541724 547462 552949 558819 565622 572899 579873 586291 592163 597481 602628 608236
57513F08236O007N586M778M373M095L306K475K392K550J930R86J018J905K254
$$ 608236 614243 619829 624607 628980 633075 636381 638856 641248 643798 645728 646714 647732 649637 651891
57499F51891J746J493J948K207J726J177J156J334J322J316J472J599J664J782
$$ 651891 653637 655130 657078 659285 661011 662188 663344 664678 666000 667316 668788 670387 672051 673833
57485F73833J756J486J588K618L918M331L802L192K766K237J901K338L076L060
$$ 673833 675589 677075 678663 681281 685199 689530 693332 696524 699290 701527 703428 705766 708842 711902
57471G11902K345J952K090K037J784K185L330M262M607N035N839O388O349O160
$$ 711902 714247 716199 718289 720326 722110 724295 727625 731887 736494 741529 747368 753756 760105 766265
57457G66265O002N507M784M507M751M825M516M316M378M408M670N650O664O325
$$ 766265 772267 777774 782558 787065 791816 796641 801157 805473 809851 814259 818929 824579 831243 837568
57443H37568M721L565L846M734N232N441N639N651N714O653Q374R465R042P889
$$ 837568 842289 845854 849700 854434 859666 865107 870746 876397 882111 888764 897138 906603 915645 923534
57429I23534P156O994P124P484P730P125N788M941N243N855N832N432N288N297
$$ 923534 930690 937684 944808 952292 960022 967147 972935 977876 983119 988974 994806 1000238 1005526 1010823
57415A010823N163N167N578O056O395P097Q476R892J0548J0442R984R275Q385
$$ 1010823 1015986 1021153 1026731 1032787 1039182 1046279 1054755 1064647 1075195 1085637 1095621 1104896 1113281
57402A113281P677P327P016O568O323O551P070P670Q268Q561Q335Q183Q903J0080
$$ 1113281 1120958 1128285 1135301 1141869 1148192 1154743 1161813 1169483 1177751 1186312 1194647 1202830 1211733 1221813
57388A221813J0417R763R533J0594J2048J2764J2911J3160J3425J3295J2887J2412
$$ 1221813 1232230 1241993 1251526 1262120 1274168 1286932 1299843 1313003 1326428 1339723 1352610 1365022
57376A365022J1736J0999J0837J1271J1248J0138Q801Q369Q683Q911Q938R187
$$ 1365022 1376758 1387757 1398594 1409865 1421113 1431251 1440052 1448421 1457104 1466015 1474953 1484140
57364A484140R593R735R647R757J0205J0799J1332J1564J1300J0866J0969J1746
$$ 1484140 1493733 1503468 1513115 1522872 1533077 1543876 1555208 1566772 1578072 1588938 1599907 1611653
57352A611653J2535J2926J3326J4010J4493J4325J3915J3830J3946J3789J3298
$$ 1611653 1624188 1637114 1650440 1664450 1678943 1693268 1707183 1721013 1734959 1748748 1762046
57341A762046J2701J2182J1986J2411J3298J4087J4581J5064J5543J5674J5593
$$ 1762046 1774747 1786929 1798915 1811326 1824624 1838711 1853292 1868356 1883899 1899573 1915166
57330A915166J5853J6341J6318J5790J5688J6213J6330J5453J4452J4209J4397
$$ 1915166 1931019 1947360 1963678 1979468 1995156 2011369 2027699 2043152 2057604 2071813 2086210
57319B086210J4534J5024J6096J6859J6578J6038J6343J7206J7681J7903J8669
$$ 2086210 2100744 2115768 2131864 2148723 2165301 2181339 2197682 2214888 2232569 2250472 2269141
57308B269141J9735J9984J9211J8476J8612J9272J9707J9713J9551J9443J9379
$$ 2269141 2288876 2308860 2328071 2346547 2365159 2384431 2404138 2423851 2443402 2462845 2482224
57297B482224J9319J9445K0046K0952K1351K0761J9937J9997K0749K1005K0509
$$ 2482224 2501543 2520988 2541034 2561986 2583337 2604098 2624035 2644032 2664781 2685786 2706295
57286B706295K0343K1127K2105K2537K2688K2838K2555K1717K1061K0907K0474
$$ 2706295 2726638 2747765 2769870 2792407 2815095 2837933 2860488 2882205 2903266 2924173 2944647
57275B944647J9366J8518J8682J9068J8708J8113J8299J9018J9345J9321J9642
$$ 2944647 2964013 2982531 3001213 3020281 3038989 3057102 3075401 3094419 3113764 3133085 3152727
57264C152727K0263K0595K0767K1390K2301K2699K2412K2117K2332K2932K3543
$$ 3152727 3172990 3193585 3214352 3235742 3258043 3280742 3303154 3325271 3347603 3370535 3394078
57253C394078K3843K3616K3038K2576K2337K1977K1556K1713K2617K3555K4027
$$ 3394078 3417921 3441537 3464575 3487151 3509488 3531465 3553021 3574734 3597351 3620906 3644933
57242C644933K4376K4825K4916K4535K4461K5084K5595K5283K4647K4295K3845
$$ 3644933 3669309 3694134 3719050 3743585 3768046 3793130 3818725 3844008 3868655 3892950 3916795
57231C916795K2878K1948K1591K1267K0433J9712J9782K0053J9649J8911J8637
$$ 3916795 3939673 3961621 3983212 4004479 4024912 4044624 4064406 4084459 4104108 4123019 4141656
57220D141656J8604J8172J7657J7779J8370J8808J9134J9628J9903J9606J9325
$$ 4141656 4160260 4178432 4196089 4213868 4232238 4251046 4270180 4289808 4309711 4329317 4348642
57209D348642J9705K0369K0748K1115K1696K1774K0929K0185K0471K1002K0694
$$ 4348642 4368347 4388716 4409464 4430579 4452275 4474049 4494978 4515163 4535634 4556636 4577330
57198D577330K0149K0523K1263K0798J8848J6327J3672J0960R001Q472Q556Q151
$$ 4577330 4597479 4618002 4639265 4660063 4678911 4695238 4708910 4719870 4728871 4737343 4745899 4754050
57186D754050P905R141J1425J3078J3639J3813J3557J2348J1029J1074J2136J2415
$$ 4754050 4761955 4771096 4782521 4795599 4809238 4823051 4836608 4848956 4859985 4871059 4883195 4895610
57174D895610J1457J0482R945Q954P383O456O742P328P509P691Q284R076J0008
$$ 4895610 4907067 4917549 4927494 4936448 4943831 4950287 4957029 4964357 4971866 4979557 4987841 4996917 5006925
57161E006925J1153J1937J1748J1279J1705J2608J2300J0206P320M399J444j097
$$ 5006925 5018078 5030015 5041763 5053042 5064747 5077355 5089655 5099861 5107181 5111580 5113024 5111927
57149E111927k441k892l446m057l979l764m954p679j0444j2362j3819j4905j5210
$$ 5111927 5109486 5106594 5103148 5099091 5095112 5091348 5086394 5078715 5068271 5055909 5042090 5027185 5011975
57136E011975j5228j5985j7068j6947j5284j2962r895n097J015O656J1280J5857
$$ 5011975 4996747 4980762 4963694 4946747 4931463 4918501 4908606 4903509 4904524 4911180 4922460 4938317
57124D938317K0407K3679K5595K7569K9993L1906L3694L7488M4264N2954O3117
$$ 4938317 4958724 4982403 5007998 5035567 5065560 5097466 5131160 5168648 5212912 5265866 5328983
57113E328983P6000R2192J10755J31473J55525J83131K12987K44912K80958L23528
$$ 5328983 5404983 5497175 5607930 5739403 5894928 6078059 6291046 6535958 6816916 7140444
57103G140444L74996M39517N22527O28098P59669R23322J127000J376424J675586
$$ 7140444 7515440 7954957 8477484 9105582 9865251 10788573 11915573 13291997 14967583
57094A4967583K030717K448168K926854L457193M028112M629605N246795N855898
$$ 14967583 16998300 19446468 22373322 25830515 29858627 34488232 39735027 45590925
57086D5590925O424929O911012P260751P431668P421893P261980O958187O449386
$$ 45590925 52015854 58926866 66187617 73619285 81041178 88303158 95261345 101710731
57078A01710731N639271M477224L004314J331411m07609k084877l595044m872284
$$ 101710731 107350002 111827226 114831540 116162951 115755342 113670465 110075421 105203137
57070A05203137n893158o655093p155191p394897p396847p204302o863489o412457
$$ 105203137 99309979 92654886 85499695 78104798 70707951 63503649 56640160 50227703
57062E0227703n884371n312013m726159m153589l616938l131918k703678k329334
$$ 50227703 44343332 39031319 34305160 30151571 26534633 23402715 20699037 18369703
57054A8369703k004937j727681j492660j292174j119866r72802q48883p44849
$$ 18369703 16364766 14637085 13144425 11852251 10732385 9759583 8910700 8165851
57046H165851o57688n85577n26349m76860m34677l98712l67560l38864l11079
$$ 8165851 7508163 6922586 6396237 5919377 5484700 5085988 4718428 4379564 4068485
57037D068485k84464k59656k36497k14839j95148j77513j60991j44591j28147
$$ 4068485 3784021 3524365 3287868 3073029 2877881 2700368 2539377 2394786 2266639
57028B266639j11843r5613p9425o3244m6469k8102p793J3914L6142N6764P0430
$$ 2266639 2154796 2059183 1979758 1916514 1870045 1841943 1834150 1848064 1884206 1940970 2011400
57017B011400O9372M8476J0128l6408q0268j13804j33944j41254j38608j29728
$$ 2011400 2080772 2129248 2139376 2102968 2022700 1908896 1774952 1633698 1495090 1365362
57007A365362j17818j04984r2604q1699p2617o4822n7591n0930m5404m1063l7104
$$ 1365362 1247544 1142560 1049956 968257 895640 830818 773227 722297 676893 635830 598726
56996E98726l2848k8662k5389k3080k0842j7930j4440j0740o803k484K009O367
$$ 598726 565878 537216 511827 488747 467905 449975 435535 424795 417992 415508 417517 423884
56984D23884J0678J5007J8533J9567J6809J0379J638p642j5822k1586k4359k4614
$$ 423884 434562 449569 468102 487669 504478 514857 516495 508853 493031 471445 447086 422472
56972D22472k3391k1315j8366j4730j1313q947p315n293k273J435N512J0087J5050
$$ 422472 399081 377766 359400 344670 333357 324410 317095 311802 309529 310964 316476 326563 341613
56959C41613J9680K3543K7087L0424L1782K8276J8701N168q273j8458k4633k7786
$$ 341613 361293 384836 411923 442347 474129 502405 521106 526274 518001 499543 474910 447124
56947D47124k9091k8965k7299k4164k0111j5816j1625p471l199J117N158Q792
$$ 447124 418033 389068 361769 337605 317494 301678 290053 282582 279383 280500 285658 294450
56935B94450J2597J7583K4141L1405L7962M2737M4616M1690L2216J6771j301j7978
$$ 294450 307047 324630 348771 380176 418138 460875 505491 547181 579397 596168 594867 576889
56923E76889l0632l8207m0747l9540l6841l4336l2049k9168k5467k1425j7553
$$ 576889 546257 508050 467303 427763 390922 356586 324537 295369 269902 248477 230924
56912B30924j4311j2120j0822r551p842o352n732n413m377k718j436q98m81L90
$$ 230924 216613 204493 193671 184120 176278 169926 164194 158781 154404 151686 150250 149352 148871 149261
56898A49261J708L304N056O754Q352J0223J2528J4711J6387J8351K1717K6221
$$ 149261 150969 154273 159329 166083 174435 184658 197186 211897 228284 246635 268352 294573
56886B94573L0360L2988L3683L1645K5622J5552L385q166j7161k2692k4645k3770
$$ 294573 324933 357921 391604 423249 448871 464423 467808 459642 442481 419789 395144 371374
56874C71374k1387j8388j4776j0348n366k88M773J0057J5917K2678L0493L9163
$$ 371374 349987 331599 316823 306475 301109 300821 305594 315651 331568 354246 384739 423902
56862D23902M8341N7816O7164P4983P8736P5472O3066M1648J4550j2570l4541
$$ 423902 472243 530059 597223 672206 750942 826414 889480 931128 945678 933108 898567
56851H98567m9128n6736n8456n5181m8240l9592l0847k2477j4058m880N557J7197
$$ 898567 849439 792703 734247 679066 630826 591234 560387 537910 523852 518972 524529 541726
56839E41726K9557M2538N6781P2725Q9616J05921J19946J28835J27484J10495
$$ 541726 571283 613821 670602 743327 832943 938864 1058810 1187645 1315129 1425624
56829A425624P6620L1076j6770n8007q7350j03705j09000j06289r8294q7053p4277
$$ 1425624 1502244 1533320 1516550 1458543 1371193 1267488 1158488 1052199 953905 866852 792575
56818G92575o1265m8540l6134k4160j2746j514J0307K3300L7667N3222O8908Q2439
$$ 792575 731310 682770 646636 622476 609730 608216 618523 641823 679490 732712 801620 884059
56806H84059R0868R1306Q1040N8408K5157j2412m6201p0799q5037r0166q8165
$$ 884059 974927 1066233 1147273 1205681 1230838 1218426 1172225 1101426 1016389 926223 838058
56795H38058q1603p3097o3952n4139m3872l4124k5392j7067q573j29Q039J6255
$$ 838058 756455 683358 619406 565267 521395 487271 461879 444812 436239 436110 444149 460404
56783D60404K4668L2769L9940M5556M7988M4610L3726J6249m713k5287m1821n1830
$$ 460404 485072 517841 557781 603337 651325 695935 729661 745910 741197 715910 674089 622259
56771F22259n5150n3924n0766m7040m2853l8026l2662k7265k2680j9481j7334
$$ 622259 567109 513185 462419 415379 372526 334500 301838 274573 251893 232412 215078
56760B15078j5437j3535j1978j0754r412p949o898o291n471m243l246k868k622
$$ 215078 199641 186106 174128 163374 153962 146013 139115 132824 127353 123110 119864 116996 114374
56747A14374k043j418j137j095j095j173j190q79m69n17q68p52j25J19l63p92
$$ 114374 112331 110913 109776 108681 107586 106413 105223 104344 103875 103358 102490 101738 101613 101732 101369 100577
56731A00577o55m80o14l94O59J841K348K485K834L077K686K050J905K104J994
$$ 100577 99922 99442 98828 98434 99093 100934 103282 105767 108601 111678 114364 116414 118319 120423 122417
56716A22417J560J249J036N46r4l55m7O04J385K044K158J717J485K170L459M411
$$ 122417 123977 125226 126262 126808 126714 126359 126312 126916 128301 130345 132503 134220 135705 137875 141334 145745
56700A45745M500L855K794J694R90Q24Q91J011J406K126K594K268J332L57l71
$$ 145745 150245 154100 156894 158588 159578 160402 161293 162304 163710 165836 168430 170698 172030 172387 172016
56685A72016p41n33K48J070J405J265R25M34j80o19o07k06L59Q70R99N25k04n42
$$ 172016 171275 170742 170990 172060 173465 174730 175655 176089 175909 175290 174683 174477 174836 175706 176705 177230 177026 176484
56667A76484m02k44j51K95J064J508J408J316J455J220K85o29p84l83M5M92J023
$$ 176484 176082 175838 175687 175982 177046 178554 179962 181278 182733 183953 184238 183609 182825 182442 182487 182979 184002
56650A84002J267J034Q15R90J210J138J184J807K674L127K927K098P41n49q73
$$ 184002 185269 186303 187118 188108 189318 190456 191640 193447 196121 199248 202175 204273 205014 204465 203592
56635B03592k58J00n37j463j851k088k936m170n057n538n969o247o099n740n391
$$ 203592 203334 203434 202897 201434 199583 197495 194559 190389 185332 179794 173825 167578 161479 155739 150348
56620A50348m723l629k863k995l305k755j511n81l35m22p10j319j961k194k097
$$ 150348 145625 141996 139133 136138 132833 130078 128567 127986 127651 127229 126519 125200 123239 121045 118948
56605A18948k017j835j273n53j25k1k5o6M8P50J983K966L267L449L963M214L574
$$ 118948 116931 115096 113823 113270 113145 113124 113099 113033 113081 113831 115814 118780 122047 125496 129459 133673 137247
56588A37247K533J918J635J197Q21J021J557J807J718J532J161O20M97J045J534
$$ 137247 139780 141698 143333 144530 145351 146372 147929 149736 151454 152986 154147 154767 155264 156309 157843
56573A57843J439J496K487L709L946L348L091L593M360N205O406P923R555J1590
$$ 157843 159282 160778 163265 166974 170920 174268 177359 180952 185312 190517 196923 204846 214401 225991
56559B25991J4237J6748J8067J7870J6104J2348O782J184k555m419n559o297o250
$$ 225991 240228 256976 275043 292913 309017 321365 328147 329331 326776 322357 316798 310501 304251
56546C04251n840n937o298o046n453n607o385o410n180l724l009l074l782n060
$$ 304251 298411 292474 286176 280130 274677 269070 262685 256275 251095 247371 244362 241288 237506 232446
56532B32446o160o092m985l909l224k398j449j205j821k330k035j258m98P4J31
$$ 232446 226286 220194 215209 211300 208076 205678 204229 203024 201203 198873 196838 195580 195082 195156 195287
56517A95287o87j969k798l080l513m212m397l751k950k620k602k532k270j629
$$ 195287 194600 192631 189833 186753 183240 179028 174631 170880 167930 165310 162708 160176 157906 156277
56503A56277m73P85J546J861K183K476K395K129K110K179K045K138K921L693L424
$$ 156277 155804 156589 158135 159996 162179 164655 167050 169179 171289 173468 175513 177651 180572 184265 187689
56488A87689K422J797J585R47L5p0O74J058N75j8k88o96j259j247o83n61j117
$$ 187689 190111 191908 193493 194440 194475 194405 195079 196137 196712 196694 196406 195710 194451 193204 192521 191960 190843
56471A90843j324p29k86o22q83j98Q29J032K66p00j180q97k5O85M53m86r83l54
$$ 190843 189519 188790 188504 187882 186999 186801 187630 188662 188928 188228 187048 186151 186126 186811 187264 186778 185795 185441
56453A85441R67K170K726K397J424P52J154K199K845K855K679K329J589R29Q57
$$ 185441 186408 188578 191304 193701 195125 195877 197031 199230 202075 204930 207609 209938 211527 212456 213313
56438B13313P18l46j578j541n92m88j540k218j784j178r10k45Q38J039jp53j83
$$ 213313 214031 213685 212107 210566 209974 209486 207946 205728 203944 202766 201856 201611 202449 203488 203487 202734 202551
56421B02551O91O89K63K28K86N0J41J005J751J440M84k56o98r25m96O44J506J379
$$ 202551 203242 203931 204194 204422 204708 204758 204899 205904 207655 209095 209579 209323 208625 207700 207204 207848 209354 210733
56403B10733Q35O04M39j0k51J27O00O55O84J023J120N34j23j29L27P95J324J839
$$ 210733 211568 212172 212611 212601 212350 212477 213077 213732 214416 215439 216559 217093 216970 216841 217168 217963 219287 221126
56385B21126J756R84L46K96K67j7J53J050J648J250P66J250K207K612K563K674
$$ 221126 222882 223866 224212 224508 224775 224758 224911 225961 227609 228859 229625 230875 233082 235694 238257 240931
56369B40931K635J732K97o50p85n68l21l5K22M16O63Q15N14%Q9R46J732J911J929
$$ 240931 243566 245298 245595 244945 244160 243592 243271 243236 243458 243874 244537 245352 245866 245866 245955 246901 248633 250544 252473
56350B52473K176K277K007J805J864J737J405J552K180K202J139pl13j26J17R14
$$ 252473 254649 256926 258933 260738 262602 264339 265744 267296 269476 271678 272817 272810 272497 272371 272488 273402
56334B73402K528M005M408M058L604K944J984J442J875K785L489L928L982L181
$$ 273402 275930 279935 284343 288401 292005 294949 296933 298375 300250 303035 306524 310452 314434 317615
56320C17615J812J056J230J188K59n94m90n1j09l04j05J88M77J474L173M231M039
$$ 317615 319427 320483 321713 322901 323160 322566 322076 322025 321916 321612 321507 321695 322172 323646 326819 331050 335089
56303C35089L906M881O074O587P324R127J0667J0208Q241O340M694K765J347J661
$$ 335089 338995 343876 349950 356537 363861 372988 383655 393863 402104 408444 413138 415903 417250 418911
56289D18911L084L938M009M438N496O412P027P859Q787R233R442J0125J1106J1645
$$ 418911 421995 425933 429942 434380 439876 446288 453315 461174 469961 479194 488636 498761 509867 521512
56275E21512J1755J1985J2318J2524J3110J4640J6537J7772J8328J8901J9781
$$ 521512 533267 545252 557570 570094 583204 597844 614381 632153 650481 669382 689163
56264F89163K1094K3364K6742L0274L3245L6483M1189M7197N3605O0362O7970
$$ 689163 710257 733621 760363 790637 823882 860365 901554 948751 1002356 1062718 1130688
56253A130688P6360Q5257R4950J05523J16121J26174J36349J47053J56937J64224
$$ 1130688 1207048 1292305 1387255 1492778 1608899 1735073 1871422 2018475 2175412 2339636
56243B339636J68676J70841J70315J66154J58207J46642J31009J11086Q7856O2434
$$ 2339636 2508312 2679153 2849468 3015622 3173829 3320471 3451480 3562566 3650422 3712856
56233C712856L5063O400k1393m6354o8440q8238j05167j18467j28700j36539j41352
$$ 3712856 3747919 3754319 3732926 3686572 3618132 3529894 3424727 3306260 3177560 3041021 2899669
56222B899669j42618j41575j39592j36270j30950j24783j19164j13442j06393
$$ 2899669 2757051 2615476 2475884 2339614 2208664 2083881 1964717 1851275 1744882
56213A744882r8818r2293q6435p9937p3398o8472o4750o0174n4311m8814m4731
$$ 1744882 1646064 1553771 1467336 1387399 1314001 1245529 1180779 1120605 1066294 1017480 972749
56202I72749m1489l8435l5428l2011k7820k3664k0694j8837j7350j6194j5394
$$ 972749 931260 892825 857397 825386 797566 773902 753208 734371 717021 700827 685433
56191F85433j4015j1577r413q752q571p349n727n216n316m524l189k809l169k875
$$ 685433 671418 659841 650428 641676 633105 625756 620029 614813 609497 604973 601784 598975 595806 592931
56177E92931k087k063k400j487N87K098K539L029L995M756N269O132P033P214
$$ 592931 590844 588781 586381 584894 585481 587579 590118 593147 597142 601898 607167 613299 620332 627546
56163F27546P194Q097R677J0872J1723J2757J3288J2510J1508J1976J3631J5087
$$ 627546 634740 642837 652514 663386 675109 687866 701154 713664 725172 737148 750779 765866
56151G65866J6356J8291K0593K2803K6135L1679L8025M3504M9574N8822P0650
$$ 765866 782222 800513 821106 843909 870044 901723 939748 983252 1032826 1091648 1162298
56140A162298Q2250R2904J03734J13890J20689J23271J22567J18034J08176R4359
$$ 1162298 1244548 1337452 1441186 1555076 1675765 1799036 1921603 2039637 2147813 2242172
56130B242172Q0641O9537O0976N4998N1803M9088M3069L2782K0523Q068m269j5095
$$ 2242172 2322813 2392350 2453326 2508324 2560127 2609215 2652284 2685066 2705589 2713657 2709388 2694293
56118B694293k2427k7251l3229m2343n3854o7520q4002j01554j15904j24448j27730
$$ 2694293 2671866 2644615 2611386 2569043 2515189 2447669 2363667 2262113 2146209 2021761 1894031
56107A894031j26399j20038j09590r7657q5601p3040o0612n0242m2275l5268k8837
$$ 1894031 1767632 1647594 1538004 1440347 1354746 1281706 1221094 1170852 1128577 1093309 1064472
56096A064472k3869j9919j5567j1296q800p497n142j816K26O34J281K550L054
$$ 1064472 1040603 1020684 1005117 993821 985021 977524 972382 970566 970792 971426 972707 975257 978311
56083I78311L029M166O022O481N845O470Q253Q716P710P777R492J0774J1194J2616
$$ 978311 981340 985506 991528 998009 1003854 1010324 1018577 1027293 1035003 1042780 1052272 1063046 1074240 1086856
56069A086856J5134J6633J6862J7643J8792J8334J6966J7526J9698K0153J8395
$$ 1086856 1101990 1118623 1135485 1153128 1171920 1190254 1207220 1224746 1244444 1264597 1282992
56058A282992J7371J7755J6934J4372J2678J2446J1446R811J0488J3468J5161
$$ 1282992 1300363 1318118 1335052 1349424 1362102 1374548 1385994 1395805 1406293 1419761 1434922
56047A434922J4783J5638J8674K0592K0088K0203K2537K4659K5213K6232K8423
$$ 1434922 1449705 1465343 1484017 1504609 1524697 1544900 1567437 1592096 1617309 1643541 1671964
56036A671964K9518K9091K9821L2368L4218L4949L7001M0135M1093L9980M0685
$$ 1671964 1701482 1730573 1760394 1792762 1826980 1861929 1898930 1939065 1980158 2020138 2060823
56025B060823M3706M5100M3910M3769M5708M6573M6116M8185N3024N6105N6548
$$ 2060823 2104529 2149629 2193539 2237308 2283016 2329589 2375705 2423890 2476914 2533019 2589567
56014B589567N8864O4228O8225O9563P2511P8148Q1840Q2299Q4297Q9538R3760
$$ 2589567 2648431 2712659 2780884 2850447 2922958 3001106 3082946 3165245 3249542 3339080 3432840
56003C432840R5873J00504J08455J14387J17243J22836J32680J40899J45850J53578
$$ 3432840 3528713 3629217 3737672 3852059 3969302 4092138 4224818 4365717 4511567 4665145
55993D665145J65739J75833J81946J91061K05911K20104K31353K46410K67304
$$ 4665145 4830884 5006717 5188663 5379724 5585635 5805739 6037092 6283502 6550806
55984F550806K86592L02293L23098L52245L81322M07170M39017M81148N25272
$$ 6550806 6837398 7139691 7462789 7815034 8196356 8603526 9042543 9523691 10048963
55975A0048963N68339O20383O85845P55746Q27856R14724J021826J139571J267973
$$ 10048963 10617302 11237685 11923530 12679276 13507132 14421856 15443682 16583253 17851226
55966A7851226J425643J622665J851196K116576K448853K869233L379345M001794
$$ 17851226 19276869 20899534 22750730 24867306 27316159 30185392 33564737 37566531
55958C7566531M793559N799467P038462Q561912J0471213J2844740J5715030J9162324
$$ 37566531 42360090 48159557 55198019 63759931 74231144 87075884 102790914 121953238
55950A21953238K3329679K8228883L3560627L8754565M2985164M4908606M2578299
$$ 121953238 145282917 173511800 207072427 245826992 288812156 333720762 376299061
55943C76299061L4285096K0060035K404563j4749051k8079559l6210221l9556899
$$ 376299061 410584157 430644192 433048755 418299704 390220145 354009924 314453025
55936C14453025l9370019l6959044l3384950k9391112k5418331k1697351j8354084
$$ 314453025 275083006 238123962 204739012 175347900 149929569 128232218 109878134
55929A09878134j5445341j2960261j0855261r093942p641071o444375n451640
$$ 109878134 94432793 81472532 70617271 61523329 53882258 47437883 41986243
55922D1986243m632541l964535l413617k947904k555242k229914j955489j716071
$$ 41986243 37353702 33389167 29975550 27027646 24472404 22242490 20287001 18570930
55914A8570930j510575j340648j196582j068418r58553q69994p93758p20561o54029
$$ 18570930 17060355 15719707 14523125 13454707 12496154 11626160 10832402 10111841 9457812
55905I457812o00208n54169n08645m66038m30566l97713l62481l29503l04407
$$ 9457812 8857604 8303435 7794790 7328752 6898186 6500473 6137992 5808489 5504082
55896E504082k83152k59875k37638k21621k08854j94162j79506j68639j58850
$$ 5504082 5220930 4961055 4723417 4501796 4292942 4098780 3919274 3750635 3591785
55887C591785j46571j34871j27243j20096j09273r8049r0874q5085p6497o7507
$$ 3591785 3445214 3310343 3183100 3063004 2953731 2855682 2764808 2679723 2603226 2535719
55877B535719o1954n7482n0729m5057m5470n0211n4548n8491o3855o7971o7404
$$ 2535719 2473765 2416283 2365554 2320497 2275027 2224816 2170268 2111777 2047922 1979951 1912547
55866A912547o4249o2230o0108n5030m8733m4500m1417l7377l4182l4087l4831
$$ 1912547 1848298 1786068 1725960 1670930 1622197 1577697 1536280 1498903 1464721 1430634 1395803
55855A395803l3496l1760l2040l2220k9674k6779k6818k7931k6796k4947k5658
$$ 1395803 1362307 1330547 1298507 1266287 1236613 1209834 1183016 1155085 1128289 1103342 1077684
55844A077684k7586k7261k5207k4098k3380k0992j8132j7201j7250j6168j4997
$$ 1077684 1050098 1022837 997630 973532 950152 929160 911028 893827 876577 860409 845412
55833H45412j5469j5816j3731j1057j0750j1646j0879r124q683q733p350n994
$$ 845412 829943 814127 800396 789339 778589 766943 756064 746940 738257 729524 722174 716180
55821G16180p172r521r982r034r170r985r335p737p095o705m831k645k248k389
$$ 716180 709008 699487 689505 680471 671301 661316 651981 644244 637149 630444 625613 622968 620720 618331
55807F18331n17K471L964M583O914J0510J2621J2922J3248J3490J1914Q819N915
$$ 618331 617814 620285 624249 628832 635746 646256 658877 671799 685047 698537 710451 719270 725185
55794G25185K849j869p193j0607j2200j4057j6246j6936j5949j4721j3308j0729
$$ 725185 728034 726165 718972 708365 696165 682108 665862 648926 632977 618256 604948 594219
55782E94219p732o060n529m776m081m427m662k767Q37M314P924J3375K0350K6625
$$ 594219 586487 580427 574898 570122 566041 561614 556952 554185 555022 559336 567260 580635 600985 627610
55768F27610L0843L2361K9339K0374P477n391j6178k4692k9982l1021k9150k6777
$$ 627610 658453 690814 720153 740527 748004 742613 726435 701743 671761 640740 611590 584813
55756E84813k4285k0914j7718j6497j6674j6261j5230j4964j5209j4622j3516
$$ 584813 560528 539614 521896 505399 488725 472464 457234 442270 427061 412439 398923
55745C98923j2992j2212r743o723n427n303l885j097P71J054J204J496N38j732
$$ 398923 385931 373719 363976 357253 351826 346523 342638 341541 342312 343366 344570 346066 346604 344872
55731C44872l671m649n464o146n977n503n797o094m961l341l417m760m808k995
$$ 344872 341201 336552 331088 324942 318965 313462 307665 301571 296610 293269 289852 285092 280284 277289
55717B77289j239l84P04K323L365L933N496Q068R919J0412J0450R883P420L423
$$ 277289 276050 275666 276370 278693 282058 285991 291487 299555 309474 319886 330336 340219 347639 351062
55703C51062p0k557n492q974j0919j0377r029q512q547q418q087p177n098k794
$$ 351062 350992 348435 342943 333969 323050 312673 303644 295132 286585 278167 270080 262903 257805 255011
55689B55011k109k879k903j331K92J004J935L865N585N955N718N975O454O302
$$ 255011 252902 250023 247120 245789 246081 247085 249020 252885 258470 264425 270143 276118 282572 288874
55675B88874N339L731J623l58j385j597j813k128k066j915k317k706j987o13m6
$$ 288874 294213 297944 299567 299209 297824 296227 294414 292286 290220 288305 285988 283282 281295 280682 280636
55660B80636j98M35K017L020K881K795L462M077M135M175M192L266J346m48j798
$$ 280636 280438 280873 282890 285910 288791 291586 295048 299125 303260 307435 311627 314893 316239 315791 313993
55645C13993l560n599o405n593m856n415o332o354n834n734o081o444o790p011
$$ 313993 310433 304834 298429 292836 287980 282565 276233 269879 264045 258311 252230 245786 238996 231985
55631B31985o602n480m285l407k672k175k319k850k967k595k378k402k176j810
$$ 231985 225383 219903 215618 212211 209539 207364 205045 202195 199228 196633 194255 191853 189677 187867
55617A87867j850k030j638j062j379k400k803k295j917k076j997j410j013r48
$$ 187867 186017 183987 182349 181287 179908 177508 174705 172410 170493 168417 166420 165010 163997 163049
55603A63049n02L28O17J54k67m72j195k411l060k813k449k216j464k84K07l06
$$ 163049 162547 162875 163492 163646 163379 162907 161712 159301 156241 153428 150979 148763 147299 147015 147222 146916
55587A46916q09o72l74j71L14Q56O66KJ30J236K015J797J417J569J902K202K854
$$ 146916 146107 145435 145061 144890 145204 146060 146726 146728 146858 148094 150109 151906 153323 154892 156794 158996 161850
55570A61850L738M127M066M263M515L984L086L099L663K892M87j560k002k002
$$ 161850 165588 169715 173781 178044 182559 186543 189629 192728 196391 199283 199770 198210 196208 194206
55556A94206k818l956m546m720m612l757k437j853k126j876o40J97j61m45N54
$$ 194206 191388 187432 182886 178166 173554 169797 167360 165507 163381 161505 160865 161062 160901 160456 161010
55541A61010K101K989L203L042K196Q54K00O44J027N56k8j68o42j867k760k573
$$ 161010 163111 166100 169303 172345 174541 175395 175595 176239 177266 177822 177794 177626 176984 175117 172357 169784
55525A69784k237k603k927k462j993k364k906k824k680l097l319k574j619j412
$$ 169784 167547 164944 162017 159555 157562 155198 152292 149468 146788 143691 140372 137798 136179 134767
55511A34767j487j128q80j351j711j017l2j2o24p42n08r16j871k265j678p32n2
$$ 134767 133280 132152 131272 129921 128210 127193 127161 127149 126525 125783 125275 124359 122488 120223 118545 117813 117761
55494A17761J82%k52q1L73M04N9K91J258J749J077K10J41N01P67J361K385K716
$$ 117761 117943 117943 117691 117610 117983 118387 118446 118737 119995 121744 122821 123031 123172 123673 124440 125801 128186 130902
55476A30902J705M69J82L73K60L29J043J336J78j521k291k282k353k099q35M27
$$ 130902 132607 133076 133258 133631 133891 134220 135263 136599 136777 135256 132965 130683 128330 126231 125396 125823
55460A25823R9j416k357k275k207k484k290j335k51O24J376J575O87o78j216o11
$$ 125823 125922 124506 122149 119874 117667 115183 112893 111558 111307 111931 113307 114882 115569 114891 113675 113064
55444A13064L25R79J251Q52l47j488j480m48N76J162J596J891J818J653J763J733
$$ 113064 113389 114368 115619 116471 116124 114636 113156 112708 113284 114446 116042 117933 119751 121404 123167 124900
55428A24900J005M4k48n0k89j088j600j335o09J24N66M66M4Q6Q37J372J012N55
$$ 124900 125905 125949 125701 125651 125362 124274 122674 121339 120730 120854 121420 121886 121930 122016 122853 124225 125237 125792
55410A25792J031J912J932J048J94m63j375k173j948r48m53q55j214q27q9M18
$$ 125792 126823 128735 130667 131715 131909 131446 130071 127898 125950 125002 124549 123694 122480 121653 121564 121982
55394A21982O26N97L34J07J93L79L08J07Rj97n42l12Q33J797J302j63r73o37j17
$$ 121982 122608 123205 123539 123646 123839 124218 124526 124633 124642 124445 123903 123591 124424 126221 127523 127360 126387 125750 125633
55375A25633j06l11l88l92k69N7J40m29j088j002m55m50j006j156n11K80O58O35
$$ 125633 125527 125216 124828 124436 124167 124224 124364 123935 122847 121845 121390 120940 119934 118778 118267 118547 119205 119840
55357A19840K17n62j080p21J3K4p82j445j459j183q44k75K81K73j98m65l73k99
$$ 119840 120057 119495 118415 117694 117707 117731 116949 115504 114045 112862 112018 111743 112024 112297 112099 111634 111261 110962
55339A10962j65L83R18N48o10j407j276p43k53L71J061J217O08k73q93r50r4J536
$$ 110962 110797 111180 112098 112646 112036 110629 109353 108610 108357 108728 109789 111006 111614 111341 110448 109498 109404 110940
55321A10940K628J829l57j990k175j711j232k85J199J990J163l81j013k68J007
$$ 110940 113568 115397 115040 113050 110875 109164 107932 107647 108846 110836 111999 111618 110605 110337 111344
55306A11344J816J714P99l08q43n59J70R43J539J663J170N63N00Q25Q40M97L99
$$ 111344 113160 114874 115673 115365 114522 113963 114133 115076 116615 118278 119448 120011 120511 121336 122176 122673 123072
55289A23072O00M34k28o61m59r8L0J19J08o08j979k825k232p76L08N45J69n87
$$ 123072 123672 124106 123878 123217 122758 122660 122690 122809 122917 122309 120330 117505 115273 114497 114805 115350 115519 114932
55271A14932j459j870j488p23j59K50Q01J264J096L23l65m19O0O17R31R37O88
$$ 114932 113473 111603 110115 109392 109233 109483 110284 111548 112644 112967 112602 112183 112243 112860 113791 114728 115416
55254A15416K93m6j28po6n35j018q81j34N83R40J194J321P68m12j104n91K29P7
$$ 115416 115709 115663 115535 115528 115462 114927 113909 113028 112894 113477 114417 115611 116932 117700 117288 116184 115593 115822 115899
55235A15899q88j496j349r63o03j39J13l53j146j309p54l25l76l73pL39M08M54
$$ 115899 115011 113515 112166 111203 110600 110461 110574 110221 109075 107766 107012 106687 106311 105938 105931 106270 106678 107132
55217A07132N74N78N65Q26J090Q05K06J29O28Q56M79J73M05P11N96K67L9j74m01
$$ 107132 107706 108284 108849 109675 110765 111570 111776 111905 112533 113389 113868 114041 114446 115157 115753 116020 116059 115885 115484
55198A15484l22J39N84P40P26N64J13m02n02k06l3j51k61l26o13j008j118j052
$$ 115484 115162 115301 115885 116625 117351 117915 118028 117626 117124 116918 116885 116734 116473 116147 115534 114526 113408 112356
55180A12356j195j227m37R19J672J333N80J5m11n37J51J353J828J068N5j83K15
$$ 112356 111161 109934 109497 110416 112088 113421 114001 114016 113605 113068 113219 114572 116400 117468 117523 117340 117555
55163A17555P30J356K027K091J209N9n64o73n90k77K33M15j9o17r02r74r51n65
$$ 117555 118285 119641 121668 123759 124968 125027 124463 123790 123200 122923 123156 123571 123552 122935 122033 121059 120108 119543
55145A19543J60O04M97M10O80O62k03j321j725j403r82o15pP17J003O20n9m68
$$ 119543 119703 120307 120804 121214 121894 122556 122353 121032 119307 117904 116922 116307 116300 117017 118020 118640 118581 118113
55127A18113k96K81N78M0r31j266n13O57J445J753J768J392N17n73j442j735j144
$$ 118113 117817 118098 118676 118716 117785 116519 116006 116663 118108 119861 121629 123021 123538 122965 121523 119788 118644
55110A18644K70J693K188J887J699J859J661Q36P8j47k41m59l55K11N64L86L63
$$ 118644 118914 120607 122795 124682 126381 128240 129901 130737 130815 130668 130427 129968 129613 129824 130388 130774 131137
55093A31137R80J557J352P47N45P86J035J108Q44l2j129j310k08R96J127N17J16
$$ 131137 132117 133674 135026 135773 136318 137104 138139 139247 140091 140059 138930 137620 137412 138408 139535 140052 140168
55076A40168k5k92m17m4K23m35j669k423k411k084j536n79L71N69P8l12k04J34
$$ 140168 140143 139851 139434 139390 139613 139178 137509 135086 132675 130591 129055 128476 128847 129416 129494 129182 128978 129112
55058A29112N05J021J578J812J506P02l55j084q87j15J4r23j762j419n49m26q75
$$ 129112 129617 130638 132216 134028 135534 136236 135881 134797 133910 133795 133809 132886 131124 129705 129156 128730 127855
55041A27855p16J58O41K73j63o1K30K91K70K28j49q05j018l72N32P67J43p20j053
$$ 127855 127139 127297 127938 128211 128048 127987 128217 128508 128778 129006 128857 128052 127034 126662 127194 127961 128104 127384 126331
55022A26331n61M03J159J394J397J452J274M95n72j187j101p17m20k37j08o2p1
$$ 126331 125770 126173 127332 128726 130123 131575 132849 133344 132772 131585 130484 129767 129347 129110 129002 128940 128869
55005A28869o0l2MJ32L43M83N16O11P99Q72P97P50O33J54m08k63O29J186O82j58
$$ 128869 128809 128777 128781 128913 129256 129739 130255 130866 131665 132537 133334 134084 134717 134871 134463 134200 134829 136015 136697 136539
54985A36539k20M85J177J484J438Q84p8o24j92M10Jj142j600q25K33N82K57k31
$$ 136539 136319 136804 137981 139465 140903 141787 141709 141085 140893 141303 141304 140162 138562 137737 137970 138552 138809 138578
54967A38578o36q66p32j04R32K094K830K589J528O30N32O90K91m60p56m70j85
$$ 138578 137942 137076 136344 136240 137172 139266 142096 144685 146213 146843 147375 148065 148356 147896 147140 146670 146485
54950A46485k04l53o33j127j507j364r46p39o17j28N73R66J039J145J204R60P44
$$ 146485 146281 145928 145295 144168 142661 141297 140351 139612 138995 138867 139440 140406 141445 142590 143794 144754 145498
54933A45498J021J439J337R55J009J357J295J070J656L081M331N117O233P842
$$ 145498 146519 147958 149295 150250 151259 152616 153911 154981 156637 159718 164049 169166 175399 183241
54919A83241Q853Q632P920P393O485M515J944m52k718n078o915p463p015o467
$$ 183241 192094 200726 208646 216039 222524 227039 228983 228531 225813 220735 213820 206357 199342 192875
54905A92875o033n292m296l686l687l770l414k798k448k489k410j688n13K65J72
$$ 192875 186842 181550 177254 173568 169881 166111 162697 159899 157451 154962 152552 150864 150351 150616 150788
54890A50788j86J38J185K126K437K402K452K677L105L849M748N439N943O636P527
$$ 150788 150602 150740 151925 154051 156488 158890 161342 164019 167124 170973 175721 181160 187103 193739 201266
54875B01266Q104Q031P424O300M473K163j7j904l894n915p117p084o555o356o268
$$ 201266 209370 217401 224825 231125 235598 237761 237744 235840 231946 226031 218914 211830 205275 198919 192651
54860A92651n674m743m184m154m203m063l754l089j815k79N92K27r76k132k684
$$ 192651 186977 182234 178050 173896 169693 165630 161876 158787 156972 156693 157285 157512 156536 154404 151720
54845A51720k725k628k527k220j575q76n27m75l22L1K10j8m01o09o09n16l55k06
$$ 151720 148995 146367 143840 141620 140045 139169 138642 138167 137845 137876 138086 138068 137667 137058 136449 135933 135578 135372
54827A35372k69n13n94k70K95P81R64O92k4o81n60L62J124P95l41j023l73J193
$$ 135372 135103 134590 133996 133726 134021 134802 135766 136458 136434 135753 135193 135555 136679 137474 137133 136110 135737 136930
54809A36930K374K220J013m1q4N89J101J123R58O72n7j066j435n61Q96J732J534
$$ 136930 139304 141524 142537 142496 142412 143001 144102 145225 146183 146855 146798 145732 144297 143736 144632 146364 147898
54792A47898Q55K79q2k69j60K67P25R35J014J289J763J951J423L68n48q29m55
$$ 147898 148753 149032 148950 148681 148521 148788 149513 150448 151462 152751 154514 156465 157888 158256 157708 156879 156424
54775A56424M05J557K652L233L265L300L799M608N373O128P063P953Q381Q304
$$ 156424 156829 158386 161038 164271 167536 170836 174635 179243 184616 190744 197807 205760 214141 222445
54761B22445P889O941N091K516l1j986l404m639n952p331q317q279p247o204n955
$$ 222445 230334 237275 242366 244882 244851 242865 239461 234822 228870 221539 213222 204943 197696 191492 185537
54746A85537n980n150l429j975j475j324p07K21P33N50L2l42l97k64j13K47J213
$$ 185537 179557 174407 170978 169003 167528 166204 165497 165718 166451 167001 167033 166691 166294 166030 165917 166164 167377
54729A67377K648L621L536L169L768N322O666P217P495P764P332N760L803K367
$$ 167377 170025 173646 177182 180351 184119 189441 196107 203324 210819 218583 225915 231675 235478 237845
54715B37845J286k22k378m746o864q276q440p309n784m944m938n084m888m446
$$ 237845 239131 238909 236531 231785 224921 216645 208205 200896 195112 190168 185230 180146 175258 170812
54701A70812l906l122j979p86j03j71o20q15n53k35k52m69n68o03p43p72m37j17
$$ 170812 166906 163784 161805 161019 160916 160745 160125 159310 158757 158522 158270 157801 157233 156630 155887 155115 154678 154561
54683A54561m11j161j620j567j427j344j031o68r14j659j810q89Q9O8n11n23J37
$$ 154561 154150 152989 151369 149802 148375 147031 146000 145332 144418 142759 140949 140060 140149 140217 139706 139183 139320
54666A39320O33N48K57K9l05p96j121j081q12m03K53J061J549J419J012R86J454
$$ 139320 139953 140501 140758 140787 140482 139686 138565 137484 136672 136269 136522 137583 139132 140551 141563 142549 144003
54649A44003J723J110m9o67k56M24M87J51K54Q04R34K40o33q90m71J87O26M87
$$ 144003 145726 146836 146787 146120 145864 146288 146775 146926 147180 147984 148918 149158 148525 147635 147164 147351 147977 148464
54631A48464k35r14q20j24K35j91q40r85n27K73J120J549J151J97m97n46k58J54
$$ 148464 148229 147315 146495 146371 146606 146415 145575 144590 144063 144336 145456 147005 148156 148353 147856 147310 147052 147206
54613A47206Q21J502J511O98k49p75j000j002n41J89M19l8l87j49J6n43j340j491
$$ 147206 148027 149529 151040 151738 151489 150714 149714 148712 148171 148360 148779 148741 148354 148205 148221 147678 146338 144847
54595A44847q68P9R96J541J365P75O28R77P72l96j332r73j18j71r70j128j65J024
$$ 144847 143979 144058 145054 146595 147960 148735 149363 150340 151112 150716 149384 148411 148293 148122 147152 146024 145859 146883
54577A46883J560J362P35J1m52o43r36j297j044n8N80J37m14K28J570K005J227
$$ 146883 148443 149805 150540 150551 150099 149456 148520 147223 146179 146121 146701 146838 146424 146652 148222 150227 151454
54560A51454M66N66J098J376J174M26o65j237o04N97J068O73M21P17Q91N33J54
$$ 151454 151920 152486 153584 154960 156134 156560 155895 154658 154054 154651 155719 156392 156813 157530 158421 158954 159108
54543A59108K02M99Q51J293J501R68rm41m3M18K88k53q62j415j627j196n80o07
$$ 159108 159310 159809 160660 161953 163454 164422 164413 163972 163929 164347 164635 164382 163520 162105 160478 159282 158702 158095
54525A58095j203j424j011o96p21l73N53J099P13K63O20J248J229Q29Q29J027
$$ 158095 156892 155468 154457 153761 153040 152667 153220 154319 155032 155295 155915 157163 158392 159221 160050 161077
54509A61077N89m34j089q64j58N19R92J108P50K26NK2k08p16q88l23N21Q41M49
$$ 161077 161666 161232 160143 159279 159121 159640 160632 161740 162490 162716 162721 162743 162535 161819 160931 160608 161129 161970 162419
54490A62419n2J0N65R25O44Q5j36NN1p6O0N80R84Q42M24K40M32Q35J259J405R70
$$ 162419 162367 162377 162942 163867 164511 164596 164460 164465 164516 164440 164500 165080 166064 166906 167330 167570 168002 168837 170096 171501 172471
54469A72471K26M2Q33J810J865R60R9J6M75Q32Q39O54M78L61K13r4n64r53r91
$$ 172471 172697 172739 173572 175382 177247 178207 178306 178322 178797 179629 180468 181122 181600 181961 182174 182080 181516 180563 179572
54450A79572p61o56q71j163j242j260j502j759j408l45O35P57K58q5j13l04p46
$$ 179572 178811 178155 177284 176121 174879 173619 172117 170358 168950 168605 169240 169997 170255 170170 170057 169753 169007
54433A69007r41p89q56j320j473q91k85l90o55nJ504K785L158K803J982Q94J68
$$ 169007 168066 167277 166421 165101 163628 162737 162452 162062 161407 161402 162906 165691 168849 171652 173634 174528 174696
54416A74696M24J219J340L60r73j886k260k042j081J19N34N4j38P75K001K266
$$ 174696 175120 176339 177679 178039 177066 175180 172920 170878 169797 169916 170450 170504 170366 171141 173142 175408
54400A75408J476N85L01O64J485K392K721K044P52l35q04p62l76K27P72R81Q27
$$ 175408 176884 177469 177770 178434 179919 182311 185032 187076 187828 187493 186689 185927 185551 185778 186550 187531 188358
54383A88358M33j08n78o25k03K34L17K72N80J305K075K525K484J974J312J036
$$ 188358 188791 188683 188105 187480 187277 187511 187828 188100 188680 189985 192060 194585 197069 199043 200355 201391
54367B01391J399K093K587K599K046R59l49j315j637j528j181m03Q83K081K317
$$ 201391 202790 204883 207470 210069 212115 213074 212725 211410 209773 208245 207064 206661 207544 209625 211942
54352B11942J345k95j846k826l134l045k960k986k890k595k412k471k341j597
$$ 211942 213287 212992 211146 208320 205186 202141 199181 196195 193305 190710 188298 185827 183486 181889
54338A81889n12K38L99J99j89p20j077q23j07L03l3o27p27k66K03L85N61R28J102
$$ 181889 181377 181615 182014 182213 182024 181304 180227 179404 179297 179600 179567 178940 178213 177947 178150 178535 179096 180024 181126
54319A81126O35j78m92J1O81P64K97j14j27J18M09N81M12k08r79j487j672j651
$$ 181126 181761 181583 181091 181102 181783 182547 182844 182730 182603 182721 183130 183711 184123 183915 182936 181449 179777 178126
54301A78126j239k42Q42J105L35o81j143j000o08k10j3k12n19k22Q91K052K398
$$ 178126 176887 176645 177487 178592 178927 178246 177103 176103 175495 175285 175272 175060 174541 174319 175210 177262 179660
54284A79660J990J584J583J673J348M57n87j089o83J53N26K36K7N30J345J639
$$ 179660 181650 183234 184817 186490 187838 188295 187708 186619 185936 186089 186615 186851 186878 187408 188753 190392
54268A90392J273Q55Q03Q89O92J62l91o65o61n65m16QP88J508J667J376J174J165
$$ 190392 191665 192520 193323 194212 194904 195066 194675 194010 193349 192784 192368 192376 193164 194672 196339 197715 198889 200054
54250B00054R30L94J32M86Q88N83l54j191j459j317j122j077j110r59l97M18R80
$$ 200054 200984 201378 201510 201996 202884 203467 203113 201922 200463 199146 198024 196947 195837 194878 194481 194899 195879
54233A95879R52L93m58j261j432n28R82J908J668R25N61N50L19k94r93j498j571
$$ 195879 196831 197224 196766 195505 194073 193545 194527 196435 198103 199028 199589 200139 200458 200164 199171 197673 196102
54216A96102r84o4J76q45k315k905k390j634j168p09j34Q0k87n80p1J066J957
$$ 196102 195118 195054 195230 194385 192070 189165 186775 185141 183973 183264 183130 183210 182923 182343 182272 183338 185295
54199A85295J966J132q8j093j340o94L21Q76O09j2k93j66k01o86j060o00N35J435
$$ 185295 187261 188393 188305 187212 185872 185178 185499 186375 186984 186972 186679 186513 186312 185626 184566 183966 184501 185936
54181A85936J541J159P84N07K59J83L87O82Q06P16M23p9n30m88N4M65K58l31q27
$$ 185936 187477 188636 189420 189927 190186 190369 190756 191438 192244 192960 193383 193304 192774 192286 192340 192805 193063 192732 191905
54162A91905j139j342j269p80j95K4j86n50q47r29p31n03o76j107j000l4R31R59
$$ 191905 190766 189424 188155 187375 187180 187204 187018 186468 185621 184692 183961 183458 182782 181675 180675 180641 181572 182531
54144A82531L65K08P39J221J132P12L15n3m06n90n79n26l88O7Q50J690K341K654
$$ 182531 182896 183104 183843 185064 186196 186908 187223 187170 186764 186174 185595 185069 184681 184748 185598 187288 189629 192283
54126A92283K480J949J670K105K860L205L163L433M145M558M197L613L552L845
$$ 192283 194763 196712 198382 200487 203347 206552 209715 213148 217293 221851 226048 229661 233213 237058
54112B37058L666K539P21j248k951m112m593m416l730k697j574p90p88j559k419
$$ 237058 240724 243263 243984 242736 239785 235673 231080 226664 222934 220237 218663 217873 217085 215526 213107
54097B13107k473j596p34q94j927k667k352j337l37L85P91O41j13q69r34l28L97
$$ 213107 210634 209038 208304 207410 205483 202816 200464 199127 198790 199175 199966 200607 200494 199625 198691 198363 198760
54080A98760Q68J028Q77N91O14J130J744K097K380K713K560J573N06L89R87J194
$$ 198760 199628 200656 201533 202124 202738 203868 205612 207709 210089 212802 215362 216935 217441 217830 218817 220011
54064B20011P88O51J078J071j42j768k340j487k05L42r9q39j005l94L74P06P86
$$ 220011 220799 221450 222528 223599 223457 221689 219349 217862 217657 217999 217900 217061 216056 215662 216036 216742 217528
54047B17528J135J676J905J886K313L381M299M314L693L360L878N019O087O448
$$ 217528 218663 220339 222244 224130 226443 229824 234123 238437 242130 245490 249368 254387 260474 266922
54033B66922O093N672N685N726N034L761K971L283M098M473M108L257K205J330
$$ 266922 273015 278687 284372 290098 295132 298893 301864 305147 309245 313718 317826 321083 323288 324618
54019C24618J143J785K701L057K446J030o13j792k280k627l413m282m373l795
$$ 324618 325761 327546 330247 333304 335750 336780 336167 334375 332095 329468 326055 321773 317400 313605
54005C13605l737m767n903n938n032m196l788l383k794k345k153j922j493j137
$$ 313605 309868 305101 299198 293260 288228 284032 280244 276861 274067 271722 269569 267647 266154 265017
53991B65017j085j217j236r61m22J53N21P55J222K052K870L325L715M665O306
$$ 265017 263932 262715 261479 260518 260096 260249 260770 261525 262747 264799 267669 270994 274709 279374 285680
53976B85680Q084R290R526Q665O665L557l89m438p549r066r376r441r524q861
$$ 285680 293764 303054 312580 321245 327910 331467 331078 326640 319091 310025 300649 291208 281684 272823
53962B72823o906m446k868k530k501j912r42l01j73j02K90Q51J222J388J697K330
$$ 272823 265917 261471 258603 256073 253572 251660 250718 250417 250244 250142 250432 251283 252505 253893 255590 257920
53946B57920L018L385L424L387L406L496L790M326M662M255L330K743K808K828
$$ 257920 260938 264323 267747 271134 274540 278036 281826 286152 290814 295069 298399 301142 303950 306778
53932C06778K166J248Q52Q80O02m6k48M86J617K419K959L740M732N390N526N562
$$ 306778 308944 310192 311044 311924 312526 312480 312232 312718 314335 316754 319713 323453 328185 333575 339101 344663
53916C44663N773N862N637N650O558P938Q580Q046P254P124P297O807N521M088
$$ 344663 350436 356298 361935 367585 374143 382081 390661 398707 405961 413085 420382 427189 432710 436798
53902D36798K825J538L45l20o48j458k887l951l924l450l638m591n528o031o398
$$ 436798 439623 441161 441506 441186 440538 439080 436193 432242 428318 424868 421230 416639 411111 405080 398682
53887C98682o879p257p271p000o726o592o517o259n701n043m617m408m078l580
$$ 398682 391803 384546 377275 370275 363549 356957 350440 344181 338480 333437 328820 324412 320334 316754
53873C16754l368l686m085l968l412k954k848k910l028l258l504l523l319l187
$$ 316754 313386 309700 305615 301647 298235 295281 292433 289523 286495 283237 279733 276210 272891 269704
53859B69704l270l317l049k521k035j789j651j350q70o09r20j522j675j083k52
$$ 269704 266434 263117 260068 257547 255512 253723 252072 250722 249852 249243 248323 246801 245126 244043 243791
53844B43791J92L13N11P18M28m49j245j245n04K72N25L40J62J92K24M8j83j60
$$ 243791 243983 244296 244807 245525 245953 245504 244259 243014 242510 242782 243307 243647 243809 244001 244225 244273 244090 243930
53826B43930J37M11M24J97j00k56j25J67K72R8Q6O08J320J640J683J941K178J584
$$ 243930 244067 244478 244902 245099 244999 244743 244618 244785 245057 245155 245241 245849 247169 248809 250492 252433 254611 256195
53808B56195K59l93O12K506L770L902L541L350L564M257N290O141O425O430O588
$$ 256195 256454 256061 256673 259179 262949 266851 270392 273742 277306 281563 286853 292994 299419 305849 312437
53793C12437O690O230N314M525M018L503L002K861K970K698J773O23l02j024j724
$$ 312437 319127 325357 330671 335196 339214 342717 345719 348580 351550 354248 356021 356644 356342 355318 353594
53778C53594k483l467m803o067o447n729m621l861l465l190l196l715m371m469
$$ 353594 351111 347644 342841 336774 330327 324598 319977 316116 312651 309461 306265 302550 298179 293710
53764B93710l854l047k518k269k160k190k289k099j408o58o74j662k782l022k374
$$ 293710 289856 286809 284291 282022 279862 277672 275383 273284 271876 271218 270544 268882 266100 263078 260704
53749B60704j755j746j839j239N1J256J756J515P67k04r96j247r96o21l67j71
$$ 260704 258949 257203 255364 254125 254176 255432 257188 258703 259470 259266 258270 257023 256027 255406 255039 254868
53733B54868lk2k68m13o2Q30J887K597K663K220J678J253P92K35K0O35J800K637
$$ 254868 254865 254843 254575 254162 254100 254930 256817 259414 262077 264297 265975 267228 268020 268255 268275 268910 270710 273347
53715B73347K686K324K004J606R11K82L60J187K150K781L199L681M142M286M008
$$ 273347 276033 278357 280361 281967 282878 283160 283520 284707 286857 289638 292837 296518 300660 304946 308954
53700C08954L437K759K159J910K231L080M241N460O358O368N157L240J703J132
$$ 308954 312391 315150 317309 319219 321450 324530 328771 334231 340589 346957 352114 355354 357057 358189
53686C58189J110R83P03M90M6j093k528l113k361j151o25r29j409j670j781j671
$$ 358189 359299 360282 360985 361475 361521 360428 357900 354787 352426 351275 350650 349721 348312 346642 344861 343190
53670C43190j014J24J016R43K9q40r27l58J02Ol17l06O5L65L89K93J64m9j55J09
$$ 343190 342176 342300 343316 344259 344288 343448 342521 342163 342265 342271 341954 341648 341713 342078 342467 342760 342924 342875 342720 342829
53650C42829M60K35n26q68k69M86M06k35l12N21J542K158K594L196L763L972L979
$$ 342829 343289 343524 342998 342130 341861 342347 342753 342518 342206 342727 344269 346427 349021 352217 355980 359952 363931
53633C63931M168M489M447L727K603J630J041O60M40O98J522K193J906J042R60
$$ 363931 368099 372588 377035 380762 383365 384995 386036 386696 387136 387834 389356 391549 393455 394497 395457
53618C95457K213L658L884K956K078J986K419K914L301L505L452L269L128L036
$$ 395457 397670 401328 405212 408168 410246 412232 414651 417565 420866 424371 427823 431092 434220 437256
53604D37256L069L545M357M571L472J840J232J944K599J987M82p07j025q00n50
$$ 437256 440325 443870 448227 452798 456270 458110 459342 461286 463885 465872 466354 465647 464622 463822 463272
53589D63272n84r90j567j898j770j426j305j586k108k508k481k108j877k122k489
$$ 463272 462688 461698 460131 458233 456463 455037 453732 452146 450038 447530 445049 442941 441064 438942 436453
53574D36453k362j729j211j228j593j921k026j850j448j101j045j081q14k86J17
$$ 436453 434091 432362 431151 429923 428330 426409 424383 422533 421085 419984 418939 417858 417044 416758 416875
53559D16875L44O70J003Q95L88J71N91J119J174R04P79Q96J138J572K202K606
$$ 416875 417219 417889 418892 419787 420175 420346 420937 422056 423230 424134 424913 425809 426947 428519 430721 433327
53543D33327K391J822J594K090L041L827M013L730L663M311N312N911O139O858
$$ 433327 435718 437540 439134 441224 444265 448092 452105 455835 459498 463809 469121 475032 481171 488029
53529D88029Q401R850J0220R831R847J0751J1959J2760J3107J3409J3964J4694
$$ 488029 496430 506280 516500 526331 536178 546929 558888 571648 584755 598164 612128 626822
53517F26822J5310J5751J6412J7715J9383K0616K1216K1949K3478K5370K6731
$$ 626822 642132 657883 674295 692010 711393 732009 753225 775174 798652 824022 850753
53506H50753K7403K7874K8243K8006K6976K5743K4979K4634K4048K2752K1048
$$ 850753 878156 906030 934273 962279 989255 1014998 1039977 1064611 1088659 1111411 1132459
53495A132459J9770J9379J9345J8735J7504J6764J7413J8966K0158K0429K0249
$$ 1132459 1152229 1171608 1190953 1209688 1227192 1243956 1261369 1280335 1300493 1320922 1341171
53484A341171K0182K0234K0112J9617J8713J7529J6399J5614J5103J4590J3918
$$ 1341171 1361353 1381587 1401699 1421316 1440029 1457558 1473957 1489571 1504674 1519264 1533182
53473A533182J2944J1276Q629N375K350m7k167m538p203r818j2047j3785j5086
$$ 1533182 1546126 1557402 1566031 1571406 1573756 1573709 1571542 1567004 1559801 1549983 1537936 1524151 1509065
53460A509065j5987j6354j6092j5563j5511j6307j7505j8460j9176j9994k0774
$$ 1509065 1493078 1476724 1460632 1445069 1429558 1413251 1395746 1377286 1358110 1338116 1317342
53449A317342k0989k0605k0176j9942j9488j8557j7602j7105j6782j5971j4454
$$ 1317342 1296353 1275748 1255572 1235630 1216142 1197585 1179983 1162878 1146096 1130125 1115671
53438A115671j2493j0250p649m870k514j161q05p91k80J130L121M999O317P144
$$ 1115671 1103178 1092928 1085279 1080409 1077895 1076734 1075929 1075138 1074858 1075988 1079109 1084108 1090425 1097569
53424A097569P777Q463R317J0338J1398J2438J3699J5529J7851K0140K2030K3648
$$ 1097569 1105346 1113809 1123126 1133464 1144862 1157300 1170999 1186528 1204379 1224519 1246549 1270197
53412A270197K5214K6631K7742K8670K9644L0663L1664L2796L4225L5807L7309
$$ 1270197 1295411 1322042 1349784 1378454 1408098 1438761 1470425 1503221 1537446 1573253 1610562
53401A610562L8831M0666M2870M5273M7793N0360N2639N4284N5480N6714N8039
$$ 1610562 1649393 1690059 1732929 1778202 1825995 1876355 1928994 1983278 2038758 2095472 2153511
53390B153511N9019N9451N9614N9626N9117N7828N6037N4099N1976M9548M6960
$$ 2153511 2212530 2271981 2331595 2391221 2450338 2508166 2564203 2618302 2670278 2719826 2766786
53379B766786M4228M0927L6807L2359K8218K4248J9849J4927R933N097J83m990
$$ 2766786 2811014 2851941 2888748 2921107 2949325 2973573 2993422 3008349 3018282 3023379 3023562 3018572
53367C018572j0493j6586k3432l0500l6935m2502m7405n1322n3594n4563n5553
$$ 3018572 3008079 2991493 2968061 2937561 2900626 2858124 2810719 2759397 2705803 2651240 2595687
53356B595687n7052n7959n7328n5819n4541n3346n1460m9165m7436m6264m4616
$$ 2595687 2538635 2480676 2423348 2367529 2312988 2259642 2208182 2159017 2111581 2065317 2020701
53345B020701m2250m0256l9524l9617l9582l9004l7882l6190l4035l1777k9535
$$ 2020701 1978451 1938195 1898671 1859054 1819472 1780468 1742586 1706396 1672361 1640584 1611049
53334A611049k7017k4151k1399j9120j7095j5090j3428j2506j2128j1859j1773
$$ 1611049 1584032 1559881 1538482 1519362 1502267 1487177 1473749 1461243 1449115 1437256 1425483
53323A425483j2301j3369j4248j4375j3978j3703j3758j3690j3004j1769j0475
$$ 1425483 1413182 1399813 1385565 1371190 1357212 1343509 1329751 1316061 1303057 1291288 1280813
53312A280813r357q212o893n588m396l012j263M68J855L360N560P973R444R769
$$ 1280813 1271456 1263244 1256351 1250763 1246367 1243355 1242092 1242560 1244415 1247775 1253335 1261308 1270752 1280521
53298A280521J0158J1764J4448J7264J9526K1067K2101K3214K4964K7015K8201
$$ 1280521 1290679 1302443 1316891 1334155 1353681 1374748 1396849 1420063 1445027 1472042 1500243
53287A500243K7906K6909K6316K6111K5362K3531K0957J8229J5633J3198J0739
$$ 1500243 1528149 1555058 1581374 1607485 1632847 1656378 1677335 1695564 1711197 1724395 1735134
53276A735134P944M752J575j289m169p547j1151j4191j6420j8407k0601k2669
$$ 1735134 1743078 1747830 1749405 1748116 1743947 1736400 1725249 1711058 1694638 1676231 1655630 1632961
53264A632961k4086k4948k5854k7120k8515k9676l0443l0734l0415k9561k8740
$$ 1632961 1608875 1583927 1558073 1530953 1502438 1472762 1442319 1411585 1381170 1351609 1322869
53253A322869k8631k9236k9749k9444k8463k7501k6925k6559k6169k5709k5147
$$ 1322869 1294238 1265002 1235253 1205809 1177346 1149845 1122920 1096361 1070192 1044483 1019336
53242A019336k4477k3884k3510k3029k1905k0109j8181j6585j5394j4617j4253
$$ 1019336 994859 970975 947465 924436 902531 882422 864241 847656 832262 817645 803392
53231H03392j3907j2914j1083q913o985n643n308o344q285r916j0559j0748j1236
$$ 803392 789485 776571 765488 756575 749590 743947 738639 732295 724010 714094 703535 692787 681551
53218F81551j1984j2634j3352j4476j5641j6058j5472j4313j3052j1866j0812
$$ 681551 669567 656933 643581 629105 613464 597406 581934 567621 554569 542703 531891
53207E31891r895r098q593q625q984r010q492q065q276q721q694q276q073q201
$$ 531891 521996 512898 504305 495680 486696 477686 469194 461129 452853 444132 435438 427162 419089 410888
53193D10888q226p894p343o710o155o006o330o534o045n186m702m640m404l834
$$ 410888 402662 394768 387425 380715 374560 368554 362224 355690 349645 344459 339757 335117 330713 326879
53179C26879l404l307l137k635k137j947j813j271l25M99N78k27j321j892j803
$$ 326879 323475 320168 317031 314396 312259 310312 308499 307228 306903 307402 307980 307753 306432 304540 302737
53164C02737j683j810j536l46J009J315N20l42o86q65j125j144q37p57j206j653
$$ 302737 301054 299244 297708 297362 298371 299686 300206 299864 299178 298313 297188 296044 295207 294450 293244 291591
53148B91591j495q83m05l06m13m52k22K51N96M29j17n24n66l73R8J022K009K187
$$ 291591 290096 289213 288808 288502 288089 287637 287415 287666 288262 288691 288574 288050 287484 287111 287209 288231 290240 292427
53130B92427J377N53O01J085Q46l34j280p38J185L101L795L379K899K961L147
$$ 292427 293804 294357 294958 296043 296889 296555 295275 294537 295722 298823 302618 305997 308896 311857 315004
53115C15004K887K355K096K185K239K043J613R01k8p34r67j197j944k822k997
$$ 315004 317891 320246 322342 324527 326766 328809 330422 331323 331295 330561 329594 328397 326453 323631 320634
53100C20634k415j756j350j048j065j803k802l002k328j887k231k519k000j212
$$ 320634 318219 316463 315113 314065 313000 311197 308395 305393 303065 301178 298947 296428 294428 293216
53086B93216j006j251j369j384j549j532r09m0L67K66R4m2l20o02o18n15o19q66
$$ 293216 292210 290959 289590 288206 286657 285125 284216 284176 284543 284809 284903 284861 284541 283939 283321 282806 282187 281321
53068B81321j070j403j967k258j806j153j225j866j895p62O48J178P45J55P9N92
$$ 281321 280251 278848 276881 274623 272817 271664 270439 268573 266678 265916 266564 267742 268487 268642 268721 269313
53052B69313J339J844J805J377J052J108J260J004K58n00p91p28q13j120j018
$$ 269313 270652 272496 274301 275678 276730 277838 279098 280102 280360 279860 279069 278341 277528 276408 275390
53037B75390n4J090J205J91o32j52J147J893J459L19q17j550j646j026n4O93R75
$$ 275390 275336 276426 277631 277822 277190 277038 278185 280078 281537 281856 281039 279489 277843 276817 276763 277456 278431
53020B78431J035J072J017Q04N79N18O25P58Q06P52O78O12M29O2k11j6N19Q03
$$ 278431 279466 280538 281555 282359 282938 283456 284081 284839 285645 286397 287075 287687 288116 288178 287967 287951 288470 289273
53002B89273O22M82Q17J259J210P53N32Q22J249J372J200J099J407K096K592K238
$$ 289273 289895 290377 291194 292453 293663 294416 294948 295770 297019 298391 299591 300690 302097 304193 306785 309023
52986C09023J090j4m71n21n30j88Q26J824J744O91j07J1M08L29nj3K43L51L50
$$ 309023 310113 310099 309628 309107 308577 308389 309215 311039 312783 313474 313367 313378 313786 314115 314110 314097 314340 314691 315041
52967C15041O10J076J318J236J164J250J203Q41M98N97J007J097N01m36j030r53
$$ 315041 315651 316727 318045 319281 320445 321695 322898 323739 324237 324834 325841 326938 327439 327003 325973 325020
52951C25020n28l46p23j519k323k769k739k360j798j124m28L6K9l38o86q47r64
$$ 325020 324492 324146 323423 321904 319581 316812 314073 311713 309915 308791 308363 308399 308428 308090 307404 306557 305593
52934C05593j059q36j36O29Q44M04k41o34o74m76j94M2K09M37Q24J152J041M50
$$ 305593 304534 303698 303562 304191 305035 305439 305198 304564 303890 303414 303220 303262 303471 303908 304732 305884 306925 307375
52916C07375j78l66j54Lk36p72j302j688j928j837j122O7R33P22m09j494j684
$$ 307375 307197 306831 306677 306680 306444 305672 304370 302682 300754 298917 297795 297862 298795 299517 299108 297614 295930
52899B95930q81L99J474J835J447Q34N89P39Q68P74O24M65O0o27j194j274r40
$$ 295930 295049 295448 296922 298757 300204 301038 301627 302366 303234 304008 304632 305097 305157 304530 303336 302062 301122
52882C01122m55N7N15Q27J013J176J239J087J014J457K259K743K729K772L107
$$ 301122 300667 300724 301239 302066 303079 304255 305494 306581 307595 309052 311311 314054 316783 319555 322662
52867C22662L114K305J191N01J42l37p84p92o36j004j892k604k767k616k388k123
$$ 322662 325776 328081 329272 329773 329915 329578 328794 328002 327366 326362 324470 321866 319099 316483 314095 311972
52851C11972k102k684l594l993l510k644k081k004k230k497k473j960j290j058
$$ 311972 309870 307186 303592 299599 296089 293445 291364 289360 287130 284633 282160 280200 278910 277852
52837B77852j315j384p46K94J054J276J183J001P39M16K04L21P61J205J227O90
$$ 277852 276537 275153 274407 274701 275755 277031 278214 279215 279954 280370 280574 280895 281656 282861 284088 284778
52821B84778j18p79j069j023q62q93j185j301p04M25J233J288J122J318J614J450
$$ 284778 284660 283881 282812 281789 280927 280034 278849 277548 276844 277269 278502 279790 280912 282230 283844 285294
52805B85294R57O28L72k81j242j872j980k016k194k070j288j52P05Q67K86o83
$$ 285294 286251 286879 287251 286970 285728 283856 281876 279860 277666 275596 274308 274156 274861 275728 276014 275331
52789B75331j375j379j065j057j292j105k76O41J168J445J728J878J694J306R36
$$ 275331 273956 272577 271512 270455 269163 268058 267782 268423 269591 271036 272764 274642 276336 277642 278578
52774B78578N95J86l22r70j695k102j737p05L05P49O06Q8n75r96p68J8Q16J304
$$ 278578 279173 279359 279037 278067 276372 274270 272533 271828 272133 272882 273488 273576 273001 272005 271237 271255 272071 273375
52756B73375J650J971K018J611R96N19K42Q5j8j54l54l28K60J196J837J979K086
$$ 273375 275025 276996 279014 280625 281621 282140 282382 282467 282449 282295 281941 281613 281873 283069 284906 286885 288971
52739B88971K515K954K940K498J973J536J131O52lp40j100o89J94P79Q19Q21J105
$$ 288971 291486 294440 297380 299878 301851 303387 304518 305170 305167 304427 303327 302638 302832 303611 304430 305251 306356
52722C06356J258Q60J48m57r71j530j861j639j049n46k38Q9M60O93P26O12L08
$$ 306356 307614 308474 308622 308165 307194 305664 303803 302164 301115 300569 300331 300420 300880 301573 302299 302911 303219
52705C03219k11o50n41K42J212J592R86j55q67o60k8L21M36P74J129P06n88j842
$$ 303219 303008 302358 301817 302059 303271 304863 305849 305694 304827 304167 304139 304460 304896 305670 306799 307505 306917 305075
52687C05075k330k281k117j669o92M27J065J022L94o58j634j746q68R1K98Jj50
$$ 305075 302745 300464 298347 296678 295986 296413 297478 298500 298894 298236 296602 294856 293988 294079 294377 294378 294228
52670B94228j73m38p56o54k84j47k09m4K65K75K00P96K140L250L281K474J689
$$ 294228 294055 293617 292861 292207 291923 291776 291567 291523 291788 292063 292263 293059 295199 298449 301730 304204 305893
52653C05893J407J528J706J654J312R25P72P68N62J0o80j240j560j613j393r93
$$ 305893 307300 308828 310534 312188 313500 314425 315197 315965 316527 316537 315857 314617 313057 311444 310051 309058
52637C09058n41j03K74N32P27R53J063P96L92N84J608K633K699J854Q33p0j052
$$ 309058 308517 308414 308688 309220 309947 310900 311963 312759 313151 313735 315343 317976 320675 322529 323362 323292 322240
52620C22240j951k210j749j167r01p87o27n93p85q45l66N41J303J347N08p43j530
$$ 322240 320289 318079 316330 315163 314262 313475 312848 312255 311470 310625 310259 310800 312103 313450 313958 313215 311685
52603C11685j299m18K36K65L1l2R8K63M66P31Q94P95N11K86L08N82R44J222J399
$$ 311685 310386 309968 310204 310469 310500 310468 310566 310829 311295 312026 312920 313715 314226 314512 314820 315402 316346 317568 318967
52584C18967J458J170L84l56n8J408K812K900J848O80k27j140j794j510n46j59
$$ 318967 320425 321595 321979 321623 321565 322973 325785 328685 330533 331213 330986 329846 328052 326542 325996 325837
52568C25837q25j437r62n5j50j433k620k618j645o90l95o29q62p46l47J46O75
$$ 325837 325012 323575 322613 322558 322408 320975 318355 315737 314092 313402 313007 312378 311516 310770 310423 310569 311244
52551C11244J140J142M47m15o07j67j6n86j114p99m0J74l17p90p68m85k62j45
$$ 311244 312384 313526 313973 313558 312951 312784 312768 312182 311068 310269 310229 310403 310086 309296 308528 308043 307781 307636
52533C07636k13n73q79m02J033K631L478L473L069K449J513N37J59N38R81Q73
$$ 307636 307423 306850 305971 305569 306602 309233 312711 316184 319253 321702 323215 323752 323911 324449 325430 326303
52517C26303N87R89K165L241L494L179K944K998L145L304L466L362K658J474K11
$$ 326303 326890 327879 330044 333285 336779 339958 342902 345900 349045 352349 355815 359177 361835 363309 363520
52502C63520j003k306l557m210l953l159k586k727l401l899l647k900k458k506
$$ 363520 362517 360211 356654 352444 348491 345332 342746 340019 336618 332719 329072 326172 323714 321208
52488C21208k184q34Q04J402P85pk52j97j11K39Q77J300J314J361J595J507R53
$$ 321208 319024 318190 318994 320396 321181 321174 320922 320725 320614 320853 321730 323030 324344 325705 327300 328807 329760
52471C29760P03J299K172K626K947L596M068L691L039L287M368N013M480L159
$$ 329760 330463 331762 333934 336560 339507 343103 347171 350862 353901 357188 361556 366569 371049 374208
52457C74208J456o37k628l493l090k698l442m900n863n870n321m582l688k749
$$ 374208 375664 375027 372399 368906 365816 363118 359676 354776 348913 343043 337722 333140 329452 326703
52443C26703k074j836j919j956j507n21L15J68q22j557j352p01l17q3L63O66K89
$$ 326703 324629 322793 320874 318918 317411 316890 317205 317373 316551 314994 313642 312941 312624 312541 312904 313570 313859
52426C13859l33j72Q96J816J738J014N32O46J078J474J674J671J547J383J232
$$ 313859 313526 313354 314250 316066 317804 318818 319350 319996 321074 322548 324222 325893 327440 328823 330055
52411C30055J209J569K417L481M480N575P054Q657R728J0011R787R147P720N336
$$ 330055 331264 332833 335250 338731 343211 348786 355840 364497 374225 384236 394023 403170 410890 416226
52397D16226K418n11l256n605p103p535p198o405n157l687k757k731k862k163
$$ 416226 418644 418133 414877 409272 402169 394634 387436 381031 375874 372187 369430 366699 363837 361674
52383C61674p93J80K29j40l16k62j14K87J191K582M130N251N429M811M323M626
$$ 361674 360881 361061 361290 361150 360834 360572 360458 360745 361936 364518 368648 373899 379328 384139 388462 393088
52367C93088N132M790L654K759K387J585j85j939k480k030j712j915k062j739
$$ 393088 398220 403010 406664 409423 411810 413395 413210 411271 408791 406761 405049 403134 401072 399333
52353C99333j172o61k38R7L45O78J207J682J832J825J899J803J220O07Q40J940
$$ 399333 398161 397500 397262 397359 397704 398382 399589 401271 403103 404928 406827 408630 409850 410457 411297 413237
52337D13237K926L129L006L366M353N599O892Q264R635J0837J1802J2498J2872
$$ 413237 416163 419292 422298 425664 430017 435616 442508 450772 460407 471244 483046 495544 508416
52324E08416J3141J3844J5215J6639J7102J6252J4733J3417J2655J2403J2772
$$ 508416 521557 535401 550616 567255 584357 600609 615342 628759 641414 653817 666589
52313F66589J4026J5995J7873J8900J9136J9319J9990K1027K1983K2568K2737
$$ 666589 680615 696610 714483 733383 752519 771838 791828 812855 834838 857406 880143
52302H80143K2677K2831K3531K4430K4652K3820K2442K0961J8905J5618J1472
$$ 880143 902820 925651 949182 973612 998264 1022084 1044526 1065487 1084392 1100010 1111482
52291A111482P536M267J284j500l472m314m669n317o199o766o873o808o695o379
$$ 1111482 1119018 1123285 1124569 1123069 1119597 1115283 1110614 1105297 1099098 1092332 1085459 1078651 1071956 1065577
52277A065577n870n443n274n172m750l786k371p74Q26K379L778M836N603O423
$$ 1065577 1059707 1054264 1048990 1043818 1039068 1035282 1032911 1032137 1032963 1035342 1039120 1043956 1049559 1055982
52263A055982P448Q334Q878R672J1383J3591J5161J5860J6669J8179J9650K0217
$$ 1055982 1063430 1071764 1080642 1090314 1101697 1115288 1130449 1146309 1162978 1181157 1200807 1221024
52251A221024K0201K0287K0081J8587J5807J2777J0014P066L735P72j257k905
$$ 1221024 1241225 1261512 1281593 1300180 1315987 1328764 1338778 1345844 1349579 1350351 1349094 1346189
52239A346189m936p038q301q745r481j1277j3598j5359j6165j6401j6448j6307
$$ 1346189 1341253 1334215 1325914 1317169 1307688 1296411 1282813 1267454 1251289 1234888 1218440 1202133
52227A202133j5923j5450j5076j4818j4610j4370j3881j2876j1404r968r021q484
$$ 1202133 1186210 1170760 1155684 1140866 1126256 1111886 1098005 1085129 1073725 1063757 1054736 1046252
52215A046252p928p157o266n258l973k487j223n01j30L19R85J592J823J713J678
$$ 1046252 1038324 1031167 1024901 1019643 1015670 1013183 1011960 1011459 1011329 1011648 1012633 1014225 1016048 1017761 1019439
52200A019439K098K916L733M356N058O118P275P999Q165Q119Q062P747O906N719
$$ 1019439 1021537 1024453 1028186 1032542 1037600 1043718 1050993 1058992 1067157 1075276 1083338 1091085 1097991 1103710
52186A103710M617L854L274K435Q93j402m026o436q376r775j0481j0497j0261
$$ 1103710 1108327 1112181 1115455 1117890 1118783 1117381 1113355 1106919 1098543 1088768 1078287 1067790 1057529
52173A057529j0191r958q827o811m926l973l608k922j588k3J308K376L440M640
$$ 1057529 1047338 1037380 1028553 1021742 1016816 1012843 1009235 1006313 1004725 1004702 1006010 1008386 1011826 1016466
52159A016466N712O074N422M166K970J941P40n08j112q36l39k20k06K61J111J871
$$ 1016466 1022178 1028252 1033674 1037840 1040810 1042751 1043491 1042983 1041871 1041035 1040696 1040476 1040270 1040531 1041642 1043513
52143A043513K371K721K895K801K524K069J271L20n6N02J373J885K423L806N968
$$ 1043513 1045884 1048605 1051500 1054301 1056825 1058894 1060165 1060485 1060429 1060931 1062304 1064189 1066612 1070418 1076386
52128A076386Q115J0033J2244J4926J7587J9894K1980K3741K4704K4953K5357
$$ 1076386 1084501 1094534 1106778 1121704 1139291 1159185 1181165 1204906 1229610 1254563 1279920
52117A279920K6403K7419K7488K6672K5789K5353K5168K4693K3457K1363J8887
$$ 1279920 1306323 1333742 1361230 1387902 1413691 1439044 1464212 1488905 1512362 1533725 1552612
52106A552612J6836J5593J4902J4572J4907J5997J6925J6446J4396J1897R969
$$ 1552612 1569448 1585041 1599943 1614515 1629422 1645419 1662344 1678790 1693186 1705083 1715052
52095A715052Q439O449L578O5l879q352j3199j7600k0683k2411k3444k4136k4080
$$ 1715052 1723491 1729940 1733518 1733583 1729704 1721352 1708153 1690553 1669870 1647459 1624015 1599879 1575799
52082A575799k2849k0824j8894j7562j6648j5743j4614j3271j1923j0777r614
$$ 1575799 1552950 1532126 1513232 1495670 1479022 1463279 1448665 1435394 1423471 1412694 1403080
52071A403080p787m988j885N43K152L696N748Q049J0027J1376J2109J2525J3316
$$ 1403080 1395293 1390305 1388420 1388963 1391115 1394811 1400559 1408608 1418635 1430011 1442120 1454645 1467961
52058A467961J5099J7541J9418J9934J9600J9356J9252J8529J6796J4441J1955
$$ 1467961 1483060 1500601 1520019 1539953 1559553 1578909 1598161 1616690 1633486 1647927 1659882
52047A659882R319O304L002k31l205o083r112j2220j4895j6553j7066j6862j6504
$$ 1659882 1669201 1675505 1678507 1678276 1675071 1668988 1659876 1647656 1632761 1616208 1599142 1582280 1565776
52034A565776j6241j6003j5674j5301j5109j5380j6102j6842j7130j7101j7413
$$ 1565776 1549535 1533532 1517858 1502557 1487448 1472068 1455966 1439124 1421994 1404893 1387480
52023A387480j8351j9240j9142j7933j6372j5146j4233j3253j2106j1071j0457
$$ 1387480 1369129 1349889 1330747 1312814 1296442 1281296 1267063 1253810 1241704 1230633 1220176
52012A220176j0364j0627j0853j0635r997r565j0059j1608j3669j5622j7189j8246
$$ 1220176 1209812 1199185 1188332 1177697 1167700 1158135 1148076 1136468 1122799 1107177 1089988 1071742
52000A071742j8605j8249j7504j6644j5508j3896j2187j1031j0470r958r442r728
$$ 1071742 1053137 1034888 1017384 1000740 985232 971336 959149 948118 937648 927690 918248 908520
51988I08520j1317j3375j4585j4768j4971j5937j7162j7672j7238j6468j5972
$$ 908520 897203 883828 869243 854475 839504 823567 806405 788733 771495 755027 739055
51977G39055j5822j5712j5373j4674j3557j2032j0320q766p369n558k758P84M127
$$ 739055 723233 707521 692148 677474 663917 651885 641565 632799 625430 619872 617114 617898 622025
51964F22025O651Q486R826J0397R990Q941P596N719L113M51j237j794j916k012
$$ 622025 628676 637162 646988 657385 667375 676316 683912 689631 692744 693195 691958 690164 688248 686236
51950F86236j764p46J163M025P792J1992J6071K0054K4085K7344K8296K6282K2098
$$ 686236 684472 683726 684889 688914 696706 708698 724769 744823 768908 796252 824548 850830 872928
51937H72928J6790J0741M387j065m478n967o731q044j0543j3996j7259j9085j9448
$$ 872928 889718 900459 904846 903781 899303 893336 886605 878561 868018 854022 836763 817678 798230
51924G98230j9588k0425k1497k2004k2066k2148k1880k0483j8144j5900j4289
$$ 798230 778642 758217 736720 714716 692650 670502 648622 628139 609995 594095 579806
51913E79806j2900j1270r479p705n909m029k060R1K418M519O000P021P936Q531
$$ 579806 566906 555636 546157 538452 532543 528514 526454 526545 528963 533482 539482 546503 554439 562970
51899E62970Q241P047N404L350M28l321o990r769j1618j2759j3156j2820j2060
$$ 562970 571211 578258 583662 587012 587440 584119 577129 567360 555742 542983 529827 517007 504947
51886E04947j0963r132o402l502j373p9J152K850M754O319P430Q419R573J0710
$$ 504947 493984 484852 478450 474948 473575 473496 474648 477498 482252 488571 496001 504420 513993 524703
51872E24703J1270J0828R483P677N687L490J159r39k455l417m087m562m659m156
$$ 524703 535973 546801 556284 563961 569648 573138 574297 573358 570903 567486 563399 558837 554178 550022
51858E50022l007j345O02K503L932M507M214L497K770J840K02k029m022n347o610
$$ 550022 547015 545670 546272 548775 552707 557214 561428 564925 567695 569535 569737 567708 563686 558339 551729
51843E51729q454j0352j1217j0907j0234r561q400o628n074m386m072l291j940
$$ 551729 543275 532923 521706 510799 500565 491004 482604 475976 470902 466516 462444 459153 457213
51830D57213m09J173K627L190K291O82j51K57Q81O75k71j258j910k154j835r93
$$ 457213 456804 457977 460604 463794 466085 466767 466616 466873 467754 468429 468158 466900 464990 462836 461001 460008
51814D60008k22j54o12p55j19Q20J229Q13Ln35m80m2K65J49j21J5P62J701K324
$$ 460008 459786 459632 459020 458265 458146 458966 460195 461008 461011 460476 459996 459954 460219 460368 460247 460262 461024 462725 465049
51795D65049K585K674K447J579K38q28j140j013r74j003p78l55j32k48n19q91
$$ 465049 467634 470308 472755 474334 474572 473744 472604 471591 470617 469614 468836 468481 468349 468101 467582 466691
51779D66691j431j877j716q69J69J017J826K816L846M705N502O426P452Q470R434
$$ 466691 465260 463383 461667 460798 460967 461984 463810 466626 470472 475177 480679 487105 494557 503027 512461
51764E12461J0134J0087Q972O989M528J778j077l605n416o577p447q221q912r499
$$ 512461 522595 532682 541654 548643 553171 554949 553872 550267 544851 538274 530827 522606 513694 504195
51750E04195r814r532q633p601o853o192n239m092l098k199j065L32J717L055
$$ 504195 494381 484849 476216 468615 461762 455570 450331 446239 443141 440942 439877 440209 441926 444981
51736D44981M492N921P092Q042Q812Q913P752N630L557K001O20o21r14L30K563
$$ 444981 449473 455394 462486 470528 479340 488253 496005 501635 505192 507193 507813 507192 506278 506608 509171
51721E09171M622N689N386L592P37k183m420n879o450n600l359j112m52j435k765
$$ 509171 513793 519482 524868 528460 529197 527014 522594 516715 510265 504665 501306 500194 499742 498307 495542
51706D95542l432l393k800j560J41J699K716L218L119K127M34j160k121k653l005
$$ 495542 492110 488717 485917 484357 484498 486197 488913 492131 495250 497377 497811 496651 494530 491877 488872
51691D88872k865j942p03jk28j152k298l143l216k512j637j133q33k40O58J369
$$ 488872 486007 484065 483362 483361 483133 481981 479683 476540 473324 470812 469175 468042 467209 466969 467627 468996
51675D68996J571J345Q14N0o59q80n12J84J106K484M478O933R601J2184J3957
$$ 468996 470567 471912 472726 472776 472117 471237 470725 470909 472015 474499 478977 485910 495511 507695 521652
51660E21652J3887J1561P731L575l46l933o684p723o766m508j764J265M567P659
$$ 521652 535539 547100 554831 558406 558060 554127 547443 539720 532954 528446 526682 527947 532514 540173
51646E40173R760J0393R408O761K798j445m922p553r999j2391j3965j4193j3553
$$ 540173 549933 560326 569734 576495 579293 577848 572926 565373 555374 542983 529018 514825 501272
51633E01272j2754j1764j0208q316o789n833m993l892k614j450o91o77j445k355
$$ 501272 488518 476754 466546 458230 451441 445608 440615 436723 434109 432659 431968 431291 429846 427491
51619D27491k567k028j446j302j379j395j469j686j777j568j293j120p93j40M97
$$ 427491 424924 422896 421450 420148 418769 417374 415905 414219 412442 410874 409581 408461 407668 407528 408025
51604D08025P07N87M50L44L10P68K073L860N427O650Q064J0053J2343J4204J4757
$$ 408025 408732 409319 409769 410113 410423 411191 413264 417124 422551 429201 437265 447318 459661 473865 488622
51589D88622J3249R593M735P7l494n779o715o260m853l390k338j173R23M004P207
$$ 488622 501871 511464 516199 516276 512782 507003 500288 494028 489175 485785 483447 482274 483197 487201 494408
51574D94408R619J1113J2217J3270J3983J4013J3816J4331J5735J7085J7494J7175
$$ 494408 504027 515140 527357 540627 554610 568623 582439 596770 612505 629590 647084 664259
51562F64259J6958J7326J8482K0817K4400K8375L1683L4218L6289L7125L5113
$$ 664259 681217 698543 717025 737842 762242 790617 822300 856518 892807 929932 965045
51551I65045K9748K2382J4651P103j66o601j1688j5767j9526k3063k6079k8536
$$ 965045 994793 1017175 1031826 1038929 1038763 1032162 1020474 1004707 985181 962118 936039 907503
51539I07503l0537l1851l2271l2065l1539l0425k8399k5907k3695k1761j9539
$$ 907503 876966 845115 812844 780779 749240 718815 690416 664509 640814 619053 599514
51528E99514j7075j5199j4300j3652j2242r861p212n268m685n321o210o348n661
$$ 599514 582439 567240 552940 539288 527046 517185 509973 504705 500020 494699 488489 482141 476480
51515D76480m883m406l821k765j667j161j132r11l22R2j03o07q39p05n98o86n79
$$ 476480 471597 467191 463370 460605 458938 457777 456645 455734 455412 455504 455401 454794 453955 453250 452652 451966 451387
51498D51387J83J407K273K086R95o8j98O87J790K200J787J236J146J315J063P9
$$ 451387 451570 452977 455250 457336 458331 458263 458065 458752 460542 462742 464529 465765 466911 468226 469289 469368
51482D69368j385k967m431n412n479m700l702l012k675k696l341m521n383n091
$$ 469368 467983 465016 460585 455173 449694 444994 441292 438280 435605 432909 429568 425047 419664 414573
51468D14573l880k754k281k198k111j928j592r32n6N41N21P0m25p84r20o46J60
$$ 414573 410693 407939 405658 403460 401349 399421 397829 396897 396841 397382 397903 397973 397548 396764 395844 395198 395358
51451C95358J381K834M448O108P554Q681R728J0948J2205J3224J4075J4986J5641
$$ 395358 396739 399573 404021 410129 417683 426364 436092 447040 459245 472469 486544 501530 517171
51438E17171J5109J2790R201N462K158q75l625n424n804n494n888p519r543j0857
$$ 517171 532280 545070 554271 559733 561891 561016 557391 551967 546163 540669 534781 527262 517719 506862
51424E06862j1186j0880j0198r223q118o980n638m039k635j944j831j704j298
$$ 506862 495676 484796 474598 465375 457257 450277 444639 440600 437965 436021 434190 432486 431188
51411D31188p78j37Q50J973K464J953J101R34J707K824L669M173M580N048N563
$$ 431188 430410 430273 431123 433096 435560 437513 438614 439548 441255 444079 447748 451921 456501 461549 467112
51396D67112N969O005N490M684M311M957O356P588Q119Q499R683J1911J4614J7396
$$ 467112 473081 479086 484576 489260 493571 498528 504884 512472 520591 529090 538773 550684 565298 582694
51382E82694K0528K4283K8354L2376L6585M1359M6333N0576N3580N5370N5503
$$ 582694 603222 627505 655859 688235 724820 766179 812512 863088 916668 972038 1027541
51371A027541N2642M5599L4612K1336P719m874j5821k5067l2909l9641m5155m8913
$$ 1027541 1080183 1125782 1160394 1181730 1189449 1184575 1168754 1143687 1110778 1071137 1025982 977069
51359I77069n0466n0065m8570m6644m4144m0526l5807l0737k6056k1982j8515
$$ 977069 926603 876538 827968 781324 737180 696654 660847 630110 604054 582072 563557
51348E63557j5748j3551j1513r543q147p598p289o562n814n931o830p438p155
$$ 563557 547809 534258 522745 513202 505055 497457 490168 483606 477792 471861 465031 457593 450438
51335D50438o441n779n018m080l472l460l391k527j221n04p54j373j672j534j191
$$ 450438 443997 438218 433200 429120 425648 422188 418797 416270 415049 414545 413791 412418 410746 409212 408021
51320D08021q62o84p19q34p79m08K50J132K160L169L904M159L986L687L552L417
$$ 408021 407159 406475 405756 404922 404143 403735 403985 405117 407277 410446 414350 418509 422495 426182 429734 433151
51304D33151K755J394J7n16k51k3l11q47j435k380l629m250l558k237j543j611
$$ 433151 435906 437300 437317 436801 436550 436527 436216 435369 433934 431554 427925 423675 420117 417880 416337 414726
51288D14726j419l84R16J754K212K664L022L068L161L917N209O057N670M264K738
$$ 414726 413307 412923 413839 415593 417805 420469 423491 426559 429720 433637 438846 444903 450573 454837 457575
51273D57575J725J182O94mq19j351j177j69J344K790L749M086L805K960J767N45
$$ 457575 459300 460482 461176 461172 460353 459002 457825 457656 459000 461790 465539 469625 473430 476390 478157 478702
51257D78702n79j684k646l032k695k230k334k859k956k289j499j332j763k210
$$ 478702 478123 476439 473793 470761 468066 465836 463502 460643 457687 455398 453899 452567 450804 448594
51243D48594k324k183k007k013k369k951l258k906k167j723j830k029j768j092
$$ 448594 446270 444087 442080 440067 437698 434747 431489 428583 426416 424693 422863 420834 419066 417974
51229D17974n78o36j095j503j605j439j064n45j15k5p5K54J042J677J728J634
$$ 417974 417396 416760 415665 414162 412557 411118 410054 409509 409394 409369 409294 409548 410590 412267 413995 415629
51213D15629K008K697L124L290L621M014L965L614L687M244M421L785K984K596
$$ 415629 417637 420334 423458 426748 430369 434383 438348 441962 445649 449893 454314 458099 461083 463679
51199D63679K251J589J204J711K482K324J113k11j052j646k179k331j893j190
$$ 463679 465930 467519 468723 470434 472916 475240 476353 476142 475090 473444 471265 468934 467041 465851
51185D65851o48l95m74r37j626k151k336k326k255k072j761j449j221j019q06
$$ 465851 465203 464808 464334 463397 461771 459620 457284 454958 452703 450631 448870 447421 446200 445181 444375
51170D44375o23n55o71r37j063p35r1L56M98R14J967L090L466L101K619K309K045
$$ 444375 443752 443197 442526 441589 440526 439791 439700 440056 440554 441468 443435 446525 449991 453092 455711 458020 460065
51153D60065J909K103K315J964J132N55N61O67M45N1k92p47j485k284k868l180
$$ 460065 461974 464077 466392 468356 469488 470043 470604 471271 471716 471767 471475 470728 469243 466959 464091 460911
51137D60911l115k446j310k76L20P02J005Q28l2q25n29Q06J991K091J461J245
$$ 460911 457796 455350 454040 453764 454084 454786 455791 456619 456587 455762 455233 456039 458030 460121 461582 462827
51121D62827K046L360M202M079L218K052P94l78j122j186p31q1O37J327J625J272
$$ 462827 464873 468233 472435 476514 479732 481784 482578 482200 481078 479892 479161 479080 479717 481044 482669 483941
51105D83941O28L56O40J138J693K446L296L765L614L097K473J717Q48J64j21n7
$$ 483941 484569 484925 485565 486703 488396 490842 494138 497903 501517 504614 507087 508804 509652 509816 509695 509638
51089E09638K61P34J035Q14K20k45m52o60p84l93L56O23R7m36k50L38P50J180
$$ 509638 509899 510633 511668 512482 512702 512457 512005 511345 510561 510168 510524 511147 511244 510808 510558 510896 511646 512826
51071E12826K040K955L278L319M053N720P555Q949J0156J1725J3873J6508J9385
$$ 512826 514866 517821 521099 524418 528471 534191 541746 550695 560851 572576 586449 602957 622342
51058F22342K2075K4140K5272K4982K2486J7601J1608O461L095J226O43J633L693
$$ 622342 644417 668557 693829 718811 741297 758898 770506 776967 780062 781288 781931 783564 787257
51045G87257M983L990J325j026k029k503l823o385r447j1840j2541j1036p693
$$ 787257 792240 796230 797555 796529 794500 791997 788174 781789 772342 760502 747961 736925 729232
51032G29232l889j442j637m450q565j2113j3732j3267j1519r333o859l807k99
$$ 729232 725343 723901 722264 717814 709249 697136 683404 670137 658618 649285 642426 638619 638320
51019F38320K895N139O683Q166R571J0254J0043R694R780R689Q355N724K880P74
$$ 638320 641215 646354 653037 661203 670774 681028 691071 700765 710545 720234 728589 734313 737193 737967
51005G37967n52j538k458l383m264m770m522l684l001k869k762j919l86J081J990
$$ 737967 737415 735877 733419 730036 725772 721002 716480 712796 709795 706926 704164 702245 701859 702940 704930
50990G04930K537L069L646M253N167O698Q734J0813J2655J4459J6580J9100K1780
$$ 704930 707467 710536 714182 718435 723602 730300 739034 749847 762502 776961 793541 812641 834421
50977H34421K4271K6112K6715K5768K3855K2364K2447K4221K7152L0965L5756
$$ 834421 858692 884804 911519 937287 961142 983506 1005953 1030174 1057326 1088291 1124047
50966A124047M1357M7051N2176N6681O0976O5349O9658P3450P6281P7982P8531
$$ 1124047 1165404 1212455 1264631 1321312 1382288 1447637 1517295 1590745 1667026 1745008 1823539
50955A823539P7658P4831O9834O3250N5903M8018L9361L0175K1312J3270N749
$$ 1823539 1901197 1976028 2045862 2109112 2165015 2213033 2252394 2282569 2303881 2317151 2322900
50944B322900j437p578j1715j3767j4545j4874j5219j5968j7445j9506k1563k3094
$$ 2322900 2321463 2313885 2302170 2288403 2273858 2258984 2243765 2227797 2210352 2190846 2169283 2146189
50932B146189k4024k4667k5522k6959k8811l0500l1910l3830l6996m0920m4365
$$ 2146189 2122165 2097498 2071976 2045017 2016206 1985706 1953796 1919966 1882970 1842050 1797685
50921A797685m6848m8900n0839n2129n2255n1380m9756m7318m4323m1643l9635
$$ 1797685 1750837 1701937 1651098 1598969 1546714 1495334 1445578 1398260 1353937 1312294 1272659
50910A272659l7426l4170l0491k7744k6108k4526k2473k0612j9492j8642j7440
$$ 1272659 1235233 1201063 1170572 1142828 1116720 1092194 1069721 1049109 1029617 1010975 993535
50899I93535j6094j5078j4120j2461r865o949m566l185k704k600k351j862j345
$$ 993535 977441 962363 948243 935782 925917 918968 914402 911217 908513 905913 903562 901700 900355
50886I00355p95M3J110J914K221K442L025L871M716N769P395R409J1190J2473
$$ 900355 899560 899603 900713 902627 904848 907290 910315 914186 918902 924671 932066 941475 952665 965138
50872I65138J3579J4855J6193J7196J7656J7870J8469J9906K1955K4046K6007
$$ 965138 978717 993572 1009765 1026961 1044617 1062487 1080956 1100862 1122817 1146863 1172870
50861A172870K8180L0718L3347L6091L9622M4446N0270N6703O4070P2838Q2662
$$ 1172870 1201050 1231768 1265115 1301206 1340828 1385274 1435544 1492247 1556317 1629155 1711817
50850A711817R2848J03390J14575J25802J35891J44731J53452J62636J71167J77359
$$ 1711817 1804665 1908055 2022630 2148432 2284323 2429054 2582506 2745142 2916309 3093668
50840C093668J80422J80288J76764J69535J58576J43937J25425J03133P8031N1619
$$ 3093668 3274090 3454378 3631142 3800677 3959253 4103190 4228615 4331748 4409779 4461398
50830D461398K5211o9k2934m2255n7604o9020p6365p9325p8004p3120o5641n6607
$$ 4461398 4486609 4486540 4463606 4421351 4363747 4294727 4218362 4139037 4061033 3987913 3922272 3865665
50818C865665m7321l9241l3546l0854l1361l4971m1279m9681n9548p0324q1501
$$ 3865665 3818344 3779103 3745557 3714703 3683342 3648371 3607092 3557411 3497863 3427539 3346038
50807C346038r2677j03472j13271j21156j26357j28742j28716j26684j22781j17020
$$ 3346038 3253361 3149889 3036618 2915462 2789105 2660363 2531647 2404963 2282182 2165162
50797B165162j09479j00419r0375q0185p0669o2131n4260m6559l8938l1843k5787
$$ 2165162 2055683 1955264 1864889 1784704 1714035 1651904 1597644 1551085 1512147 1480304 1454517
50786A454517k0739j6138j1597p502m663l448l443l889m205m153l934m108n042
$$ 1454517 1433778 1417640 1406043 1398541 1393878 1390430 1386987 1383098 1378893 1374740 1370806 1366698 1361656
50773A361656o303p039p120p432q734j0633j2147j3004j3850j5207j6723j7582
$$ 1361656 1355353 1348314 1341194 1333762 1325028 1314395 1302248 1289244 1275394 1260187 1243464 1225882
50761A225882j7385j6449j5343j4324j3281j2090j0824r522p954n878l295k86
$$ 1225882 1208497 1192048 1176705 1162381 1149100 1137010 1126186 1116664 1108710 1102832 1099537 1099251
50749A099251L258P277J1150J4180J6488J8843K1623K4527K7358L0369L3689L7127
$$ 1099251 1102509 1109786 1120936 1135116 1151604 1170447 1192070 1216597 1243955 1274324 1308013 1345140
50737A345140M0849M5484N1094N6806O2023O7247P3050P8810Q3428Q6832Q9813
$$ 1345140 1385989 1431473 1482567 1539373 1601396 1668643 1741693 1820503 1903931 1990763 2080576
50726B080576R2588R4404R4548R2969Q9892Q5472P9874P3026O4288N2902L8899
$$ 2080576 2173164 2267568 2362116 2455085 2544977 2630449 2710323 2783349 2847637 2900539 2939438
50715B939438K3101O265j1167k8441m4127n6595o4666o7990o7257o3850n8767
$$ 2939438 2962539 2968804 2957637 2929196 2885069 2828474 2763808 2695818 2628561 2564711 2505944
50704B505944n1959m3235l3611k4963j8423j3810j0677r198r875j2966j8451k5994
$$ 2505944 2453985 2410750 2377139 2352176 2333753 2319943 2309266 2300068 2290193 2277227 2258776 2232782
50692B232782l4765m3783n2550o0788o7651p1921p3201p2214o9738o5916o0810
$$ 2232782 2198017 2154234 2101684 2040896 1973245 1901324 1828123 1755909 1686171 1620255 1559445
50681A559445n4810m8121m0685l2980k6145k0639j5449r331k395M223R774J4221
$$ 1559445 1504635 1456514 1415829 1382849 1356704 1336065 1320616 1311285 1308890 1313113 1322887 1337108
50669A337108J7601J9933K1632K3200K4434K4593K3472K1773K0256J9018J7811
$$ 1337108 1354709 1374642 1396274 1419474 1443908 1468501 1491973 1513746 1534002 1553020 1570831
50658A570831J6726J6283J6853J8144J9305J9705J9644K0089K1545K3471K5033
$$ 1570831 1587557 1603840 1620693 1638837 1658142 1677847 1697491 1717580 1739125 1762596 1787629
50647A787629K6175K7575K9807L2888L6547M0519M4531M8304N1653N4472N6683
$$ 1787629 1813804 1841379 1871186 1904074 1940621 1981140 2025671 2073975 2125628 2180100 2236783
50636B236783N8290N9325N9603N8736N6538N3270M9348M5142M1226L8388L6837
$$ 2236783 2295073 2354398 2414001 2472737 2529275 2582545 2631893 2677035 2718261 2756649 2793486
50625B793486L5684L3645L0008K4380J5772L112j2912k9085m1334m7234m6943
$$ 2793486 2829170 2862815 2892823 2917203 2932975 2936087 2923175 2894090 2852756 2805522 2758579
50614B758579m2350l5643k8291k0710j2804m929J778O181Q037P742N416O84o611
$$ 2758579 2716229 2680586 2652295 2631585 2618781 2613852 2615630 2621811 2629848 2637590 2643006 2643690 2637079
50601B637079j6009k6875l8754n0937o2072p0837p6960q1081q3614q4345q3217
$$ 2637079 2621070 2594195 2555441 2504504 2442432 2371595 2294635 2213554 2129940 2045595 1962378
50590A962378q0915p8168p4905p0689o5698o0623n5694n0546m5167m0264l6302
$$ 1962378 1881463 1803295 1728390 1657701 1592003 1531380 1475686 1425140 1379973 1339709 1303407
50579A303407l2728k8667k4102j9802j6285j3335j0531p700m698j274K488N891
$$ 1303407 1270679 1242012 1217910 1198108 1181823 1168488 1157957 1150257 1145559 1144285 1146773 1152664
50567A152664Q257R818J1496J3717J5864J7278J8334J9929K2045K3592K3937K3827
$$ 1152664 1160921 1170739 1182235 1195952 1211816 1229094 1247428 1267357 1289402 1312994 1336931 1360758
50555A360758K4378K5694K7109K8354K9698L1151L2341L3183L3895L4264L3656
$$ 1360758 1385136 1410830 1437939 1466293 1495991 1527142 1559483 1592666 1626561 1660825 1694481
50544A694481L2070L0525L0051L0752L2209L4402L7679M2113M7335N2964N8907
$$ 1694481 1726551 1757076 1787127 1817879 1850088 1884490 1922169 1964282 2011617 2064581 2123488
50533B123488O5254P2008P8964Q5826R2571R9542J06984J14678J22318J29977
$$ 2123488 2188742 2260750 2339714 2425540 2518111 2617653 2724637 2839315 2961633 3091610
50523C091610J37621J44338J48748J50240J49171J45792J39687J30421J17947
$$ 3091610 3229231 3373569 3522317 3672557 3821728 3967520 4107207 4237628 4355575
50514D355575J02179Q3024O1214L8273J5131q471l2604n5964p6793r4330j08565
$$ 4355575 4457754 4540778 4601992 4640265 4655396 4646925 4614321 4558357 4481564 4387234 4278669
50503D278669j19077j25125j26451j23137j14969j01854q4652o4840m3531k1598
$$ 4278669 4159592 4034467 3908016 3784879 3669910 3568056 3483404 3418564 3375033 3353435
50493C353435m32J8432L4314M7062N5709N8402N3902M2378K4761K233k3367m9587
$$ 3353435 3353003 3371435 3405749 3452811 3508520 3566922 3620824 3663202 3687963 3690196 3666829 3617242
50481C617242p4319r6296j14574j28323j37490j42883j45178j44409j40840j35502
$$ 3617242 3542923 3446627 3332053 3203730 3066240 2923357 2778179 2633770 2492930 2357428
50471B357428j29226j21655j12132j01241r0648q1451p3316o5394n7426m9749
$$ 2357428 2228202 2106547 1994415 1893174 1802526 1721075 1647759 1582365 1524939 1475190
50461A475190m2667l6300l0835k6425k2734j8874j4175q856l762N28M071P142
$$ 1475190 1432523 1396223 1365388 1338963 1316229 1297355 1283180 1274324 1270562 1271090 1275161 1282303
50449A282303R910J2584J5405J8283K0875K3188K5656K8345L0614L1905L2256
$$ 1282303 1292213 1304797 1320202 1338485 1359360 1382548 1408204 1436549 1467163 1499068 1531324
50438A531324L1431K8378K2430J4626O951N30m465p661q519p554o207n138l733
$$ 1531324 1562755 1591133 1613563 1628189 1635140 1635670 1631205 1623544 1615025 1607471 1601264 1596126 1592393
50425A592393j549P81K579M105N926Q163J0914J4662J9510K4690K9456L4091L9348
$$ 1592393 1590844 1591625 1594204 1598309 1604235 1612398 1623312 1637974 1657484 1682174 1711630 1745721 1785069
50412A785069M5417N1912N8350O4129O8592P1758P4429P6910P8159P6998P3714
$$ 1785069 1830486 1882398 1940748 2004877 2073469 2145227 2219656 2296566 2374725 2451723 2525437
50401B525437O9606O5268O0233N4042M6586L7438K5862J1895l301j8527l3457
$$ 2525437 2595043 2660311 2720544 2774586 2821172 2858610 2884472 2896367 2893066 2874539 2841082
50390B841082m8121o1927p3623q2087q6994q8723q7770q4225p7874o8833n7869
$$ 2841082 2792961 2731034 2657411 2575324 2488330 2399607 2311837 2227612 2149738 2080905 2023036
50379B023036m5949l3687k1462r807O97R757J7272K2870K5836K5455K1454J4230
$$ 2023036 1977087 1943400 1921938 1912131 1912828 1922585 1939857 1962727 1988563 2014018 2035472 2049702
50367B049702M785n766j6663k7248l6386m2910m6707m8663m9126m7530m4202m1587
$$ 2049702 2054487 2048721 2032058 2004810 1968424 1925514 1878807 1830144 1781018 1733488 1689286 1647699
50355A647699m2258m6096n0613n3891n5891n6902n6312n3535m9128m4152l9038
$$ 1647699 1605441 1559345 1508732 1454841 1398950 1342048 1285736 1232201 1183073 1138921 1099883
50344A099883l3767k8620k4006j9869j5838j1869q337n626l811k619j483M3J753
$$ 1099883 1066116 1037496 1013490 993621 977783 965914 957577 951951 948140 945521 944038 944081 945834
50331I45834K951L348L405L579L643L113K098J325J498K891N251P752R323R505
$$ 945834 948785 952133 955538 959117 962760 965873 967971 969296 970794 973685 978936 986688 996011 1005516
50317A005516Q977Q793R177R401Q907Q077P717Q001Q298Q101P811Q384J0259J2882
$$ 1005516 1014493 1023286 1032463 1041864 1050771 1058848 1066565 1074566 1082864 1090965 1098776 1107160 1117419 1130301
50303A130301J5442J7799K0467K3912K8241L3436L9395M5692N1627N6430N8836
$$ 1130301 1145743 1163542 1184009 1207921 1236162 1269598 1308993 1354685 1406312 1462742 1521578
50292A521578N6431M6363K7723L374k0967l9861n0838n4775n4265n1589m7758
$$ 1521578 1578009 1624372 1652095 1655469 1634502 1594641 1543803 1489028 1434763 1383174 1335416
50281A335416m2942l7369l1569k6001k0800j5990j1593p542l723j57L169O513
$$ 1335416 1292474 1255105 1223536 1197535 1176735 1160745 1149152 1141610 1137887 1137730 1140899 1147412
50269A147412J0062J3400J5851J7418J8777K0254K1357K1521K0751J9291J7388
$$ 1147412 1157474 1170874 1186725 1204143 1222920 1243174 1264531 1286052 1306803 1326094 1343482
50258A343482J5635J4829J4922J4865J4051J3149J2708J1732Q784M041j001n644
$$ 1343482 1359117 1373946 1388868 1403733 1417784 1430933 1443641 1455373 1464157 1468198 1467197 1461553
50246A461553j0483j5718k0297k3052k3688k2224j8645j3693r067o014m358l581
$$ 1461553 1451070 1435352 1415055 1392003 1368315 1346091 1327446 1313753 1304686 1298672 1294314 1290733
50234A290733m162o946j1620j6743k1082k4154k5644k5197k3046k0250j8006j6899
$$ 1290733 1286571 1279625 1268005 1251262 1230180 1206026 1180382 1155185 1132139 1111889 1093883 1076984
50222A076984j6716j6717j6113j4713j3124j2065j1574j1157j0584j0081r828
$$ 1076984 1060268 1043551 1027438 1012725 999601 987536 975962 964805 954221 944140 934312
50211I34312r713r596r411q988q170p173o469o188n979n555n022m543m082l635
$$ 934312 924599 915003 905592 896604 888434 881261 874792 868604 862625 857070 852048 847505 843423 839788
50197H39788l477l823m503n088n247m828l926l012k683l018l399l280k941l057
$$ 839788 836311 832488 827985 822897 817650 812822 808896 805884 803201 800183 796784 793504 790563 787506
50183G87506l617l740k683p14J113J896J416M0j568k664k719j790n42K91N33N85
$$ 787506 783889 780149 777466 776752 777865 779761 781177 781217 779649 776985 774266 772476 771934 772225 772758 773343
50167G73343Q40J275J693K094K587L165L844M947O759Q945J0756J2000J3396J5741
$$ 773343 774183 775458 777151 779245 781832 784997 788841 793788 800547 809492 820248 832248 845644 861385
50153H61385J9054K2871K7029L1677L6608M1020M4055M5319M4921M3346M1246
$$ 861385 880439 903310 930339 962016 998624 1039644 1083699 1129018 1173939 1217285 1258531
50142A258531L9080L6870L4492L2178L0483K9647K9239K8452K6504K2768J6909
$$ 1258531 1297611 1334481 1368973 1401151 1431634 1461281 1490520 1518972 1545476 1568244 1585153
50131A585153R135J71r178j8313k6695l3820l9499m3909m7017m8213m6931m3518
$$ 1585153 1594288 1594459 1585281 1566968 1540273 1506453 1466954 1423045 1376028 1327815 1280884 1237366
50119A237366l9101l4591l0202k6051k2736k0865k0181j9641j8449j6725j4991
$$ 1237366 1198265 1163674 1133472 1107421 1084685 1063820 1043639 1023998 1005549 988824 973833
50108I73833j3305j1321r044p040n678m637l542k746k866l628l987l596l502m793
$$ 973833 960528 949207 940163 933123 927445 922808 919266 916520 913654 910026 906039 902443 898941 894148
50094H94148o985q447q263p052n899n121m293l086j684n71j17k36l81m6O73J253
$$ 894148 887163 878716 870453 863401 857502 852381 848088 845002 843318 842747 842630 842394 842013 841967 842640 843893
50078H43893J489J759K479L600M863O114P138P547P257O814O822P183P301O897
$$ 843893 845382 847141 849620 853220 858083 864197 871335 878882 886139 892953 899775 906958 914259 921156
50064I21156O176N331M390L454K699K003J067o9j033j707k371l128l657l697l376
$$ 921156 927332 932663 937053 940507 943206 945209 946276 946207 945174 943467 941096 937968 934311 930614 927238
50049I27238k860k066j001L1Q51J717K901M307N748P289Q939J0445J1798J3565
$$ 927238 924378 922312 921311 921342 922193 923910 926811 931118 936866 944155 953094 963539 975337 988902
50035I88902J6174J9179K1827K4114K6656K9642L2631L5264L7481L8953L9058
$$ 988902 1005076 1024255 1046082 1070196 1096852 1126494 1159125 1194389 1231870 1270823 1309881
50024A309881L7608L5063L1817K7870K3432J9336J6456J5001J4458J3796J1590
$$ 1309881 1347489 1382552 1414369 1442239 1465671 1485007 1501463 1516464 1530922 1544718 1556308
50013A556308O639j075j0359j9980k9378l8045m4915m9090n0813n0951m9740m6676
$$ 1556308 1562947 1561872 1551513 1531533 1502155 1464110 1419195 1370105 1319292 1268341 1218601 1171925
50001A171925m1621l5442k9370k4081j9487j5197j1101p677n565m774m549m179
$$ 1171925 1130304 1094862 1065492 1041411 1021924 1006727 995626 987949 982384 977610 973061 968882
49989I68882l735l712m298n387o981r077j1310j3184j4583j5646j6262j6147j5346
$$ 968882 965147 961435 957137 951750 944769 935692 924382 911198 896615 880969 864707 848560 833214
49976H33214j4208j2916j1450r951q652p468o166m854l898l378l125l250l970
$$ 833214 819006 806090 794640 784689 776037 768569 762403 757549 753651 750273 747148 743898 739928
49963G39928m857n011m210l281k921k688j629M75K975N210P026Q506R615J0182
$$ 739928 735071 730060 725850 722569 719648 716960 715331 715806 718781 723991 731017 739523 749138 759320
49949G59320J0127R627R057Q589P932O706N041L485K299J282L84j20k87q74k457
$$ 759320 769447 779074 788131 796720 804652 811358 816399 819884 822183 823465 823849 823729 823442 822568 820111
49934H20111m561o191p140q179r945j2044j3480j3639j2681j1129r349p525n899
$$ 820111 815550 809359 802219 794040 784095 772051 758571 744932 732251 721122 711773 704248 698349
49921F98349m796m240l771k848j418R1J251J949K330K693L346M229M832M856M887
$$ 698349 693553 689313 685542 682694 681276 681367 682618 684567 686897 689590 692936 697165 701997 706853 711740
49906G11740N795P508Q985R622R973J0783J1929J2798J3128J2905J1898J0043
$$ 711740 717535 725043 734028 743650 753623 764406 776335 789133 802261 815166 827064 837107
$$ [...]
##END NTUPLES=NMR SPECTRUM
##END=
