##TITLE=AC1441_CSSAH13250_7790727_DKqfx0IcuA
##JCAMPDX= 6.0         $$ Bruker NMR JCAMP-DX V2.0
##DATA TYPE= NMR SPECTRUM
##DATA CLASS= NTUPLES
##ORIGIN= BRUKER
##OWNER= Administrator
$$ 1.72 TOPSPIN		Version 2.1
$$ 2013-04-17 03:23:40.921 -0700  Administrator@X
$$ Compression mode = diff/dup
##.OBSERVE FREQUENCY= 400.02188249412
##.OBSERVE NUCLEUS= ^1H
##.ACQUISITION MODE= SIMULTANEOUS (DQD)
##.ACQUISITION SCHEME= undefined
##.AVERAGES= 8
##.DIGITISER RES= 22
##SPECTROMETER/DATA SYSTEM= spect
##.PULSE SEQUENCE= zg30
##.SOLVENT NAME= COFFEE_meoh
##.SHIFT REFERENCE= INTERNAL, COFFEE_meoh, 1, 14.98509
##AUDIT TRAIL= $$ (NUMBER, WHEN, WHO, WHERE, PROCESS, VERSION, WHAT)
$$ ##TITLE= Audit trail, TOPSPIN		Version 2.1
$$ ##JCAMPDX= 5.01
$$ ##ORIGIN= Bruker BioSpin GmbH
$$ ##OWNER= Administrator
$$ $$ E:\/data/COFFEE/nmr/AC1441_CSSAH13250_7790727_DKqfx0IcuA/10/pdata/1/auditp.txt
$$ ##AUDIT TRAIL=  $$ (NUMBER, WHEN, WHO, WHERE, PROCESS, VERSION, WHAT)
(   1,<2013-04-17 03:23:33.905 -0700>,<Administrator>,<X>,<go>,<TOPSPIN 2.1>,
      <created by zg
	started at 2013-04-17 03:22:27.468 -0700,
	POWCHK enabled, PULCHK disabled,
       configuration hash MD5:
       33 CF 6A 21 5C D3 B9 40 6C 15 AA 8D 27 A2 4F 13
       data hash MD5: 64K
       CB D2 54 7B 1E 4B 74 CD 95 CF 12 35 D2 41 03 64>)
(   2,<2013-04-17 03:23:36.811 -0700>,<Administrator>,<X>,<proc1d>,<TOPSPIN 2.1>,
      <Start of raw data processing
       efp LB = 0 FT_mod = 6 PKNL = 1 PHC0 = 0 PHC1 = 0 SI = 32K 
       data hash MD5: 32K
       9C F7 84 B4 E3 EA 43 E8 E4 7C 5B CA 95 E7 F2 55>)
(   3,<2013-04-17 03:23:37.171 -0700>,<Administrator>,<X>,<proc1d>,<TOPSPIN 2.1>,
      <pk PHC0 = 98.72864 PHC1 = 0 
       data hash MD5: 32K
       9D F4 21 B4 E6 CB 74 FD CC 8C 87 23 07 A3 1E 9E>)
(   4,<2013-04-17 03:23:37.296 -0700>,<Administrator>,<X>,<proc1d>,<TOPSPIN 2.1>,
      <abs ABSG = 1 
       data hash MD5: 32K
       5F 76 32 DE 17 8A E6 34 41 05 19 28 C2 66 6E A0>)
(   5,<2013-04-17 03:23:37.358 -0700>,<Administrator>,<X>,<proc1d>,<TOPSPIN 2.1>,
      <abs ABSG = 2 
       data hash MD5: 32K
       4B AC A0 37 ED EC DF FA ED 1E 07 F4 35 6E 34 61>)
(   6,<2013-04-17 03:23:37.436 -0700>,<Administrator>,<X>,<proc1d>,<TOPSPIN 2.1>,
      <abs ABSG = 3 
       data hash MD5: 32K
       66 BB F5 C7 5A 7C 47 86 BA 99 78 72 6F 77 C7 C9>)
(   7,<2013-04-17 03:23:37.483 -0700>,<Administrator>,<X>,<proc1d>,<TOPSPIN 2.1>,
      <abs ABSG = 4 
       data hash MD5: 32K
       08 56 53 2C 1F 42 A6 31 8A F3 78 9F 2A DC A3 8D>)
(   8,<2013-04-17 03:23:37.546 -0700>,<Administrator>,<X>,<proc1d>,<TOPSPIN 2.1>,
      <abs ABSG = 5 
       data hash MD5: 32K
       7D 17 9D D7 F6 9F B8 03 1C E2 D1 7D D7 79 6B B1>)
$$ ##END=
$$ 
$$ $$ hash MD5
$$ $$ A9 B5 86 BB 7F CC 9C F0 85 27 A6 3C 77 64 EA C4
##$RELAX= 
##$RELAX= 
##$RELAX= 
##$RELAX= 
##$RELAX= 
##$RELAX= 
##$RELAX= 
$$ Bruker specific parameters
$$ --------------------------
##$DU= <E:\>
##$EXPNO= 10
##$NAME= <AC1441_CSSAH13250_7790727_DKqfx0IcuA>
$$ [...]
150 150 150 150 150 150 150 150
##$TP07= 0
##$TPNAME0= <>
##$TPNAME1= <>
##$TPNAME2= <>
##$TPNAME3= <>
##$TPNAME4= <>
##$TPNAME5= <>
##$TPNAME6= <>
##$TPNAME7= <>
##$TPOAL= (0..7)
0.5 0.5 0.5 0.5 0.5 0.5 0.5 0.5
##$TPOFFS= (0..7)
0 0 0 0 0 0 0 0
##$TUNHIN= 0
##$TUNHOUT= 0
##$TUNXOUT= 0
##$USERA1= <user>
##$USERA2= <user>
##$USERA3= <user>
##$USERA4= <user>
##$USERA5= <user>
##$V9= 5
##$VALIST= <valist>
##$VCLIST= <CCCCCCCCCCCCCCC>
##$VD= 0
##$VDLIST= <DDDDDDDDDDDDDDD>
##$VPLIST= <PPPPPPPPPPPPPPP>
##$VTLIST= <TTTTTTTTTTTTTTT>
##$WBST= 2048
##$WBSW= 25
##$XGAIN= (0..3)
0 0 0 0
##$XL= 0
##$YL= 0
##$YMAX_a= 653999
##$YMIN_a= -556607
##$ZGOPTNS= <>
##$ZL1= 120
##$ZL2= 120
##$ZL3= 120
##$ZL4= 120
##$ABSF1= 14.98509
##$ABSF2= -5.573092
##$ABSG= 5
##$ABSL= 3
##$ALPHA= 0
##$AQORDER= 0
##$ASSFAC= 0
##$ASSFACI= 0
##$ASSFACX= 0
##$ASSWID= 0
##$AUNMP= <proc_prof1d_extract_pilot.lims>
##$AXLEFT= 0
##$AXNAME= <>
##$AXNUC= <1H>
##$AXRIGHT= 0
##$AXTYPE= 0
##$AXUNIT= <>
##$AZFE= 0.1
##$AZFW= 0.1
##$BCFW= 0
##$BC_mod= 0
##$BYTORDP= 0
##$COROFFS= 0
##$CY= 15
##$DATMOD= 1
##$DC= 0
##$DFILT= <>
##$DTYPP= 0
##$F1P= 0
##$F2P= 0
##$FCOR= 0.5
##$FTSIZE= 32768
##$FT_mod= 6
##$GAMMA= 0
##$GB= 0
##$INTBC= 1
##$INTSCL= 1
##$ISEN= 128
##$LB= 0
##$LEV0= 0
##$LPBIN= 0
##$MAXI= 10000
##$MC2= 0
##$MEAN= 0
##$ME_mod= 0
##$MI= 0
##$NCOEF= 0
##$NC_proc= -8
##$NLEV= 6
##$NOISF1= 0
##$NOISF2= 0
##$NSP= 0
##$NTH_PI= 0
##$NZP= 0
##$OFFSET= 14.98509
##$PC= 1
##$PHC0= 98.72864
##$PHC1= 0
##$PH_mod= 1
##$PKNL= yes
##$PPARMOD= 0
##$PPDIAG= 0
##$PPIPTYP= 0
##$PPMPNUM= 2147483647
##$PPRESOL= 1
##$PSCAL= 4
##$PSIGN= 0
##$PYNMP= <proc.py>
##$REVERSE= no
##$SF= 400.02
##$SI= 32768
##$SIGF1= 0
##$SIGF2= 0
##$SINO= 400
##$SIOLD= 32768
##$SPECTYP= <>
##$SREGLST= <1H.CDCl3>
##$SSB= 0
##$STSI= 32768
##$STSR= 0
##$SW_p= 8223.68421052631
##$SYMM= 0
##$S_DEV= 0
##$TDeff= 65536
##$TDoff= 0
##$TI= <>
##$TILT= no
##$TM1= 0
##$TM2= 0
##$TOPLEV= 0
##$USERP1= <user>
##$USERP2= <user>
##$USERP3= <user>
##$USERP4= <user>
##$USERP5= <user>
##$WDW= 1
##$XDIM= 32768
##$YMAX_p= 468929850
##$YMIN_p= -722167
##$CURPLOT= <Network HP LaserJet P1505>
##$CURPRIN= <$Network HP LaserJet P1505>
##$DFORMAT= <normdp>
##$LAYOUT= <+/1D_H.xwp>
##$LFORMAT= <normlp>
##$PFORMAT= <normpl>
##$SURQMSG= 1
$$ End of Bruker specific parameters
$$ ---------------------------------
##NTUPLES= NMR SPECTRUM
##VAR_NAME=  FREQUENCY,     SPECTRUM/REAL,   SPECTRUM/IMAG
##SYMBOL=    X,             R,               I
##VAR_TYPE=  INDEPENDENT,   DEPENDENT,       DEPENDENT
##VAR_FORM=  AFFN,          ASDF,            ASDF
##VAR_DIM=   32768,         32768,           32768
##UNITS=     HZ,            ARBITRARY UNITS, ARBITRARY UNITS
##FACTOR=    0.250966925370066, 1,           1
##FIRST=     8223.43324360094, -149765,      -205924
##LAST=      0,             -194246,         -252860
##MIN=       0,             -722167,         0
##MAX=       8223.43324360094, 468929850,    0
$$ Real data points
##PAGE= N=1
##DATA TABLE= (X++(R..R)), XYDATA
$$ [...]
23840 -123482 -162230 178500 -99422 79064 91048 172463 -22012 18136 1124 206391 -205508
23828 49572 19046 -856 267392 -179514 109434 320669 -33513 115802 -75738 20224 112171
23817 112171 223821 -129796 280317 -45228 -96872 -165215 233431 -102375 -185664 -75985
23806 -51092 -157256 30376 -180201 -3959 220606 201377 -98876 335206 35407 209411 -67577
23794 227283 -151553 -74585 279823 205604 -33535 -233430 28211 -239037 -252382 -56432 -237859
23783 -237859 -95729 -69493 50061 159048 95968 -117050 -29117 -177138 -419109 -333158 151605
23771 -100310 178304 234618 -75803 -196845 86548 -121581 -83035 -58402 -362851 201503
23760 -77573 -211214 -501323 38624 -80713 207735 43581 -289900 283028 -278251 53608
23749 253990 -46818 61377 29700 142851 83982 -145552 56290 -15868 334580 -79265 155011
23737 -96895 245461 -11828 -235792 -4835 -91353 -163733 -128970 -16610 29570 182066 11186
23725 -169478 195552 192961 -42846 64263 -82983 -26190 46644 -59601 -174862 -217226 -120113
23714 -120113 -309007 106755 34993 56010 222315 40632 79438 -154093 92712 228768
23704 228768 266392 -91525 276903 -75784 -316937 224824 -1271 80797 185924 -14533 -82864
23693 -82864 76981 -118495 55286 577474 185520 127266 -184697 -145214 -321887 96182 -213494
23681 271749 107151 -313782 35034 1384 -4505 -100225 71856 -76335 124255 -37573 123218
23669 45575 -220723 85779 -303440 31965 244181 -45529 -257565 -233622 -103101 121380
23658 -387086 -50680 -238736 -229488 -125540 -30061 70757 -18333 141495 -104801 81374 215101
23647 215101 13275 -125143 329512 -143000 82323 -1296 218085 38979 73637 -147854 79944
23635 92548 -222835 108208 183019 70212 165118 32711 -244551 -123182 44836 327888 -111768
23623 289648 341544 -53462 120401 -108941 -9590 43835 -85354 32385 -33411 89365 37417
23611 -218832 76784 -15422 234999 -150208 193497 -75785 -22434 180269 292142 -138375
23600 -68427 173973 -165377 356597 37297 36413 169426 -210090 19124 -178190 40915 84367
23589 84367 151452 -398411 307542 -168416 116631 55992 81983 107795 306130 -10427 -23965
23578 -23965 40424 -175411 196959 -16571 -34658 167495 298472 39254 33928 179303 -98067
23566 227738 -99398 129026 -16614 -54064 -25314 316006 -69518 -252691 228154 -352614
23555 174799 141146 -127512 -131244 -3416 74858 -152630 57679 -399940 279313 -129358 -234438
23544 -234438 -3218 -133461 -382337 11855 169938 -85943 -121417 177874 -47916 199567 -222932
23532 -468495 -59576 -355382 -39244 -391069 -112094 237813 373513 -170584 -88859 -66515
23522 -66515 -88029 -284471 -118381 -202325 -277901 -52584 -246249 172561 75755 184391 -51500
23510 60017 90970 45251 54954 -44717 -201830 72942 -178509 66161 -10639 -260395 -224901
23499 -224901 -171257 305032 179486 -159038 -53465 -125407 -160109 156914 113657 60476 -79598
23487 170452 -12749 176730 47952 204162 163780 -127542 -124908 -190907 -185529 217941 -13456
23475 22069 -142299 37672 -288058 288499 122574 41156 -250319 -51102 22931 147750
23465 147750 -206579 -224850 -102930 -270205 -133957 89086 239580 352044 50657 100679
23455 100679 -161963 -148708 297064 -100694 87730 -27705 -55589 49405 -60730 -90973 -263757
23444 -263757 -320151 42786 -143345 -190239 47677 187932 178628 189901 -185698 -195920 380543
23432 62396 41373 16614 -30908 113085 38011 -286595 -104443 23816 -112800 -189515 -46340
23420 174349 -36631 -107274 399566 -211924 -160308 -170652 45466 -322074 260252 128517
23409 227394 -8218 -33754 -418322 42646 -486345 -350070 -182127 -100853 -472158 100502
23398 -260463 320533 -163465 -8411 172436 33420 79610 193798 156981 55765 1161 -130700
23386 -118577 -101261 165801 -205779 -52872 26494 -266183 -34494 154896 130724 21849 -128899
23374 -144987 -73570 250632 -213023 -209214 -99898 528852 -250843 -82744 -80963 -27225 -46927
23363 -46927 -92608 -171901 -37423 -34862 81644 -177142 6620 -51413 -156241 -176998 -29974 -103512
23351 -103512 289039 -287187 -57927 -188574 -312342 -41729 -100260 94909 185968 367237
23341 367237 -54541 30251 -140556 38813 325693 -81327 -79672 -64084 46081 112892 -185928
23329 129017 -105625 -304547 177838 -16766 158775 -255955 65376 -140728 -117102 190939
23318 -331770 -75598 218776 12280 -192711 -76608 271330 47927 39472 -184951 -53476 -80988
23307 -80988 -301602 106136 33401 -392402 -236436 -91356 247265 -442151 -158992 456598
23296 337200 -134036 -107296 -142181 160180 -154078 46791 -6774 -289384 3934 -125147 57311
23284 -76460 120277 -130160 281990 -214059 1162 -80226 18706 95551 -63164 190107 154454
23273 154454 153290 -133550 -42006 -202539 -126842 13198 -79855 162256 -136625 82606 -246292
23261 190736 -293219 -245347 -150974 -293475 42318 80943 205525 -78764 117854 -23044 -63094
23250 -63094 -102284 4587 -43807 136082 97385 83964 -11334 -60415 211551 76778 -252504
23238 72190 -145948 -24585 35453 -2618 -246180 -130040 -39343 110069 -118996 46366 -111078
23226 76279 12398 2863 25862 57380 94167 161701 -64473 -99812 -34312 -237111 -147874 343135
23213 116808 -174697 161552 -112158 -154497 -168090 -317400 -353082 -138535 407713 -334451
23202 -22952 -93298 -42789 -566266 123425 71889 -21289 228567 92148 -76762 -72652 4103
23190 19973 39391 -142408 75232 -4397 -139315 146486 187087 56757 -11665 -77424 -115000
23179 -115000 111461 -405043 -143767 -201617 -175098 -385706 -60282 167243 -112783 33606
23168 259752 -160063 187835 107321 32094 -161840 272410 136518 -307777 219075 -35039
23157 69083 97649 73980 -383398 -345061 -98910 -127525 164562 53559 160171 -289482 53375
23145 28986 387120 -41869 -219069 -74980 -74117 -12541 -90320 -154972 198008 18466 -399533
23133 83223 -29001 -12088 -127320 147890 45485 -78665 -87254 127930 -325659 -97597 230963
23121 -39698 -260750 146254 -253892 49318 -188657 246458 85898 -68352 -60628 174676 -107059
23109 -65501 150406 203609 -369594 -212352 -191985 46766 121079 120162 280151 274040 344565
23098 344565 -55994 -291900 -286194 -343103 590578 236660 35649 131158 -33224 116950 -165490
23086 -143247 90165 23009 -165842 -63342 -15189 -104913 296725 -184788 45063 -149212 -96210
23075 -96210 -149591 69695 100160 263881 -44501 -43038 22611 99437 -333085 -84695 -179730
23064 -179730 -9000 -173201 34047 -11534 42622 -53333 5338 166193 204299 -88139 52164
23052 60208 -261175 -231010 52975 251321 1531 -322516 87024 152509 148862 390514 126882
23040 -56351 -57453 -91406 162484 -116090 -47875 -132468 -404573 289615 -114837 -88779 -207773
23029 -207773 -109059 31010 51406 -162636 184484 -72567 -101728 257761 -74132 81865 -42207
23017 121882 -222969 46725 -182439 -80389 -61280 -231701 476695 -287027 -240488 -62176
23006 -192295 -202914 -61014 -42024 77883 -254322 -77072 76988 -216789 43700 -83405 -256003
22995 -256003 118316 -80619 -81652 14889 -10469 59333 -55321 -16789 -234668 45003 78157
22984 78157 123450 64859 238252 25303 -130996 -173082 -424905 -142729 117335 -44628 236778
22972 231314 214148 -19660 -98971 255551 32156 -200551 -155396 -175136 186049 -227409 -168576
22961 -168576 -115178 486776 -16514 -354993 -63344 180441 109916 194571 47623 -179408 181858
22949 103564 -173135 201141 -27722 97892 -116109 -20224 -23404 -43433 -120972 -202723 -127583
22938 -127583 64572 312461 -114774 22995 385245 82139 -91462 62407 -239086 141070
22927 -217619 -364261 -175929 -389651 -142315 255081 99793 14341 97509 60860 59760 -46270
22915 61900 -63017 20355 -80614 23534 -90951 -168088 166013 77414 6385 -98590 152224
22903 76205 37683 -514831 -87898 254567 194360 92022 -62792 109516 22095 -129781 -55042
22891 84169 -257880 -243568 320449 -233310 -385102 56395 354641 -177786 -146377 -95850
22881 -95850 -180481 52000 68324 -21812 -146507 160841 -7591 -3203 111669 51481 -90862
22869 -1449 106982 87076 -184819 -81305 -236748 10508 -401085 67236 -187835 -213390 -85864
22857 -115561 -80240 -11550 -149697 -39464 -351474 -290974 -167409 60552 342708 191373
22847 191373 -181516 -58351 -307260 -87973 -147004 -60009 -123894 -82657 144831 -9618 272436
22835 -79935 -346072 78335 -26837 36026 32507 -72111 -192269 23900 146935 453056 157284
22823 10579 -224952 -53552 -89014 -136715 -234072 166456 26208 160746 -170915 -187453 67660
22811 -54367 -94771 139657 16365 -41460 -83935 208472 -243297 176889 -235853 -201097 199971
22799 -55883 19683 -279842 96261 72245 -26466 -110929 200828 -230969 129105 66606 201568
22788 201568 229172 -128070 -193272 56254 4686 -224048 23119 143741 79910 -24556 -44727
22777 -44727 126315 -198854 99834 -78928 73440 24051 301441 -236013 73281 238646 273806
22766 273806 152045 30177 110369 -104342 -130925 200570 -237503 21752 -179558 -31727
22755 42930 -355 -159487 -36609 -274548 -199968 101756 -84198 -163168 -43085 -151061 141259
22743 -11364 193702 164800 221884 90177 -259048 -11981 208103 -69006 84669 -126875 -52029
22731 -96759 -141554 121144 -85270 -6959 -149847 39823 31291 91048 -291232 -437341 -305552
22720 -305552 -135364 -24203 44089 -64564 27370 -126059 -128023 -36099 -241916 34034 -155171
22708 -61020 -115728 -198937 67945 10962 -215219 -255495 340908 -81878 260824 -133934 55450
22696 218544 -136568 -148880 -85318 -32294 -48432 301104 -308128 -332275 -50160 -31165 215658
22684 24168 -203679 27278 -12815 256953 -82509 -124166 -132416 39234 -141509 112752 14684
22672 -87993 -205328 -93397 1185 19864 -5754 -150702 -53215 -195682 14317 346388 -210967
22660 33187 -136104 97515 19251 -195343 185510 189329 1173 -238609 1063 295572 43229
22648 -166879 -40818 -91543 -88684 34462 -97375 -41756 38535 -140667 55160 160634 278361
22637 278361 -66794 -65631 175495 305436 45790 144257 218474 152967 -24001 73531 -41690
22625 231596 -147385 -127587 106498 -268701 34303 -160387 -322558 -10885 127735 97213
22615 97213 -138567 -5486 -244292 -120776 -155144 -148161 172599 -89819 -321088 230578 -342876
22603 -492884 -254014 -203844 -66173 95948 -111751 21604 99377 -260417 129821 1790 27981
22592 27981 -313774 -58636 15016 246587 -73967 -43089 384429 -196866 -40258 -235385 1329
22580 -14258 -130171 -218699 229693 85196 33976 152407 -12094 -36896 81422 -4776 -144655
22569 -144655 -87563 -103300 -12769 209895 134386 -74716 37912 -271758 149963 -272827 75449
22557 78654 411557 -76268 -146958 217835 -138596 51437 115202 297823 189457 198661 127791
22546 127791 100945 -60847 -95488 43058 -37677 99592 -23870 -149297 -136243 -268766 -23832
22534 -126810 -153952 49873 -44967 134813 -205114 28897 227245 -230555 83845 87163 175336
22523 175336 -78843 -8937 -138731 -305704 167007 -181582 -154355 -675 292278 52298 123001
22512 123001 -138097 145111 67715 95600 411844 -264356 54772 16042 -274298 -7638 87879
22500 -150805 202400 -191123 113286 84539 139943 135084 141744 -70706 -66712 -125411 -62591
22488 -187826 -203806 -425896 -72204 -184726 -122465 -92930 163987 -79097 243501 -13415 -262899
22477 -262899 -290499 96883 105647 -34894 -123478 -93360 127583 -159521 -169152 32637 -372316
22465 -193453 13836 72583 -109589 159548 -159242 382887 -291141 289701 -217823 -90082
22454 -131393 -241896 -293922 -305657 -147704 -344588 -315970 78215 102257 -113086 -118678 -55053
22442 7760 -44700 -73143 -198686 -433677 -136229 -26149 -232759 99876 -224571 -161461 -185272
22431 -185272 38187 -115988 33324 -122581 -163609 -85102 3361 -11280 -246352 109435 240978
22420 240978 -275665 -16343 -163981 -116453 192288 96338 -39869 -74572 -278263 -52740 100649
22408 92943 9415 113664 66043 -106728 122046 42285 -128095 134793 -40110 -301293 -146076
22396 -112476 -11257 -66309 12079 -185112 90789 -183469 61370 177009 57867 123310 -21247
22384 -244678 41191 -160188 141235 -95134 146740 -213938 168023 140145 -300351 45959
22373 -29785 -55665 46230 -44385 92049 -35356 27190 147212 106845 -167999 13034 300346
22362 300346 179183 68363 122788 -95922 11296 -43143 -199507 84056 158242 -50406 17808
22350 -101671 292829 -36868 -78434 -268490 69552 169887 37427 -190358 -170193 -34031 -184241
22339 -184241 -187291 -140561 73759 103497 -393579 -122033 39619 9751 172278 112902 166487
22328 166487 398280 308354 252156 42478 199121 -190215 251122 -22648 -126225 82047
22317 -372408 -343769 -132802 -109483 25112 -427799 -167412 -194469 -33976 425182 149897
22306 80131 -49029 170430 -23834 29497 252092 -50259 2818 -333486 -119417 -305243 -150412
22294 44838 -16274 28865 101896 -24382 31896 -35367 193955 -126160 -83704 208801 37242
22282 463065 14555 8476 -79584 -306064 -253163 -295012 29516 194089 2669 11112 -218236
22270 207643 -307879 98013 -17860 -114138 -36283 -14981 -4730 40505 84117 -40175 -185507
22259 -185507 -161989 333341 180461 -201024 -84497 2220 255945 44281 -14149 -87094 -129083
22248 -129083 -121424 77008 10983 -78321 -118078 -97313 -357595 -202248 141229 176573 -244211
22236 -21320 -194512 83223 1557 17856 30794 192870 -62014 -215579 42447 252378 2502
22224 28383 -164293 13943 -209172 186906 149678 -257114 -203157 120267 -409249 197532
22213 -269787 -276650 -20452 -178556 -79915 178396 -250120 164156 31388 -99649 342694 75298
22201 -143259 -148525 -109434 -352149 163269 66229 131918 -185721 159493 146014 89814 90293
22190 90293 -220469 843 -100155 -37403 -270745 181474 100935 -360295 -349175 -8021 -291754
22179 -291754 522607 -136087 -119319 -161479 -181177 25366 -27197 -429083 243013 -82502 17069
22167 -198259 29134 9590 -145586 245307 -357702 -123701 -98528 -206861 137413 -63184
22156 -196245 -80357 17692 -207350 27514 409300 -146307 -97534 -86426 136889 97276 71550
22145 71550 -155537 -220083 -198116 -221433 -32224 -158166 193984 60317 -267412 -28597 -162723
22134 -162723 -274950 7651 94996 107856 -89383 -144883 55195 8118 -212346 -26002 -297362
22123 -297362 83136 -74904 318712 -201682 -139710 234776 -313784 5103 -49002 95108 7498
22111 -424591 203747 56165 125008 -156570 24349 -72561 -176902 -7346 -248850 -411344 270454
22099 -125708 -210258 -149875 96427 60358 62358 365823 212091 79836 -133138 7683 184951
22088 184951 -82542 -77840 -131257 30123 -148344 62519 -108397 1495 -239906 -143036 -118667
22077 -118667 -64860 175746 -372419 95507 76253 382416 104659 -84220 -243103 206573
22066 281710 -120221 120549 -7063 17524 -289294 107425 -70100 -280846 -130682 107904
22055 -51558 -274164 309429 407354 116952 -531759 -109597 -161523 128962 349733 -166542
22044 -228352 -192863 206053 -79508 128829 33559 -329685 273364 -29400 -91676 41139 75905
22033 75905 -208536 -322082 28704 13469 -152309 -121691 -205696 -328694 5780 -249331 413750
22021 -71879 -140860 -325660 49937 34077 168293 -274835 -49149 -214941 -149939 166712 84550
22010 84550 159803 -182192 67231 -242893 -276200 -192455 -169737 203043 145564 -261410 708
21998 -299408 24455 40497 -123027 34995 38572 219334 -92712 53032 6555 -216904 -100297
21986 -241216 -365548 -29813 -153443 -98241 -31048 52638 -157862 101654 26026 -33872 -79528
21975 -79528 105946 -66474 -18437 -129741 -28007 -133716 172729 48717 177446 26613 67273
21964 67273 -160386 -9455 -41753 151573 195409 -142335 316827 -3253 -180119 -299794 159106
21952 -142764 159347 -212766 5462 -114499 -38409 -292812 -232450 -88621 -135980 -143744 1912
21940 75042 -46252 -74331 -75259 -151404 -420241 -207198 188143 -245513 88208 -322138 4775
21928 77242 167445 -214516 -219645 157690 86670 -59998 150417 78547 -337904 -64565 -203044
21917 -203044 -297894 -127087 10805 -79094 -55169 45908 -266172 -125375 88567 36066 -120488
21905 -193814 -32832 248883 114195 -112371 -257885 -18860 -143464 -128178 -547 295783 -15254
21893 -4899 112050 -17031 147554 30930 104272 44542 166244 50774 70850 -133258 103410
21881 -68300 -290198 253642 -178843 -141477 24097 62511 72257 188114 -24170 71400 504681
21870 504681 -59738 52910 -103207 -120590 -108607 -168101 -99287 384305 -80048 -13618 -118164
21859 -118164 252845 -243788 200424 -381813 -174986 -71134 124633 -58740 -28748 127803
21848 -274054 -87380 -165724 253737 -116177 -33575 -67301 -49526 46788 -264748 -59327 197913
21836 265251 -26396 -59777 -232839 48297 -160344 28543 236174 -183849 -62461 -380127
21826 -380127 57475 -187156 -90932 132087 330231 11787 27466 68303 183585 64836 -187874
21814 13761 -217404 -319322 -220372 300372 181633 53903 -12493 -69764 21406 105873 -28196
21802 143065 -226546 161534 37710 -195852 144038 -52867 -275642 -269616 -235917 -287422 -18396
21790 28729 83409 -27764 -109855 67671 22225 11272 -314306 109150 -305279 -37059 -224001
21779 -224001 -189899 89233 -148408 -176399 104247 54332 -171145 1706 -173639 169727 -135787
21767 -288447 179096 52010 -117572 10528 29263 -109679 21972 127616 -136784 80523
21756 -53838 -100837 132880 -128359 -67522 -199806 -162397 313785 38359 -37344 -79664 259518
21744 112056 -84760 -39069 -22318 100661 -114581 93536 -50311 -108137 -181138 -30064 -503385
21733 -503385 129561 240993 64252 -253704 146850 488 -52488 -191399 -103721 164695 120804
21722 120804 -196396 194510 -49616 167754 86141 140953 -139516 -287571 35329 125536
21712 125536 -420358 -148876 -67020 -89010 -56406 -142154 -92343 -168530 355213 -170977 161312
21700 -274242 -6785 -45422 -326220 75218 27004 -398886 -48300 -75907 39301 -6140 41607
21688 -144472 -21907 -88520 -221541 299862 -120593 -111753 -174390 47560 -138123 60202 -57537
21676 -223213 232090 -190136 -233393 -234090 -206543 132114 139281 -267223 -117895 187893 -114443
21664 1433 307374 298353 -138473 200211 -254322 -157262 -58239 148896 -67492 210873 -60705
21652 -4944 -79918 276212 94546 -179998 206890 226764 49472 -244288 -72412 -191257 -55402
21640 -181524 -222849 109246 178664 -276153 -6514 97722 -47708 2976 159791 -179235 115759
21628 59953 -231654 22950 -172147 216690 -92704 -53736 49869 135600 -108171 -162411 -123243
21617 -123243 137586 -58616 433989 48376 40189 -24191 162862 -187544 -191685 -86705 -36359
21605 -176047 142132 -177769 -188935 13588 -113106 -310047 -171661 186519 -205639 149904
21594 47551 -103512 -155183 -52813 120408 -147829 -154526 -61337 -15314 79468 -72884 -164444
21583 -164444 146059 117351 13420 -169763 -197848 -87852 148561 -52987 -107064 -489274 91439
21571 143311 -136814 -96862 -88793 56598 185785 -23107 -79728 19751 44451 -291685 137586
21559 31097 -40415 107923 28942 -52914 274633 -7778 60887 -144388 111300 -73604 4253
21547 340699 83616 -98356 -28902 -50212 -44025 120651 94208 -118311 -274917 -65491 -254194
21536 -254194 -141558 -6270 261435 -186382 -159516 -101985 213295 -77793 -116179 -143532 220005
21524 -328977 -388209 -4444 54440 53401 100338 38214 -219094 29216 -243026 -205156 -168921
21513 -168921 -40749 16640 -117032 -124553 -329748 -327475 -231794 122399 -289769 -72564 -163367
21502 -163367 -70895 140931 -352981 218589 -3378 -230421 -153019 -18478 5627 26120 -250215
21490 -296526 -294168 6809 -345462 -139450 -78877 96914 -142144 -149325 -100649 -144698 20489
21478 -86732 40581 193186 82160 141989 -280843 -7834 -136866 70196 -113197 -182404 20058
21466 132192 -218255 18375 63438 13335 101900 176539 -85716 259852 -194732 -53672 -12580
21454 5886 249619 -61317 332305 -258446 -345446 220682 -396008 91201 62564 56380 -176382
21442 -19283 82190 -78597 271659 373002 93816 284012 317312 129257 229850 713966
21432 713966 133126 320740 181538 -12550 146457 -43200 54817 -91171 -232777 -36900
21421 -85777 315071 -326475 -227562 74792 74831 -134763 29628 -86731 75478 -195918 53270
21409 15220 62032 -79482 -15698 -416827 222061 -69094 -446685 239706 201 -312455 -69382
21397 83385 -146677 5014 136849 191828 -2996 -241948 -14410 -247211 312455 -204233 176460
21385 185575 -82930 101943 196469 -22548 -85183 -202148 -132658 180104 -318557 157598
21374 -16443 105470 -107216 -31480 101698 93493 -321792 17144 168448 -133909 -10952 -29979
21363 -29979 -190305 -294334 37524 -191918 64747 -121442 289372 -21143 -35731 34715 -141052
21351 -91362 -151867 139444 -193717 -211975 221840 -290606 64221 390676 99772 1040 -312717
21339 -37134 11346 -241373 -89156 95859 -181421 -291681 27877 -123680 41680 11016 -188946
21327 -223026 95279 136456 -38901 -287454 63790 211476 -166922 119317 -150254 -48512
21316 6846 -116846 -312544 -117700 96283 53316 37636 -134698 -344247 -260440 -14546 -108515
21305 -108515 -1794 -29957 -226837 -331972 -58024 -288221 182463 -175000 -57655 -103405 10796
21293 207493 -130690 280442 -342452 -51234 -23832 -189348 -305213 -183256 45624 207140
21283 207140 -201155 -324739 -86940 -143772 103687 -149915 -432747 357899 -283782 -37723
21272 -298630 116211 -159363 49967 -372173 -3567 -87822 -101545 -216965 16115 130564 -88362
21260 35447 -182001 110630 -46064 -189840 -132223 -213666 -31625 -42166 -54731 68773 -24334
21248 42721 106894 232654 -104639 62065 -126725 -224473 -272810 176965 53939 -178400 -13027
21236 6242 -347252 -160764 -30291 80705 102548 201073 -86635 66200 305235 -37831 -184425
21225 -184425 -301695 252738 -70312 468946 -205969 -55972 -105693 -127475 180114 -277891
21214 -337977 -166968 -388264 139745 119809 141488 111059 -59385 9114 187246 157664 -223986
21202 -40231 -83921 493767 -51933 -116615 34996 -150237 -362904 324206 -22693 11247 314353
21191 314353 173685 -47702 -131828 -135816 -203422 -31321 59215 39209 151921 -196016 116321
21179 -326254 -151980 -40318 -446059 -42969 120633 -179612 170349 -354196 -286227 -150475
21169 -150475 154679 -289609 -170696 -286584 114632 358197 -46340 -43657 20164 -74288
21158 -231001 -402848 -251027 -168692 -116019 40856 -394008 137125 -57903 -346382 -19730
21147 -186413 -79516 -72268 -73901 25751 121171 229814 189942 -166131 181272 -29005 169292
21135 -116943 -128960 220655 76912 -271566 -91453 25956 16832 39648 -126100 34759 -149667
21123 9609 -359599 4906 -217813 84694 -282139 -104462 329440 -193264 -66415 166071 96838
21112 96838 -100757 61765 95924 99359 48299 132961 84785 -135970 357770 -99003 128635
21100 -383184 138528 -39677 289830 253127 -33608 182474 -211508 157190 -180013 93882
21089 80449 42647 -124957 -121390 88115 -422775 -229478 64952 -344713 277560 173595 -46279
21077 368085 -251315 -62327 -17489 -221817 153568 -323838 -284245 249672 43655 -240592
21066 -108735 -21208 151747 -49898 129149 98947 -16918 99910 -143227 121829 -159955
21055 206180 -278753 307109 -209066 122618 -21715 51697 61798 -95447 -200881 79813
21044 -230201 72441 323555 -72313 -21266 -58500 -44265 -188141 28261 -37353 -38475 -78196
21033 -78196 -203467 10260 -237746 -3173 316560 -66179 -274695 -8776 -7324 -222238 167958
21021 38203 -21731 -304661 -139051 -413821 129070 61204 -94994 -349501 19782 172328
21011 172328 46455 -155831 -168161 -337876 23676 442344 -240456 -142849 -535047 75055
21000 52514 -211818 244685 171114 -284251 238501 -108385 -180474 -107724 -284700 161957
20989 153567 69273 80380 139672 90260 -71399 129270 -163815 34132 -116753 -170215 -70059
20977 -150238 1435 -141810 -237121 -150571 -306568 29998 11376 99993 151723 67546 24248
20965 150553 589984 293228 109140 -229242 352804 -49056 -187137 68866 142092 2922
20954 -381928 36609 -110021 47735 229761 32869 -257096 212179 -128642 110523 -103889
20943 -90116 -73986 124010 -101687 -22447 -20161 -83969 -187279 62041 -152680 34274 209909
20932 209909 -197353 -300475 291700 120407 -45194 -127588 -75900 11425 -305701 -15283
20921 148476 129509 360545 -213716 119283 124382 -363302 15381 -136648 -509635 197567
20910 64908 -319239 -23570 -127323 58962 81710 4319 -133984 -163273 65700 12612 -102316
20898 60406 -202135 30292 -124731 43119 5036 -97742 112716 54391 -96110 140734 325717
20887 325717 -411775 17073 194759 163493 17942 -94960 -22836 -70184 -40430 356008 -47697
20875 7930 -37333 -70050 109577 209583 -61820 -281567 -358242 3885 192155 -157038 -56919
20863 -17857 -141976 -344901 -372450 -109319 -82732 102839 -156383 -21743 37846 10571 -402922
20851 -226045 351983 -237389 284537 -282239 236594 -782 -87113 -151056 -96126 154166 196927
20840 196927 215691 -336375 -141490 -7620 -148162 -204101 120102 308952 -42675 -251469
20830 -251469 -77042 172558 -85127 89710 -229407 -95127 -179392 -148697 -33959 -47184 -382294
20819 -382294 -64683 89348 -194022 -39313 -249699 -118576 -202173 -149577 -42086 -105933 52605
20807 -405491 213940 -231379 182672 336695 -3829 -14471 -55026 236117 -40436 81623 87879
20796 87879 135061 -154840 108891 62866 119990 -15648 -127513 -16196 208590 -182164 -116724
20785 -116724 -330636 -17043 -310800 -308568 76874 -200373 77052 -171606 -60190 -75204 -251011
20774 -251011 -114273 -38086 -123779 49897 122191 146213 -80217 24298 134192 -100573 128320
20762 230842 -205731 143964 34836 79321 -231551 -112340 -48804 -20040 -63528 111974
20751 -11780 -152280 -113663 -348978 -180575 -38513 38184 124751 -140767 -217273 -124354 -100114
20740 -100114 -137802 -57023 -24393 38762 -108401 79898 -48250 -185162 58719 -6901 351676
20728 19747 -95716 94013 52789 -237328 -160224 -55729 -6927 -5011 -53855 -159945 -90764 140470
20715 -226768 84065 -317227 24596 -98816 103661 -84957 -57423 108882 -171912 -282216
20705 -282216 -369698 -52476 -133406 -19709 -227251 -7567 143693 12972 32141 -97175 119545
20693 -196819 173 134151 -218187 -279400 -169408 -321309 -14010 -406524 -18163 85166 237264
20682 237264 -511240 36867 -270524 151418 -40964 141867 -65868 -28857 -233486 -95850
20671 -14595 -95514 397971 71274 -229828 273346 228191 -237267 -244310 137224 53406 186657
20660 186657 172230 59723 66626 -85399 -211523 -84503 72535 -136007 -116141 -242340 -123971
20649 -123971 29451 -43114 21940 210886 2672 -5772 40147 18452 -101921 151514 439745
20638 439745 -55154 -61198 -156853 -149184 5162 -20800 189363 -159038 82818 -45840 424382
20626 -209618 -16623 -224237 63160 -53279 -94125 -51611 17278 349547 176405 -133954 -199994
20615 -199994 94727 -258514 97882 -61447 -208832 -54743 16000 54017 -148215 -10813 -204279
20604 -204279 -166304 -62743 -261900 -86205 -263779 -200259 -8956 -65934 -213470 85877 -312407
20592 -66766 -36451 9266 -394779 -117879 32030 86461 237637 -3964 315256 251304 -44138
20580 282493 189294 202116 65472 54733 33204 -53678 -16791 -229999 -101399 296253 6639
20568 134692 156640 -21617 -175817 -94339 114873 -205010 -163658 102955 -187458 -333075
20558 -333075 -266949 -3026 68476 -101569 -75793 -398317 123690 50141 369143 267636 -8558
20546 82033 -119186 86836 -63762 165596 34335 42932 84869 -122130 -48774 -166283 -194394
20535 -194394 -52727 -296769 -157684 -134521 -60593 41966 185091 -314524 35874 -3389 152502
20523 103685 175481 126875 -270330 130238 51102 -6354 -12598 63012 -278780 -20682 -203884
20512 -203884 -212729 -358331 260618 -201716 -11215 166431 -74431 -164964 318701 -85289 315964
20500 35512 -87092 157275 -28062 -35658 -292437 148757 174859 -221496 -235491 -50354 -150140
20489 -150140 -226560 -105067 -368923 74227 -18118 -296228 -194236 37721 -388063 85556
20478 69152 153773 -417536 -81935 170267 -57157 413509 -148552 45616 -65002 -18618 186423
20466 -303633 3800 124892 -182473 -248284 -74024 76341 133137 47151 -128176 515123 -297192
20454 77778 333158 180293 -183264 150218 -144280 -270866 32780 -98628 112896 -229446
20443 -382918 59067 -169255 -145868 -144831 -241539 116084 -206473 -39483 161722 -10832 -45486
20432 -45486 -165632 259748 -199013 48716 242843 56392 54722 42696 14124 264410 -193598
20420 -84929 -13555 -51610 -318869 -157176 -107577 122048 -59734 -245168 109697 -163191
20409 -109934 8682 -81048 63031 -16711 -91307 46399 -227659 -102336 -9479 -154998 -279298
20398 -279298 26416 36660 2074 83426 90244 -269918 -369966 -144060 45370 -69077 -138135
20387 -138135 14808 -434380 34871 23955 -37603 -161429 74897 -160875 1620 -216202 -45204
20375 76648 -124866 9557 -184367 -114833 252477 -25818 138539 153202 -29618 118962 -241003
20363 -242327 85419 6694 149336 233852 -164199 37380 373765 -207673 -161231 -181135 -82951
20351 -413689 53760 -346945 -128323 -284470 -24415 -36749 -163541 -129914 -29036 -338861
20341 -338861 222140 -187788 -58408 60387 118895 -260492 -93188 -88652 38672 -133938 -40105
20329 54420 -80076 -2217 -274503 -87028 37471 -183742 85173 -300830 -263215 -14158 30324
20317 -27290 -175523 32227 -66829 -73496 -5158 -160911 -285345 223746 -134148 114791 -188089
20305 -50281 78349 87643 58179 -184410 -63323 -53028 -306270 -86821 -194244 -14696 -284330
20294 -284330 287221 31308 -139668 118924 -277644 166907 -182156 -1481 -61573 76779
20283 -308367 -153922 57542 28025 -175593 16367 147848 -52672 -299139 58496 -181553
20272 154947 115950 164843 62260 -192711 -101924 -295767 219382 -190906 -446741 -56598
20261 -45018 90058 -278928 -333317 4968 -40641 185643 162451 -246606 -81009 -285567 -185730
20250 -185730 -2324 -41355 129738 -121347 -23664 -178927 197214 83019 -228482 -226477 -13804
20238 -176606 -286390 -75045 -156531 -114685 66408 248947 -80665 42890 -46492 -214000 292468
20226 67419 -274319 -43361 -37226 74821 -206684 -363641 -57728 27931 127042 -325672 -100319
20214 219781 -158503 145400 -176017 -449692 332938 -285931 -205700 168479 1842 -77208
20203 48190 192528 139606 82964 -107220 -222452 -180784 134088 -75507 -176217 -219172 348219
20191 -110700 99530 -104554 -169245 360080 -76585 -8863 -237784 -184749 -99236 187996 -232879
20179 46655 185254 -291398 -722167 -9511 133842 -118439 332013 -41663 -124535 265951
20168 -204022 -113599 149511 -22478 302406 -118765 -141945 122961 -125940 -494864 -221387
20157 188444 -31036 181792 98615 259767 154634 -17497 429402 156786 125600 -190389
20146 -145186 -42347 -124951 63286 177216 344156 104066 -178263 115528 3502 -18358 146041
20134 149368 79816 -36038 159086 -111481 313860 45002 24948 -291332 -50702 -57286 -17824
20122 322034 104630 -149463 255188 -102538 5468 -133933 -286308 367130 104973 -170075
20111 20029 -116150 -107142 -6675 -84125 -72672 -82269 -201850 -237379 35263 -25403 -354418 -137125
20098 158848 -232613 30941 -18320 6147 -117177 -251469 171203 -99928 -116 86183 -115588
20086 185586 36781 -177859 193111 273207 355953 -89299 -17395 119748 -358374 -75164 -257269
20075 -257269 -95451 -94028 -206069 5426 104270 -133493 -88243 -152516 203431 29521 3392
20063 -105373 184666 -392292 244011 -126636 269408 -58808 -71782 -165003 121679 -45986
20052 -315618 -133968 -55866 -264197 -170400 -27422 -77882 -51418 -184992 -298053 181738
20041 64881 -111797 -103792 207704 -120796 -276332 -167468 -24295 -30580 45347 -282000 55257
20029 18010 191021 -13965 -235955 -7872 -87580 130157 145683 -58397 190029 -249612 278271
20017 29946 18614 -302008 -123667 -319703 -502412 -65146 -249719 -117693 -322032 -94069
20006 -188277 -41387 -49073 -195330 455375 -75125 -268938 -118815 -60999 -134480 23362 8630
19994 118476 154212 -22144 -227693 -207940 21350 -251205 -177633 -257360 200207 13041 335981
19983 335981 -1855 69104 130936 195378 -12819 -147283 -291217 -22255 89431 40375 315315
19972 315315 -206183 -555637 59578 -149037 381517 -54646 189031 -98490 -496327 129929
19961 83984 -38474 -82748 -330558 -255043 -114525 -187595 174730 -12495 -85362 165946 -60109
19949 62339 -77651 84943 -68249 -99522 64944 -92883 -83586 -228053 191856 191863 50848 100728
19937 100728 -193973 59413 46906 34895 111705 9517 68102 -165452 -242726 -28456 88899
19925 -60810 32439 -62768 191217 -374726 61442 -186540 373539 -155753 -295585 -176204
19915 -176204 -143036 151908 16279 -276565 -150513 121149 23933 -170361 171425 -71901
19904 -117124 139118 110298 -196532 -72214 -212712 -97907 -311162 254369 -239471 83619
19893 -203074 20347 -124350 -51957 -57458 -109964 -132657 -67535 98472 -172376 142540 -112319
19881 -16121 -48793 -63738 -126250 -128467 -39213 -12750 146973 -208780 139370 -70220 -50920
19870 -50920 -118984 61510 -60905 202806 -182431 -270013 -78748 2938 68798 210255 -127296
19858 16811 -7522 -143338 -226613 -17865 236766 -103882 -161532 -100836 -32096 -137857 -393158
19847 -393158 -161352 241808 271252 -52575 -27665 -153660 -16271 -24218 47165 -250844 225629
19835 -293264 57284 -187252 17884 -349989 202829 142158 -72132 85245 -328370 135025
19824 -352921 -66779 -26062 98483 127796 153007 -84494 119716 -30256 -265911 66315 -98727
19812 -178139 140022 70111 -37771 44030 68530 -8071 11864 -12958 -56543 180594 -217642
19800 56645 -45433 186233 -197531 172750 33087 -147326 -365381 -47297 -167375 -287773
19790 -287773 -172015 -75087 -338341 8190 -164185 90077 73742 -6055 77273 -19838 -148042
19779 -148042 160676 -132124 -191071 221240 -261445 -234522 118029 53365 87479 238567
19769 238567 152951 -89718 26008 63559 -62677 -12130 -109455 -84167 -144615 22420 126620
19758 126620 174284 39829 207755 -288785 -143804 -134984 232468 -193007 -270110 -356276 -171929
19746 -378510 -31268 -123424 -69680 81952 -315204 -41516 282837 -76706 247770 193702 244355
19735 244355 -33921 -64122 -114417 291146 -152434 16337 -22655 240102 -197169 -106518 104102
19723 278035 -281980 -159269 -80050 -63885 -131248 -30903 -62529 -97628 337506 -17116 95238
19711 139227 -17454 64450 -38815 -62915 -126343 -56981 -181013 189186 186763 -343454 -190534
19700 -190534 162706 144674 -11612 -83928 164048 201205 -221735 366885 33719 -89367 -323527
19689 -323527 -124849 -222581 -240808 -44497 -205982 161730 -88006 91031 -27443 -248413 43313
19677 -57118 -32510 38599 -126436 -86319 -87942 30341 -153781 260027 -218155 -67709 -159333
19666 -159333 -126890 105495 -32810 -191150 63414 -139386 34363 -376333 -266782 -186749
19656 -186749 -221898 -52511 -9142 -109124 28744 -34021 4421 -506166 -332571 -94324 -130434
19645 -130434 -152540 -258528 -75966 -25509 97397 -341994 -226771 -88710 99651 -182065 -41950
19633 -137974 164163 131350 -294665 201368 7240 -11802 -393206 -185235 52277 -229593
19622 63556 46229 -7025 -222094 -107706 226699 49557 -53289 -287631 -5553 45003 -43643
19610 -411531 -335111 26112 -163799 -80906 -24591 112703 -174124 -225138 -321885 48527 -121884
19598 -6479 273813 191914 76964 -213428 -46240 -504048 -86957 -169439 -8415 -43821 -140188
19587 -140188 -208196 90479 -412258 -121531 16335 -92013 -278886 82956 162844 264 187801
19576 187801 18778 -50991 -290394 -143120 365759 63688 -93240 -429518 -268965 96073
19565 -7611 52378 -178683 -53208 -79528 -171389 -68800 -53910 169218 -28914 89421 -54084
19553 -32400 21669 -75485 -249052 -134204 175082 -146833 -6578 -177747 132863 -235034
19542 -85116 -169981 49695 -124609 -145034 54252 17730 -55479 -116540 -16140 142834 -8897
19530 -14055 -108519 117128 -161751 -338145 -184285 109855 179655 -161062 -198137 83163
19519 -310445 -170442 -216581 42691 455631 66901 40651 90289 -470904 -182299 -3940 45657
19507 -269571 168256 -101947 189834 38024 -103157 59771 -121386 -256294 255093 -191840
19496 -278584 86357 264002 -363251 -69242 77369 18533 -357551 82852 -210605 -268338 99172
19484 -177171 141333 -153687 -68247 -318985 182298 82877 188679 247987 267857 -40747
19473 15829 -211933 -72789 -181619 -147091 -49972 48270 -50929 192987 145251 -178459 -132148
19462 -132148 121398 -180942 140548 -453714 105764 -276445 123618 -32591 29201 28390
19452 28390 216171 239721 -115779 -165688 110003 -152111 -10559 -272733 -46993 -50243 -206408
19441 -206408 -133053 -224110 -102758 -179422 -90140 114372 -191369 -225606 36445 227782 -118174
19429 -26677 36640 -232731 219998 -64375 -15967 105504 -69596 16399 159806 -107299 184885
19417 22922 -16061 -44683 158387 156652 18729 -180003 -105182 -5447 -156791 -123144 57102
19405 -140036 90749 293464 -294347 -71290 -159287 -12712 258955 -91948 -130249 -87080 -400703
19394 -400703 75223 -197961 219931 41396 5987 1053 -7857 -9803 -237693 44265 38360 -514
19381 -237142 -254017 -225266 -132875 -154565 -275350 -125067 -49045 40637 -295359 145222 -232558
19369 192216 89363 29093 -429760 40349 32543 -46346 145816 -39722 230551 -138963 237705
19357 -221298 -101912 -84107 -204141 1745 394317 38631 -22295 -130142 -5744 -316956 -153300
19345 -355473 -212272 80634 -28407 -172857 30001 -362153 -205783 184299 146297 -67381
19334 -249119 3681 -75327 -331621 -344530 -58214 -58292 -117093 143760 -274512 -368906 450936
19322 -299155 206176 -55384 45526 138976 -43492 -443401 20261 -77222 -137148 100607 -349667
19310 19105 77571 -84678 -148946 -96480 -268219 381353 -182917 -370505 -249529 -220996 -161623
19299 -161623 -14956 63340 -393911 -75711 92313 -67344 -178520 -217753 69784 828 -101065
19287 -194879 -77081 -326527 83030 -286854 -301583 11639 34262 -284459 -45002 -93571 -137101
19276 -137101 -114666 -72203 -128437 -94606 -289428 54368 11979 -216392 -49075 142817 -162102
19264 -58353 -269132 -245877 255234 -120993 -45191 -262176 42120 -142535 91139 193190
19254 193190 -144856 -205177 26459 -104366 -285322 -123559 -61580 -275406 21623 -12950
19243 -235649 337918 -24339 -303009 -275419 -187435 43752 30912 -134709 79287 -108689 193486
19231 -88535 -120723 -134278 -103624 -109977 336244 83490 -35581 -258608 52090 -189300 -19365
19219 -51236 130882 -29159 -118714 -290384 -34533 67461 44547 83721 94499 45977 -36611
19207 -333424 -8076 -57632 -120377 -13796 -89061 -71031 -201706 243701 -319058 -208445 -6206
19195 111500 -144181 91014 -313410 91545 -88660 -176475 128495 -569196 -91880 246803
19184 -47096 -134593 -230695 241737 -318723 -870 -69785 -283890 -17311 380911 -371452 -40713
19172 -112087 -282256 78625 -222234 147123 -210666 -340653 262248 -285665 -106191 -338920
19162 -338920 -207038 -83399 -13489 -30451 -352662 -247538 -141035 20128 277911 -32193
19151 84754 -65467 -105763 236360 -1522 -260979 -26582 44256 -160645 -97781 162817 71449
19139 4304 -324534 -50916 -393791 137513 20177 -81692 153630 13448 347065 22526 -193223
19127 70713 267773 22870 -111794 169884 -279899 56464 -242589 -279035 -208588 -103033
19116 192340 22709 265255 60287 -203223 -310602 2098 44578 49468 -115411 -398635 183947
19104 -82264 66253 -587769 -96833 123111 24305 26455 10581 -282200 -166110 -66831 -119979
19093 -119979 -145183 132984 2901 28397 -277894 -256429 108512 -233074 158550 294654
19083 294654 -67515 -169281 -180764 30628 -396356 -221646 274668 191824 130071 294607
19073 294607 -194491 -75022 -9311 -235622 -125223 29542 -286814 143153 169539 -5513 80739
19061 146046 -25897 42389 -38756 21587 -61046 -232344 -88802 101626 -25722 91480 78241
19050 78241 271552 238886 -212430 -115030 310384 215798 -115078 -141685 3245 265466 -382223
19038 -136420 -486677 91569 -251303 -49432 6979 -15173 -124063 -142747 239868 995 53974
19027 53974 80381 -114627 48659 75747 57090 15232 -17119 -130346 70197 18032 -129905
19015 -84443 183895 -114143 479349 122774 -252993 -161765 252671 57932 -534368 54160
19004 -36635 -117637 20441 125655 17794 381136 -130584 -221024 -50429 -41892 -6584 13631
18992 143947 28672 -232387 -96398 -279944 -173350 159197 -334529 9270 231936 63851
18981 -92106 -45045 -52961 245450 -177537 86973 -228763 -239689 -49435 198113 267772 -246442
18969 -237565 -102782 -109919 -249073 -92225 147132 -48633 -123009 -233531 270387 -267044
18958 268425 -256927 178968 -54876 -128988 261781 116002 -43305 219527 77739 -10824
18947 -305634 26304 3939 74196 161897 -146177 148917 -82937 126170 7164 9014 -22698
18935 141647 -161053 -47595 -30914 31367 83152 -214692 115281 -259055 -184937 -93690 10273
18923 25642 -141452 43830 -56683 -333248 -302204 109642 -53559 -64518 104951 -235969 -36239
18911 -60326 -341889 1940 -218967 -455962 -61553 121856 108417 -194932 17965 -63532 -103084
18900 -103084 83218 -311484 73968 -175762 -10222 -260252 -89245 293603 101670 -139359
18889 -149492 -89049 -125586 184892 30400 -172804 -276180 174037 -183927 -20552 117529
18878 -94699 -76761 67085 109094 -83168 -288502 214005 -267733 -279793 -113433 -106364 -330711
18867 -330711 -10743 67659 -113144 35223 -34510 -176118 147305 -70783 -292901 -47173 14091
18855 387374 22385 110084 -272913 -157955 -232747 102321 2021 246333 80632 -69990 -298654
18844 -298654 -438827 -254158 244741 -88729 9315 335286 -108461 66564 3882 -182559 -113560
18833 -113560 -27654 -102356 56388 35952 68977 -25288 -495445 224885 8850 46462 66528
18822 66528 -28291 143252 -148610 123615 -90935 101777 -136220 -196130 -30552 49302 220182
18811 220182 -174156 37840 -77712 -130565 204036 -111738 -254593 -80493 36565 -109044
18800 -180153 -166385 132694 98002 -303971 182373 -238260 146012 274803 -189215 -110456
18790 -110456 -162603 -273925 -124038 -49385 -92747 163647 91207 22691 -96942 -435086 -115199
18778 35884 -10663 5792 -4533 -24276 -5877 119540 -139505 223316 259894 -17683 232061
18766 -299809 -46305 336847 -318604 -119197 82904 -235047 118327 -255660 -203404 -133067
18756 -133067 -135470 -277552 -46191 93171 252528 128100 -71791 -13432 -104087 -282842 -253464
18745 -253464 172734 -202182 -281568 -192272 147610 -149812 322450 96433 -187087 -84639
18734 298397 43401 29502 67282 -62647 -407390 -240919 145614 115824 13815 -89540 -194242
18723 -194242 -201927 197346 -261459 -387222 -77947 -248404 149196 -93395 -39958 205333
18712 -229611 -246777 -355048 197574 119261 -192830 207524 189835 48723 -248279 -241981 -98846
18700 7418 -166121 -119058 -72587 -122016 -216135 157287 51144 -79277 26935 -141410 -306022
18689 -306022 -100975 -196734 -70703 212574 -6864 -10663 -281813 202700 141401 -104538 -108122
18678 -108122 427885 -137886 85654 -53838 -384180 -79629 120153 -267534 -172001 -249466
18668 -249466 290604 61369 -211842 84652 -99679 -261674 -101613 -341711 177850 -61534
18657 -403488 -114937 136279 -108467 -281898 -16278 -2898 -230131 -165326 84444 67288 14204
18645 17432 -92252 -213869 40883 -296686 277832 27504 -269270 154572 -36475 -56073 -16441
18633 -7558 83688 116525 -165947 -139443 -45945 -217067 160931 -128119 39236 -5235 114347
18621 94491 -227726 142484 28395 -49459 -230223 4946 -151461 51828 62772 -23887 -128699
18610 -128699 -78181 -20619 -139267 -74506 -302668 -39949 102503 72261 257081 140876
18600 140876 173169 93735 197965 92729 -5692 87891 -168072 -45745 35711 -88171 -63880
18589 -63880 -255259 84434 -56618 -36487 69479 -62548 -287199 -132451 99917 -250271 111805
18577 -251766 37190 53920 72820 -339639 401227 -225283 104052 -539424 -110494 -180663
18567 -180663 -376631 45520 -193656 149992 -72577 -38031 11675 -63068 -24988 -302583 161036
18555 -210775 -201215 33991 -214592 -35929 -227022 -164000 56029 -122311 -330563 -177794 -47719
18543 -14604 38432 -360141 -189465 -299497 -8440 -342439 -105358 -50197 -219122 180688
18532 -52174 -69527 -309183 1976 82252 -256024 -48255 -109685 -49418 -124444 -177125 -139786
18521 -139786 32399 42809 -145226 -31435 70171 7680 -30991 -17638 -294847 -56133 -285349
18510 -285349 62873 -195978 32412 -58796 -98693 62802 -113001 -301593 81618 -109261 36030
18498 95444 107671 -37705 114803 66332 -17783 -95957 109801 -344104 -71082 32477 -41775
18486 -36108 -77389 -250856 -274408 -313229 -299901 -282978 -178558 14253 11343 -23539 -153811
18475 -153811 5877 -94501 -139048 -204735 -278045 65974 -258375 -77054 86991 -76130 -62071
18464 -62071 -170920 8413 -393126 -228281 209331 -106434 -96145 -32743 -55112 72107 -312084
18452 -190274 -163541 -370412 91702 68357 -159740 -67944 -86946 -9057 -390968 -105339 207522
18440 -13507 -330542 -146718 -230755 -139397 -128548 99076 413267 -138150 46504 73760 -123510
18428 -211860 -69483 -150922 -152834 -77954 115944 42872 215728 94519 206547 114914 -100772
18416 -200008 -70879 17428 -32206 123942 -48928 -443032 -283225 154681 -59587 -161671
18406 -161671 212131 -6863 390835 10036 -226907 261431 75066 263106 -121787 144613
18395 -305370 -98439 187279 -3781 7541 -101830 -19494 253169 -158872 40986 98824 -16731
18383 -392399 23656 -327612 -5088 271794 76789 -28727 -185526 -193283 -109308 -28829 91829
18371 161293 -15360 -378465 165914 -62828 -111424 225388 182581 47354 -375650 77912 212212
18360 212212 184348 -101214 107551 171079 48235 -40414 -42608 188051 -123224 -336575 -70684
18348 184784 -216229 -141768 101704 -145197 66241 74231 -146072 -157828 -133472 -413 251 -6976
18335 -174563 -143583 -141171 146795 162706 170064 54381 -109375 -47704 -56989 -230676 -124323
18324 -124323 130345 -399451 114872 -31292 97401 -86485 2593 102441 47631 251455 -49573
18312 -90114 21299 4520 -160222 -236994 70579 -214595 -232432 84434 60787 18031 122842
18301 122842 -157436 -2202 34252 28541 68297 -44047 -89434 -332929 243750 -89919 44167
18289 363212 -81270 -206966 -80150 -131594 105627 31041 130919 15351 -130372 48194 149112
18278 149112 291693 169095 -107002 -251406 -165508 -97088 185156 89739 -11721 -65691
18268 -65691 -63059 93862 -10471 -176137 159483 -367946 98017 -378764 -437654 -82517 -393794
18257 -393794 41718 -138915 109806 121786 -15406 -235392 134098 219206 28548 44035 106920
18246 106920 44266 -74875 104255 -362996 77368 -302116 -67892 -121328 -283838 122447
18235 -237421 103114 -36164 -137397 37311 17375 1959 -109191 -79999 22913 -119180 -45208
18223 72623 -509228 75837 -183036 -385981 151102 -289278 72937 334666 -92622 65568
18212 -20865 -68262 155726 -80947 226439 -88878 223779 -268966 -324663 271083 -183111
18201 156063 -260793 -221507 -87383 43013 -286603 191140 -96453 206615 25899 -384564
18190 -247113 -69208 -229234 96712 185992 -83760 -9013 -117587 -62984 81682 -261544 -159919
18179 -159919 -52333 30993 198813 36982 -61679 -93803 21797 53679 -189015 30763 -132185
18167 -66295 33265 -160242 -24046 95854 -118990 -187862 -116074 -278000 230099 17379 -217955
18155 224488 -32634 191970 -123394 176854 314767 64516 156308 366814 -42926 132370
18144 -404244 -279742 -102411 12017 212613 -15058 -195895 -230759 -170694 -42198 -58674 -264627
18133 -264627 -70232 -6271 354021 441406 -317156 -295251 86681 274522 30988 -60189 28996
18121 -118471 62350 -119270 -210085 -332381 -296713 21781 -94915 -319327 -103638 -297984
18111 -297984 -57077 -59865 -178944 29539 255961 -43070 -78926 109558 -135551 575183 -17804
18099 -21527 92710 170593 67830 -45018 -56441 -92955 -126081 75358 -2941 34357 -49030 16397
18086 -162222 317509 127427 194019 -259352 -419857 -93595 -100652 202766 -248443 -213556
18076 -213556 242414 284783 15942 -4633 -102238 -164530 23083 -120444 -235293 -214605 -43294
18064 -198127 117107 -122781 227230 -416499 -46147 1806 -111539 -196205 380042 24263
18053 -89633 -103169 -121897 61566 57030 -73049 62039 158004 181625 -221333 48527 -217735
18041 -175100 -151477 23467 259940 -136111 203679 49692 61588 -49830 -304460 13308 5117
18029 -342274 -123818 -22149 -69789 84620 269658 -275352 113526 -107425 38762 -320188
18018 302570 -170289 48450 61960 -51252 61913 81496 -31529 24695 -8491 70694 -119060
18006 -17894 -89856 92750 -216323 -154496 67593 -173014 220586 -94373 89673 -59687 -10166
17994 -105491 48779 -288512 -60075 -105090 160530 -88808 -139360 48198 158092 430487 -21828
17982 160975 215325 -125797 18218 158790 77564 351632 -321730 -21467 -27025 -136817 27302
17970 -108210 -6204 100405 148179 254953 85321 -167789 -233088 -73999 -253849 -88928 -9511
17958 -381138 48398 -110773 -6964 -220536 -102872 -1668 -156230 164160 -365657 -48012 42229
17946 25034 -5678 16450 -181346 -87018 115478 -163330 1337 -163393 19834 -49742 -323409
17935 -323409 -477491 -112198 73799 -191480 -10161 -59669 -112926 -59829 -20164 -58955 -136983
17924 -136983 -88873 -143329 -183076 -20747 -104942 -84094 158383 -250653 -139984 -203528 -175681
17913 -175681 -261809 128619 -257185 -307082 -64278 -86410 244981 221408 -257128 -282673 -53776
17901 131039 191842 50775 228078 97356 -45980 -210565 -13242 123049 -52248 -131314 -11686
17889 16494 42696 -25501 116787 -219927 -3616 -368791 -66058 90513 -148829 -132851 -273839
17878 -273839 10446 -134107 -130355 -239952 213216 6772 201029 91600 6669 -140641 -57968
17866 28932 9063 -110572 -208231 -84222 54182 -56690 57793 294460 -125624 -230373 194508
17854 -151823 197833 -90914 165275 35538 182504 -166040 -148408 201601 -216968 242804
17843 89926 -258850 36114 -382838 69325 -81330 -183530 163237 87844 -74597 -255490 -151545
17832 -151545 116157 146280 71810 -304053 227039 74516 -146999 -167769 177496 -108414
17821 60799 -219005 60602 17008 -116010 375512 73064 -147845 372396 -119120 150893
17810 -195996 -235334 -150322 -225820 132682 5854 -109032 121549 -90992 285915 -178875 5759
17798 109045 -243385 -35434 92886 441413 90697 193040 250046 92057 -14872 155343 94868
17787 94868 -50955 250194 74212 -201438 334706 -90093 -172103 71771 -17400 -172114 271336
17775 -141589 -11208 48877 92674 -92154 241980 -382731 -39902 -74211 54486 -98159 -17819
17763 131035 -113025 122038 -7867 258527 -30823 -108571 -289240 -194609 199132 150692 189308
17752 189308 -95638 44235 214771 -261516 122770 58750 -234080 -249204 -31272 93970 -181240
17740 -163009 -51551 291114 -166697 -13993 49544 137450 -119262 -17951 409915 52062 -16748
17728 -190714 209507 -80649 247796 -44738 -150182 78605 -143641 -99703 15679 -57100 -229451
17717 -229451 21983 -3024 435922 -144959 -121467 72535 -83264 214441 -171882 252338 -192660
17705 36957 -155290 -215075 -100535 -39136 91253 98749 -359232 -15148 -47555 -109614 -48229
17693 -131158 -220263 32615 215030 -120547 74481 -184540 -155737 20983 -43714 -202491 87863
17681 -418933 61515 292319 171588 -96405 -84121 -59465 -202704 -85398 43742 187606 -360071
17669 13309 -8880 9153 -38629 283586 26950 114212 -84131 -115979 330368 9031 128963 -26414
17656 137493 86196 164993 45227 197103 79577 34397 -90034 333950 -37491 -189587 275133
17644 5678 -28224 -47924 -124093 -87691 79114 10234 -151446 30140 231903 -50961 199413
17632 392137 310056 -36823 86548 207022 -45542 250037 -325005 -88115 162077 -154694
17621 -53599 -43749 66463 162591 249638 235227 -42822 55435 60836 -54613 31260 87415 -231539
17608 77257 256190 55783 -279907 -17469 -90572 95987 -213835 -171329 43506 49414 132897
17597 132897 -326447 -114648 -53361 286640 138236 -262672 488724 173947 23867 109466
17587 109466 -163119 -175089 482964 -287598 22135 -125215 -46592 -8991 -446095 -25752 -143756
17576 -143756 -215118 -31341 -184541 178865 -158313 205670 -135091 -86662 266126 102531
17565 249791 -82967 -5901 61971 250563 -82481 -211840 -239907 344505 -64954 -10987 -373901
17554 -373901 472019 169356 152884 61801 130643 -46497 133194 -219431 428782 108386
17543 -54453 -113761 177044 -59958 191054 -257605 75409 -261381 -63700 293970 499899
17533 499899 68256 43464 138762 109534 26120 126258 152912 53678 93721 -22717 201397
17521 -317505 -54489 233010 59955 -67596 16698 187068 71563 -23112 -60428 578500 257054
17509 57398 -1899 -141126 -17703 -90850 33693 -237185 183197 102275 -92890 54000 245315
17498 245315 392627 251459 84043 -536315 -7702 125908 -74880 186547 -223458 -118906
17488 -118906 -197120 -114091 177634 153199 -247662 57257 43116 149441 168155 -159248 -135266
17477 -135266 157828 257960 197868 144105 88307 -16886 267037 19594 216409 69554 181747
17466 181747 53207 130675 -5245 158763 492646 148322 -67095 307321 426842 -190349
17455 320476 106098 130832 79733 36552 219099 281880 -862 -112765 196238 544560 495103
17444 495103 259036 193208 206451 -36573 135781 148723 438702 82600 -11299 151315 24515
17432 334981 226867 266230 -116491 206126 335530 99182 184686 448848 298384 475595
17422 475595 577048 397802 390476 292905 306881 447462 451760 296869 259559 230937 343109
17411 343109 -106496 -8814 -35886 507867 100006 388975 -54871 221852 193809 65501 -101663
17399 275749 184101 13888 500717 262828 335232 -92631 -30545 104502 85250 236139 -84414
17387 -202942 46280 374165 299898 217981 -97983 137429 -9986 42432 443346 4816 423407
17376 423407 9076 330196 32401 89748 107931 312110 161913 99910 79354 75887 204156
17365 204156 59951 286676 -41839 191120 6247 127244 211556 237019 -103227 330524 153441
17353 -22028 42171 78221 -23207 -13881 30224 69849 279389 -105618 -73696 120038 -49423
17341 24059 15052 340184 193883 315097 15255 186364 41083 346151 250347 271 165275
17330 165275 179411 -68924 33548 156126 -83811 -157458 147396 480002 423580 -23674 307478
17318 61872 23329 300874 600530 102493 -29672 354958 175026 46584 301017 355368
17308 355368 201289 -52478 252445 473748 184354 272601 302731 53991 266798 379249
17298 379249 214574 330293 309684 316519 395526 -41935 265636 278067 70124 62525 132558
17287 132558 187106 143612 -76403 21304 100854 411 233235 281513 -74856 266097 20049
17275 -276220 72347 214501 196989 128416 -71368 100336 311387 141840 -381966 306003
17264 -18607 421825 228185 -23263 323499 271647 24847 227634 41602 77797 556211 244599
17252 -4323 218301 91561 148820 260765 118853 389011 -71715 157225 307382 315736 -14632
17240 286051 165136 -47749 29424 450717 -177100 48271 1318 259309 211659 529193 362375
17229 362375 162774 118274 -82513 214617 256190 116689 65527 86456 296999 256879 448751
17218 448751 -4054 53484 581870 123521 140104 422010 178705 281003 71510 414251
17208 414251 210777 297684 -11152 47870 91115 211027 282717 242098 215632 148788 558091
17197 558091 429554 226041 144420 286660 176402 365855 131836 375269 203514 -213474
17186 46022 780625 278381 174987 238970 14235 70142 65905 70401 410366 486939 101792
17174 -97389 273875 226415 425223 -59590 216432 475457 496949 111032 399111 65048
17163 40083 267229 -105358 65541 -65784 316371 288464 101206 497373 357372 376795
17153 376795 311867 339110 53523 146474 339588 510049 353961 667284 125464 95208
17143 95208 392281 249073 473008 295011 -15469 502955 480651 446334 406873 674909
17133 674909 322287 302587 297363 90371 380523 352444 484900 437716 569998 194219 332172
17122 332172 169640 261415 259506 717653 515283 378128 61684 259345 261204 354002 577544
17111 577544 374289 564403 122677 578633 98169 398511 405360 114816 534483 408122
17101 408122 431207 198247 205488 475213 342033 370540 337739 244908 270497 363409 260511
17090 260511 476672 290315 530501 348961 391056 145802 628414 162785 204748 250777
17080 250777 358427 504757 720447 478477 552565 216676 462870 385303 716933 199132
17069 271925 492046 486121 446816 238952 466453 473476 69548 649632 600263 465401 683494
17058 683494 284033 374576 666026 594309 523489 293194 522397 516698 425843 435477 580667
17047 580667 592492 525533 787668 670965 495776 474912 532781 334473 463875 759761
17037 759761 890785 780239 375764 762465 361025 664763 261013 377929 717794 472455
17027 472455 708541 832258 611016 562765 676389 775681 431633 784437 704593 665756
17017 665756 534358 484430 722756 932654 458899 839309 568398 930459 634387 1028398
17007 1028398 166925 506818 685567 990759 937270 872740 658974 979374 640402 705760
16997 705760 649023 464353 678340 490293 863835 485206 655608 630887 787636 839230
16987 839230 996560 1097534 657377 989420 943731 965695 682156 850560 819069 725306
16977 725306 811035 896821 967709 962819 942068 800151 1185194 1009627 917007 1074718 846317
16966 846317 900298 837930 963872 1000490 642029 1340327 693257 1026339 901083 1115953
16956 1115953 750057 978003 867856 894378 1008315 1278737 1153441 893351 1126403 1383511
16946 1383511 871655 1288799 1185803 1117895 862588 878553 1096809 1165709 1293741 1420886
16936 1420886 932704 1261442 1197128 1151594 1110518 1356611 1610190 1268224 1463716 1302665
16926 1302665 1573699 1236991 1677921 949718 1362989 1520844 1584983 1751441 1321411 1255962
16916 1255962 1573136 1392755 1360953 1559899 1621205 1445271 1636705 1190296 1274712 1483191
16906 1483191 1473292 1639307 1564814 1693950 1528189 1529771 1654674 1430154 1926108 1908568
16896 1908568 1918934 2257053 1829710 1880292 2110680 1588144 2055282 1883068 1918618 1911194
16886 1911194 1830027 1842217 2060724 2213072 2180741 2039697 2012862 2233327 2118322 2134765
16876 2134765 2372717 2286698 2259306 2406402 2501531 2180162 2399193 2351231 2622038 2434726
16866 2434726 2493514 2654362 2664814 2906170 2632180 2816246 2568541 2545161 2918765 3028516
16856 3028516 2970683 2937918 2792447 2825085 2813819 2818799 3164033 3343488 3314499 3053319 3756399
16845 3756399 3376081 3423235 3485672 3536430 3361887 3506166 3806104 3898981 3868653 4151769
16835 4151769 4067294 4353046 4128830 4061071 4258839 4319218 4206139 4488745 4607950 4802318
16825 4802318 4813966 4738711 4504155 4639587 4960639 4876862 5603528 4973511 5210003 5359017
16815 5359017 5323636 5491271 6038943 5807147 5850966 6284249 6267605 6451983 6519206 6728186
16805 6728186 6854153 6797527 7312685 7167931 7062113 7508555 7907497 8013628 8114867 8171510
16795 8171510 8538283 8854613 8889926 9036316 9688081 9622598 9825734 10037601 10181134 10454270
16785 10454270 10909437 11046430 11444459 11628109 12250840 12387812 12795454 13022838 13709867
16776 13709867 14116972 14284950 14934825 15157646 15602595 16106803 16793922 17264838 18118185
16767 18118185 18350218 19120269 20017853 20492381 21135875 21886275 23074572 23817386 24815817
16758 24815817 25836160 27117072 28269262 29046631 30567166 31683695 33138758 34914895
16750 34914895 36576199 37922461 39542825 41811226 44134477 45974616 49066310 51838909
16742 51838909 54059914 57403696 60221074 63611317 67413007 71387285 75680015 80166036
16734 80166036 84899724 90133458 96007497 102290553 108428000 115129427 122359479 129962843
16726 129962843 137624694 146147577 154127268 161941245 170010177 177932409 184670314 191077871
16718 191077871 196201607 200424702 203146153 204493455 204395144 202317640 199487143 194812192
16710 194812192 189411816 182960325 175566667 167806288 159652519 151166358 143084044 134826608
16702 134826608 126954729 119359876 111870409 105035594 98382888 92407740 86748238 81255555
16694 81255555 76391020 71551561 67582193 63270160 59826838 56377197 53285115 50429744
16686 50429744 47272663 45200566 43065833 40453044 38424114 36624142 34748285 32957183
16678 32957183 31518464 30054326 28946409 27101402 26235224 25130371 24091187 23208616
16670 23208616 22165158 21387405 20618599 19500028 18693006 18190065 17616128 16790611 16396386
16661 16396386 15694034 14935785 14467783 14304536 13799398 13203119 12712579 12043873 11923258
16652 11923258 11232238 10948341 10957037 10624774 10219357 9857875 9454798 9152790 9268103 8943033
16642 8943033 8420358 8336585 8184122 7961957 7717436 7340610 7311758 6841940 6862928 6652242
16632 6652242 6590750 6527446 6065603 6270017 5861612 5892293 5729596 5601806 5379746 5241948
16622 5241948 5159236 4969663 4878439 4922621 4803887 4759558 4525871 4160313 4430920 4342995
16612 4342995 4237260 4106703 4012470 3972458 3662304 4149460 3642775 3832432 3729844 3670603
16602 3670603 3479847 3478062 3323761 3593341 3266596 3347390 3098707 3132868 3157467 3004961
16592 3004961 2841884 2701812 2517157 2731705 2500498 2725947 2469084 2632852 2541643 2560302
16582 2560302 2507993 2266243 2715166 2161637 2036702 2298568 2231330 2585736 2414670 2304015
16572 2304015 2059032 2004628 1722866 1746509 2253429 1909199 1798994 1686115 1897467 2010611
16562 2010611 1611947 1730242 1710057 1866373 2119240 1935464 1737398 1660848 1895043 1774163
16552 1774163 1635494 1413241 1404715 1243467 1178426 1473036 1355424 1340740 1306513 1113926
16542 1113926 1304800 1494143 1706496 1144572 1028529 1157909 1286936 1243220 1159142 1129840
16532 1129840 1026068 1409937 1148536 1002541 1159305 1178560 1358730 1028708 1344001 1269296
16522 1269296 823562 546458 728236 1027334 731185 950916 814880 1016760 989897 903943
16512 903943 764582 771028 1058984 789627 899210 805827 682192 1277523 827985 826471
16502 826471 643298 814593 887034 687127 929596 985657 447565 803655 633249 637381
16492 637381 594366 777581 648222 720823 905033 732600 591050 753858 904392 605513
16482 605513 672421 488870 672598 480240 689522 515506 817579 420097 464193 387676
16472 387676 494578 534463 400212 637717 428377 618134 548257 377462 374967 764998
16462 764998 539806 909525 477075 614350 673723 322942 371605 393796 418120 279314
16452 279314 548729 317716 719266 545508 400125 544418 457727 256438 692730 694351
16442 694351 740174 527476 536083 237999 316478 267197 319213 439204 311095 446081 211428
16430 276562 313369 671869 659583 462476 262555 38124 263602 239657 566697 401227
16420 401227 510093 363139 172161 104250 84723 123715 528162 268499 433000 213236
16409 465239 667453 426849 291296 531141 225245 192950 499282 -20684 422462 319639
16399 319639 317453 13295 504417 340912 252365 467210 293320 390153 345040 27944 379221
16388 379221 163219 134941 213968 347567 87004 200368 331756 120982 369931 -90119
16377 237226 -134135 -28849 91142 141810 448593 -155101 77659 333157 480594 365996
16367 365996 293988 152678 318747 111919 314404 9744 335903 367125 293902 504072
16357 504072 -107436 -29254 -12054 -102424 346510 124939 199175 310939 87025 180046 381613
16346 381613 407784 212257 284738 336608 63344 -103933 109114 -109890 523027 385040
16336 385040 -63668 -132281 199898 -30310 306475 -164485 -30184 4670 359828 218823 308294
16325 308294 -45103 78746 30260 -218512 -5030 -266190 258648 197529 28385 104812 -168910
16313 205029 190136 165120 120825 2871 -21023 118514 454451 24427 266639 182568 -108669
16301 127009 199631 119914 -107900 -9257 -215358 57391 94055 153522 -147564 -113816 113621
16289 253372 -177988 11623 325050 105605 -81336 582 -27115 -217495 -18664 143776 72471
16278 72471 30367 -110046 -149341 -31873 -54614 240319 -70259 208965 214575 95483 566968
16267 566968 175163 97897 81455 -16857 -115091 120476 181449 75444 -48860 -31790 92778
16255 450856 -78485 71530 34237 292381 1378 -98442 356641 -108703 -247182 -19338 -207759
16244 -207759 -56077 130675 103014 210340 283429 246736 -107540 -43256 539264 199711
16233 40184 -97061 90217 -29973 45639 -183399 14324 22009 93373 -161149 87033 -198241
16221 -115520 -299534 -102356 8537 -288142 -76625 -86022 -181598 -29061 -72884 55957 -46932
16209 -59834 -95003 72142 -283775 223944 -217427 277564 17809 420476 -238681 142158
16198 258640 -42686 97327 -23595 85550 -197837 311606 -213811 -119796 263707 222927 156789
16187 156789 -10703 19002 -184057 -150115 84118 166681 247489 68751 -153280 140357 142236
16176 142236 -147927 -163754 -144332 -26061 53114 112215 -44612 225381 106527 16960 174756
16165 174756 -139906 -135202 -98842 -50054 30516 -150098 96178 71293 -22060 -56614 -36982
16154 -36982 -24598 95483 79848 53672 9337 141134 264477 -100455 -7969 22533 -75533
16142 104637 23653 -190319 -53870 -12269 178404 57070 54220 30309 -93712 291819 76577
16130 -42234 -262399 -128495 -40542 -97622 -402572 -18307 2398 105121 186781 197644 59880
16118 104298 -32747 -77966 -173613 -31068 -157134 -271698 -3280 -272869 52344 -174615 -140663
16107 -140663 -95797 -20603 -186615 317124 218677 135352 167019 315294 128381 -55829 -314355
16096 -314355 -261225 282725 -149513 47310 -108489 -284178 128426 -99134 -294575 58673
16085 122857 -302297 -61674 64925 -142776 -23469 -9605 149701 -30899 -60403 -58427 22967
16073 63658 202561 179474 108806 -227357 156032 -79593 -202555 99196 230422 -101062
16062 90952 -160843 166743 -206679 -90893 -63964 -218188 110042 76786 -34360 -125535 -204035
16051 -204035 -69075 -174202 -202775 90261 -294782 -30975 247143 -2660 87054 49531 -286743
16039 -173604 -237154 -91168 -252707 -290131 -206662 -412994 69729 -211061 120564 -126163
16028 -364733 280137 -264981 -81442 -80116 207882 376385 -213 -181126 -53606 -168935 -33912
16016 -59478 -280756 -332369 -109580 238735 -44428 6847 18147 -67426 96228 -16103 49375
16004 245134 -17585 129400 13694 134756 -112716 492 -228323 -111558 39716 71281 291370
15993 291370 100152 -246264 -65961 -37509 144745 -10536 -107870 379249 -107162 187577
15982 217427 439077 625820 364343 120403 -115361 -33795 110741 108172 -217844 26695
15971 -398426 -175956 -49212 185838 269391 93334 311738 -77107 -3670 -16915 -92507 229706
15959 108730 -163112 46677 24952 105091 -230557 -202232 33967 11370 -82984 -155673 29644
15947 -33173 126547 75390 -89590 233486 -134204 -71324 346507 -436631 -523344 -26220 -171420
15936 -171420 168899 247689 -309568 -86104 17554 39050 -276207 130149 290019 -425123
15925 102457 -350252 -130198 391480 -110197 -288925 -217329 -184015 30992 -9001 -100618 132646
15913 32015 -12707 16097 -295473 -60151 -32876 -145581 -140575 -175977 -352116 110159 -73751
15901 76675 -143014 -180943 -47909 -59912 151869 -55042 -278631 -13984 -194561 -20331 -154876
15890 -154876 -476736 227608 279368 -167963 289332 -141255 -272083 33573 32567 199497
15880 199497 -157723 55934 -31812 -154174 64907 97115 20504 -105291 -172144 -250322 57630
15868 176914 89682 -210413 -223906 -113671 312488 86779 -571907 -153400 64082 48132
15858 48132 -138844 -148293 21606 -322576 168997 -44574 66493 71848 -285603 222279 -452470
15846 215516 -9418 -124250 -72951 161692 -49816 167535 -255685 79188 -105888 78641 15207
15834 -82070 -242196 -174564 119153 161157 -312138 114192 62777 -237131 -138926 159988
15823 368278 -96582 -63049 65212 -5288 323657 -39657 -87936 144947 30012 -196775 162326
15811 75206 122552 -158169 -56893 117711 49695 -100037 -114228 161264 64452 -52643 -17180
15799 -214199 -68982 80709 -133801 3774 -137347 39662 -397122 47446 123802 -25806 -94501
15788 -94501 -138304 155226 151146 -94569 -349300 55793 -127934 36539 89108 -81524 -531618
15777 -531618 -141642 -203898 -336587 -118797 -136029 -247243 84299 -83218 -31218 -147453
15767 -147453 -47442 -61931 -46445 -17870 -62492 -234899 -44448 -281699 146251 299296 251295
15756 251295 119104 268559 -126524 39403 -31793 60830 28023 -122211 94054 -74259 339387
15744 42649 -154660 268544 -69647 138760 535371 97050 -169130 21711 88959 -166910
15733 219967 92044 199692 60379 -4592 -185634 -835 -326789 -36968 -146214 333110 277977
15722 277977 -64718 -292598 234040 106475 10963 -16367 114132 408847 -30361 194385
15711 -103705 -33955 -150238 48203 303084 33682 -243530 -1057 -297792 81992 -11382 -260597
15700 -260597 -24926 -113624 -300343 198467 -103593 120546 -221742 -179649 -97222 160220
15689 186726 271759 -23693 -202502 -132057 -24347 167649 82346 175075 -402417 -114792 -185835
15678 -185835 147298 144068 72461 95716 -273004 352475 -250005 136699 57423 230384
15668 230384 346635 -81703 263782 -27509 -21278 -213701 -22648 -273684 -46928 -75955 71500
15656 -224877 -129146 144643 62828 95749 336532 -416336 140679 192730 -123382 -378957
15646 -378957 112065 162818 190330 -125834 -8599 -135091 161272 160601 -253032 -187001 62727
15634 -78221 161313 107319 193269 153360 223947 -135826 198810 -322146 92935 72570 -69517
15622 -42651 37646 347337 -137726 10540 -298776 227063 78771 -92147 -96463 -111239 -58612
15611 -58612 476163 -555624 109132 -93511 -383773 -132150 -61778 -218635 100287 69400
15601 69400 91064 368701 46728 77494 85892 96927 -244134 -54162 -134878 -206858 2974 267028
15589 267028 110557 -6940 -223938 308790 -50903 138192 130563 -83122 -135904 52151 10357
15577 -27021 -244289 -85946 -345505 -140308 9030 -61895 12507 13197 -217174 37900 48759
15566 48759 -27408 -92515 113547 44575 -32616 306933 174629 266719 114361 -124793 154787
15554 36426 -71329 -15867 -419000 39712 -250123 -48601 -89440 106885 -265827 35860 -144229
15542 -41344 63423 -350391 -20235 -158130 -33037 -186853 -236129 -207593 -111019 15502 9774
15531 9774 110566 -53064 19861 -243578 -32661 142151 84769 -119328 -114519 63041 141613
15520 141613 95876 159357 -81792 -79160 -97980 -14494 -254492 268156 297961 290433 209526
15509 209526 39804 197611 -230345 -73448 -74959 -62787 34738 -380317 7352 -243054 19418
15497 320524 200600 -67204 -99182 -68218 27674 -99839 -169762 208959 -39313 -48072 63652
15485 58887 -268872 -212840 -206933 -14160 138439 -45315 23660 14271 -333252 -75493 -51124
15474 -51124 28631 -264269 -225148 55721 34706 355615 -31464 115057 100842 6904 214505
15463 214505 202182 79686 259259 62601 -67319 -140931 -190905 -79732 352758 -198149 -47744
15451 5170 250495 80552 106144 74574 -152071 -195108 241428 -46378 -332763 73619 -100315
15439 -91546 91568 -126577 26636 -29608 18148 -142647 -21171 237352 169880 -280158 233956
15427 76166 70798 120015 144947 133548 -55688 236769 105934 84549 178827 -161139 306666
15415 -47581 -28184 -89565 -357879 -86812 -5353 46460 133022 50700 150685 -1292 49322 -35096
15402 -39778 -24785 248132 -63864 -106587 -291938 -318130 -144190 -264747 -75981 114893 -139081
15390 193461 132822 184071 -45356 216203 11578 -54646 -32187 -132691 59356 -47946 265827
15378 208034 274297 -207289 -24389 25991 -14939 -75449 245206 22138 70631 143629 -219099
15366 63832 -222145 -197816 343003 271348 -12265 -120023 -93820 4728 -48329 36610 -42500
15354 62794 59982 68012 98578 -55778 -12200 141571 41537 110134 -110328 154904 98993
15343 98993 50476 -34149 146182 114302 -82986 76575 300793 99186 7444 138750 41911
15331 -127153 96178 -63448 25635 65307 -125788 -18461 23517 -141515 -189424 131186 153629
15320 153629 192779 -371519 105680 211856 -35757 -2352 173216 111001 -92414 -174434 -30752
15308 -125744 250663 43171 81400 108726 -28818 29479 20742 -178072 66236 174055 -87972
15296 112151 233433 73935 -247732 -73756 -150052 294193 -139914 449684 278283 12263
15285 17844 -82695 458351 123266 -131538 -69170 239046 212791 377869 5502 307777 146298
15273 346262 60417 105993 -161659 -92790 106167 -142150 -29950 306884 -5233 117145 158589
15262 158589 -66283 81875 259614 28134 90601 171747 132717 107553 244785 332227 173036
15251 173036 287515 -62699 -1877 391861 1149749 1641130 1077269 1550123 1101155 317764
15240 304914 336841 102947 -76304 271561 265659 -93315 -19856 122584 130996 243689 327549
15229 327549 -90833 -225256 -10188 130814 185002 -25205 -85593 171780 301852 -50907 131951
15217 -12492 -38975 179454 133108 -37357 345344 -221634 107323 127102 249345 -108472
15206 -210753 67371 -75685 88621 -167992 -60220 136194 2806 80638 -40368 49223 82695
15195 82695 86698 -228270 99106 -80135 54571 274090 159717 -169617 24924 114709 186586
15184 186586 111767 -68190 106899 78986 -278446 32305 296729 -156063 204406 -74487
15173 -63919 54166 68901 95160 -25027 110191 51581 93599 137413 -5127 60350 61682 229415
15161 229415 214798 -126239 -72011 -4645 -173797 -153757 434472 142283 15290 -81030 81028
15149 -96043 7007 8368 191831 72423 -36875 -216595 -101274 211533 261472 90255 200666
15138 200666 -193383 257794 116072 -133966 -19900 -30674 434129 210551 183539 208521
15128 208521 283277 46016 265819 52251 130035 46852 111352 -285722 264881 325181 221995
15117 221995 294992 11983 56328 -60465 65104 154574 194954 126531 186921 175393 266687
15106 266687 61486 384900 240259 204754 99210 114779 105908 320472 57327 98197 -33903
15094 77272 135314 304487 309370 -187374 266584 54441 479571 79147 237034 284730 -57039
15082 -159459 543542 186845 282435 262655 -41562 -43054 183636 251018 229083 87472 103279
15071 103279 -87087 126778 -203307 242306 123291 150141 326125 34796 256929 357848
15061 357848 298057 224146 395187 314743 -4795 353496 -36094 254542 201689 73624 -13349
15049 -170608 286382 626564 206237 65863 301334 -10948 376350 241936 301542 12242
15038 463733 143523 304860 -74726 141519 200417 166226 287938 73510 203318 434395
15028 434395 -175101 255509 164512 -24718 -74100 289369 380116 185968 401996 224336
15018 224336 144488 415537 25240 567092 187408 148214 -75977 82768 190444 149597 18775
15006 348694 -156217 204249 101669 255858 150848 -60102 304499 318301 165302 375881
14996 375881 13963 92002 -180283 41321 162202 435065 139184 108790 357366 -58375
14985 97974 -193493 142804 158534 96033 227512 466258 -26903 -9603 258553 331790 203750
14974 203750 166435 -14443 365132 14978 114555 136862 -14632 174555 98889 184291 330654
14963 330654 451519 -8718 368548 483365 250248 15318 441019 128813 406994 -104513
14952 225575 104193 110198 299929 11274 390915 132958 596183 410168 362050 145822
14941 169227 232068 35312 145955 468383 507747 132528 292915 222200 104280 346160
14931 346160 110963 179475 338904 312552 -156231 259046 471132 -29384 -328980 430304
14920 167550 48206 266493 18263 279140 400497 264365 215480 154318 -24392 367718
14909 164890 375887 356207 338057 429749 42277 316871 316752 267518 585780 450397 388192
14898 388192 172156 16575 371429 128531 306349 144455 634782 445832 304681 296220
14888 296220 2540 542194 796887 258182 416925 387388 98458 472846 560997 556579 278673
14877 278673 398323 272451 216014 558243 292179 397361 502152 260154 252253 258716
14867 258716 342742 706771 -60360 417058 535147 341744 427645 158365 357399 414614
14857 414614 503561 277695 318623 284615 305941 54855 105877 664580 437419 423534 667295
14846 667295 289019 402590 458136 646251 354008 545746 499271 362230 446194 271409
14836 271409 502526 337111 576306 367283 501749 269848 445553 570411 373425 441278
14826 441278 573792 295981 709015 565715 743861 808553 139422 484846 335533 494519
14816 494519 835300 593661 647765 426758 563069 242473 480276 588050 415131 411541
14806 411541 537648 678448 342061 398074 491647 417673 607022 535897 182737 538355
14796 538355 423509 535815 629133 624358 746023 368379 831953 518899 590161 440446
14786 440446 756983 326955 750081 312780 301733 285365 117627 564779 500840 677774
14776 677774 768727 738738 946314 248383 586582 284181 491645 626497 587894 536182
14766 536182 708332 468195 343680 618645 524704 343843 640844 474728 937730 943729
14756 943729 542826 610657 379794 707837 494768 703849 885079 652416 668335 607126
14746 607126 828746 820840 439532 608510 1137328 989633 451092 652677 1036905 767903
14736 767903 443092 662072 443580 584898 808752 678313 758114 654242 407965 722698
14726 722698 781810 419355 698213 514843 779209 765489 738962 509046 837898 559191
14716 559191 602998 734192 740526 880679 1244484 693759 753878 957889 710480 963943
14706 963943 875284 770081 815321 850521 725647 590723 787856 1039093 1050100 722307
14696 722307 1056088 838165 1034641 865581 910385 1077380 264626 926339 714447 772314
14686 772314 1072952 1005668 846200 1059950 894483 878526 964438 790593 820338 1001558
14676 1001558 1269245 1073085 922934 980058 952013 1056671 1080864 985694 1358410 989750
14666 989750 1096797 927402 1131070 1168551 1088062 1313580 794929 1238209 911069 906400
14656 906400 1495821 961191 689685 1389122 974552 1069079 1536970 1290974 1152194 1021596
14646 1021596 1134767 1060045 1495338 967076 1581669 979672 1570185 929674 1313102 1448007
14636 1448007 1586251 1287238 1349318 1467190 1649872 1265363 1400093 1541759 1386052 1224192
14626 1224192 1469653 1395821 1433345 1316513 1422334 1226412 1509868 1547155 1745501 1440313
14616 1440313 1349214 1525807 1271534 1425504 1394714 1318561 1699566 1913226 1821211 1506539
14606 1506539 1715947 1288989 1938936 1325889 1447481 1624265 1837789 1596466 1902108
14597 1902108 1726998 1686623 1701254 1845186 1563033 1616140 1831923 1777944 1843878 1745053
14587 1745053 2062485 1744207 1845469 1610129 2033533 2070061 1903643 1912708 1830634 1963536
14577 1963536 1658476 1822429 1889923 2165154 2164064 1926507 1665072 2342229 1810725 1902550
14567 1902550 2230541 2198281 2487622 2573562 2378083 2597431 2526167 2594090 2457436 2861756
14557 2861756 3219465 2866274 3225931 3409484 3596794 3845844 4444128 4981518 7042963
14548 7042963 10651926 20254372 40867729 44791008 21654361 11902697 6948379 3723679
14540 3723679 2755664 2305313 1632211 1928659 1682745 1761874 1908389 1808690 1939770 2054313
14530 2054313 2038503 2089954 2495147 1907366 2035744 2357494 2296246 2481050 2361674 2207787
14520 2207787 2668898 2332716 2708650 2405472 2690315 2489153 2592969 2526069 2588754 2785139
14510 2785139 2675336 2418983 2405430 2992356 2570881 3021785 2922271 2760830 2761759 3026933
14500 3026933 2934312 3074094 3172938 3307715 3255398 3293965 3283754 3816192 3263132 3687680
14490 3687680 3294101 3637637 3421762 3851006 2957324 3625087 3912198 3618979 3834702
14481 3834702 3565936 3811941 3869127 4215490 4022658 4253555 4046458 4072908 4279391 3993747
14471 3993747 3996726 4293085 4419904 4329789 4324246 4217219 4503726 4613697 4831345 4694784
14461 4694784 5045624 4741804 4814715 5134507 5263070 4971489 5088005 5130474 5299986 5274503
14451 5274503 5406770 5549186 5244516 5425323 5613926 5766642 5776906 5890369 5694706 6101518
14441 6101518 6061845 5920696 5879123 6544532 6160041 6297488 6347197 6476488 6681991 6713952
14431 6713952 6803307 7062888 6767760 6735151 7444421 7225317 7313946 6930385 7737382 7627393
14421 7627393 7801114 8059726 7920568 8122104 8174117 8252095 8264048 8452630 8532793 8730131
14411 8730131 8868114 8966072 9111266 9159417 9177204 9706288 9523321 9765621 9934290 10200581
14401 10200581 10400280 10787790 10598750 10975184 11169401 11220020 11231315 11651480 11592003 11982646
14391 11982646 12251884 12428588 12533074 12802676 13092910 13123890 13815217 13511105 14114159
14382 14114159 14156595 14724501 14734089 14675557 15015956 15662823 15987067 15846251 16447962 16449883
14372 16449883 17079768 17483700 18115058 17988324 18724021 18885058 19549222 19726152 20264304
14363 20264304 20669313 21274078 21463639 22037252 22481410 22607856 23573335 24081780 24463252
14354 24463252 25551174 25662444 26190736 26826669 27455193 28085957 28800292 29928067 30320286
14345 30320286 31291662 31988154 32827051 33882184 34664103 35696380 36634382 37470280 38704078
14336 38704078 39337791 40918355 42037562 43318632 44356996 45804771 47090407 48988162
14328 48988162 50080664 51977398 53146680 55048270 57028102 58809011 60861187 62946859
14320 62946859 64986119 67695004 69982550 72870673 75173247 78099822 81027686 84253035
14312 84253035 87593876 91043947 94755872 98389519 102995051 107238189 111722080 116924485
14304 116924485 122157832 127258299 133245806 139598018 146238362 152839550 160171066 168130431
14296 168130431 176700029 185421252 194897851 204808337 214957844 226167537 237465894
14289 237465894 249848042 262921974 275851858 290082143 304164724 318978277 334222491
14282 334222491 349866157 365385979 381132551 396244849 411220415 425326154 438117686
14275 438117686 450002483 459569615 466273777 468929850 468745797 467898643 465317161 460586905
14267 460586905 458520465 452634736 444506841 434700938 422844489 410121904 395643942
14260 395643942 381083603 365519763 349518886 333246997 317283816 301927998 286971816
14253 286971816 273658650 260197730 247057490 234501470 222882290 211169330 200559673
14246 200559673 190996130 181511471 173273054 164758322 157018785 149442203 142554384 135930404
14238 135930404 130765807 124709131 119479862 113990558 109021809 104289194 100150166 96673227
14230 96673227 92480284 88881039 85391795 81940475 78877237 76295329 73199310 70365866
14222 70365866 67598768 65573671 63228338 61471426 59267904 57040557 55315700 53288675
14214 53288675 52311210 50843167 49225781 47118677 45722978 44824420 43136113 42791594
14206 42791594 41430114 40231577 38753413 37494538 36410254 35872493 35399894 34257863
14198 34257863 33240117 32203154 31325992 30207134 30165986 29327532 28481861 27747250 26999502
14189 26999502 26186330 26076832 24941579 24527466 24118996 23412483 22667224 22660903 21785492
14180 21785492 21543871 21277433 20676125 20163049 19771899 19508888 19021216 18519307 18639621
14171 18639621 18195688 17867205 17246904 16955718 16893843 16392958 16132523 15778800 15416737
14162 15416737 15193163 14897851 14874295 14735318 14370633 13865680 13651434 13483190 12908242
14153 12908242 12765988 12588378 12438898 12361750 12337028 11881646 11758705 11806522 11378172 11322198
14143 11322198 11216965 11051023 10557919 10692123 10290999 10144172 10071726 9984152 9830287 9768032
14133 9768032 9563791 9488221 9195692 8889450 8739830 8773263 8779857 8589000 8558137 8512773
14123 8512773 8002957 8184986 8136065 8356548 7852364 7792819 7779348 7544725 7572734 7490901
14113 7490901 7154824 7097144 7183242 6965605 6648635 6646771 6591396 6203588 6406190 6310662
14103 6310662 6471255 6046734 6108429 6160169 6591852 5749305 6193172 6028140 5848626 5986212
14093 5986212 5969413 5672582 5444520 5733638 5476804 5483362 5441767 5107804 5325417 5135052
14083 5135052 5219729 5255038 5566236 4858235 4913085 4742949 4806428 4805995 4664326 4818960 4525505
14072 4525505 4690509 4815954 4090591 4512599 4225394 4417229 4392809 4275853 4589225 4224225
14062 4224225 4339407 4284988 4224972 4249109 4204674 4065511 3815283 3929896 4347105 4072788
14052 4072788 3562521 3439177 4079698 3584969 3878906 3662394 3710275 3584730 3474092 3177541
14042 3177541 3264953 3126093 3291553 3069563 3242037 3139679 3537198 3420169 3478969 3363994
14032 3363994 3290190 3430148 3111130 3098867 3231169 3514061 3177679 3185981 3036595 2674867
14022 2674867 2881830 2902503 2681325 2862021 2856804 2640822 2678996 2581962 2703694 2729140
14012 2729140 2380734 2652884 2539501 2320768 2643543 2607253 2572216 2338755 2109852 2512938
14002 2512938 2066160 2373775 2167847 2370726 2405732 2463819 1943322 2286906 1916320 2425669
13992 2425669 2096692 2342613 2308575 3199594 5344380 12644285 33731611 47056457 27306680
13983 27306680 14675346 8979771 6185255 5124531 4341192 3693230 3199344 3010101
13975 3010101 2734976 2566387 2583329 2529948 2735070 2518065 2630342 2783173 2343832 2263103
13965 2263103 2234789 2181048 2117531 2251289 2500717 2365419 2274276 1860933 1888150 2045286
13955 2045286 2047257 2065110 2153641 2155380 1921927 1945160 2069346 1870035 1972721 1789623 2016668
13944 2016668 2022049 1736336 2008673 1539791 1854254 1502503 1869970 1723455 1842953 1724211
13934 1724211 1464731 2080180 1468387 1731999 1664164 1611746 1616958 1594804 1512340 1723076
13924 1723076 1591834 1566287 1649552 1707956 1733023 1625067 922349 1556607 1526074 1690142
13914 1690142 1486406 1605531 1475579 1755749 1340150 1558879 1576041 1139582 1443538 1401107
13904 1401107 1259341 1418069 1526139 1437245 1426939 1489467 1589676 1143993 1118813 1254565
13894 1254565 1339166 1141148 1356584 1301362 1524529 1525778 1621079 1398185 1371531 1368586 1167266
13883 1167266 1411385 1000403 1262862 1141952 1256875 1292532 1025090 1091928 1175493 1423670
13873 1423670 1256905 1104377 1133147 1257364 1367656 1186186 1034503 1266608 1089642 1180049
13863 1180049 714650 1042199 1320982 1047013 1047297 1106168 1195140 1236460 1165910 1144500 1332286
13852 1332286 1443882 1133124 1466766 851387 1263395 1076760 946206 831989 1238740
13843 1238740 957727 1108675 1175094 1336840 991847 1238615 1037244 1053312 1093876 986201
13833 986201 1120508 1046924 1151802 1125684 985535 777221 1078371 974290 1064253 1103791
13823 1103791 1000805 1155758 1025776 557165 807656 1065511 764641 761282 720850 538768
13813 538768 963121 867169 623018 1163960 629585 977924 648555 666247 730628 864933
13803 864933 951929 1061872 801376 840814 819334 848303 629879 871336 764272 872057
13793 872057 844334 694571 968273 730321 585387 663173 740257 813271 576074 888995
13783 888995 457509 851739 799358 532757 739391 1099369 729353 524134 317496 589910
13773 589910 854147 824897 745690 621650 608003 685217 916184 852697 847379 627558 655326
13762 655326 634527 829765 516506 862510 558935 533895 410976 572922 582623 997086
13752 997086 520706 766668 690450 902063 547452 784022 454646 130577 691839 523958
13742 523958 309844 686693 459380 842209 611887 895145 553029 378558 595308 744257
13732 744257 579157 421454 418799 529455 451007 570053 676209 287719 201322 516294
13722 516294 802106 584142 338249 883390 614863 629060 299927 532109 774503 787262
13712 787262 578942 330166 447059 718489 525512 539516 748181 675714 661423 626650
13702 626650 561142 331945 592590 499727 511012 533648 638849 583519 434195 750038
13692 750038 808551 509003 556279 380675 667876 355868 389822 63970 551650 447252
13682 447252 744041 219743 211553 567385 433294 423762 851511 478826 453195 544603 297284
13671 297284 418384 701125 659480 650457 365652 482981 327157 634689 384950 454979
13661 454979 729921 319802 712849 546994 741661 355332 344912 491906 366170 631796
13651 631796 359999 218848 284908 411056 647933 706482 272206 295462 357216 476500
13641 476500 952675 369707 475333 262786 424700 625198 191396 574889 116062 509512
13631 509512 172501 575799 556352 325027 462951 97261 481980 252139 338496 101337
13620 394765 335505 280219 312509 377835 449323 790566 460298 646314 298064 358452 -91621
13608 355181 294896 634541 357684 443792 512408 166628 543016 32806 513829 267430
13598 267430 345265 479174 419665 555003 448974 396369 177383 507540 315759 646455
13588 646455 46869 452994 448166 805718 447019 317494 762464 428685 373621 177693
13577 194250 474600 234970 613430 420516 427064 271082 345310 244896 348211 207569
13567 207569 670845 221186 131411 148668 547710 562450 100048 327160 590201 -35858
13556 -17415 267757 273694 472866 578859 -117493 322158 289739 310939 548527 362981
13546 362981 220548 526759 243135 223906 284393 181448 201633 280126 123569 374840
13536 374840 244216 271169 129531 420625 98302 337903 722413 428023 410305 -24038
13525 331679 502086 329835 400713 214076 231888 177408 322504 61937 350628 361454
13515 361454 33408 581591 356783 291848 507736 30897 326147 280847 146687 232268
13505 232268 144433 524891 193959 303718 400934 -3151 303984 282697 240697 418010 366893
13494 366893 243306 336290 279713 298134 296194 268531 449587 361873 305090 210181 624519
13483 624519 201502 315093 555321 335775 117633 216820 77125 239015 106198 81978
13473 81978 182667 120036 9579 333153 152584 154718 539660 260688 441932 175258 211634
13462 211634 265651 260660 160564 237459 344477 286794 14842 161367 89405 636769 145446
13450 93526 99361 356672 -142138 72199 -31436 -48360 191989 110657 525827 188013 251626
13439 251626 -43382 291063 535361 151504 169950 256844 330814 426978 646145 -34509 255284
13427 541885 38977 232306 211090 263693 482709 284761 265648 408060 538188 172278
13416 455771 201889 37836 23244 343903 253733 195872 81347 543912 4939 143263 199467
13405 199467 117550 -113411 248564 362742 170034 181598 87672 416154 78974 411612
13395 411612 200154 515086 -75415 207129 524236 -238280 529104 45050 115377 126618
13385 126618 149823 239605 397306 -114641 193745 291240 178820 30223 -53175 214752
13374 221763 111347 300754 8697 -24940 69394 31970 -108436 389381 308007 116397 162439
13363 162439 373059 405348 347585 33445 250671 384707 179140 393009 -15332 -23877 97370
13351 234422 234756 230123 186880 200368 681908 203907 225879 412536 299072 287211 509174
13340 509174 176420 322872 256952 263404 11125 211732 117904 -69900 355906 379652 396897
13329 396897 73722 -109261 166288 -212199 198718 214190 165197 110687 406545 186061
13318 373761 29547 388315 10100 28021 145598 97312 273763 -303497 421034 387432
13308 387432 136473 92851 171848 -270990 85204 209366 -275614 -50488 93904 40088 321894
13297 321894 286981 119679 27073 204152 290403 647948 264523 -12001 179127 432319
13287 432319 137356 129622 38334 63824 130401 111559 34689 416723 93179 220041 237042
13276 237042 213698 116293 280571 386887 210829 288683 155920 111866 170288 457923
13266 457923 139676 36941 270311 -41482 283477 463299 -62223 74895 15379 40562 77082
13255 77082 276027 15053 282705 183388 51847 328042 262167 53890 175624 6950 229943
13244 229943 119486 452747 59919 215541 64373 96777 -179562 -186349 1470 376185 136149
13232 -75464 358130 103570 52206 85212 331918 -36880 31480 496284 158377 101696 48325
13220 341754 -149158 91626 243867 91200 15269 76792 242354 150714 -2794 88734 -51487
13208 77106 211095 208133 33901 -113472 201408 160532 296598 371361 96060 -19761 -127711
13197 -127711 -63957 126113 -161261 205070 -35975 313514 64609 27902 36149 -166631 30084
13185 -152838 408474 202479 156318 142367 119251 87306 128726 -182884 -69783 278923 215996
13174 215996 147796 199614 317435 -162105 222824 261428 205253 9866 155821 417002 181572
13162 199897 80561 -186989 -27846 251106 242928 -124156 11320 252258 104538 418709
13152 418709 16029 177000 -137984 149855 218297 -160904 -116807 69327 -101975 -15884
13141 30707 42110 116074 146887 352659 282069 -282557 161308 165112 -31469 278406 99950
13129 285262 283353 199536 200088 367875 432214 70610 71128 214539 -254424 -23437 265607 53628
13116 -255435 258517 -151143 42155 235163 -91392 -200550 -39391 361467 91103 84424 354145
13105 354145 274827 117099 27368 430970 171798 142912 3712 -298685 210080 -40906 43685
13093 -197967 67251 99621 208554 -149402 310485 -54646 58955 59456 -121290 361481 22798
13081 -89090 12543 -103700 96041 51912 197036 88875 173853 326062 157058 262240 -32654
13069 -42419 -82744 17223 86670 315565 9587 173248 134027 -132427 351823 12805 371446
13058 371446 -94802 98624 379366 134365 173339 -75194 324425 -133036 -43696 347450
13047 19251 132268 42519 412152 203828 338312 -115904 -28400 -185083 198632 89392
13036 -224839 24561 -104473 -175413 -20096 -172563 145133 88349 97949 200956 -157613 35833
13024 124953 239814 125919 196703 -49031 111982 -24470 79210 99018 248222 438018
13014 438018 231539 134102 -210725 74738 124739 337502 -129928 -272271 -21969 -68673
13004 -68673 -193235 543300 -69878 172245 -312166 108965 -104219 -186481 231611 -152675
12993 -58019 80099 508345 -151558 108356 96696 -184171 -139159 -197392 -74799 99672 -171054
12981 121208 90435 -85001 -139192 149845 -48088 84393 304033 174767 127277 61668 222904
12970 222904 215689 203071 121759 29234 49847 161745 162939 -132173 -127254 -138781 157464
12958 -311320 -220223 140290 244522 134761 14822 255826 197498 -95183 -264904 98493
12947 -70902 197361 340853 32641 -35169 261950 35871 -64211 162353 -55203 51178 100700
12936 100700 117023 16666 151477 -20730 -178834 74813 -1699 56212 60194 -46078 291946
12924 -132937 303660 187272 260933 340975 257625 -2123 240022 216853 140078 -6949 -4185
12913 -4185 186305 71766 250581 -8469 -59516 -217944 -54988 138723 -40125 -194659 -33772
12901 309588 -69611 139301 -97391 158306 14673 87933 208639 -39157 -105401 -144142 282923
12889 29022 194317 -52325 244584 -268691 -67808 -203237 -68879 32428 76490 26870 -196209
12877 296798 75743 455938 138242 -269947 250186 -133694 -222442 -159434 -236218 223387
12866 324922 37094 -90324 7741 -6616 -656 -160818 35264 -268866 45959 -11731 141034 3990
12853 -7570 82866 28281 50993 -48557 -92612 133658 12722 235303 205236 -156722 88375
12841 173064 -79090 155514 57010 -212180 255441 183964 3942 60124 -279839 -39751 -37983
12830 -37983 211385 -188311 -158177 86412 -88100 -143271 48801 158170 365550 163581 -108720
12818 138653 159795 -158680 101968 115250 124179 303507 -244298 -63923 -204126 -245343 259447
12806 -100361 152442 229342 11231 -156424 -78087 -78860 11371 -40520 260360 -156366 102970
12794 -191939 190383 -79534 -17532 -116886 -19914 -185772 330057 -222529 -136776 91923 -16962
12782 -101812 297088 12571 104785 292761 -85211 250643 -88588 59174 384160 154857
12771 117410 -54393 136383 -13188 76133 -20396 260239 -27892 97949 -182234 169739 195665
12760 195665 17017 -3191 232436 163673 221981 -2895 185698 415284 -85655 -54597 122745
12748 -22020 39215 158091 -197442 -170680 95819 134393 258942 -192069 -241173 104318 264396
12737 264396 -207176 100808 300901 -8009 -167152 322963 -35338 84169 67529 -163250
12726 343754 239642 703312 104545 19181 -158084 -93173 -660514 -34181 -94184 178063
12715 22963 -58471 200171 -80209 -209849 183184 202531 387178 13533 234696 56835 34863
12704 34863 22676 199327 220841 3166 407634 24206 205611 -113980 -53403 187269 192195
12693 192195 89892 161616 40505 -296783 -62131 46380 21944 -79449 -46635 -197934 -459471
12682 -459471 104355 -49440 48379 195707 -74158 221398 -262664 365789 -376177 -231535
12672 -231535 68767 76838 422178 231278 371947 279669 -50978 -225998 -220279 11107 211996
12661 211996 -32418 -47270 120789 246836 416910 -323638 320676 249526 462880 417613
12651 417613 133121 160364 210139 285672 -311319 365827 197448 7585 -16104 87686 4903
12639 58731 -217104 162690 19946 108274 269861 137850 251111 374865 -267711 230781
12628 279706 111658 73997 72812 -26799 210918 317173 155608 422394 211986 58797
12617 39523 278389 166734 -100025 75347 163750 -11550 -29626 15046 -77024 -324514 -7634
12605 4999 43311 -79894 -183379 -287105 113278 437482 150543 119730 321459 9741 172190
12594 172190 36996 40881 96064 294405 -38896 -87802 117339 262571 174695 -109181 -1681
12582 75016 -43595 281777 74874 -60557 478882 -2981 -25374 68373 13083 79645 325521
12571 325521 56132 -11475 -28716 -78623 -40294 82663 -28302 -254694 -7509 183914 343511
12560 343511 -31876 -188616 9721 256752 -22529 -260264 -67161 91325 -6799 73265 -39277
12548 -32789 118997 -74389 260506 226403 25490 324931 27772 -136013 196138 320966
12538 320966 148102 -2193 15477 -300389 -457440 97160 146632 -204765 114873 -80330 182961
12526 -80425 4099 110278 79637 -69884 -288505 199097 108072 89832 79980 -159079 55415
12514 377617 -28154 -191846 144965 25021 28180 65122 -30600 152853 -79167 48075 -402552
12502 -18189 40028 127134 172922 -88874 -217936 -173110 214661 -58269 -39322 -189263 -15317
12490 237628 5141 -34437 -262307 -44008 85944 -60762 -27990 69591 -52190 50122 92085
12479 92085 303656 -127277 -147115 23300 -304786 155944 121980 386772 130250 -99410
12468 155236 271282 -120445 -28893 -256457 -141595 -151124 364665 -16788 3761 -103755 -62586
12457 -62586 -379815 281396 -16930 75107 -222820 -47230 -207750 79575 22157 176838 -188133
12445 -73945 -149347 -253403 174054 -86704 204917 -60841 202091 13997 187177 -163916
12434 330563 -268475 -471903 -83324 179132 11212 356067 159100 164882 -166912 218190
12423 242639 6414 142690 97485 225951 -131876 -154927 -67771 37209 -47028 -393700 396800
12411 317562 -132487 79751 87341 194992 -56274 237402 -152288 400963 15445 -38794 89336
12399 110605 70920 -393914 -75503 33969 207831 28116 -200541 84636 -157686 -22824 66600
12387 106932 -3088 -96587 339714 66818 -272331 -271529 -81749 184636 5091 64932 426236
12376 426236 68348 -104663 135576 74326 95843 -294783 -141427 239095 -141439 -93425
12366 -93425 8494 90706 -61577 -15108 -112654 241748 -2062 258018 -35909 642 -29938 125294
12353 10483 234559 167775 68966 -151695 125502 39626 -224419 90571 -4257 279949 -256138
12341 236411 161883 160681 149129 -127510 124563 -273377 -221443 199261 165144 -281843 -277414
12330 -277414 338146 183688 -288784 -315278 -146935 82579 -169346 346135 -47151 37732
12319 248579 108358 39394 18385 -41712 17349 268405 278602 -132839 197845 -398356
12308 30625 103665 -240565 236915 -206085 101088 80672 -2878 -201892 160121 199277 -71016
12296 284889 -378362 -74725 198193 -134747 -114901 397067 -9276 200793 -8747 117422 36049
12284 -30614 -165418 97312 -7873 170165 318589 99521 37157 290019 209042 282494 343245
12273 343245 475124 274218 429328 -74643 187784 17056 108988 -187980 188939 28982
12262 258935 -49249 146182 -209202 -23861 236170 219071 54295 35426 247639 25187 86625
12251 86625 328577 -309850 33905 52486 216532 179215 310518 118702 607227 40111
12240 -99699 54718 -53695 -49427 35341 -42805 -58653 166089 62875 280248 173830 -107164
12228 183621 130111 197261 -50029 379445 430886 316054 117011 530512 474337 -31811 228128
12216 2012 -115135 327603 225901 -66471 200626 -45885 -180613 112718 -21912 451499
12205 -21111 190294 403028 -149540 292055 399939 -7148 132852 104589 354591 -98222
12194 154155 221538 94610 181314 278265 -66351 293391 116750 -209964 -36879 312831 496421
12183 496421 560129 -67275 322425 145338 84698 73565 -94709 251137 -50814 193294 -34761
12171 20860 335433 268201 100190 -74608 119694 332275 -47480 -65847 59832 229053 -159010
12159 351403 262436 -176231 114928 257538 14044 -29487 26937 -160432 159396 306527
12149 306527 -25039 237185 -58625 111450 -117907 -136914 87657 22582 -150829 -45673 -4612
12137 157476 103090 -83608 102345 -9639 110295 -65918 137156 143398 133418 -47444 -93628
12126 -93628 112969 -52292 131277 126064 -103467 -17148 26691 96154 205674 4845 -87618
12114 43077 -12529 306130 -83164 20607 -43893 82646 30522 -260668 195893 67979 132522
12103 132522 143803 214357 -146409 -297695 133681 223620 -296640 -110643 -208757 -101246
12092 -335175 65737 -225468 -66531 -175322 9257 357889 -214273 -83279 254070 68433 -67209
12080 150584 472468 1032794 2341358 1283099 563396 -220711 352579 177278 102708
12071 102708 256809 39058 208419 61631 -189372 -53506 -172529 91499 181698 -172925
12060 164139 147853 279686 392487 287553 133576 91927 101407 99448 -67625 248243 183437
12049 183437 -190224 -143524 -144727 -104689 81275 -123167 57219 -148309 58124 -133634 -43345
12037 125881 228904 17350 232297 259336 -83996 22596 -236983 -20238 -294031 -45080 51532
12025 187714 -90555 11515 56753 207762 207624 153056 50819 3924 174445 109224 321516
12014 321516 -266947 142588 -170082 155398 218483 172843 -40296 6323 51945 -126064 24917
12002 131053 -179827 84360 -114006 -130498 187796 25933 -180618 -181330 -383964 -238167 174234
11990 -2368 -142428 -202473 -44874 -160382 -95221 -115051 -149284 -251136 -127288 150503 -237411
11978 -47704 151325 -126806 50565 -57566 70608 -15053 6225 -196251 163744 -143902 -58889
11966 47489 -58217 166560 219826 -273928 -57275 151636 -168541 129377 102266 57489 -123044
11954 140313 58980 67525 228721 -99772 179647 233440 138837 646798 -184490 147834 -45167
11942 -183399 -1516 -80361 -87334 -219581 -80428 74712 -121716 212441 -302032 -17942 -300868
11931 -300868 -280107 -284415 -47324 -48859 105450 9678 178276 293716 333542 226005 56288
11919 -216781 189508 -16868 -30791 104573 541 103706 -16711 192146 316293 -31755 -276041
11908 -276041 198886 -575978 -271297 -147015 1407 -72917 194393 -19238 199909 122418
11898 122418 -84190 -8234 -158490 -77702 -13089 240181 -83095 -211876 5165 -79957 -102523
11887 -102523 -140518 -271846 -5657 -66342 153585 -70294 28536 -284503 -23882 -22381 253363
11875 117926 21177 240251 -80738 -210917 31595 133512 115029 135066 -13863 -17221 -159478
11864 -159478 -91288 -136023 205160 -312820 272039 146154 322303 268944 209704 -184495
11853 70569 -71745 -401260 -221146 -135176 118502 -387659 -259 313262 219483 -20528 83817
11841 -31025 -250664 -190628 -107783 -16642 -68877 -435389 13549 80849 117374 -103051 -117519
11830 -117519 269876 45484 157534 247165 22911 326161 1848 -114655 -173551 -224063 319611
11818 147260 -167494 -212482 133653 -162866 -76556 -86265 178055 -32983 -248768 -70789 -21308
11806 -177301 -82873 -187661 -134675 19569 101172 -493352 120021 -293983 255670 -8585 170710
11794 233919 133257 -330166 -16317 63511 -223328 -68414 148804 27187 17610 267474 199293
11783 199293 -317510 -151436 -77652 71292 -153596 262885 -225913 123559 -105076 -116254
11773 -116254 66748 -322836 -197647 114715 -395557 118743 -28565 65641 -43785 289088
11762 -64128 -91022 39701 -116038 135760 40955 -216246 129684 336923 215842 123087
11752 123087 184997 241077 -24362 28159 -61228 -6513 13832 60506 52783 24181 227953 356074
11740 356074 -309685 210575 47800 -105657 124550 -253813 -131472 -144994 -117768 -290600
11730 -290600 83655 3081 -136605 -192243 307957 -65864 -36645 -46242 72413 173532 200454
11719 200454 -45833 -214155 186985 -212080 -18475 -216593 48047 -122957 -113632 -405121
11709 -405121 242328 79574 -53447 -61899 -287403 -234976 87218 364182 119545 -44467 -240323
11698 -240323 45542 -137242 11981 282097 43184 -109418 -61830 208911 -9513 381934 292683
11687 292683 -27851 187753 36310 271650 216627 423707 32860 125721 210019 -13335 180640
11675 -30723 99966 358211 201054 35667 62705 -120551 164850 -17530 37342 360059 -98928
11663 65008 -231243 -93951 -15187 -83364 78179 89437 150067 173945 -60048 -76076 83187
11651 167597 375382 -172809 202574 56981 -28111 -133287 -86837 -8586 69291 -82601 7567
11639 290497 213019 231561 24572 -29132 -277730 44717 -271968 -244351 80415 90251 379149
11628 379149 -55223 -138919 13288 394401 -4005 -142705 -125635 -93349 43113 42176 256539
11617 256539 33110 -11088 185827 -34687 -164250 -345639 -69506 186314 -47060 -121938 245565
11605 53699 14638 -132036 197449 -217426 281346 -256328 -200012 397840 -101828 -159352
11595 -159352 577 111969 423079 244286 -122595 267685 21988 -144757 98650 -6594 82740
11583 -67356 -18580 580793 316418 129511 348714 67907 -156675 179336 36886 190111
11573 190111 191247 334224 -24404 311497 -181436 -10595 248436 108028 124132 -302927
11562 -54826 -64489 164920 290007 12523 90682 228221 36305 203234 -18712 -293345 194485
11550 107232 -447852 61967 162455 329600 -227159 258757 210784 10355 129652 -8523
11539 6473 139453 399764 217021 107889 264630 446792 4703 8728 346086 18071 131202
11528 131202 333443 157659 245267 -238684 155383 255054 77802 67557 295661 -90072
11517 -310516 94277 226408 -157438 -85767 275397 179673 178757 233107 145546 208454 95955
11505 455433 516559 5571 -131815 -248451 -312278 -148708 533247 288152 -354055 416688
11494 14203 186099 -28463 -76769 -35863 501642 -96572 -55227 108749 167328 -76334 178101
11482 171600 124590 36853 183133 199059 63715 38102 204239 -79678 265500 348412 118808
11470 354866 288402 -49162 -112659 119906 188966 562 154799 16543 29648 -93967 -97164 263511
11457 -78397 280720 51056 550774 271480 112372 211076 -47549 30470 353442 77920 454736
11446 454736 242122 47752 138986 -147691 -46557 -349994 92576 111406 62965 75679 -104132
11434 220899 241436 -135840 22002 -24731 120863 -243590 -178190 -48133 362451 -39242 77195
11422 7836 161418 -931 119611 264517 195077 329853 82129 51277 244703 -165986 376625
11410 138659 20636 333852 -39392 28681 42984 101146 -5205 214419 111489 -169030 141320
11398 433577 97750 210735 49274 -10067 41691 42608 67684 -26092 -20588 -135188 63961 267480
11386 267480 156705 36418 -122817 -43641 305008 -111605 -354531 -90277 55655 -82893
11375 -104951 -288069 262414 -8983 -3831 271409 -66046 -60252 -9234 -41251 36100 -58540 -165213
11363 -165213 -194494 -28491 69982 -168188 -14975 -303015 130386 227890 -132586 -9703 -212114
11352 -212114 65928 -45810 1738 297784 -40868 169015 -450189 33481 36882 -16198 134103
11340 112494 -173510 -76007 205088 66791 -9511 177768 271801 19212 176728 229548 -39584
11328 -89363 244627 -355077 -48618 169340 124183 -28373 15864 -263585 301487 -218062
11317 96979 136036 -127895 -243851 -286010 24831 342893 295297 23009 -164376 -155024 -220614
11306 -220614 -265345 116120 57173 -337498 143985 -78158 -48583 -115988 -190418 -115682 -161901
11295 -161901 89118 208368 33623 -236554 -238318 658 -29711 -149717 -423846 3342 27777
11284 27777 -154923 -372814 71429 -179165 -147903 120897 151424 153564 -194290 -54226 -31997
11273 -31997 17276 60306 -247954 127819 22380 -258271 159501 91045 -320951 -3536 -63146
11262 -63146 -311947 -75239 124638 349380 103694 40083 144062 -221825 100878 55627
11252 55627 -202465 19387 9350 -46813 -25741 32733 23831 -213328 24822 221142 83288
11240 -43735 -82003 -2640 21779 -182820 -368282 -267398 -115250 -316499 112148 -141774
11229 -13100 -43701 -233608 391559 186803 -81713 -183675 54363 -144024 255146 -254966
11218 178899 -172808 220458 -58096 -57134 181524 100171 -10925 -108126 -9600 27619 -191060
11206 -376170 -72448 288892 105805 248528 -100827 122217 -76358 -37949 -192126 -208962
11196 -208962 166726 108268 -78681 116364 218785 -64420 120199 -99577 -79659 -184695
11186 -184695 -361741 -473320 -425289 -363048 -239484 23476 -299682 -30255 -144701 -354615
11176 -354615 -21397 -14595 92821 -51368 104211 65438 381017 -77812 -110668 -6348 -46920
11165 -46920 -134469 51171 -395989 255050 -1423 -64764 85737 82203 127889 -305398 -260056
11154 -260056 253623 -131925 2298 74545 -406773 279037 -46758 71539 -127523 -281880
11144 -281880 71380 120028 -178045 50308 8650 -228750 -136125 -195153 -8342 -89668 -367723
11133 -367723 4538 315086 132999 136841 44529 82025 243114 10944 20466 35824 343290
11122 343290 -108974 124895 -24981 108962 -259502 100146 -109025 46928 172243 -130782
11111 -16072 -142495 556829 -188787 -103008 315034 -114147 317121 142271 186252 288912
11101 288912 91537 275660 -79926 133623 -5052 379255 198832 -91622 668686 371695
11091 371695 -120677 34097 333349 235116 38057 -25191 154477 201899 245235 -117411 141389
11079 337621 227646 190922 197122 398412 126113 312922 140252 315262 400766 587125
11069 587125 366317 331166 413435 195179 285901 439168 263654 445303 502510 600461
11059 600461 524745 722138 97465 667762 590594 707423 366680 843670 305004 772874
11049 772874 775994 723267 639219 843332 809422 945211 1007638 804575 558766 631491 894297
11038 894297 492992 545017 479250 898930 560524 471821 617771 710893 272378 785770
11028 785770 743387 637354 1047565 890976 927888 703722 627074 675949 510626 625849
11018 625849 277056 719848 563357 675387 403074 338965 445617 464703 391349 377114
11008 377114 638255 349495 557909 819314 713151 706736 604981 339637 905977 545164
10998 545164 542110 905250 1155783 686717 659339 692120 741428 944765 953656 859727 953260
10987 953260 571795 978607 855886 989746 1035985 1268575 1152300 1216813 1067395 1144078
10977 1144078 1942052 1625249 1764523 2293517 2732202 2343794 3006088 2835892 2491970
10968 2491970 2567255 2268918 1814580 1765043 1584490 1644505 1249176 1478879 1424482 1878987
10958 1878987 1698924 1863305 1669610 1859908 1818739 1415297 1109949 1386572 939802 1058845
10948 1058845 548660 684277 344727 120059 399495 387782 267206 32234 237102 344980
10938 344980 131534 220581 211241 147549 5309 144324 162242 437109 -69912 137965 127828
10927 127828 226238 107995 40039 31780 -66784 -249644 -6574 143729 178910 -226520 -60465
10915 114040 47231 273570 -182438 -172579 409651 292620 -58731 107626 -2528 59326 153446
10904 153446 -49858 81230 -153720 88460 -172127 -491537 44707 -256353 -269062 -52931 303336
10892 -363450 -164711 -180516 98574 -194419 -100116 208212 6473 -94153 -238917 7812 -96563
10880 122179 -73566 -115704 58587 -72845 335890 304632 -105460 -151670 -101939 -180536 66574
10868 -161688 -119261 57240 -154207 -105494 276939 75507 163152 44358 69256 108541 -274418
10856 -91174 -122596 383825 -37241 -408420 -39761 8666 298293 -51903 -121550 199903 -251802
10844 97160 -24619 272943 155868 137546 25709 211610 -35373 33527 -187861 -751 -165987
10833 -165987 -159253 156023 -536 16180 -270024 167303 26622 10042 -84775 90388 -15836
10821 -34670 240007 -108000 31708 -179698 -216955 -40365 -78321 -85948 -46120 -415862 -264657
10810 -264657 68182 191383 -23392 -228252 279393 -80938 189529 -97478 -233123 33715
10799 -160980 -122058 -185004 41452 231927 -41962 44108 -179399 -12678 -302370 -37670 -263793
10788 -263793 10965 -216704 -86509 24804 -185311 -55841 -56935 -187872 -143791 41701 -223650
10776 168847 -29950 -99284 -114666 -18297 110522 173958 -13180 55959 -330425 49251 -126828
10764 55390 -261665 -150919 -125038 -71332 -52107 260903 -236970 20840 -69034 129427 237491
10753 237491 14668 14789 -14288 230602 -58071 215921 -113903 -190462 -122686 -83355 -165815
10742 -165815 -32378 62053 -80450 249040 -89362 163635 24304 73074 144715 -106734 -117706
10731 -117706 -206 -156612 -162148 98045 112515 129978 263599 51277 165734 -170306 -50556
10719 52725 -300937 -250247 108749 -216632 -112594 -87856 -229733 -208051 -13192 -87689 -319864
10708 -319864 62147 -160579 109783 22478 16249 126698 -255008 -145267 -159239 -200092 -266779
10697 -266779 -177461 -8819 148004 12798 -395159 -143812 209779 26132 -138029 -65929 -139453
10686 -139453 -22114 -149633 224626 -87289 193459 -217207 -185722 59292 -501026 -121545
10675 202852 -57677 164790 102983 299129 -190794 181217 -92069 -175574 81718 -195869
10664 -142308 -243392 -258187 -65706 56862 76408 -54449 109616 -353281 178842 -59362 81501
10652 -262450 270088 -144694 -334488 243631 -42604 -172904 -47576 -95993 61493 -57193
10641 -42096 -169909 -197981 65193 -348656 162281 -18929 -3722 11083 151035 -144961 -247800
10630 -247800 -225343 -75303 -382455 206912 64440 -132311 -332395 9190 193044 -60729 -233970
10619 -233970 54564 -197643 -62543 -140262 167711 56000 78084 -85445 247255 340823 90488
10607 -129940 -387498 76201 -216304 -94598 153877 -150029 214575 -435874 -173884 -72810
10596 -118604 -47135 -101508 -166122 -50917 -116922 251912 -84026 348463 -210967 -82046 217356
10584 -199888 -157020 -178077 270667 57922 37127 -146004 53377 124859 -365182 186091 -162104
10572 155694 -392269 -273699 99158 -62955 -305711 -85271 66982 167457 187308 264949 31620
10560 250795 95187 420404 427044 10837 -142544 29256 -54094 -82286 -103785 -1826 29664
10548 30032 13695 -25132 -253889 168706 30204 108407 -61145 90260 -226622 41318 -422305
10536 114549 -297636 24662 -233833 -59687 -338422 110414 175765 257156 102594 -37234
10525 -185056 305606 -10579 -241725 -101778 25218 -142679 25813 -119097 13310 -33765
10514 5223 133569 157709 81605 93452 -10885 -62819 -346835 -121115 -13767 244920 45287
10502 -156808 -159119 -26733 -57490 -112897 -32716 -213437 -316449 126072 18022 -92111 -4613
10490 40080 -96757 107398 -7537 128527 315459 67839 -124356 249029 352982 273553 609994
10479 609994 514801 504669 226498 23205 92480 -58700 72577 80778 -211960 53005 241812
10468 241812 243671 274512 29410 -33986 70317 -93128 -127001 -91307 129208 263642 -120611
10456 -124946 -144519 3494 55277 58943 254207 -220434 281729 62792 -29755 -121640 -8013
10444 -213630 90032 13568 99420 120411 -126794 -78727 254078 194169 -115114 -60204 78072
10432 -54256 77895 106916 215086 -92077 31704 -94986 -41198 151953 -37070 -292225 254674
10420 -72271 83918 17950 -161578 10673 75269 108846 -210573 -71977 21483 -36440 -117708
10409 -117708 123363 290931 65433 -95288 -220506 103084 -52546 67831 32673 23395 -216812
10397 -9334 -74384 82049 -43127 144947 127679 159188 167320 91241 157282 58428 11842 87454
10385 87454 25652 215248 208612 -43504 453339 174107 -130498 155390 170054 142328 185323
10374 185323 113934 135540 269517 295968 135668 258611 56946 866642 269965 693618
10364 693618 324879 324909 42201 553591 387836 155462 408524 330 250036 212478 313507
10353 313507 164063 547167 506037 625749 729723 250921 606599 372386 593428 256810
10342 74711 529554 50515 142907 222801 594121 563068 307176 10986 -6568 -20435 128378
10330 367280 73471 -62477 -108337 144067 -143242 164829 109417 431409 447324 367573 -289810
10318 354925 64354 231768 228649 272919 270433 125113 431768 55606 -1061 -222974 230792
10306 27574 -117040 -300630 32648 -102940 27231 -46182 55538 -213928 -122710 221166 -246721
10294 -203855 58099 -81475 422050 186586 148230 110535 54426 -23150 -83894 -127795 -34020
10282 -200459 76424 118394 31629 125647 4493 -57400 -145403 -60378 -297630 98604 -90413
10270 -160654 143169 -158915 258612 243009 233804 29661 -7699 -120316 96590 -65189 168837
10258 254915 413336 60205 69265 -130260 436086 58079 89436 -97353 -121497 -466022 -348357
10247 -348357 -17349 12727 -377205 -50156 -474084 -20838 -125169 -241190 -270085 -84336 8341
10235 31843 63709 -216843 11938 -350667 -68413 -98985 -217140 -113830 -1712 -215875 111812
10223 144703 -285040 286278 60576 361941 -187170 -160412 345146 -169916 -181532 -182061 19129
10211 -184090 -93649 299802 -61844 50001 -26348 -151161 -73671 60445 -299247 -248555 -450984
10200 -450984 75550 -89876 -87415 -125428 -78657 -288911 -83130 -276813 -138732 199500 96394
10188 -126466 -11181 -278545 16516 -214594 -218972 -143704 22497 -8095 142858 -28607 157979
10176 -229977 -157351 223097 -341631 -92156 81435 -143649 -93816 172975 -95562 79731 -40805
10164 96295 181251 143435 -168749 -132996 -177697 28143 -196985 -115875 98869 101548 289248
10153 289248 -167841 -284513 24678 2738 341892 -174139 -186967 -138391 -140993 60464 148180
10142 148180 68523 -61091 144974 -191167 -186454 -63959 -138511 216428 -267953 -236294 35237
10130 78132 -248082 85965 -43757 -68009 -135918 -1073 27729 60453 -98778 -155772 -70273 -174457
10118 -174457 103056 7184 170672 -51744 33049 242332 56544 -49211 197149 -15997 -236791
10107 -236791 205162 -157422 121003 229659 -349255 165837 -34770 -114633 92148 -224233
10096 -42602 -79419 385280 -224799 180764 23440 126008 -553483 180080 17320 -63748
10085 -74367 153596 -222746 -289211 84744 -267622 36877 -340993 9849 -100687 -48201 -115228
10074 -115228 -353565 -35922 -244688 -38613 -148034 40671 -62664 -19115 -176529 -58570 -395357
10063 -395357 -344391 -207427 -185578 -52341 -24667 349391 -66386 166974 -155016 -382 -227482
10052 -227482 246896 132166 -28630 -87431 -121821 -68164 -141329 -154749 216114 346320 49380
10040 -69846 -100939 -106238 -306847 -38202 147497 -79508 -281262 44745 41797 -101727 33051
10028 -347624 150022 -9864 -4665 -249985 39951 -12627 -229762 -56413 -253982 -10133 -71430
10017 -71430 -57210 17680 -284881 -158139 -100341 387236 -158710 6549 -88672 81043 -69718
10005 -67141 -185251 177034 -100520 44505 -53790 451447 -94055 144035 -31696 -147300
9995 -147300 -132584 -43201 -2075 -365694 -281360 -20415 -204885 -13336 -113643 -263520 59055
9983 -142200 72117 -44175 -84631 295027 -520883 -120280 105977 -226377 -27586 -266248
9973 -266248 -25785 -2925 -86124 232021 -130131 -53965 323227 -214355 -164192 -193892 -66634
9961 114051 50010 171306 -381857 40720 -95669 -55926 -24342 -36705 -301086 -183345 -211727
9950 -211727 47859 44066 -56865 121887 -195346 -109424 27855 -138815 -4748 -87837 193698
9938 -281814 -72788 73511 -94295 199274 -224329 -277221 -279776 -233353 -345468 39785 -276254
9926 -72799 83589 -98148 -130429 102428 -109495 -25227 -17818 -2771 -129725 -108415 91328 46071
9914 46071 66154 -439562 149868 -46222 -88386 -41387 -69497 -265510 131587 -166586 -2555
9902 -287785 -121452 -159198 4231 -138462 -194523 -20572 -369546 -125176 -537360 112024 -143452
9890 -140946 -78072 46850 39163 -176992 -60846 59218 50176 -143072 -358266 -317342 213453
9878 -378602 -195947 -104731 -193997 -161214 -223907 173558 -122669 -46477 136455 192054 -222378
9866 -8314 249721 257321 -2030 -178268 -232246 161791 -19277 -307819 103530 -29073 -260223
9855 -260223 30516 -56181 -78215 -440 -15178 -174069 -46925 88201 -6952 -97201 83108 -39497
9842 -113830 -24779 93222 -42564 71904 120373 208627 171841 -10348 -56818 205330 88884
9830 -113816 -259051 27363 14844 -82593 75786 -90843 -177346 65433 -297057 -139227 10606
9818 148531 -14229 -75159 87255 169766 62042 319690 31240 -196692 92095 -59840 -307998
9807 -307998 -114912 -49099 223154 1667 1865 -57593 -348425 32237 131813 -88549 -18679 -221809
9795 -221809 -50671 208646 -60202 127381 -250726 -43650 -79275 -38460 128555 -144739 -3112
9783 -48631 -82705 164333 -289949 199321 135453 -314006 126286 -171643 -42901 -50991 -213746
9772 -213746 -227378 -207315 -136651 -49419 -68507 -62789 -136540 -21252 -26537 56469 -307340 93346
9759 76398 -118537 -202683 -121202 -36812 -42315 8834 51825 158499 -185822 -245497 -81321 -165094
9747 -165094 173454 118289 172251 -106667 220046 -1131 -134450 -207444 154050 -208099 -198888
9736 -198888 144034 -380508 25448 -135182 16733 220256 -30733 -135418 20141 -173911
9725 -29031 -230117 -40879 -169227 119939 76237 -247001 128501 -222537 -205144 -175676 128102
9713 87694 -93718 -560239 -268404 252365 -43961 -77122 77692 22858 -263431 -205273 224398
9701 51974 87345 -138881 208856 -42268 -94665 -274508 72021 139500 68694 -20069 137904
9689 124041 -244636 254550 -50463 -77770 147681 -92320 -22196 -2599 -231446 150628 -227741
9677 -83530 -140085 -18910 208774 -35655 -91501 15554 57329 30905 -64929 -242181 -210070
9666 -210070 -241428 74136 -278532 -292393 -204927 -215519 -182489 -248123 1184 -287092 22302
9654 -197825 -308795 -254742 120654 55615 29634 39455 101610 -89909 -459503 238898 -63004
9642 -262406 -358093 -125887 -65088 50309 -129313 -179209 -18513 -189690 -311198 46333 11614
9630 -24380 -98996 359627 -201573 139499 26764 -65689 -194478 41883 -169825 113882 96801
9619 96801 173934 -212485 -213600 25701 213418 -174762 -265041 -78508 -326418 100845 -76989
9607 -322122 -62734 373160 -203435 -86096 -1056 120502 -220150 -193442 54253 -179821 -18177
9595 234120 -179612 -39730 -20489 -329889 263207 -50494 -55270 91806 129172 103310 95192
9584 95192 -166628 102213 -129125 186921 34641 -168028 82218 78229 160965 54040 -14496
9572 -98989 -209101 6257 96871 162549 -71115 -53448 -41335 -50536 -154030 -332996 192841
9560 -253587 -278220 -254008 111925 75213 -102016 -223033 -41736 -131240 256750 -104091 -21654
9548 -243959 -153101 227960 -20213 -105748 -64279 -323839 49448 -81625 -120143 -230752 -9321
9536 -127742 22349 59514 -390599 -141393 168395 200525 -78307 -411990 -186947 29200 -310623
9524 -254235 -45543 -261521 -344705 -277064 -427863 -238578 -28414 -74199 -81752 114985 -128731
9512 -68466 96430 147955 -299021 92805 -125154 64860 31524 32607 258230 -359607 20817
9500 61638 59619 -12951 171914 -123725 -377429 139093 -5708 -391586 281285 -1700 126306
9488 356016 -159837 -47469 89008 119860 -63948 -29177 -278552 -277596 -138254 -99480 126412
9476 92381 -67768 256919 -138079 -423301 -120482 -262432 -310359 3210 -129618 -83737 79525
9464 178869 -26131 -176916 82025 -187161 61226 132956 133505 -152832 145388 -49451 -120467
9453 -120467 239739 -178578 -190738 -163517 -190503 -376333 120972 -325750 166799 -127929
9442 79697 -21950 30850 -405164 -118165 -240684 120180 70040 -94944 202839 102094 -199062
9430 -53771 -28754 -17273 -292479 -305578 -148103 -321163 -43043 121714 -98224 -250289 -138339
9419 -138339 -6918 -237628 -56776 40643 239355 152907 66765 -39909 175466 139313 -251850
9407 -193 -46321 290593 -203574 -162977 -242185 111915 -279752 -313817 72085 -147824 70493
9395 -133710 -302351 -182775 -154511 500 9426 -420834 194238 -273457 12734 -357428 306428
9383 6162 40021 -154428 -185768 71496 65427 -179001 -57621 -230966 -177706 -304079 4984 -303618
9370 157486 360131 -115766 -539873 -199174 -176872 65433 -144877 -206829 51977 -160882
9359 90990 -331814 176903 -27731 -29202 148798 -173421 182702 -199851 -77223 -162869 -161105
9348 -161105 -97898 -85065 -425787 -112409 304924 -22942 -225486 -184020 79322 332937 -137499
9336 -167092 163350 82133 -130353 -100357 82823 -126284 -175523 -172276 75227 -440749 -290123
9325 -290123 -75912 272052 208938 -298561 -116794 391947 -95136 -142841 -200939 -13596 61566
9313 93132 -30739 15470 141 -50024 -90139 -81789 -204818 -170106 -116228 113117 -536047 31842
9300 -103509 -357570 275550 -113005 186429 62182 -230284 -157829 -351980 -6738 -65381 -217752
9289 -217752 -82240 -267884 -150969 32838 -257409 222122 -9334 -29650 129537 -136302 189721
9277 -360915 -157478 -219035 53689 -74621 -160908 42259 195864 54875 63507 -253930 -325994
9266 -325994 233031 5608 -12534 125809 203185 114998 -437349 -18458 -236260 278608 86361
9254 360005 -177944 -48494 54325 -87927 -55156 -265671 -334032 -167093 -116427 196420 -91938
9242 540091 -109364 -239143 171295 -148420 -434587 -190047 -210080 -75364 -118671 -103607
9232 -103607 -238790 -66526 -31051 9979 -15567 -111328 -93046 52827 -234784 326271 210263
9221 210263 -102985 -246149 105691 -1452 259306 -93642 113589 235146 -271699 -122189
9210 76977 -9335 21708 -44648 -210441 49439 -58281 36612 100911 -217025 -193811 -16151 146835
9197 -73002 -245517 -39591 -131829 211158 -257771 -21797 86056 45499 136686 -168237 143075
9185 5003 -126739 6220 194954 134973 -150747 -248860 -143763 -1369 17690 -374779 -200411
9174 -200411 110946 -39069 -166215 -28786 -299216 80476 -134994 417059 -261623 -150866
9164 -150866 -169112 -59202 -43110 -189639 -13351 45561 -427892 -233617 -56633 -33313 -247873
9153 -247873 -66001 -11626 -62719 296018 -79629 58509 28406 -78391 -197575 241744 -262869
9141 -185687 -106683 -523164 129549 -52728 -206696 -391825 45115 184696 -196670 3105 70704
9130 70704 127334 18718 -469879 29340 -190183 175663 -385482 -90199 -389989 -318123 56379
9118 -21713 -262412 94744 73845 -104739 278057 -43180 -52498 43525 80877 -128235 -25938
9106 -249959 -112070 -145828 -242742 14003 -160725 -9018 55218 26454 -145739 -143788 -7518 -64058
9094 -64058 -425772 125781 -145556 163233 148903 -206987 -384650 237103 78342 -191296
9083 -216451 273959 -203131 -90986 27243 -53678 230632 54154 -178667 -286475 -148883
9073 -148883 562744 83665 101887 -142264 75625 21744 -91322 21893 -148774 -215608 5237
9061 55909 205277 -135207 66938 -407025 170523 143414 84745 -15746 -457905 -235641 -103184
9049 -104177 -201831 -26460 59468 -159154 86590 -129560 -13561 205349 -311845 -10238 107505
9037 -27803 -150463 142448 -241983 -622568 -106633 19717 299961 -201090 22142 -362890
9026 -91960 -312262 -6437 14968 -239660 -326811 -24854 124166 -220789 48875 -47419 -125122
9015 -125122 69381 152426 27889 22056 -161161 -105132 -242175 14960 -143320 42785 -74037
9003 -169305 -90701 -241044 25885 -254605 -595923 28490 -90855 42358 -175760 -262493 -291450
8992 -291450 49543 35282 -223639 -90061 -120598 -317345 -249897 17897 178075 180172 -387764
8980 220649 188183 -190269 154118 -141176 -229207 -289866 -120769 27854 -95516 -36409 -317593
8969 -317593 -196512 155475 7092 -133007 31551 -112307 97182 -303665 -266974 107201 183141
8958 183141 97896 -422962 -186621 -114092 24662 24210 -140411 -227313 99478 -178413 -186572
8947 -186572 30255 -28139 11208 -11254 229793 292663 151597 -91395 -201453 287618 -37039
8935 95869 -24644 -148997 -199793 -188665 -31168 123516 79087 -153137 -86952 256840 -32368
8923 311937 427203 1658209 1751147 728994 -96833 454987 144056 -162225 240979 287700
8913 287700 99600 -218731 -29652 177424 -52201 -208801 -256463 -141432 -250388 -3987 -51818
8902 -51818 204849 -297991 -42379 -185211 -13607 -143829 -158330 74141 -142243 -441195 16458
8890 -53253 110074 195371 49007 168440 72316 -111125 104284 77765 -190459 -133946 97230
8878 155029 -369854 -62590 256234 -466363 104801 -192119 -283770 157202 -336246 180004
8867 46703 -266258 -259460 -253581 32772 -158668 -249762 21009 -362388 -123936 -103841 -168515
8856 -168515 32717 -195170 -274802 237562 -16609 -144741 -141011 6114 -210361 -396819 -1980
8844 -46479 -29111 46638 -257366 140958 -22814 -178476 44682 99699 -248833 252896 -304908
8832 -55647 353553 -201132 -157449 -500507 -217998 48606 -247482 -44655 -25110 -6916 -176946
8821 -176946 210896 111934 43967 -71097 188997 -211480 7224 180018 317191 34014 -114650
8809 -300195 70900 -2427 -142790 168993 309 -59084 -100670 -305431 -201563 -160604 -208155
8798 -208155 -67307 135093 99447 -276460 -93431 -14603 12954 136706 -11817 -314414 -13600
8786 -260485 204706 61553 -94948 -141959 106915 -131628 35796 53775 -119574 -320374 55432
8774 -478896 41021 106676 -90765 193118 -237012 -169605 -30821 -2376 205446 -190536 226662
8762 -247056 -153716 -164909 -146944 36945 -255287 361463 -339715 -218895 -3177 -152828 31405
8750 -107325 23157 -204707 -10452 -356938 -254890 11804 8544 96001 -6190 922 -469319 130242
8737 132730 -162923 -101978 -92767 -231131 51682 79646 -181637 -125725 -12305 53843 49134
8726 49134 -66993 -454574 53104 -54291 132418 40469 351283 -49361 -334645 -71318 41416
8714 -91977 -16972 -4194 253731 35273 -403119 50567 308834 -202937 -209715 102771 -308036
8702 -14853 -71713 -80865 218155 -137637 -72198 211288 -72166 -10138 -302837 312348 277054
8691 277054 -46025 229704 -505417 -340152 -160729 -46637 85149 -182379 -279748 11104 14397
8680 14397 -120623 635096 -85152 -194831 -146953 107669 -208452 -33401 -158465 165642
8669 167338 144278 -254014 -326683 87227 -307263 82845 -175499 -60902 105247 46078 98579
8658 98579 -72570 210478 69906 335173 -182594 -343628 -299318 -238740 111711 -186492 -90863
8646 -200453 226121 -36269 144811 -128950 31631 -353003 -96064 -31224 261285 115171
8635 -238995 -185381 19456 -303336 172269 -284843 -151398 148296 35995 -231742 -39025
8624 -103453 -177130 18214 -154893 -392132 -39959 -154801 -411103 204996 -70182 26883 -344782
8612 -174094 21710 -279416 -252159 -177700 -101583 -238044 -52970 -300506 -277435 -29194 -338543
8601 -338543 -244634 -62059 -41286 -128246 347152 -365315 -145021 44418 -11963 -149139 91879
8589 147104 45138 -171171 -188388 21378 -125140 -339651 -117556 28289 -447 365431 49280
8577 -131779 -39490 -149051 -164350 -130276 -112641 65377 -10741 -31288 -190585 -198091 -183886
8566 -183886 -253434 187015 -113220 -313727 233888 172685 -61167 -11673 -195039 166202
8555 -58018 -120023 93265 -146719 254170 -311086 -38879 -281440 237436 278191 51494 111983
8544 111983 -85692 -207871 170430 270794 -695 137407 -384798 -303025 -123400 1835 -246989
8532 73006 -170494 -108826 5841 95279 -24999 -58515 181499 -178333 55862 165310 233811
8521 233811 -60337 -135037 29011 -218713 -100879 -93759 58572 -123767 -276940 2344 -255181
8509 108403 43679 106202 61555 -206259 13649 -28995 74694 -98424 340940 56567 2519
8497 -137867 -36311 10114 -143773 -9641 -174702 -111978 -112323 -144306 -227162 7402 206380 269566
8485 269566 59560 34013 -260991 -97364 -137223 -82524 -43934 -66680 -7696 -130974 -45430
8473 89204 79469 -115930 136402 38386 -16235 11639 40639 -86910 2299 192435 -33739 -34232
8461 -34232 -112965 -246404 25721 -275382 -318345 174560 228409 -427371 -67274 -181459 97506
8449 18691 -205279 -74583 10585 -196913 85906 42653 -381209 -31976 -22971 -280 -122147 -333205
8437 -333205 -131436 -471316 16674 182552 -36076 119735 81883 -128451 -99296 24637 -219827
8425 89903 -117317 54021 171470 -102433 -29327 765 34311 154339 170805 -301194 -11754
8413 110059 -66701 -84079 -391527 352741 21814 136785 -319862 -238737 -364333 50557 -329108
8401 215790 -45739 -33558 -38088 -127379 -129423 -60074 55381 -3266 86275 -200747 -72544 -82735
8389 -82735 -275529 58018 -85195 219106 115048 520 -57534 -186362 -315302 5346 166608
8378 166608 40884 -202489 65194 -28482 -356894 140659 39659 59372 -105037 -8963 -189433
8367 -189433 168490 7886 -10383 157809 -169783 119423 23656 118458 -107866 139993 -252181
8355 -12788 -99629 -53163 -24421 -156068 -84152 104693 -269926 105372 19466 27810 -70770
8343 197947 -36679 -29042 -419670 -193518 -107180 -198499 39604 -39670 159589 109032 156610
8332 156610 -222138 -106436 -78755 -114787 173966 -337991 32765 135352 -261965 -79044
8321 -165118 173693 -153587 -173990 -64841 -10749 31918 55747 -519062 71162 121542 -303107
8309 22424 127246 13563 -42615 -31649 36315 -194449 -196701 -26501 50919 417430 170890
8297 112398 -322886 -62688 -145199 -257893 -182928 -607460 174026 -61750 -507389 222435
8286 -142185 88190 -29821 85105 -15808 73186 56364 50985 -103729 -95955 -30822 76522 -7186
8273 46266 124781 -87595 -260196 -115032 -136570 290865 240900 -282460 -70177 -432618 -96088
8261 -166229 -43975 -330365 -45440 158844 -106628 -276484 -22696 101898 -249767 -363317
8251 -363317 57573 30943 -69705 -269348 -93888 -166871 -68540 -105404 -284803 -159525 -33867
8239 261192 -102720 -48859 -125354 -67251 -181302 -154908 -97325 -208121 3350 -119738 -9916
8227 -7757 96282 71333 -175483 -288108 -235639 -108536 -366386 59004 -375023 -27458 135826
8215 -81844 -74999 197912 -125546 -347913 -311898 -239936 193803 144450 -73878 -12980 -154814
8204 -154814 -198431 -374274 -10381 -30706 -146100 -45107 50817 -249009 -13173 -66875 -250354
8193 -250354 192717 162524 -283631 -185960 126087 -120463 1972 -13544 -14963 25841 64446
8182 64446 -64558 259548 -48312 -252334 -101693 3955 -2163 287407 -215743 73859 -272657
8170 265711 253843 162518 -111157 -197082 -58982 -350458 472363 -83280 -96452 72727 -87508
8158 -101340 17877 2199 15628 27145 -122883 -57483 -108785 33679 -8177 -497 -143106 -618056
8146 -618056 -183415 363961 157682 217695 -16065 -225568 -132630 -225169 40597 -212262 -8919
8134 218747 -82554 216573 -137637 390920 209749 -197170 104927 -187531 -175096 -159865
8124 -159865 -271346 -12844 186697 72968 -11421 105244 108504 -133460 1425 -304539 211748
8112 -260246 203890 120313 136133 -89208 -35320 254636 -13556 -121014 -107204 -1592 -181556
8101 -181556 108680 39204 -51734 38309 -60318 226333 -318430 181100 203288 -166399 -229302
8090 -229302 -51521 -96114 284907 211553 -210459 -46586 37872 369308 -50150 207381 -131673
8078 -23663 80947 54686 69781 -76723 72395 333040 19723 291535 -73107 9974 96118 -145693
8065 71344 -301979 -201304 -502798 263437 -58257 34650 -90414 -311287 -112814 -64334 -123776
8054 -123776 -85154 -9434 -969 -108082 -107820 150077 96826 -197745 107812 175536 -193096 -47552
8041 -163662 -16915 285075 275705 -233783 -456863 -104844 -131007 -47495 123324 -134112 -32124
8029 208267 -314611 -185739 148216 -72770 246073 -22577 -239115 194664 452305 -137618
8018 -60605 -504487 -279646 -199050 -22004 44760 -288022 -81612 132887 86547 192811 -36586
8006 -220008 -286739 273803 61339 -96640 133913 -81595 -278792 -135345 -253639 -310014 -43337
7994 -327564 -41216 -83971 50076 -249486 -6461 -54957 -137160 118258 -109456 67132 16828
7982 -101245 283929 -252880 -100190 -214885 46010 -118987 -131430 130100 -123171 -418449
7972 -418449 -60390 76710 7796 104096 32109 -449858 7130 -82763 -333548 -140667 -123338
7961 -123338 27486 -128763 -63924 -125072 119564 -223156 41254 -238986 57498 -265078 112367
7949 -2546 -20273 47992 398718 86734 -77294 215662 -73226 148997 -10150 180564 132825
7938 132825 185223 107365 69432 32275 20467 -113466 237182 197905 42576 290375 -26031
7926 -27502 96098 146069 210337 249845 181145 22924 -106002 -46137 -8400 97936 -2081 -191832
7914 -191832 79485 39416 -36224 -270152 -141462 40786 20571 311309 45511 -327038 143182
7902 6504 43958 321110 170113 -335055 -272628 -149592 -192603 46434 -43788 22838 107192
7891 107192 -29429 -57353 -158511 -246513 112491 -46283 -89317 -235729 46973 -9971 -148312
7880 -148312 -39616 -66860 -71071 261 -259201 -84130 245768 -221406 -343746 -43925 -232354
7869 -232354 -106723 -411799 -129096 13363 -84269 11445 22970 -171437 -121106 -155952 -31549
7857 -173943 -82587 -180665 283686 -288980 -18804 113601 -262623 49791 -486346 35515 -197534
7845 -42791 -138190 96392 59390 -177452 188822 29458 -181357 -16431 51128 -43109 -176347
7834 -176347 -117173 -57398 -44738 135404 -319742 -281768 -120868 105177 116125 21568 -185661
7822 392091 -134114 -15010 -28575 71075 -209245 -87897 -58306 -212317 26974 -44403 -185136
7811 -185136 -102833 -133336 69225 -136079 -157266 -76647 15375 -71859 8417 309675 -212048
7799 -251188 40152 53186 -71207 -149350 153781 -134765 -65273 77547 -499464 125251 -72852
7787 143063 71925 -358546 -169184 -77464 -185487 -210986 302227 -80027 181609 9896 -79871
7775 53640 88628 147770 80832 -162522 35260 406629 -570012 48610 -105072 19849 -44889
7763 40014 -11976 -33992 124491 -19265 -230385 -215464 -105789 36506 -184311 -98872 7067
7751 313939 -199721 -357722 1585 57209 43133 -67169 103026 191490 -17841 93522 -233297
7739 1401 -105934 14720 60983 -121209 91263 -81326 -246423 280354 -101188 133305 -13284
7727 -359693 -179120 -36201 2123 1646 209751 117245 -269091 -154924 -278695 -157069 -59976
7715 -61097 154443 -459217 71284 -58372 -75198 -210482 -87573 -239531 -120994 -120234 78396
7703 340381 -160167 21919 224744 -94240 35282 -117798 -26970 108244 -92262 86029 -66538
7691 121202 242468 -143238 -68400 -190316 -141358 -260574 394530 -170502 217333 -472805
7680 147674 -20231 229784 -181320 -195843 325811 -106363 51568 204360 -367065 355083
7669 25376 118748 81628 -119313 -78178 -135393 122858 -137330 -214229 -1681 292064 -133664
7657 326607 67126 168726 -37103 92573 -149147 52855 63564 -100778 -383834 -79952 278263
7645 -94611 184960 -218361 -7931 64411 206414 -133416 139443 16208 326315 -208427 -100136
7633 -506377 21365 -63770 -240237 94971 54749 191261 -94751 -64973 90231 35280 -54204
7621 -292629 89339 116843 -534639 126593 -23 131829 56541 168685 -296346 271020 -100269
7609 -14327 98991 -302742 -121392 145891 -312558 102606 -97166 -239500 -331483 251769
7598 -224417 1301 -228543 105376 -356345 172529 -259296 34326 118310 118690 -30944 12585
7586 150635 57871 -103562 -211475 119186 159304 -4359 -19688 4036 -62115 -56932 188526
7574 -22898 -394525 117122 -97004 -57384 3078 274029 -149446 -121674 -222963 -22128 -164248
7563 -164248 -56650 -86035 274090 14333 -396933 -27780 -72747 -33831 -87438 198211 63546
7551 168634 -81916 205528 -157228 -29953 -238827 64841 135703 -76014 -12991 299448 -226866
7539 157958 1707 -48345 30065 -1293 34102 -64759 -339826 -154428 -53737 184297 188990 -58971
7526 204693 -252734 53415 197725 71892 -187884 111955 2428 -114338 -271114 -203241 323952
7514 -135292 26364 -190895 64738 -69232 -54109 -193536 158748 23604 -28189 -152154 -140064
7503 -140064 -408704 -328120 -228194 31506 -108400 -304606 -114304 -327559 24236 37026 -164303
7491 42054 -435009 -421307 -150214 -56391 -310119 -225965 136096 -53712 -159594 72750 108605
7480 108605 21485 80884 -1879 -17257 -115031 276860 -27511 45885 -331931 20845 -237476
7468 -52664 -182255 -335906 143733 -147231 -80020 -97160 -144684 -148905 -178796 340555 -93754
7456 -78066 157078 51999 24234 380687 107052 -40177 188444 7534 -64655 23466 -48288
7444 -119967 82589 73640 -243399 -200319 123447 -171669 24664 -70477 -81845 48099 -112916
7432 -229087 -84384 -140686 -72386 -140536 -9912 -41103 -501784 126874 -59587 248354 -371058
7420 -26310 -27333 262003 883 4178 -42900 -32616 -47363 -332382 -160789 139845 -14921 -187949
7408 -187949 14640 -79202 66094 -208161 -115464 105945 -32181 63603 85197 -214776 -21099
7396 -44283 62193 13429 -88000 -146209 154070 7039 100673 -87382 -203813 -277101 -234261 -153053
7384 -153053 178597 -101893 -284198 470110 -232363 38933 -65766 509 -125242 49883 71351
7373 71351 133627 -98930 -59360 -193017 -207188 155014 -16074 -11219 210270 282322 364051
7362 364051 53374 -77014 123782 100945 81699 -78451 -135090 -94447 -352719 222612 -11299
7350 194963 150959 -118744 -252032 95711 32340 -21140 -52914 -7419 -288289 -1951 -56109
7339 -56109 -205987 54684 14660 89319 234892 -150138 -4650 94111 332343 -68465 232467
7327 -44975 -184305 -150925 -227553 -375954 -51229 -24848 -36625 133823 -57269 205094 -95493
7315 147220 320855 -72236 123072 121879 -163845 -27952 -90098 89222 -100070 -126804 157664
7303 -136752 171515 9953 -160806 -81957 -53160 91707 384266 39037 -157145 91999 266075
7292 266075 153240 -189036 48857 -7079 109150 -61105 -237113 -13649 -191527 -257377 130538
7280 89734 164274 -81555 13158 -175672 -318936 -107331 -160940 -131587 112488 -383528 -45351
7268 34830 -208191 -251952 102549 -62799 -428629 -252314 -100141 -140365 333362 -111261
7257 -21042 33456 134215 -230617 -346214 -117650 -282761 250079 141928 110601 -154114
7246 53035 -63422 38832 -100003 10267 -7953 -100606 31163 97851 1164 136284 94290 229396
7234 229396 -55417 37149 -142473 -57318 -114776 12146 -298024 135484 111579 -65517 -88023
7223 -88023 -47173 277961 -134020 -90498 163187 -306044 -41727 -242584 262768 196144 -15718
7211 52589 82822 254127 27617 -267121 49284 121567 80345 -231273 131098 -102248 -382433
7200 -382433 -113668 55998 10176 -24253 193999 -131873 -8359 -103926 -194265 241364 -112323
7188 312029 22652 151421 -43251 -113020 132530 46815 -34387 -343818 22371 184075 -166998
7176 17248 -131604 37501 -177796 -163109 -197903 111030 -48578 -124711 -193446 78004 -25472
7164 -139959 59045 -105399 -178670 28205 42724 -146280 174112 -329389 -212024 -84858 -199713
7153 -199713 40595 39422 17884 131302 -43686 -93520 -116227 61879 89788 75091 -164027
7141 -112038 310210 39662 -115892 104913 32034 -1835 43389 -412144 -381099 89954 111422
7130 111422 -87067 293227 32912 96420 -248764 -86898 70077 159831 19679 -42933 -137378
7119 -137378 185924 78092 -322417 -230499 50905 187601 -2782 -27146 -251003 -110568 -46182
7107 -117160 -2765 -6370 -165395 -401598 -341065 36378 53160 121931 64460 -180028 205829
7095 -119835 202920 -123515 19503 -234 -40048 -187251 47771 -11592 -35111 66162 -106552
7083 201304 -162472 125074 246670 -48764 -18139 -98582 -276392 -28766 -148222 86571 98478
7072 98478 250814 -116732 -41374 27945 -94331 -85255 -143578 -226600 -27423 -163791 156749
7060 85440 -128722 -4932 -85074 -182707 -13640 -409089 -260020 60011 96054 141771 11201
7048 -322347 302386 231680 -97608 -212598 -89220 -181915 161403 18201 -114917 -120448 -40700
7036 -159631 252886 -268650 239855 -284478 -346170 -176112 -136098 -109930 -7957 -230338 -109665
7024 -148242 -161513 -208760 12208 191066 -104737 -8683 -143399 -44386 277419 47295 -43966
7012 -106504 287719 167990 248685 -287965 -82884 42905 124775 7523 -246792 -79140 -16331
7000 -7602 116016 11094 40436 -105171 79659 71028 -155280 -38820 121364 -66230 -84778
6989 -84778 -360805 276655 -90964 9957 -227610 -51149 12907 220549 -183676 -22769 -101068
6978 -101068 -248393 -566600 -281212 -158479 -235994 185432 -186477 -303444 31786 7224
6967 -99622 -198199 -7254 -158445 21948 98102 -42610 -109487 -83469 81795 -175984 -36790 -45911
6955 -45911 -139584 377200 -47909 83308 45717 -166177 -256978 -272526 -66176 -113770 -21923
6943 209700 -129630 -432062 -40431 -161750 164017 -96930 175507 316935 157117 53591
6932 660 -45015 -207257 48158 387187 -28722 -13339 408267 -94731 -197532 91772 246892
6921 246892 -281893 -103291 177237 211327 17966 38395 -213003 -62918 28532 -315752 -155516
6909 92314 -187473 -12340 16175 -286708 133786 -60711 -34851 -8652 203779 -182130 -180653
6898 -180653 -58447 103588 -118921 300209 65392 -65440 -2563 58741 79699 162903 -327925
6886 -78916 59153 -300917 -453378 -292959 -149249 -303568 -157033 -101098 -18063 137368
6875 247486 112947 59089 -107822 -324192 -142388 41433 60390 -154465 219236 -11842
6864 -205860 -115465 -115475 -121582 -106621 287298 -79837 -64622 -116564 61711 -59811 -46515 -185449
6852 -185449 331571 -25636 -56003 -34490 -209821 311401 17288 -82562 -341173 -91959 79756
6840 336920 28367 164277 -146073 -85530 -32209 258615 -18638 -188343 59406 49291 24368
6828 241239 -116080 73377 26781 20240 -184032 -46942 87507 888 -53529 31910 -16463 -86826
6816 -86826 287894 -7974 -89010 225889 -211375 48331 -254948 80924 57703 205415 52598
6804 -216697 -184234 181483 243747 17462 50344 -199058 -225232 -440040 27697 -40749 -47716
6793 -47716 26577 61735 21376 139656 100175 -222934 3293 -338037 -306801 127803 214189
6782 214189 361099 -247613 100371 -143366 406088 -107803 106092 -38167 35754 -262465
6771 -71974 62779 152732 84439 -164615 -312705 61560 16747 -251822 20957 56424 127873
6760 127873 31827 -24198 176238 -386906 -178437 -363080 70266 -178841 -65064 -88039 -96943
6749 -96943 -430887 40023 -242081 -20858 -57952 -51352 -15919 -166182 -132334 -160229 -106282
6738 -106282 278550 6086 -234614 258288 -120288 -43705 -103340 153546 -230158 168568
6727 120447 59624 317080 58623 -235051 63069 83089 98660 -162165 434376 54402 100535
6716 100535 304442 -115827 -12747 -210240 -6340 -75003 -218954 38897 -448738 -15682 99532
6704 52144 36780 -104405 91045 -100070 171043 50593 -1185 143979 -461094 138564 -93153
6692 -143281 -569458 -113494 257565 -189168 145522 -194454 146536 166949 -3177 -68494
6682 -68494 68796 107647 187224 -139675 246085 -315927 -63261 -67576 -32639 34574 -263877
6670 -32304 20869 -147171 -30731 -418208 -376119 36539 44143 -111854 203668 139818 -116278
6658 -105370 -237952 329441 -64569 -48070 26005 -63982 234666 -308146 27536 267483 -147343
6646 36152 -5223 240264 -281545 -126151 -192647 126903 -31065 65266 -58651 -176399 -140371
6635 -140371 291881 88291 238900 -92409 -70651 -207265 139417 436 250974 105560 -318926
6623 -34260 164969 -365049 182877 108598 -137815 19764 -149402 84345 234090 183868 -113445
6611 44313 -89061 -38491 -304203 48438 68013 380052 -18769 -272546 -11708 145075 -484091
6599 -246318 188116 -365740 31380 17677 -132629 110170 413778 262816 92541 -3081 130558
6587 -22063 175315 -19142 -156102 188829 -130406 -126886 24395 -243620 6841 30920 -100802
6575 29265 76908 -274067 232390 -190547 90857 -215977 -189055 -123199 -35953 -279108 224853
6563 136489 36404 -30866 312174 -30254 225564 -164963 40240 -250841 -431033 -30943 -155382
6552 -155382 -155107 127972 171753 -84014 -104710 -191424 415901 -169957 -218585 -67042 192 89188
6540 89188 -375709 28691 369332 -389535 46894 158649 -285090 -250015 236512 -6989 -316017
6529 -316017 -233722 -72660 -201174 399956 -25447 403866 22264 -68116 8652 48868 -80520
6517 14676 -149601 56514 82969 40400 55682 -125718 30925 -3858 66612 69651 -206634 -68769
6504 -152391 59556 353910 141593 558100 54054 -226271 -24795 488634 -262627 199706
6493 32819 -40829 -30194 -277076 -215243 -263187 -89524 -24705 218114 -152298 91690 -102258
6481 93678 122032 45169 87702 -193463 -40671 -247749 192993 -69983 -16748 -229159 -39044
6469 -226126 -113158 -63842 -37391 186172 -243806 -86577 -178249 94893 146748 -107945 -418657
6458 -418657 11463 -174041 -150828 35021 -121290 -217829 13311 -106013 -392302 142913 -204523
6446 -264920 140946 -34456 -96111 225094 -42130 -260396 -234781 36010 -196634 -71462 91587
6434 -119149 -5713 -89084 217326 -71514 170452 -39218 73170 169152 359148 -63375 -32069
6423 -32069 -219044 108553 -219479 9219 419952 -360996 -34445 6391 -145273 140350 -168746
6411 -159504 -216157 -166346 258996 262305 -99676 41375 -228442 -188656 -156953 -80444 76874
6399 130702 -445111 -237767 105635 21059 74720 254515 -231248 -270830 53544 -20486 193330
6387 -6334 254363 -165131 -18228 -3859 -194545 22181 -37830 -120914 -1649 -75755 -45649 -20866
6374 -109655 126375 8977 -80551 55654 44975 27110 -208480 -62007 -115742 198938 182209
6363 182209 195989 -18520 -98373 -28402 -34457 -292028 176820 -90978 -250519 127021 175188
6352 175188 -160364 -148285 -86877 58153 51389 -159631 174404 -184568 -80824 -128058 -49118
6340 -192599 190142 -207905 88240 -19607 323900 180065 171467 -184617 -69007 105587 -4165
6328 -154958 -128291 -1634 324336 -29547 -176083 113209 77723 612 -84890 -31651 -15149 -377618
6316 -377618 176603 -191135 46781 -83777 -90538 -294841 11198 250140 -127230 -78138 143039
6304 -208081 487135 273274 -36205 -98515 52904 113961 -30854 53611 -131333 45978 -9227
6292 -160576 21056 -95335 537 -17612 -30285 -22794 -12375 47369 68809 108234 118311 468837
6280 468837 7958 -177689 888 19401 223848 75340 -47685 2625 61027 -105614 20513 -90300
6267 -286335 -238470 277886 73228 27934 270389 19719 108826 301261 -338379 -153089 -210159
6256 -210159 -126604 -32738 839 168607 72228 -52577 33074 -121961 56268 -103900 125073
6244 197550 -405470 -15189 295562 -198163 92889 -171100 -107590 -41498 14696 -229163 -34706
6232 -145878 -105316 -39766 -43946 90421 149479 -277860 69001 46995 -212177 258939 58101
6220 -138616 -136964 -22323 -39903 66518 228703 71362 -274522 78018 281433 -52847 169681
6208 -213560 11536 -276228 115862 -247255 -53510 45956 -144931 126601 218735 -236464
6197 -21843 -241285 62271 123651 151638 -127520 227851 -67008 -209400 117035 -161485 -91673
6186 -91673 -241599 80554 -204184 69313 -142211 -287227 181433 98207 -203529 -260842 303693
6174 116270 -231279 -249375 123731 155518 -109088 34993 -17913 -98363 -7993 -239922 126738
6162 -248176 240962 48268 -124679 -127623 51721 -135266 -100647 310681 -57738 -557707 -143826
6150 -304939 -230685 77981 115723 122615 -181093 -200983 -57880 44971 5497 -38691 -91544 97795
6137 92383 30775 -19198 49855 -175851 254758 249142 132805 26939 -32440 275752 180131
6126 180131 -8315 120622 244570 -194417 289469 41187 -131076 236730 362002 117610
6115 -310652 -254199 95938 371414 -46985 -79399 67338 -13432 97568 42764 141861 453264
6104 453264 257033 -180 -113852 242108 138645 -156270 -79218 287495 -218217 -28473 -304262
6093 -304262 189650 84165 220420 -115600 -97940 -117317 -186107 -52074 205600 275756 -37921
6081 55725 7562 -71482 97813 360965 20575 127798 26913 31170 448797 326373 -301307
6069 218459 -267067 69456 66900 -196270 34546 82820 -42481 -190295 94814 -271840 -181473
6058 -181473 -116530 -164408 161552 -381591 122770 -134346 95439 146136 -526248 -283058
6048 -283058 164957 -133565 47043 -94302 -285248 156121 -125519 126102 -137656 391633
6037 -227232 -61320 39837 -4584 120306 -214476 -262206 -7122 -185538 418351 -128683 -125907
6026 -125907 -183678 237228 -65872 118322 66294 -283113 -8646 247346 -147368 259883 -281411
6014 44921 -29429 2888 -89875 247318 129608 123399 -107764 268504 30452 -139693 -9568
6002 50629 2865 109754 17585 86853 49358 65725 46105 -350462 85905 4325 7109 -211183
5989 -120716 205522 -108491 177801 89069 -62497 187144 -234080 -108567 -297870 92375
5978 64 99994 130788 -58923 -46703 -108861 74201 270340 -323883 -165818 -300499 -265614 144796
5965 -188464 188101 213531 170265 -536076 253901 62142 -93504 98493 307790 82223 119160
5954 119160 270606 89037 -135346 -93666 -191924 -56207 -32035 -80624 -126855 58190 -91924
5942 -79450 -130265 -240554 -217278 -69516 78992 -43738 8601 -57230 -152912 217189 -226209
5930 43176 -136947 -143063 243832 60592 289396 146675 62214 50220 -139066 -252707 243495
5918 74901 -42055 -217333 277339 289753 -23936 -385801 655 -19388 -29428 -140421 113716
5906 -189496 -252866 -158970 -173510 -309285 26752 113656 -55291 42058 140546 77322 325691
5895 325691 -133219 -216290 -182442 39539 39235 163478 1059 65575 15590 2325 -16956 222542
5882 -105364 2775 -107850 -319073 204941 -10811 163070 104407 -265808 94967 50571 85109
5871 85109 111814 29380 -686 -21874 41757 240976 -50396 -85330 67544 -293702 90830 -325724
5858 327711 34012 15829 -235884 -80269 -157324 -245573 -140454 54377 30149 171230 -53942
5846 48429 269911 -158567 1342 51103 -197335 19058 -17603 -69533 887 -253757 154420
5834 149664 250286 242356 -50373 201459 222688 -369028 144794 48028 -59432 302931 183316
5823 183316 145960 -2221 26109 59298 -209791 56464 57040 -28381 154053 -72117 -62092 -414030
5811 -414030 409978 -101993 -519217 -56367 155040 -13270 -661 -205237 225798 75064 -88881
5799 141905 -52632 77094 -157600 245666 142778 86109 44341 -317252 -10325 -8388 -148923
5788 -148923 -23535 -381346 -205956 148315 -171289 44331 181632 41056 -216091 440463
5777 111001 -46553 178649 188762 -96554 -234465 -37318 -22163 150662 -123761 -186792 -140628
5766 -140628 -27990 142921 -182201 -198962 20221 -278621 190545 -36293 230335 344108
5756 344108 74836 -159991 138912 315342 -15928 -159038 -66328 39612 311973 -37226 -97607
5745 -97607 155581 -190851 -52183 82366 34546 273425 -85895 8731 295514 -87205 -398211
5734 -398211 207236 -42520 221228 32947 -187776 182526 226000 287536 -78852 110035 -17024
5722 -176377 319331 26447 162605 367226 -29253 -407736 -177070 166340 156084 66700
5711 -142233 -58262 -112789 8308 -166194 -92555 -55824 99853 65462 27671 -87980 -168977 -188588
5699 -188588 -123391 -140728 -34460 10240 -3877 -218071 277630 46443 -103354 -19532 -41090
5688 -41090 44750 67657 258478 -40609 -259996 -126055 196155 146647 -68632 93218 304019
5677 304019 -287604 -68469 -267653 -285367 -67976 103904 -98357 -91211 109210 -48746 -184300
5666 -184300 -50914 -17685 348479 112570 -26747 153832 -55495 -41179 -302751 78559 82403
5655 82403 266017 104376 -362011 -134090 241068 141221 110093 84971 44420 124775 -10905
5643 -296865 -171818 30627 -76061 -52986 -98816 228786 184595 29727 153121 -65789 -28671
5631 38237 -134673 -374377 343830 -176724 63382 -244292 -274060 142603 222741 70949 4318
5619 -100926 -124568 -41989 -150998 -338339 47778 386887 351794 -173659 -301605 57018 -88004
5607 199921 -141211 136800 249430 -39005 -253908 81790 -27779 242496 -103317 -163855
5597 -163855 168836 8414 -143276 -11153 -29821 42922 96396 -89862 116264 283749 -260331
5585 -39529 75453 -185101 83035 49231 -96499 -203387 272182 95179 -26108 115963 39249
5573 147044 -282103 -5453 57190 133880 29821 53074 -119218 39628 317833 -122311 84455
5561 142478 213967 217339 64848 154454 -340707 -313465 106289 113283 311030 296830 111983
5549 121468 -363334 131755 -263401 -12876 114847 92435 -91548 71153 -4298 -289531 -126483
5537 184251 -290680 176992 -135536 93018 87296 -49691 211669 202113 -169932 -231924 166994
5525 75896 66963 11958 48951 -182326 -168792 201846 37780 -46790 -253261 -317542 -44003
5513 -159346 -33218 242143 -9096 -471060 -361243 18129 131723 -235202 48842 158218 -153661
5501 79443 -122537 -118587 -185567 89992 -97904 -89835 30693 -104400 -136723 49711 5337 -143459
5488 -373316 -134095 -214180 -15066 -52020 -27546 -38897 75772 -99989 105438 -88627 -220465
5477 -220465 -125413 -49255 221164 -236615 -103011 -149209 315893 -112776 -129405 -238463
5467 -238463 49113 158715 7858 -303899 -138205 -90887 103236 -54894 -164717 -70172 218463
5455 105548 93689 270116 -19255 -169549 54746 -438393 -48190 145882 -138284 -325705
5445 -325705 -258191 -222943 -71605 -38807 -85184 -125528 71990 49904 14593 198659 -132921
5433 51897 160294 136090 132142 -306172 -11510 148766 94989 -17911 -69623 6884 -307289
5421 -58183 268175 -62986 -402248 -21476 -366272 -118480 -172791 19266 -253712 -92699 292710
5409 -79243 66850 -241653 131219 158848 -87932 -128184 -107693 6611 27457 63215 251482
5398 251482 294718 -211426 -9626 -84819 212912 -247322 -73180 -76546 -48114 9474 192714
5387 192714 -232249 150156 46469 -495899 71 49118 -173944 -178869 -106306 99945 160764 -122309
5374 140458 -12065 -22298 79368 412019 3852 -97237 17731 204425 -28956 -44019 119741
5362 158762 -50091 -362520 75743 120995 123128 78397 -207970 -206736 129012 143002 289 -151262
5349 197242 28440 243047 137798 23911 161251 -120889 341522 183991 -107265 7738
5338 199794 17402 -21411 122512 -55780 -359428 19505 -185626 -13956 23812 -107417 154973
5326 -150685 242582 -14985 37636 198972 15758 -243773 469184 -35924 1314 139056 -133048
5314 -314434 -109374 314696 -62663 130642 55439 -352883 118013 -40661 5743 -36994 -1172
5302 -27620 -88649 -224705 -276526 288170 -173851 -306009 -302362 -9388 -472201 -24745 -299649
5291 -299649 53971 -114810 -437792 101112 191086 -32375 -194105 171 -91797 -48745 192562
5279 298198 226764 166330 67873 34685 -67561 -39450 21949 -190435 -168639 -154945 237987
5267 169273 -117013 -121876 161017 13096 -281747 8723 209444 -63807 71833 44914 -127866
5255 -49115 289613 222872 -181030 -120051 114288 159276 233235 -281683 -121562 -35787 -103348
5244 -103348 -77360 398931 -65251 -184378 -27604 -24458 70113 -95987 -11975 -2991 -232293
5233 -232293 -119611 -107259 13424 116134 -160331 -4485 252101 47935 -90196 -145504 372881
5221 -59561 -235915 190908 142037 97591 -102771 -247180 118251 -290662 -131890 -160426
5211 -160426 -311877 -14641 47330 -150496 250401 198596 48335 194335 172668 -83429 -31919
5199 127892 -342210 -203652 -65130 60923 76177 -141660 224853 -285740 158525 -72467
5188 177316 252055 -115715 -39445 -53379 -85261 338566 72634 -59230 316361 -219043 72038
5176 66259 5518 98144 14218 -25460 45941 -15990 299568 -167511 -5888 92634 -273572 -325662
5164 -325662 241172 -328956 334820 30094 -28871 -110768 -128631 69633 55211 -137485 49892
5152 -415980 -47498 311649 -233203 51486 -260358 41201 113312 -81547 -62722 -75300 -206043
5141 -206043 218968 -54259 -385743 -17284 124810 74062 199264 -296746 -197333 23710 -56846
5129 282300 118589 -33837 -330677 115264 129505 -179499 164873 -359900 -117821 163912
5118 191813 131615 261653 49611 -115405 75898 -63224 -270170 208436 226001 84970 204320
5107 204320 -59860 36825 106173 120479 -279886 151444 104035 -64429 252761 32926 113803
5096 113803 8476 388349 -101713 -138970 -60674 -25117 -142224 37759 68808 59247 -203945
5084 -337263 41214 105107 261026 118489 147735 -276112 -172832 -172208 130845 181816 -54304
5072 176769 80233 -100922 55026 -250350 -23879 72410 191554 255237 6663 6980 -9427 -20498
5060 -20498 27863 245760 -181569 259174 -116881 347590 -466391 185812 -200481 33623
5049 35377 -317191 -183828 -253849 145450 -156910 163619 -42364 -64597 159149 -232300
5038 62324 -39502 -177998 163512 142493 -77097 -62784 126535 242997 -59034 150646 -104883
5026 65688 307921 600043 49693 -27795 218050 240304 -90667 100429 -106450 -128178 -8432
5014 250220 149759 -175574 163005 61002 -374758 -56076 235350 285245 113726 -100126
5003 -4885 38887 75613 171087 123550 257568 341645 137582 55654 -300590 147179 218999
4992 218999 221553 -17730 284333 94802 -229137 -26261 -50983 243156 -52429 101725 -189204
4980 -87604 139828 -105762 51789 265483 -82733 183631 -13538 -112334 2563 -51505 -62244
4969 -62244 55533 -24941 -125992 82316 -35237 153668 -208308 65349 -122183 49093 21713
4957 177312 -60699 196170 -220653 49263 -39851 95702 -25756 49591 -114853 -120393 -181926
4946 -181926 25304 1279 189303 10799 -6851 -52202 107437 16961 34395 91303 130493 -62125
4933 -159330 33825 228243 193136 443926 -55726 -91893 -279853 -8727 97517 -295195 342993
4921 156406 226962 61175 104799 -165645 80444 -15143 -98327 -189438 -247051 155956 35722
4909 -211706 54793 -62455 -293059 65025 -148237 99727 79181 26198 220444 143890 76073
4898 76073 -304095 -88079 361529 -35477 17129 156934 476943 -116404 149170 96078 218020
4887 218020 41360 -23778 -246949 22328 -3935 -39547 110563 -31678 -169742 34837 66317
4876 66317 90485 45772 148355 -69423 240027 99094 -70749 -274513 -2171 -43905 -59051
4865 -59051 68307 -2451 211425 199933 -263510 -191773 118741 30343 17638 230876 -6357
4853 -100431 -159965 18078 143347 -121358 159383 407617 -80386 22384 -286080 -69067 -45406
4842 -45406 211871 -103597 -46366 -415294 -175672 172188 112633 -5440 -64039 10306 -88432
4830 -62969 -20647 329647 37210 -72015 -190930 -69669 -96782 -61503 59466 -114172 -56789
4818 -43877 169853 -200784 -193570 1727 99765 -44311 114310 77410 77072 -110880 62778 -41159
4805 -84098 228047 -95228 -64085 144721 125592 -161613 140280 -247079 -254359 -23857 -204764
4794 -204764 121565 89163 -375490 41789 69326 -23268 110021 -12840 36057 -74020 172715
4782 60959 264926 -130248 77012 -356830 -148218 82045 215946 81402 -71594 -132672 -1794
4770 221367 192037 70282 -288032 68747 19043 205742 -40261 82155 -41431 1541 116078
4759 116078 -64394 199866 -44356 -36954 -75875 -194891 192772 203687 118618 -35688 -164930
4748 -164930 40232 218319 96291 78419 -93150 61867 149843 445638 -230727 313032 -12181
4736 -198596 -19004 82209 -74213 -160520 75675 -146914 173462 35814 -18563 -187528 143667
4724 -11863 -67899 32829 43569 -59781 -294813 147782 45815 65805 282627 125515 322031
4713 322031 33526 -284719 -231056 97733 232738 -12460 115329 47701 5659 -40025 -187165
4702 -187165 -1150 -68382 -86660 -452209 92989 28657 15163 64361 3577 -305893 59854 291216
4690 291216 93709 -141914 36709 -225672 -41183 116854 179008 55426 435176 134221 41923
4678 195797 40385 210776 -171182 383935 71766 -178093 5630 41138 -121056 82866 126147
4667 126147 323166 -38980 -108800 19137 -31256 -60842 78037 252821 -331078 11126 192038
4656 192038 356207 -265694 -86413 -292297 -93071 25589 12375 240984 -184586 69050 -28956
4644 101852 242494 -160585 326772 -203856 -141443 -279270 -156713 -162133 365053 222850
4634 222850 -39929 2704 -240567 432035 -21632 10487 -169549 -14281 25729 -120521 -93855
4623 -93855 68418 138069 147613 172523 97454 -123931 -110662 -197353 -89449 127474 17411 -9802
4610 -6154 -3473 -28452 -79716 -121139 -42267 -143645 186025 -206319 225919 34110 -79048
4598 147303 -332313 427525 193235 -447020 -1093 65237 75345 258749 16398 7239 -138166
4586 -38222 117470 -364116 63649 366750 223447 -54388 301163 165226 -495 -106967 -40746
4574 152103 16303 -33457 -24209 -159331 -17090 192497 -303635 -221922 257149 -65530 208964
4562 104722 27808 118935 -26776 292952 79540 19239 14385 41153 -155246 -181220 89323
4550 -30719 2646 -260793 -154710 -7915 -112936 -27750 -258575 -33910 378968 -320476 -158498
4538 4211 -265470 80199 -52471 -162499 -102278 -112621 134905 -4637 -129494 -256956 114122
4526 17833 15647 -69771 -50606 -26683 -98452 -32915 -27387 95388 263163 -36829 -129651 180255
4513 356705 -48840 46347 117014 -121364 -146064 -239444 -112873 -167213 -16820 -147014 -134646
4502 -134646 18446 310030 -101981 -177931 365024 27561 102746 -399398 -168754 130438
4491 207011 -142112 53427 -110134 74602 402895 42273 417817 -86527 101577 -45926 853
$$ [...]
##END NTUPLES=NMR SPECTRUM
##END=
