##TITLE=AC1443_BRASW13252_8011624_KwShgGANJ4
##JCAMPDX= 6.0         $$ Bruker NMR JCAMP-DX V2.0
##DATA TYPE= NMR SPECTRUM
##DATA CLASS= NTUPLES
##ORIGIN= BRUKER
##OWNER= Administrator
$$ 1.72 TOPSPIN		Version 2.1
$$ 2013-07-05 22:40:14.873 -0700  Administrator@X
$$ Compression mode = diff/dup
##.OBSERVE FREQUENCY= 400.02188249412
##.OBSERVE NUCLEUS= ^1H
##.ACQUISITION MODE= SIMULTANEOUS (DQD)
##.ACQUISITION SCHEME= undefined
##.AVERAGES= 8
##.DIGITISER RES= 22
##SPECTROMETER/DATA SYSTEM= spect
##.PULSE SEQUENCE= zg30
##.SOLVENT NAME= COFFEE_meoh
##.SHIFT REFERENCE= INTERNAL, COFFEE_meoh, 1, 14.98509
##AUDIT TRAIL= $$ (NUMBER, WHEN, WHO, WHERE, PROCESS, VERSION, WHAT)
$$ ##TITLE= Audit trail, TOPSPIN		Version 2.1
$$ ##JCAMPDX= 5.01
$$ ##ORIGIN= Bruker BioSpin GmbH
$$ ##OWNER= Administrator
$$ $$ E:\/data/COFFEE/nmr/AC1443_BRASW13252_8011624_KwShgGANJ4/10/pdata/1/auditp.txt
$$ ##AUDIT TRAIL=  $$ (NUMBER, WHEN, WHO, WHERE, PROCESS, VERSION, WHAT)
(   1,<2013-07-05 22:40:07.561 -0700>,<Administrator>,<X>,<go>,<TOPSPIN 2.1>,
      <created by zg
	started at 2013-07-05 22:39:00.545 -0700,
	POWCHK enabled, PULCHK disabled,
       configuration hash MD5:
       C8 4E 4E 5D D3 5C D8 9E 9F 52 82 E0 59 8A DE 15
       data hash MD5: 64K
       3B EB 5A AB 4A 66 2A 07 15 40 AB 6C 53 7F 6E 64>)
(   2,<2013-07-05 22:40:10.686 -0700>,<Administrator>,<X>,<proc1d>,<TOPSPIN 2.1>,
      <Start of raw data processing
       efp LB = 0 FT_mod = 6 PKNL = 1 PHC0 = 0 PHC1 = 0 SI = 32K 
       data hash MD5: 32K
       E7 17 C7 EA 42 FC 6B 96 32 FD 4D EB 67 9C BF C6>)
(   3,<2013-07-05 22:40:11.123 -0700>,<Administrator>,<X>,<proc1d>,<TOPSPIN 2.1>,
      <pk PHC0 = 93.40027 PHC1 = 0 
       data hash MD5: 32K
       19 F7 36 F6 96 FB 7A 89 8B F9 B3 2C 32 5A 66 AC>)
(   4,<2013-07-05 22:40:11.326 -0700>,<Administrator>,<X>,<proc1d>,<TOPSPIN 2.1>,
      <abs ABSG = 1 
       data hash MD5: 32K
       6E D5 9F 4C DF 9B 1C 2D 1B 19 3F 1E 6E 02 38 92>)
(   5,<2013-07-05 22:40:11.389 -0700>,<Administrator>,<X>,<proc1d>,<TOPSPIN 2.1>,
      <abs ABSG = 2 
       data hash MD5: 32K
       C1 C2 0C F1 49 08 AA 3E A0 41 BF EA 3C BA B6 3E>)
(   6,<2013-07-05 22:40:11.436 -0700>,<Administrator>,<X>,<proc1d>,<TOPSPIN 2.1>,
      <abs ABSG = 3 
       data hash MD5: 32K
       C3 7E E1 69 8B 9C 62 FB 4F 78 1A D4 E1 72 EC 3B>)
(   7,<2013-07-05 22:40:11.498 -0700>,<Administrator>,<X>,<proc1d>,<TOPSPIN 2.1>,
      <abs ABSG = 4 
       data hash MD5: 32K
       EE 58 BE 2E 85 36 FF EC 96 3D BE 26 93 53 F5 08>)
(   8,<2013-07-05 22:40:11.561 -0700>,<Administrator>,<X>,<proc1d>,<TOPSPIN 2.1>,
      <abs ABSG = 5 
       data hash MD5: 32K
       2B 41 E9 9D 8C DF 66 5F B6 87 0D E0 D3 2A 11 EE>)
$$ ##END=
$$ 
$$ $$ hash MD5
$$ $$ F7 34 B3 1D F6 9B 45 F9 73 A8 ED 60 B2 F6 F7 8F
##$RELAX= 
##$RELAX= 
##$RELAX= 
##$RELAX= 
##$RELAX= 
##$RELAX= 
##$RELAX= 
$$ Bruker specific parameters
$$ --------------------------
##$DU= <E:\>
##$EXPNO= 10
##$NAME= <AC1443_BRASW13252_8011624_KwShgGANJ4>
$$ [...]
##$TP= (0..7)
150 150 150 150 150 150 150 150
##$TP07= 0
##$TPNAME0= <>
##$TPNAME1= <>
##$TPNAME2= <>
##$TPNAME3= <>
##$TPNAME4= <>
##$TPNAME5= <>
##$TPNAME6= <>
##$TPNAME7= <>
##$TPOAL= (0..7)
0.5 0.5 0.5 0.5 0.5 0.5 0.5 0.5
##$TPOFFS= (0..7)
0 0 0 0 0 0 0 0
##$TUNHIN= 0
##$TUNHOUT= 0
##$TUNXOUT= 0
##$USERA1= <user>
##$USERA2= <user>
##$USERA3= <user>
##$USERA4= <user>
##$USERA5= <user>
##$V9= 5
##$VALIST= <valist>
##$VCLIST= <CCCCCCCCCCCCCCC>
##$VD= 0
##$VDLIST= <DDDDDDDDDDDDDDD>
##$VPLIST= <PPPPPPPPPPPPPPP>
##$VTLIST= <TTTTTTTTTTTTTTT>
##$WBST= 1024
##$WBSW= 4
##$XGAIN= (0..3)
0 0 0 0
##$XL= 0
##$YL= 0
##$YMAX_a= 591713
##$YMIN_a= -501527
##$ZGOPTNS= <>
##$ZL1= 120
##$ZL2= 120
##$ZL3= 120
##$ZL4= 120
##$ABSF1= 14.98509
##$ABSF2= -5.573092
##$ABSG= 5
##$ABSL= 3
##$ALPHA= 0
##$AQORDER= 0
##$ASSFAC= 0
##$ASSFACI= 0
##$ASSFACX= 0
##$ASSWID= 0
##$AUNMP= <proc_prof1d_extract_pilot.lims>
##$AXLEFT= 0
##$AXNAME= <>
##$AXNUC= <1H>
##$AXRIGHT= 0
##$AXTYPE= 0
##$AXUNIT= <>
##$AZFE= 0.1
##$AZFW= 0.1
##$BCFW= 0
##$BC_mod= 0
##$BYTORDP= 0
##$COROFFS= 0
##$CY= 15
##$DATMOD= 1
##$DC= 0
##$DFILT= <>
##$DTYPP= 0
##$F1P= 0
##$F2P= 0
##$FCOR= 0.5
##$FTSIZE= 32768
##$FT_mod= 6
##$GAMMA= 0
##$GB= 0
##$INTBC= 1
##$INTSCL= 1
##$ISEN= 128
##$LB= 0
##$LEV0= 0
##$LPBIN= 0
##$MAXI= 10000
##$MC2= 0
##$MEAN= 0
##$ME_mod= 0
##$MI= 0
##$NCOEF= 0
##$NC_proc= -8
##$NLEV= 6
##$NOISF1= 0
##$NOISF2= 0
##$NSP= 0
##$NTH_PI= 0
##$NZP= 0
##$OFFSET= 14.98509
##$PC= 1
##$PHC0= 93.40027
##$PHC1= 0
##$PH_mod= 1
##$PKNL= yes
##$PPARMOD= 0
##$PPDIAG= 0
##$PPIPTYP= 0
##$PPMPNUM= 2147483647
##$PPRESOL= 1
##$PSCAL= 4
##$PSIGN= 0
##$PYNMP= <proc.py>
##$REVERSE= no
##$SF= 400.02
##$SI= 32768
##$SIGF1= 0
##$SIGF2= 0
##$SINO= 400
##$SIOLD= 32768
##$SPECTYP= <>
##$SREGLST= <1H.CDCl3>
##$SSB= 0
##$STSI= 32768
##$STSR= 0
##$SW_p= 8223.68421052631
##$SYMM= 0
##$S_DEV= 0
##$TDeff= 65536
##$TDoff= 0
##$TI= <>
##$TILT= no
##$TM1= 0
##$TM2= 0
##$TOPLEV= 0
##$USERP1= <user>
##$USERP2= <user>
##$USERP3= <user>
##$USERP4= <user>
##$USERP5= <user>
##$WDW= 1
##$XDIM= 32768
##$YMAX_p= 437686603
##$YMIN_p= -673043
##$CURPLOT= <Network HP LaserJet P1505>
##$CURPRIN= <$Network HP LaserJet P1505>
##$DFORMAT= <normdp>
##$LAYOUT= <+/1D_H.xwp>
##$LFORMAT= <normlp>
##$PFORMAT= <normpl>
##$SURQMSG= 1
$$ End of Bruker specific parameters
$$ ---------------------------------
##NTUPLES= NMR SPECTRUM
##VAR_NAME=  FREQUENCY,     SPECTRUM/REAL,   SPECTRUM/IMAG
##SYMBOL=    X,             R,               I
##VAR_TYPE=  INDEPENDENT,   DEPENDENT,       DEPENDENT
##VAR_FORM=  AFFN,          ASDF,            ASDF
##VAR_DIM=   32768,         32768,           32768
##UNITS=     HZ,            ARBITRARY UNITS, ARBITRARY UNITS
##FACTOR=    0.250966925370066, 1,           1
##FIRST=     8223.43324360094, -168727,      -79533
##LAST=      0,             -160809,         -7330
##MIN=       0,             -673043,         0
##MAX=       8223.43324360094, 437686603,    0
$$ Real data points
##PAGE= N=1
##DATA TABLE= (X++(R..R)), XYDATA
$$ [...]
23857 -86156 84435 -82731 -165290 -154025 -11884 104371 103367 31200 131715 -71650 23850
23845 109932 -231931 -100468 166258 36354 139206 145078 40658 -417010 -60941 -62954 -69113
23834 -69113 51202 -12477 -418080 -47091 -298473 -158435 25811 265134 117988 207345 -33776
23822 -14129 -208419 98667 191701 -51909 275504 144402 -8391 -205098 237628 87648 124547
23811 124547 70193 -24327 -30645 -178864 -124597 -51330 -90629 -133140 -38 89344 -152500 -19892
23798 135573 77651 -238487 104239 -260241 -36914 -31272 314306 150917 -64872 -325617
23788 -325617 -28887 172170 -327370 7477 -56914 90446 -8637 -73200 58762 231137 -75995
23776 244691 -170320 -84698 15946 197170 149681 -7411 -400713 67364 -221 -257038 194685
23764 285831 41581 56900 162982 -58933 53130 -156785 -430836 113719 91932 -152709
23753 -10271 18198 -111585 227845 -70216 128230 -110163 207834 36308 200361 223134
23743 223134 -35301 -191577 100581 -174071 700 147444 336697 180850 178765 83790 6652
23731 -181716 -16610 265499 132368 -210553 114958 -77397 139993 41500 -126358 265728
23720 -14294 -108672 -215648 241261 168833 139102 -65624 87970 66015 -258335 -320417 420361
23708 -126233 -86258 158145 83413 -40333 175721 64592 -99809 -13368 -22062 285027 -138272
23696 -86927 64506 -576046 -169269 176051 89784 -184592 -479226 -119989 -12391 -14504 53012
23684 272153 -197342 -44049 -343393 284527 -168498 16287 -126130 -143373 -209090 -141354
23674 -141354 184240 -131742 -4282 -182396 -316837 61587 54890 -343321 -246170 -5454 -81851
23663 -81851 -59544 14229 -127602 -18208 -176339 113625 -13571 58132 28361 -102840 -78177
23652 -78177 40864 -427267 -202769 -312691 211915 187205 155962 -59456 -181557 -140411 33534
23640 -45726 103749 -203057 -161590 65205 107773 -45505 -34232 115625 101563 -35158 -145591
23629 -145591 -43917 -61655 -182205 -87918 -102667 88153 -206165 -283908 191661 -32557 11006
23617 -33975 -138759 -46492 91643 -33646 254239 -249994 246944 89679 -37787 173623 84740
23605 80835 312239 137839 1269 -212487 -292763 115726 42352 53120 -212446 -119788 114287
23593 146740 453555 377206 -64051 460956 101721 180260 -23030 149799 -88145 -63167 -147837
23582 -147837 -298415 160047 46472 -38785 60061 283468 -78077 284525 -227840 -169949
23572 -169949 259916 -144342 -63003 260273 -165526 -47826 -126103 -45777 -265619 135332
23561 48302 482042 -105575 -227568 130630 -272090 -158138 73141 -169747 66572 -138797
23550 10698 82240 -253271 98427 -335467 64092 73121 104021 -77489 349981 142898 135990
23539 135990 45352 -192649 37736 60413 -18401 191733 -261530 -321055 132966 -153622
23528 144178 6328 46267 144679 112584 -2587 -224136 274604 -231907 -111642 111508 -19775
23516 -144949 35921 -145825 34102 29271 191704 163519 -157712 -69163 -42800 138708 -7647
23504 289826 348166 -119472 68791 149645 -144718 1541 -75855 53842 -7237 -17442 92669
23492 146679 -51085 -210226 136081 -231662 20183 -43163 -42 6942 -73887 -109082 -77722 135308
23479 216077 126765 101568 -78039 -11522 153624 -126626 -77306 -321930 -113525 13511 -134510
23467 -14037 -92509 -183903 1090 -25743 -44841 -60026 -90193 -1168 182245 -9350 -67193 151568
23454 -176390 34871 -214146 -131007 -208617 -127123 -170067 -418275 -7773 -49172 -302608 63684
23442 99397 29780 -4687 384454 -27593 -194746 -71647 -22443 -134667 -29164 -160321 -178643
23431 -178643 -169994 -114066 -185488 258522 -116876 103316 -213429 197771 -87062 32872 -143354
23419 -62032 -115919 -130950 -60674 -251685 235935 -258798 166324 -36591 138737 175685 -233944
23407 -29362 -142073 -141338 -2119 223950 -114937 106000 -378096 130638 -281948 -277248 356518
23395 -27113 149693 -111875 199084 151480 303348 4317 308041 138054 323437 -203064
23384 -174455 261693 267684 36088 273722 -90224 -96219 102240 423678 -111040 -155245 -173038
23373 -173038 274178 -42766 62172 -80004 -46864 268203 -89130 100336 -168552 -106436 79410
23361 2538 -358121 190181 -154818 -37786 -213235 68900 2200 -167777 -292347 18580 -34729
23349 20600 -66406 117993 -122858 336540 -85920 109872 39834 -176270 -104563 -148748 -275568
23338 -275568 -77163 -8847 -74593 54836 -89048 15420 -166742 -41306 52319 -18832 159677
23326 36379 29618 -254422 -160624 -186080 369167 8354 1614 -188675 -270948 -51335 -114559 236854
23313 97679 104696 12318 -56860 110627 -203425 125275 48956 -73560 173428 59385 -26127
23301 -6932 -195761 -8452 134137 -15086 -188570 -19966 -277715 -97169 262639 -125953 -61112
23289 -331977 -218601 -201784 -122787 -318148 -74565 -320473 194702 5173 -106656 18421 -17717
23277 114237 -361620 17817 418824 -299487 223549 146845 37333 -46579 -706 238319 162032
23266 162032 -192501 270801 66939 254369 25702 -287116 -28909 -1148 228144 82193 -331268
23254 269092 18067 -135587 -149661 -122890 308534 -76731 186550 -63483 58883 -99462 205024
23242 -213941 -12636 -232846 -334105 -12698 -129303 157345 -45778 -35214 82210 90611 105924
23231 105924 -215140 94686 -19532 13292 86012 82393 -74329 -332784 78530 49551 -50212
23219 145855 -78449 193006 -481945 -375037 208473 -116842 42494 -486943 212016 -181269
23208 -138334 234254 -113042 -180726 -136107 -57552 -87366 -233425 23962 -109975 -69052 -38275
23197 -38275 19954 -289283 282869 343426 -251562 -49999 -126974 42614 142551 -16107 3173
23185 -116047 -48923 48028 -106199 165127 27315 49590 -177084 300201 100268 -234524
23174 12846 140373 259588 239182 -52303 -162234 -50661 -195321 171015 -101630 -113833
23164 -113833 -1686 118610 141197 -113248 4923 -421854 -282063 134134 137375 158984 -110715
23152 66717 -327633 38240 27792 -36712 -272145 40091 69654 -243763 -56921 -257458 -69974
23140 -324000 -41778 -148850 20607 -235342 -75989 -3609 238345 157012 -15100 74072 120023
23129 120023 42036 -185022 95148 -9440 -169906 -126910 41999 -87453 204509 227732 -45655
23117 9808 -189101 -70788 -122734 91316 79599 137693 274255 -7125 -283889 -118991 16253
23105 -51698 -202989 -151511 20644 94962 33266 302155 33769 133630 88556 159355 151172
23094 151172 -146482 110450 -31818 -136860 -152844 -313886 -247770 -12869 59298 38265 -85070
23082 -121114 27881 185324 276637 257800 -22326 -172330 -144890 -272470 34140 55021 -94065
23070 -336052 53972 33155 85231 -48666 162479 -270515 13503 -27771 -135113 294666 271454
23059 271454 319560 -153711 217095 -420 386471 -12141 -344275 6732 26285 190625 254729
23048 254729 158316 -45926 -117364 261724 -105722 -123034 -27104 -243937 167359 -99234 -418330
23037 -418330 77184 -111640 -16841 -29651 -56742 -38627 169703 40756 88404 -277164 257082
23025 182216 234265 42206 -32509 85581 -43473 18226 -152855 -72766 -77157 14853 -63681
23013 283352 -243297 -9223 13075 201942 -94416 -319891 297001 23392 -158440 61706 -3832
23001 242151 -134330 -293248 -17750 -35025 -321562 116793 3657 54938 -128573 2856 -78157
22989 -482885 387625 98262 -235236 128935 -91559 -29157 -27294 16223 -112291 141081 124208
22978 124208 -342732 -250989 165717 106508 86105 -88430 -98750 -214998 251947 181999 -98969
22966 -120387 95263 -12417 -122506 -241510 22308 -155592 334903 210185 29646 293952
22956 293952 -77942 -182037 67651 283650 -187767 -196777 37649 -77560 73522 -55071 -64432
22945 -64432 -269694 54068 -75778 -60346 174016 101319 -246667 180081 -47533 -93872 -90796
22934 -90796 28083 -181296 111579 140098 -56854 -18873 -87824 222388 -248185 112768 -258949
22922 256645 -31435 -90813 109811 -125391 261703 219561 139610 29682 -20841 -13023 49377
22910 -225640 328952 -59495 -29592 -29126 -349398 79029 -305258 -301575 -146544 -2063 -223987
22899 -223987 112667 306974 22878 5832 -49290 -109176 57704 -199933 -41805 69898 -152072
22887 60124 -31493 -124519 19046 22209 -196496 172085 -290413 30154 328560 11422 149245
22876 149245 268139 -1435 -148230 72260 -323645 -15674 163657 -13853 49021 64780 -156695
22864 178470 -57668 -217585 -238880 -62656 -81282 30153 97501 203460 170311 -103006 -36959
22852 -31394 -46254 -3816 -2732 -377262 -323521 178593 -144638 -324353 -88730 171425 -279486
22840 -18106 -122814 56891 58699 -148903 7630 -53872 102609 140704 -12864 -20121 -128193
22829 -128193 -198963 92947 79878 -290453 -53742 -128811 -147391 -124850 -99794 -232977 -422272
22818 -422272 -43030 277867 -118877 -291136 173172 180272 -354510 -157642 -154720 -164095 -14854
22806 -119037 -93699 -122781 46784 86119 -256886 -32134 -3725 63148 82364 -228987 -185576
22795 -185576 -259850 -191690 55457 -113100 16782 207357 -172056 38952 23720 60192 463539
22784 463539 -147187 -141897 78162 50623 -86487 9555 -1908 -116750 -121399 25073 -12072 -93482
22772 -93482 273648 500109 108048 -77919 93167 339979 5470 -233986 117209 -388642
22761 330932 -260567 -58748 259881 -103318 -157720 -157316 72971 178174 78326 -138953 152350
22749 -60061 -26099 -159446 152631 -141196 357548 137003 55057 -186528 -47743 -7317 54212
22737 -139859 -126296 -129333 -40084 -68709 22700 -140632 -57764 -135545 -154034 120880 -202860
22725 187418 -52709 304409 314490 29809 -280409 -162687 99721 -20047 32149 280832 -246545
22713 -203833 -17541 -103214 -8618 5030 180875 29058 -30382 -163650 -73263 -736 34008 306747
22701 306747 -96310 -124589 -75370 143316 -123906 -348292 -45277 -218731 1081 -55567 -128920
22690 -128920 187017 51285 58765 -106930 -360608 -354007 -113845 116077 -171926 171235
22679 150507 2595 66805 -202085 131864 -247869 1016 -149389 -212280 188431 -226140 -85098
22667 -229725 -252234 -63509 -202069 -162011 -269555 63146 -195766 -80100 -87439 147303 -95056
22655 -280660 -255523 -34982 -160224 63657 -344344 -282852 -73419 257089 -226935 61595 -193338
22643 242521 51878 -66300 -43946 -223528 -4201 -170471 -194234 -79707 -112896 -200202 -97115
22631 184150 -71076 -5386 -85138 -141311 24060 -105713 39079 -436761 153034 -11853 7908
22619 56940 -5982 316906 -220410 72090 192104 -55161 -251074 143356 -157637 200575
22608 3293 982 56300 36514 56762 -197567 98151 113402 129759 109702 -568904 -56850 135522
22595 -144924 -115537 212795 177650 93540 -44301 -432175 42171 88323 114303 -280077 -15388
22583 -148417 -227085 68846 84315 -187150 -142489 176721 -46479 -359666 -264088 32282 -22663
22571 182395 -68725 -2756 -290291 -53203 238607 -59224 -413916 134965 -95554 -32737 -262605
22560 -262605 152506 350407 7973 -158177 -164749 158245 169025 74779 -89524 284216 -209652
22548 -142409 46280 -11535 288045 -26110 68074 -31386 -23054 -31462 -118876 -233646 -153637
22537 -153637 52318 -6605 -187406 59138 -101694 124753 -126803 -176217 -233835 -136647 50496
22525 -263667 -227082 42382 212657 -216035 -220166 -41777 179442 84405 -148105 1633 -57958
22513 -54073 173746 201016 -29473 -154626 192478 -248935 -183101 127222 -222498 -9954 -344978
22502 -344978 167042 -62350 220245 -319043 279644 -169414 122180 -259793 46100 -108293
22491 36208 -131687 157138 -164496 -72577 -91575 -8651 -86496 1626 20901 -36638 -209207
22480 -209207 237402 42168 211968 -24997 32892 310308 22818 -331171 57413 70211 -157723
22468 99137 -358501 97396 309050 109248 109327 97548 -103175 -118749 -143891 -184208 67637
22456 -8448 4193 204639 -89950 -81107 -13916 -235739 -81512 156690 -70636 -294800 -92011
22444 41458 211656 6122 -44783 43437 254201 8569 -295963 -360536 -164735 -49097 -70110
22433 -70110 -201033 -227524 -19524 -139468 -286008 -53840 166149 220800 -68592 -213303 -2857
22421 17998 -72374 -105991 294533 119242 126539 17923 -52409 234047 -35035 -204424 66251
22409 183276 39548 -283027 -45439 86722 -102473 23874 -184569 -95303 -24315 39959 -249955
22397 -229501 286023 -106985 -386449 -55291 -197115 100016 79849 -217836 -97790 -136934
22387 -136934 -70316 26137 -300008 -158101 203887 204518 10071 -49970 -143555 15738 143933
22376 143933 -46935 -266134 177532 140530 -78268 -302491 184474 115712 -17440 15503 -388240
22364 -116823 252827 95466 -47926 -164215 -53026 76581 -379626 106726 -264096 -58854
22353 -272564 39762 94372 -82944 18166 -249282 58899 193825 -25430 38059 -432745 370714
22341 159872 117652 441824 247508 32459 -362249 -120897 -196815 -3961 188873 -179164
22330 -115752 144461 85256 -34746 -81121 -216211 -141920 -124661 -36133 246095 248794 6608
22318 384072 -148494 156843 67782 -238311 123965 -135478 97682 51890 -485529 12531
22307 263069 75362 -379365 134186 -280918 -164295 27097 -50504 1462 -181531 -8978 -191475
22296 -191475 -253013 -136706 -234351 219748 59642 48592 -237765 -91364 162615 -184755
22285 7696 232999 -60076 240465 -78847 -2736 -114451 -305548 138786 132463 -163654 290412
22273 303568 -108159 -60130 -5700 30629 28280 -11724 154504 -350810 186513 -140714 -28695
22261 -107369 -133305 -206491 291236 -240246 -334621 319986 -42803 274453 -136162 -10247
22250 -286883 24083 -107395 -94891 80413 -174649 -379720 70585 -36870 -259458 185497
22239 -66750 13308 -41022 56297 10629 85902 -123125 -136360 33964 -68994 105416 -178842
22227 -49527 -343254 -96431 86816 -149315 18331 -44254 64836 171198 -300312 102677 166968
22216 166968 37756 -177695 -156757 -107866 -48420 94647 -125900 -91858 -217022 22050 -128532
22204 -181134 13544 46328 114199 25030 77362 -35929 207345 88598 -273619 -17461 -44195
22193 -44195 306536 101827 224023 29112 -148144 -81286 394331 -20371 -228551 -68141
22182 226708 -33663 -41779 -62233 -210852 -10195 11280 120588 13825 -190721 119321 195954
22171 195954 -137972 -15220 -169771 45279 -44560 148275 -275464 87979 37287 -187549
22160 -122778 -11581 70294 9186 94986 -236495 203635 21990 -282684 -39580 106526 -58076
22148 -89914 -454303 -21029 -53694 17687 130320 -12305 -51479 124075 -21952 -177872 85198
22136 -134890 -66428 -180092 157935 158733 394295 -37206 -601291 -144323 67491 -172676 75508
22124 228020 -287884 -149366 40295 -219959 -295537 31231 127164 -34149 -388409 -384468 -87233
22112 -85774 165484 -313021 -258976 188904 221284 -240504 44736 -125498 -93674 -344343
22102 -344343 -178602 30483 -176380 -121267 44601 68568 -239607 -144652 47812 115657 248761
22091 248761 -126461 264843 111826 -500390 -492634 -159730 120631 -256341 164727 -105346
22080 83643 37854 209569 -37287 -261209 164674 236585 -3609 -162801 -231567 -79366 88023
22068 -290794 -328786 -114362 -298138 27683 -94603 125986 -52559 -230816 39594 -87200 -96323
22057 -96323 -492129 151838 -14715 246444 -216259 -119056 -74129 -323303 -115240 30956
22046 -228110 59354 -69642 62586 -230393 -341767 -35781 -11955 23531 63744 25824 -140865
22034 -68866 -88068 290731 -120293 244632 -168461 217159 -556114 104856 -39932 -37967
22024 -37967 2329 -4402 -201923 -252057 -152829 -30801 -43727 91076 -68522 273958 -9113 -302482
22012 -302482 -44922 -188718 94432 140651 -152211 -294504 24969 48822 -362467 -341297 -50893
22000 169595 -95328 -322179 -10916 39741 -94561 -201469 -69153 38192 -181144 -97608 -141739
21989 -141739 301741 23208 44483 -41023 -110671 -42169 -22506 191601 -36425 15383 -108396
21977 48819 -13370 83027 124664 -482381 119244 -176921 233821 -17456 -72673 -36002 -31323
21966 -31323 -286520 -16787 -107597 46446 158406 183209 -51251 -87940 -122397 -178923 58728
21954 -251548 -15655 -81184 119379 -373081 273833 -8302 -47854 -27738 -83150 -449543 -119292
21942 74881 -293392 -67550 -251113 31765 157783 243700 -98270 -200476 27582 -274775 129886
21930 -50489 -298870 -324257 -110898 -370740 -162951 40376 -153063 -63144 -322747 -107939
21919 -111785 24385 -238385 -252071 200200 -100096 188406 62228 131854 -102641 156364
21908 -440703 221868 -58555 17822 -17089 -58714 144371 -17328 75237 25030 -105764 56789
21896 6833 259429 68540 -60140 -191231 -99370 91761 -207424 158199 -146143 313171 -171649
21884 -61470 -132701 226877 315538 77039 467845 95247 -119822 -115124 -47809 -158215 47964
21872 -133036 -52811 184771 109630 -207217 29752 -223583 -45067 10421 -47416 114967 -30717
21860 69840 -77929 -250841 255934 -128249 36713 130652 -228032 -164187 -55686 -14595 -57179
21849 -57179 178800 91617 -158580 -55511 294078 14369 250538 -145086 140654 -23660
21838 124581 -243703 -303585 -118956 37552 -185784 -76129 -37691 112153 -132662 -85431
21828 -85431 93279 -266702 -29327 96196 177636 -279345 275224 -156190 -139555 73385 -209273
21816 -203320 240066 -23403 -144112 148773 -42833 -40578 -202973 43192 -159615 150264
21805 -54174 -116128 -45839 -373682 -428827 -21665 244229 -77398 -271145 -39563 -484394 193378
21793 -199351 55599 -250317 177676 -297705 190699 -70857 39517 -257879 -240520 -331602
21783 -331602 -79764 -78006 -129346 -30136 -50919 -50839 190231 40392 -48427 14448 57833 -88786
21770 -86952 -19752 22798 213859 189450 89690 419102 -198176 -164266 -151390 5505 23715
21759 23715 -52111 298030 -107067 -440775 205929 -67534 -11669 -99151 131324 -231212
21748 -15911 20828 -39007 -248287 -73840 -151843 -270643 175974 77152 -70345 -178858 -170475
21737 -170475 253681 -68655 -126370 -32009 -84151 91409 -158532 134656 -57341 155035 106261
21726 106261 180281 -230908 -149654 -6568 -321787 15928 228197 -140625 1122 -171439 -242373
21715 -242373 7061 -309699 74036 276435 -70979 -70772 138507 -96659 -153994 -146616 -9879 348307
21702 274383 95431 -135440 99237 -512195 -9564 -45286 -232199 -147719 -263366 322732 193044
21691 193044 163991 184114 -154507 -277973 -216410 109562 270150 -33128 24190 -5065 -129301
21680 -129301 -109099 -147047 25353 242471 -198473 -140019 -206024 21015 104739 -232694 -6559
21668 283543 -86969 -1215 15800 -355895 -222280 -28434 -135790 -27983 128129 -418716 129127
21656 -338350 16119 107703 -80652 -17043 -61205 -232242 -227169 -69985 -366521 -270962 -137096
21645 -137096 123952 75999 194946 56967 -68492 68719 -93259 360949 257248 -186381
21634 -216864 -266373 -247370 94104 -380266 -113937 -201291 -113133 -173517 -157509 -39449 61135
21622 311995 -11114 -240975 -61572 -177237 -192575 -168369 401877 126928 -185951 -133082
21612 -133082 -261995 181357 58191 182059 -155910 -17291 28243 -69709 -19443 86155 -59207
21600 49999 75160 33486 -181573 67034 -105048 -196493 32186 -176115 56335 -199143 93042
21588 40537 -6724 -129295 -23995 39126 10859 -237239 29001 69713 17700 801 71646 -82214
21575 -58403 -341779 -52440 -95490 -176269 -98189 -221466 -48 -42171 169508 28835 -83525 -282576
21563 -282576 46953 217987 -11913 -68014 66445 284543 -241048 179863 62220 44997 -163037
21551 -121908 -180044 25765 -101393 -308195 -332154 99362 137004 260895 45614 -283986 181480
21539 -229534 -81301 -93628 -8528 60892 -273429 -193923 23733 143845 111971 -46656 -156753
21528 -156753 -12510 47092 -116929 -156478 46869 474110 134001 270351 -128379 103192
21517 135749 82277 -231747 -137064 124426 -154283 -26346 -124188 -364239 -157842 28678
21506 -171981 -431363 -111124 163713 -191431 -57790 258225 -210581 -65642 -67663 -47369
21496 -47369 -101223 126008 222424 44784 113728 -248983 2661 -106833 145145 -76721 -24985
21484 -158085 252612 -273312 -162656 194518 -189852 -272475 1360 76717 17763 -160315
21473 -45357 204259 -56334 -41803 93934 152933 -50087 -177047 -166628 -350323 254821 233078
21462 233078 -190561 -8683 41325 129297 -89798 -121639 -96476 -13450 74331 -151184 -16208
21450 -308445 -435588 -323083 -346558 -68512 -305072 124276 -47937 265134 -141413 145333
21439 338797 423745 333475 208510 244195 517321 -191763 142724 159282 169620 -86323 216214
21427 -266853 -60082 201556 -194101 415556 -113249 79651 173933 -291339 -10889 -29005
21417 -29005 44778 -300609 -120074 23985 -477695 65954 -134650 -95167 2364 100057 -316092
21405 -90894 221752 -181005 -103055 -156859 -111949 -54144 -132170 21450 -112098 237155 -82828
21393 -76067 -91852 -28182 393851 -49039 -402584 80056 -161986 -143748 -186772 -133767 74012
21381 35228 -402382 39296 -163303 -148350 105336 -27530 39609 -130701 173457 -169326
21370 -22893 -405937 185584 -23372 -26269 104998 -127873 95559 25877 -1731 -290891 -6137
21358 -46968 -58584 65352 -102359 -137131 153562 -230346 -166190 -88072 239015 -208920 -116590
21347 -116590 -329836 29475 14414 -166072 98508 -113003 -87076 35763 -239601 25627 -303904
21335 -272578 -116861 -473475 -300709 7923 -124164 -132031 -27525 -159210 -368938 -152573
21324 339995 160843 -208537 -125402 8775 -16464 34279 150497 -17671 -455471 162013 12170
21312 243560 -203675 97162 67225 75993 140591 -101964 -100288 -177889 98745 168807 -229637
21300 -412800 -1667 20222 80660 -22224 -85224 -351460 -219996 38400 -84798 -322895 -357585
21289 -357585 239986 -68338 107896 -242562 -428862 -46076 -271037 -193677 14575 -87386
21278 423419 82938 107767 155927 154904 -437389 153238 -251643 -167846 -131275 31518 -161890
21266 88541 96371 -251273 227304 -403523 -80303 -135698 -22170 -93016 -22042 299912 -24592
21254 -150950 -108222 37756 -8669 -54847 -202962 -236043 114218 -289230 -96491 -243700 -7688
21242 -220307 -257552 -393343 87497 -249691 230307 -184785 255 -569938 46021 79282 101278
21231 101278 107620 -328977 141761 -85578 219980 -61 106004 22420 -193701 -77344 -30366
21219 -89389 33585 50613 -30602 -226215 278230 73888 -75668 -285561 8329 -32543 -240297
21208 -240297 -205752 -10119 -244189 269007 -337324 104171 -223010 -253187 80092 -409880
21197 -166545 -147653 54957 -76707 -16176 -260827 -19014 289012 46227 -21232 4347 -129023
21185 -148788 -194008 -416210 -138493 -120080 -137277 147373 296943 1878 -311535 73242 -100398
21173 -65140 -208207 -244053 123357 218522 -38960 -194467 -3776 258998 -7095 77448 118205
21162 118205 -183948 282209 -126423 -43887 -155255 -175835 251098 -163452 68856 -164553
21151 112265 15633 106237 -143042 -62589 79429 36957 -84757 100692 -65919 -208288 -77521
21139 -253921 -187333 -234757 216272 -157319 -306087 -156402 181108 -49069 -115436 85819
21128 132738 140267 192601 40910 63665 -232428 -213274 131763 204234 119139 4529 5023 -168993
21115 -399527 -152671 -152092 45915 118485 55630 -499058 -114998 -442954 51915 304296 -331212
21103 -196599 39056 54477 -142524 51306 13419 -320115 94408 -109956 -323595 -225064 43263
21091 -103085 146736 -226873 34454 -8579 76494 14186 -329401 -131156 -797 -59192 69823
21079 -1857 -22411 -99785 51057 -53462 -17522 -401973 -35151 -46331 234366 16931 -331826
21067 -90830 -191695 184806 62142 -37527 -228508 -58793 365717 294299 112047 37051 -75780
21055 -166797 139182 -349636 -53899 22076 53187 -131066 -176741 64951 222054 133643 79294
21044 79294 183372 -59627 7126 58430 2225 55183 -93507 -101387 -183387 306263 -90678 -97853
21032 -97853 -126176 -408954 -263119 145133 -304267 -146352 -193441 -38587 77884 -374572
21021 -355966 18351 -38940 -169964 -59525 -216018 405425 365407 -206575 160047 124407
21011 124407 -485872 47442 -148072 371709 -82212 -156764 230864 13550 -262690 -16933
21000 -29684 -317525 -22208 160764 308838 273481 118496 -27176 253514 -13207 -213894
20990 -213894 37079 15481 390505 -245012 -108427 -320481 437346 26121 58496 -458922
20979 215008 39057 -27648 -72593 -112215 -94984 -362135 -347268 -146627 -218737 -114635 -113183
20968 -113183 -5810 -194598 28411 99206 -103692 -162050 224203 73412 -248295 314403 208970
20957 208970 -78391 69374 -204869 229729 -237306 -159547 -11475 29945 305412 -250697
20946 -166052 -274927 -144636 -31897 288246 -15166 -141099 54980 -55604 161116 307801
20936 307801 90862 -58252 -146667 8711 -115068 -362570 167148 -153906 84479 -324617 -83586
20924 237916 -77604 5629 -171331 -203989 -309017 53603 118827 65184 -84681 113037 51273
20912 -76622 -238000 127053 70192 -37530 -275712 -196927 -233128 -215045 214792 -147516 -1147
20900 187972 45544 -78659 -210393 58637 -9205 47532 224605 -118371 -154580 -53210 -93131
20889 -93131 -5558 210673 331816 -273338 29186 -295868 -263778 -40208 -49964 -73118 -159108
20878 -159108 -150190 -285354 -83209 -145336 342496 -95948 -150988 78144 -63808 74589 -104311
20866 -156091 9011 188343 18806 -19225 201964 -86266 -363437 -110143 -136588 -8626 -107847
20855 -107847 -97768 -202084 -63087 -48324 95105 -224061 -338386 -304586 199505 73334 -56112
20843 -196079 -225128 -109838 13501 -185556 171436 -172322 45285 -205836 -88446 -103506
20833 -103506 -188804 -71086 -134845 -57047 -82854 27672 -297823 -195890 65225 108979 87515
20822 87515 -43116 -44062 -166472 122845 18197 -153675 -24721 301947 135675 -138110 -124294
20811 -124294 -173489 205947 -7287 -79167 -169085 -141246 -11752 16155 -15298 -29108 -7262 -571746
20799 -571746 39140 -157695 -132136 -260751 44931 -27831 -60875 93458 72664 -81769 114351
20787 -156547 234105 4555 35334 44130 5213 22178 -92335 81716 343199 -87163 -129460 -20006
20774 152439 -167674 52240 183949 -84109 -190353 312119 -131598 15553 177902 -186886
20763 -123861 55819 -138140 -185287 -32835 -95983 175450 72137 187536 -180390 -103234 -372864
20752 -372864 65241 -25720 32159 220920 63846 -141887 92125 -5432 -259461 -54352 -40215
20741 -40215 -252374 -178564 -72976 -108542 -26497 -196379 -61917 -47453 -56788 -346085 -5410
20729 -133645 -56268 -110973 -285540 -169393 -422035 216251 -264498 173062 95243 -105368
20718 -219209 42037 -115392 -124964 133174 327757 -31956 55046 -304097 -431327 73354 -186872
20706 -266253 -113338 -107386 33534 51387 -407831 -497784 46445 -245464 -234220 6798 -166347
20694 -55410 -277201 335337 -148681 -352523 1188 -53366 -110946 378099 -215268 -119969 -129656
20683 -129656 54613 -138381 -143804 -253481 272937 -33368 134687 -10641 107751 -137027
20672 175446 179412 24141 149077 198187 170926 -21643 132186 140492 -268570 -265509 263434
20660 279963 112915 -188019 67163 245885 39491 -77383 -3780 241091 -468537 -68752 48672
20648 40336 -171844 287279 -99228 22862 -37177 -130378 -210477 -401500 -237152 42671 -341220
20636 -243566 183464 171197 -156815 -142045 -91456 88948 -99468 -99824 -111728 104237 39265
20624 187211 -55111 350615 47552 148320 272121 -207869 -144454 63147 -150472 -390809
20614 -390809 -94202 -247562 -163530 -229296 290976 1145 -219598 -142581 155613 -143838 205100
20602 -38005 11577 119179 -216 -447869 -10595 -186308 -1346 -243934 306769 -119217 -319326
20591 -319326 334114 -221085 -138129 240562 183033 14996 104616 120052 111883 -194852 -27730
20579 -921 217064 -262890 -144965 -664141 -130969 -220319 -85564 -35816 -105706 96469 -45519
20567 45849 83279 -322641 300248 -177773 -34488 146695 35552 184608 -244975 -199179
20557 -199179 166292 109054 -65270 139656 -349101 187377 -10471 -252719 40080 54187
20547 54187 -216641 27027 -399714 145560 -67993 244774 182799 96409 -273772 -266680 -432559
20536 -432559 -187329 -120862 -88820 -143839 -128973 -55478 -104866 -138802 210325 -270625 131171
20524 278776 282448 -208090 265319 -17488 134456 -70086 105805 75338 -278094 -92012 -26788
20512 140966 -61564 -205813 -339240 -139156 53665 -15558 -250648 88266 -209078 145509
20501 -236844 124270 84200 85213 23228 250569 -432940 -113449 -53327 -77804 -51880 -410784
20490 -410784 -113665 -91695 -211861 15787 -189790 66353 -210607 -32892 -242947 -240099 -113896
20478 -169346 -365370 -252207 -334394 -21199 101802 -122233 -81121 10640 265614 -171408
20467 261259 -191911 -162553 -34654 -186292 -96952 -36962 -15036 132499 -35020 274319 -105759
20455 7171 -104060 21110 154666 149312 1256 252881 -129500 214888 -28175 21062 -8043
20443 -141124 150420 -12383 -23207 175323 -60243 141258 -127520 -60804 64567 76543 -28387
20431 -133524 413583 -23574 280034 129104 111279 -54854 -296104 46482 -31447 -306405
20421 -306405 -90771 -42291 62794 -45285 67850 -137679 -319419 255466 50745 -180755 -2483
20409 -253460 36544 155236 -333716 -142967 57271 -257334 72627 -20594 111496 -46027
20398 -356529 33500 67540 -278755 -6263 81945 -2599 -74274 -113396 18576 -118890 -22633
20386 -89453 -183444 -203105 75063 -38473 46411 -251448 120708 -275915 -81681 -237994 -76870
20374 -135293 26919 -143301 216951 -119791 -157668 82831 -271008 253911 -36747 -484577
20364 -484577 -337031 -93239 -296990 -14991 130028 103190 -240064 -283445 -24108 78341 4068
20352 -181326 4081 58745 -74034 -232809 -50931 130986 16460 -80203 -330928 -87404 -243944
20341 -243944 171028 -434 -138817 -181528 13858 -147088 -285582 -25870 -145568 -241925 -235436
20330 -235436 -230176 -161075 84224 -388345 -134781 103428 -14832 130289 -108720 -3373 -221518
20319 -221518 -108527 -125167 -229412 -136080 137820 -111606 -125522 -264640 -240305 214308
20308 1203 124617 51854 -90207 -260444 130816 210004 173018 -140000 81625 -237299 118858
20296 -62472 -319989 5456 -26220 163406 -73966 -16223 14545 -130935 -227207 -155819 -86827
20285 -86827 -128372 -46520 -189270 141727 -172666 -342972 -143175 -126636 -171514 -187418 -302797
20274 -302797 -154931 -34923 -111048 -55495 97324 109460 -92980 71338 -11242 -33544 242540
20262 -115552 55815 -275254 149256 -125125 -50339 15182 8606 -280229 82940 -207064 -373182
20251 -373182 231117 -16404 81189 -279543 183749 -118579 189055 -271744 -94551 -304460
20241 -304460 -385055 -100766 -117839 -324863 267472 -440493 -34946 215345 111698 -140099
20230 -227937 -256808 175091 10325 78717 -12548 59580 -56590 79002 -1903 127585 -141814
20218 -197595 9353 -171390 -255662 10139 -59841 -126172 -20506 68554 -216030 -92154 271115
20206 -185524 -95092 226990 -167066 169771 6050 49547 203917 -1752 -129151 -29508 423501
20194 -128911 211824 92825 173554 -164617 103809 138021 150908 -33623 40878 -54677 -224880
20183 -224880 82692 10541 107008 -21889 -323989 -122608 268245 -401123 82183 -51214 57646
20171 46664 93413 16622 257679 -541053 -200069 -307081 45362 -447913 -64300 -73323 -107718
20160 -107718 73538 -224149 -568061 27406 -395589 -258973 59051 -178908 65872 -52474
20149 46665 -91176 -151547 -68608 -61548 -294256 68666 37824 -36741 155692 -54268 5459 -124934
20136 176734 -166860 51027 196570 114725 -192191 -153800 209542 113838 186155 288482
20126 288482 117309 81553 -50617 179997 85825 107957 53138 -186180 92383 -144168 -94149
20115 -94149 -360251 -197420 180631 -13030 -14122 44742 -92241 12222 -106954 -202352 51736
20103 268194 -142173 -110278 -4127 -329756 42596 -282425 -33800 199438 -68650 127788 -22354
20091 97291 157657 -275754 -211169 -225185 96164 -249159 20738 56247 -15167 2210 -159159
20079 -31172 -196596 120045 -238024 91213 -98448 -368300 -32033 -266034 224609 -142798
20068 3420 -7705 -274822 -209309 -191344 -143248 -185681 -52699 22112 12640 -60299 -163415 -45562
20055 -97716 -21859 -286459 385040 -226834 90019 -189242 -301800 204936 -267984 348704
20044 -56746 -1885 -123103 -235286 -312564 -271339 -90721 -210690 -80061 86310 -118632 -608466
20033 -608466 -130406 -98445 206959 6556 86579 43732 -306383 -269306 -437306 -140949 465631
20021 -272126 -272409 -456052 27434 269533 -108098 1021 197302 -267678 252994 -162035 -247879
20010 -247879 -179531 -1932 -29993 -456537 -390492 -55920 25615 -73189 125815 -149131 -176785
19999 -176785 -134903 -30410 -48055 -263048 392181 264578 -39213 276545 159075 53689
19988 15996 36263 30792 -132870 172288 97127 21225 330962 -40657 -123948 -17543 85964
19976 -192963 -194758 990 -106727 27970 264339 -3587 -272291 -224315 -8352 -280386 -25193 -39246
19964 -39246 -21002 51240 32293 83179 -178616 195011 60840 -239299 -55530 97905 77126
19953 77126 30362 -10946 173312 26384 190185 -17280 -72617 -66438 -109106 -194709 -167897
19942 -167897 -16930 -53345 68239 -106332 247122 -233054 329750 39179 -18259 -176845
19932 -176845 -364395 -27381 -12557 -135285 75594 -125203 944 -88843 -461079 -428363 -90385
19920 -94563 -4578 112871 -202496 197373 95355 -84847 -388313 -216557 541 -139146 -199651
19909 -199651 -58862 -117708 -153439 123263 122104 184796 -266825 178264 275007 -155156 91115
19897 80723 -399293 -137251 60682 115271 -298853 -99488 -28149 -15915 11911 -336999 127972
19885 167874 -96026 -24633 -150292 -415635 -90785 74798 -16558 -99498 -89786 -173140 -22129
19873 -37110 -98784 15442 -106689 -93923 -34710 -330425 -260521 28882 70618 70304 246513
19862 246513 66823 141709 -45339 -50586 -433944 -43694 -97537 -124563 -109798 105236 -232478
19850 -168528 131521 68811 -132943 -204949 -61397 -116991 55611 -206436 2042 13273 -86934
19838 -25655 -204603 100241 -236065 -248025 117133 -71415 4661 -14652 -322218 -110110 -162080
19827 -162080 -57636 -161201 -171574 -130787 -222408 -233803 -285037 304443 -5796 -14578 16733
19815 -65026 113591 -110126 -277985 -12670 -145154 -14056 -33316 165225 -19628 -201245
19805 -201245 -127372 -45783 -139974 -233091 -235374 100205 -19760 3209 120572 -98232 -169084
19794 -169084 -299082 198139 137143 -229185 -247458 28040 -76933 -143476 -185768 -4329 101661
19782 -276949 101715 -38888 -303125 -74805 -341842 -153273 125940 178420 -129108 -100716
19772 -100716 -300602 40274 49915 276101 -97946 -215288 30649 -36713 -225991 -48151 -22375
19760 79755 -14276 -97035 328454 71731 -372882 34588 176475 -126724 212208 56740 206704
19749 206704 27585 -81242 -130672 -18164 269176 200911 -275316 16195 136787 -6196 -46179
19738 -46179 397552 251438 134556 266996 -221079 -167550 24274 -51055 273645 -6865 -186710
19727 -186710 69039 -90330 -235823 -8765 -32170 226274 275755 43906 -246964 -196973 -87434
19715 -624375 240774 -252570 -25843 -226198 105789 -112104 5990 -148963 123630 87439
19705 87439 22603 112548 259611 170124 269628 -140810 16128 -29000 -3294 -121852 31212
19693 -113506 -218868 -112184 189878 -108340 170325 67553 -83527 -343109 -128391 -36608
19682 50064 -29168 -279787 38524 -96695 123301 141513 90982 -351166 -23270 -153799 -196582
19671 -196582 -94740 -299421 40072 -222518 -278652 -289840 31633 152565 21589 112753 8590
19659 -48088 -252562 -550121 17104 -66019 -201793 -121075 -143632 -28274 253863 -617 426454
19647 -297290 -92566 -212807 -205280 -51953 86546 157705 -90458 -66963 -67501 -62647 -12647 -175296
19635 -175296 -32666 -9849 -180247 -22778 -205992 -188614 78831 38442 160963 -347630 45779
19623 -100857 -223499 102714 -42163 -160500 -292105 47744 36613 -319707 -29824 81020
19612 114650 -60532 199236 16502 -324907 31281 -12188 120602 188744 -373202 93840 123696
19601 123696 -42984 -187137 -37713 99173 -80488 -117983 28423 -446178 171201 -135913 91324
19589 196 -37769 -198680 -5268 -194507 106735 95787 -210350 -139737 -78480 250271 -446955
19577 -257134 -50405 -298367 124899 -366796 -533175 -151310 -103000 -185720 -28614 -493422
19567 -493422 59072 107382 -154397 -87909 -128700 27263 -313146 17861 -151153 116221 -64239
19555 104443 -106855 -14903 -46900 -25713 163606 157476 -3504 -450943 89716 -116340 -59237
19544 -59237 -108015 -16466 -110477 -394756 -243047 -73979 -154351 -169782 419888 -346767 25258
19532 7181 10619 121368 70505 227758 -98354 -31307 -61086 83418 -76198 -118806 -381015
19521 -381015 109188 87481 -17016 41384 36814 -198405 35616 -120692 -291786 -152965 24664
19509 46536 -33044 -20926 35247 208701 -93082 -45242 78752 -81743 -116630 103546 -167193
19497 -54557 2502 -99761 -45561 -165291 288213 -349297 104115 -313365 -168974 -8385 -357609
19486 -357609 -207711 66265 -24881 -43043 -64983 -14859 -75183 -136129 -94540 -26430 -302975
19475 -302975 154346 -133720 -76111 244830 -146553 166132 164599 -82858 39883 109750 91615
19464 91615 27295 -258792 216749 -94500 -78921 23184 -280675 -96853 -4120 394967 356285
19453 356285 -58155 58912 -168238 121839 -32160 157551 -86787 -123748 -75401 -43521 81980
19441 -327832 -215343 -305228 298858 -159169 63699 174811 51685 9993 -65346 197356 -159659
19429 203029 38620 77092 -103587 -136286 -105581 -93624 -33803 -75905 92323 51545 -272249
19417 -45871 60004 118472 -137291 78646 250800 -19897 -7921 -9051 -302185 -204041 263426
19405 -259886 -291437 -24989 -209555 -301674 -179240 -138767 61991 30260 64299 291835 -72859
19393 -172480 -146883 -168166 -382549 -352968 108701 -107185 195770 -237629 -206354 136458
19382 170564 14391 125130 9853 531363 -239642 -152399 -177905 90660 -153979 -110977 91275
19370 -313150 -186874 -188175 168202 181945 -172048 43366 -30313 -376769 -41515 -42222 -95526
19359 -95526 -20222 81075 107600 -28079 -26134 -343037 123845 -235787 60494 71746 -39106
19347 -175289 -57705 -41392 -262854 -45924 117766 115225 -161066 -246878 -540490 47442 -218981
19335 -163379 2608 -39421 82883 363840 -74554 154787 160041 -98227 -92908 -83744 -175545 94378
19322 -91586 207129 -210301 -178332 -192541 -83251 -65618 92250 110406 124328 -173152 -80081
19310 18634 -161462 -171963 -53154 -243745 -144672 97465 -9306 -152199 -178831 103157 -241412
19298 78023 308223 -33895 -328173 191234 35586 -492173 75298 -203370 -73662 1829 239249
19287 239249 -70993 94871 -180683 91444 187461 -128630 -25029 -34189 -119371 137666 -82371
19275 -132095 -231934 -191337 -291708 78516 -58728 78810 101620 40472 -11216 -413653 10886
19263 -3786 -55583 -55652 126626 160816 -287360 100073 -77752 -112355 -47445 37050 -156644 86271
19250 23462 36540 -36067 -199472 313090 -294043 -172731 27359 -15058 -88101 153816 -109796
19238 -174744 157554 -256913 -330991 -92359 -123356 163006 -1708 -271411 -72672 -83946 -197775
19227 -197775 -54139 -233610 -6430 -37587 184188 -65992 -272101 172126 81498 -56386 -162306
19216 -162306 -136520 -113666 -139715 -176547 -206613 -55915 -180610 102203 -39079 -38938 -105688
19205 -105688 -172551 162601 -246122 24782 21817 175457 -250793 16153 54415 -143934 56638
19193 85365 37173 -95650 -93318 -20818 5612 12969 131734 -145137 -334477 -16083 370181
19181 142839 -288360 -134472 44564 -74914 -196611 -113513 267444 -19465 198951 -30464
19170 -103013 -332728 -365087 -80991 -133981 -159942 -289474 -306048 -8290 -41827 150793 -103587
19158 -147498 -74317 66387 -135334 -298027 163873 -113593 -54434 44549 94639 -42268 13169
19146 118500 110616 30776 -226103 -427836 -161273 -106954 58260 4692 -140508 -101630 -308273
19135 -308273 -135232 85982 -161261 114073 227134 134838 -446911 -13390 -140543 -35206
19124 -54740 -103545 -173232 51899 -131190 -388977 -400947 -131467 32363 65958 -125097 4438
19112 -3230 29169 80939 -199424 -51472 -55741 -10710 -62162 7621 61510 76907 196575 55598
19099 -407713 -151041 34666 -305559 73727 140201 136596 461588 3351 -422820 195152 167202
19088 167202 -140432 -188749 -214870 208672 69880 69099 -14801 -45142 -262599 74191 -140265
19076 -97911 -134422 -127955 -421939 -294548 -182964 -145134 -81367 95317 -69752 -249912 -93842
19064 170732 24085 -220589 -90253 -326299 152549 107505 75925 -72492 -164668 -120352 -168547
19053 -168547 166128 -138932 -56131 53740 308886 160648 120298 -35023 -186227 -196506
19043 -196506 44705 -97747 -26677 477577 -133419 -281879 -42785 -244772 -23344 -322140
19033 -322140 63624 330528 243085 49541 141172 185263 -402792 -142766 -84174 -172516 125094
19021 287142 210886 -28928 269829 -199658 -53958 -3301 -60030 -49021 -65798 -67543 79795
19009 -364150 -19908 55138 -120810 124639 -511114 -59803 -13387 35092 158928 20297 -36448
18997 -11997 81703 72232 77812 -87483 -249453 -227235 -36440 -427741 41584 -230376 202664
18985 279387 123411 63395 -170176 103603 233499 -5370 -215994 3993 167550 -13296 -166829
18974 -166829 133150 -64049 -382414 -170170 35713 -41327 50439 256280 79228 -187066
18963 -92046 178337 -101184 -3970 62375 177901 -660 -359019 60290 -130815 23966 -10915
18951 -145924 168454 66791 -137945 316338 231209 34908 126852 -153667 -85913 48452 244737
18940 244737 26159 53098 -258428 -158652 -18463 -202785 90059 15609 -120377 77602 -112922
18928 -73039 -80243 -119603 278453 240192 139291 -345927 272367 99421 230414 207275 -62782
18916 -150011 -29678 -166920 66331 -174728 -170427 -161060 -112474 84232 -277586 55650 -209113
18904 4886 -138927 -118799 55099 -4293 -221952 -153046 258064 69407 -226344 94625 -161009
18892 -129105 134777 -55855 119426 114132 -263901 -62612 -234332 -117971 -74396 -60721 234012
18880 -46074 -92464 -12230 51432 -131734 -60553 -157442 44470 36343 106261 214119 -269706
18868 123516 -126827 -120696 -184366 -54668 -5800 61830 -286622 104718 -20579 -258592 -48762
18856 -130229 50050 -126406 280782 -248175 -215460 148437 -18413 -17134 -214797 159894
18845 -190156 250758 -203053 372417 -55479 -503524 -130749 -40858 -10597 -384024 -60242
18834 -200647 -66760 -252905 -246499 41201 -10907 -69710 -96235 -203948 -102752 -131689 5862
18822 215064 -346139 -763 -321711 7987 -39703 77121 84648 -426911 -270669 269180 285321
18811 285321 160813 9823 242471 -166313 -56561 36695 15561 60277 -211670 197715 13259
18799 -148662 49338 12822 82319 -89762 -53152 -38606 67042 31889 148196 -257105 -264613
18788 -264613 6073 -378966 -83149 10126 -159037 30817 -20389 -1767 -247931 -363298 14455
18776 15047 194638 -185880 -106902 104157 -111252 145571 58249 -319297 -10998 -333190
18766 -333190 95474 94096 20736 384094 -367694 370290 -56228 -358242 110176 -150083
18755 -164245 -144152 -309409 124409 -134343 -28329 -259736 145875 -36073 26219 200488
18745 200488 128030 -65764 -44873 13607 -57402 -120942 46609 62391 254337 50823 3208
18733 -113015 -67529 -391951 -89732 304302 173694 -4769 64561 -61849 -159275 -57159 113097
18721 -159122 -111023 -130251 73153 -299644 -226413 -141671 -367409 -202119 -130594 -6058 -247501
18710 -247501 -127076 -4908 -350977 138131 92575 -175660 -162200 327914 -230158 -335035
18700 -335035 -57736 -72586 -207290 117108 42067 -167548 -17205 54610 -19969 -36239 -111698
18689 -111698 -3619 -350348 -252074 -302189 -224992 -188384 -250470 -172642 -252691 -161292 269623
18677 128074 20433 -113536 -224655 -111376 -225404 38651 -170627 -292690 -249172 -28918
18666 250821 -312929 -280949 -17827 -112149 -94363 42103 727 -56634 -261962 -24330 80273
18654 -54253 -253038 -78158 -268644 162023 -64293 34031 264286 -145284 191984 86218
18643 -104755 -43890 80997 -83747 182923 154338 193004 -155473 -354228 33496 -47530 -124175
18632 -124175 101536 -69742 174841 161510 -291160 -383506 193495 -19028 168356 193377
18622 193377 -9545 267589 -177500 185833 27379 -225827 -319372 126810 -70037 -168249 -178373
18611 -178373 -11758 -112926 -220950 -107132 8569 -297659 3609 61447 -179357 -160253 -114456
18600 -114456 -278857 -19700 191414 -110881 221159 79212 -130210 229100 -268362 87747
18589 -113463 -516243 275088 -99556 165831 206107 -182150 -273012 131169 -176975 -289866
18579 -289866 -120845 85721 121034 82958 -28145 -65767 -92019 244425 9838 -168601 -189079
18568 -189079 146828 -9829 -50985 -210859 83707 -233810 -104667 -19219 43495 -39882 -139235
18557 -139235 137306 50950 -215470 -179073 69860 -206991 -166195 -360770 -140304 63079
18546 -84716 -249205 -25206 206565 -224790 -3009 207936 -308733 -319405 20465 3244 -129110
18534 46857 260509 -190654 -179575 -58421 15017 -105592 -274787 -21173 15382 -184426 -126351
18523 -126351 -136525 83253 -158735 74263 -55406 70963 93427 57706 -267717 -95436 87633
18511 -140192 -123548 -204280 58353 3957 -50975 125506 11330 -203569 491392 -479179 -470778
18500 -470778 19670 99447 63872 -244027 366034 153411 -327364 -385737 -128796 9923 12763
18489 12763 -123369 195353 -20009 84693 -451144 -272696 438478 71589 -432668 -251157
18479 -251157 -160117 -163462 -104665 14673 -361976 161490 -227305 -129321 18946 -56059 -47197
18468 -47197 -220591 -117214 -217145 -206508 -157313 -96992 -285298 -4461 -285665 166353 49480
18456 78436 -80832 152135 -248636 226735 -210707 218803 -39037 -27939 -214851 -233395
18446 -233395 202533 -13388 213207 24149 -236941 204992 166421 -120177 374188 -156928
18435 -210712 -254607 -69706 122185 18340 -148138 -77946 -744 -257944 38675 -113499 -298561
18424 -298561 -261142 -49506 -19835 -50652 125955 257913 -280883 -91346 -94748 143883 -40374
18412 -137431 -265773 -125566 204852 156366 52878 242509 -1170 100134 127084 -124758
18401 276069 100390 42208 -142468 26978 -360272 -242236 -79265 -7270 -36289 -12123 -248873
18390 -248873 -83227 249846 54419 -278774 -61761 -412934 224885 183216 122035 -428105
18379 73871 148458 22210 144204 87136 -138933 -168720 82544 202649 402166 139167 -6766
18367 -212124 26353 24961 296527 -276038 234893 -164580 156644 -336304 105927 33 119318
18356 119318 -92481 -2666 124923 -187266 110465 -230409 -85465 -11868 145403 -64265 -139228
18345 -139228 -162299 -11867 -59272 20799 -264897 -45644 -70398 128285 -204892 -244602 163630
18333 98030 -338972 -145895 -61860 304141 -100881 -61229 36514 -127012 140629 -96017
18322 -469893 3597 108109 -163966 -32105 23569 255145 52020 157125 -97484 392724 -271876
18310 -171801 -365882 55853 -203520 98247 168688 -84704 -167784 -153516 75928 -276391 -190809
18299 -190809 212264 -125187 8022 -93677 -184829 -283758 147723 -186756 215771 -61499 121719
18287 -98876 -111129 -52837 227049 -536150 -237239 121672 57292 67743 -271595 -137513
18277 -137513 -233622 -134516 307552 -223471 -124727 -126986 -66382 60909 -204808 141073 -239198
18265 45344 -52726 20859 -135738 -83633 -86962 -14435 126331 -13072 115747 202463 105108
18254 105108 -83518 -283430 85138 -138981 -70875 -327244 -210852 133206 -25154 224894
18243 74279 116515 -60094 -52600 -382411 110261 6936 134072 327937 85416 131349 -189648
18231 -98943 -328494 18816 -14933 44666 -34269 -123358 -159841 86584 206911 36299 26289
18220 26289 -338376 -52785 86410 -408790 -14929 67982 -393158 144194 -236439 -121269
18210 -121269 -172550 -358642 -40632 -70392 -7288 188108 60852 -180701 224253 -173541 2107
18198 -34173 -1501 -1988 205184 -100835 98368 -26073 -389651 329304 -374336 88261 111028
18187 111028 18492 56330 310085 162780 -84737 37594 93751 134102 -239886 -13041 -86375
18176 -86375 -74074 -153675 -21984 50616 -16677 134168 -250731 -237510 14008 -77382 116681
18164 -13748 -1407 -206435 -130713 -270302 -168892 152165 -80770 -199667 42563 160585 1787
18152 187701 -45744 -126974 -200090 -36265 123899 -1087 -93901 305134 -82913 -159190 253577
18140 -41347 72486 106318 142158 -236586 -47987 3134 -240586 -87815 -155616 -376074 -508976
18129 -508976 -78233 -63248 118673 -237202 -6914 3963 127937 -285710 -134013 34010 -187084
18117 -250200 -29596 275739 -245657 -75680 -163864 6341 33478 2050 -207794 -127286 210162
18105 158026 114169 -65677 130575 -140867 98761 -127461 -186930 -79656 -194527 244890
18094 15496 -85027 -257278 -93810 -114217 -90768 -179475 6412 293699 221826 -3678 181289
18082 442781 24768 73752 102217 73995 -252225 -74778 -294939 -40909 -177952 -161726 49885
18070 142761 292603 297663 -112610 -352651 -58464 -176325 221986 28408 -143501 14014
18059 -37620 -280786 87842 -186949 74797 -160638 30053 152999 -9116 177841 89073 191837
18048 191837 -129865 51784 188045 313576 -161975 140726 -120531 322246 6155 387704
18038 387704 -37613 150443 -67822 -11769 -26743 36655 -90414 47447 -206578 -38873 -145561
18027 -145561 148031 4109 -180297 -22866 -16512 256660 116901 -17590 -157868 -77272 82631
18015 133194 -11244 -220016 49670 92985 309456 118016 -98964 37048 -29641 -279823 -220937
18004 -220937 214863 8510 -256247 -86039 50116 -85659 -38961 -255823 -238194 -61737 -221522
17993 -221522 110547 -84139 -18925 -283105 214798 -65868 -118755 162965 20321 -60605 -86885
17982 -86885 98380 -149167 -154148 -17094 71614 -202204 -246630 -64689 29150 -95818 248180
17970 155534 21306 -285106 31560 49504 -151112 49895 -114391 89616 -67015 66895 -170050
17958 -48005 -67762 -141496 46288 -54116 -92233 -118726 128027 266708 109423 -48868 -113980
17947 -113980 84782 -210308 170797 -364751 -214490 -51745 447460 -256158 121829 -332162
17936 -61551 -301889 -115137 9192 361263 327101 195612 -167214 72903 -18377 -80602 74550
17924 203342 -341841 -443996 -294911 -15501 18975 -37122 -63915 65072 -73210 -86108 215087
17912 -89716 48450 -5095 -145656 -67474 -226945 -384824 -22871 -145986 -110549 50297 135762
17901 135762 -216621 300613 -77026 231698 4466 101658 19778 -359252 -394478 4698 141709
17890 141709 145205 -115561 38179 -20868 236794 -42632 222164 -176798 163988 252512 -229100
17878 17251 199961 -140600 -28430 184342 -106843 -296720 246046 -17688 -55218 34805
17867 -27698 158438 127959 192766 -3808 -132213 -17179 31174 332419 201792 -130383 39763
17855 -643 -15737 -251737 -256281 90414 175331 -3215 -229238 105678 113973 57162 -162703 83830
17842 313566 -131356 294619 50517 -67984 -270052 -173962 81172 -72689 -31082 31928 -113462
17830 -225147 -42526 -229880 -70566 186954 -13205 -114244 118026 -145992 158703 -68345
17819 -30173 486 20914 -312350 147527 28363 178187 -18840 97302 -191646 75704 -53114
17807 222370 -271983 -13058 142953 -102301 369326 283218 13307 -80714 91908 325198
17797 325198 9944 67117 -161790 -36487 -551119 85942 -64678 39558 -127756 107037 17609
17785 41234 131377 -345292 -86681 -202005 -237993 148965 260107 38348 217391 -142005
17774 -58253 138989 -285385 -164088 98921 348792 132698 88648 183771 11578 -127821
17763 103556 -13041 299387 224774 230484 -115660 365355 -177140 342182 33524 28457 37472
17752 37472 -115765 179220 -364239 29789 423852 -79334 328427 -136013 -67593 264415
17741 -135825 127442 -110833 -354869 -83181 235827 -91846 25774 110311 53954 -66699 259494
17729 -243774 92439 -38771 -97207 34288 -121148 -137770 182012 11836 -175793 82179 57420
17718 57420 -274589 146554 -8729 206565 -259195 11723 -158298 218815 -93500 226386
17707 -5974 -33186 -411878 259274 115638 34283 141874 -35959 88848 159393 292676 64107
17695 277409 -175948 170941 12694 57082 -32848 -76830 65528 8780 46182 139464 279353
17684 279353 101790 170592 68836 108533 34234 -21244 -32114 -123720 -73624 125642 -62453
17672 -31960 85796 -97186 -39539 55903 -307677 -181342 -94788 87464 -203925 -265107 297995
17660 115487 253145 207463 -192045 -175334 75163 433009 -32753 89259 -256809 -63560 -163829
17649 -163829 47457 130549 -93450 -89738 -427703 70987 186038 239775 -30377 -90020 -122241
17638 -122241 269644 -28989 -234300 26784 -74148 -56947 227704 -113613 -19738 212967
17627 368492 -144706 42995 -10094 -147315 -187811 27287 88578 -6618 321615 -90596 30132
17615 181454 -122541 -66518 45838 -157756 -121083 -98296 336278 -126193 -16692 -45693 -24226
17604 -24226 -35819 -346819 64180 132092 55404 -78930 148407 -177774 -44750 13495 150117
17593 150117 -253935 -179967 149337 145575 -122740 -11347 -261514 -177130 71472 99774 104159
17582 104159 91573 9965 -169029 -212231 -154217 199182 246211 111530 249067 15324 -359126
17570 359780 -242903 165740 -107338 -191929 97737 88861 109701 -337142 119 211195 -48995
17558 2775 191537 191709 -80395 -54938 143596 -142440 -98067 -140265 159127 241139 -305441
17546 95491 296437 131855 -40324 9821 166982 29979 -56566 -245227 470526 160810 318425
17535 318425 26373 289788 159421 23331 -17635 32511 264617 15627 181368 101437 164299
17524 164299 62550 -109163 -71151 91392 140577 -88041 -89160 179123 258325 346481 -44107
17512 -95096 110151 -64530 37292 215705 -128153 17957 214735 123420 374159 227299
17502 227299 -33253 144780 30499 164609 282491 -59802 317390 -62586 -68690 192831 135065
17491 135065 281700 36412 -47576 -12228 116875 243122 17351 123142 38317 -72776 -59820
17480 -59820 140623 275493 129449 188513 441088 64799 -71093 29139 -176548 198800
17469 115866 339098 85866 94253 75247 112063 307609 79090 363253 252111 214157 -770
17457 262493 -34185 -352209 191451 179882 47808 278599 487613 412511 212441 88411
17446 213461 346860 441021 225986 143594 204858 327747 301482 179354 241094 122809
17436 122809 496425 52384 312672 244940 437265 483631 3178 187355 77803 355414 -75560
17424 160453 477433 208711 88820 116319 206873 -37890 227240 -120846 402418 474038
17414 474038 51060 278263 303170 91321 194337 63139 189707 147249 107585 504240 202649
17402 176172 117469 -49474 68579 -27142 72017 570310 28245 136282 162827 82979 381434
17391 381434 -132698 213077 158286 88831 145138 -71316 223161 -72418 185525 53997 381652
17380 381652 425230 14504 95177 72285 -57925 -32197 14076 187245 20535 117544 -139840
17368 162210 134508 -153278 -82649 203455 4666 -9389 215555 158523 94172 -83007 217413
17356 373142 88557 138882 196904 269539 246454 153702 -190219 431862 -147558 387996 22398
17344 388376 110113 373875 99353 -73117 102054 367518 -69527 252373 58904 328185
17334 328185 -37022 27375 80257 311357 103446 446527 -68903 164556 286848 213349
17324 213349 271214 -116236 -83750 -5636 317697 -28994 49887 -42099 582791 150916 107660
17313 107660 204783 -52952 569734 293643 27329 5377 120238 601630 86277 60165 385629
17302 385629 118293 9408 161909 -890 -36191 135337 135146 -115147 180293 -31001 50210
17290 369244 280544 180845 116234 210824 73479 163934 126738 256068 436610 345310 404936
17279 404936 433502 48502 180862 288553 -14090 143792 60908 27735 -29324 -83122 150733
17267 -33276 -20526 93718 102563 -81479 -95314 200853 278227 -103118 -83329 196825 112322
17256 112322 240818 -33238 48728 -214232 187805 332764 -155216 179737 224973 318962
17246 318962 137079 201991 424674 239439 232735 307124 207659 -28619 282443 -190851 252861
17234 27090 297302 135455 -61876 -65601 58400 465959 -315196 318923 3543 152071 44890
17222 295759 59704 -121677 162355 -42646 -65830 -47074 267634 189196 79167 209340 148525
17211 148525 450606 90187 90031 268800 240008 304233 -54718 258650 -171759 25065 142748
17200 142748 336639 18874 332372 337364 227985 339799 -145627 283780 369689 524737
17190 524737 405626 119771 306468 800858 178910 356508 230729 307051 195836 476474
17180 476474 313250 114535 47631 306190 -164955 238033 330626 392264 305356 454718
17170 454718 392527 447301 139203 19476 131099 -22662 -98197 401691 305936 355372 394092
17159 394092 170929 453810 236725 179410 302588 -108445 432894 262296 597023 38888
17148 384725 -10033 641231 505957 451889 466524 418743 39107 379739 361000 220818 425323
17137 425323 332107 150286 603737 81589 290993 551878 243884 605837 138227 567768
17127 567768 430342 144959 306869 298628 418925 476397 481245 610679 -51006 131380 572601
17116 572601 186107 268930 301104 195759 370841 55746 693271 543769 158181 311513
17106 311513 640297 57538 342876 427423 640674 464171 311645 310221 298160 186437
17096 186437 289436 85362 297713 93421 362769 330758 179615 94424 483590 287009
17086 287009 287644 536466 116079 351574 316198 168344 406055 358378 612324 518568 19564
17074 434981 391711 435393 444681 311658 264649 364267 451500 691930 682132 381422 505690
17063 505690 695422 567699 623327 633863 442944 445442 624697 286093 423254 420574 587600
17052 587600 391002 366649 611540 520736 484153 256317 683267 762243 575294 615794
17042 615794 341795 461228 679686 324159 674224 559158 719234 708779 543232 396530
17032 396530 489939 382512 469270 626020 614979 528738 677899 532336 696491 938698
17022 938698 558967 192555 489526 732801 526801 485293 454627 767956 680117 530294
17012 530294 705649 711023 561053 962711 486853 550651 745983 268185 1042562 476501
17001 686148 614996 627270 671678 577542 539190 484801 617954 626643 766302 870474 675953
16990 675953 607563 947587 747733 806245 612079 689552 824130 1104554 1031097 594821
16980 594821 811620 1081888 1066657 409573 982490 987166 989089 1064603 823931 899192 800238
16969 800238 885656 893181 846530 675010 1029271 837532 763750 1209545 949926 1164521
16959 1164521 1194617 683685 792910 965433 1014852 1206428 961345 1046841 1087609 838761
16949 838761 997837 1023444 885236 1279114 1219725 963459 954780 870472 1381583 1402117 1284701
16938 1284701 1656669 1193611 1324109 1404086 833764 1298887 1114345 1122837 1061605 1061075 1282907
16927 1282907 1113187 1218768 1511619 1355905 1338564 987591 1090061 1397731 1468288 1492510
16917 1492510 1508772 1221179 1438205 1465943 1477887 1704475 1286398 1238547 1360722 1782971
16907 1782971 1299952 1600226 1465765 1685604 1682561 1726176 1847236 1643843 1620023 1732410
16897 1732410 1656175 1607879 1882748 1534634 1827321 1823851 1993118 1882217 1983319 1964007
16887 1964007 1907057 1996650 1950837 1846306 1932386 1976079 2122077 1829654 2345271 1924601
16877 1924601 2085563 2133852 2196049 2151332 2553813 2140244 2063306 2355075 2428417 2441568
16867 2441568 2580468 2502634 2560129 2529785 2717492 2921882 2774477 2858296 2896126 2972423
16857 2972423 2874940 3070797 2716944 2942904 3130969 2828540 3182541 2970247 3094754 3450075
16847 3450075 2975359 3347027 3421804 3262041 3674110 3613285 3490365 3527416 3685650 3514277
16837 3514277 4002059 3921474 3733630 4464789 4071838 4376568 4134389 4314276 4392625 4590200
16827 4590200 4746673 4528273 4849674 4849209 4935973 5005817 4987242 5469230 5466408 5696440 5465893
16816 5465893 5763165 5776286 5587081 6030927 6309343 6269307 6445187 6899382 6844772 6796136
16806 6796136 7003240 7371300 7417614 7041729 7456231 7958109 7880863 8419183 8213360 8587546
16796 8587546 8854123 9125095 9240035 9325337 9481112 9658562 10307172 10341359 10899617 10942556
16786 10942556 11110431 11804794 12151001 12380036 12913710 13012964 13424308 13960265 14023221 15081375
16776 15081375 14964651 15745842 16365650 16323539 17244657 18172345 18381267 19258127 20023233
16767 20023233 20481123 21423068 22096978 22887189 23835503 24739323 25848802 26940891 28262036
16758 28262036 29709008 30552579 31979934 33028864 34730709 36533196 38320092 40133819
16750 40133819 41555762 43807607 45949943 48524281 51054926 53516258 56278507 59527731
16742 59527731 62915772 66329225 69809868 73784330 77790191 82424406 87070865 92022884
16734 92022884 97234655 102233107 108056469 113753719 119853008 125771199 132127744 137832710
16726 137832710 143634533 149024933 154138583 158571241 162225365 165483292 167447056 168407192
16718 168407192 168398660 167750666 165648633 162670972 159269788 155202865 150171844 144844489
16710 144844489 139140417 133313530 126905516 120925976 114837906 108935392 103460176 97896779
16702 97896779 92440079 87348108 82550297 78136740 74005908 69819968 66350702 62740425
16694 62740425 59449970 56264562 53305281 50368242 48044445 45831050 43638456 41610239
16686 41610239 39246435 37490717 35767464 34122345 32864902 31297800 29863774 28332000
16678 28332000 27501892 26399519 25574988 24633284 23311236 22248001 21815026 20770320 20185172
16669 20185172 19319117 18729188 17842304 17151142 16679168 15945976 15688386 14926040 14642721
16660 14642721 14186090 13826538 13361359 12934865 12617585 12303595 11830148 11624533 11035146
16651 11035146 10854993 10586258 10577704 10228204 9322649 9434239 8975428 8897823 8589585 8574152
16641 8574152 8229695 8169423 7582520 7659584 7745278 7349945 7314051 7032099 6728182 6773932
16631 6773932 6601917 6326118 6109871 6176645 5724462 5360678 5909778 5632844 5458042 5237234
16621 5237234 5027524 5261120 4795807 5166561 4882181 4729200 4466386 4592668 4717289
16612 4717289 4311670 4267686 4077296 4171354 3739322 3853172 3664809 3998228 3850604 3672525
16602 3672525 3297216 3469509 3899188 3396312 3398074 3509319 3225777 3157165 3255674 2925431
16592 2925431 3362252 2983580 3010448 2896035 2727612 2997522 2758636 2828902 2564051 2523603
16582 2523603 2756569 2588708 2522297 2581611 2436336 2561271 2548918 2313611 2608168 2365081
16572 2365081 1915830 2267124 2009810 2317233 1898178 2145884 2097478 1936620 1923460 2093803
16562 2093803 2017652 1824931 1794426 1996847 1907731 1737796 1868646 1697592 1688029 1928731
16552 1928731 1645327 1748732 2061260 1559812 1825388 1594056 1642508 1478291 1738313 1447769
16542 1447769 1301769 1659301 1271011 1300844 1299816 1238117 1405262 1420552 1261232 1435912
16532 1435912 1544275 1326789 1301171 1094103 1437018 1396262 1476576 1451658 1012232 1030065
16522 1030065 1154123 1134308 1061807 972108 1281597 1493820 1249008 1246486 884951 1183793
16512 1183793 881700 1125423 946005 898050 976506 1097096 1247641 725464 965947 1212146
16502 1212146 893708 858824 769351 1235466 1046493 1127631 1153203 770955 1053109 990017
16492 990017 885560 844234 1008588 813304 727978 844595 760553 481628 1058438 918722
16482 918722 687641 832239 1233758 627231 615217 697967 691712 892720 958241 690245
16472 690245 741919 975922 656145 712126 840871 588316 1031493 596872 675111 1088738
16462 1088738 912554 877818 988904 777804 1104372 721998 547341 643270 781958 739598
16452 739598 823188 767583 510025 542274 709325 592294 693687 574264 675601 317614
16441 459703 807050 333582 947196 854809 509384 468282 764350 683191 777141 125318
16430 392764 370854 630584 218263 641460 688551 937402 106976 587183 627873 440166
16420 440166 307289 749013 491700 449818 544768 232804 237068 640897 428948 677758
16410 677758 491686 589958 492850 392738 612207 318474 490842 433444 321486 496425
16400 496425 650280 233365 539380 556999 611710 317549 165802 381470 295452 171738
16390 171738 484518 661839 211571 663581 342652 150159 335426 264266 465928 345303
16380 345303 346419 127174 597774 164749 291988 300921 270002 411878 18663 530344 489681
16369 489681 44139 184272 159684 485258 358681 171397 442059 389405 573807 273929
16358 250524 371448 153053 333667 201907 49797 170099 104768 559214 228293 367179
16348 367179 261432 -112017 284745 422471 202036 42553 359616 320606 -109826 88470
16337 -100231 127627 433916 136501 188280 306561 318724 330618 202971 -6454 346630
16326 -115420 383447 453329 -42648 -29169 331470 59286 -34279 420460 31195 105006 170317
16315 170317 391653 246346 536401 70339 215004 -7585 243541 392925 -42373 31829
16304 410651 468585 443419 152550 160044 245201 254012 366891 -45318 205490 399159 136439
16292 270271 64303 80360 -55669 160932 108123 269033 217626 473063 434430 125536 295021
16281 295021 30486 177788 143792 270375 -250225 224374 99937 400039 -81712 199294
16270 377514 -82685 263807 -4879 622518 -96857 68891 197141 -10830 101443 -136936 118159
16258 314326 10007 -185278 -42539 144138 -101121 -126618 14942 67263 75095 42771 227277
16247 227277 364350 -28187 289682 147331 251704 179085 118867 -204881 -314369 -239566
16237 -239566 174785 -299234 242882 242118 -38772 143854 4439 560258 -17949 -322278 454533
16225 129930 41904 -137638 216077 245077 -16925 299351 -45709 107125 -136476 14411
16214 272442 -47702 169578 -81755 199515 146492 312676 -90853 278070 193944 -36567 336160
16202 145792 145097 19624 238867 66759 1222 143103 321760 68244 416039 50864 -85911
16190 31116 -167867 104647 -101239 63248 -117546 -252963 69782 188560 74710 148674
16180 148674 -116764 -53334 333508 320671 -341043 158627 23608 231587 427913 -212158
16169 137100 356681 117931 -126808 117379 -88731 347476 55222 110456 -60818 84484
16158 128631 -11523 272691 -260974 74380 20582 -49970 4055 -5039 134101 -20937 -9969
16146 186351 20719 -20852 -138058 258102 -60474 14638 122957 -66838 -105405 92875 -66979
16134 147606 240316 212764 -129359 214443 -65044 10093 -19569 193823 19216 -119044 -66969
16123 -66969 -472859 128257 -36767 51358 -262082 -111037 -259952 -164085 -4340 162919 233409
16112 233409 284839 -66115 191666 28961 32188 -45087 -106964 -52248 8327 165114 217391
16101 217391 -14434 262613 112446 85020 163303 -62512 288769 -206657 196461 -30189
16090 20892 165112 39014 -10153 239851 -70252 74374 372440 -70247 187947 -234122 142414
16078 -9793 41868 -387665 193241 -92422 187159 142629 159496 -43294 59659 93139 -283317
16066 44243 -84352 188006 125687 -351067 180131 -140229 134193 -10712 304282 -90040
16055 236443 157408 58729 -92479 -193748 -88351 -273504 163714 137211 20436 -156690 -177955
16044 -177955 -146430 -246693 -248489 153135 -41831 -120225 369965 -30106 -167114 41928 -133329
16032 -145054 171274 195678 -127891 -16621 -257204 -43913 19784 -203418 -24040 -154827
16022 -154827 219518 -275670 114246 205975 -121551 -227310 91710 -301975 -244324 -161108
16012 -161108 -214096 -182004 -268091 125736 -222839 278669 -108366 -66775 90128 -2808 282404
16000 -107480 -231364 -87634 -290071 45185 -114858 -119999 -107863 -199918 -129536 2690 73324
15989 73324 26729 -48272 108631 175259 169460 268495 241835 120275 203698 -64378 113136
15977 -83699 8562 -149097 -4466 -344551 138260 -383115 198506 -19841 181936 -79792 503501
15965 -68865 -215439 -142323 -124216 157023 103101 51502 9058 36585 133476 220353 -282059
15953 14602 67809 -242236 -318689 -54227 -108220 -66860 -151334 560927 78665 -292898 263090
15941 7880 180375 -16299 -136236 -84618 -27644 150485 -173929 -73377 -167018 -94907 71222
15929 105215 -156633 -129360 -17896 -189692 26996 -137570 -213621 -101646 138633 -130230
15918 171894 83244 74886 260202 -236100 108879 57326 70506 -159778 12551 -11597 223838
15906 -403406 -124715 -216133 -423 -86705 82901 -22433 -26597 80119 222117 -347672 3899 252067
15894 252067 -233068 -254991 -90721 -174146 -168398 34028 -58293 59000 101922 -93332 124201
15882 -6448 -115395 100732 28835 57037 3025 -203850 37806 -18002 -513121 124549 -287121
15870 -309519 116636 -94931 -316838 -75544 -39652 -70814 -183038 245201 260815 -83209 45810
15858 75975 175703 11568 -139183 110679 174599 -271829 -62099 134835 -358175 -80319 -101959
15847 -101959 -143404 -70051 65981 -295952 163420 -94892 -50370 -1494 56852 162940 -148115
15835 -137095 166788 82706 17605 -333982 -24528 -254160 -159995 -163138 -100144 -53674 -141657
15824 -141657 -208690 120776 116621 38646 -188176 203336 -61292 4515 -291624 155722 221752
15813 221752 204864 140515 -146242 -163521 -25498 -192570 -326024 -2107 29869 43407 109444
15802 109444 82790 -202031 -257002 -160217 38063 -300676 39717 256905 -104840 -110528 126826
15790 -155477 -5002 -115785 1111 -70774 -128709 158238 85121 163832 -303339 -325148 332302
15778 40747 -167653 -122673 152622 -131770 -177201 -271432 12128 -420774 97046 -83105 211670
15766 -127650 168278 -315741 -278143 -223696 36008 22849 -139099 160904 17075 92356 234432
15755 234432 456156 38743 107753 132580 -151375 144889 57959 97236 26951 81032 -67716
15743 -92338 170879 -75372 -312663 -65426 131399 -190841 -172503 42417 -45297 -151498 -128339
15732 -128339 47648 -226359 -40975 -160817 -11818 -341641 -68870 -288296 -150833 -86762
15722 -86762 68790 83819 -85829 277271 -11685 50480 190258 -49192 83554 -271131 106372
15710 49668 -122407 -30445 3439 -182167 -127064 121625 -211535 -151651 -58935 138435 -225904
15698 67323 -266519 -252015 27081 55835 105555 104605 -750 -100672 46123 102339 -47317 -59413
15686 -59413 -332820 -16093 57637 147280 202901 109695 75704 -156936 133786 -178391 -19075
15674 57216 -69626 154861 141059 222339 259504 -46800 -213645 -28840 -298449 -217098 221902
15662 377445 133147 90863 -224017 60092 -154517 -354449 191839 -13363 307775 -325685
15651 93954 -127319 -125036 -80317 -161959 96745 37769 39326 180209 -67279 112716 -283025
15639 160006 -194332 5122 77530 187362 311602 -127853 63439 -87516 -30914 -42596 -355728
15628 -355728 269401 -96657 9136 -4105 -30352 66206 50391 -245965 275643 -328969 249384
15616 -27660 70106 -65029 -176662 28322 -30028 -142138 -44489 -81645 -345448 -293008 -48423
15604 69244 -197204 73808 -177615 -20421 65783 65716 -207479 98778 177059 -112182 -144171
15593 -144171 -90863 -10803 -7204 43953 90364 -87440 152041 -92569 30827 -82844 38099
15581 119981 -66990 -12528 -99890 109879 245429 113884 -118679 -228903 174566 -211196
15570 67126 -90114 43399 -45686 149435 -352109 289653 35469 60921 343796 -64097 -104677
15559 -104677 73988 -81820 -107037 112253 -271279 -102128 425 -321541 -188533 -20283 447305
15547 -268869 -65540 23569 -168126 276991 133153 -185310 69331 -57992 -125967 79164 -83020
15535 -272921 112790 14741 -27871 -25246 -74045 28111 -59268 -58296 2791 -212553 14866 25175
15523 25175 -320603 -224245 24938 195312 51292 38591 -85305 -40939 406707 7869 -40773
15511 -390659 -9521 -134094 -43228 -110137 -44192 -204387 -162078 32643 -217326 109693 -205908
15499 -77200 26338 -196803 113326 -123237 52940 181136 32502 337524 -151942 28958
15488 209027 55442 -151906 99987 155469 -149374 -115535 -26196 53988 -80603 52266 122219
15477 122219 26189 125325 110094 -386800 306788 -9368 -98861 28797 128718 -275222 -173108
15466 -173108 60263 135851 -287833 -236559 -2521 -123106 39369 -39775 -215136 10666 -67444
15454 -206751 -31702 -32364 -369559 81069 41990 48848 -132340 125718 -197917 -105384 -162586
15443 -162586 71094 30770 53648 169200 222821 -11439 -111986 189600 -111120 -10779 179461
15431 -36458 32435 -227584 -90335 196354 -649323 223283 -99631 25043 -41786 -195815 374316
15419 44819 -94587 -45650 91454 149795 -115858 -83525 90028 141897 -105156 -125214 169745
15407 74508 45390 66373 26711 -343942 -193765 6361 -6331 -319690 170709 10119 185899
15396 185899 55275 -8427 -149966 233898 -91512 -146305 72891 121104 -1835 184767 -206368
15384 247876 -35461 20018 42032 329848 123458 218897 -98283 144407 126828 -169809 222532
15372 -66252 117858 33763 -11672 -82355 -229459 374569 -122102 1079 -291756 -72456 72389
15360 -93656 201580 -102515 -81359 100332 90094 -294590 231545 -167623 89973 151613
15350 151613 439036 -238319 72043 -50684 -201019 157232 230803 -209032 -41361 -199004
15340 -199004 -144699 -285368 90913 216484 112596 -153431 10886 250222 56983 -188437
15329 40329 138926 149105 926 -64281 190746 -79856 -18883 -26332 66181 -80099 -95489 49741
15316 -277119 -66409 1694 -134199 190048 50969 -13804 126305 308348 -29810 -21435 -388466
15305 -388466 169004 286276 -105630 42350 -195334 251572 358551 -481852 113256 -106456
15294 -21836 28393 117412 253364 98119 -16906 327988 -276643 -78805 211282 -91356 248666
15282 98562 -25836 106937 -119889 115923 -209951 207076 -33352 74330 -53484 -238539
15272 -238539 121983 -189633 -11062 32565 296153 43419 -16259 17337 -92813 72926 76799
15261 76799 232294 6011 -175938 173188 126859 220767 150880 229725 293271 181314 -83563
15249 333585 772315 1412791 1507331 1536146 1308314 574172 408487 283489 -277146 251982
15238 -155127 -48355 -41130 -65520 287972 -67185 266346 42160 -31057 -65565 201671 164646
15227 164646 46458 205095 14716 -49798 204189 316020 -159895 165043 -172496 140832
15216 66070 -17018 277600 129644 206831 35573 -68279 206117 -23863 196155 -206981 93410
15204 -40279 173915 -109902 -253 243621 103220 -30426 354993 187797 -22514 -74026 70900
15192 -87634 -72164 154546 -57763 40635 16593 87263 90715 -178487 370652 38057 157889
15181 157889 36000 343289 93825 146147 118281 -26618 6026 -135753 -167066 414201 204376
15169 89886 162613 -251924 25997 -61181 104999 239750 100738 17847 -175086 2213 124457
15158 124457 162289 -119289 140042 -100071 96541 505015 -106317 -45612 99174 -121061
15147 -13908 296355 -129394 62460 38906 -15438 184032 61489 -123314 -41089 163224 47950
15135 -32678 68884 -269375 168559 -126665 -3215 81666 -79874 272862 -136702 -164824 310053
15123 -118731 217475 74288 89038 21634 185417 440 -8238 89198 -48209 69185 372450
15112 372450 81989 148931 -55468 -273684 149344 133893 269159 100724 245681 -59484
15101 8922 353316 82245 232485 3835 104169 80457 280440 37367 -70083 133230 19573
15089 92320 204577 398316 13371 139730 -39355 228284 183091 -400836 132439 322084
15079 322084 105260 223382 409918 -214581 561346 190140 148012 -32313 260542 406461
15069 406461 272222 -76179 161848 51596 -103545 160816 -10825 -4875 434098 79145 291082
15058 291082 241912 185925 80933 107757 66329 -53194 66627 65377 115964 183043 73405 59850
15046 59850 -42866 159118 289271 237762 98389 -117383 93410 451995 -25535 191067 425074
15035 425074 -107992 207349 -376656 -15090 287364 83263 236979 -64655 315600 -99689
15024 34297 -62338 31218 -156094 102009 370388 112789 336288 104753 299865 373288
15014 373288 154895 15019 270259 281680 349462 146404 191198 -62863 300948 -20388 107475
15002 265394 -206778 492066 91038 66188 122542 158972 182371 343597 256155 187942 139339
14991 139339 159550 259119 276819 325825 -54885 218192 317691 37513 93739 224585 92501
14979 7939 -160948 419262 332463 503349 322812 547978 23543 -44398 123211 -160931
14968 511314 209827 109107 478603 185418 139217 122065 574472 92326 213002 485819
14958 485819 205707 347918 -54785 287274 383485 196531 19865 -44777 206626 347368
14948 347368 345099 43874 189601 130090 288004 225823 255034 415189 420560 432294 -28120
14936 433634 122937 36280 229697 -158275 -40432 123332 95202 391841 78981 168370
14926 168370 193429 291428 57623 408627 333177 322165 106839 134081 -42013 173498 313704
14915 313704 313963 148253 33273 359669 389240 342856 393062 204313 261476 361573 253391
14904 253391 243887 215395 -24529 805996 242799 261759 350544 245202 277952 140407 508663
14893 508663 242060 129553 247219 254560 351405 244164 192972 353861 655887 427396
14883 427396 156833 149628 394001 220946 339178 195775 216480 138133 249592 259231 23757
14871 167086 219984 31293 415902 330593 497399 305160 296247 243372 332985 250945 500687
14860 500687 561302 570987 561478 449835 268245 310753 154698 347121 336823 392386 324249
14849 324249 558793 411313 540 413802 243915 247311 165881 375501 466145 600283 421324
14838 421324 402842 88389 269233 293613 517281 451543 215404 280652 442695 329969
14828 329969 578571 646079 639230 206900 418477 631725 364129 509522 463838 276001
14818 276001 180475 309846 648158 511688 172270 674695 220788 388017 605421 405935
14808 405935 319187 679745 166398 329008 391077 501140 328505 446544 441452 298534
14798 298534 342732 426102 464986 469103 563959 525242 493986 325093 387995 188302 611303
14787 611303 489096 650339 480470 623094 438208 679181 385044 535965 259169 530289
14777 530289 326923 589550 835963 587362 871771 448141 664966 725657 471661 619494
14767 619494 364932 700338 730979 601185 681692 461716 428772 684864 655707 268366
14756 605593 802846 576387 435268 769338 359206 809719 493504 634008 492658 650754
14746 650754 398661 647077 222781 610355 629590 625653 308106 727194 501867 574244
14736 574244 752166 659003 505660 652438 639609 1139488 604001 577211 486536 385684
14726 385684 849792 734686 823765 493791 634661 695002 919679 608091 847734 643069
14716 643069 693831 796987 806970 787343 1087859 656226 1032111 729197 591042 785890
14706 785890 567188 825473 712973 478845 804229 669694 758045 582297 775095 837202
14696 837202 751696 656508 823345 834262 874883 867703 486590 542781 832550 719241 618078
14685 618078 910772 861513 802317 547370 652092 941961 889264 959890 895556 683718
14675 683718 842589 806334 836117 957821 907773 1024143 854908 846926 890074 773679 1268327
14664 1268327 663741 821289 1129176 813804 1064708 896238 897476 861069 1001370 1124626
14654 1124626 1167496 1267603 817275 951063 877175 1505342 834964 1110532 1183052 992346
14644 992346 1127232 1229969 938653 1498781 1298941 1132742 1273395 954532 1150154 989902
14634 989902 1043813 1172604 1269898 1095110 996658 1062577 1139047 1283680 1159751 1404472
14624 1404472 1450280 1418122 1240172 1198046 1060260 1106639 1150387 1461002 1467938 1338774 1583395
14613 1583395 1124109 1833519 884799 1264696 1291556 1470818 1366408 1454165 1219215 1587843
14603 1587843 1591709 1456427 1608004 1479698 1587139 1430003 1691037 1200801 1667512 1736844
14593 1736844 1592561 1391339 1587803 1627208 1612589 1683319 1323848 1777302 1665240 1690103
14583 1690103 1896814 1955545 1827794 1706678 1902929 1731950 1776918 1720162 1824633 1924481
14573 1924481 1896767 1924497 1789864 1928809 2118364 2386731 2160343 1966540 2260293 2242268
14563 2242268 2336195 2161863 2034760 2047585 2584087 2391341 2750622 2705990 2683579 2908150
14553 2908150 3304300 3344367 3968333 4987773 6602420 10172920 19804096 39702067 39569251
14544 39569251 21414473 9274446 4578481 3187047 2036229 2261125 1770450 1833545
14536 1833545 1835217 1949036 1624937 1942552 1667578 1831805 2075945 2043669 1901189 2221460
14526 2221460 1902479 2106022 2041980 1995009 2263568 1887644 2286344 2339861 2309797 2414911
14516 2414911 2146794 2351345 2493212 2428430 2483049 2495840 2590015 2466379 2508557 2628126
14506 2628126 2707206 2565535 2649195 2652035 2884161 2683051 2688652 2897018 2894343 2738578 3076433
14495 3076433 3263794 2990266 3115731 3093212 3214427 2981968 3028491 3319584 3502421 3285708
14485 3285708 3058805 3542150 3220164 3556858 3337049 3400249 3586198 3560354 3777130 3702133
14475 3702133 3944000 3653533 3835720 4047777 4049200 3997062 3679417 3863930 4069253 4069715
14465 4069715 4039029 4545617 4221544 4434053 4538153 4492457 4553132 4506516 4299777 4610179
14455 4610179 4730034 4833454 4707793 4547938 4613344 4920475 4847230 5103267 5471180 4935748
14445 4935748 5043517 5192420 5322324 5275092 5426363 5540312 5779972 5926392 5732732 5642099
14435 5642099 5910628 5764395 6227195 6209134 6503431 6171392 5844507 6068430 6373719 6502103
14425 6502103 6866301 6807041 6979895 6946298 7004246 6988695 7229784 7270973 7630651 7474456
14415 7474456 7746882 7796351 8017633 8014564 8070671 8266099 8563949 8508137 8759817 8899873
14405 8899873 8574120 9108781 9087609 9333549 9387676 9587005 10156068 9930073 10090061 10250403
14395 10250403 10229409 10423784 10734387 10959299 11323749 11313806 11442772 11659803 11951993 12367784
14385 12367784 12159759 12304083 12577103 12745922 12947328 13633831 13642954 14009526 14346705 14350531
14375 14350531 14632633 15229377 15380544 15573528 16044668 16109065 16554463 16951530 17281505
14366 17281505 17833095 18106918 18510440 18767135 19527519 19350723 19955634 20649670 20903408
14357 20903408 21107416 22084478 22137547 22666961 23334334 23898867 24505176 24841993 25908013
14348 25908013 26357160 27081313 27718554 28237645 29028114 30052702 30654070 31550932 32352120
14339 32352120 33362839 33847806 35283315 36140625 37082110 38294529 39422288 40465385
14331 40465385 41882717 43399887 44955768 46032323 47981216 49390627 51201754 52604818
14323 52604818 54467068 56285915 58029998 60916179 63077316 64869332 67834814 69910552
14315 69910552 72744468 75701439 78579476 82092253 85471334 88880258 92572556 96517473
14307 96517473 101229771 105307698 110272047 115076197 120842391 126521532 132041631 138805274
14299 138805274 145795924 153143534 160930096 169054537 177677486 186573517 196523107 206784678
14291 206784678 217937027 229160968 241142684 253784520 266978504 280945337 294693377
14284 294693377 309061886 323462239 338279430 352718905 367125680 381068223 394027717
14277 394027717 405896130 416758597 425980022 432883590 437192195 437686603 435648201 431846855
14269 431846855 427369790 422867820 418354831 411340278 402137548 390706719 378395874 365962888
14261 365962888 352063904 337509698 322462540 307679868 292946626 278520905 264836768
14254 264836768 252401258 239794467 227870728 215988922 204954587 195037060 185374067
14247 185374067 176072693 167366889 159139026 151904906 144685650 137772587 131637131 125199201
14239 125199201 119646286 114515636 109843684 105231011 100433897 96287782 92053113 88832356
14231 88832356 85293280 81933597 78611961 75800706 72721149 70102216 67374501 64926106
14223 64926106 62709812 60502210 58302151 56449421 54695273 52840851 51057971 49292790
14215 49292790 47983792 46622935 45254353 43543204 42583093 40999612 39943504 38732213
14207 38732213 38405137 37261151 35937466 35152956 33501910 32886145 32280331 31800658 30528333
14198 30528333 29755119 29111919 28229997 27393133 26941249 26327911 25614635 25152373 24253739
14189 24253739 23795655 22965205 22637680 22117991 21604867 21169891 20728575 20063569 19906801
14180 19906801 19320633 19097661 18689294 18225621 17396593 17543237 16972575 16613913 16536924
14171 16536924 16269791 16063507 15195622 15186542 15035471 14767672 14257987 14226854 14100767 13830569
14161 13830569 13115735 13004690 12572015 12629659 12184378 12107894 12358036 12107508 11661862 11757961
14151 11757961 11132632 11301709 10845421 10775046 10337868 10387462 10071954 10618321 10165935 9795915
14141 9795915 9593288 9314901 9148269 9322570 9316348 8935617 8691934 9039544 8547561 8422964
14131 8422964 8462747 8100700 8016522 8037277 7869266 7565403 7508679 7459976 7622139 7093690
14121 7093690 6823066 6756937 6876417 6586612 6710499 7034996 6846067 6584374 6501616 6361155
14111 6361155 6099644 6110087 6018843 5726755 6215375 5782105 5984096 5184749 5720873 5428694
14101 5428694 5402048 5689058 5552838 5315923 5399053 5290448 5565396 5147220 5497626 5014031
14091 5014031 4975630 5222461 4939752 5034113 4887581 4676633 4509738 4463500 4307592 4821417
14081 4821417 4100326 4293440 4666865 4104200 4307199 4266322 4213330 4166628 4192122 3962623
14071 3962623 4004326 4205684 3922688 3947116 3877462 3973666 3933929 3831044 3633511 3528846
14061 3528846 3911481 3438180 3674485 3724800 4032232 3795114 3561061 3463084 3598089 3209358
14051 3209358 2984023 3190168 3335520 3174447 3191449 3454102 3265024 3392729 3117282 2825703
14041 2825703 2980749 3189063 3113374 3046062 3086935 2833823 2710548 2899530 3106301 2964797
14031 2964797 2676409 2819166 2773088 2778437 2720031 2975066 2785897 2505374 2750610 2735756
14021 2735756 2595323 2697334 2463884 2044173 2195475 2475132 2009876 2150257 2199489 2375004
14011 2375004 2239739 2196523 2431653 2130371 2153687 1950675 2201017 1925585 2290859 1918748
14001 1918748 2256233 2266171 1717071 1856309 1832591 2119390 1669269 1803065 1953334 1694023
13991 1694023 2036000 2032951 2857250 5223193 12697371 32505648 41132526 24591120 12688224
13982 12688224 7642293 5775493 4586500 4084600 3535607 3281706 2571499 2869611 2541538
13973 2541538 2704315 2433746 2744035 1990263 2373802 2249780 2055018 2199457 2000938
13964 2000938 2307094 2512202 2324304 2095331 1931148 1930231 1935004 1798704 1834993 2089770
13954 2089770 1982200 1588725 1684791 1613803 1776499 1552156 1659976 1701281 1705719 1744072
13944 1744072 1858639 1716024 1885163 1642001 1702920 1750619 1548182 1859502 1515316 1471888
13934 1471888 1502065 1753803 1368129 1565156 1436327 1623884 1353209 1592078 1597442 1351771
13924 1351771 1539874 1311203 1613951 1705243 1513490 1619530 1685571 1361143 1411697 1198038
13914 1198038 1148860 1607286 1340874 1533701 1472640 1231395 1027049 1327388 1265427 1390539
13904 1390539 1347101 1104263 1366735 1242421 1131885 1220705 1016878 1353703 1163197 1020703
13894 1020703 1235020 1019580 1231856 1633095 1471752 1386830 1219855 1320722 1450977 1163530
13884 1163530 1297339 859307 1229878 951430 1043539 1129863 1313120 1146005 986478 1222215
13874 1222215 1319316 1255518 1079367 1031766 1119394 1061222 980116 1073507 1096964 1346186 946625
13863 946625 760534 807880 986410 1010317 976462 1372258 1206858 1001519 939928 878357
13853 878357 1076747 1252428 715132 1026320 712374 739384 1103013 1206677 921187 823278
13843 823278 707130 894062 1053488 897766 785079 877573 947328 1409225 956076 950321
13833 950321 1024562 1086497 880000 826631 877313 899560 1275383 660952 890939 983344 862626
13822 862626 814707 756807 846148 757617 904252 581247 983280 883649 618968 825485
13812 825485 439038 982419 570088 783032 851350 508113 838633 903853 1029183 510651
13801 752529 709982 935074 914012 571396 938584 774578 1077133 528977 457049 502104
13791 502104 977052 583583 572504 721194 608979 1162564 608707 852211 1059882 826529
13781 826529 755242 909833 619032 500948 552664 651787 602006 977618 792755 1039116
13771 1039116 638030 838181 764579 565642 633388 548390 729011 917414 802172 380993
13760 783437 953684 200587 580691 597302 827254 697766 516517 307517 275120 760642
13750 760642 534536 704064 730460 427448 523966 736489 714396 961206 894549 449054
13740 449054 513980 622482 601241 302762 416146 517135 901423 854376 612761 405423
13730 405423 332628 522210 591572 477748 548550 508252 402385 582209 457691 465072 821804
13719 821804 587829 712771 500576 674247 188756 563707 468489 500559 590289 352663
13709 352663 562104 533463 470396 483353 140664 335155 566915 570412 299024 608638
13699 608638 60981 478359 462932 510572 453238 677808 154401 677176 598917 345799
13689 345799 541151 763444 450083 431758 504050 275925 301310 582041 173976 438896
13679 438896 632321 115601 537404 470100 338335 756596 348891 632368 616074 454407
13669 454407 442161 544092 626344 466064 485584 164476 692444 353977 561305 312431
13659 312431 331467 628568 491072 429964 493879 513142 524222 346129 94462 673919 303722
13647 273958 303794 346839 472230 121825 812343 437352 255116 467509 17839 314599
13637 314599 499851 393173 544153 149510 192727 296005 535738 651902 678776 477775
13627 477775 336922 379999 705852 464549 369065 19076 210253 607976 435108 446259
13617 446259 341020 269819 493591 205102 109937 325381 327938 163768 123507 384315
13607 384315 168071 395670 353264 588270 306481 473536 134811 450372 275446 175059
13597 175059 308489 142465 248021 309746 1831 528108 286152 631692 513159 325244
13587 325244 524864 244281 380333 534102 535745 248049 272613 225525 449575 313132
13577 313132 586209 274648 197899 379421 674828 207626 464106 458066 289973 193096
13567 193096 291376 417491 450160 408422 459255 845617 298330 313977 212286 208056 -27754
13555 296118 108750 343035 52635 259095 257402 315896 136287 181150 351070 -22616 476725
13543 438512 44860 441481 286745 253122 304335 547910 354153 458295 -4004 88274 165986
13532 165986 233807 549268 255458 122240 110832 165936 65686 127525 255703 188223 94889
13521 94889 276474 29602 36147 306400 80254 86550 270320 515582 618247 304884 319045
13510 319045 325893 354684 107184 28201 223286 493291 180524 221718 331191 70100 88863
13499 88863 274431 274645 396944 290515 -135027 305264 401201 185496 398805 60998 112148
13488 112148 167339 83816 61678 237319 405116 236915 32642 191233 318293 353542
13478 353542 -132351 244414 430395 404610 125367 314113 217139 19756 263737 -14003
13467 338890 145386 226631 319280 -25858 255959 431124 212989 177900 83438 97437 235377
13456 235377 394652 140300 312998 297499 518947 165104 26582 118743 342151 644347
13446 644347 352522 -19168 -107731 370998 385521 425498 406089 305297 237163 -239280 243757
13434 435886 313651 61115 147630 253345 62361 322210 387248 270145 399558 205213
13424 205213 -25023 205928 445462 400210 284206 -164378 327314 216406 60032 421400
13414 421400 457526 182284 -35564 211320 447119 164284 199754 303746 175049 144275
13404 144275 304592 198957 298463 96489 444888 285859 515163 -129122 269766 505160
13394 505160 34826 208396 278871 122156 233415 187655 3359 161461 141910 319406 81813
13382 156794 50166 -90303 121170 32226 52884 26307 198967 -61841 327870 110443 368417
13371 368417 -206334 104061 324838 352194 419315 397320 361854 217074 -149744 111257
13360 258122 280575 -14368 530897 -237583 146239 -75051 135195 36301 193958 165752
13350 165752 192320 171472 -44504 192458 321095 152810 -62326 349390 411174 540076
13340 540076 359648 326554 471560 103451 19151 411879 455568 408627 259566 -37685
13329 47438 88090 -158606 263482 246889 154433 174928 87813 119697 -82809 240758 170371
13318 170371 105227 370638 356771 427175 39665 205475 294216 -227992 311085 99538 342771
13307 342771 52026 28235 452847 -99892 59634 127670 338099 231009 -35884 117929 385361
13296 385361 80055 196304 321312 349765 421062 163583 466979 419377 -92709 114605
13285 181107 -70933 47408 51380 -21830 191735 112498 172465 19399 252154 268131 10688
13273 -200707 118882 239389 28879 60161 447796 56335 -20047 29595 148915 -89161 -120351
13262 -120351 126273 272125 67444 143785 195304 140070 304307 -368 175375 -214338 87440
13250 166663 76229 -1769 398009 52927 -54846 14145 81367 4259 40778 -40030 7801 37678
13238 37678 -92179 473420 -34270 163096 121029 244810 -118100 459835 -116529 187303
13227 57154 -35254 65211 79999 -16680 253554 220890 62189 -60428 160096 168681 -90012
13215 150213 50234 455464 -184432 -160487 -69582 239466 154284 -147305 -133140 103170
13204 466505 149653 6963 360548 276039 264993 -45321 235188 -121739 264225 339027 306382
13193 306382 179578 64250 327915 107708 153789 17748 62881 -77382 130762 33873 100633
13182 100633 717 35862 29618 -64921 307087 176412 34359 127489 -245915 -74625 39784
13170 157308 30388 301413 202714 213023 94174 129567 63531 7939 19128 48918 80939
13159 80939 101942 -69862 -177148 302072 104836 -128195 -5824 -127970 73324 266385 160321
13148 160321 63064 137826 -92592 145131 -162469 -130482 265274 121832 206220 139101 120982
13137 120982 274808 26459 98535 243978 155110 9007 -199279 201097 -7149 -58426 116298
13125 116207 7859 108804 209684 84790 -5695 9538 143776 179900 -34602 151983 163398
13114 163398 28263 -185435 -151925 -84074 279059 27306 225131 423740 -82251 194574
13103 244234 257896 -255390 -285681 20402 78934 -121181 -236088 127753 501927 168771
13092 124172 524965 204584 68919 217539 121518 -126648 -6374 162850 8345 -328796 235716
13080 147869 122522 -31092 29950 -279489 79260 245954 460153 183269 296799 208277
13070 208277 165758 -144024 -64946 11187 -252247 53794 144749 103676 98018 33223 -201798
13058 187580 -34272 289975 -24558 -101622 41882 347189 -159232 341234 -105875 193258
13047 47324 22478 124595 -64966 -39460 107563 481761 518389 -164947 329653 37906 216651
13036 216651 -14971 97782 220455 -127481 64901 168402 104295 130335 -157653 359264
13025 207384 102680 125153 12172 -44438 254649 -115362 -7692 254694 69792 144484 -38776
13013 272776 -96406 -33466 162901 157395 -233112 -17876 115763 281477 92665 -161212 -18708
13001 -152845 -33028 61091 130711 378475 28111 278656 56754 390324 102784 -90580 136820
12989 331052 103967 -58145 81231 116124 50658 332904 145374 -192187 415018 65107
12978 -130149 -298447 272516 75530 15357 243597 -89660 -81494 225742 -97307 166788 35259
12966 6639 -405030 11031 243910 311148 -116558 18700 -287854 -79354 323407 -91036 307861
12954 59938 273269 99309 484399 -229562 51303 53146 -254549 -41226 -244496 -180934 -148989
12943 -148989 227045 41561 46889 -89636 -34780 -297639 -6198 -333224 -12178 -33539 -95427
12932 -95427 48930 323602 173593 -158073 -170222 -80617 -32657 -10261 -11755 128704 -83540
12920 265861 -127539 139240 172085 50406 -93682 165039 130098 -105668 -86427 -60216 155516
12908 -3166 286781 269534 270785 62113 301494 56362 25469 -303188 81763 140070 35678
12896 -193836 -110433 -213896 244606 -56977 24128 -143988 -8104 97467 3048 50455 -94056
12884 -27479 -19942 -91325 131831 317275 -145050 -75015 299495 -151618 -28563 -122095 -74651
12873 -74651 -176334 -64615 211583 -31167 69744 144480 87486 -359248 140181 -224531 135900
12861 -121291 138090 127731 -160777 -53086 -191901 215572 -207026 -34358 134412 176703
12851 176703 -63379 -5308 196687 38953 -208117 10863 88477 176345 64304 -218389 -351681
12840 -351681 209588 290295 -60195 -96556 383472 -169434 -100800 299413 -259252 15594
12829 -248628 -229441 31113 57270 -132656 24363 140127 136784 171907 377699 129223 4416
12817 148806 33157 231369 164164 94669 162729 -21046 -121540 -10552 -285734 -275787 -7377
12805 72492 39860 171936 -74684 -305952 147902 -78833 -55689 181086 25250 -313642 -177023
12794 -177023 -5572 179221 277700 14934 161536 -11116 271035 277502 -239096 157782 147414
12783 147414 -115702 101322 -21878 326867 210070 86972 39661 -111932 -173447 -424490
12773 -424490 178744 224818 -241587 104357 165282 252268 395053 -439355 -139880 -52478
12762 81511 -106864 172706 -8956 54921 -99380 -9531 -42062 59533 31323 -131471 45160
12750 453472 156747 -55812 238074 -179124 -79742 -48326 -18495 -223724 -173043 211599
12739 -182028 159081 151381 -143666 163499 245713 -102872 50631 104184 -14633 229367 65797
12727 -43891 91724 126587 -187745 149778 22925 -70802 41902 -39988 -157579 -146498 203501
12715 -168239 67919 266804 -136290 462307 480706 181107 -18194 140227 28343 238895
12705 238895 282661 116875 98141 157184 1891 -28110 193655 -16253 -138962 293109 -136729
12693 -239272 25349 -49674 -162125 -198225 42064 70065 18717 -182783 380089 111416 160984
12682 160984 267194 -42471 341746 234464 154557 436009 -189973 294756 94537 -70268
12671 -126335 -28499 302336 183176 43564 -174773 -173816 -11572 116318 -96710 58776 97554
12660 97554 368665 7381 116211 -257341 122629 -17041 -92260 49399 157091 283505 -112495
12648 -16649 30759 -96251 263208 498794 -28058 247694 -166380 18128 92100 313241 41184
12636 106636 90485 18912 -144278 -54113 14547 42061 332591 512630 -6377 151536 -102035
12624 -63198 283740 30157 -85394 154510 -207923 -13106 192051 -265902 161803 -51777
12613 -50998 -128326 -57540 -79995 291825 76510 131961 257241 92264 114451 40814 173328
12602 173328 -17107 254616 191894 -89473 165577 99440 147675 -138073 285734 57885 -69812
12590 311069 211557 4795 66909 205173 -59950 -94373 88076 -33595 -180207 120018 192571
12579 192571 85357 -241327 450425 146585 40972 109361 38370 -16483 -46252 46289 385637
12568 385637 3505 32056 -35953 801 426288 -47751 170352 -317854 -356 -303309 26129 138401
12556 138401 -24114 141192 294769 242779 109246 219361 160974 182393 151264 -147862
12545 139683 70242 -84118 -212823 106282 -205512 -22057 -325515 -154166 -18533 -44867
12535 -44867 6589 127022 8943 385380 -344726 240583 27621 610438 62801 4889 216646
12524 216646 301816 303426 -62702 -97847 29242 99787 -331314 -400570 129169 103821 280045
12513 280045 20012 239065 -242808 227942 -100055 96369 -102273 -120557 -94913 219073
12502 -310931 280463 -112244 203490 100619 501751 240657 80927 145126 140152 -40533
12491 6550 -278147 362861 -172969 141879 225732 -46315 -187312 110844 -9666 171844 -115022
12479 254978 133742 199074 7664 263629 -182941 -210413 40209 9170 -55022 154316 -443501
12467 43928 -110292 -83203 142865 -60673 3150 5254 -265569 24355 151101 59504 -35664
12455 13939 -156469 -110134 -52555 -5083 -99517 232246 -163259 237065 206483 193122 227473
12444 227473 -83381 199516 -191869 89046 -29087 180631 -131104 -265144 127580 -85642
12433 -276944 -131272 312674 2054 -353024 -33098 -162737 117249 138022 20622 -306490
12422 150091 -197419 401446 18433 -2216 54733 20923 -46456 106280 208403 -171349 -295922
12411 -295922 -307815 -31849 -61118 61614 91984 33461 53491 -149830 129916 -31851 112458
12399 -329612 -167176 131127 -77469 -237374 151848 19619 26598 91970 48061 129780 -77464
12387 49021 -100425 17433 143421 -214119 85721 238796 -31622 85278 -120890 44477 276431
12376 276431 112265 161014 -324205 277510 1260 318820 221759 -72855 -313571 11672 -673043
12364 3481 -138520 4921 332087 -175001 -132819 -228595 78631 -174031 -206569 -193254 -299189
12353 -299189 -52270 110733 90350 -59766 155547 -325677 -6588 -251309 -204537 -143235 177776
12341 -52191 200826 316046 272860 113447 196291 248387 260995 -114542 -29053 -210656 109326
12329 149430 -59830 57932 130187 322871 183475 135131 199385 252805 -76005 -78726 -304207
12318 -304207 -105222 402362 179793 -101136 48184 285716 54139 340815 42152 -139992
12307 -54131 173966 152074 91881 -43940 116850 63527 -104287 219557 -202461 4407 -161669
12295 -103394 -103680 -210198 179101 168508 54990 -19343 82468 34093 -39094 101339 15860
12283 218039 341788 -97302 33371 215298 28469 40945 376872 -33463 185277 334035
12273 334035 43873 97488 14353 265687 331654 237295 -23537 353089 -131425 -160470 5547
12261 374252 -137626 -73298 -269395 110654 142489 -184962 205010 230838 -156242 217252
12250 214837 330380 97843 31064 333128 -44356 -143738 -50508 210113 224446 389296 171844
12238 103275 201575 -68732 261193 128077 124586 30268 212051 265130 359235 46640 -198260
12226 137330 570201 420324 317034 86592 285276 28839 311078 -1468 -143934 384446
12215 166465 155259 -75622 69998 80456 -188351 131555 -229863 -243458 -122651 127104
12204 13483 -165449 37328 74775 119683 148699 -26956 47318 29435 426155 246014 265180
12193 265180 164943 -288727 -52945 281347 -151568 -12042 -127444 101434 169112 199564
12183 199564 553530 15983 87568 777 211324 348669 139950 136510 -45399 -409 -55566 -111547
12171 -111547 480972 342643 15339 67511 -53767 -200881 124355 114861 -102845 -291029
12161 -291029 64282 -124377 61958 27145 -288871 15903 42680 -187685 -11572 171688 304143
12150 304143 230583 105069 -164991 281727 -10431 313296 -164862 -182614 151651 -2659
12139 -58856 99097 153880 -187883 126695 105120 -21646 271961 -357852 27051 39351 -113403
12127 -15044 -71434 62559 118603 244608 293590 331990 -22245 -42202 -5499 212573 -105967
12115 47153 64212 273795 30042 -301229 46802 288609 71345 -18677 427369 83713 43
12103 -110324 222654 246901 225701 175685 -174311 46881 -102030 234586 -133856 -362624
12093 -362624 -247594 -118965 -299518 253172 40725 -27247 103181 37785 -40029 175337
12082 -170588 -24114 -358304 -5384 129691 6480 -91940 209173 311639 -185753 465051 996188
12071 996188 1831584 1032148 353989 447747 122441 -62257 44400 408130 25062 -344158
12060 -115003 -54431 212226 -328864 -130987 -117713 156411 -23362 -285 126867 101621 -125755
12048 -40331 25239 398186 -3261 -13249 -40234 -99305 26627 -94394 -111377 109811 309659
12037 309659 172620 -147154 -338018 222190 -16472 -163468 186240 -45369 -131263 168036
12026 75479 28915 49459 -5267 41181 159268 231115 84885 346238 112526 147065 -6893
12014 68298 49464 -112161 -200118 7131 14400 158256 219700 472483 -18649 200168 -230306
12002 131990 162046 -16391 49499 -40537 -422963 -212215 112237 113242 350765 -88641 -69404
11991 -69404 20036 -222723 -175647 61544 -175008 -125993 -301037 -417086 -186953 -360929
11981 -360929 -2225 176597 -71215 -176494 79757 -101285 -103932 -95754 -3842 -117047 -133697
11970 -133697 -158188 45008 -39567 -245595 -239472 169688 -66679 -7871 170281 259172 -60579
11958 7301 -156358 80592 73322 -133064 -118180 -108980 128932 -129692 382948 -34301 -255433
11947 -255433 -100714 -2003 -162139 131664 64127 -273418 -86351 -284847 -181312 53528
11936 6513 -242127 -319097 -36527 -6590 171495 -23159 -308686 -126922 20996 285907 -51640
11924 25317 -138686 51190 139571 12318 -220059 -243882 -116221 -102130 25316 90910 -178183
11912 107288 -42276 -72286 -330445 -37428 -38768 279801 168727 -121076 -88619 -26894 -37265
11901 -37265 -193583 89784 -199699 -48202 -19880 -245391 137482 24776 -309422 143157
11890 -289808 -161708 30581 39917 -115509 -140268 99178 172279 34153 146552 -139095 -93020
11879 -93020 -8520 -151727 -150023 68670 23074 -217753 119851 -28826 -91190 140815 -151625
11867 67734 28059 93660 -251646 24473 -230120 -262352 -57190 76742 -142152 181639 -111337
11855 -202665 153551 70816 54283 -316785 145244 -51259 -444192 23372 81516 210836
11845 210836 92873 20332 -108673 68670 10871 -105268 285766 102825 -113057 19546
11834 -105077 -113998 -41297 139736 24962 -84733 149698 207076 224205 -87883 22387 235149
11823 235149 11883 -366640 -73626 -33889 349394 96307 -36239 190484 232683 -90592 -5045
11811 316480 154673 -90280 209648 176238 14130 104826 -109064 238577 -116128 50227
11800 -82896 -391491 -103537 189936 250933 5787 -140897 -127976 200147 -97924 -109973 -43026
11788 -239484 358202 44078 -10697 221401 321212 -412395 106998 23883 156716 -317915
11777 449312 -121183 -125371 188290 -266597 -12435 -142771 -233335 74532 -417060 -77937 -223858
11766 -223858 203436 -176662 115470 216375 -75277 -112206 -61745 -401613 -158442 103697
11755 116492 188194 -121086 116414 -33891 276772 34821 -247031 -16121 86445 -72111 36081
11743 -87937 408244 341018 -230075 -109447 -155744 13375 -123102 63559 261670 -175459
11732 -229424 95545 42119 164540 86243 124114 108045 -52975 -256150 -279084 -66756 172295
11720 -97093 -245528 123480 -124548 468896 14166 388534 263917 -54138 188156 154434
11710 154434 -272269 -224212 -28677 -105909 44571 89310 10309 -112677 206919 7000 59333
11699 59333 -70523 114460 81853 130502 279955 108549 245557 2895 161873 74783 151622
11688 151622 -91220 193239 -82133 62205 167948 63021 -224174 -20520 -435731 -67511 127628
11676 52263 238352 341691 19960 268558 -58618 214476 -12818 34841 -448578 289121
11665 -65218 -65755 -195104 34496 61217 -276327 94199 -196887 195338 154958 188743 -166389
11653 -111142 -132993 -108420 -233795 -167024 -115992 15905 277676 -50063 56393 -291854 33
11641 -83544 -187043 249694 -290838 -357191 198195 -191351 62362 114792 -119941 -103857
11631 -103857 -29533 214283 -188617 362233 -81293 -140899 178052 242353 130923 93446
11621 93446 -185584 59351 -115060 109237 129362 -257219 136980 -4489 94206 -81745 286456
11609 346456 -19888 -56618 98385 78127 127897 200444 154434 -146208 329792 102020 1131
11597 96053 23319 192192 354620 -114745 7076 233706 207065 90023 -83885 157026 138301
11586 138301 77677 346079 269160 -97962 -94860 27189 173326 327984 525551 302479 574894
11575 574894 -431008 187493 153634 264239 105152 172784 -23723 13020 158696 17303
11564 -41886 191563 223096 599750 -137674 -72505 56236 211673 129937 180849 -47478 78668
11552 180760 -127224 179858 -210921 -6756 113174 511938 86382 -48142 -55937 171247 100508
11541 100508 -30096 120973 55053 326855 9372 79028 -102124 37761 174308 81418 -82421
11529 263492 -16294 301848 68166 170801 395288 193538 182046 270231 -35294 114845
11518 171328 40006 -33924 207576 140928 -70535 51009 -97871 -273531 438862 428211 51864
11506 -41379 38499 40333 143525 -75023 106723 367146 290257 -9076 191844 -222137 277711
11494 -223804 9957 -229763 50465 -11696 -44693 241643 -107139 118718 -254018 50889 169693
11483 169693 318834 349715 305054 -52340 116575 411497 -6490 -71492 151195 -42977 116752
11471 -326066 180604 182326 173312 -263974 114848 145755 33026 39361 20292 400138 164665
11459 313209 179031 217505 93326 -307964 193991 439518 -133197 187141 29048 41677
11449 41677 80538 310671 364750 169425 4235 -316121 -53050 82042 2911 68734 -326008
11437 213089 -46927 -91665 -322419 -160617 56410 -98637 33275 235147 -37564 -283749 88829
11425 -18205 -63126 81229 221212 -80920 -69206 -198520 106277 52323 409 90320 -248178
11413 74737 -10693 -132843 75526 160523 108416 177837 -37566 36028 109755 -179025 78820
11401 193988 340977 165093 -125566 -124170 -4680 6788 232766 15473 182622 139210 113791
11390 113791 336480 -47205 -284457 277804 -27359 112461 41242 -73317 14720 -327699
11379 -8115 -111591 -80596 -18877 -111625 -21953 120567 270456 274217 -33916 -147846 -221286
11368 -221286 155333 -77004 106171 31056 42814 218291 -108005 30924 14230 -447592
11357 -226159 -270721 -249880 -127036 470207 335263 287260 77135 368524 -78078 294883
11346 -208203 212899 -98537 62890 50154 8652 184360 -111934 35218 -372528 -141539 310759
11334 189634 151269 56390 109721 -162084 232154 186227 7834 107734 26496 225203 -25337
11322 -65083 -129229 -250405 98493 143673 -160493 217354 -21903 -146071 71136 -455962 50363
11310 83575 118454 -421986 82538 -4930 -1102 -256503 -83870 70973 142538 105050 46642 -21065
11297 -188368 -67018 -136739 -64038 -45369 -129221 -80944 -464985 -105634 -177361 -118469 138941
11285 36286 -52134 1495 -10675 -332102 -371907 -40004 76332 319105 -79791 -168651 -181633
11274 -181633 84073 315258 80131 12639 -332156 -75146 16096 -189052 96843 -147184 -23767
11262 162858 -141635 419000 113162 -104397 -81354 11636 -84988 -163266 -33888 -14118 128826
11250 -105959 57410 47110 -6465 270525 -380728 -4725 192955 -142914 127810 -54503 154465
11238 37322 -92139 106633 -47887 -139301 -278975 43379 35374 12407 -171910 92268 85351
11227 85351 199185 -366115 -80116 -187733 -380353 -51171 -41106 164872 -279634 27194
11216 155469 82297 -441886 134172 -81623 -211948 -139658 -125207 -14305 -49617 -153371 117545
11204 -53365 78179 3127 -237483 100472 -52560 34116 -345791 19563 -98953 207918 -73404
11192 10242 -47950 -93640 -132636 430846 19876 -79481 -56806 -59033 71558 96341 -2675 -289022
11180 -289022 -35241 -142546 54786 -19932 -213923 20680 -107387 98446 90146 65135 93564
11169 93564 61561 -269897 -78072 142035 -178107 7555 -153453 -272979 500795 -76890 51283
11157 92057 21661 -6050 -33494 -293239 51203 71050 219480 293689 187240 21896 168340
11146 168340 -152661 167377 1921 144509 2051 153498 214002 -124127 85058 -17016 -35513
11135 -35513 136754 -146713 -117294 156390 -56317 153676 60287 155665 -119045 17275 118999
11124 118999 -5714 25700 154322 -33669 201037 147995 -126380 -247014 -287648 -88623 16927
11112 102367 -8947 253738 185246 -102376 74049 244717 57899 -41992 204270 136612 92453
11101 92453 145691 307727 222758 292546 304512 -76334 -54146 208364 -29521 20892 138512
11090 138512 70728 144912 446358 264626 34909 3958 343369 192287 129345 57137 74870
11079 74870 282593 298938 112349 334251 259303 -151948 538246 207731 124095 573687
11069 573687 326905 95793 60677 333688 -37509 404692 377177 534412 238221 369923
11059 369923 651137 361837 628674 484994 642687 557409 753464 593044 727425 456175
11049 456175 293881 656536 786463 707730 688993 929664 504689 750199 664075 579605
11039 579605 562156 588342 762576 592307 264876 796902 698414 239048 353474 652457
11029 652457 456130 368107 657539 548525 531277 629861 849840 687827 940459 894973
11019 894973 341903 548464 439263 751950 416529 527780 658330 338900 432331 798525
11009 798525 557885 674973 479703 284410 502856 587377 505189 633996 609423 417147
10999 417147 755106 687938 863076 103058 692115 742968 637504 904808 761756 615520
10989 615520 508955 948638 849740 863716 489886 971712 567511 1158162 753020 1163630
10979 1163630 959988 1147378 1663367 1426993 1723866 1861959 2186870 2420532 2652468
10970 2652468 2369155 2591142 2529128 2502097 2175700 1480659 1483193 1298083 1443490 1897405
10960 1897405 1805171 1646463 1873598 1757470 1738350 1773448 1558607 1338148 1373382 1006841
10950 1006841 782656 988823 463724 477123 483834 410908 50734 609076 100989 245276
10940 245276 178463 239317 182872 288396 106556 213662 256120 273080 -211673 169307
10929 146960 210149 -24418 -45660 356827 48097 -116234 -40508 75283 124431 -47291 -72007
10918 -72007 3861 119621 121137 364601 -204118 281224 -198714 271411 -128619 181750
10907 -220826 -143423 -73703 -5416 -164604 -191154 73360 236750 -53240 93068 -151706 -51121
10895 -150261 460435 139195 -21209 -236212 -60835 -182972 55811 153778 56839 -30307 40399
10883 107698 -121908 328018 112724 -75339 -47625 -371948 -141224 -24369 -210879 44863
10872 48037 203644 35840 -62849 -41217 -19887 -152242 -57169 183775 -179219 50592 254103
10861 254103 -89793 300227 103715 -39718 -471410 -144139 60451 8093 -13852 347473 295814
10850 295814 -107126 217028 -112803 -195418 -321370 18574 94374 -110598 156875 73813
10839 79975 112400 13853 -13354 554821 -354338 -111015 57907 132565 176439 321617 24103
10827 -331901 -3695 388168 -85001 114309 -277467 195344 222977 -144159 276751 70159
10816 40300 109651 -218450 10835 142326 -21181 90660 63064 264306 -71093 -113937 -37997
10804 -155127 26529 -249484 -290695 205676 53559 9016 -107027 -21781 -99627 15020 -228998
10792 -52901 -133221 142699 -68854 -23407 -244605 71958 -43528 258774 76602 -166119 207927
10780 194960 -225782 -90193 -86232 -2017 -23895 -243639 -18149 137204 91063 -267437 -196521
10769 -196521 -137909 109217 178822 -142607 -196415 -170141 -181536 -273031 106529 -283078 -203413
10758 -203413 67050 -201579 -60157 -63167 53374 84913 -406736 -104457 193046 -35658 -70095
10747 -70095 174761 -319694 -296640 99866 -16819 141627 -123644 39115 -25021 141457 -57161
10735 -103757 38867 -100363 -33585 64080 -3114 -236021 83868 -274297 42687 -50587 72577
10723 115252 -131244 -57228 -93382 -303094 45939 -45124 -257353 -244240 65793 -7779 282934
10711 200420 -226499 -123390 20714 364287 -221995 314954 -151296 123631 -158660 162113
10700 -198453 -224972 -122799 -258245 135052 43256 136882 158445 -321750 105947 -168357
10689 -28823 60949 -169530 147884 103456 -115319 -92569 -38101 22222 328113 -162099 -126679
10678 -126679 141958 306 -80992 -311458 -57519 163247 -1667 -56972 -222081 -64945 -133053
10667 -133053 -225614 -232839 71269 -58477 22342 79233 86088 145032 65819 31998 215620 -23717
10654 55918 366226 -462963 75964 173424 68307 -85949 -220660 37231 309868 434285 60277
10642 80441 -173080 91034 -167733 -169488 -45950 247911 -158091 -30052 43257 -344234 48568
10630 -238096 32927 69091 192320 -285418 -13613 -248010 211753 236148 -248465 -99247
10619 161751 92866 151829 -70109 378995 -99209 -84056 -173016 305297 -489904 6004 -366937
10607 216145 -155933 136481 96007 -139862 -81883 -50059 -72045 119119 -286111 -42097
10596 -183815 -77492 153294 -490474 263451 -145550 -286886 -276189 109058 -35105 184231
10585 -115454 54823 -42158 -265715 -179621 80070 -353363 -164960 206565 -319016 -193024
10575 -193024 65510 -61991 166045 98121 -7137 53897 98128 -272707 -24817 -29456 80289
10563 174725 -390 -120016 -230089 154766 166377 -65964 -214341 -122901 163791 123945 -246444
10551 102696 -156 99109 -35404 -377898 62156 -85859 -43561 -1839 53586 -103844 -82898 204740
10538 213980 -206245 -279365 84927 -341143 57365 -257405 30928 -97548 -201959 -56176 -212977
10527 -212977 -188474 346438 271171 110350 211425 10314 20008 -34437 -136654 -174780 -267745
10516 -267745 257052 490837 224379 111469 -9720 -79906 203146 -5336 -19799 -47251 29932
10504 -181530 -161316 -90157 293993 -58802 54429 -86611 -436446 22101 -263484 -379292 96449
10492 25186 -28070 275911 -96050 38644 -254671 139902 55135 -28461 50050 160536 380153
10481 380153 584548 326706 392863 463690 620872 197458 41171 -142186 6473 33031 -58925
10469 113426 211796 21432 -89934 -31787 128541 -295043 -45171 -60604 -44955 -188667 -154934
10458 -154934 -59919 -18219 -123096 -322302 331764 302062 -65952 -187644 -357618 -80034
10447 -181876 -21162 -95834 -117415 171331 206471 -314378 13629 125166 -11821 -236878 -66164
10435 -195233 17770 46737 313092 -149058 244680 102943 -95773 57952 84611 88902 -54659
10423 -219097 -119080 150736 -106111 -318273 8313 -264034 76650 -269615 -64971 97638
10412 25806 -113763 -119545 -22263 140271 -28130 -401125 -20444 83206 80656 70693 -194462
10400 -226796 15487 14464 -205253 53451 -53514 -7446 67408 298631 104103 -190691 130333
10388 291974 -21665 -25338 98217 145337 19773 83595 64124 301966 -19458 265520 151473
10377 151473 -8957 462925 -122092 338361 26860 274777 763501 274818 411558 551216
10367 551216 227011 321360 490787 446158 238625 41678 240620 92505 239897 -41435
10356 154149 67078 -5606 318069 461834 667651 583740 647741 278809 488171 208467
10345 161351 187394 572542 528728 119893 166258 359585 391736 372013 -96982 185240 -234851
10333 -75946 75314 238024 207150 -166089 -70052 169603 100684 136593 175905 36593 14485
10321 80103 191063 215776 93974 -156305 195304 21652 410869 90403 86545 -272270 -206180
10310 -206180 65707 -257813 303529 -89700 212013 -86289 65000 -175188 -221869 319466
10299 -63725 -23334 -128895 62398 44144 -4905 190110 -151638 243030 -79438 -328589 -206520
10288 -206520 -303227 212556 -140432 -385000 -116583 -180957 -196785 -133778 74073 -152943
10277 -153198 -518553 -42920 -173488 191151 96760 75235 -79146 253876 73704 137109 73004
10266 73004 8221 58764 -67046 -51057 168153 -88364 11072 296894 249413 210738 181331
10255 181331 328365 -43140 20082 236803 100423 -35789 -85943 120574 186193 85966 118256
10244 118256 -21655 2476 -37836 146045 -94390 -71227 -244753 84640 -66417 386395 205007
10233 205007 218365 -161775 78963 84640 -228847 165248 -97205 -190333 -22288 -193717 -157115
10222 -157115 -5453 7708 -7479 -11166 -73774 126741 -42236 -154730 142217 136890 -278516 -107106
10209 -9602 -30849 -109252 62727 -150986 -208282 237714 95477 -70251 168411 95281 -354532
10197 -274218 2707 -145523 -147624 109409 -99562 -272701 16553 -32641 20245 185199 184274
10186 184274 -37290 -340108 -72897 9263 181329 -71334 -244032 275143 464 -102569 -121834
10175 -121834 -4977 -2510 6221 -114195 -28545 120288 -46933 -59081 280124 -119785 -193511
10164 -193511 256231 -177406 -85384 -113120 -268800 -423195 282480 -8551 -143114 -486104
10154 -486104 235240 217898 -243587 -112492 -301159 -218509 80567 99144 -126183 -355873
10144 -355873 141613 -34395 -34079 -264117 -27467 204950 81563 -263519 -43388 -49840 -36846
10133 -36846 291810 -93420 -91931 -16031 313767 -371267 38122 73894 33712 -93900 -213354
10122 -213354 -151432 -179659 -339585 25777 60673 -323159 355564 -207432 -51331 -226410
10112 -226410 19272 -2432 112504 199214 -88303 -85811 82409 -145432 31135 -309358 153240
10100 92988 -145352 90882 -10454 -37685 -13108 -15869 -258482 131644 255404 51412 -129604
10088 -84409 -46080 -181373 -9853 203243 -70942 -110718 -119949 -198386 134299 -7249 -287205
10077 -287205 -57368 88740 -3606 -82515 -292728 -172627 274312 200980 16402 105801 143500
10066 143500 -168904 47244 61732 323993 -269154 90479 -63724 72605 92756 -156580 -100724
10055 -100724 -133869 -66851 171212 -252383 -68226 -143674 213109 -88957 -25351 -36048 -88402
10044 -88402 -188051 -222139 192115 -130176 -87144 198889 -165474 101446 -88658 8942 -50618
10032 -10734 114202 -273756 78731 -150475 -9506 -554451 122638 130629 318409 -3152 -116412
10021 -116412 179247 216314 -234984 -34806 -49497 -14963 -202773 -270451 -81491 -107692 -145715
10010 -145715 -296956 -24646 -142863 -174099 -60217 332154 81450 -137493 -61908 -313175
10000 -313175 -104320 -31525 -162679 -73183 -192372 -22489 348504 -156342 6609 -200257
9989 -60063 -22379 18782 -136659 52547 251645 -98150 -389872 -132120 -280913 24392 93523
9978 93523 -71066 -38908 -170014 -12068 -55070 116252 30946 -86970 -167014 169729 -119998
9966 154597 -151029 -47552 -56201 -234785 470572 220905 -59004 226147 -22475 -98608 -80790
9955 -80790 32611 96814 -100276 93197 -50726 -130424 -138264 -140713 117593 188197 100093 -450101
9942 -171723 -214507 -122953 -7677 15249 -19504 -118062 -194931 -147627 -139874 23321 40954 -251355
9929 -61319 -277188 -393414 -178715 362593 184312 -252860 33454 181459 -107115 65538
9918 33057 -68179 28242 144671 114567 -38585 -247155 25657 -3534 108272 -159464 198869
9906 -362657 62068 -173321 -49944 -124189 92328 -43914 140857 -205310 48054 101636 -330268
9894 -70483 -83756 -85560 208108 -87992 -173679 -140614 171733 -156923 -49431 137653 -186105
9882 -68252 -238539 -113276 267555 37172 228519 -53801 -73306 87876 -80427 39900 -210930
9870 97165 -202362 -226699 170251 -54172 -212498 -360329 24580 -179058 116716 -969 -26799
9859 -26799 -242923 87932 -116513 -462430 -152426 187459 53596 -35046 -368751 92190 -194959
9847 -266330 -175044 -161307 -188565 -174303 -196679 154159 -203089 -59146 -7513 11534 -3153 -35166
9835 -35166 47202 -44837 157890 327563 -18659 -502 -95875 -120847 -196402 -275519 230139 -17867
9822 -63729 71336 -18798 243284 71336 -350589 42249 336717 -293410 115381 -164488 29246
9810 -3460 -156572 110243 30112 -147201 297128 -183577 -161335 -148321 131130 25201 -292696
9798 65596 -63731 -5091 5447 -120304 -290765 42783 -376560 -452338 -143060 -231090 -283029
9787 -283029 68836 -137589 -160846 238166 216818 -134534 -181428 106508 167700 133480 -9175
9775 -180126 -298541 -385120 -39058 90632 -95031 -216086 -171649 -75003 -94076 221795 -118398
9763 -70274 206691 -31008 -407519 3971 78548 205229 -436708 -164265 -348283 -133553 -138653
9752 -138653 -182237 -22279 -148793 -197122 -79610 -66863 184664 -34007 -82079 -99016 -60408
9741 -60408 244275 -113422 -286182 -155591 288236 48321 -50401 234616 -159284 -72607
9730 -18338 -188720 -357418 22907 305929 -242046 40379 257148 -402261 30667 -141627
9719 -156336 -443052 39048 -241751 -18329 -312308 4141 -250099 -107876 67133 -188561 -31514
9707 64046 -313085 108762 -201137 -493140 -334595 -91741 -216360 -72565 -260012 200550
9696 190093 -196940 -151171 107885 -104468 269588 50997 234222 -42692 -72171 68036 116253
9685 116253 28570 -57397 -109959 31100 -10978 -261599 -500843 278523 19865 -82197 -67312
9674 -67312 -249068 147337 -43625 198484 -65190 -123216 -38758 -191252 -18111 -211337 -80955
9662 -213395 -363135 158629 -87813 -99151 -91432 130741 1794 3221 163583 12000 -161396
9650 132361 -81217 -208898 -331782 39063 -311291 17003 -105487 -75667 -322900 -407726 -9583
9638 244889 137591 97134 97283 -185293 -30319 68264 -251491 105156 222984 -426901 203343
9626 7710 -216669 -151610 -221523 -11425 -18485 37355 -259941 -105132 -231407 -391007 -397997
9615 -397997 169814 263921 -35451 144943 -48210 -99956 -202236 -7714 -34481 -545697 -112176
9603 190770 54294 -250045 -47188 68400 14685 193980 39446 -32076 4466 -50340 152612
9591 143929 -23994 109993 -196736 -108785 79129 -272599 141249 75156 114313 -86045 -57680
9580 -57680 -158100 72533 104480 -134983 97790 -24842 8336 -239067 -252460 82043 -99750
9568 -104261 -122300 377061 -228242 36314 94947 -369788 -101642 -192780 13814 264064 -96184
9556 -53932 95149 35557 -83904 82846 1504 -16521 284804 -27792 -70390 -57998 265444 -67025
9543 38892 -323824 -307491 -11755 -207833 284966 -139955 -245043 -235983 -111133 -348282 -354969
9532 -354969 100828 -140706 -144103 -426453 -298779 -3256 -117960 203066 -107874 81662 8807
9520 48832 20509 37067 217462 293210 -196612 -39327 -48819 -155581 40798 -237758 -214168
9509 -214168 101688 57750 90215 208952 -267554 143316 83023 -33254 -79182 -37110 30419
9497 -6090 -75884 -79357 297017 141724 71279 201823 -126861 47487 -365933 175626 -442549
9485 -259198 211601 -198851 -410878 126430 364517 -164615 -264199 -98605 -150955 79805
9474 -203526 -176985 43832 9676 -305009 -200184 -154574 -62266 -212264 70792 -218037 10812
9462 -192436 -24121 -79780 -55134 46935 -24877 292468 -141492 -181691 -297514 -222568 -262348
9451 -262348 -94301 37132 60741 156234 -78470 -128492 8858 -133379 99904 312498 75391
9439 -179731 -239332 212712 80402 -226447 96473 118942 -419325 -134304 47044 -101300 -34405
9427 -152036 46631 -38183 -265816 -264131 74374 -110243 46505 70230 41984 -373563 28885
9415 -351249 -229122 240531 247750 155346 218458 71562 90228 -165036 -204727 158305 -30149
9403 100024 158616 162543 -55971 -185758 -483806 243323 -356052 -264046 -49968 -65636 -190408
9392 -190408 10585 -137321 -114730 -97673 -144028 -39853 -16726 -11039 -59236 -91930 -104573 -243716
9380 -243716 -62040 -538215 -4920 272297 64120 -12242 -272543 -234444 -124825 472800 164992
9368 44290 9358 -22972 -30408 73101 -304311 -86552 -88193 -145000 119291 -136523 106804 19609
9355 268398 -211559 -281949 57799 -29818 -348545 -178242 -37156 -384717 -182051 -260629 -23090
9343 -158539 3244 -266247 -34158 -50010 -66001 199239 -46575 22040 423248 80524 -155613
9331 -14784 27832 -204257 9369 -86268 79376 -70558 -96748 94306 -183634 102885 97272 -70796
9318 -149404 254300 -141490 -180997 64936 -114333 -105877 -69526 -45387 -235347 -140206 -80844
9307 -80844 -10161 341357 -122514 -117796 -72746 -157426 264197 -90345 18409 -64817 -136679
9296 -136679 -45857 214947 -8463 -79 -27860 -26368 -18554 -48257 -25712 -121324 271528 -53650
9283 -42606 -219970 -381617 -51241 -70254 -29668 219822 -100280 124057 -111860 196580
9272 -237703 -310962 134355 15814 107691 -113478 163191 -64112 -115729 -32878 -125886 -100901
9261 -100901 -33896 83121 7148 169854 -117671 134196 -182895 -124037 -134838 150526 -64846
9249 -154452 -196128 3490 -337721 -233970 -94923 -25898 85449 -122347 17267 -150401 -107539
9238 -107539 51653 -117177 -38648 -46083 -277433 58797 -27002 -86380 -113844 -74021 248366
9226 -265660 -35498 -240642 106795 261792 -86596 -116068 -26562 -24498 -14314 -337640 -95061
9214 63249 -139734 82885 -310759 -11304 -250336 -165960 -346244 -270338 -160660 -135385 -7337
9202 -165861 -162373 -143988 -80918 -243518 -115632 -224056 -155646 -264426 -29805 28148 -185117
9190 -43442 225565 125448 59412 -70984 -43441 -63380 -82030 38768 88001 -361046 -276434
9179 -276434 36515 -2392 -316321 235461 129373 -48203 86576 345934 -183994 26272 39161
9168 39161 127333 -22949 -354933 -21810 67612 -148349 -46207 -187851 147866 162728 -12589
9156 331665 54255 31447 280125 -279046 -20577 -199902 72465 -30564 86924 -29519 -56380
9145 -56380 -263542 148799 -190124 60503 11973 -85033 69008 -343952 -224652 330492 -303446
9133 103096 205719 -79992 -299261 69302 -145077 128722 -141561 -151540 132059 75834 -423013
9121 -50716 90775 -113070 -294929 15117 -94195 224053 -212430 -281495 131753 -2543 162870
9109 72432 -149268 103826 155573 -129177 154061 -87545 314478 112340 109955 -130106 299008
9097 -109296 -17094 117720 -166547 -102366 81513 -78049 -5182 -295099 -211431 -148320 144322
9085 -257791 -106813 178577 -301787 -53455 -255771 50612 -588 266232 -349984 180520 -199643
9073 325094 -20111 125707 -159691 80508 -316630 -273433 162230 -497426 -64042 189298
9062 -188787 -88151 -200985 -27162 318780 209736 168104 215965 94919 -180221 -261628 -147957
9051 -147957 -266345 -231907 -43658 81724 69134 -384235 293936 128843 -17903 -136731 40758
9039 90100 -113918 -63956 -237932 -226278 25821 249615 72677 -65710 -33018 206386 -8017
9027 -364687 -317647 -13938 -30943 -187605 140743 124591 72133 -77125 -43717 50325 -83849
9015 -683 -237850 201621 -182829 -169047 147939 -58756 27564 -321467 -113070 -278649 318905
9003 123365 -222470 136721 -7590 -284960 -81373 15869 -212244 24289 -252471 -76098 65111
8991 287446 200329 -166833 -101884 -188638 201285 -41502 -35894 -98119 -5733 218763 5633 -100985
8978 -181481 135003 -15472 75205 -10411 359375 61918 -235731 214953 9736 -69272 9218
8966 -205628 -364035 -109618 -121691 -143578 -62995 2420 120675 -28336 -272918 26262 -111596
8954 103610 -81157 95829 -230335 471988 -188743 -182866 42002 -291652 138271 -108684 87013
8942 -9636 -367590 -159395 -360984 -353314 -86039 -119220 42266 -92903 -133612 64361 -10932 -80319
8930 -80319 70086 -137498 -76004 131435 310276 -106 -73850 427092 1419229 1071094 328540
8918 147019 -141575 -130723 -266251 -8188 -61324 104557 94496 -232274 -178194 -72007 108329
8906 122316 251714 322 -277371 -215732 -99455 294274 -188178 -194809 314762 -210616 29440
8894 -397320 -20436 14406 -49681 55402 54348 -104735 -2444 -165751 -178977 -260209 121411
8882 174817 23254 173554 43237 -4502 105478 179362 173290 -233059 389981 -331499 -34173
8870 30423 -418795 85132 -223396 -92686 -85433 -32967 47894 -69408 393317 169617 -390031
8858 -310851 120384 -27037 -100347 -229048 -134019 -7194 49111 -103886 -85354 171540 3873
8846 -79382 -132964 -169351 149022 -156361 59831 87471 -258951 -297587 77293 -327980 87218
8834 -390666 -207997 48230 118021 -46924 -244757 89883 22710 -192846 217515 -23598 -226587
8823 -226587 -96717 -120454 23122 -358259 32320 65925 170395 -16884 -145026 -10567 37299
8811 54939 194140 -29648 217691 146259 -147754 -229675 -192286 56214 -408149 -308157 -313939
8800 -313939 -69635 -26244 69839 42330 19056 -72577 62315 -189843 -97448 -188040 99021
8788 -111403 -79457 47517 -170130 54360 -59821 -119811 -56224 -451737 -297285 -76480 -145770
8777 -145770 114551 62869 52687 -383331 -34345 124021 98207 -41358 -108276 -101930 -171790
8766 -171790 235908 -206078 39562 -163353 437249 -169682 43371 84076 -227080 -205993
8756 -205993 -215288 22970 96668 195185 -231758 -163078 -51356 -24517 -114222 23442 -26862 -254410
8744 -254410 163823 -96918 -18743 -178530 106747 -80408 135651 -108357 -233639 314232
8733 -23946 29196 -195522 157166 86850 20891 -117358 -94415 124975 77737 -190130 -184039
8722 -184039 -166025 -108567 -155765 113986 -65628 3135 -271251 94726 -45190 -181953 -60942
8710 -129303 211284 -26131 81353 -143307 -147558 -14763 371095 360880 -65127 36523 -175340
8698 -262918 -88045 98662 -80892 -77844 10091 -78900 109105 -68652 -196466 -135027 -178059
8687 -178059 75314 -58429 158692 -81222 21671 -179778 -112466 -125140 -178098 -298429 -34218
8675 1647 -72660 -258885 -40385 -179658 -177033 -100010 -296261 -12536 62541 -82203 -187025
8664 -187025 -129359 369381 75925 -342495 -129773 -103908 -43738 -47674 -217044 -46411 -248960
8653 -248960 -131725 60250 -94268 16239 -234380 80933 -347549 -123253 -45184 51593 -285222
8641 238756 124613 21489 132190 5815 107660 47493 -294356 179547 -347602 -292370 -37824
8629 58770 158195 73022 -94057 -120927 -252595 -78874 -55490 18060 -152859 -159056 -278014
8618 -278014 -114067 -175922 72574 -150402 236467 -129862 82646 -158969 -78323 -86600 301983
8606 -151380 73937 103307 -3234 246614 -105828 -252327 -346660 45361 198941 -79608 190099
8594 -244216 -72908 -385962 -103631 263121 87193 -189408 -25240 -86505 -109147 -8953 28351
8582 -222128 60836 -16157 114742 -94088 -130299 146898 -310185 -12858 136270 -131471 174998
8570 118134 -134881 40650 -220264 -180641 -31888 -208297 100465 -288995 -216999 18295 -56325
8558 -170942 -155773 -68229 -71178 353819 21479 -288753 38922 109403 -149398 186702 -137358
8546 283766 110347 -68355 40802 -78354 84240 -171276 -90031 24325 141082 -77358 56301
8534 -125088 -92777 -131501 -43341 -249163 29266 -175554 -235180 -48304 -52039 -108067 -10941
8522 -162262 -68103 40559 -86959 8884 -114009 -103992 -61257 70982 -355632 -192233 -100116
8511 -100116 -114274 -409648 111254 50807 -237174 9070 -376462 -31336 -369933 -53364 -206386
8500 -206386 139910 -25874 60405 -150703 131081 -89870 70285 65316 35693 -60816 66760
8488 -105763 -426336 96894 1813 -214043 -296013 -222960 -52548 -107872 -161701 -74158 -161969
8477 -161969 59034 79747 6766 -213369 -88046 112748 -290817 -57939 -8150 -165476 75114
8465 228402 -60165 -67365 30374 313835 146558 -37721 160235 -128983 103746 270907 71225
8453 108460 62012 335681 99595 80947 303748 -36253 -74784 -283640 720 -4094 -240087
8442 -240087 35513 31624 83772 986 52525 -278907 170429 76521 -400212 -173884 -75403
8430 12552 22845 -43886 -50631 -147108 -42931 127585 65643 203415 -135767 -74703 -148127
8419 -148127 -32675 -48240 -179916 -150729 27915 -157488 -239636 -241565 134240 61052 157514
8408 157514 194904 56745 -14488 30666 -166535 177268 -97328 -124259 45643 90839 -21948
8396 -263892 -64394 -70858 -156924 -417827 92885 183190 -266770 -76612 -105146 -112477 -161727 280255
8383 90813 2310 -100686 86908 15128 156759 49625 152970 -132026 -114286 -177134 174130
8371 -72048 -332453 23285 -87199 -10186 -199182 -40417 -318224 -169358 -305040 -42979 219668
8359 -342976 -151949 89784 -162179 -100030 211090 -87584 -130171 -212625 226805 -117196 -59764
8348 -59764 83187 116288 -306287 -35194 -271868 -147965 -170504 -291520 -92252 321925 -229189
8336 1892 40347 98949 191458 -150318 213111 -170584 -102223 201123 -128833 -28043 -321388
8325 -321388 -257557 56339 14820 -109026 -174776 157862 210948 -53417 -156205 -294459 -231519
8314 -231519 -208919 188279 35224 81120 -155658 22868 -98616 -210752 97733 44097 -241268
8302 -55951 51865 211985 197587 -212724 125967 -134425 35704 -401836 -405554 -131371 181547
8290 -1187 -195012 -5818 216883 -238345 -235802 74441 -182565 -5781 -200614 -148331 -204579 -40167
8277 157685 -8097 70194 -96556 211747 -144919 150657 -331471 -242166 34976 84942 -5808
8265 -120214 219021 76060 212431 -38131 -198104 -398430 102379 2917 19172 -115600 59148
8253 -17632 230934 -248847 -203532 -37373 166931 -3467 -3171 -21123 254267 -87046 -341952
8242 -341952 -45274 341331 69733 -61527 102242 148434 -444904 -104845 -328293 186203
8231 63019 19110 -36867 -220539 -166739 95251 -67668 172785 -95259 -233539 95212 159457
8220 159457 -360976 128546 -43141 20535 -109305 -74964 -204163 -53905 65253 -212898 -60054
8208 96142 34256 41929 -183115 152206 76951 -61968 -20219 -306084 103812 3077 -61921
8196 -58081 70432 -40038 -176006 -150883 -127765 -239909 292607 84530 -156896 -245940 16595
8184 275025 -76806 -86280 -73852 -171283 -155344 -120640 -123184 -147620 -121528 -153610 -75582 41112
8171 -134427 -248823 -294433 -77565 102030 -28600 126222 75793 -140195 72996 -79210 -179369
8160 -179369 298971 -63494 119243 -40615 -182121 -31192 38867 177982 -3948 -452765 253444
8148 196350 -121215 -45566 186066 109571 118750 79051 99335 196775 -226876 94768 -161530
8136 -16506 -119994 -227851 76118 -222109 -243189 23872 -39993 -136758 118694 -331858 -134713
8124 -87421 119491 -370418 -123592 -264383 -145693 -106135 -201948 -312956 -200313 -99339
8113 20357 80819 100563 -169919 127588 -255117 -257192 103267 -81724 -131433 24778 -194387
8101 -112800 27848 -337717 77483 254221 -67563 -97475 -198782 -28684 71019 -90299 -166778
8090 -166778 -248201 -342833 -19984 -108390 -261133 -85869 50180 -235031 -212319 -42594 193456
8078 -263463 77163 -137026 -239953 205566 86748 113497 -102494 234578 -182251 17555
8067 218123 -74424 33112 -210553 -78974 234651 -220332 366113 -146586 -7166 -262567 10185
8055 209652 -61640 -276151 82624 -112014 159521 209703 40810 163828 -185941 -62950 327063
8043 62705 105127 200327 345561 -54017 169020 -28098 38487 168006 -23642 -294160 134971
8031 87611 103943 -15579 -29053 -230906 -199239 278500 -305021 184621 -112209 -90471 -178217
8020 -178217 88642 152862 65768 249527 -124199 -97413 -296107 336356 -227797 22702 -73162
8008 45649 -166933 -288795 228995 268097 -3261 -178443 -68613 -54573 -33736 -11250 -394352
7997 -394352 -192051 118912 -132127 179540 161977 131596 -383963 -216953 134993 -159969
7986 -352748 213527 -250855 -372185 103099 -29985 -271437 -12751 -376934 -463693 -152353
7975 -18157 -326103 26547 -122049 -157512 143751 -14238 146420 -206299 35094 -39296 101133
7963 -240118 42365 -233921 -136583 -260273 82175 -105368 35466 168701 -12175 60100 78482
7952 78482 -173327 -116926 186859 213203 -371047 -78608 -109715 -70027 20436 63006 -8160
7940 -154336 -92154 -120479 -39343 -82832 -257322 -248277 39159 850 136377 260789 176953 -143908
7927 -384731 98884 -113470 -278966 70467 30088 22506 77250 -292414 -334198 151412 -81958
7915 179698 -33133 111306 -51786 -303285 91643 -317279 -51951 -218219 38530 -152880 -238742
7904 -238742 -254176 68247 -195193 -92390 107211 -113670 196756 -250157 -124307 -222 311420
7892 -64614 -101535 -274358 83595 -68423 -36521 -272229 -134644 124072 250462 -218328 76917
7880 85281 -40841 -101567 -47424 -87474 20935 115176 12957 41513 187986 -120483 65739
7868 36527 -192611 88801 107020 -90766 -175835 97193 38859 -102722 -784 211318 296018 -123586
7855 -231383 94570 -115073 -46431 -13370 33266 19016 -83163 -15891 71524 27939 -142826
7843 147345 -166343 -338990 224443 -269423 -79058 -239435 -89210 -31493 -327050 -44619
7832 -332094 -60399 -183063 -279985 -42747 236415 53447 214115 -112300 32985 -260483 53516
7820 -150443 -326897 -57500 42705 -163752 -228410 21114 22852 -176216 -95097 -301183 -21504
7808 -189067 -143893 -250139 59218 -354458 151191 24628 284909 -158743 195272 -119998
7797 -221431 -269482 17928 -32920 -118104 104497 -134441 -254863 12000 45894 -22841 -56480
7786 -56480 218356 41820 -70525 77750 -90691 16750 100975 -242925 98363 -68614 -24426
7774 -43197 -209852 424195 -62000 107507 23894 399989 112588 1693 9995 111415 -45452
7762 -109233 -50729 -61151 -80910 161918 -118475 69735 -151280 67561 193798 -393162 47761
7750 -73852 60592 -68730 -239274 95638 82287 -47560 -67855 -211183 75436 -251859 -184907
7739 -184907 66568 -115448 140633 8563 135295 -170738 -144848 44433 123549 -220153 -42815
7727 24961 7026 41355 -196011 -174682 -210846 49287 259545 -83623 -139388 -183481 96451 -96271
7714 -188594 -51681 -3488 22718 19465 -276500 -65196 -154921 174650 -98579 -221147 159584
7702 -145094 35940 30730 7651 -285886 326546 -69848 145582 -54307 -59943 -29112 4934 -97553
7689 26026 67445 -97593 -241083 63324 6620 161580 -306576 -152115 174559 -69633 -142040
7678 -142040 -267007 -48328 74023 152245 -79164 112860 64411 169571 22908 138686 -127037
7666 -127531 -200343 54061 -348006 -9206 179716 -176653 156041 -34814 -134886 -126577 198950
7654 -69150 -137887 -35777 119346 -165490 71851 204472 -175362 40701 230187 35777 43050
7643 43050 -165366 -158053 -136129 -157557 -13183 -69753 310402 -250566 155207 94263 78051
7632 78051 218917 194870 -92654 -166461 -61732 239212 -124027 220710 -266663 -276049 -217673
7621 -217673 7976 -238562 183054 -352774 329437 -19516 -313415 -78114 23593 68546 92386
7610 92386 38234 -179932 15378 -72433 -26807 -113093 -315237 -48375 -219180 -126288 189869
7598 -20932 -73531 -146974 194979 -80336 -269255 32793 -286107 28677 30120 -19753 6343 111633
7586 111633 -135184 -370158 77070 -214893 -243425 -189722 -71789 -117097 -321071 -5597 -150531
7575 -150531 -209725 -189849 154915 75478 103568 -352030 -291513 -160614 -114119 263067 -95956
7563 -524299 159270 25942 -219184 277508 7762 187778 -171629 301799 90634 62341 195681
7552 195681 164822 22416 131797 6353 -104510 175249 -107459 263284 -39458 -312098 124128
7540 -141260 -227080 -52203 -210906 -1230 22507 -211558 -108319 -335876 -6079 -83378 -18283
7528 98720 72826 -152443 -198109 329378 121451 174092 -264042 274254 23493 -318669 -263288
7517 -263288 -59230 -282486 78754 -67229 238279 75393 74974 48155 -23078 -86540 126377
7505 -106793 -52564 -119785 -184289 2945 26349 137809 172836 -319320 27170 42355 -15942
7493 -9142 -78812 -18280 40422 -17084 -3964 -289675 125061 -162794 -299563 269090 182511
7482 182511 186454 -80877 41423 -118346 8934 -277474 -45861 -167340 -13409 -135149 -21379
7470 160164 -86075 -339480 -182865 152142 -77009 89242 -54407 -208209 257702 -396114
7459 1831 -119273 77552 264502 -19577 -5845 -145634 322689 -178108 -268068 -100673 -148117
7448 -148117 109571 111398 295390 -68827 246919 -167828 263454 66815 115742 -76277 -253405
7437 -253405 -48562 127342 -199103 100173 124781 -50311 -16751 135817 246272 -511724
7426 5545 -70014 -29801 -167813 72209 -44908 -1462 15336 -51764 75077 127261 -186958 144919
7413 91197 -7132 326571 -194479 58253 50068 156043 -91976 -54082 118598 -284616 -364867
7402 -364867 113814 190684 -130733 -208553 7176 266780 32816 263952 13408 -57114 -18292
7390 -188077 -67508 85056 -121889 -375668 53003 49763 -135800 444401 -297823 -228177 66037
7378 185702 -247122 -42323 -39307 -195094 84242 -22322 194082 171136 -144999 134848 -57809
7366 -76570 -10393 69351 -34128 13496 -96597 -78169 -239882 -62515 -58921 -3111 133530 -54885
7353 9675 82413 -327202 -164264 -6267 70226 89528 -145985 82097 177560 -230874 -29263
7341 279116 -170886 -72101 -15654 -142494 202652 41480 -204849 -193586 -118710 -137716 149888
7329 -257145 -57346 -236131 -57107 260262 -321394 80439 478232 38269 23163 -262217 -228405
7318 -228405 224253 -360903 49372 83082 -248452 -241992 351659 -21212 12655 -232143 -14417
7306 176276 -96021 -156949 202776 -135149 252171 -88199 -102695 -66177 109831 4600 -88664
7294 58524 -322678 316617 -6034 -205064 -72342 107720 53201 -233150 -43449 66931 96650
7283 96650 7208 69408 -84145 55103 240157 50334 -283287 72583 32783 -199690 -107414
7272 -107414 204115 -127099 63643 -17946 93754 -172858 15057 -11034 12013 98051 335947
7261 335947 -125071 -56621 -166281 25603 -230675 -123853 -60240 -52047 -316353 -306838 29785
7249 191672 204024 209110 58644 -471908 -162977 228645 -218431 80788 164861 -444311 249781
7237 -175545 -106999 -81816 -16764 -326219 215563 33183 14507 -265822 -53190 -7036 121980
7225 187827 -60313 45255 140894 -62484 -31951 -23618 298562 -231796 73110 144516 -255176
7213 76119 16965 -25375 -203220 219552 -254047 276693 -191186 -37978 -57977 173131 -214005
7201 157824 -70505 -175599 -109770 23153 -95644 -106260 146069 56614 -91489 9955 2480 145307
7189 145307 163298 229831 -34996 -177527 -27200 43804 82368 27033 28665 -154502 120405
7177 -566415 -156131 -173405 -85409 -193347 237754 -98244 -334790 -156995 29909 -239654
7166 136464 -436910 -65534 -238954 128171 127247 -36835 103006 -104988 -99671 47241 -137991
7154 -192030 -23227 -262704 -7803 -148216 46215 88820 212507 42805 -151265 -126147 -120290
7143 -120290 -77415 -312424 94352 31153 -48301 -7719 -87067 228408 186100 -7388 244775
7131 -68036 -259188 -143830 224540 197320 -109666 -132831 -111925 -112184 96449 38693 43668 71464
7119 71464 338744 131537 -113097 51830 -312394 -6908 -210502 124625 30247 220025 -297644
7107 -125617 -57863 5519 -256865 -302089 -439512 169937 -334433 105876 111430 106690 104846
7096 104846 274173 -65197 -81458 9020 -6143 1033 -114540 194937 4341 -161304 215824
7084 28670 -273259 105622 -39173 -193088 435108 -301014 53722 -39293 -91416 249398 -167828
7072 -90332 -132959 -14240 -136169 -128663 34160 -122093 6548 -186057 34577 68074 -239154
7060 -111306 -111093 -160389 45845 -107265 75063 487221 36038 -32929 66807 -127473 -164316
7049 -164316 99387 68817 -133296 239168 -68311 169474 -102303 -109546 -230517 -4045 -353026
7038 -353026 -99507 -16056 232957 38798 -140892 31315 -227636 -20269 282403 -111220 35812
7026 10460 -352356 -27755 -41467 -102157 1878 -37827 4909 -34887 -39309 -208415 -344583 -76030
7013 -185238 -905 191994 -94621 -302625 -57336 169294 -229159 -367986 116533 -213542 91107
7001 -307845 -63177 51932 10255 127077 -1236 -46484 237737 61095 222657 -126810 57204
6989 -86771 -210086 -282194 -41196 -19916 294481 37524 263124 -15957 71918 527288 98278
6977 -5179 183127 -228441 -56013 -344394 -293631 43732 -51359 -372186 -237954 154118 -32336
6965 -394660 -67013 -68996 45588 -18264 210374 -192143 128376 -320794 116444 137149 179502
6954 179502 269083 -166335 44845 39300 140488 93699 -272226 -25038 148631 20891 -55304
6942 -147309 -76581 -121595 -28725 -76753 192951 -198383 68571 -52836 -297870 10918 -316290
6930 18296 -121986 160022 -116303 -56880 -150924 49559 20823 -83853 131759 25959 40109
6919 40109 -57023 -204481 -463845 -64823 -132688 101023 -157497 38475 -151798 86624 46493
6908 46493 64629 -90061 255756 642 -143918 -15590 -61123 -98709 -202840 -329293 58108
6896 121469 145700 -149863 -27483 3015 143393 121479 -282102 153741 -146815 -103041 -176883
6885 -176883 43811 -55334 1265 260326 -105163 117480 -46586 17360 -242146 -288761 -121707
6873 134754 -158034 -402425 -49911 -508016 -2983 -12099 253331 -249477 -279321 -244178 40491
6861 -278356 -120231 -362464 -7867 -305640 -3123 -176007 -213447 134692 323 116926 5446
6849 88790 92085 -161411 124792 314584 -370530 21304 71110 119158 -297854 -13905 -256418
6838 -256418 148917 -3294 -143051 -30843 -54583 270572 -212590 -137494 -46062 -2391 -133242
6827 -133242 -270099 -102865 125514 -12475 -237428 -94459 136290 -206390 -89647 -218530
6817 -218530 -192325 323881 -51685 -220783 415868 87703 -123034 16686 53573 -264516 25137
6805 -188999 180960 146005 -321758 52828 -200665 -116476 -94342 91407 -12090 92087 61599
6794 61599 -19998 36327 483218 216239 -36126 86535 64004 -312681 -178780 89613 -30192
6782 81016 10351 -75408 -7618 -111437 91568 -178370 -88502 -184262 -9949 293279 377928 56996
6769 -371172 46414 240265 -181377 46486 -263833 146110 -65952 15371 -143792 128169
6758 -170692 -240771 63193 -180841 407975 207344 -155058 -479025 246217 173409 200869
6748 200869 -80476 -36880 -39418 -346193 24071 193631 -324253 95109 261697 -82775 225464
6736 188115 251023 -74951 95204 93148 -215184 44870 91976 66810 394129 32172 40420 -171121
6723 -61401 -34044 63986 -185138 -249937 26340 -72348 -155545 3087 32331 -359790 -296701 -114028
6710 -69136 155236 -22030 -6030 150095 -42309 85791 -263739 102766 63055 72035 -122369
6698 -345854 -146648 -66712 85822 132844 69446 189006 -137797 -142731 237841 -26417 -234470
6687 -234470 -127719 70704 44307 45279 -68256 -230069 85115 325462 153802 77629 32937
6675 38914 131525 -282660 176887 5924 -84385 47203 -299922 -179220 232462 282122 163930
6664 163930 76684 13281 -53888 -229513 244701 -295884 -110446 -525696 -38618 26911 -124586
6652 257385 -60430 -152422 -52098 151136 -168237 -99078 192554 -190975 50660 139679 124427
6641 124427 -157502 -156188 162 47529 258309 -95315 -27187 149924 -223836 -20400 121040
6629 -50211 98545 -141348 -98609 -189813 134928 -100132 -242338 -466948 129760 -166190
6618 100354 -256252 -73685 -46258 -185668 -112524 -28176 130847 82699 -310965 -71801 37719
6606 -84186 266776 121912 227195 193645 208386 262092 -106466 316065 297987 -26397 -225274
6595 -225274 166878 2083 -432355 -67366 5157 -1793 -254824 107703 -224422 -112885 32993
6583 -389626 -365591 51506 317794 -336329 28684 -34053 45582 -95506 -85656 -148264 37378
6571 227896 27557 32026 39502 -67200 278207 -97268 63142 -50437 21798 -60244 13515 122694
6559 122694 -213961 -78487 89185 -123155 -175766 -28870 -510776 -201651 -133634 -213277 14547
6547 -33251 277924 19170 -95189 -74379 -127229 23584 -178385 77769 -1229 44124 88815 -377447
6534 75235 -166815 -8791 11879 -58069 13888 -67412 -7953 293915 -37072 85901 -93063 -99859
6522 -99859 -5291 195662 6306 114931 68046 -511 77524 154928 41509 190869 -13887 -20397
6510 -20397 -38204 37826 -92485 -126702 -10720 122545 -32772 41596 143477 -341135 138623
6498 -265874 -18125 -21455 -90320 32734 59055 -294441 120151 178954 -58353 351465 -127453
6486 132383 -170295 -122777 107069 27277 53127 -37110 18601 199070 -140004 114990 80616
6475 80616 -224545 -188895 -51925 -329418 126587 -23524 143208 -315354 54175 -781 -2065
6464 -2065 29874 -4451 52586 -241782 -145886 134190 242524 -53727 -90207 -183845 -94741 136664
6451 -203175 75838 193620 -410363 119004 167256 -156292 69702 55433 -318733 250830
6440 161272 -261546 -225413 39354 -232293 84950 65607 -243767 194806 37924 -263870 -104824
6428 110158 136379 -83271 24136 51915 -26577 -9693 -21793 137872 20496 -17674 354925
6416 97832 163498 -37208 -77994 -82237 -53555 -239839 -13497 -2331 54395 145734 176983 -225077
6403 268822 -215141 -157810 14402 -152632 -316038 -98867 -304108 -10304 -258655 184538
6392 -15913 -528729 -12045 -229714 -82339 262992 -312222 13864 -199143 114765 148738 21211
6380 -221131 -139815 -47250 75082 87897 107921 -239687 116934 -184435 47269 35865 45122
6369 45122 -115770 -265801 22616 -76513 -86343 13343 31125 121709 290327 15836 -477080
6357 -66218 318553 49806 -126477 196224 49642 -78071 -86974 -204757 128927 -163910 -381482
6346 -381482 -234550 -232254 -12056 -379426 15073 -22320 -125225 -51240 -64657 -298538 231631
6334 -226965 74509 45573 -186458 25771 -230786 -259351 -142455 78950 -126925 -168627 83768
6322 -79766 20447 184719 88085 -109135 157210 -82197 -182228 -12159 162228 -234027 153355
6310 123750 6558 54699 39758 117512 -66850 -375305 -227295 81541 -98894 71716 -541938
6298 -120709 136246 -67041 -138589 134938 -91744 -121976 -79986 -12097 -107946 -388614 118137
6286 99802 77342 -118720 196499 -344916 11388 43580 32751 -73088 203234 63885 -112495
6274 77298 -275429 83182 7952 103292 -111987 -10984 818 -327558 280424 264195 -127927
6262 49505 86591 253193 24097 -206642 -112147 312629 90051 -94163 -108112 206609 -267580
6250 -50138 -83223 -347314 -61483 69571 49774 -130149 -142094 136067 -145864 -342892 -22219
6238 -486569 -29240 -98246 -50401 228304 299174 397048 26743 -245810 67713 255537 84724
6226 -188542 125654 136169 120356 -137325 -353211 86732 11443 58933 -277563 -34648 -26960
6215 -26960 -129434 -69578 -20392 -285793 85364 -155180 158314 -92898 -60153 -100876 4725
6203 245584 -135909 -156119 14562 -5450 -191238 144538 -25705 -182459 -174981 -340424 -198275
6192 -198275 -157975 67780 -139518 -42781 44621 -78804 276378 72907 -102912 -32022 88678
6180 -70628 -76810 11610 84927 98373 254094 194255 236564 -128627 -79610 107488 258603
6169 258603 -120663 -94853 57628 -307980 -97413 -178614 -152474 93208 150435 -154477 -26280
6157 51620 156013 60123 125743 172043 12629 274386 -434690 236413 -1838 -307436 -201057
6146 -201057 176957 1361 -26028 147560 50234 -203498 -298670 101164 72698 286333 125630
6134 -178030 125919 -64645 -387882 467084 76064 53017 161952 -142297 -171401 -308756
6124 -308756 71694 159746 69002 -50012 -54413 186994 -80971 70702 -21804 -56677 -381012
6113 -381012 -258464 -237535 134898 145090 -169823 102703 -170065 215233 62484 84941
6103 84941 39581 -56569 -18387 244946 -2413 199856 169923 -252970 -100816 -172447 52252
6091 -9441 49318 -48182 169411 -19533 -209770 -269129 11281 -757 72299 89922 -389901 117808
6078 112389 -52541 287505 79801 -43539 -23521 29100 105012 83714 105673 -55192 -19100
6066 -79536 -30579 -138626 62411 33859 -98843 216307 40564 88414 97396 -97863 87200 242991
6054 242991 207298 286830 -181227 -321650 -98801 152793 -22773 260377 -225559 35407 -88081
6042 331875 -170125 -158667 309419 -170256 -149983 -54221 25810 11304 -160725 89643 55487
6031 55487 113338 49507 -12627 120433 -25849 296307 165803 -129999 164191 181072 201928
6020 201928 -143164 338436 206691 198744 71415 -60634 -45958 95373 53544 -238180 376034
6008 -60069 -181191 97626 49259 -163653 76796 -184096 254252 -256942 -224348 4719 36017
5997 36017 -89477 -317878 -193641 252034 58939 -130277 131675 246827 133304 -129079
5986 60570 -78400 11068 66780 139693 355194 7793 22282 -206267 -110984 -4380 -30729 325336
5973 -233143 367216 34210 -299027 143632 56962 75298 -303281 371428 165447 121797
5963 121797 -191685 -93518 -60529 -187453 -254915 142570 96840 -162989 -303227 48249 -125925
5951 162160 61600 -116148 -141227 -18352 -412636 -219941 -106232 -428150 -1207 -123586 207430
5939 93221 -232992 -37259 -45365 -237660 99536 -116437 -59388 138468 185334 97946 -263599
5927 145798 157066 -196492 60493 -128372 44570 85080 -225181 127483 -47146 93771 56881
5916 56881 45607 -14908 -141160 -71089 -37151 -76724 -477977 297514 -26886 -299061 174384
5904 -134514 233461 -297218 -295684 150167 59896 55273 57766 236797 97373 -76553 -15127
5892 -138163 210713 -76568 1219 -56617 13003 -135247 -114019 114105 -43608 44406 -131076
5880 -65036 102983 -12613 -90603 -283448 -20849 16177 166815 -104309 158052 -51727 -166803
5869 -166803 -293796 -163559 -103492 17729 65627 13912 -81985 22920 -16841 -86858 -273621
5858 -273621 -102151 226952 38025 116002 324288 -142826 -137696 -17751 -157977 -172124 40059
5846 241718 134885 12905 -270026 -94920 306737 129600 -76452 -48762 -282183 -68646 76850
5834 -257039 101909 -116253 -9553 192241 -163901 -105069 50841 165308 -351738 -91829 106551
5822 -115662 -170256 96410 -267177 -155863 154182 -105606 134598 84415 104605 128342 72974
5811 72974 397694 72296 -56493 -100220 55178 -143219 192075 -133733 -122911 -67838 487830
5799 70018 64964 -146573 -133797 183047 -150651 116531 -266455 -428377 -217449 196488
5788 467230 117743 90236 -157594 1097 119629 -36132 116454 -184160 -165997 -148944 -76850
5777 -76850 35336 42611 288471 -120770 -145737 140970 193152 126709 280029 54013 222236
5766 222236 -19631 147853 -128430 98104 -145873 42018 185279 39589 62536 1505 93948
5755 93948 -3182 176500 50961 210100 -57390 286252 -169534 -92072 -182293 39608 130973
5744 130973 -112780 136532 -301042 310723 -32217 -179540 -100680 21164 -45969 -217890
5734 -217890 -205913 209804 148439 -115533 -120835 -161092 -103562 273822 -119426 -28954 -206260
5723 -206260 -205263 -227733 -251345 85514 -68573 -68552 52403 124437 -236499 -380192 150881 31588
5710 -178683 13347 194798 -30719 -66925 230447 176784 260091 85915 -49433 231640 -7703
5698 30267 89422 -47056 -465619 -67997 -26165 -302173 233875 78721 -157318 -33708 -69084
5687 -69084 -161884 41901 -3206 171294 110105 -21356 1089 -2347 22760 84060 -210170 36474
5674 158374 59658 -108140 292705 230928 58568 -136774 280141 -180639 -285733 -62553
5663 -84299 395084 16655 -126997 -143514 148141 281663 -201021 299164 -78054 31224 -237140
5651 -158340 58655 70549 130811 186165 -83651 23555 -44681 123164 -145395 -170516 41402
5639 -49645 7991 80604 182820 168 -92003 196841 49856 -21985 -88127 186386 286471 -81430
5626 117817 -205729 3446 46966 -257191 365966 96048 -9284 210355 99846 35644 114235
5615 114235 -135412 -149424 -4539 105664 -74472 7064 136042 172309 -15375 212056 23960
5603 -258188 67409 -36121 128304 -195950 -13492 78955 159040 56874 -157900 187644 -62742
5591 233247 155072 -105705 -1527 109100 -281107 -96429 122599 -93107 -15116 -22512 -8009
5579 8824 304788 188777 -93057 133179 256844 -112786 -91906 45281 -182696 -12935 -122052
5568 -122052 -113695 185274 -53280 46419 -153591 189968 86071 -37467 -9157 -49012 -186046
5557 -186046 34726 91230 -268002 -41689 172533 -7113 55521 -323784 -319424 -99417 -73240
5546 -73240 -60321 6368 72608 -18208 -68336 -315245 -37816 -296792 -204744 -95494 104371
5534 123575 100130 -141201 -164109 5135 -152940 51795 -270338 -181909 -125812 -49665 11406
5522 -147005 163986 -183201 -227788 -48607 -92010 134960 342 -249773 188355 -129825 112766
5510 311698 67048 -81340 299838 -153454 127022 115102 -156173 16857 -78596 -211919 -202812
5499 -202812 -205945 33247 222509 -59892 -3535 -126097 319796 -182815 -82118 -245782 67305
5487 159714 -417173 -180155 -100127 219938 -104333 98887 295054 -160902 16508 129503
5477 129503 170712 -52002 68158 68184 88730 -105525 -53076 35482 -269422 -52481 130171 -25345
5464 -71831 -137053 -325489 41720 -205012 123267 150295 -5841 -3640 54630 171629 170438 -32006
5451 -120494 191511 228167 -91050 97934 -200912 280660 -240462 94407 152512 -65859 -99035
5440 -99035 -150662 -289781 -13511 -60487 -7241 60195 -208567 89137 218296 -305582 71490
5428 -275076 -144408 24248 -80518 205001 -42898 -342165 27834 75920 -133967 -107111 -17768
5416 -220644 306603 -117390 -297875 -100594 83004 272845 -385753 -94480 -103359 111101
5405 -204663 -296873 -258442 -125289 81089 -27289 118077 63905 7727 48878 -52205 8652 315506
5393 315506 173888 -41674 347515 -62195 334476 -55318 -144829 178203 -220967 -205336 -123193
5382 -123193 -8821 64468 -13296 234817 -190927 -166020 94904 -101729 -65495 -55490 -149250
5371 -149250 283437 160787 16933 -100428 -3503 -452634 62763 137113 385491 70225 81821
5360 81821 86685 -169960 31147 -223010 -185038 -102392 -189771 219744 122361 -21488 -139860
5349 -139860 90565 -195005 -242377 5990 -170286 -8461 -110936 92478 510075 -173331 178427
5337 116098 49088 169128 18794 42688 -83256 -33118 12113 177687 38065 -63958 -14502
5325 -74667 31564 280677 -158813 35508 176561 287371 143927 -380117 -38082 148738
5314 -251046 52702 174427 -151975 -124227 2496 -93790 340530 145231 97971 130617 306124
5303 306124 171734 -67538 23595 -268106 21038 -318871 -131109 -233403 -109920 -124031
5293 -124031 120318 -208851 -250722 -106079 -23972 -93068 -114786 102011 -19857 -157101 -8923
5281 1361 -88023 -50274 34043 289532 266942 312098 57382 -285434 164674 23577 -74497
5269 -39201 38409 30238 -19699 17047 -159160 30065 -104976 -42996 74220 182093 -260033
5257 -173785 7278 -97857 -179508 -62296 91397 -177671 -137731 -227815 -145547 -225668 -6240 -87844
5245 -87844 48929 -222656 94277 191989 12753 -68753 39024 145545 26752 -99195 -271163
5234 -271163 166392 -192562 78682 83937 172814 114665 95528 365652 38862 150171 89177
5223 89177 -179577 -106220 7443 -322442 -45905 -333452 -121421 -139114 -131320 345651 171112
5211 -265696 -63584 15642 52488 -244615 137098 -106054 29023 103074 159425 301874 -179013
5199 -147323 -16661 -125714 -83373 -46486 205073 272504 -22188 20038 -125336 45408 20780
5187 -112235 -20950 -345319 -270 -104641 102766 186935 -67023 -191184 -32254 179630 -203581
5175 -32064 32596 399297 -104249 -15980 -18549 -182506 -15337 323116 -190558 48215 30032
5164 30032 -136776 -184747 -225707 47358 -270861 149246 161345 -36541 265564 -41500 260675
5152 -79800 -29200 212033 -184377 -154489 -98410 -54258 113705 30663 -29524 -82238 -23392
5140 12680 327912 151777 -138910 -9256 -267111 183513 -71740 -303273 42870 105763 138250
5129 138250 290952 277160 83589 -281965 -67582 -126999 94096 -37419 80520 -112790 -21244
5117 382556 274405 166580 85623 44663 -224489 -269423 -38907 89830 283231 -260962 157980
5105 12169 105605 -130940 35121 -245608 39667 -154356 -24970 198368 -162306 -265261 221441
5093 -199614 -48633 320515 -221979 -176984 24751 -84971 -115 418039 -63736 -390600 -37052
5081 -140798 -255998 69132 20957 -69428 -72438 165508 42479 33532 243843 201445 918 133555
5069 133555 137389 -96398 -125880 -297014 49634 -69010 -187328 -150967 173421 -154962 33656
5057 200313 125027 338960 256142 72777 -43967 -192946 -90162 63072 -61782 -35375 49710
5045 3410 -108057 120167 77095 -7932 -50573 76100 186293 -37635 90398 227562 -168889
5033 130529 -118944 -20698 91037 -74798 193899 158336 -49927 -228775 -154497 391560 120083
5021 -312065 -64502 187348 -207575 -103805 -114234 61087 249406 38795 12408 -345047 33503
5009 225409 87419 154154 -78170 -73088 80528 -190807 28687 -35041 29 -46147 333035 33135
4996 194828 232632 -179747 33931 167984 -63874 -225665 101651 -457569 63472 -84513 133213
4984 46824 55335 43132 -72504 -37135 -246496 139645 -88588 -134224 1154 36285 183161 -159527
4971 7939 323652 280407 184724 29452 -95172 -55454 54424 -10456 187400 67693 -150908
4959 -133446 -1006 58607 189041 268821 -113065 -142137 -34153 35306 -56379 120198 48606
4947 334767 -47956 -15548 95263 74445 -128760 105445 -135126 107809 295947 -94984 170835
4935 -8579 -163632 243658 55658 -109380 88590 179804 -157555 -63482 98360 157157 157415 70594
4922 -270780 82775 -153076 -84696 -100972 -95752 -269470 -373448 -406729 -373701 151262 -29757
4910 162979 47140 243196 -209347 84419 53115 16082 220031 -104734 -29736 231216 -5591
4898 -146289 203852 -100136 -196688 -86771 -48144 148829 -341778 97776 41745 -357712 23820
4886 -1388 -89376 139778 164871 -105058 -126537 99456 -25446 75055 -99234 147095 54014
4874 414 -9176 14545 -40813 222407 -225928 -19741 250801 -90318 2559 30886 386498 165548
4861 -258748 48593 96077 168103 -164909 -217272 -152311 -72184 48299 -278980 -172573 102385
4849 -118598 -201618 136446 -5012 105216 410632 -68414 -245200 237017 79465 -254293 55966
4837 140155 -108099 -142775 329936 271057 -197597 274350 213956 -86335 -102146 -203726 -359298
4826 -359298 142990 162659 -33041 89181 -415910 40018 238924 222957 2472 -92558 55992
4814 36949 -130095 51940 86471 28656 -181024 -126074 23281 30781 60850 -271883 84964
4802 173852 80766 -18699 -23667 -125717 181346 -131382 420820 -223464 102249 349951
4792 349951 -48521 28558 131 299218 332373 6525 88721 137415 263653 197882 -240152 -97394
4779 33771 199197 119653 -93201 294561 29802 158933 5567 -49809 -99367 78206 32124
4767 325174 -166873 31605 -125841 -272919 182842 -194806 -50478 -236490 -89520 267983
4756 -248135 -89709 311678 57739 -41042 -151416 -8198 -2591 326696 406137 -149261 45931
4744 58393 -87678 -151108 131091 20711 36075 171513 275470 33000 -110598 -2132 -73136
4733 -73136 -80540 347021 48568 -367583 231116 198354 -297620 -52475 -311512 -15192 -156345
4722 -156345 109898 362939 126746 -300341 -138946 54655 213039 238666 -145585 -96413
4712 -96413 137837 -48987 -191098 -91072 -133817 -138046 188083 -614 -188275 15493 58870 133683
4700 133683 49243 150810 -64224 -50044 -270941 -263685 217305 140015 204976 102907 -154785
4688 75492 7185 -36676 -401704 -34917 65089 -32983 -86675 -84440 -45239 222358 -35536 135732
4675 -101647 63954 88264 235053 281083 28916 -26994 -27250 239428 94989 -191611 23196
4663 -262909 -391522 -117688 122117 192809 134622 215693 -142193 11735 -174690 -6471 -163002
4652 -163002 -35932 59402 -252318 192226 34228 175627 -208131 242134 -120201 113115
4641 215684 -424486 110163 174960 150358 -68083 48200 -168746 147438 207956 -1492 -179208
4630 -179208 -167138 -105063 84656 38201 7420 168146 160682 95674 243737 -173460 110770
4618 69068 108888 -88900 -215407 115527 -28950 -62152 70262 -77819 609601 112424 -28416
4606 -422549 -363156 -175173 -201924 -13648 -293227 195446 29833 89669 1658 59449 -268017
4594 -301472 -215794 73701 -238989 -102848 39722 181567 154731 -3194 294860 -63409 113788
4582 222403 129705 55166 -29309 -5928 103359 -280616 203956 273850 86261 297547 -5061
4570 157906 -206998 -43468 42333 58024 140692 -263392 238326 67170 150283 -247654 -284939
4559 -284939 188193 -139450 36555 377917 -10410 -107413 95940 -78139 -180847 3439 251792
4548 251792 -366758 103320 121755 46267 158528 322305 -151106 31032 -148182 206557
4537 90553 -188799 -327836 36221 189607 -431265 -32955 -12431 105533 -43863 -91441 65004
4525 -59049 119157 216024 -68220 176286 -33405 -179565 61231 -5314 88794 -379585 167576
4513 85275 -179330 229999 -278567 65657 121984 -6607 152281 78435 -26075 -54091 -60702
4502 -60702 29353 108916 -109101 45374 32157 -139497 -161485 72957 -80130 -4088 -5415 -78300
4490 -78300 160021 91201 127119 388464 -66815 176965 -129106 -65933 -207422 414209 -228681
4478 204673 -167084 131403 -133228 -43346 -173094 171864 160030 -420962 97021 127559
$$ [...]
##END NTUPLES=NMR SPECTRUM
##END=
