##TITLE=AC1443_BRASW13252_8011624_KwShgGANJ4
##JCAMPDX= 6.0         $$ Bruker NMR JCAMP-DX V2.0
##DATA TYPE= NMR SPECTRUM
##DATA CLASS= NTUPLES
##ORIGIN= BRUKER
##OWNER= Administrator
$$ 1.72 TOPSPIN		Version 2.1
$$ 2013-07-05 22:53:15.217 -0700  Administrator@X
$$ Compression mode = diff/dup
##.OBSERVE FREQUENCY= 400.02188249412
##.OBSERVE NUCLEUS= ^1H
##.ACQUISITION MODE= SIMULTANEOUS (DQD)
##.ACQUISITION SCHEME= undefined
##.AVERAGES= 64
##.DIGITISER RES= 22
##SPECTROMETER/DATA SYSTEM= spect
##.PULSE SEQUENCE= noesygpps1d.comp
##.SOLVENT NAME= COFFEE_meoh
##.SHIFT REFERENCE= INTERNAL, COFFEE_meoh, 1, 14.9609
##AUDIT TRAIL= $$ (NUMBER, WHEN, WHO, WHERE, PROCESS, VERSION, WHAT)
$$ ##TITLE= Audit trail, TOPSPIN		Version 2.1
$$ ##JCAMPDX= 5.01
$$ ##ORIGIN= Bruker BioSpin GmbH
$$ ##OWNER= Administrator
$$ $$ E:\/data/COFFEE/nmr/AC1443_BRASW13252_8011624_KwShgGANJ4/12/pdata/1/auditp.txt
$$ ##AUDIT TRAIL=  $$ (NUMBER, WHEN, WHO, WHERE, PROCESS, VERSION, WHAT)
(   1,<2013-07-05 22:53:09.904 -0700>,<Administrator>,<X>,<go>,<TOPSPIN 2.1>,
      <created by zg
	started at 2013-07-05 22:41:40.061 -0700,
	POWCHK enabled, PULCHK disabled,
       configuration hash MD5:
       C8 4E 4E 5D D3 5C D8 9E 9F 52 82 E0 59 8A DE 15
       data hash MD5: 64K
       27 F1 13 47 F9 E2 17 CF 1D 45 4C 53 47 FC 7B 16>)
(   2,<2013-07-05 22:53:13.217 -0700>,<Administrator>,<X>,<proc1d>,<TOPSPIN 2.1>,
      <Start of raw data processing
       efp LB = 0.3 FT_mod = 6 PKNL = 1 PHC0 = 0 PHC1 = 0 SI = 128K 
       data hash MD5: 128K
       B9 29 43 32 F1 E2 98 CB 33 D4 46 5B D8 C5 60 64>)
(   3,<2013-07-05 22:53:14.154 -0700>,<Administrator>,<X>,<proc1d>,<TOPSPIN 2.1>,
      <pk PHC0 = -83.67737 PHC1 = 0 
       data hash MD5: 128K
       1E AD E1 7B 56 33 5A C1 C1 05 62 EA A9 04 4C 57>)
(   4,<2013-07-05 22:53:14.576 -0700>,<Administrator>,<X>,<proc1d>,<TOPSPIN 2.1>,
      <abs ABSG = 1 
       data hash MD5: 128K
       E8 7D E9 0D 19 BE EE DB 39 99 15 31 16 24 E3 F5>)
(   5,<2013-07-05 22:53:14.701 -0700>,<Administrator>,<X>,<proc1d>,<TOPSPIN 2.1>,
      <abs ABSG = 2 
       data hash MD5: 128K
       0F 30 83 0B 71 CA D0 FF CA 7C DE 32 32 82 09 40>)
(   6,<2013-07-05 22:53:14.811 -0700>,<Administrator>,<X>,<proc1d>,<TOPSPIN 2.1>,
      <abs ABSG = 3 
       data hash MD5: 128K
       EE 5A 33 51 CA B0 1C 45 F6 C3 05 FA 40 03 F5 4F>)
(   7,<2013-07-05 22:53:14.904 -0700>,<Administrator>,<X>,<proc1d>,<TOPSPIN 2.1>,
      <abs ABSG = 4 
       data hash MD5: 128K
       67 92 D4 12 09 B1 54 2F B5 E4 A7 15 DE E8 29 43>)
(   8,<2013-07-05 22:53:14.998 -0700>,<Administrator>,<X>,<proc1d>,<TOPSPIN 2.1>,
      <abs ABSG = 5 
       data hash MD5: 128K
       B2 BB F7 53 7A B0 6F A9 50 B3 DD 96 48 E0 2B 01>)
$$ ##END=
$$ 
$$ $$ hash MD5
$$ $$ C1 D3 E8 22 36 78 D0 25 EB 9C A3 FE F9 68 CD 33
##$RELAX= 
##$RELAX= 
##$RELAX= 
##$RELAX= 
##$RELAX= 
##$RELAX= 
##$RELAX= 
##$RELAX= 
$$ Bruker specific parameters
$$ --------------------------
##$DU= <E:\>
##$EXPNO= 12
$$ [...]
150 150 150 150 150 150 150 150
##$TP07= 0
##$TPNAME0= <>
##$TPNAME1= <>
##$TPNAME2= <>
##$TPNAME3= <>
##$TPNAME4= <>
##$TPNAME5= <>
##$TPNAME6= <>
##$TPNAME7= <>
##$TPOAL= (0..7)
0.5 0.5 0.5 0.5 0.5 0.5 0.5 0.5
##$TPOFFS= (0..7)
0 0 0 0 0 0 0 0
##$TUNHIN= 0
##$TUNHOUT= 0
##$TUNXOUT= 0
##$USERA1= <user>
##$USERA2= <user>
##$USERA3= <user>
##$USERA4= <user>
##$USERA5= <user>
##$V9= 5
##$VALIST= <valist>
##$VCLIST= <CCCCCCCCCCCCCCC>
##$VD= 0
##$VDLIST= <DDDDDDDDDDDDDDD>
##$VPLIST= <PPPPPPPPPPPPPPP>
##$VTLIST= <TTTTTTTTTTTTTTT>
##$WBST= 1024
##$WBSW= 4
##$XGAIN= (0..3)
0 0 0 0
##$XL= 0
##$YL= 0
##$YMAX_a= 6477215
##$YMIN_a= -12696518
##$ZGOPTNS= <>
##$ZL1= 120
##$ZL2= 120
##$ZL3= 120
##$ZL4= 120
##$ABSF1= 14.9609
##$ABSF2= -5.597281
##$ABSG= 5
##$ABSL= 3
##$ALPHA= 0
##$AQORDER= 0
##$ASSFAC= 0
##$ASSFACI= 0
##$ASSFACX= 0
##$ASSWID= 0
##$AUNMP= <proc_prof1d_extract.lims>
##$AXLEFT= 0
##$AXNAME= <>
##$AXNUC= <1H>
##$AXRIGHT= 0
##$AXTYPE= 0
##$AXUNIT= <>
##$AZFE= 0.1
##$AZFW= 0.1
##$BCFW= 0
##$BC_mod= 0
##$BYTORDP= 0
##$COROFFS= 0
##$CY= 15
##$DATMOD= 1
##$DC= 0
##$DFILT= <>
##$DTYPP= 0
##$F1P= 0
##$F2P= 0
##$FCOR= 0.5
##$FTSIZE= 131072
##$FT_mod= 6
##$GAMMA= 0
##$GB= 0
##$INTBC= 1
##$INTSCL= 1
##$ISEN= 128
##$LB= 0.3
##$LEV0= 0
##$LPBIN= 0
##$MAXI= 10000
##$MC2= 0
##$MEAN= 0
##$ME_mod= 0
##$MI= 0
##$NCOEF= 0
##$NC_proc= -2
##$NLEV= 6
##$NOISF1= 0
##$NOISF2= 0
##$NSP= 0
##$NTH_PI= 0
##$NZP= 0
##$OFFSET= 14.9609
##$PC= 1
##$PHC0= -83.67737
##$PHC1= 0
##$PH_mod= 1
##$PKNL= yes
##$PPARMOD= 0
##$PPDIAG= 0
##$PPIPTYP= 0
##$PPMPNUM= 2147483647
##$PPRESOL= 1
##$PSCAL= 4
##$PSIGN= 0
##$PYNMP= <proc.py>
##$REVERSE= no
##$SF= 400.020009677908
##$SI= 131072
##$SIGF1= 0
##$SIGF2= 0
##$SINO= 400
##$SIOLD= 131072
##$SPECTYP= <>
##$SREGLST= <1H.CDCl3>
##$SSB= 0
##$STSI= 131072
##$STSR= 0
##$SW_p= 8223.68421052631
##$SYMM= 0
##$S_DEV= 0
##$TDeff= 65536
##$TDoff= 0
##$TI= <>
##$TILT= no
##$TM1= 0
##$TM2= 0
##$TOPLEV= 0
##$USERP1= <user>
##$USERP2= <user>
##$USERP3= <user>
##$USERP4= <user>
##$USERP5= <user>
##$WDW= 1
##$XDIM= 131072
##$YMAX_p= 423904856
##$YMIN_p= -12885
##$CURPLOT= <Network HP LaserJet P1505>
##$CURPRIN= <$Network HP LaserJet P1505>
##$DFORMAT= <normdp>
##$LAYOUT= <+/1D_H.xwp>
##$LFORMAT= <normlp>
##$PFORMAT= <normpl>
##$SURQMSG= 1
$$ End of Bruker specific parameters
$$ ---------------------------------
##NTUPLES= NMR SPECTRUM
##VAR_NAME=  FREQUENCY,     SPECTRUM/REAL,   SPECTRUM/IMAG
##SYMBOL=    X,             R,               I
##VAR_TYPE=  INDEPENDENT,   DEPENDENT,       DEPENDENT
##VAR_FORM=  AFFN,          ASDF,            ASDF
##VAR_DIM=   131072,        131072,          131072
##UNITS=     HZ,            ARBITRARY UNITS, ARBITRARY UNITS
##FACTOR=    0.0627417313425164, 1,          1
##FIRST=     8223.62146879497, 1428,         -56273
##LAST=      0,             3604,            -56598
##MIN=       0,             -12885,          0
##MAX=       8223.62146879497, 423904856,    0
$$ Real data points
##PAGE= N=1
##DATA TABLE= (X++(R..R)), XYDATA
$$ [...]
65205 134469 135033 135341 135433 135273 134664 133815 133514 134281 135624 136547 136647 136367 136240 136275 136169 135884 135784 136254 137309
65186 137309 138649 139993 141248 142340 143083 143393 143476 143634 143977 144461 145050 145618 145830 145456 144718 144047 143587 143222
65168 143222 142996 143169 143918 145374 147792 151226 155038 158283 160644 162518 164191 165519 166589 167991 170072
65153 170072 172458 174730 177095 179964 183308 186965 191306 197029 204459 213438 223725 235099 247229
65140 247229 259815 272696 285523 297583 308368 318081 327144 335442 342590 348808 354871 361021 366327
65127 366327 369332 369204 366327 362037 357701 353770 349664 344632 338466 331223 322733 312908 302268 291585
65113 291585 281149 270881 260950 251550 242244 232352 222067 212429 204012 196489 189782 184649 181399
65100 181399 178798 175269 170870 167086 164703 162833 160320 157325 154999 154036 154145 154712 155457 156365 157468
65085 157468 158858 160654 162701 164480 165499 165692 165290 164430 163171 161792 160701 160043 159652 159480 159651 159966
65069 159966 159788 158775 157430 156574 156411 156504 156502 156463 156489 156520 156544 156686 156976 157292 157620 158090 158691 159186 159434 159583
65049 159583 159847 160242 160635 160893 160876 160475 159753 158970 158331 157716 156682 154807 152124 149304 147219 146192 145757
65032 145757 145217 144290 143082 141708 140211 138696 137229 135791 134537 133855 133849 134025 133989 134184 135356 137406 139419
65015 139419 140813 141783 142596 143208 143747 144641 145917 147051 147927 149255 151529 154122 156073 157352 158675 160403
64999 160403 162294 164074 165546 166262 165832 164615 163503 162975 162840 162926 163439 164537 166119 168198 170967 174249
64983 174249 177350 179777 181784 183851 185895 187297 187575 186780 185347 183760 182213 180488 178310 175866 173673
64968 173673 171775 169472 166223 162556 159654 158119 157522 157042 156153 154690 152757 150782 149325 148585 148216
64953 148216 147765 147149 146607 146419 146780 147642 148480 148474 147241 145338 143795 143215 143497 144233 144997 145360 145098 144503
64935 144503 144110 143972 143549 142558 141594 141495 142239 142923 142908 142664 143320 145494 148665 151562 153032 152716 151125 149226
64917 149226 147868 147420 147846 148994 150724 152717 154364 155150 155217 155319 156066 157460 159302 161725 164917 168632
64901 168632 172542 176959 182513 189062 195611 201604 207579 214116 220745 226572 231485 235929 239764 242266
64887 242266 243296 243612 243798 243585 242605 241178 239839 238425 236177 232623 228015 223021 218324 214470 211691
64872 211691 209704 207861 205701 203395 201555 200580 200225 199931 199520 199318 199486 199512 198666 196752 194048 190682
64856 190682 186592 182104 177983 174634 171619 168302 164732 161544 159155 157374 155813 154387 153304 152670
64842 152670 152252 151704 151031 150697 151120 152113 153034 153412 153282 152907 152457 152039 151788 151846 152355 153535 155562 158273
64824 158273 161155 163721 165861 167803 169899 172449 175568 179167 183163 187686 192935 198885 205397 212559
64810 212559 220577 229222 237671 245085 251129 255834 259146 260794 260488 258194 254305 249567 244646 239718
64796 239718 234607 229227 223683 218032 212339 206943 202281 198399 195060 192347 190672 190020 189702 189151 188523
64781 188523 188233 188350 188809 189789 191388 193244 194998 196891 199406 202554 206071 210178 215482 222056 229140
64766 229140 235943 242328 248551 254708 260676 266351 271640 276371 280440 284060 287710 291745 296017 299907
64752 299907 302807 304576 305423 305401 304189 301482 297337 291987 285497 277855 269288 260279 251337 242870 235169
64737 235169 228340 222339 217250 213404 211060 210046 209835 209846 209603 208863 207837 207090 206924 207030 207018 207110 207944
64720 207944 209814 212491 215688 219284 223080 226798 230450 234322 238418 242158 244780 245849 245311 243364
64706 243364 240415 236897 232896 228157 222603 216648 210807 205224 199900 195216 191792 189789 188708 187977
64692 187977 187418 186993 186487 185860 185696 186764 189052 191655 193751 195348 196961 199050 202042 206432 212303
64677 212303 219034 225976 233180 240937 248891 256366 263371 270379 277014 281912 284179 284125 282184 277990 271302
64662 271302 263130 255085 247941 241592 236078 231804 228840 226790 225382 224604 224255 223968 223750 224040 225179
64647 225179 227203 230074 233631 237369 240835 244362 248952 255272 263139 271955 281218 290529 299591 308419
64633 308419 317208 325797 333467 339375 343006 344268 343456 341078 337448 332474 326060 318531 310266 301172
64619 301172 291120 280753 271126 262488 254140 245702 237850 231458 226577 222674 219354 216454 213775 211214
64605 211214 208925 207049 205509 204324 203855 204400 205808 207786 210359 213710 217718 221988 226265 230653 235441
64590 235441 240812 246508 251811 256144 259784 263618 268076 272719 277054 281239 285581 289772 293105 295268
64576 295268 296447 296839 296487 295540 294294 292894 291143 288512 284262 277916 269929 261575 253793 246343 238523
64561 238523 230503 223362 217893 213853 210418 206934 203146 199203 195650 193121 191810 191381 191423 191778 192429
64546 192429 193388 194768 196664 198853 200840 202334 203445 204316 204829 204811 204259 203179 201444 199074 196496 194293
64530 194293 192771 191909 191553 191418 191097 190439 189858 189960 190818 191885 192663 193190 193767 194523 195456 196696 198408
64513 198408 200511 202675 204614 206333 208187 210755 214469 219205 224393 229707 235427 241910 248998 256325
64499 256325 263917 271842 279348 285049 288211 289340 289242 288097 285759 282411 278368 273625 268225 262818 258294
64484 258294 254949 252431 250363 248559 246774 244755 242488 240006 237141 233896 230802 228283 225867 222782
64470 222782 219294 216608 215294 214676 214087 213956 215088 217431 220187 222820 225416 228196 231101 233725 235447
64455 235447 235835 235172 234346 233998 233992 233884 233548 233061 232421 231774 231670 232692 234956 238273 242503 247370 252269
64438 252269 256782 261348 266961 274155 282583 291572 300862 310858 322433 336454 353260 372609 394274
64425 394274 418644 446733 479874 519541 567111 623454 688939 763995 849145 943897 1045735
64414 1045735 1150714 1255065 1355991 1451360 1539505 1619384 1690197 1750469 1797863 1830161 1846217
64403 1846217 1845943 1829975 1799665 1756937 1703421 1639601 1565117 1480027 1385794 1285280 1182082
64392 1182082 1079866 981912 890771 807944 733751 667711 609379 558916 516673 482117 453441
64381 453441 428512 406186 386478 369580 355140 342638 331945 323040 315436 308457 302038 296563
64369 296563 291736 286318 279464 271830 264743 258668 253172 248082 243810 240506 237666 234831 232115 229874
64355 229874 228414 228152 229514 232411 236280 240768 245829 251090 255850 259942 263812 267317 269226 268578 265932
64340 265932 262601 259124 255224 250845 246424 242320 238701 235903 234273 233696 233708 233993 234466 235215 236721 239692
64324 239692 244060 248531 251814 253973 255869 257655 258734 258933 258715 258272 257388 256256 255412 254597 252637 248898
64308 248898 244112 239336 234749 229923 224796 219861 215701 212636 210529 208727 206583 204199 202320 201399
64294 201399 201192 201366 201923 202819 203744 204634 205923 207985 210719 213978 217931 222703 228018 233544 239233 245086
64278 245086 250988 257066 263762 271147 278545 285202 291009 296211 300750 304281 306516 307192 306048 303279
64264 303279 299830 296803 294697 293429 292786 292507 292214 291712 291144 290475 289015 285930 281154 275439 269559 263735
64248 263735 257762 251403 244710 238179 232438 227677 223562 219911 217155 215844 215942 216879 218019 218797 218797 218175
64232 218175 217812 218510 220133 221888 223260 224169 224453 223875 222777 222125 222585 223848 225049 225583 225365 224504 222981
64215 222981 220647 217503 213952 210689 208228 206620 205675 205265 205300 205663 206397 207744 209693 211662 212971 213545
64199 213545 213924 214688 216116 218280 221123 224538 228676 234109 241373 250465 261008 272762 285584 298995
64185 298995 312211 324600 335687 344723 350696 352899 351234 345946 337482 326708 314861 303036 291838
64172 291838 281503 272023 263128 254537 246432 239393 233729 229122 225115 221688 219088 217260 215730 214054
64158 214054 212291 211031 210936 212121 214003 215887 217609 219442 221510 223669 225909 228468 231410 234448 237284
64143 237284 239779 241646 242417 242019 241037 240086 239163 237950 236509 235237 234298 233554 233011 232904 233247 233707 234046
64126 234046 234468 235424 237289 240226 244062 248196 252006 255635 260121 266384 274231 282667 291120 299960 309701
64111 309701 320031 329795 337772 343394 346978 349495 351907 354447 356576 357902 359041 361357 365863 372560
64097 372560 380659 389046 396536 402277 406297 409421 412296 414563 415223 413751 410620 406721 402433 397342
64083 397342 390795 382751 373999 365459 357363 349349 341310 333791 327414 322255 317980 314299 310998 307791
64069 307791 304526 301371 298568 296193 294415 293653 294031 294870 295281 295187 295309 296165 297625 299416 301514 303879
64053 303879 306377 309222 313078 318386 324901 332141 340047 348939 359103 370646 383521 397397 411745
64040 411745 426281 441099 456066 470308 482659 492504 499827 504543 506263 504800 500622 494592 487485
64027 487485 479866 472237 465034 458443 452392 446819 441848 437577 433734 429731 425152 419930 413940 406733
64013 406733 398110 388793 380002 372263 365092 358016 351415 346021 341966 338793 336191 334269 333112 332456
63999 332456 331907 331326 331004 331529 333312 336086 339011 341536 344035 347380 352020 357716 364004 370521 377003
63984 377003 383398 390067 397539 405954 414974 424271 433842 443808 454303 465643 478275 492228 506882
63971 506882 521551 536196 551406 567805 585703 605200 626375 649317 674133 701003 730245
63960 730245 762398 798306 839070 885786 939335 1000506 1070440 1151001 1244703 1354140 1481325
63949 1481325 1627550 1793818 1981083 2189792 2419311 2668108 2934462 3216523 3511601
63940 3511601 3815785 4124376 4432183 4733092 5019821 5284831 5521547 5724558 5889076
63931 5889076 6011069 6088100 6119457 6105115 6044921 5939139 5789575 5599930 5375349 5122060
63921 5122060 4847300 4558834 4263863 3968200 3676402 3392562 3120688 2864241 2625492
63912 2625492 2405578 2205140 2024594 1863687 1721151 1595236 1484478 1387692 1303391 1229809
63902 1229809 1165715 1110756 1064680 1026438 994253 966264 940814 916436 892106 867577 843170
63891 843170 819258 796111 774059 753378 734080 716202 700310 687229 677153 669456 663701 660440
63879 660440 660678 664762 672212 682487 695454 711068 728979 748707 770024 792982 817612 843689
63867 843689 870744 898241 925707 952712 978720 1003048 1025018 1044170 1060311 1073483 1083858
63856 1083858 1091431 1095604 1095207 1089332 1078256 1063347 1045972 1026657 1005345 982127 957347 931126
63844 931126 903239 873616 842741 811344 779831 748163 716221 684148 652388 621503 591952
63833 591952 563954 537611 513118 490677 470083 450697 432177 415140 400641 388896 378902 369414
63821 369414 359947 350639 341625 332980 324993 317973 311846 306315 301352 297129 293510 290092 286762 283788
63807 283788 281258 278904 276654 274904 273872 273025 271522 269037 265910 262721 260053 258348 257481 256546 254595
63792 254595 251679 248772 246537 244554 241968 238620 235219 232563 230900 229993 229487 229090 228580 227870 227077 226406
63776 226406 225928 225485 224867 224060 223321 223009 223326 224120 224969 225497 225655 225603 225352 224707 223665 222618 221958 221605
63758 221605 221226 220762 220478 220493 220651 220837 221150 221673 222372 223299 224576 226064 227360 228295 229200 230520 232392
63741 232392 234727 237406 240218 242863 245240 247477 249531 251044 251822 252235 252924 254341 256648 259635 262555
63726 262555 264606 265965 267875 271216 275447 279557 283560 288205 293447 298138 301279 302807 303075 302352 300994
63711 300994 299410 297613 295413 293176 291632 290737 289548 287671 286063 285803 286710 287902 289139 290745 292599
63696 292599 294216 295750 298080 301665 305943 310066 313701 316915 319683 321788 322975 323063 322119 320608 319080
63681 319080 317672 316177 314639 313487 312955 312706 312322 311839 311549 311454 311280 310933 310643 310735 311540 313404 316352
63664 316352 319616 321912 322553 322084 321487 320889 319464 316582 312578 308203 303787 299289 294857 290793 287127
63649 287127 283720 280816 278999 278461 278704 279139 279594 280120 280720 281558 283101 285650 288911 292348 295738 299139
63633 299139 302541 305966 309754 314352 319840 325977 332641 339904 347749 356108 365153 375214 386384 398577
63619 398577 412025 427305 444677 463699 483723 504556 526468 549735 574441 600610 628304
63608 628304 657502 687827 718285 747303 773227 794924 811885 823856 830624 832272 829503 823578
63596 823578 815976 807912 799902 791667 782668 772743 761957 749873 735399 717650 696749 673647 649454
63583 649454 625168 601699 579653 559151 540139 522825 507569 494495 483458 474299 466903 461179
63571 461179 457390 456290 458386 463007 468631 474310 480386 487671 496311 505739 515373 524959 534485 544132
63557 544132 554286 565396 577900 592340 609271 628838 650818 675418 703723 736756 774054
63546 774054 813513 852520 888759 920038 944161 959561 965996 964478 956778 945011 931252 917092
63534 917092 903601 891685 882064 874587 867887 860119 849950 836607 819370 797648 771695 742766
63522 742766 712356 681469 650673 620501 591492 563985 538127 514091 492161 472538 455178
63511 455178 439864 426471 415035 405457 397170 389267 381134 372915 365314 358988 354087 350226 346802
63498 346802 343480 340502 338356 337105 336217 335212 334185 333474 333075 332783 332753 333492 335274 337898 340979 344176
63482 344176 347212 350040 353025 356509 360198 363417 366071 368828 372093 375312 377633 378854 379246 378749 376945
63467 376945 373781 369869 366005 362608 359585 356409 352393 347282 341795 337345 335037 334920 336137 337627
63453 337627 338760 339600 340818 343270 347503 353505 360754 368507 376259 384184 393082 403671 415943 429413
63439 429413 444009 460505 479993 503048 529349 557758 586502 613525 637144 656623 672110
63428 672110 684064 692908 699318 704593 710468 718520 729891 745466 765873 791057 820143 852135
63416 852135 886575 923040 959970 994507 1023765 1046001 1060547 1067306 1066917 1061070 1051875 1040815
63404 1040815 1028674 1016271 1004496 993366 981650 967833 951115 931186 907591 880049 849269
63393 849269 816809 783995 751383 719366 688724 660198 633854 609301 586456 565774 547781
63382 547781 532658 520280 510396 502723 497093 493573 492268 493024 495557 499886 506330 514931 525190 536647
63368 536647 549460 564087 580555 598418 617433 637910 660344 684986 711863 740975 772280
63357 772280 805658 840899 877534 914477 949973 982061 1009065 1029721 1043178 1049230 1048575 1042667
63345 1042667 1033244 1021904 1009887 997990 986542 975433 964071 951304 935633 915880 891864
63334 891864 864427 834743 803655 771712 739725 709000 680824 655779 633758 614635 598728
63323 598728 586576 578507 574380 573306 573286 571493 565555 554836 540387 523800 506242 488366 470634
63310 470634 453615 438138 425057 414595 406091 398718 392324 387119 382805 378709 374801 371757 369761
63297 369761 367918 365323 362206 359522 357796 356769 355823 354304 351735 348274 344754 341902 339681 337713
63283 337713 335964 334576 333354 332046 330911 330383 330257 329844 328898 327856 327172 326917 327061 327548 328037 328141 328103
63266 328103 328720 330367 332590 334894 337429 340529 343961 347054 349406 351163 352824 355069 358510 363214
63252 363214 368522 373612 378257 382880 387987 393784 400204 407052 414116 421416 429425 438879 450313 463844
63238 463844 479394 496923 516391 537671 560698 585586 612351 640466 668961 697122 724975
63227 724975 752862 780748 808202 834980 861213 887007 912332 937421 962783 988514 1014076
63216 1014076 1039179 1064479 1090718 1117276 1142135 1163171 1179006 1188747 1191736 1187898 1177770 1161770
63204 1161770 1139720 1111476 1077855 1040666 1001914 963115 925171 888643 854130 822420 794246
63193 794246 769914 749354 732485 719308 709675 703310 700164 700433 704094 710619 719284 729555 741192
63180 741192 754234 768945 785362 802723 819765 835907 851840 868653 886605 904996 922936
63169 922936 939756 954867 967775 978329 986594 992351 995022 994160 989771 981941 970354 954415 933851
63156 933851 909087 881096 851025 819977 788995 758971 730442 703571 678441 655304 634428
63145 634428 615780 599077 584136 571015 559807 550469 542814 536474 530864 525513 520558 516617 514032
63132 514032 512413 511058 509631 508273 507315 507123 508030 510121 513126 516718 520850 525641 530998 536577 542053
63117 542053 547227 551943 556113 559858 563463 567155 570965 574761 578246 581013 582813 583828 584533 585226 585788
63102 585788 585914 585457 584482 583102 581373 579327 577086 574961 573398 572670 572563 572517 572246 572126 572708 573866 574791
63085 574791 575015 575141 576213 578566 581728 585329 589495 594232 599112 604004 609568 616408 624068 631577 638876
63070 638876 647027 656922 668397 680747 693585 706986 721285 737064 754973 775262 797732 822375
63058 822375 849767 880562 914869 952461 993450 1038465 1088200 1142846 1201760 1263637 1327299
63047 1327299 1392484 1459558 1528328 1597571 1666023 1733373 1799860 1865252 1928886 1990542 2050655
63036 2050655 2109662 2167740 2225342 2283273 2341661 2398996 2452552 2499779 2539072 2569282 2588825
63025 2588825 2595585 2587793 2564894 2527494 2476647 2413518 2339761 2257829 2170514 2080272 1989193 1899531
63013 1899531 1813827 1734304 1662244 1598004 1541505 1492638 1451403 1417916 1392407 1375049 1365622
63002 1365622 1363345 1367167 1376285 1390282 1408704 1430754 1455566 1482563 1511195 1540541 1569717 1598734
62990 1598734 1628452 1659398 1690918 1721681 1750672 1777422 1801560 1822508 1839489 1851513 1857428
62979 1857428 1856208 1847158 1829761 1803595 1768729 1726112 1677330 1623993 1567477 1509055 1449982 1391427
62967 1391427 1334445 1279923 1228371 1179830 1134136 1091248 1051248 1014237 980354 949669 921791
62956 921791 895735 870533 845953 822468 800533 780070 760604 741707 723284 705579 688927
62945 688927 673461 659092 645675 633028 620866 609083 598132 588670 580676 573324 565985 558936
62933 558936 552759 547559 543268 540201 538564 537613 536162 533965 531912 530736 530166 529502 528442 526983 525113
62918 525113 523041 521351 520373 519584 518080 515565 512498 509356 506184 502963 499949 497331 494749 491637 488035
62903 488035 484678 482075 479858 477421 474961 473393 473198 473854 474516 474822 474824 474587 474235 474107 474455 475116 475714
62886 475714 476027 476024 475806 475701 476041 476595 476621 475855 475004 474808 474993 474789 474133 473669 473713 473914 473882 473531 472820 471758
62866 471758 470685 469935 469197 467883 466215 465249 465598 466648 467376 467470 467417 467836 468931 470266 470964 470502 469404
62849 469404 468736 468878 469266 469309 468963 468288 467136 465565 463978 462542 461078 459730 459044 458969 458550 457216 455729
62832 455729 455087 455010 454454 453307 452662 453427 455404 457834 460194 462321 464293 466371 468792 471498 474321 477315
62816 477315 480567 483790 486595 489165 492162 495914 500129 504605 509765 516197 523893 532261 540781 549425
62802 549425 558447 567877 577341 586508 595703 605854 617655 630942 645060 659663 674994 691682
62790 691682 710687 733195 760002 791013 825870 865121 910233 962267 1021030 1085754 1156251
62779 1156251 1233065 1316859 1407942 1506072 1610231 1718699 1829578 1941119 2051290 2157295
62769 2157295 2255951 2344398 2420057 2480119 2521835 2543591 2545373 2528073 2492764 2440830 2374268
62758 2374268 2295395 2206447 2109789 2008203 1904436 1800522 1697890 1597942 1502035 1410932
62748 1410932 1324839 1244105 1169393 1101036 1038739 982129 931065 885097 843192 804574 769523
62737 769523 738790 712435 689727 669937 652587 637006 622373 608408 595597 584581 575728 569287
62725 569287 565375 563488 562399 560906 558579 555806 553437 552501 553833 557559 563047 569508 576607 584601
62711 584601 594214 606361 621505 639145 658341 678987 702167 729037 759795 794084 831956 873935
62699 873935 920296 970790 1024999 1082708 1144051 1209476 1279228 1352386 1426510 1498596 1566333
62688 1566333 1628244 1682911 1728626 1763708 1786780 1796781 1793247 1776677 1748192 1708766 1659153
62677 1659153 1600646 1535434 1465947 1394197 1321936 1250979 1182771 1117712 1055421 995841 939854
62666 939854 888619 842521 800967 763126 728620 697431 669455 644414 622174 602816 586259
62655 586259 571930 558947 546599 534650 523274 512769 503234 494470 486199 478395 471277 465006 459507
62642 459507 454632 450403 447072 445061 444715 445869 447633 448887 449082 448425 447274 445691 443680 441477 439348
62627 439348 437335 435438 433831 432670 431867 431353 431378 432298 434174 436755 439718 442728 445508 448173 451356
62612 451356 455648 460940 466588 472270 478412 485745 494636 504823 515760 527267 539988 555048 573143
62599 573143 594130 617739 644487 675492 711404 751817 795770 842568 892020 943967 997622
62588 997622 1051388 1103433 1152500 1197898 1238585 1272585 1297717 1312728 1317437 1312021 1296771 1272566
62576 1272566 1241079 1204173 1163206 1118965 1072061 1023308 973852 924956 877589 832360 789962
62565 789962 751364 717106 686562 658475 632340 608824 588709 571871 557474 544719 533039
62554 533039 521939 511217 501285 492843 486095 480500 475424 470862 467381 465352 464425 463851 463250 462824 462798
62539 462798 462936 462797 462240 461314 459877 457813 455666 454521 454963 456491 458204 459883 462139 465737 471084
62524 471084 478287 487320 498086 510469 524429 539962 557068 575916 597004 620969 648173 678630
62512 678630 712299 749153 788810 830343 872753 915519 958340 1000297 1039604 1074393 1103602
62501 1103602 1126921 1144103 1154602 1157887 1153963 1143733 1129108 1112588 1096375 1081745 1069337 1059833
62489 1059833 1053975 1052094 1054218 1060720 1072375 1089563 1111802 1138220 1167974 1199914 1232257 1262992
62477 1262992 1290307 1312461 1327845 1335730 1336541 1330701 1317400 1295145 1263408 1223207 1176313 1124659
62465 1124659 1070458 1015912 962296 909738 858237 808549 761847 719046 680851 648062 621050
62454 621050 598893 579587 561579 545046 531441 521729 515303 510761 507489 505994 506720 509152 512405
62441 512405 516236 520977 526753 533304 540369 547680 554664 560707 565635 569429 571492 570886 567418 561896
62427 561896 555075 546877 536991 525800 514318 503411 493415 484290 475863 467979 460638 453986 448177
62414 448177 443295 439294 435793 432063 427626 422868 418731 415756 413763 412394 411434 410513 409116 407266 405783
62399 405783 405513 406543 408380 410564 412813 414880 416657 418339 420238 422551 425372 428679 432161 435329
62385 435329 438035 440712 444002 448318 453790 460289 467439 474960 483101 492232 501926 511068 519236 527354
62371 527354 536509 546669 557226 568346 580980 595743 612560 631430 652866 677483 705694 737913
62359 737913 774572 815801 861429 911385 965578 1023152 1082189 1140318 1195428 1245772 1289840
62348 1289840 1326468 1354984 1375096 1386853 1390797 1387839 1378654 1363300 1341647 1314156 1282086 1246952
62336 1246952 1209898 1171613 1132676 1093924 1056445 1021256 988951 959575 932771 908075 885199
62325 885199 864082 844610 826243 808048 789188 769343 748611 727145 705110 682938 661423
62314 661423 641315 622810 605516 589002 573342 559042 546502 535782 526910 520045 515061 511219
62302 511219 507708 504443 501932 500396 499441 498674 498216 498401 499333 500928 503075 505527 507857 509831 511698
62287 511698 513936 516796 520114 523363 525928 527701 529480 532348 536436 540692 544122 546910 550020 554066
62273 554066 558942 564229 569535 574684 580025 586503 595074 606078 619323 634662 652347 673108 698002
62260 698002 727821 762454 801282 844474 893263 948350 1008387 1070648 1132810 1193479 1251312
62249 1251312 1304511 1351233 1389925 1419342 1438864 1448844 1450118 1443167 1428138 1405459 1375887 1340098
62237 1340098 1298867 1253405 1204825 1153551 1100223 1047019 996908 951341 909744 871603 837850
62226 837850 809573 786423 767172 751127 738046 727305 718115 710208 703396 696766 689253 680912 672691
62213 672691 664953 657023 648278 638920 629434 619957 610510 601372 592862 585040 577901 571602 566352 562278
62199 562278 559531 558266 558333 559217 560460 562063 564354 567585 571732 576643 582299 588888 596517 604884 613496
62184 613496 622295 631732 641945 652191 661553 669942 677889 685516 692384 698457 704590 711865 720970 732467
62170 732467 747161 765739 788329 814758 845009 879163 917067 958244 1001788 1046057 1088806
62159 1088806 1128011 1162464 1191358 1213741 1228903 1237056 1239110 1235809 1227473 1214405 1196967 1175271
62147 1175271 1149314 1119576 1087039 1052594 1016950 981240 947126 915912 887898 862920 841108
62136 841108 822734 807615 795219 785261 777720 772261 768019 764154 760411 757051 754399 752588 751725 752158
62122 752158 754424 758851 765307 773534 783611 795713 809290 822853 834730 843832 849630 851953 851297
62109 851297 849036 846751 845230 844273 843169 840995 836735 829796 820531 809908 798701 787416 776926
62096 776926 768546 763223 760991 761385 763965 768262 773625 779560 786055 793368 801541 810269 819082 827587
62082 827587 835712 843825 852461 861912 872304 884035 897759 913726 931421 950063 969305 989284
62070 989284 1010223 1032211 1055239 1079253 1104191 1130018 1156610 1183647 1210739 1237492 1263119
62059 1263119 1286136 1304997 1319128 1328839 1334097 1334052 1328165 1317249 1302803 1285581 1265295 1241500
62047 1241500 1214160 1183412 1149305 1111995 1072048 1030503 988689 947789 908392 870518 834183
62036 834183 799747 767644 738079 711139 686833 664755 644104 624428 606112 589774 575459
62025 575459 562801 551639 541930 533253 524946 516712 508676 500921 493362 486023 479063 472610 466896 462330
62011 462330 459000 456307 453632 451236 449914 449924 450963 453137 457085 462868 469472 475849 481886 487959 494067
61996 494067 499965 505805 511926 518108 523538 527624 530406 532015 532070 529969 525707 520112 514064 507663 500491
61981 500491 492638 485005 478331 472322 466186 459769 453676 448345 443578 439037 434728 430859 427575 425031
61967 425031 423351 422303 421206 419388 416701 413565 410658 408538 407349 406885 406966 407616 408691 409635 410028 410232
61951 410232 411131 413337 417055 422476 429600 437708 445731 453406 461546 471002 481919 494201 508013 523388
61937 523388 539797 556648 573876 591618 609506 626622 642050 655270 666374 676154 685582 694749
61925 694749 702433 707060 708026 705870 701399 695016 686874 677448 667843 659449 653038 648293 644626 642470
61911 642470 643207 647589 654832 663665 673719 685326 698356 711948 725166 737205 747043 753677 756870
61898 756870 757187 755128 750674 743827 735128 725295 714661 703264 691375 679628 668644 658714 649841
61885 649841 641922 634753 627887 620692 612690 603846 594403 584591 574657 565095 556431 548722 541597 534952
61871 534952 529262 525030 522189 520314 519146 518655 518846 519870 522143 526016 531444 538262 546645 556930
61857 556930 569103 582790 597792 614381 633113 654511 678746 705311 733122 761274 789678
61846 789678 818633 847823 876003 901684 923820 941843 955384 964147 967924 966711 960945 951562
61834 951562 939672 926283 912481 899596 888712 880141 873842 870370 870818 875632 883948 894366 905887
61821 905887 917682 928377 936283 940325 940220 935632 925701 909826 888717 864229 838124 811190 783589
61808 783589 755756 728655 703227 679809 658228 638308 620147 603901 589451 576462 564808
61797 564808 554753 546521 539740 533626 527813 522683 518688 515590 512768 510031 507698 505907 504341 502694
61783 502694 500981 499280 497587 496097 495188 494860 494558 493857 493025 492533 492279 491740 490795 490018 490182 491612 493949
61766 493949 496343 498037 499039 500139 502146 505221 509068 513478 518411 523763 529356 535021 540495 545408
61752 545408 549547 552841 554882 554937 552877 549671 546367 542847 538252 532417 526105 519948 513973 508331 503613
61737 503613 500065 497162 494417 492111 490711 490014 489399 488676 488140 487962 487987 488138 488651 489866 491979 494880
61721 494880 498023 500671 502567 504318 506759 509984 513247 515796 517495 518673 519692 520763 521835 522480
61707 522480 522086 520378 517619 514236 510442 506431 502677 499650 497244 494798 491767 488198 484513 481139
61693 481139 478404 476496 475199 473872 472008 469755 467594 465581 463258 460341 457102 453897 450613 446881
61679 446881 442675 438392 434415 430806 427428 424234 421379 419137 417650 416675 415579 413757 411181 408506
61665 408506 406498 405250 404066 402296 400294 399189 399588 400840 401876 402463 403159 404240 405288 405818 405714
61650 405714 405011 403898 403179 404100 407223 411828 416738 421362 425635 429464 432789 435880 438948 441604 443098
61635 443098 443026 441477 438751 435342 431964 429137 426815 424743 422882 421100 418751 415285 411172 407605 405249
61620 405249 403782 402658 401751 401119 400653 400146 399401 398223 396584 394763 392917 390634 387417 383523 379668
61605 379668 375878 371392 365944 360423 355761 351757 347581 343072 338917 335669 333121 330655 327829 324583
61591 324583 321155 317910 315148 312967 311308 309980 308663 307096 305386 303946 302990 302219 301166 299676 297900
61576 297900 295988 294026 292198 290739 289693 288871 288132 287596 287452 287599 287590 287092 286319 285859 286036 286670 287497 288580
61558 288580 290084 291872 293613 295163 296597 297949 299166 300310 301552 303004 304680 306541 308398 309885
61544 309885 310712 310842 310318 309240 308164 308120 309782 312775 316186 319480 322445 324604 325485 325430 325360 325635 325782
61527 325782 325422 324776 324047 322972 321329 319373 317418 315466 313533 311890 310636 309461 308174 307117 306653
61512 306653 306634 306669 306616 306457 306003 305161 304244 303679 303568 303788 304284 305007 305763 306383 306822 306980 306793 306699 307543 309623
61492 309623 312187 314259 315632 316679 317572 318268 319000 320122 321529 322757 323644 324476 325474 326576 327713 328897
61476 328897 329969 330605 330663 330258 329486 328351 326994 325730 324767 324085 323663 323681 324385 325785 327444 328616 328812
61459 328812 328340 328091 328600 329505 330102 330152 329825 329122 327886 326400 325522 325938 327451 329152 330298 330964 331858
61442 331858 333505 335668 337719 339483 341474 344202 347575 351160 354727 358249 361555 364334 366456 368110
61428 368110 369704 371702 374327 377206 379557 380981 381941 383200 384972 386944 388893 390939 393243 395776
61414 395776 398282 400216 400875 400021 398328 396830 395880 394962 393543 391770 390188 389041 388057 386853 385404
61399 385404 384073 383120 382300 381151 379639 378179 376888 375288 373021 370494 368423 367021 366073 365523 365394
61384 365394 365338 364893 364232 364072 364772 366045 367645 369834 372928 376795 380944 384789 387763 389679 391208 393504
61368 393504 396980 400756 403635 405288 406189 406818 407445 408479 410308 412750 415179 417433 420268 424606 430518
61353 430518 437235 444062 451009 458415 466191 473628 479946 484886 488696 491743 494326 496820 499728 503340
61339 503340 507361 511049 513856 515948 517985 520379 522778 524343 524460 523106 520632 517433 513925 510593
61325 510593 507844 505804 504375 503462 503115 503503 504832 507179 510342 513949 517846 522358 528013 534987 542902
61310 542902 551213 559808 569252 580421 593819 609093 625162 640725 654722 666497 675747 682342
61298 682342 686088 686760 684466 679877 673866 666934 659115 650342 640641 630126 619096 608118 597668
61285 597668 587708 578011 568859 560979 554668 549432 544642 540211 536458 533714 532276 532356 533785 536029 538668
61270 538668 541632 544820 547892 550572 552919 555247 558170 562711 569642 578475 587733 596535 605284 614452
61256 614452 623513 631695 639038 645840 651558 655243 656832 657194 657042 656499 655615 654554 653381 652179 651214
61241 651214 650396 648948 646343 643290 640909 639165 637103 634482 632063 630226 628460 626613 625592 626265 628428
61226 628428 631350 634696 638408 642295 646253 650466 654988 659603 664402 669878 676067 682251 688033 694096
61212 694096 701163 708668 715210 720049 723457 725900 727649 729127 730830 732801 734814 737269 741288 747672
61198 747672 756215 766347 778001 791413 806346 822065 837918 853346 867223 877923 884632 888311
61186 888311 890770 892835 893976 893682 892442 890976 889123 886053 881248 874720 866534 856768 845875 834538
61172 834538 823078 811352 799219 786770 774159 761534 749067 736775 724403 711755 698958
61161 698958 686174 673455 661251 650575 642018 634956 628465 622748 618842 617149 617136 618379 620904 624413
61147 624413 628051 631036 632756 632231 628563 622168 614625 607005 599263 591502 584721 579742 576336 574017
61133 574017 572880 573040 574119 576000 579334 584521 590881 597653 605187 614302 625072 637201 651094 667463
61119 667463 686083 705943 726581 748430 771831 796495 821962 847932 873971 899423 923770
61108 923770 946789 968352 988383 1006936 1023981 1039046 1051197 1059351 1062686 1061107 1055367 1046266
61096 1046266 1033720 1017229 997391 976062 954618 932854 910119 886669 863135 839459 815384
61085 815384 791513 768884 747864 728278 710198 693668 678036 662640 648088 635892 626872 620592
61073 620592 616124 612551 608969 604999 601271 598625 596980 595780 595249 596163 598503 601443 604658 608597 613383
61058 613383 618536 624005 630495 638470 647652 657698 668587 680220 692541 706177 722013 739887
61046 739887 758656 777844 798303 820891 845384 871060 897553 924686 952302 980671 1010444
61035 1010444 1041881 1074750 1109065 1145147 1182863 1221873 1262747 1306596 1353182 1400621 1447533
61024 1447533 1494314 1541738 1589738 1638630 1690474 1748119 1813573 1888013 1972340 2066747 2170769
61013 2170769 2284925 2411729 2554603 2717473 2906926 3133712 3410963 3752569 4175067
61004 4175067 4699435 5348790 6146464 7120631 8310449 9762846 11518947 13596462 15965271
60995 15965271 18511108 21009980 23162281 24704067 25534273 25760445 25629260 25407752 25302687
60986 25302687 25433159 25809066 26297916 26632031 26504917 25716338 24260548 22297362 20049969
60977 20049969 17718560 15451216 13349019 11472297 9843724 8457845 7294947 6329729
60969 6329729 5533967 4879321 4341058 3898654 3533504 3228393 2969584 2747718 2556025
60960 2556025 2388625 2240754 2109398 1992861 1889999 1799927 1721797 1654512 1596893 1547947
60950 1547947 1506458 1470366 1437137 1404908 1373016 1341672 1311673 1284230 1260177 1239112 1219861
60939 1219861 1201969 1186199 1173327 1162947 1153883 1145500 1138271 1133149 1130571 1129992 1130281 1130630 1131065 1132008
60925 1132008 1133496 1135023 1136039 1136296 1135731 1134330 1132048 1128630 1123487 1116054 1106220 1094243 1080354 1064835
60911 1064835 1048339 1031674 1015184 998671 981934 965006 947914 930687 913746 897777 883075
60900 883075 869361 856376 844088 832113 819541 805914 792073 779415 768432 758423 748616 739122
60888 739122 730664 723686 717845 712216 705874 698393 689871 680553 670553 660040 649505 639596 630613
60875 630613 622258 614006 605697 597744 590704 584640 579057 573512 568081 563053 558413 553953 549761 546200
60861 546200 543501 541728 541005 541138 541046 539352 535828 531600 527584 523438 518650 513947 510703 509199 508317
60846 508317 506890 504605 501633 498146 494421 490805 487282 483447 479016 474030 468534 462538 456392 450706
60832 450706 445727 441234 437222 434230 432737 432637 433577 435411 438027 441021 443906 446405 448310 449390 449750
60817 449750 449984 450569 451292 451653 451642 451699 452035 452384 452418 452025 451214 450092 448972 448137 447415 446331 444825 443445
60799 443445 442555 441599 439546 436006 431630 427365 423658 420455 417657 415236 413019 410690 408079 405222 402120
60784 402120 398695 395012 391281 387478 383286 378635 374045 370150 367052 364476 362365 360932 360188 359854 359784
60769 359784 360169 361253 363114 365721 368927 372354 375568 378414 381022 383527 386035 388808 392128 395974
60755 395974 400087 404279 408339 411783 414207 415919 417699 419882 422111 424021 425592 426719 427096 426756 426138
60740 426138 425298 423629 420685 416765 412247 407001 400987 394893 389458 384518 379439 374257 369652 365949
60726 365949 362787 359763 356765 353648 350209 346637 343490 341090 339251 337744 336671 336170 335999 335592 334552
60711 334552 333077 331906 331626 331927 331806 330750 329423 328857 329241 329939 330479 331013 331825 332876 333943 334864 335601
60694 335601 336257 337029 338031 339296 341090 343835 347416 350904 353495 355475 357731 360535 363444 366281 369514
60679 369514 373587 378439 383820 389617 395755 402122 408596 414783 419907 423512 426143 428628 430720 431272
60665 431272 429846 427309 424486 421119 416707 411732 407252 403683 400618 397638 394692 391845 389275 387481
60651 387481 386973 387582 388434 388835 388983 389587 390823 391850 391540 389647 386983 384338 381551 377973 373575 369059
60635 369059 365007 361506 358637 356685 355613 354869 354003 353143 352614 352468 352603 352972 353384 353480 353211 353065 353497
60618 353497 354425 355467 356358 356849 356601 355606 354483 353946 354107 354559 354963 355266 355545 355914 356416 356802 356681 356176
60600 356176 356118 357217 359207 361144 362459 363397 364530 366162 368113 369922 371324 372645 374474 376851 379120
60585 379120 380801 382121 383356 384112 383928 383253 383122 383930 385150 386229 387137 388020 388982 390450 393140 397321
60569 397321 402545 408447 415427 424040 433958 444105 453890 463803 474487 485370 494640 500694 503380
60556 503380 503634 502157 498938 494022 488171 482411 477317 473126 470229 468980 469196 470394 472586 476353 482025
60541 482025 489250 497597 507270 518891 532800 548768 566309 584997 604407 623830 642031 657408
60529 657408 668561 674895 676702 674719 669647 662031 652431 641623 630642 620502 611703 603994 596756
60516 596756 589632 582798 576735 571933 568718 567096 566656 566835 567429 568753 571252 575096 580379 587604 597711
60501 597711 611414 628686 649105 672669 699959 731406 766720 805270 846675 890500 935459
60490 935459 979509 1020921 1058887 1092920 1122107 1145158 1160870 1168256 1166644 1156046 1137121 1110432
60478 1110432 1076028 1034329 987206 937648 888316 840770 795883 754325 716458 682245 651570
60467 651570 624385 600455 579216 560082 542714 526958 512790 500370 489830 480895 472948 465575
60455 465575 458800 452739 447348 442610 438565 435006 431496 427937 424788 422429 420638 419023 417637 416721
60441 416721 416106 415428 414748 414340 413913 412781 411012 409706 409661 410251 410185 409079 407612 406333 405032 403491 402211
60424 402211 401949 402820 404168 405187 405414 404824 403773 402809 402292 402198 402430 403160 404569 406315 407643 408175 408332
60407 408332 408803 409784 410955 412077 413271 414642 415877 416540 416721 417108 418275 420052 421832 423396 425177
60392 425177 427742 431275 435513 439892 443694 446454 448367 450041 451765 453433 455288 458107 462236 466876
60378 466876 470843 473656 475418 476202 476305 476697 478213 480354 481861 482531 483486 485407 487468 488534 488599 488412
60362 488412 488349 488353 488577 489302 490461 491819 493538 496052 499401 503156 507033 511315 516618 523331 531198 539393
60346 539393 547117 554099 560327 565437 568832 570387 570455 569113 566054 561436 556126 550743 545132 539218 533622
60331 533622 528799 524237 519236 514025 509235 504790 500251 495896 492413 489633 486599 483020 479786 477808
60317 477808 477060 476965 477075 477200 477527 478821 481954 486964 493095 499963 508083 517987 529463 542130 556287
60302 556287 572534 590668 609347 626761 641356 652018 657990 658856 654680 646094 634090 619572
60290 619572 603231 585988 569289 554562 542437 532757 525198 519443 514834 510478 505853 500957 495790
60277 495790 490233 484633 479886 476465 473591 469880 464781 459059 453866 449721 446517 444226 443095 443029 443213
60262 443213 442844 442161 442156 443100 443930 443466 441796 439964 438696 437994 437655 437502 437216 436692 436543 437601 439794 442029
60244 442029 443322 443540 443120 442672 442926 444331 446371 447845 448169 447945 447957 448146 448034 447778 448242 450102 453241
60227 453241 456958 460550 463736 466689 469683 472831 476260 480325 485236 490527 495333 499277 502763 506442
60213 506442 510880 516715 524382 533385 542359 550298 557395 564408 571614 578759 585644 592285 598615 604425
60199 604425 609498 613627 616645 618636 619961 620892 621366 621236 620565 619511 618105 616229 613670 610246 606173
60184 606173 602246 599146 596517 593240 588806 583877 579311 575263 571583 568437 565915 563527 560848 558372
60170 558372 556990 556721 556596 555796 554325 552539 550605 548631 546854 545407 544116 542765 541434 540434 540026
60155 540026 540287 541101 542182 543186 543917 544484 545208 546307 547682 549067 550427 552035 553993 555932 557518
60140 557518 559182 561887 566092 571314 576796 582203 587486 592533 597348 602250 607526 612920 617757 621474
60126 621474 623885 625164 625789 626324 627008 627654 628153 628851 630151 631865 633301 633999 634225 634689 635891 637666
60110 637666 639308 640136 640020 639274 638109 636392 633954 630910 627564 624161 620804 617480 614146 610908 608052
60095 608052 605720 603724 601929 600662 600342 600841 601722 602970 604830 606941 608497 609454 610760 612904 614954
60080 614954 615632 614777 613124 611090 608460 604932 600289 594338 587278 579969 573128 566436 559071 551065 543458
60065 543458 537057 531673 526733 522080 517912 514296 511082 508101 505272 502590 500122 497984 496313 495278
60051 495278 494988 495291 495831 496395 497096 498151 499778 502443 506751 512787 519819 527016 534171 541322 547973
60036 547973 553199 556434 557705 557248 555389 552781 550182 547803 545141 541559 536812 531059 524620 517776
60022 517776 510635 503255 496074 489990 485636 482624 479867 476695 473373 470501 468237 466251 464203 462049
60008 462049 459888 457621 454907 451582 448033 444874 442228 439628 436759 433977 432017 431443 432468 434849
59994 434849 437683 439827 440951 441909 443740 446667 450379 454687 459334 463579 466788 469304 472068 475427
59980 475427 478780 481294 482470 482224 481007 479717 478833 477701 475297 471605 467570 463770 459943 455983 452557
59965 452557 450369 449431 449442 450346 452097 454253 456307 458203 460167 462186 463916 465053 465642 466010 466384 466501
59949 466501 465808 464331 463126 463444 465438 468114 470441 471989 472593 472134 470911 469640 468757 468115 467600 467500
59933 467500 467964 468652 469362 470594 472972 476442 480537 485176 490550 496358 501810 506524 510966 515837 521410
59918 521410 527653 534630 542454 550983 559834 568564 576655 583422 588321 591435 593361 594470 594482 592909 589709
59903 589709 585285 580146 574888 570238 566508 563141 559415 555681 553182 552414 552414 552141 551901 552723 554861 557760
59887 557760 561204 565555 570780 576048 580607 584573 588636 593368 598979 605404 612373 619522 626456 632621
59873 632621 637336 640350 642206 643649 644652 644454 642597 639534 636153 632965 629812 626101 621301 615479
59859 615479 609352 603662 598669 594472 591377 589423 587816 585729 583737 583718 587046 593387 601488 610533 620201
59844 620201 629770 637826 643045 645122 644899 643643 642290 641464 641971 644588 648980 653260 655271 654231 650724
59829 650724 645428 638592 630660 622597 615294 609078 603907 599584 595663 591580 587112 582513 578260 574912
59815 574912 572967 572353 572220 571756 571005 570314 569256 566966 563489 559776 556276 552471 548079 543722 539964
59800 539964 536507 532918 529463 526633 524407 522557 521184 520353 519629 518535 517210 516093 515201 514216 513122
59785 513122 512423 512724 514164 516048 517147 516855 516074 516341 518033 520140 521869 523496 525278 526633 527216 527981
59769 527981 530139 533482 536625 538622 539594 540102 540722 542022 544151 546483 548296 549694 551339 553466 555866
59754 555866 558668 562415 567311 572995 579068 585263 591099 596014 600002 603580 606959 609672 611315 612262
59740 612262 613416 615397 618084 620807 622956 624528 625998 627537 628539 628252 626770 625094 624189 624263 624898
59725 624898 625565 625965 626128 626338 626887 627834 628978 629939 630313 629982 629363 629085 629316 629665 629835 630012 630467 631171
59707 631171 632079 633434 635483 638288 642072 647223 653533 659901 665463 670635 676395 682829 689147 694966
59693 694966 700718 706643 712093 716093 718134 718273 716914 714701 712236 709676 706841 703746 700694 697815
59679 697815 694885 691684 688113 683816 678174 671045 663258 656001 649750 643989 637946 631472 625205 619976
59665 619976 616069 613083 610494 608229 606616 605937 606242 607510 609753 612869 616593 620689 625135 630091 635625
59650 635625 641401 646620 650417 652428 652893 652147 650092 646233 640202 632330 623780 615969 609562 604030 598463
59635 598463 592750 587564 583254 579289 574972 570174 565127 559992 555033 550704 547128 543812 540258 536520
59621 536520 532733 528527 523481 517927 512700 508231 504397 501031 498026 495005 491553 487872 484782 482992
59607 482992 482675 483668 485620 487947 490069 491828 493387 494750 495722 496349 497000 497941 499122 500382 501545 502313
59591 502313 502429 502069 501800 502057 502838 503881 504893 505586 505750 505362 504403 502617 499726 495937 492028 488812
59575 488812 486570 484910 483051 480329 476724 472895 469584 466977 464742 462571 460508 458807 457668 457141
59561 457141 457161 457645 458537 459669 460732 461625 462718 464367 466216 467517 468220 469127 470740 472648 474498 476889
59545 476889 480654 485703 491393 497729 505504 515409 527790 543159 562010 583675 605644 624279 636305
59532 636305 640186 636823 629007 619725 610794 603065 597365 594544 594766 597321 601156 605195 608417 610383
59518 610383 611656 613052 614293 614010 611149 605910 599155 591441 582922 573747 564222 554745 545766 537655
59504 537655 530527 524263 518702 513727 509333 505789 503493 502410 501953 501667 501734 502422 503463 504538 505953
59489 505953 508111 510565 512409 513567 514900 517010 519668 522587 526059 530554 536187 542796 550094 557567
59475 557567 564600 570823 576012 579768 581795 582483 582589 582308 581213 579207 576904 574899 573266 572058 571727
59460 571727 572678 574800 577777 581614 586577 592792 600093 608157 616783 626107 636427 647614 658929 669671
59446 669671 679602 688278 694362 696328 693765 687462 678607 668588 659168 651594 645463 639417 633029 627036
59432 627036 621704 616263 610334 604698 599991 595702 591333 587777 586570 588310 592653 599486 609197 621900
59418 621900 637112 654213 672827 692921 714909 739542 767146 796550 824578 846524 857825
59407 857825 856456 844423 826649 808079 791778 779253 771510 769338 773057 782033 793663 802849 803860
59394 803860 793920 774832 750836 725500 700907 678454 659020 642566 628570 616928 607883 601362
59382 601362 596960 594364 593251 593108 593693 595376 598378 602060 605660 609418 614171 619963 625936 631529 636952
59367 636952 642426 647793 653176 659271 666464 674112 681173 687332 693118 699080 705200 711205 717133 723384
59353 723384 730262 737786 746067 755597 766728 778989 791425 803761 816699 830852 845848 860813
59341 860813 875297 889241 902317 913710 922466 927808 929412 927751 923930 918703 911771 902344 890252
59328 890252 876246 861407 846657 832620 819536 807292 795837 785481 776512 768630 761070 753311
59316 753311 745484 738139 731777 726411 721501 716490 711561 707575 705036 703428 701893 700282 699181 699186 700633
59301 700633 703914 709543 717797 728574 741546 755946 769938 780512 784531 780382 768830 752300
59289 752300 733214 713021 692703 673666 657504 644885 635205 627474 621271 616803 614506 614674 617098
59276 617098 620941 625442 630826 638037 647429 658278 669768 681808 694542 707651 720592 733003
59264 733003 744385 753843 760663 764847 766640 765945 762701 757431 750837 743077 734001 723937 713769 704324
59250 704324 695980 688680 682009 675523 669314 663991 659900 656769 654390 653098 653115 654028 655493 657920 661701
59235 661701 666189 670346 674163 678463 683354 687780 690792 692475 693354 693512 692710 690974 688647 686010 683082
59220 683082 679774 676178 672765 670178 668647 667703 666614 664946 662588 659540 656039 652688 650027 647994
59206 647994 646088 644013 641965 640299 639121 638136 636816 634906 632810 631186 630078 628831 627069 625323
59192 625323 624376 624383 625014 626114 627760 629904 632385 635153 638211 641534 645268 649738 654942 660246 664848
59177 664848 668369 670910 672885 674872 677193 679562 681697 684344 688871 695592 703342 711129 719248 728140
59163 728140 737150 745344 752765 759799 765844 769731 771098 770363 767715 763117 757012 749976 741867 732311
59149 732311 721832 711508 701611 691528 680902 669881 658393 646285 634141 622944 612861 603401
59137 603401 594765 587817 582496 577455 571779 566062 561259 557359 553911 551108 549602 549642 550990 553422 556844
59122 556844 561153 566313 572453 579706 588146 597802 608460 619493 630415 641557 653632 666553 679205
59109 679205 690535 700368 709088 717087 724665 731873 738198 742847 745592 746906 747130 745981 743183 739116
59095 739116 734470 729498 723964 717748 711353 705785 701903 699746 698527 697319 695582 693055 689658 685746
59081 685746 681873 677879 672749 666006 658729 652428 647340 642656 637962 633470 629098 624531 620123 616619
59067 616619 613843 610701 606681 602397 598439 594597 590531 586330 582045 577463 572675 568226 564377 560933
59053 560933 557964 555943 554866 554015 552925 551837 550857 549487 547435 545169 543183 541442 540059 539790 541085
59038 541085 543129 544555 544882 544749 544970 545819 547114 548622 550398 552877 556520 561435 567622 575371 584876
59023 584876 595563 606556 617901 630556 644847 659539 672740 683235 690763 695636 698419 699522
59011 699522 698856 696322 692669 689210 686494 683973 681166 678452 676444 675419 675748 678044 682253 687282 692120
58996 692120 696843 701891 706860 710712 712907 713773 713985 714101 714361 714517 714008 712623 710775 709012 707546 706448
58980 706448 705919 706149 707253 709538 713509 719476 727392 737062 748043 759451 770561 781680 793721
58967 793721 806738 819625 831467 842398 852795 862446 871085 879071 886823 893909 899209 901761 901191
58954 901191 897649 891569 883168 872068 857866 841143 823404 805894 789017 772873 757605 743165
58942 743165 729555 717459 707769 700360 694315 689523 686804 686019 685365 683409 680751 678753 677547 676343
58928 676343 674969 673908 673211 672326 670752 668178 664389 659760 655397 652063 649357 646617 644130 642632 642078
58913 642078 641848 641891 642807 644870 647736 651105 655096 659999 666094 673644 682702 693111 704910 718363
58899 718363 733251 748525 763089 776582 789153 801060 812870 825397 838906 852899 867234
58888 867234 882812 900501 919902 939821 959418 978118 994914 1008656 1018792 1025172 1027500 1025766
58876 1025766 1020915 1014239 1006157 996205 984098 970222 955258 939893 924826 910586 897436 885668
58864 885668 875661 867263 859562 851745 843854 836251 828794 821065 813050 804992 796776 788023 778624 768889
58850 768889 759355 750637 743090 736340 729627 722684 715735 708496 700101 690396 680477 671411 663223 655658
58836 655658 649001 643461 638556 633843 629549 625850 622429 619475 618136 618963 620741 621934 622590 623766 625823
58821 625823 628425 631585 635394 639194 642216 644749 647601 650738 653445 655478 657076 658179 658600 658580 658227
58806 658227 656858 653865 649724 645268 640557 635459 630576 626307 621699 615653 608738 602336 596535 590479
58792 590479 584401 579500 575967 572937 570426 569569 570725 572995 575914 580068 585665 591993 598831 606935
58778 606935 616420 625863 633752 639877 644712 648332 650487 650989 649510 645752 640107 633474 626222 618119
58764 618119 609440 601170 593852 587233 581393 577211 575155 574406 573786 572992 572464 572614 573538 575016 576449 577191
58748 577191 577143 576758 576495 576660 577581 579393 581865 585068 589846 596816 605231 613794 622304 631349 640650 649120
58732 649120 656643 664426 673164 682027 689829 696222 701292 704949 707214 708335 708264 706611 703417 699378 695230
58717 695230 691604 689337 689032 690225 691841 693452 695217 696801 697548 697702 698102 698490 697402 694016 688794
58702 688794 682003 673003 661574 648641 634928 620122 604184 588460 574524 562655 552233 542927
58690 542927 534720 527413 520887 515423 511119 507366 503391 498977 494365 489867 485880 482788 480594 479031
58676 479031 478071 477808 477943 478081 478537 480059 482772 486245 490553 496280 503472 511709 521323 533254 547255
58661 547255 561347 573440 582597 588427 590505 588975 584786 578756 571190 562696 554360 546658 539178 531851
58647 531851 525431 520261 515618 510885 506426 502684 499362 496158 493511 492017 491766 492681 494712 497285 499459
58632 499459 501070 502870 505168 507299 508776 509930 510923 511269 510906 510692 511223 512144 513199 514897 517451 520144
58616 520144 522519 525231 528978 533495 538289 543363 548498 552797 555735 557834 559625 560910 561712 562835
58602 562835 564682 566486 567517 567981 567921 566517 563527 560338 558334 557182 555949 555025 555554 557678 560782
58587 560782 565040 571387 580132 590636 602158 614213 626395 638571 650854 662784 673174 681504
58575 681504 688769 696043 702911 708352 712664 717394 723707 731786 741598 753327 767147 783203 801704
58562 801704 822573 845297 869487 895042 921306 946674 969557 989230 1005345 1017385 1025226 1029549
58550 1029549 1031119 1030270 1027573 1024075 1020139 1014841 1007270 997745 987027 975037 961104 944821 925985
58537 925985 904462 880901 856863 833480 810639 788198 767182 748930 733673 720779 709773
58526 709773 700410 692395 685840 681419 679380 678911 678973 679133 679192 678813 678035 677304 676577 675316 673709 672667 672092
58509 672092 670504 667096 662904 659175 655943 653055 651115 650253 649348 647642 645886 644701 643135 640249 636904
58494 636904 634544 633291 632661 633065 635096 638283 642013 646739 652904 659700 666460 674358 685079 698618
58480 698618 713869 730589 749170 769207 789753 810278 829897 846434 857810 863797 865122 861785
58468 861785 853784 842623 830358 817714 804677 792178 781649 773531 767741 764861 765293 768003 771809
58455 771809 777265 785660 796772 809223 822294 835567 847383 855558 859353 859233 855143 846725 834875
58442 834875 821543 808195 795571 784307 774531 765620 757652 752178 750107 749922 749640 749526 751171 754956
58428 754956 760313 767427 776589 786767 796902 807736 820238 833025 843532 850957 855912 858079 856745
58415 856745 852936 848460 843244 835951 826809 817450 808394 799109 790119 782590 776088 769161 761966 756021
58401 756021 751708 748261 745826 745146 745601 745999 746906 749676 753634 756865 759382 762686 766505 768972 769965
58386 769965 771285 773391 774900 775542 776709 778770 780673 782651 786504 792671 799635 806703 814735 823659
58372 823659 831923 839055 846269 853988 861207 867782 874850 882541 889815 897112 906526 918665 931736 944342
58358 944342 956859 969487 981313 991857 1001311 1008921 1013431 1015406 1016740 1017787 1017523 1016522 1016870 1018871
58344 1018871 1020844 1022503 1025570 1030630 1036500 1043236 1052573 1064732 1077877 1091461 1106967 1124496 1141805
58331 1141805 1157693 1173309 1189150 1203767 1216337 1227504 1236810 1242480 1244781 1246441 1248753 1250325
58319 1250325 1250710 1251872 1254838 1258150 1261047 1265102 1271283 1278352 1285524 1293830 1303684 1313970 1324597 1336978
58305 1336978 1351022 1364765 1377918 1392480 1408907 1425108 1440257 1456013 1472940 1489378 1504986
58294 1504986 1521658 1539755 1557296 1574048 1592371 1612781 1632931 1652451 1674299 1699622 1725716
58283 1725716 1750978 1777372 1805882 1834015 1860205 1886418 1914052 1941503 1968138 1996477 2028015
58272 2028015 2061025 2094655 2130854 2170210 2210551 2251902 2297860 2349595 2403573 2457805 2515040
58261 2515040 2576892 2640256 2702748 2766242 2831538 2895023 2954419 3012666 3072357 3131633 3189362
58250 3189362 3248945 3312975 3379506 3447647 3521296 3603173 3690750 3782320 3881252 3989823 4104799
58239 4104799 4223751 4349726 4485078 4626956 4773688 4929156 5096026 5271582 5455340
58230 5455340 5653375 5869483 6099639 6341043 6598843 6877795 7175693 7491784 7833000
58221 7833000 8204693 8604154 9030931 9494311 10002726 10555850 11155866 11816089 12549236
58212 12549236 13358371 14249653 15242473 16356516 17601916 18994665 20569037 22363238
58204 22363238 24409241 26752781 29469184 32646807 36377854 40790067 46074732 52470880
58196 52470880 60252077 69756113 81398917 95627752 112896396 133727477 158740090
58189 158740090 188485889 223134629 262123640 303733680 344642395 379982338 404518915
58182 404518915 414657033 409918006 392733588 366861894 335807743 302213679 268035306
58175 268035306 234812267 203719102 175521847 150589671 128965137 110463969 94787955
58168 94787955 81607516 70585304 61380469 53677123 47212996 41772458 37167267 33240629
58160 33240629 29876770 26986468 24487432 22308276 20399122 18721969 17236514 15906267
58152 15906267 14709711 13632602 12655732 11761111 10942952 10200750 9526854 8910847 8350205
58143 8350205 7845972 7392364 6980058 6605452 6267879 5961652 5679030 5417024 5173692
58134 5173692 4942096 4715840 4496920 4290748 4097101 3912863 3739511 3580278 3433152
58125 3433152 3293887 3162991 3042963 2931617 2824855 2723422 2630368 2544289 2461370 2381854
58115 2381854 2308349 2239769 2172839 2107739 2046730 1989069 1932676 1878906 1830271 1785078 1739533
58104 1739533 1693654 1650185 1609179 1568516 1528342 1490345 1453872 1417204 1381338 1348315 1317260
58093 1317260 1286221 1256353 1230020 1206281 1182483 1158943 1137883 1119112 1100903 1083802 1069328
58082 1069328 1056080 1041258 1025024 1009404 993917 976328 956851 937707 919237 900106 880613
58071 880613 862251 844775 827097 810229 795976 783572 770959 758442 747803 738798 729954 721755
58059 721755 715565 710289 703593 695582 687872 679984 670301 659774 650972 643963 636693 628867 621973 615922
58045 615922 609296 602550 597439 593481 588392 581873 575583 569630 562573 554859 548700 544247 539199 532584
58031 532584 525865 519907 513815 507158 500509 493403 484529 474337 464834 456518 448144 439717 432892 428041
58017 428041 423596 418837 414776 411727 408477 404512 400852 398119 395856 394130 393722 394344 394684 394466 394501 394559
58001 394559 393408 391133 389308 388630 388462 388741 390110 392017 392996 393145 394055 396046 397720 398611 399921 402110
57985 402110 403983 404743 404901 404568 402892 399790 396352 393008 389109 384764 381131 378456 375715 372675 370391
57970 370391 369162 367984 366594 366078 366685 366876 365435 362996 360775 359217 358489 358901 360227 361761 363322
57955 363322 365037 366171 365644 363634 361122 358125 354223 350610 349377 350630 352459 353992 356263 359828
57941 359828 363900 368414 374621 382880 391945 401177 411390 422788 434116 444658 454928 464543 471531
57928 471531 474807 475387 474148 470463 464141 456720 449454 441858 433522 425598 419059 413182 407239 402093
57914 402093 398598 395872 392807 390004 388613 388272 387753 386840 386208 386105 386291 386517 386105 383855 379365 373723
57898 373723 368209 363146 358653 355287 353064 350972 348402 346041 344556 343575 342823 342997 344413 345939 346463
57883 346463 346402 346688 347218 347416 347328 347092 346265 344792 343686 343591 343565 342462 340693 339438 338929 338701 338831 339661
57865 339661 340859 341927 343218 345436 348572 352217 356322 360797 364977 368395 371514 374794 377681 379388
57851 379388 380043 380107 379269 376981 373584 369893 366099 361947 357577 353280 348795 343724 338310 333104 328231
57836 328231 323647 319735 316957 315265 314359 314062 314008 313660 313240 313896 316248 319381 321964 323680 324873 325569
57820 325569 325689 325583 325474 324939 323777 322858 323289 325158 327718 330146 331373 329976 325368 318755 312043 306057
57804 306057 300478 295038 289983 285685 282491 280659 279974 279871 280354 282091 285125 288354 290972 293590 297070
57789 297070 301111 304985 308947 313737 319207 324570 329607 334586 339283 343099 346027 348663 351401 354287
57775 354287 357325 360209 362056 362135 360603 357933 354036 348623 342058 335129 328267 321629 315545 310237 305451
57760 305451 300912 296850 293579 291036 289160 288105 287568 286664 285156 284088 284478 286034 287861 289725 291813
57745 291813 294025 296386 299413 303077 306123 307468 307667 307946 308466 308647 308555 308653 308599 307652 306019 304607 303635
57728 303635 302558 301257 300194 299508 298898 298245 297509 296246 294135 291705 289625 287575 284764 281307 278083
57713 278083 275486 273241 271155 269051 266297 262510 258544 255648 253769 251758 249136 246581 244695 243359
57699 243359 242372 241794 241561 241474 241543 241650 241216 239995 238872 238851 239562 239827 239455 239295 239707 240270 240969 242440 244889
57680 244889 248001 252129 258477 267791 279861 294684 313325 337305 367852 405994 452704 508677
57668 508677 574337 649664 732734 817775 895063 953346 983297 980570 947552 892328 824682 752267
57656 752267 680069 611988 551094 498516 453652 415841 384896 360068 339820 322980 309208
57645 309208 298177 289267 282209 277045 273275 269970 266868 264422 262678 261107 259688 259063 259307 259552 259143
57630 259143 258287 257310 256144 254832 253683 252643 251244 249318 247035 244230 240692 237143 234782 233637 232485
57615 232485 230691 228959 227871 226907 225612 224691 225020 226255 227233 227355 226981 226765 227030 227488 227411 226323 224558
57598 224558 222717 220777 218368 215749 213650 212199 210846 209302 207642 205552 202575 199232 196838 195927
57584 195927 195756 195492 194942 194009 192564 191047 190110 189431 187940 185431 182814 180605 178474 176531 175537 175252
57568 175252 174020 170841 166728 163265 160892 159347 158605 158449 158112 157370 157150 158165 159676 160463 160292 159648
57552 159648 158772 157803 157216 157325 157900 158820 160326 162072 162887 162333 161717 162647 165257 168582 171924 174972 177300
57535 177300 178741 179728 180441 180163 178313 175587 173306 172129 172019 172786 173927 174693 175170 176591 179714 183581
57519 183581 186788 189262 191762 194345 196537 198500 200739 202957 204354 204872 205100 205172 204766 204065 203699 203837
57503 203837 204133 204441 204733 204443 202764 199618 195726 191856 188564 186283 184908 183545 181467 179155 177626
57488 177626 176958 176268 174954 173245 171688 170777 170828 171451 171429 169921 167599 165758 164593 163301 161668 160385
57472 160385 159692 158887 157540 156286 155875 156088 156168 155904 155776 156223 157152 158173 159059 159847 160530 160858 160737 160652
57454 160652 161233 162297 162903 162541 161711 161032 160422 159550 158519 157577 156727 156131 156356 157605 159203 160480 161674
57437 161674 163308 165137 166480 167298 168181 169473 171004 172519 173827 174765 175467 176378 177559 178332 178044 176828
57421 176828 175199 173414 171689 170438 169720 169001 168051 167501 167897 168772 169416 169980 171093 172859 174897 176863
57405 176863 178271 178480 177571 176593 176190 175763 174817 174179 174794 176140 177143 177995 179617 181888 183852 185383
57389 185383 187158 189141 190462 190815 190777 190838 191189 192296 194501 197158 199264 200811 202424 203972 204761 204897
57373 204897 205163 205657 205819 205660 205613 205354 204225 202797 202408 203067 203378 202826 202548 203365 204504 204913 204661 204427
57355 204427 204592 205361 206799 208401 209478 210245 211550 213410 214993 216178 217826 220134 222088 223062 223641
57340 223641 224299 224536 224112 223927 224799 226237 227261 227661 227734 227580 227340 227428 227857 227958 227264 226079 224793 223352
57322 223352 221848 220820 220587 220974 221972 223836 226224 228277 229916 232000 234675 236770 237551 237976 239296
57307 239296 241340 243121 244415 245698 247082 248272 249255 250247 251173 251764 251958 251917 251984 252761 254585 256743 258035
57290 258035 258454 259498 262329 266444 270637 274376 277623 280102 281638 282700 283956 285629 287638 289899
57276 289899 292167 294203 296343 299210 302606 305486 307264 308236 308523 307758 306241 305183 305127 305245 304876 304660
57260 304660 305311 306379 307197 308096 309600 311311 312659 314112 316586 320225 324593 329479 334706 339793 344595
57245 344595 349630 355051 360087 364265 368271 372691 376848 379963 382612 385862 389723 393645 397779 402437
57231 402437 406976 410627 413981 418235 423340 428261 432842 438001 444125 450499 456423 461848 466859 471533
57217 471533 476366 481999 488389 494884 501093 507100 513076 519312 526393 534645 543572 552419 560967 569233
57203 569233 576931 583967 591013 598828 607411 616472 626165 636538 646894 656631 666279 676790 688355
57190 688355 700771 714305 729146 744641 760247 776738 795225 815393 835939 856313 876788
57179 876788 897202 917085 936765 956982 977504 997463 1016968 1037001 1057727 1078331 1098705
57168 1098705 1120004 1143211 1168252 1194848 1223215 1253482 1285194 1317734 1350712 1383911 1417432
57157 1417432 1451799 1487304 1523402 1559310 1594815 1629813 1663608 1695706 1726905 1758558 1791020
57146 1791020 1823765 1856614 1889773 1923084 1956493 1990931 2027489 2065983 2105568 2146414 2189444
57135 2189444 2234670 2281309 2329460 2380197 2433909 2489840 2547449 2607121 2669561 2735518 2805988
57124 2805988 2881581 2961800 3045912 3134246 3227688 3326589 3431435 3543851 3665399 3796047
57114 3796047 3935555 4085732 4249576 4428902 4624997 4841135 5082386 5353495 5659346
57105 5659346 6007257 6406667 6867308 7400625 8023070 8755969 9623481 10654544 11887009
57096 11887009 13366769 15142854 17265991 19789931 22767742 26244140 30252669 34816701
57088 34816701 39944611 45620728 51803523 58429392 65410054 72629858 79959794 87269563
57080 87269563 94389103 101023815 106718396 110955155 113340482 113733626 112231783 109065452
57072 109065452 104509432 98848727 92369626 85348833 78043641 70688061 63487256 56607707
57064 56607707 50171761 44260578 38919093 34159338 29966049 26305929 23135457 20404646
57056 20404646 18060032 16048826 14321820 12834188 11546455 10425895 9445913 8583723
57048 8583723 7819622 7138263 6528704 5982364 5491684 5050686 4655046 4300601 3982471
57039 3982471 3696121 3438439 3207193 3000066 2814821 2650012 2505074 2379770 2273612
57030 2273612 2185639 2114978 2062020 2028942 2018590 2032740 2070749 2127598 2191036 2241451 2258153
57019 2258153 2228905 2154500 2044959 1912664 1768764 1622948 1483174 1354776 1240559 1141691
57009 1141691 1057765 986523 925026 871568 825768 786806 752666 721571 693296 668327 646322
56998 646322 626069 606624 587800 569772 552826 537410 523841 511951 501529 493147 487989 486806
56986 486806 489494 495796 505765 518994 533734 547176 556567 559910 556114 545229 528666 508681 487255
56973 487255 465462 443861 423154 404280 388010 374738 364548 357280 352542 350019 350027 353567 361559
56960 361559 374075 390595 410808 434520 460450 485509 505726 517837 520026 511870 494481 470651
56948 470651 444015 417476 392368 369009 347674 329003 313811 302680 295580 291980 291599 295025
56936 295025 303270 316848 335682 359753 389152 423258 460139 496655 528616 551046 559621 552892
56924 552892 533085 504372 470508 434101 397344 362464 331267 304494 281679 261706 243801
56913 243801 228106 215082 204479 195404 187443 180970 176077 171946 167830 164060 161374 159669 158176
56900 158176 156637 155527 155200 155571 156763 159410 164071 170772 179385 190156 203619 220199 240132 263630
56886 263630 290760 320817 351614 379523 400685 412594 414780 408266 394826 376751 356654 336841
56874 336841 318884 303885 292810 286243 284142 286404 293584 306586 325668 350278 380174 416391
56862 416391 460763 514407 576584 644502 713454 776829 826743 856230 862139 846336 814041 771112
56850 771112 722655 673062 625964 583876 548515 521468 503972 496063 496917 506442 525961 557074
56838 557074 600537 656641 726015 809400 906624 1015423 1129837 1238849 1327780 1383286 1398722
56827 1398722 1375589 1320848 1243325 1151758 1054307 958301 869660 792149 727097 674175 632778
56816 632778 602749 584090 576693 580638 596354 624216 664351 716878 781542 856336 936340 1013809
56804 1013809 1079115 1122334 1136049 1118360 1073432 1008791 932221 850744 770563 696217 629878
56793 629878 572323 524301 486291 457610 436954 423757 418167 419934 428367 443458 466083 496749
56781 496749 534508 576776 619283 656155 681197 690058 681500 657049 620088 575080 526536 477936
56769 477936 431462 388537 350090 316295 286653 260655 238208 219424 204269 192398 183081 175331
56757 175331 168365 161884 155796 149941 144389 139634 136063 133347 130799 128129 125533 123243 121390 120014
56743 120014 118860 117413 115591 114012 113083 112173 110371 107837 105682 104634 104438 104545 104746 105026 105334 105677
56727 105677 106159 106877 107894 109177 110422 111238 111755 112563 113815 114993 116051 118031 121710 126140 129525
56712 129525 131257 132238 133400 134906 136685 138765 140913 142706 144135 145543 146947 148059 148929 149885 150755
56697 150755 150839 149828 148273 146936 146052 145250 143975 142081 140232 139293 139070 138237 136067 133533 131899 130892
56681 130892 129391 127338 125626 124379 122813 120874 119590 119480 119805 119828 119742 119984 120617 121824 124098 127343
56665 127343 130573 133011 134824 136411 137668 138436 139003 139660 140276 140708 141200 142010 143102 144443 146097 147826
56649 147826 149201 150361 152061 154690 157770 160673 163239 165414 166934 167829 168716 170110 171822 173297 174202
56634 174202 174402 173778 172397 170516 168208 165324 161931 158430 155067 151800 148791 146548 145336 144791 144320
56619 144320 143608 142682 141822 141382 141329 140987 139673 137555 135422 133779 132718 132460 133245 134665 135899 136686 137401
56602 137401 138104 138343 138023 137704 137816 138232 138813 139681 140721 141522 142103 143146 145205 148134 151348 154171 155970
56585 155970 156630 156917 157690 158743 159185 158868 158543 158525 158240 157381 156530 156280 156593 157382 158886 161077 163446 165775
56567 165775 168390 171366 174305 177303 181308 187003 194088 202126 211297 221695 232466 242260 250144 255737
56553 255737 259031 260547 261233 261797 262409 263100 263868 264280 263627 261732 259063 255982 252583 249273 246585 244236
56537 244236 241275 237442 233468 229770 225890 221640 217795 215071 213237 211801 210757 210088 209278 207912 206205
56522 206205 204543 203178 202635 203537 205574 207456 208227 207875 206470 203899 200885 198995 198834 199251 199109 198833
56506 198833 199299 200179 200455 199884 198945 197880 196638 195326 193962 192248 190153 188189 186590 184901 182943
56491 182943 181429 180956 181124 181284 181377 181317 180452 178469 176205 174646 173808 173357 173609 174908 176593 177620 177909
56474 177909 178305 179462 181354 183462 184965 185281 184893 185004 185958 186805 186895 186873 187370 187802 187422 186648 186233 185941
56456 185941 185197 184388 184333 184987 185781 186720 188031 189163 189373 189011 189162 190166 191428 192472 193277 193723 193572
56439 193572 192981 192373 191919 191619 191602 191853 191956 191611 191037 190579 190395 190807 192115 193663 194054 192973 191896 192199
56421 192199 193440 194414 194944 195631 196538 197289 197941 198735 199436 199742 199843 199847 199274 197941 196648 196205 196455 197039
56403 197039 198175 199760 200647 200015 198747 198327 199075 200487 202509 205207 207917 210020 211996 214617 217674
56388 217674 220590 223575 226934 229950 231738 232564 233078 232931 231471 229204 227200 225617 224135 223178 223282
56373 223282 223854 223986 223952 224450 225025 224880 224678 225815 228191 230346 231574 232358 232989 233364 233991 235562 237563
56356 237563 238733 238874 238900 239271 239728 240379 241611 243100 244247 245427 247452 249986 251898 252972 253907 254902
56340 254902 255691 256744 258850 261666 264110 266076 268290 270666 272457 273958 276452 280323 284686 288954
56326 288954 293335 297699 301348 304081 306357 308382 310122 311948 314093 315800 316298 316161 316315 316270 315053
56311 315053 313371 312954 314033 315464 317086 319824 323511 326804 329598 333468 339303 346270 353430 360547
56297 360547 367005 371815 375213 378527 382040 384731 386513 388892 392800 397528 402450 408074 414648 421333
56283 421333 427672 434473 442394 450846 459048 467146 475710 485137 495889 508292 521787 535469 549523
56270 549523 564947 581834 599327 617450 637527 660527 686363 715003 746891 782045 820195
56259 820195 862136 909634 963873 1025254 1094675 1173458 1261988 1359964 1467910 1586705 1715698
56248 1715698 1853212 1998926 2153546 2315748 2481539 2647082 2810030 2967451 3114633
56239 3114633 3246946 3361120 3453878 3521258 3560546 3571635 3555787 3514422 3449744 3365019 3263345
56228 3263345 3147267 3019937 2885139 2745695 2603333 2460454 2320409 2185486 2056240
56219 2056240 1933173 1817418 1709266 1607849 1512897 1425259 1345189 1271758 1204349 1143021
56209 1143021 1086954 1034412 984891 939571 899159 862909 830113 800602 773426 747166 722212
56198 722212 700667 683273 668366 654459 641789 630628 620303 610857 603562 598713 594703 590189
56186 590189 585474 580980 576340 571743 568300 566175 564228 562126 560862 560582 560088 559235 559557 561640 564098
56171 564098 566070 568497 571975 575559 578702 582219 586386 590302 594106 599507 607062 615223 623072 631641
56157 631641 641515 651688 662026 674425 690166 708430 728679 752185 780024 811962 848630 892403
56145 892403 944892 1005992 1076527 1159109 1254898 1361905 1477584 1600150 1725785 1847487
56135 1847487 1958754 2056522 2139760 2208467 2265554 2316265 2363336 2404977 2438806 2464598 2481673
56124 2481673 2487563 2481978 2468959 2452402 2432051 2405919 2373194 2331928 2277085 2204463 2114740 2011542
56112 2011542 1898275 1779386 1661643 1550831 1449086 1357591 1278871 1213726 1158910 1111110
56102 1111110 1070756 1039063 1014131 993274 976630 965065 956833 949594 943645 940061 937804 935710
56090 935710 935074 937176 940380 942674 944921 948748 953587 958649 965318 974521 984222 992519 1000693 1010246
56076 1010246 1019741 1027745 1036027 1046491 1057752 1068211 1079563 1093623 1108586 1122187 1135817 1151671
56064 1151671 1168651 1184976 1201994 1221346 1241051 1258494 1274681 1291544 1307809 1321620 1334443
56053 1334443 1348274 1361821 1373643 1386003 1401317 1417837 1433287 1449529 1468964 1489656 1509033
56042 1509033 1529103 1552733 1577914 1601231 1624080 1649875 1677819 1704990 1731970 1760970 1791070
56031 1791070 1820702 1852095 1887853 1926052 1964017 2003673 2047660 2093675 2138544 2184233 2233697
56020 2233697 2284612 2333736 2383670 2438433 2496133 2553127 2611625 2675725 2743744 2812184 2883443
56009 2883443 2961538 3043959 3126146 3210374 3301680 3398791 3497929 3601825 3715664 3837681 3963162
55998 3963162 4093964 4234470 4382123 4532230 4688182 4856326 5034697 5217937 5409414
55989 5409414 5617061 5841137 6077864 6330897 6606782 6903331 7215504 7548587 7912369
55980 7912369 8307099 8729238 9185823 9688017 10236029 10826842 11471455 12187333 12979844
55971 12979844 13849919 14813995 15896352 17108455 18458496 19975954 21704419 23678541
55963 23678541 25935847 28546790 31608325 35219911 39502527 44639441 50871017 58466705
55955 58466705 67746773 79119837 93050048 110004623 130498756 155165092 184637991
55948 184637991 219230602 258569414 301201562 344107504 382497516 410651642 423904856
55941 423904856 420589787 402466083 373460918 337938421 299664420 261553079 225669909
55934 225669909 193245354 164799246 140377406 119742759 102477922 88087410 76105965
55927 76105965 66134886 57816393 50832834 44936452 39943356 35694033 32044630 28889359
55919 28889359 26156781 23779810 21691537 19846559 18219395 16780081 15492162 14333137
55911 14333137 13294737 12362323 11513404 10736485 10032271 9395188 8810795 8271999 7781224
55902 7781224 7335328 6923599 6541697 6193184 5876168 5581781 5306708 5054387 4823084
55893 4823084 4605105 4398550 4208066 4033353 3868316 3712073 3569625 3440967 3320317
55884 3320317 3206749 3104949 3014701 2929858 2848499 2773880 2704280 2632007 2554151 2475164 2397352
55873 2397352 2317822 2236383 2157694 2083584 2011133 1940079 1874531 1815820 1760859 1708825 1662372
55862 1662372 1621082 1580742 1540244 1502417 1467162 1430689 1392553 1356623 1323994 1291652 1259173
55851 1259173 1229918 1204247 1178132 1150048 1122966 1097997 1072188 1044290 1016958 991667 966887
55840 966887 942704 921772 904243 886935 868818 852328 838242 824405 810490 798781 789142 778417
55828 778417 765991 754893 746309 737995 729104 721388 714486 705243 693089 681131 670587 659154 646250
55815 646250 634806 626152 617947 608947 601188 595703 590607 585240 581871 581470 581914 582103 583793 587731 592057
55800 592057 596173 602053 609897 616431 619366 619863 618960 615371 608578 600442 592011 582244 571522 562769
55786 562769 557374 553370 549234 545962 543728 540101 533526 525487 517627 509990 503654 501727 505853 514726
55772 514726 527580 545850 569443 594248 615065 628534 632267 624699 607690 586302 564171 541521
55760 541521 518637 497795 480072 463531 446577 430346 416082 403044 390727 380329 372162 364324
55748 364324 355725 347847 341922 336962 332186 328651 326847 325370 323616 323070 324214 324848 323306 320735 318473
55733 318473 315824 312306 309381 307831 305809 301577 296054 290748 285353 279260 273339 268314 263343 257968
55719 257968 253543 251127 249926 249332 250472 254188 259557 265816 273582 282710 291132 297315 301710 304490
55705 304490 304405 301437 297973 295462 292263 286639 279468 272136 264268 255655 248046 242652 237973 232432 227139
55690 227139 223788 221689 219315 217105 216333 216660 217046 217819 219858 223023 227101 232829 240213 247382 252891
55675 252891 257570 262410 266320 267879 267632 266695 264716 261250 257535 254890 252747 250204 248021 247150 246847
55660 246847 246219 246114 247357 248613 248261 247050 246734 247288 247662 248059 249200 250334 250146 248753 246903 244225
55644 244225 240266 236221 233520 231516 228455 223952 218679 212599 205470 198314 192455 187687 183041 178577
55630 178577 174868 171629 168501 166234 165419 165037 163932 162697 162341 162203 161093 159538 158847 158784 158151 156995
55614 156995 156246 155754 154520 152457 150285 148178 146015 144289 143281 142041 139718 137135 135558 134768 133903
55599 133903 133210 133223 133102 131693 129537 128069 127468 127027 126886 127588 128568 128860 128774 129201 129867 129989 129956 130630 131539
55580 131539 131541 130720 129955 129225 128124 127487 128645 131450 134662 137817 141080 143881 145555 146932 149461 153011
55564 153011 156173 158357 159929 160698 160016 158176 156129 154058 151626 149198 147313 145413 142678 139670 137604
55549 137604 136479 135528 134972 135546 136751 137374 137450 138033 139337 140800 142630 145522 149098 152268 154914 157602
55533 157602 160026 161418 162083 162747 162774 161002 158069 155900 154890 153532 150856 147459 144012 140600 137683
55518 137683 135940 134933 133458 131405 129764 128752 127466 125463 123117 120380 116801 112898 109844 107569
55504 107569 104779 101100 97680 95373 93774 92418 91563 91402 91661 92279 93421 94718 95554 96069 96775 97385
55488 97385 97284 96914 97246 97987 97798 96319 94585 93476 93099 93531 94642 95315 94506 93061 92875 94191 95422
55471 95422 95683 95777 96437 97316 98046 98692 98805 97688 95973 95424 96678 98545 99901 100798 101343 101080 100092 99326
55453 99326 99239 99249 98954 98653 98376 97688 96769 96373 96391 95853 94678 94015 94419 95112 95504 95978 96622 96634 95724 94845
55433 94845 94828 95376 95985 96709 97443 97622 97227 97036 97352 97511 97122 96719 96739 96981 97473 98708 100570 102269 103841
55414 103841 106370 110125 113698 115768 116559 116728 115972 113717 110393 107102 104489 102530 100940 99392 97876
55399 97876 96965 97083 97581 97468 97016 97415 98743 99687 99524 98972 98608 97904 96537 95362 95243 95857 96365 96342
55381 96342 95505 93526 90741 88216 86633 85911 86091 87442 89371 90526 90524 90382 90704 90745 89933 89015 88873 89306
55363 89306 89786 90348 90990 91151 90631 90046 89751 89282 88509 88232 88868 89642 89831 89769 89854 89708 89231 89349 90609
55344 90609 91974 92100 91019 89662 88515 87719 87639 88314 88996 89148 89222 89634 89850 89403 89019 89614 90839 91679
55326 91679 91930 92051 92149 92167 92595 93859 95290 95737 95073 94237 93923 93929 93760 93244 92596 92191 92196 92326 92292 92460 93425
55305 93425 94878 95801 95982 96317 97243 97904 97463 96317 95369 94982 95254 96348 97854 98714 98537 98168 98314 98572
55287 98572 98519 98685 99503 100281 100236 99714 99364 98971 98193 97640 97977 98631 98612 98100 98030 98532 98984 99271 99885 100918
55267 100918 101918 102604 102971 102941 102589 102364 102420 102163 101130 99817 98919 98336 97710 97323 97567 98092 98421 98871
55249 98871 99912 101077 101496 101111 100436 99619 98700 98281 98794 99457 99130 97889 96722 95912 94955 93893 93547
55232 93547 94232 95249 95802 95653 94899 93834 93088 93215 94064 95017 95671 95843 95310 94223 93410 93494 94077 94527
55214 94527 95125 96426 97890 98299 97468 96470 96122 96208 96280 96297 96230 95846 95167 94619 94507 94781 95282 95757 95756 95088
55194 95088 94312 94188 94706 95156 95076 94595 93996 93563 93734 94791 96375 97764 98527 98534 97678 96188 94941 94722
55176 94722 95276 95727 95779 95865 96250 96719 97150 97708 98434 99164 99923 100927 102212 103616 105061 106486 107631 108261
55158 108261 108404 108062 107042 105503 104272 104048 104596 105235 105763 106240 106312 105540 104268 103398 103331 103708 104121 104490
55140 104490 104769 104800 104461 103670 102394 100928 99849 99421 99376 99568 100249 101302 101936 101766 101520 101887 102300 101838
55122 101838 100796 100333 100875 101869 102889 103926 104736 104874 104442 103974 103598 103039 102372 102058 102302 103013 104261
55105 104261 106087 108064 109702 111067 112346 113145 113069 112644 112701 113020 112620 111319 110032 109467 109425 109465 109482 109517
55087 109517 109746 110635 112460 114671 116395 117426 118079 118339 118017 117512 117450 117636 117324 116423 115536 114898 114264 113752
55069 113752 113673 113562 112603 111130 110479 111030 111620 111310 110585 110216 109995 109393 108629 108263 108302 108455 108811 109548 110246
55050 110246 110230 109491 108884 109308 110804 112414 112957 112156 110948 110427 110688 111077 111311 111709 112426 113117 113447 113407
55032 113407 113102 112682 112458 112617 112926 113178 113658 114528 115000 114025 111792 109718 108866 109086 109749 110521 111234 111685
55014 111685 111813 111620 110954 109874 109115 109457 110685 111897 112775 113753 114910 115629 115551 115109 114906 115167 115921 117074
54996 117074 118275 119300 120530 122344 124237 125375 125857 126380 126794 126213 124637 123165 122287 121246 119573
54981 119573 118016 117251 116747 115757 114624 114230 114750 115685 116658 117576 118354 119030 119749 120336 120360 119890 119652 120114
54963 120114 121009 121990 123102 124288 125175 125713 126345 127139 127532 127377 127430 128176 128886 128590 127402 126150 125195 124398
54945 124398 123949 124364 125711 127383 128708 129487 129983 130538 131142 131380 130969 130245 129781 129722 130040 131171 133532
54928 133532 136505 138941 140857 143605 148016 153496 159457 166533 175453 185496 195035 203157 209890 215185
54914 215185 218486 219188 216970 211895 204623 196340 188060 180162 172771 166181 160572 155697 151271 147392
54900 147392 144315 142084 140572 139512 138441 137076 135785 135143 134979 134587 133940 133842 134699 136047 137611 139817
54884 139817 142824 146046 149247 153124 158169 163911 170085 177492 186614 196182 204342 210720 216084 220363
54870 220363 222245 220730 216045 209067 200731 192097 184123 177046 170383 163662 156922 150631 145407 141657
54856 141657 139160 137270 135714 134747 134319 133723 132563 131401 130793 130283 129087 127258 125398 123676 121965
54841 121965 120548 119739 119084 117882 116332 115247 114729 114044 112839 111651 111091 111281 112213 113944 116199 118292
54825 118292 119669 120200 119959 119108 117962 116764 115483 114196 113448 113642 114276 114479 114276 114615 116076 118153
54809 118153 120016 121322 122045 122063 121345 120311 119669 119964 121339 123495 125704 127128 127363 126712 125873 125391 125427
54792 125427 125904 126758 127914 129058 129693 129667 129477 129724 130428 131231 132117 133360 134829 136044 137041 138448 140492
54775 140492 142689 144907 147985 152731 158853 165488 172325 179599 187377 195458 203727 211997 219656 225903
54761 225903 230239 232509 232765 231332 228606 224495 218504 210699 202103 193795 186150 179227 173223 168042
54747 168042 163151 158429 154510 151657 149007 145771 142598 140811 140728 141527 142377 142837 142582 141690 140992 141331
54731 141331 142658 144533 147110 150772 155275 160183 165783 172549 179981 187107 193939 201214 208702 214927
54717 214927 218742 220122 219286 216042 210391 203021 194864 186750 179508 173639 168809 164391 160558 158029
54703 158029 156691 155431 153526 151319 149247 147098 144625 142110 139856 137766 135828 134379 133494 132697 131693
54688 131693 130855 130616 130785 130904 130847 130778 130822 131008 131192 130913 129758 128038 126653 126066 125884 125581 125171 124940 125026
54669 125026 125499 126381 127359 127912 127922 127697 127241 126102 124252 122553 121916 122330 123133 123877 124553 125241 125914 126478
54651 126478 126732 126468 125799 125228 125178 125575 126000 126097 125824 125483 125505 126022 126698 127178 127517 127913 128249 128369 128563 129165
54631 129165 129813 129852 129392 129214 129510 129570 128950 128143 127675 127299 126651 126075 126114 126591 126876 126783 126628 126591 126626 126905 127716
54610 127716 128905 129906 130479 130962 131583 131869 131151 129574 128206 128000 128886 130047 130864 131215 131008 130008 128340
54593 128340 126701 125810 125891 126874 128526 130078 130363 128997 127099 126149 126432 127237 128182 129400 130597 131011 130560
54576 130560 130113 130248 130438 129896 128732 127764 127509 127730 127825 127450 126893 126842 127639 128874 129967 130899 131888 132597
54558 132597 132427 131565 131031 131467 132499 133477 134262 134996 135629 136005 136156 136293 136741 137912 139929 142234 143970
54541 143970 144815 145119 145316 145665 146417 147591 148576 148597 147615 146202 144618 142762 141010 140179 140433 141035 141396
54524 141396 141554 141334 140063 137713 135549 134876 135641 136849 137828 138464 138606 137997 136690 135083 133589 132489
54508 132489 131891 131645 131561 131776 132496 133380 133828 134002 134781 136327 137484 137191 135880 134818 134520 134484 134110 133226
54490 133226 131953 130690 130140 130837 132634 134900 137082 138889 140215 141160 141879 142231 141846 140725 139383 138260
54474 138260 137458 137202 137946 139718 141899 143995 146069 148041 149303 149571 149493 149809 150464 151170 152163 153563 154514
54457 154514 154002 152314 150738 149930 149440 148849 148472 148685 149246 149541 149125 147867 145937 143806 142007 140818
54441 140818 140298 140419 140930 141350 141526 141974 143213 144937 146249 146598 146072 145010 143856 143203 143344 143867 144230
54424 144230 144658 145769 147342 148299 148182 147937 148736 150491 152106 152862 152955 152748 152161 151011 149585 148484 147992
54407 147992 147923 148084 148580 149532 150750 151899 152791 153339 153451 153307 153462 154275 155393 156258 156952 157934 159074 159632
54389 159632 159348 158862 158841 159303 160004 160839 161543 161605 160923 160062 159495 159073 158531 157955 157381 156583 155756 155741 156890
54370 156890 158272 158756 158536 158794 160142 162090 163911 165326 166442 167569 169099 171132 173350 175591 178242
54355 178242 181634 185375 188810 191820 194558 196741 197948 198431 198870 199315 199068 197661 195372 192719 189912
54340 189912 186880 183489 179711 175894 172740 170645 169252 168011 166925 166220 165594 164508 163121 162201 162054
54325 162054 162199 162226 162395 163089 164077 164567 163921 162327 160913 160924 162442 164094 164387 163141 161284 159633 158409
54308 158409 157590 157007 156212 154992 153890 153564 153727 153451 152476 151424 150693 149947 148915 147936 147399 147312 147743 149100
54290 149100 151521 154389 156825 158378 159061 159148 159141 159535 160305 160875 160801 160201 159418 158618 157909 157487 157397 157399 157286 157141
54270 157141 157145 157265 157225 156663 155461 154126 153687 154790 157008 159439 161819 164465 167257 169456 170662 171254
54254 171254 171604 171519 170790 169714 168657 167597 166507 165783 165808 166440 167314 168271 169072 169108 168012 166406 165412 165418
54236 165418 165813 165934 165843 165994 166473 166827 166547 165572 164326 163275 162438 161449 160123 158816 158089 158149 158815 159908
54218 159908 161407 163149 164677 165564 165770 165481 164703 163324 161580 160078 159134 158407 157521 156836 157048 158099
54202 158099 159043 159088 158244 156829 155012 153197 152237 152634 153851 154937 155597 156116 156550 156648 156481 156528 157068 157958
54184 157958 158981 160016 160852 161264 161272 161039 160569 159852 159215 159079 159399 159717 159776 159740 159838 160117 160479 160710 160531 159878
54164 159878 158978 157953 156659 155229 154355 154531 155375 156263 157260 158696 160161 160814 160559 160037 159483 158509 157128
54147 157128 156111 156032 156609 157238 157586 157542 157238 157247 158079 159326 160055 160213 160787 162291 163949 164919 165502 166469 167771
54128 167771 168701 169029 169267 169892 170785 171416 171357 170688 169981 169734 169824 169831 169829 170323 171402 172560 173494 174414 175362 175934
54108 175934 176007 176093 176490 176719 176316 175649 175371 175470 175423 175004 174413 173865 173502 173509 173897 174397 174854 175419 176091 176472 176372
54087 176372 176305 176955 178384 180087 181563 182586 183385 184844 188008 192921 198429 203628 208971 215302 222291
54072 222291 228623 233384 236367 237271 235649 231865 227212 222703 218276 213455 208281 203269 198866 195365
54058 195365 193036 191916 191525 191189 190752 190750 191715 193476 195347 196969 198586 200378 201944 202813 203205 203758 204759
54041 204759 206275 208828 213025 218387 223491 227681 231821 236865 242473 247738 252569 257448 262330 266732
54027 266732 270711 274750 278772 282141 284773 287441 290730 294313 297520 300095 302088 303471 304242 304673 305108
54012 305108 305605 305964 306017 305754 305200 304280 302836 300778 298114 294797 290655 285756 280748 276451 272980 269607
53996 269607 265702 261508 257837 255283 253844 252968 251734 249389 245996 242242 238494 234531 230403 226843
53982 226843 224297 222163 219714 217296 215821 215345 215021 214294 213365 212463 211506 210591 210175 210463 211144 211849 212448
53965 212448 212777 212597 212031 211637 211793 212291 212691 212830 212834 212867 213042 213468 214340 216015 218753 222266 225792 228959
53947 228959 232270 236267 240533 244177 247228 250765 255525 261007 266250 271017 275967 281968 289443 298021
53933 298021 306699 314725 322491 331242 341754 353772 366799 380722 395013 407755 416345 419400 417666
53920 417666 412981 406747 399593 392190 385848 381959 380924 381886 383695 386051 389474 394186 399306 403364
53906 403364 405596 406513 407125 407712 407609 406265 404143 402222 400780 399159 396758 393698 390352 386741 382685
53891 382685 378070 372608 365857 357991 350124 343207 336873 330074 322637 315424 308967 302785 296313 289874
53877 289874 284367 280349 277676 275742 273813 271322 268081 264184 259843 255470 251697 248839 246386 243445
53863 243445 239728 235774 232275 229640 228130 227807 228167 228341 227836 226677 224792 221919 218370 215244 213417
53848 213417 212720 212485 212500 212912 213568 214038 214111 213799 212994 211635 210178 209379 209522 210176 210782 211165 211403 211541 211620
53829 211620 211739 211859 211727 211204 210566 210271 210487 211090 212096 213757 216061 218418 220188 221388 222525 223796
53813 223796 224903 225756 226890 228819 231340 233834 236052 238206 240523 243193 246646 251307 256958 262719
53799 262719 267869 272408 276764 281222 285766 290206 294303 297922 301179 304308 307344 310067 312276 313942
53785 313942 315127 315923 316459 316686 316201 314561 311837 308594 305263 301822 298148 294338 290509 286531 282270
53770 282270 277923 273895 270335 266961 263366 259450 255572 252253 249656 247391 244953 242325 239991 238375
53756 238375 237419 236690 235745 234348 232557 230706 229203 228178 227255 225721 223013 219244 215287 212169 210265
53741 210265 209233 208717 208806 209635 210931 212343 213973 216017 218021 219060 218893 218477 219040 220795 222829 224187
53725 224187 224840 225493 226535 227483 227637 227143 226957 227695 229009 230300 231523 232910 234316 235415 236324 237500
53709 237500 239145 241159 243485 246027 248434 250501 252648 255424 258643 261662 264447 267695 271824 276449
53695 276449 280980 285139 288797 291911 294773 297744 300494 302094 302121 301188 300108 299020 297622 295876 294144
53680 294144 292927 292649 293322 294290 294730 294573 294428 294457 293998 292612 290848 289491 288545 287546 286453 285579 284907
53663 284907 284086 283022 281960 281036 280156 279257 278425 277801 277626 278208 279516 280955 281864 282186 282391 282823 283453
53646 283453 284193 285148 286467 288058 289560 290611 291233 291870 292906 294265 295693 297273 299184 301050 302151
53631 302151 302405 302553 303109 303764 304191 304807 306166 308062 309869 311521 313544 316349 320003 324498 329606 334590
53615 334590 338671 341916 345182 349158 353860 359122 365018 371545 378238 384490 390149 395611 401288 407060
53601 407060 412241 416104 418413 419472 419760 419679 419511 419313 418872 418044 417061 416112 414724 412224 409014 406639
53585 406639 406109 406672 406783 405786 404021 401765 398988 396023 393587 391968 390725 389340 387704 385926 384194
53570 384194 382883 382303 382171 381831 381184 380900 381434 382291 382718 382819 383469 385115 387091 388292 388344 387903 387883 388578
53552 388578 389662 390839 392181 393820 395669 397600 399688 401970 404116 405629 406345 406639 407192 408654 411351
53537 411351 415134 419623 424649 430255 436183 441822 447027 452697 460032 469269 479525 489812 499862
53524 499862 510013 520689 532023 543758 555498 567263 579703 593452 608399 623963 639999
53513 639999 657017 675471 695260 716076 737837 760530 783902 807547 831240 855016 878940
53502 878940 902843 926254 948695 970138 991012 1011610 1031692 1051012 1070084 1089890 1110697
53491 1110697 1131537 1151158 1169245 1186542 1203967 1221870 1240054 1258203 1276118 1293668 1310741
53480 1310741 1327420 1344107 1361186 1378441 1394991 1409948 1423014 1434336 1443997 1451833 1457577 1460910
53468 1460910 1461537 1459510 1455313 1449347 1441435 1431211 1418924 1405477 1391670 1377759 1363707 1349399
53456 1349399 1334464 1318328 1300784 1282320 1263644 1244967 1225974 1206406 1186493 1166822 1147923
53445 1147923 1129897 1112342 1094643 1076491 1058263 1040966 1025770 1013471 1004284 998042 994415 992813
53433 992813 992276 991864 991289 990931 991151 991909 993236 995674 999800 1005487 1012069 1019249 1027496 1037539 1049726
53418 1049726 1063913 1079692 1096650 1114574 1133530 1153686 1175082 1197643 1221368 1246369 1272759
53407 1272759 1300525 1329445 1359163 1389613 1421472 1455880 1493504 1534004 1576564 1620636 1666027
53396 1666027 1712669 1760737 1810709 1862826 1916576 1971049 2025711 2080542 2135602 2190791 2245818
53385 2245818 2300025 2352416 2402351 2450019 2495869 2539755 2581143 2619873 2656053 2689324 2718946
53374 2718946 2744619 2766520 2784470 2797757 2805955 2809194 2807359 2799668 2785417 2764545 2737142 2703081
53362 2703081 2662768 2617814 2570216 2520979 2470036 2417372 2363682 2309967 2256968 2205142 2154895
53351 2154895 2106606 2060478 2016442 1974228 1933566 1894293 1856161 1818573 1780777 1742385 1703585
53340 1703585 1664891 1626982 1590730 1556980 1526053 1497738 1471941 1449074 1429578 1413305 1399610
53329 1399610 1387807 1377275 1367329 1357310 1346817 1335617 1323384 1309791 1294901 1279348 1264036
53318 1264036 1249627 1236259 1223751 1212101 1201691 1192916 1185725 1179804 1175142 1172022 1170390 1169574 1168889
53305 1168889 1168376 1168795 1170987 1175274 1181318 1188519 1196665 1206169 1217534 1230768 1245714 1262766 1282618
53292 1282618 1305136 1329128 1353614 1378812 1405391 1433130 1460861 1487517 1512619 1535852 1556832
53281 1556832 1575485 1592200 1607305 1620610 1631721 1640621 1647597 1652530 1654531 1652557 1646425 1637035 1625440
53268 1625440 1611872 1595874 1577247 1556490 1534297 1510952 1486347 1460316 1432848 1404219 1375070
53257 1375070 1346101 1317544 1289145 1260722 1232457 1204467 1176515 1148474 1120820 1094255 1069068
53246 1069068 1045163 1022478 1000849 979537 957498 934358 910787 887684 865335 843673 823107
53235 823107 804552 788475 774250 760763 747591 735280 724494 715236 706961 699124 691352 683456
53223 683456 675626 668363 661654 654330 644840 632723 618911 604591 590317 576240 562471 548814
53211 548814 534759 520262 506194 493592 482743 473334 465045 457482 449928 441847 433539 425724 418579
53198 418579 411615 404366 396643 388244 379102 369765 361155 353637 346815 340362 334492 329405 324793 320321
53184 320321 316138 312462 308991 305261 301476 298421 296496 295265 294114 292969 292068 291230 289798 287417 284585
53169 284585 282245 280890 280266 279876 279485 278994 278080 276331 273785 271135 269210 268298 267995 267679 267093 266453 266015
53152 266015 265598 264648 262828 260445 258211 256691 256040 256104 256518 256752 256372 255451 254611 254524 255377 256822 258350
53135 258350 259644 260712 261841 263384 265365 267245 268271 268215 267653 267368 267536 267757 267811 268006 268632 269411 269849
53118 269849 269900 269916 269974 269691 268862 267926 267517 267667 267695 266892 265230 263366 261930 260919 259865 258561 257310 256269
53100 256269 254916 252687 250011 248092 247481 247360 246631 245317 244497 244984 246520 248235 249484 250065 249911 248959
53084 248959 247429 246032 245622 246450 247903 249097 249608 249519 249018 248397 248322 249494 251774 253977 254817 253977 252123
53067 252123 250223 248988 248677 248991 249243 248888 247955 246871 245969 245238 244446 243434 242352 241628 241523 241734 241702
53050 241702 241312 241010 241135 241560 242138 243056 244403 245714 246420 246547 246570 246690 246638 246192 245527 245029 245009 245632 246872
53031 246872 248454 249911 250773 250760 250013 249130 248705 248689 248498 247932 247660 248465 250288 252343 254042 255371 256530
53014 256530 257589 258518 259232 259592 259589 259501 259637 260024 260486 260924 261244 261212 260696 260007 259623 259621 259643 259395 258908 258422 258277
52993 258277 258832 260130 261633 262616 262877 262851 263075 263809 265098 266799 268512 269776 270455 270758 270917 271085 271523
52976 271523 272586 274492 277272 280855 284864 288403 290483 290818 289983 288863 288136 288171 288900 289728 289933 289348
52960 289348 288344 287187 285778 284049 282132 280011 277518 274906 272930 272008 271714 271463 271305 271553 271943 271819
52944 271819 271093 270444 270448 270925 271283 271136 270377 269007 267229 265570 264569 264236 264045 263544 262873 262574 262983 263901
52926 263901 264799 265210 264924 264043 262970 262211 262033 262356 263022 263989 265121 266008 266317 266219 266156 266255 266307 266382 267002 268409
52906 268409 269889 270195 268648 265736 262696 260636 259949 260311 261084 261785 262320 262899 263796 265073 266411 267217
52890 267217 267008 265810 264191 262934 262571 263017 263570 263497 262795 262241 262467 263179 263612 263577 263606 264047 264552 264706 264701
52871 264701 265004 265665 266409 267279 268684 270737 272928 274669 275913 277101 278637 280546 282489 283887 284197
52856 284197 283307 281661 279772 277628 274843 271415 267930 264829 261814 258369 254671 251491 249254 247679
52842 247679 246401 245422 244732 243969 242847 241720 241276 241722 242546 243027 242839 242280 242053 242667 243880 244840 245001
52825 245001 244675 244489 244545 244469 244112 243746 243577 243465 243270 243185 243536 244351 245274 245917 246293 246844 247931 249315 250388
52806 250388 250881 250965 250611 249378 247188 244795 242972 241558 239915 238030 236451 235284 234045 232538 231162
52791 231162 230104 228941 227396 225995 225542 226289 227970 230273 232873 235233 236865 237817 238673 240063 242212
52776 242212 244777 246963 248028 247890 247187 246569 246058 245220 243847 242177 240524 238926 237314 235895 235146 235275
52760 235275 235819 236070 235938 236044 236791 237712 238144 238258 238851 240190 241663 242671 243354 244191 245272 246285 247037
52743 247037 247663 248414 249378 250461 251588 252936 254795 257109 259415 261455 263578 266109 268627 270423 271532
52728 271532 272627 273865 274625 274545 274137 273929 273594 272428 270315 267816 265606 264093 263268 262563 261218 259156
52712 259156 257204 256086 255567 255009 254414 254338 255026 256150 257308 258207 258466 257889 257002 256759 257470 258455 258984 259190
52694 259190 259684 260591 261429 261903 262350 263170 264100 264396 263751 262705 262048 262017 262286 262505 262576 262471 262118 261461 260495
52675 260495 259294 258163 257557 257487 257238 256151 254600 253646 253711 254218 254601 254946 255436 255843 256115 256837 258482 260545
52657 260545 262104 263011 263973 265583 267871 270741 274165 277772 280668 282021 281705 280285 278462 276626 274810
52642 274810 272980 271281 269932 269002 268471 268445 268975 269636 269736 269113 268431 268437 269246 270555 272098 273543 274257 273709
52624 273709 272023 269845 267806 266354 265787 266049 266617 267007 267267 267699 268288 268806 269313 270073 271005 271640 271689 271341
52606 271341 271024 271079 271618 272437 273087 273313 273357 273646 274277 275058 275874 276698 277351 277586 277388 276955 276495 276232 276429
52587 276429 277108 277927 278630 279393 280403 281388 282037 282573 283301 283755 283035 281020 278617 276725 275568 275062 275117
52570 275117 275280 274814 273593 272384 271808 271471 270647 269461 268760 268949 269499 269609 268940 267691 266334 265368 265028
52553 265028 265124 265354 265774 266676 267942 268825 268616 267342 265615 263950 262500 261330 260545 260042 259560 259218 259666
52536 259666 261333 263718 265900 267613 269273 270986 272183 272504 272473 272857 273752 274726 275511 276059 276191 275776 275170
52519 275170 274979 275389 276109 276861 277571 278184 278819 280101 282790 286894 291538 295868 299726 303255 306149 307665
52503 307665 307250 305018 301607 297651 293463 289295 285762 283565 282554 281504 279353 276492 274244 273217
52489 273217 272808 272347 272011 272244 272827 273043 272557 271770 271369 271648 272247 272506 272312 272524 274244 277562 281373 284555
52471 284555 286854 288471 289355 289463 289442 290410 292957 296693 300798 304716 308264 311392 314046 316124 317345
52456 317345 317155 314999 310818 305311 299564 294331 289738 285692 282336 279862 278044 276333 274494 272894
52442 272894 272057 272180 273132 274621 276109 276807 276141 274259 271879 269632 267723 266239 265476 265697 266676 267817
52426 267817 268836 270051 271753 273479 274259 273615 272072 270702 270387 271403 273323 275215 276422 277316 278967
52411 278967 281927 285780 290068 295061 301227 308490 316514 325226 334352 342838 349496 353972 356303 355832
52397 355832 351674 344354 335936 328109 320951 313996 307726 303253 300964 300184 300044 300135 300373 300634 300724 300614
52381 300614 300719 301746 303986 306804 309274 311351 313910 317428 321203 324294 326844 329916 334218 339448
52367 339448 344797 349607 353460 355986 356920 356351 354842 353151 351722 350496 349301 348282 347728 347617 347667 347807
52351 347807 348237 349011 349957 351088 352673 354741 356909 358900 360895 363127 365497 367835 370344 373458 377417
52336 377417 382161 387470 393065 398752 404604 410896 417928 426117 436171 448630 463099 478410 493738
52323 493738 509208 525191 541533 557810 573889 589829 605559 621122 637039 654005 672354
52312 672354 692048 712886 734378 755756 776637 797538 819219 841593 863739 884926 905160
52301 905160 924680 943472 961521 979203 996949 1014495 1030622 1043808 1053178 1058853 1061496 1061709
52289 1061709 1059943 1056686 1052305 1046774 1039945 1032124 1023978 1015840 1007538 999115 991225 984575 979301 975228
52275 975228 972371 970796 970255 970374 971121 972810 975765 980118 985800 992552 1000167 1008819 1018841 1030056
52261 1030056 1041734 1053529 1066086 1080360 1096583 1114206 1132535 1151080 1169627 1188353 1207582
52250 1207582 1226901 1244694 1259052 1269111 1275358 1278869 1280604 1281084 1280210 1277459 1272596 1266028 1258175
52237 1258175 1248863 1237811 1225465 1212751 1200095 1187178 1173537 1158964 1143457 1127348 1111462
52226 1111462 1096691 1083287 1070826 1058777 1046833 1034960 1023550 1013368 1004908 997944 992117 987661
52214 987661 985014 983946 983725 984009 984961 986557 988468 990565 992892 995178 997004 998491 1000182 1002322 1004946
52199 1004946 1008520 1013564 1019587 1025394 1030714 1036540 1043476 1050765 1057445 1063514 1069140 1073592 1075976 1076494
52185 1076494 1075981 1074512 1071431 1066508 1060192 1052850 1044646 1036142 1028074 1020350 1012073 1002897 993733 985741
52171 985741 979207 973806 969476 966438 964632 963644 963162 963163 963730 965017 967283 970524 974037 976771 978295 979070
52155 979070 979606 979728 979075 978031 977511 977828 978370 978647 979107 980508 982826 985325 987459 989196 990538 991323
52139 991323 991600 991748 992025 992332 992584 993060 994290 996803 1001019 1007061 1014621 1023446 1034056 1047582 1064632
52124 1064632 1084635 1106533 1129780 1154423 1180574 1208148 1236849 1266034 1294817 1322734 1350160
52113 1350160 1377636 1404909 1431097 1455692 1478872 1500746 1520933 1539295 1556695 1574492 1593223
52102 1593223 1612027 1629411 1644395 1656902 1667240 1675379 1680743 1682582 1680440 1674287 1664380 1651178
52090 1651178 1635383 1617830 1599129 1579420 1558631 1537056 1515559 1495094 1476079 1458367 1441843
52079 1441843 1426828 1413789 1402757 1393227 1384663 1377041 1370943 1367196 1366401 1368655 1373575 1380566 1389114
52066 1389114 1398947 1410023 1422364 1435888 1450418 1465869 1482234 1499244 1516270 1532905 1549552
52055 1549552 1566902 1584707 1601472 1615671 1626957 1635948 1643159 1648504 1651492 1651472 1647900 1640858 1631256
52042 1631256 1620093 1607608 1593547 1578090 1561971 1545687 1529137 1512123 1494717 1476964 1458729
52031 1458729 1440089 1421502 1403287 1385168 1366626 1347560 1328475 1310147 1293120 1277298 1261940
52020 1261940 1246334 1230624 1215793 1202747 1191589 1181793 1172749 1164078 1155684 1147650 1139857 1131641 1122051
52007 1122051 1110548 1097248 1082494 1066462 1049178 1030586 1010641 989688 968717 948789 930192
51996 930192 912660 896351 881837 868961 856533 843654 830578 817710 804391 789525 772979
51985 772979 755586 738042 720616 703739 687970 673243 658839 644282 629760 615611 602054
51974 602054 589582 578993 570719 564538 560181 557840 557794 559845 563414 567925 572841 577662 582187 586569
51960 586569 590793 594231 595954 595413 592709 588381 583179 577869 572886 568124 563243 558219 553537 549886
51946 549886 547825 547692 549682 553965 560715 569985 581516 594760 609121 624092 639066 653295 666200
51933 666200 677611 687391 694890 699129 699665 696992 691911 684688 675054 662875 648586 633080 617460
51920 617460 602838 590004 579104 569834 562091 556352 553414 553995 558620 567487 580152 595544 612517
51907 612517 630184 647399 662220 672417 676680 675140 668831 658923 646348 631604 614785 596109
51895 596109 576443 556897 537912 519295 501327 485219 472067 461793 453644 447325 443047 440690
51883 440690 439689 439829 441532 445128 450329 456709 464316 473348 483365 493233 501901 508988 514536 518404
51869 518404 520164 519598 517138 513643 509745 505491 500653 495299 490003 485582 482669 481480 481825 483249 485201
51854 485201 487183 488848 489997 490427 489770 487586 483670 478219 471686 464574 457385 450522 444073 437914 432201
51839 432201 427489 424039 421288 418580 416238 415296 416134 418020 420142 422398 424800 426753 427538 427190 426324
51824 426324 425285 423921 422045 419670 416926 414247 412505 412456 413957 416098 418160 420110 422097 423905 425095
51809 425095 425514 425424 425209 424969 424402 423134 421294 419617 418769 418677 418749 418633 418474 418462 418464 418177 417425 416245 414789
51790 414789 413122 411008 408034 404205 400381 397797 397046 397633 398483 398704 397955 396459 394808 393621 393307 394159
51774 394159 396505 400517 405943 412311 419402 427330 436147 445610 455295 464662 473051 479901 485026 488468
51760 488468 490103 489714 487463 483865 479187 473265 466176 458743 452007 446319 441236 436267 431451 427102
51746 427102 423212 419387 415530 412433 411265 412306 414584 417141 420375 425481 432705 440905 448966 456815
51732 456815 464618 471650 476762 479661 481080 481869 482640 484232 487635 492903 498500 502169 502478 499548 494553
51717 494553 488806 483221 478322 474516 472053 470609 469121 466479 462483 457859 453358 449228 445673 443300
51703 443300 442598 443111 443618 443128 441459 438942 436090 433637 432469 433051 434985 437314 439127 439794 438889 436318
51687 436318 432567 428484 424645 420982 417084 412795 408499 404918 402701 402131 403035 404872 406877 408329 409002
51672 409002 409446 410669 413369 417639 423459 431132 440926 452463 464901 477591 490038 501118 508898
51659 508898 511698 509302 503010 494713 486048 478143 471726 467301 465232 465603 468018 471700 475759 479253
51645 479253 481016 479876 475301 467714 458099 447454 436674 426568 417641 409974 403487 398223 394270
51632 394270 391599 390081 389433 389103 388609 388191 388667 390273 392045 392870 392836 392952 393720 394649 395126 395054 394503 393368
51614 393368 391724 390097 389039 388607 388487 388415 388317 388230 388304 388660 389149 389470 389710 390529 392555 395767 399731 404384
51596 404384 410350 418435 428857 440803 452531 461918 467263 467902 464312 457728 449602 441235 433669 427693
51582 427693 423776 421964 421958 423497 426742 432261 440560 451478 463953 476512 488299 499776 512181
51569 512181 526152 540938 554999 567210 577568 587202 597922 611437 628546 649213 673577 702511
51557 702511 736580 774543 813319 849515 880707 905497 923051 932942 935232 930467 919585 903633
51545 903633 883221 858275 828667 795132 759312 722946 687346 653575 622617 595164 571476
51534 571476 551495 534748 520160 506521 493439 481544 471575 463587 457216 452282 448739 446214 443909
51521 443909 441023 437250 433094 429746 428256 428643 430036 431759 433958 437009 440802 444906 448992 452580
51507 452580 454666 454264 451404 447242 443064 439444 436292 433366 430547 427839 425280 422846 420365 417595
51493 417595 414401 410943 407660 405003 403029 401297 399268 396862 394446 392280 390191 387835 385134 382359
51479 382359 379916 378059 376672 375313 373661 371856 370185 368547 366591 364330 362096 359855 357139 353908
51465 353908 350930 348893 347606 346496 345519 344997 344918 345024 345478 346757 348860 351147 353105 354889 357003 359774
51449 359774 363276 367469 372308 378001 385197 394609 406226 419029 431544 442516 451167 457267 461200
51436 461200 463710 465341 466162 466057 464936 462483 458013 451060 442137 432585 423601 415607 408564 402516 397496
51421 397496 393152 389035 385333 382911 382306 382953 383780 384396 385293 386928 389148 391623 394385 397624 401250
51406 401250 404967 408578 411930 414774 416959 418678 420269 421880 423541 425386 427465 429475 431090 432565
51392 432565 434658 437853 441939 446490 451538 457670 465688 476361 490336 508069 529759 555415 585014
51379 585014 618602 656331 698449 745101 795821 848914 901301 949303 989979 1021836 1044338
51368 1044338 1057053 1059645 1052455 1036491 1012680 981633 944336 902541 858032 811906 765065 719039
51356 719039 675611 635755 599527 567001 538606 514431 493868 476273 461489 449357 439230
51345 439230 430479 423104 417248 412248 406831 400383 393552 387502 382914 379807 377782 376110 373983 371219
51331 371219 368550 366726 365408 363470 360449 357138 354539 352785 351444 350442 350024 350084 350193 350332 350996 352466
51315 352466 354455 356650 359157 362164 365499 368809 371896 374653 376966 378892 380717 382610 384450 386099
51301 386099 387483 388184 387419 384839 381030 376784 372232 367252 362438 358783 356321 353863 350548 347185 345554
51286 345554 346535 349306 352338 354849 357210 360175 363966 368136 372145 375809 379209 382359 385083 387083
51272 387083 388070 388003 387350 386921 387260 388305 389740 391439 393420 395613 397928 400321 402452 403515 402812 400478
51256 400478 397322 394061 390998 388257 385826 383351 380369 376883 373437 370584 368555 367430 367241 367748 368501
51241 368501 369218 369872 370306 370150 369255 367919 366487 364992 363391 361839 360489 359147 357419 355172 352754
51226 352754 350839 350084 350711 352290 354051 355462 356397 356829 356773 356648 357276 359149 361888 364740 367401 370063
51210 370063 372847 375689 378773 382586 387311 392473 397389 401744 405520 408584 410709 411880 412207 411529 409542
51195 409542 406511 403454 401234 399666 397931 395697 393357 391192 388957 386544 384470 383294 382867 382581 382148
51180 382148 381681 381257 380867 380734 381156 382039 383001 383963 385228 386877 388507 389705 390461 390933 391153 391246 391715 393152
51162 393152 395596 398293 400193 400818 400709 400918 401909 403041 403328 402527 401259 400262 399901 400309 401449 402926
51146 402926 404102 404596 404403 403473 401601 398869 395860 393207 391201 389966 389593 389805 389812 388940 387302 385562
51130 385562 384136 382918 381709 380686 380374 381289 383521 386586 389759 392626 395228 397669 399770 401259 402182
51115 402182 403038 404591 407458 411615 416273 420572 424483 428638 433165 437158 439699 440997 441988 443133 444167
51100 444167 444894 445543 446202 446493 446082 445087 443733 441956 439698 437363 435530 434358 433603 433204 433404 434181 434913
51083 434913 434888 434043 432939 432105 431644 431406 431214 430850 430096 429006 427986 427471 427656 428661 430692 433782 437528
51066 437528 441460 445653 450728 457257 465450 475398 487262 501020 516127 531475 545655 557453 566570
51053 566570 574004 581528 590605 601814 615086 630010 645765 661115 674897 686524 695885 702820
51041 702820 706720 706624 701838 692783 681305 669761 659546 650485 641535 631743 620504 607501 592952
51028 592952 577838 563515 550994 540660 532575 526810 523404 522116 522362 523564 525628 528902 533559
51015 533559 539220 545448 552340 560162 568522 576519 583819 591000 598656 606695 614813 623133 631963 641318
51001 641318 651080 661234 671584 681648 691325 701271 712025 723092 733550 743298 752957 762628 771539
50988 771539 779045 785305 790818 795988 801429 808160 816980 827866 840190 853290 866745 880521 895096
50975 895096 911113 928742 947882 969273 994829 1026240 1063538 1105660 1152246 1204122 1261974
50964 1261974 1325236 1392614 1463230 1536827 1613198 1691788 1771651 1851290 1928555 2001070 2066894
50953 2066894 2124691 2173512 2212829 2242867 2264438 2278241 2284584 2283947 2277541 2267075 2254231 2240520
50941 2240520 2227134 2214304 2200907 2185400 2167295 2147285 2125857 2102414 2076156 2047329 2017073
50930 2017073 1986141 1954223 1920452 1884096 1844670 1801767 1755148 1704970 1651837 1596687 1540618
50919 1540618 1484738 1430002 1377139 1326714 1279224 1235076 1194435 1157151 1122971 1091851 1063926
50908 1063926 1039124 1016943 996779 978323 961487 946001 931384 917294 903779 891233 880203
50897 880203 871092 863793 857688 852257 847540 843776 840835 838491 837023 836918 837955 839242 840344 841764
50883 841764 844111 847383 851381 856213 861971 868436 875595 883985 893916 904763 915685 926791 938965
50870 938965 952772 968149 985113 1004014 1025041 1048051 1073122 1100813 1131737 1166157 1204230
50859 1204230 1246377 1293344 1346046 1405403 1472174 1546982 1630594 1724007 1828032 1942906 2068499
50848 2068499 2204691 2351213 2507342 2672063 2844292 3022516 3204402 3387187 3568130
50839 3568130 3743914 3909741 4059894 4189529 4295619 4376399 4430821 4458932 4462062 4442143
50829 4442143 4401323 4342711 4271070 4192133 4111250 4032795 3960366 3896728 3843387 3800408 3766661
50818 3766661 3740035 3717510 3695417 3669873 3637160 3594104 3538645 3470220 3389412 3297025 3193442
50807 3193442 3078918 2954514 2822746 2687249 2551672 2418778 2290431 2168185 2053701
50798 2053701 1948662 1854403 1771468 1699407 1637191 1584040 1539705 1503725 1474764 1451189 1432193
50787 1432193 1417823 1407859 1401244 1396747 1393632 1391379 1389281 1386787 1383927 1380879 1377218 1372002 1364619 1355260
50773 1355260 1344543 1332884 1320277 1306537 1291691 1276111 1260124 1243507 1225539 1205749 1184521
50762 1184521 1162877 1141818 1121962 1103666 1087189 1072717 1060378 1050362 1042960 1038442 1036813 1037655
50750 1037655 1040307 1044389 1050195 1058536 1070274 1086068 1106357 1131223 1160311 1193300 1230661 1273632
50738 1273632 1323199 1379295 1441251 1508827 1582435 1662301 1747733 1837308 1929654 2023860 2119305
50727 2119305 2215379 2311464 2406898 2500599 2590725 2674999 2751440 2818450 2874093 2915683 2940546
50716 2940546 2947066 2934968 2905103 2859663 2802388 2737855 2670315 2603386 2540425 2484255 2436328
50705 2436328 2396816 2365751 2343360 2328908 2319875 2313039 2306095 2297697 2286225 2269239 2244251 2209621
50693 2209621 2164742 2109905 2046286 1975891 1901247 1824984 1749565 1677219 1609913 1549124 1495390
50682 1495390 1448302 1407436 1373347 1347212 1329410 1319011 1314958 1317176 1325995 1340924 1360650 1384079
50670 1384079 1410708 1439961 1470718 1501620 1531464 1559244 1584258 1606353 1625806 1642862 1657630
50659 1657630 1670482 1682253 1693897 1706086 1719034 1732456 1745611 1757741 1768684 1779063 1789995
50648 1789995 1802764 1818592 1838262 1861909 1889491 1921490 1958735 2001414 2048601 2098912 2151253
50637 2151253 2204756 2258398 2311064 2361687 2409137 2452463 2491715 2528146 2562976 2596235 2627417
50626 2627417 2656768 2684450 2707860 2720974 2717639 2695677 2657584 2608145 2552462 2495724 2442819
50615 2442819 2396892 2358772 2328501 2306853 2294616 2290855 2292941 2298293 2305264 2312229 2316727 2316014 2308019
50602 2308019 2291412 2265261 2229167 2183500 2129133 2067225 1999628 1929075 1858216 1788468 1720310
50591 1720310 1654619 1592950 1536345 1484555 1436928 1393532 1354791 1320341 1289030 1260078 1233569
50580 1233569 1209608 1187638 1167053 1148057 1131375 1117351 1105874 1097081 1091495 1089328 1090137 1093413
50568 1093413 1099170 1107669 1118836 1132170 1147052 1163027 1180081 1198883 1220407 1244996 1272046 1300899
50556 1300899 1331741 1365183 1401107 1438380 1475584 1511640 1545825 1577747 1607402 1635008 1660775
50545 1660775 1685079 1708762 1732843 1758011 1784783 1814030 1846881 1884101 1926128 1973729 2027971
50534 2027971 2089239 2156767 2229575 2307716 2392419 2485251 2587219 2698240 2817142 2942245
50524 2942245 3072023 3205112 3339757 3473579 3603904 3727985 3842975 3946144 4035152 4107688
50514 4107688 4160907 4191987 4199543 4183953 4146208 4087148 4008243 3912408 3803407 3684858 3560348
50503 3560348 3434118 3310902 3195200 3090964 3001598 2929678 2876756 2843614 2830348 2835844 2857740
50492 2857740 2893460 2940810 2996862 3056546 3113192 3160329 3192507 3204987 3194047 3158177 3098412
50481 3098412 3017276 2917863 2803884 2679747 2549897 2418203 2287999 2162188 2042961 1931627
50471 1931627 1828915 1735238 1650631 1574726 1506952 1446560 1392587 1344258 1301585 1265199 1235413
50460 1235413 1211747 1193488 1180313 1172053 1168143 1167639 1169632 1173382 1178113 1183015 1187589 1191977 1196866
50447 1196866 1203079 1211182 1221415 1233826 1248293 1264455 1281874 1300161 1318647 1335924 1350269 1360870
50435 1360870 1368313 1373688 1377693 1380924 1384345 1388703 1393786 1399086 1404982 1412518 1422133 1433401 1446022
50422 1446022 1460216 1476019 1493074 1511485 1532164 1555999 1583305 1614506 1650675 1692786 1740770
50411 1740770 1793735 1850754 1910951 1973259 2036680 2100650 2164706 2227910 2288963 2346709 2400124
50400 2400124 2447861 2488124 2518940 2538485 2545386 2539013 2519318 2486273 2439770 2380433 2310318 2232518
50388 2232518 2150258 2066611 1984649 1907182 1836277 1773374 1719780 1676630 1644387 1622823 1611561
50377 1611561 1610317 1618509 1634885 1657567 1684226 1712118 1738275 1759811 1774025 1778437 1771293 1752368
50365 1752368 1723000 1685053 1639894 1588522 1532436 1473957 1415538 1358879 1304700 1253149 1204276
50354 1204276 1158190 1114981 1074660 1037248 1002993 972456 946259 924563 906805 892093 879957
50343 879957 870660 864769 862514 863573 867360 873508 882223 894178 909749 928024 946688 963005 974946
50330 974946 981429 982067 977258 968426 957595 946439 935951 926941 920408 917145 917182 919819 924060 928990
50316 928990 933943 938548 942611 945965 948524 950419 951874 952974 953768 954544 955741 957543 959753 962118 964511
50301 964511 966849 969078 971320 973804 976676 980098 984365 989533 995093 1000626 1006776 1014872 1025349 1037278
50287 1037278 1049822 1063339 1078142 1092485 1102678 1105381 1099535 1086436 1068729 1049446 1031218 1015711
50275 1015711 1003697 995560 991460 991016 993229 997034 1001788 1007080 1012194 1016118 1018255 1018988 1019267 1019515 1019180
50260 1019180 1017610 1015161 1012988 1011779 1011230 1010931 1011214 1012710 1015501 1019221 1023826 1029909 1038342 1049978
50246 1049978 1065454 1084883 1107739 1133342 1161272 1191033 1221638 1252090 1282143 1311960 1341064
50235 1341064 1368317 1393221 1416636 1439802 1462840 1484365 1502206 1514252 1518940 1515429 1503483 1483261
50223 1483261 1455485 1421779 1384380 1345250 1305677 1266938 1230876 1199325 1173008 1151309 1132985
50212 1132985 1116703 1100932 1083867 1063903 1040310 1013505 984841 956025 928413 902582 878595
50201 878595 856680 837484 821535 808536 797419 787177 777616 769190 762109 755714 748894 741117 732928
50188 732928 725314 718732 712911 707523 702721 698845 695797 692921 689513 685331 680628 675843 671326 667236
50174 667236 663673 660824 658937 658024 657646 657172 656362 655561 655261 655577 656232 656959 657778 658956 660857 663800 667928
50157 667928 673165 679360 686417 694241 702590 711166 719774 728287 736411 743598 749300 753315 755851 757307
50143 757307 757974 758009 757757 758009 759749 763674 770172 779772 793215 810825 832134 856537 884203 916024
50129 916024 952758 994533 1041006 1091510 1145058 1200667 1257777 1315950 1374151 1430922 1485550
50118 1485550 1538701 1591581 1644717 1697695 1749465 1798376 1842079 1877960 1903722 1917386 1917132 1901838
50106 1901838 1872014 1829798 1777825 1718253 1652977 1584397 1515410 1448484 1384871 1324909 1269004
50095 1269004 1218084 1173077 1134169 1100768 1071976 1046772 1023982 1002614 982474 964118 948016
50084 948016 933986 921593 910795 901932 895195 890450 887503 886354 887102 889611 893265 897138 900588 903627
50070 903627 906485 908898 910178 909968 908496 905975 902302 897624 892731 888410 884657 880908 876767 872121
50056 872121 866787 860679 854239 848235 842973 838098 833226 828517 824528 821826 820788 821532 823835 827226
50042 827226 831374 836390 842732 850756 860284 870698 881544 892953 905205 917990 930526 942521
50030 942521 954485 966807 978954 989943 999207 1006553 1011660 1014339 1015156 1015123 1014711 1013684 1011965 1010133
50016 1010133 1008881 1008410 1008593 1009478 1011477 1015317 1021935 1032140 1046154 1063605 1084050 1107367 1133589
50003 1133589 1162530 1193640 1226144 1259296 1292589 1325676 1358053 1389015 1418138 1445493 1470965
49992 1470965 1493337 1510343 1519546 1518925 1506912 1482623 1446408 1399900 1345421 1285570 1223339 1161941
49980 1161941 1103955 1050644 1002278 958882 920529 887119 858251 833387 811983 793482 777267
49969 777267 762706 749346 737083 726038 716152 707081 698689 691507 686390 683667 682868 683279 684621 687159
49955 687159 691386 697543 705267 713696 722058 730068 737610 744280 749597 753562 756564 758777 760038 760306
49941 760306 759814 758658 756533 752930 747353 739455 729400 718030 706140 693662 680151 666091 652885
49928 652885 641274 630565 619990 610171 602464 597198 593405 590202 587767 586830 587692 589896 592568 594989
49914 594989 597012 598994 601243 603729 606529 610283 615774 623123 631750 641125 651162 661919 673353
49901 673353 685519 698560 712173 725294 736557 745052 750506 753007 752865 750662 746995 741902 734747
49888 734747 724975 713045 700402 688404 677330 666492 655156 643208 631025 619035 607528 596793
49876 596793 587250 579379 573415 569105 565872 563290 561315 560013 559258 558925 559253 560750 563736 568174 573891
49861 573891 580774 588765 597880 608142 619355 631123 643316 656201 669651 682481 693253 701729
49849 701729 708862 715249 720325 723352 724452 724116 722162 717803 710514 700442 688320 675399 663128
49836 663128 652274 642513 633303 624917 618115 613035 609053 605724 603242 601958 602004 603457 606319 610235
49822 610235 614771 620177 627353 636742 647642 658951 670201 681388 692044 701133 707986 713053 717484
49809 717484 721999 726265 729287 730356 729500 727037 722923 716868 709024 700242 691524 683391 675856 668666
49795 668666 661376 653401 644399 634666 625032 616426 609533 604638 601443 599122 596928 594845 593456 593099
49781 593099 593443 593985 594651 595627 596911 598467 600734 604443 609758 615983 622348 628776 635584 642686 649546
49766 649546 655812 661564 666908 671681 675641 678631 680412 680667 679343 676782 673319 668926 663345 656369
49752 656369 647884 638022 627551 617822 609874 603646 598407 593820 590153 587483 585250 582823 580168 577708
49738 577708 575722 574068 572378 570421 568495 567553 568563 571469 575100 578466 581933 586590 592645 599126
49724 599126 605317 611836 619909 630006 641608 653925 666226 677732 687860 696637 704327 710565 714327
49711 714327 714888 712319 706934 698864 688567 677241 666250 656337 647790 640940 635944 632251 628983 625858
49697 625858 623238 621255 619475 617601 616104 615846 617281 620239 624230 628783 633583 638512 643637 649192
49683 649192 655585 663252 672355 682706 694163 707021 721819 738834 757785 777734 796957 813183
49671 813183 824541 830438 831485 828881 824129 818921 814543 811394 809541 809563 812088 816500 820747 822580
49657 822580 820452 813363 800954 784280 765704 747270 729550 712423 696375 682371 670838 661494
49645 661494 654027 648388 644561 642573 642635 644752 648172 651598 654016 655129 655134 654307 652699 649980 645736 640127
49629 640127 633989 628007 622091 615944 609927 604802 600793 597491 594618 592242 590211 588024 585631 583897
49615 583897 583799 585320 587430 589119 590188 591081 592178 593436 594630 595730 596926 598368 599999 601620 602994
49600 602994 604028 605017 606561 608929 611544 613491 614543 615274 616195 617308 618636 620527 623071 625739 628058
49585 628058 630261 632721 635131 636807 637651 638241 639062 640125 641348 642855 644839 647372 650372 653640 657109
49570 657109 661253 666965 674674 683792 693350 702956 712782 722922 733263 743697 753831 762588 768749
49557 768749 771990 772930 772129 769550 765142 759461 753459 747924 743305 739783 737314 735684 734617 733824 733077
49542 733077 732441 732285 732876 734065 735548 737187 738806 740034 740872 742263 745575 751529 760016 770791 783791
49527 783791 798881 816008 835753 859081 886013 914824 942765 967407 987246 1001518 1009994 1013053
49515 1013053 1011817 1008078 1003886 1000897 999984 1001366 1004848 1009626 1014091 1016310 1014857 1009077 998780 984092
49501 984092 965705 944935 923419 902717 883915 867230 852053 837729 824344 812590 802997 795458
49489 795458 789367 783941 778713 774049 770926 769791 769851 769946 769808 769894 770265 770444 770322 770421 771103 772204 773603
49472 773603 775507 777867 780067 781614 782780 784260 786405 789047 791909 795023 798751 803293 808076 811887
49458 811887 813915 814368 813727 811826 808303 803601 798654 793701 788265 782323 776581 771456 766624 761856 757491
49443 757491 753706 750097 746463 743437 741913 742210 744004 746636 749346 751879 755156 760704 769120 779676
49429 779676 791664 805339 821113 838613 857151 876517 896684 917134 936874 954576 968261
49418 968261 975642 975717 969867 960860 951162 942586 936762 934853 936919 942314 950576 961361 973766 986559
49404 986559 999108 1011538 1024007 1036406 1048667 1060769 1072387 1083087 1092974 1102741 1112916 1123343
49392 1123343 1133423 1142567 1150317 1156249 1159900 1160843 1158955 1154615 1148410 1140596 1131130 1120278 1108753
49379 1108753 1097073 1085263 1073476 1062484 1053189 1045971 1040819 1037738 1036670 1037406 1039931 1044436 1050580
49366 1050580 1057177 1063064 1067964 1072135 1075587 1078100 1079488 1079294 1076697 1071410 1064339 1056782 1049312 1042063
49352 1042063 1035585 1030508 1026610 1023098 1019750 1017069 1015428 1014727 1014731 1014992 1014639 1013072 1010824 1008827 1006824
49337 1006824 1003429 997992 991584 985807 981291 977669 974400 971294 968670 967293 967706 969421 971220 972428
49323 972428 973503 975273 978191 982502 988499 996102 1004504 1012662 1020067 1026928 1033882 1041632 1050533 1060312
49309 1060312 1070410 1080725 1091854 1104585 1119419 1136555 1155906 1176898 1198319 1218338 1234650
49298 1234650 1245078 1248702 1246372 1239750 1229963 1217613 1203670 1189388 1175257 1160921 1146384 1132496
49286 1132496 1119884 1108149 1096616 1085336 1074800 1065088 1055850 1046918 1038588 1031509 1026510 1024184 1024300
49273 1024300 1025935 1028425 1031861 1036426 1041723 1047136 1052408 1057343 1061257 1063391 1063809 1063495 1063525 1064423 1066217
49258 1066217 1068908 1073000 1079754 1090641 1106128 1125106 1145599 1165708 1183522 1196656 1202819 1201115
49246 1201115 1192327 1177832 1158609 1135489 1109845 1083576 1058434 1035553 1015447 998173 983518
49235 983518 971428 962400 957230 956078 957894 961119 964982 969846 976230 983944 992466 1001763 1012184 1023664
49221 1023664 1035523 1047132 1058375 1069421 1080388 1091272 1101834 1111480 1119621 1126249 1131835 1136637
49209 1136637 1140633 1144401 1149478 1157308 1167991 1180462 1193786 1207893 1223138 1239524 1256512 1273356
49197 1273356 1289501 1304750 1319137 1332699 1345408 1357245 1368213 1378233 1387139 1394846 1401450 1407267
49185 1407267 1412898 1419140 1426524 1434967 1444200 1454621 1467444 1483898 1504593 1529826 1560092 1596018
49173 1596018 1637963 1685850 1738963 1795216 1850560 1899694 1937927 1962815 1974521 1975220 1968302 1957616
49161 1957616 1946688 1938005 1932720 1930747 1931076 1932235 1932927 1932641 1931748 1930947 1930702 1931198 1932678 1935550 1940169
49146 1940169 1946676 1955022 1964974 1976174 1988433 2001853 2016424 2031645 2047022 2062819 2079723 2097707
49134 2097707 2115932 2133960 2152281 2171230 2190128 2208210 2225782 2243652 2261828 2279630 2296916
49123 2296916 2314329 2332446 2351396 2371322 2392493 2414915 2438486 2463676 2491627 2523710 2561489
49112 2561489 2606990 2662432 2729854 2811568 2910291 3027061 3158109 3294640 3427020 3550258
49102 3550258 3666387 3781568 3898860 4010928 4099399 4144235 4137023 4086430 4010729 3924779 3832897
49091 3832897 3731534 3616783 3489862 3357522 3228472 3109348 3003330 2911459 2834060 2770709
49081 2770709 2719945 2679835 2648590 2624313 2604797 2588203 2573561 2560261 2547576 2535153 2523466
49070 2523466 2513162 2504257 2496362 2489231 2482555 2475716 2468330 2460706 2453247 2445781 2437968 2429899 2421705 2413165
49056 2413165 2404396 2396429 2390176 2385059 2379576 2373100 2366331 2360054 2354312 2348994 2344557 2341856 2341621 2344151
49042 2344151 2349161 2355905 2363632 2371869 2380050 2387268 2392759 2396365 2398200 2398381 2397620 2397442 2398861 2401101 2402587
49027 2402587 2403073 2403789 2405429 2407009 2407089 2405388 2402789 2400356 2398779 2398332 2398982 2400672 2403569 2407759 2412747
49012 2412747 2417734 2422451 2427312 2432706 2438614 2445016 2452129 2460035 2468468 2477151 2485953 2494557 2502366 2508963
48998 2508963 2514394 2518876 2522536 2525541 2528133 2530368 2532071 2533152 2533714 2533772 2533188 2531954 2530243 2528095 2525337
48983 2525337 2521915 2518122 2514447 2511317 2508838 2506420 2502931 2497749 2491602 2485800 2480590 2474880 2467694 2459215
48969 2459215 2450173 2440936 2431687 2422943 2415275 2408758 2403203 2398795 2396080 2395430 2396896 2400515 2406412 2414591
48955 2414591 2424810 2436634 2449445 2462568 2475693 2489180 2503697 2519478 2535945 2552085 2567174
48944 2567174 2581313 2595405 2610597 2627655 2646856 2668397 2692640 2719853 2749831 2782032 2816069
48933 2816069 2852005 2890117 2930458 2972703 3016466 3061712 3108793 3158011 3209245 3262033 3315938
48922 3315938 3370847 3426973 3484613 3543679 3603431 3662856 3721375 3779021 3835880 3891720 3946292
48911 3946292 3999583 4051442 4101291 4148683 4193932 4237747 4280342 4321301 4360249 4397256 4432657
48900 4432657 4466822 4500038 4532162 4562459 4590176 4615317 4638516 4660134 4679857 4697108 4711419
48889 4711419 4722327 4729430 4732733 4732671 4729598 4723512 4714278 4701832 4686078 4666972 4644828 4620241 4593479
48876 4593479 4564206 4531943 4496573 4458184 4416621 4371497 4322674 4270679 4216578 4161423 4105772
48865 4105772 4049796 3993828 3938582 3884708 3832355 3781392 3731868 3684072 3638367 3595141 3554674
48854 3554674 3516820 3481115 3447585 3417075 3390361 3367193 3346723 3328676 3313538 3301766 3293337
48843 3293337 3287954 3285165 3284359 3285179 3287837 3292618 3299331 3307803 3318586 3332333 3348659 3366449 3385248
48830 3385248 3405385 3426704 3448238 3469441 3490833 3513003 3535754 3558670 3581772 3605134 3628503
48819 3628503 3651801 3675364 3699287 3723099 3746598 3770369 3794963 3820104 3845255 3870422 3895798
48808 3895798 3921134 3946124 3971018 3996223 4021726 4047556 4074400 4102918 4132704 4162739 4192704
48797 4192704 4223024 4253538 4282929 4309746 4333557 4354912 4374596 4393140 4410704 4427165 4442297
48786 4442297 4455909 4467734 4477251 4483714 4486239 4483837 4475777 4462153 4443921 4422093 4397095 4369069
48774 4369069 4338349 4305217 4269497 4230966 4190092 4147812 4104556 4059864 4013126 3964396 3914410
48763 3914410 3864006 3813633 3763328 3713127 3663466 3615066 3568423 3523682 3481036 3440912 3403535
48752 3403535 3368604 3335711 3304787 3275839 3248519 3222374 3197388 3173937 3152330 3132757 3115644
48741 3115644 3101680 3091412 3084926 3081781 3081093 3081822 3083223 3084921 3086494 3087356 3087410 3087535 3088949 3092133 3096657
48726 3096657 3101883 3107434 3113135 3118993 3125269 3132118 3139083 3145257 3150064 3153508 3155615 3156056 3154538 3151280
48712 3151280 3146813 3141557 3135923 3130724 3126975 3125092 3124492 3124279 3124223 3124795 3126283 3128287 3130267 3132189 3134287
48697 3134287 3136460 3138409 3140265 3142584 3145690 3149453 3153701 3158299 3162686 3165903 3167455 3167873 3168186 3169074 3170712
48682 3170712 3173069 3176119 3179919 3184617 3190112 3195675 3200267 3203405 3205311 3206135 3205527 3203236 3199620 3195211
48668 3195211 3190218 3184661 3178463 3170946 3160684 3146427 3127934 3105589 3079620 3050127 3017392 2981491
48656 2981491 2941989 2898774 2853067 2806954 2762017 2719038 2678834 2642507 2610610 2582649 2557741
48645 2557741 2535265 2514641 2494878 2474872 2454127 2432935 2411776 2390708 2369431 2347953 2326986
48634 2326986 2307476 2289749 2273304 2257318 2241023 2223646 2204666 2184512 2164624 2146356 2129915
48623 2129915 2114531 2099450 2084605 2070650 2058601 2049186 2042260 2037066 2033236 2031138 2031080 2032654 2035221
48610 2035221 2038590 2042734 2047152 2051011 2053706 2054891 2054310 2052159 2049481 2047762 2048038 2050526 2054769 2059831
48596 2059831 2064630 2068504 2071349 2073123 2073581 2072673 2070649 2067348 2061900 2053674 2043161 2031464 2019262 2006750
48582 2006750 1994188 1981879 1969891 1958324 1947587 1937950 1929175 1921095 1914247 1909444 1906990 1906763 1908606
48569 1908606 1912156 1916763 1922091 1928310 1935084 1940973 1944568 1945634 1944319 1939912 1931501 1919435 1904992
48556 1904992 1888933 1871616 1854273 1838750 1825773 1814552 1804217 1794535 1785018 1774436 1761807 1747158
48544 1747158 1731013 1713773 1695913 1678144 1661109 1645272 1631044 1618492 1607085 1596429 1587078
48533 1587078 1579788 1574152 1568964 1563886 1559723 1557082 1555939 1556711 1560562 1568252 1579575 1594050 1610834
48520 1610834 1627400 1639522 1643624 1638761 1626198 1608128 1587297 1566587 1547780 1531087 1516547 1505184
48508 1505184 1498135 1495320 1495903 1499530 1506256 1515577 1526453 1538177 1550629 1563837 1577825 1592580 1607363
48495 1607363 1619920 1627020 1626188 1617067 1601320 1581457 1559579 1536828 1513691 1490545 1467782 1445767
48483 1445767 1425126 1406903 1391801 1379257 1367857 1356851 1346813 1338724 1332853 1328615 1325065 1321458
48471 1321458 1317716 1314432 1312061 1310247 1308471 1307081 1306918 1308023 1309562 1311123 1313307 1316919 1322249 1329101
48457 1329101 1336676 1343373 1347666 1349364 1349225 1347319 1342825 1335663 1327187 1318813 1310907 1303350 1296196 1289259
48443 1289259 1281937 1273991 1265723 1257057 1247371 1236644 1225794 1215447 1205335 1195347 1186042 1177554 1169168
48430 1169168 1160758 1153527 1148427 1144768 1141360 1138096 1135422 1133097 1130568 1127886 1125223 1122117 1118155 1113805
48416 1113805 1109601 1105130 1099886 1094531 1090150 1086606 1082758 1078048 1072932 1067943 1063280 1059167 1055768 1052822
48402 1052822 1049962 1047211 1044549 1041352 1036970 1031687 1026452 1021778 1017354 1012526 1006768 1000040 993027 986654
48388 986654 981090 975696 970156 964950 960420 956280 952406 949158 946322 942805 938159 933475 929932 927381
48374 927381 925208 923601 922810 922006 920100 917200 914229 911607 909227 907189 905615 904245 903046 902636 903292
48359 903292 904217 904647 904969 905903 907298 908633 909962 911439 912691 913531 914595 916419 918761 921591 925801
48344 925801 932087 940199 950126 962772 978458 996107 1014899 1035119 1055960 1074158 1086677 1093652
48332 1093652 1097152 1098438 1098185 1098016 1099721 1103834 1110556 1120894 1135273 1152434 1171374 1192828 1217138
48319 1217138 1242640 1268275 1295779 1326885 1360458 1395098 1432547 1475663 1525168 1581413 1647109
48308 1647109 1724894 1814619 1916858 2036740 2180602 2352001 2555876 2803899 3111018 3490834
48298 3490834 3960922 4548973 5286388 6200878 7325886 8713653 10425204 12502715 14946462
48289 14946462 17683386 20505658 23031524 24790043 25430431 24898391 23425364 21361232
48281 21361232 19017160 16619029 14327943 12251996 10443151 8908399 7632257 6588285
48273 6588285 5740830 5052016 4491228 4035251 3662921 3355584 3100787 2890252 2715119
48264 2715119 2566719 2440135 2333052 2242161 2163639 2095569 2036845 1984885 1937108 1893319 1854151
48253 1854151 1818458 1784599 1752936 1724673 1699515 1676685 1656890 1640877 1627174 1613708 1600781
48242 1600781 1590248 1582519 1576497 1571855 1569294 1569031 1570860 1575250 1582639 1591766 1599922 1604447 1603087 1594012
48228 1594012 1577150 1554990 1530655 1505575 1479931 1454324 1429545 1405405 1381242 1357085 1333148
48217 1333148 1308877 1283702 1258135 1232988 1208194 1183416 1158913 1134687 1109774 1083744 1057965
48206 1057965 1033986 1011592 989935 969483 951019 933667 916015 898645 883420 870483 858124
48195 858124 845611 834136 824636 816517 808994 802108 795839 789626 783364 777738 773002 768428 763511 758821
48181 758821 755134 752380 749864 746984 743540 739842 736572 734051 731756 729185 726850 725529 724774 723289
48167 723289 720789 718403 717076 716522 715978 715101 713850 712348 711068 710453 710110 709203 707793 706974 707429 708596
48151 708596 709526 709832 709533 708727 707810 707362 707454 707601 707677 708261 709748 711790 713927 716161 718494 720516 721914
48134 721914 722933 723907 724791 725650 727105 729692 732997 736010 738259 740159 742346 745130 748621 752895 757771
48119 757771 762705 767303 771932 777423 783989 790754 796798 802467 809092 817412 826950 837081 847935 859778
48105 859778 872242 884890 898033 912264 927538 943463 960143 977912 996473 1015154 1033858
48094 1033858 1052907 1072058 1090594 1108455 1126394 1144865 1163547 1182117 1200651 1218970 1236333
48083 1236333 1252212 1266838 1280715 1294080 1307045 1319648 1331479 1341812 1350490 1358231 1365821 1373408
48071 1373408 1380798 1387927 1394747 1401140 1407329 1414023 1421809 1430614 1439827 1448643 1456237 1462130 1466578 1470172
48057 1470172 1472853 1473786 1472378 1468902 1463922 1457642 1450098 1441404 1431467 1419975 1407059 1393511 1379884
48044 1379884 1365812 1350678 1334559 1317962 1300848 1282519 1262485 1241093 1219276 1197796 1176587
48033 1176587 1154786 1131679 1107636 1083807 1060872 1038568 1016541 995005 974229 954032 934257
48022 934257 915249 897270 879893 862531 845319 828928 813863 800466 789189 780091 772185 764119
48010 764119 755642 747865 741937 737858 734703 731663 728702 726420 725315 725116 724991 724543 724347 725160 726872
47995 726872 728707 730276 731874 733754 735645 737137 738185 739093 740178 741477 742580 742839 741974 740415 738815
47980 738815 737395 736049 734821 733771 732501 730392 727392 724085 720893 717706 714390 711154 708167 705292
47966 705292 702457 699910 697729 695452 692587 689291 686227 683887 682398 681792 682083 683080 684495 686259 688552
47951 688552 691495 695097 699438 704599 710304 715993 721475 727344 734431 742912 752256 762032 772412 783664
47937 783664 795491 807274 818919 830980 843770 856641 868432 878460 886753 893456 898422 901610
47925 901610 903565 905148 906641 907292 905898 901872 895655 888078 879573 870191 860199 850220 840670 831448
47911 831448 822350 813463 804875 796331 787626 779182 771746 765503 759987 754930 750777 748116 746960 746878 747579
47896 747579 748999 750995 753380 756312 760298 765608 771877 778513 785365 792727 800690 808915 817240 826225
47882 826225 836542 847891 859096 869503 879718 890505 901390 911059 918996 925934 932572 938528
47870 938528 942868 945096 945197 943183 939135 933393 926156 917109 906023 893593 881040 868831 856368
47857 856368 843091 829294 815586 802069 788554 775271 762844 751661 741641 732594 724463 717197
47845 717197 710712 705046 700324 696569 693756 692034 691597 692240 693348 694509 696013 698564 702549 707683 713228
47830 713228 718455 723014 727065 731116 735629 740681 745888 750639 754568 757990 761785 766629 772372 778383
47816 778383 784490 791239 799180 808343 818644 830468 844449 860798 879115 898710 918874 939021
47804 939021 958851 978324 997160 1014441 1028989 1040133 1047953 1052916 1055514 1056054 1054416 1050177 1043386
47791 1043386 1035073 1026548 1018299 1010138 1002337 995854 991206 987856 985131 983159 982350 982416 982528 982240 981658
47776 981658 980835 979594 977902 975905 973493 970249 966031 961304 956742 952649 948760 944438 939069 932573
47762 932573 925664 919401 914305 909857 904889 898440 890433 881730 873500 866360 860163 854607 849844 846218
47748 846218 843620 841498 839595 838362 838598 840840 845149 851236 858731 867448 877425 888670 901028 914577
47734 914577 929981 947958 968280 989668 1010815 1031284 1051254 1070710 1089147 1105929 1120705
47723 1120705 1133495 1144518 1153917 1161643 1167592 1171682 1173598 1172642 1168240 1160563 1150276 1137676 1122633
47710 1122633 1105518 1087501 1069499 1051302 1032283 1012646 993385 975262 958457 943107 929466
47699 929466 917477 906847 897735 890809 886335 883719 882279 882060 883500 886660 891280 897410 905467 915690
47685 915690 927811 941321 955819 971144 987363 1004555 1022464 1040453 1058067 1075438 1092850
47674 1092850 1109977 1125883 1139699 1151007 1159701 1165997 1170549 1173961 1175919 1175263 1171221 1164236 1155272
47661 1155272 1144696 1132245 1117785 1101576 1083958 1065329 1046438 1028188 1011015 994759 979205
47650 979205 964436 950597 937738 926131 916419 909157 904347 901599 900560 901001 902684 905419 909213
47637 909213 914153 920173 927150 935196 944663 955772 968365 982022 996462 1011838 1028726 1047723
47625 1047723 1068981 1092097 1116428 1141416 1166535 1191041 1213977 1234463 1251981 1266339 1277267
47614 1277267 1283944 1285031 1279456 1267303 1249754 1228061 1202760 1173992 1142231 1108324 1072962 1036635
47602 1036635 1000158 964817 931727 901187 872857 846410 821860 799465 779511 762094 746908
47591 746908 733296 720790 709542 699967 691937 684685 677662 671167 665748 661192 656609 651487 646150
47578 646150 641068 636263 631739 628001 625575 624197 623096 622025 621389 621324 621241 620598 619589 618708 617965 616913
47562 616913 615189 612737 609698 606423 603393 600744 598032 594783 591151 587744 584927 582632 580628 578619
47548 578619 576221 573358 570593 568555 567088 565503 563663 562188 561412 560824 559912 558949 558368 557859 556859 555731
47532 555731 555625 556997 558895 560095 560527 561167 562703 564762 566458 567323 567516 567351 566940 566303 565548 564748 563792
47515 563792 562597 561452 560931 561364 562506 563812 564891 565635 566030 566077 565888 565686 565635 565707 565757 565730 565744 565964 566401
47496 566401 566857 567046 566744 565901 564720 563684 563271 563459 563514 562514 560204 557297 554911 553731 553643 554041 554477
47479 554477 555085 556403 558745 561780 564801 567361 569608 572057 575166 578989 583022 586430 588650 589854
47465 589854 590763 591986 593645 595518 597248 598444 598879 598706 598369 598264 598599 599470 600805 602265 603555 604863
47449 604863 606707 609376 612932 617810 624801 634154 645116 656751 668890 681907 696001 711202 727809
47436 727809 746181 766165 787204 808883 830812 852060 871411 888276 902860 915274 925128 932270
47424 932270 937326 940980 943054 942793 939831 934439 927080 918239 908608 898858 889088 878905 868222 857621
47410 857621 847691 838243 828495 817976 807018 796357 786429 777077 767824 758345 748767 739593 731346
47397 731346 724221 718069 712684 708072 704427 701914 700565 700389 701396 703456 706278 709678 713795 718850
47383 718850 724750 731192 738175 746074 755038 764533 773750 782336 790415 798017 804833 810633 815525 819520
47369 819520 822101 822574 820827 817426 812871 807044 799531 790299 779779 768383 756198 743223 729654
47356 729654 715855 702176 688927 676348 664400 652760 641305 630551 621246 613426 606145 598395
47344 598395 590096 581985 574779 568749 563946 560307 557462 554896 552562 551028 550668 550997 551215 551272 551938 553722
47328 553722 556182 558516 560529 562651 565151 567765 570206 572758 576058 580216 584372 587358 588841 589625
47314 589625 590681 592034 592882 592741 592049 591449 590853 589654 587752 585914 584965 584924 585200 585462 586033 587356 589334
47297 589334 591425 593361 595495 598322 601846 605679 609742 614510 620466 627557 635372 643698 652664 662463
47283 662463 673112 684428 696066 707698 719288 731076 743098 754841 765653 775387 784377 792902
47271 792902 801012 808804 816353 823342 829178 833722 837547 841262 844887 848189 851325 854802 858909 863574
47257 863574 868769 874772 881801 889337 895734 898601 895901 887058 873145 856096 837794 819699 802770
47244 802770 787423 773673 761538 751175 742625 735655 729998 725461 721758 718616 716266 715361 716077 717721
47230 717721 719707 722468 726728 732210 737918 743587 749977 757567 765861 774327 783196 792778 802566 811761
47216 811761 820298 828605 836519 843122 847707 850370 851588 851658 850672 848632 845287 840159 832987 824162 814642
47201 814642 805497 797398 790268 783448 776457 769690 764175 760575 758689 757970 758211 759534 762037 765749 770717
47186 770717 776821 783686 791209 800017 810904 823765 837630 851918 867172 884184 902836 922330
47174 922330 942239 962702 983629 1004428 1024627 1044256 1063282 1081117 1097033 1110738 1122193
47163 1122193 1131187 1137579 1141796 1144543 1145939 1145389 1142481 1137730 1132171 1126294 1119521 1110783 1099726 1087381
47149 1087381 1075563 1065460 1056842 1048721 1040557 1032663 1025696 1020179 1016361 1014076 1012681 1011568 1010852 1011169
47135 1011169 1012765 1015186 1018091 1021845 1026977 1033452 1040926 1049392 1058976 1069190 1078898 1087108 1093359 1097306
47121 1097306 1098513 1096976 1093423 1088604 1082384 1073960 1062957 1049966 1035890 1021147 1005785 990169
47109 990169 975074 961025 947832 934933 921984 908945 895875 882983 870726 859499 849195
47098 849195 839384 829977 821362 813779 806843 799924 792820 785934 779981 775633 773175 772267 772217 772700 774031
47083 774031 776559 780063 784039 788375 793310 798921 805120 812019 819725 827743 835142 841538 847363 852861
47069 852861 857413 860423 862486 864909 868144 871341 873558 874800 875634 876414 877334 878796 880994 883256 884545
47054 884545 884848 885585 888256 892908 898294 903339 908036 912995 918590 924767 931407 938516 946086 954001 962153
47039 962153 970510 978964 987136 994543 1001051 1007146 1013596 1020854 1028864 1037444 1046633 1056570 1067203 1078274
47025 1078274 1089495 1100597 1111354 1121706 1131722 1141227 1149640 1156380 1161279 1164365 1165503 1164714 1162635
47012 1162635 1159993 1156650 1151779 1145114 1137371 1129278 1120916 1112431 1104573 1097839 1091618 1085034 1078297 1072468
46998 1072468 1068178 1065393 1064229 1064934 1067012 1069381 1071706 1074740 1078931 1083542 1087729 1091795 1096698 1102851
46984 1102851 1110110 1118512 1128178 1138722 1149540 1160686 1172783 1186052 1200006 1214214 1228767 1243842
46972 1243842 1259213 1274414 1289052 1302869 1315873 1328443 1340930 1353054 1364084 1373679 1382117 1389598
46960 1389598 1395877 1400791 1404599 1407425 1408878 1408773 1407822 1407057 1406758 1406517 1406156 1405942 1406001 1406251 1407033 1409183 1413130
46943 1413130 1418401 1424378 1431176 1439367 1449018 1459341 1469329 1478567 1487499 1496994 1507547 1518881 1530446
46930 1530446 1542275 1555009 1568954 1583458 1597459 1610340 1621962 1632146 1640581 1647067 1651418 1653125
46918 1653125 1651541 1646485 1638372 1627688 1614654 1599473 1582634 1564781 1546438 1527996 1509843 1492389
46906 1492389 1475988 1460888 1447145 1434663 1423545 1414434 1408316 1405856 1407022 1411431 1418870 1429413
46894 1429413 1443130 1459840 1479161 1500776 1524646 1550814 1578846 1607643 1636029 1663485 1690010
46883 1690010 1715341 1738757 1759737 1778461 1795380 1810483 1823186 1832827 1839219 1842967 1845336 1847536
46871 1847536 1849963 1852319 1854468 1856895 1860265 1864984 1871399 1879927 1890611 1902983 1916720 1932080 1949210
46858 1949210 1967418 1985744 2003974 2022407 2040765 2058122 2073923 2088340 2101422 2112569 2121148
46847 2121148 2127123 2130703 2131825 2130340 2126361 2120012 2111102 2099454 2085480 2070211 2054834 2040247 2026817
46834 2026817 2014408 2002904 1992834 1985160 1980343 1977993 1977696 1979686 1984339 1991444 2000591 2011999 2026267
46821 2026267 2043306 2062032 2081216 2100182 2118641 2136300 2152880 2168204 2182070 2194198 2204300
46810 2204300 2211909 2216157 2216175 2211958 2204569 2195256 2184519 2172201 2158231 2142969 2126972 2110656 2094140
46797 2094140 2077252 2059784 2041898 2024253 2007570 1992163 1978005 1965102 1953485 1942944 1933178
46786 1933178 1924380 1917368 1912783 1910245 1908591 1907001 1905650 1905109 1905369 1905738 1905667 1905277 1904953 1904720 1904319 1903785
46770 1903785 1903606 1904249 1905731 1907735 1909990 1912484 1915483 1919432 1924705 1931355 1939185 1948151 1958522 1970502
46756 1970502 1983765 1997602 2011505 2025485 2039796 2054465 2069152 2083361 2096681 2108904 2120064
46745 2120064 2130423 2140308 2149785 2158466 2165778 2171510 2176015 2179748 2182719 2184629 2185531 2186116 2187256 2189370
46731 2189370 2192305 2195650 2199123 2202797 2207065 2212232 2218151 2224464 2231255 2239052 2247971 2257200 2265760 2273519
46717 2273519 2280953 2288049 2294078 2298460 2301213 2302276 2301036 2296999 2290547 2282424 2272671 2260552 2245447
46704 2245447 2227354 2206593 2183611 2159197 2134359 2109630 2084718 2059094 2032732 2006098 1979620
46693 1979620 1953443 1927593 1902133 1877196 1852988 1829692 1807250 1785444 1764446 1745144 1728515
46682 1728515 1714581 1702209 1690110 1677884 1666017 1655086 1645311 1636749 1629569 1623897 1619539 1616117
46670 1616117 1613508 1612062 1612339 1614733 1619348 1626112 1634872 1645389 1657392 1670680 1685151 1700756 1717442
46657 1717442 1735109 1753505 1772148 1790360 1807430 1822827 1836380 1848286 1858768 1867641 1874325 1878432
46645 1878432 1880140 1879873 1877838 1874263 1869948 1866144 1863817 1863358 1865020 1869145 1875867 1885087 1897079 1912687
46631 1912687 1932496 1956009 1982017 2009541 2038020 2066813 2095065 2122082 2147464 2170838 2191668
46620 2191668 2209276 2222788 2231225 2234047 2231510 2224152 2212087 2195309 2174530 2151007 2125425 2097608
46608 2097608 2067558 2036201 2004707 1973595 1942929 1912965 1884126 1856648 1830810 1807268 1786604
46597 1786604 1768593 1752365 1737253 1723083 1709697 1696668 1683623 1670512 1657469 1644707 1632629
46586 1632629 1621684 1611865 1602495 1592780 1582533 1572241 1562444 1553196 1544253 1535687 1528023 1521494 1515339
46573 1515339 1508349 1500347 1492677 1486946 1483585 1481969 1481514 1481945 1482704 1482993 1482656 1482412 1482813 1483410 1483255 1481914
46557 1481914 1479671 1477154 1475239 1474946 1476772 1480022 1483337 1486043 1488726 1492362 1497189 1502617 1508061 1513643
46543 1513643 1520084 1527959 1537051 1546517 1555797 1565305 1576029 1588448 1602188 1616800 1632524 1649936
46531 1649936 1669091 1689481 1710797 1733303 1757314 1782695 1809156 1836723 1865520 1895183 1924900
46520 1924900 1954075 1982679 2010896 2038631 2065393 2090387 2112716 2131893 2148343 2162996 2176087
46509 2176087 2186691 2193858 2197998 2200598 2202697 2204200 2204668 2204046 2202293 2198977 2193913 2187882 2182037 2176594
46495 2176594 2170776 2164141 2157286 2150852 2144320 2136415 2126523 2115140 2102828 2089341 2073988 2056427 2036661
46482 2036661 2014537 1989757 1962414 1933104 1902462 1870863 1838571 1805810 1772626 1739065 1705638
46471 1705638 1673210 1642145 1612049 1582777 1555328 1531111 1510542 1493016 1478184 1466496 1458289
$$ [...]
##END NTUPLES=NMR SPECTRUM
##END=
