##TITLE=AC1444_BRAAS13253_8011580_HmZ3cLmx9v
##JCAMPDX= 6.0         $$ Bruker NMR JCAMP-DX V2.0
##DATA TYPE= NMR SPECTRUM
##DATA CLASS= NTUPLES
##ORIGIN= BRUKER
##OWNER= Administrator
$$ 1.72 TOPSPIN		Version 2.1
$$ 2013-07-05 16:13:48.498 -0700  Administrator@X
$$ Compression mode = diff/dup
##.OBSERVE FREQUENCY= 400.02188249412
##.OBSERVE NUCLEUS= ^1H
##.ACQUISITION MODE= SIMULTANEOUS (DQD)
##.ACQUISITION SCHEME= undefined
##.AVERAGES= 8
##.DIGITISER RES= 22
##SPECTROMETER/DATA SYSTEM= spect
##.PULSE SEQUENCE= zg30
##.SOLVENT NAME= COFFEE_meoh
##.SHIFT REFERENCE= INTERNAL, COFFEE_meoh, 1, 14.98509
##AUDIT TRAIL= $$ (NUMBER, WHEN, WHO, WHERE, PROCESS, VERSION, WHAT)
$$ ##TITLE= Audit trail, TOPSPIN		Version 2.1
$$ ##JCAMPDX= 5.01
$$ ##ORIGIN= Bruker BioSpin GmbH
$$ ##OWNER= Administrator
$$ $$ E:\/data/COFFEE/nmr/AC1444_BRAAS13253_8011580_HmZ3cLmx9v/10/pdata/1/auditp.txt
$$ ##AUDIT TRAIL=  $$ (NUMBER, WHEN, WHO, WHERE, PROCESS, VERSION, WHAT)
(   1,<2013-07-05 16:13:41.467 -0700>,<Administrator>,<X>,<go>,<TOPSPIN 2.1>,
      <created by zg
	started at 2013-07-05 16:12:35.779 -0700,
	POWCHK enabled, PULCHK disabled,
       configuration hash MD5:
       C8 4E 4E 5D D3 5C D8 9E 9F 52 82 E0 59 8A DE 15
       data hash MD5: 64K
       32 AB 4D E5 4F E6 98 6C 74 3B 75 90 DF 60 8A EF>)
(   2,<2013-07-05 16:13:44.451 -0700>,<Administrator>,<X>,<proc1d>,<TOPSPIN 2.1>,
      <Start of raw data processing
       efp LB = 0 FT_mod = 6 PKNL = 1 PHC0 = 0 PHC1 = 0 SI = 32K 
       data hash MD5: 32K
       DC D2 AF D7 FB 28 57 5D F6 D5 FD FD C4 96 6B 72>)
(   3,<2013-07-05 16:13:44.748 -0700>,<Administrator>,<X>,<proc1d>,<TOPSPIN 2.1>,
      <pk PHC0 = 95.08118 PHC1 = 0 
       data hash MD5: 32K
       CD 23 A0 EF D8 A3 BB 2B 35 98 B7 B8 66 47 2C DC>)
(   4,<2013-07-05 16:13:44.982 -0700>,<Administrator>,<X>,<proc1d>,<TOPSPIN 2.1>,
      <abs ABSG = 1 
       data hash MD5: 32K
       19 FF 4A 7A E8 C9 AA 7A 0D 11 81 4C 7D BA E1 FC>)
(   5,<2013-07-05 16:13:45.076 -0700>,<Administrator>,<X>,<proc1d>,<TOPSPIN 2.1>,
      <abs ABSG = 2 
       data hash MD5: 32K
       FB 21 22 D3 8C 7E A1 49 5E F0 20 7A 2B 94 83 C5>)
(   6,<2013-07-05 16:13:45.139 -0700>,<Administrator>,<X>,<proc1d>,<TOPSPIN 2.1>,
      <abs ABSG = 3 
       data hash MD5: 32K
       DE A1 C6 8A B8 4F B0 F8 35 BF 31 B5 30 63 27 B8>)
(   7,<2013-07-05 16:13:45.217 -0700>,<Administrator>,<X>,<proc1d>,<TOPSPIN 2.1>,
      <abs ABSG = 4 
       data hash MD5: 32K
       67 CA 88 9A 0E 22 01 BA 03 A3 46 3C 84 19 DC 87>)
(   8,<2013-07-05 16:13:45.264 -0700>,<Administrator>,<X>,<proc1d>,<TOPSPIN 2.1>,
      <abs ABSG = 5 
       data hash MD5: 32K
       F5 AE 9F 24 EC 88 EB B8 01 BF 84 09 56 7A F8 0B>)
$$ ##END=
$$ 
$$ $$ hash MD5
$$ $$ CB 5A 47 9B 8F 17 2A D2 50 65 11 D3 7F 92 F2 93
##$RELAX= 
##$RELAX= 
##$RELAX= 
##$RELAX= 
##$RELAX= 
##$RELAX= 
##$RELAX= 
$$ Bruker specific parameters
$$ --------------------------
##$DU= <E:\>
##$EXPNO= 10
##$NAME= <AC1444_BRAAS13253_8011580_HmZ3cLmx9v>
$$ [...]
##$TP= (0..7)
150 150 150 150 150 150 150 150
##$TP07= 0
##$TPNAME0= <>
##$TPNAME1= <>
##$TPNAME2= <>
##$TPNAME3= <>
##$TPNAME4= <>
##$TPNAME5= <>
##$TPNAME6= <>
##$TPNAME7= <>
##$TPOAL= (0..7)
0.5 0.5 0.5 0.5 0.5 0.5 0.5 0.5
##$TPOFFS= (0..7)
0 0 0 0 0 0 0 0
##$TUNHIN= 0
##$TUNHOUT= 0
##$TUNXOUT= 0
##$USERA1= <user>
##$USERA2= <user>
##$USERA3= <user>
##$USERA4= <user>
##$USERA5= <user>
##$V9= 5
##$VALIST= <valist>
##$VCLIST= <CCCCCCCCCCCCCCC>
##$VD= 0
##$VDLIST= <DDDDDDDDDDDDDDD>
##$VPLIST= <PPPPPPPPPPPPPPP>
##$VTLIST= <TTTTTTTTTTTTTTT>
##$WBST= 1024
##$WBSW= 4
##$XGAIN= (0..3)
0 0 0 0
##$XL= 0
##$YL= 0
##$YMAX_a= 640579
##$YMIN_a= -543425
##$ZGOPTNS= <>
##$ZL1= 120
##$ZL2= 120
##$ZL3= 120
##$ZL4= 120
##$ABSF1= 14.98509
##$ABSF2= -5.573092
##$ABSG= 5
##$ABSL= 3
##$ALPHA= 0
##$AQORDER= 0
##$ASSFAC= 0
##$ASSFACI= 0
##$ASSFACX= 0
##$ASSWID= 0
##$AUNMP= <proc_prof1d_extract_pilot.lims>
##$AXLEFT= 0
##$AXNAME= <>
##$AXNUC= <1H>
##$AXRIGHT= 0
##$AXTYPE= 0
##$AXUNIT= <>
##$AZFE= 0.1
##$AZFW= 0.1
##$BCFW= 0
##$BC_mod= 0
##$BYTORDP= 0
##$COROFFS= 0
##$CY= 15
##$DATMOD= 1
##$DC= 0
##$DFILT= <>
##$DTYPP= 0
##$F1P= 0
##$F2P= 0
##$FCOR= 0.5
##$FTSIZE= 32768
##$FT_mod= 6
##$GAMMA= 0
##$GB= 0
##$INTBC= 1
##$INTSCL= 1
##$ISEN= 128
##$LB= 0
##$LEV0= 0
##$LPBIN= 0
##$MAXI= 10000
##$MC2= 0
##$MEAN= 0
##$ME_mod= 0
##$MI= 0
##$NCOEF= 0
##$NC_proc= -8
##$NLEV= 6
##$NOISF1= 0
##$NOISF2= 0
##$NSP= 0
##$NTH_PI= 0
##$NZP= 0
##$OFFSET= 14.98509
##$PC= 1
##$PHC0= 95.08118
##$PHC1= 0
##$PH_mod= 1
##$PKNL= yes
##$PPARMOD= 0
##$PPDIAG= 0
##$PPIPTYP= 0
##$PPMPNUM= 2147483647
##$PPRESOL= 1
##$PSCAL= 4
##$PSIGN= 0
##$PYNMP= <proc.py>
##$REVERSE= no
##$SF= 400.02
##$SI= 32768
##$SIGF1= 0
##$SIGF2= 0
##$SINO= 400
##$SIOLD= 32768
##$SPECTYP= <>
##$SREGLST= <1H.CDCl3>
##$SSB= 0
##$STSI= 32768
##$STSR= 0
##$SW_p= 8223.68421052631
##$SYMM= 0
##$S_DEV= 0
##$TDeff= 65536
##$TDoff= 0
##$TI= <>
##$TILT= no
##$TM1= 0
##$TM2= 0
##$TOPLEV= 0
##$USERP1= <user>
##$USERP2= <user>
##$USERP3= <user>
##$USERP4= <user>
##$USERP5= <user>
##$WDW= 1
##$XDIM= 32768
##$YMAX_p= 467218162
##$YMIN_p= -634153
##$CURPLOT= <Network HP LaserJet P1505>
##$CURPRIN= <$Network HP LaserJet P1505>
##$DFORMAT= <normdp>
##$LAYOUT= <+/1D_H.xwp>
##$LFORMAT= <normlp>
##$PFORMAT= <normpl>
##$SURQMSG= 1
$$ End of Bruker specific parameters
$$ ---------------------------------
##NTUPLES= NMR SPECTRUM
##VAR_NAME=  FREQUENCY,     SPECTRUM/REAL,   SPECTRUM/IMAG
##SYMBOL=    X,             R,               I
##VAR_TYPE=  INDEPENDENT,   DEPENDENT,       DEPENDENT
##VAR_FORM=  AFFN,          ASDF,            ASDF
##VAR_DIM=   32768,         32768,           32768
##UNITS=     HZ,            ARBITRARY UNITS, ARBITRARY UNITS
##FACTOR=    0.250966925370066, 1,           1
##FIRST=     8223.43324360094, 162977,       212431
##LAST=      0,             3585,            -71233
##MIN=       0,             -634153,         0
##MAX=       8223.43324360094, 467218162,    0
$$ Real data points
##PAGE= N=1
##DATA TABLE= (X++(R..R)), XYDATA
$$ [...]
19542b17780A3048d28210f1744l4100E9964c5306j93154j0051j40843a17637D3675
19530a12028D03133b19476f5834A58523a50399C4646a2413p74k34479B14285d95392
19518b25891i5003D655R3314c54098A86215a07712r7770H1899a90429E7999c3129
19506A2296a35879f3788A64403c18824L0627c0017A2931J15728K497F5250a16232
19494D0947c37341a36337H9431b82275A15927J43323a47761b4586j32298k02988
19484c59872I4405b10905L7846b3283A52467c44286e1724B94542a38084r9793
19474b37877A12102a11742j20058i5445E1268a3943k61469B246a20037C3902a87757
19462b23398e2733j42791r2242g1154I7582O8624b5236j24960a0280A47289K29492
$$ plain form
19542 -217780 13048 -428210 -61744 -95844 59964 -35306 -228460 -238511 -379354 -117637 43675
19530 -112028 403133 -219476 -65834 158523 -150399 34646 -12413 -13187 -247666 214285 -495392
19518 -225891 -95003 4655 97969 -354098 186215 -107712 -205482 81899 -190429 57999 -33129
19506 12296 -135879 -63788 164403 -318824 -288197 -30017 12931 128659 131156 65250 -116232
19494 40947 -337341 -136337 89431 -282275 115927 259250 -147761 -24586 -156884 -359872
19484 -359872 94405 -210905 -173059 -23283 152467 -344286 -51724 294542 -138084 -237877
19474 -237877 112102 -111742 -231800 -95445 51268 -13943 -275412 2246 -120037 33902 -187757
19462 -223398 -52733 -195524 -287766 -71154 97582 166206 -25236 -150196 -10280 147289 376781
19451C76781A56211d4868A61517a17192o9752O9411N5149G0350b31147i9198k2143
19440a21341j12928L9594A65782R0712D6843A8498a02026M1I8519b62319M6615
19429b15704g5809A27218l1380J92780i4639L2714r943l85410C8519e7857r8958
19418a56815d8682q6831N7617k59820f1022A1301a17921A16734h0019B23133a21044
19406d53974h1219j38760P0397D2304J98998h6156c4170C27976d25118J47558
19396b77560c3021k96334F6652C0888J62131R837C3452b59132o4361a57297I8177
19384b70062a31601j36290J24452f1349A8075b32261R1507N826j21335a04780
19373c68893J19389h5546c5702B4106c76327d2600m230i260E0301O1271c33475
$$ plain form
19451 376781 156211 -44868 161517 -117192 -186944 -117533 -62384 70350 -231147 -99198 -121341
19440 -121341 -234269 -194675 165782 256494 46843 18498 -102026 -101985 98519 -262319 -215704
19429 -215704 -75809 127218 95838 288618 -94639 -61925 -71868 -457278 38519 -57857 -156815
19418 -156815 -48682 -135513 -77896 -337716 -61022 11301 -117921 116734 -80019 223133 -121044
19406 -453974 -81219 -219979 -149582 42304 241302 -86156 -34170 327976 -425118 -277560
19396 -277560 -33021 -329355 66652 30888 193019 202856 33452 -259132 -323493 -157297 98177
19384 -270062 -131601 -267891 -143439 -61349 18075 -232261 -140754 -134928 -256263 -104780
19373 -368893 -249504 -85546 -35702 24106 -376327 -42600 -46830 -9260 50301 111572 -333475
19361b02240B1561d8663B5946f4262m0141A06037J54721j5076K5343d23196B19
19349i1600j2194D05017a5501r2818A02139a45505H7365d7561j53850j14498h3768
19337C43958i5789B44958a96278B4121c6724l2677a4203F3007L5484m2650i2577
19325F4124b59719A59720a08369r723l6688A97187p0183g2686j88464d8349C03588
19313B1114J64210h5123j65264j14541E2140e3493q189G4060a9097A75391b06443
19301A17255g0830B32207I2653b36135a1851q3715C76130b62914A8857e2458b4128
19289b21846a05450L1223K1479C9037d3695A32891a94486e2083p9566F3906b40075
19277G6337g2844n1843j71596e6960A07935a96681D6225O7891a3495B4800J87341
$$ plain form
19361 -202240 21561 -48663 25946 -64262 -104403 106037 260758 245682 271025 -423196 219
19349 -91600 -103794 405017 -15501 -108319 102139 -145505 87365 -47561 -201411 -315909 -83768
19337 343958 -95789 244958 -196278 24121 -36724 -69401 -14203 63007 98491 55841 -92577
19325 64124 -259719 159720 -108369 -118092 -154780 197187 127004 -72686 -261150 -48349 303588
19313 21114 185324 -85123 -250387 -364928 52140 -53493 -61682 74060 -19097 175391 -206443
19301 117255 -70830 232207 92653 -236135 -11851 -95566 376130 -262914 18857 -52458 -24128
19289 -221846 -105450 -74227 -52748 39037 -43695 132891 -194486 -52083 -131649 63906 -240075
19277 76337 -72844 -124687 -296283 -56960 107935 -196681 46225 114116 -13495 24800 212141
19266B12141D05R1061M1060L6864M2816a4970j39917O1876C1070h0095J4396j12738
19254a78437e5284r5014j8386m6182A02917e0551k33683d6580C7940K57782a04282
19242a07282j4479A38534b1812k62105F9016a09514j75334A64443J23328d32009
19231d3660C6216a09811j03673b7769j62773j82420J18037e5938m4549k5707j90757
19220c16951a54309B0074M5767J69952c81198J85976B041d12042J68013K3697
19210b20332d4142F19g9536o9228e7283A35610h2247B34220D9931a51329r732
19199a61061M2853k55005a15347c8269m34406a47597l4350q1729j2638J22469
19189a53845N4433M5598j24363D06920F5504d08366H7196b11510B94120e0770
$$ plain form
19266 212141 405 91466 132526 169390 212206 -14970 -154887 -93011 31070 -80095 -65699 -178437
19254 -178437 -55284 -150298 -168684 -214866 102917 -50551 -284234 -46580 37940 295722 -104282
19242 -107282 -121761 138534 -21812 -283917 69016 -109514 -284848 164443 287771 -432009
19231 -43660 36216 -109811 -213484 -27769 -190542 -372962 -254925 -55938 -100487 -126194 -316951
19220 -316951 -154309 20074 65841 235793 -381198 -195222 2041 -412042 -244029 -220332
19210 -220332 -44142 619 -79536 -148764 -57283 135610 -82247 234220 49931 -151329 -161061
19199 -161061 -118208 -373213 -115347 -38269 -472675 -147597 -181947 -263676 -276314 -153845
19189 -153845 -99412 -53814 -178177 406920 65504 -408366 87196 -211510 294120 -50770
19178g3199I6647c9430k72883J30250b2553A718Q7875M1045a98E8622e7279a6092
19165a50109A25206K0441m7264a96591K8960g743E7896B0084g1496m3376G7925
19153A14857K81222a16381j8791O5789r7890h0140N343k5675j54303b2023p8171
19142a00194D962b32264A68720b3404m6115A35110g7255B34R0535a92390P6454
19131a15936A94088E8922Q6396a10369j10802P7681i491g29A03173P0767b78427
19119b57314f6128H9782a54464C2296b69132h0554A07286h6817j87296d3770A17068
19107C97071b70784A99523g9973l11244E4696a79481P9582k22777Q5194g4528
19096h9464k93E2798J26329O8856d51332B6942a59192K9075o3373h9094q1749
$$ plain form
19178 -73199 96647 -39430 -312313 -182063 -22553 1718 89593 130638 -198 58622 -57279 -16092
19165 -150109 125206 145647 98383 -196591 -167631 -7743 57896 20084 -71496 -114872 77925
19153 114857 396079 -116381 -135172 -69383 -167273 -80140 -74797 -100472 -254775 -22023 -100194
19142 -100194 4962 -232264 168720 -23404 -69519 135110 -77255 234 90769 -192390 -115936
19131 -115936 194088 58922 145318 -110369 -221171 -143490 -9491 -729 103173 173940 -278427
19119 -257314 -66128 89782 -154464 32296 -269132 -80554 107286 -86817 -274113 -43770 117068
19107 397071 -270784 199523 -79973 -391217 54696 -179481 -99899 -322676 -237482 -74528
19096 -89464 -89757 52798 179127 247983 -451332 26942 -159192 -130117 -193490 -89094 -170843
19085a70843n3845c1572C601a789B19082B8587a16291A48169J45907a43173q363
19074a51536l0187j47227A41537c44588R1637o6705A59128b3395B0008a71468
19063a25494j04570i2140l4013D914a70473C9619b97273g3323l26079a79239N8421
19052a20818A93243F4975J8248h1460k80268b8312l9710A15786N6623L4895a50032
19040a92277A00812b35654d7625b1004E9624e1420C3919J73460C9366b9248k19281
19029b48529D4524K06235c1327l818j9215k75476a47712B62723K5474b62028I6254
19017b54665C08982j46022J6533n3752c4702B6964M42b37846I8130g019G1665
19005I2247a9267D8981d20342a26731A31141a81128C82939H6921a16115c1188
$$ plain form
19085 -170843 -224688 -31572 3601 -1789 219082 28587 -116291 148169 294076 -143173 -151536
19074 -151536 -181723 -328950 141537 -344588 -252951 -319656 159128 -23395 20008 -171468
19063 -125494 -230064 -92140 -126153 4914 -170473 39619 -297273 -73323 -399402 -179239 -120818
19052 -120818 193243 64975 83223 -81460 -361728 -28312 -68022 115786 172409 207304 -150032
19040 -192277 100812 -235654 -47625 -21004 59624 -51420 33919 207379 39366 -29248 -248529
19029 -248529 44524 250759 -31327 -35145 -54360 -329836 -147712 262723 288197 -262028 96254
19017 -254665 308982 162960 179493 125741 -34702 26964 27406 -237846 98130 -7019 71665
19005 92247 -19267 48981 -420342 -126731 131141 -181128 382939 86921 -116115 -31188
18994C48717b55890B17947b42400j6396a18961L6354H2521c07757a17852I3003
18983a33885p3215a6133K315F3087e6868A29233b39605i0014K6375E8384M7450
18972A05834a73484D9972d5928A31595j5133b3334j06644H4940b9285b978B90913
18960a62632j30997b580A45425a02204O546j07028O9252H0558g4122G6372j9156
18949E7216a4081m2871A1537g7489n4052M6895L6859p4197B79028c7152I8492
18937a19362I3972b0896H4211c08663A48176l8436c31021b7049C09886b72852
18926C5907e4783k53981I5598b30612I8930a35184J4178j83739K5060D8114B3773
18914C22649a20651k5482A20359c45549A64656a53386e9551A5747a41079m11445
$$ plain form
18994 348717 -255890 217947 -242400 -258796 -118961 -82607 82521 -307757 -117852 93003
18983 -133885 -207100 -16133 -13818 63087 -56868 129233 -239605 -90014 -63639 58384 105834
18972 105834 -173484 49972 -45928 131595 116462 -23334 -129978 84940 -29285 -2978 290913
18960 -162632 -293629 -2580 145425 -102204 -95658 -202686 -133434 80558 -74122 76372 57216
18949 57216 -14081 -56952 11537 -77489 -131541 -84646 -47787 -121984 279028 -37152 98492
18937 -119362 93972 -20896 84211 -308663 148176 109740 -331021 -27049 309886 -272852
18926 35907 -54783 -308764 95598 -230612 98930 -135184 -121006 -304745 -279685 48114 23773
18914 322649 -120651 -146133 120359 -345549 164656 -153386 -59551 15747 -141079 -552524
18904e52524c4585A63242C8157b34028k79355C9325b16520h5921o4244A25953
18893b19757o5636B70645H1238h1148D7166b3544j68878A70357g7175j36194B11765
18881g9150H4698R3050E2933d7076j0591b5026j7925p1747j19323b0016j01045
18870a21061b7171j63472f6527H2193K5561a73096A87785D1132A992i605m97122
18859e06727b20101B73680j22757i8298j43151J03959f2869C47143D8749O2083
18849A10832j2496P5704b47749A41187a08407j47002K6391e4022B1623a63955
18838d19592I6903J0672A5731c17650a50037n2270M6181I2863p30g9303C0656
18826e4340j1890E1494a85122m4067M9964j70250g5273A50526c0080D19527A69662
$$ plain form
18904 -552524 -34585 163242 38157 -234028 -513383 39325 -216520 -85921 -150165 125953
18893 -219757 -285393 270645 81238 -81148 47166 -23544 -192422 170357 -77175 -213369 211765
18881 -79150 84698 177748 52933 -47076 -57667 -25026 -42951 -114698 -234021 -20016 -121061
18870 -121061 -27171 -190643 -66527 82193 107754 -173096 187785 41132 1992 -9605 -506727
18859 -506727 -220101 273680 150923 -98298 -241449 -137490 -62869 347143 48749 110832
18849 110832 98336 174040 -247749 141187 -108407 -255409 -229018 -54022 21623 -163955
18838 -419592 96903 107575 15731 -317650 -150037 -202307 -156126 92863 92133 -79303 30656
18826 -54340 -66230 51494 -185122 -229189 -179225 -349475 -75273 150526 -30080 419527 169662
18814A04170Q1718b74987C6714Q1830d6048B94854c2402I8051J30612A4705f0864
18802d3402I5210a16046q2073r9727A14970b60770a02034o0334b888j61945a1176
18790C2246K8861K1764c09966f9389o9078J9629I1627A4127b34615a03430A54449
18778I1638b17261c9810E1523c68151F439O6588N2056a09272j73431J17606j6554
18767a81651M5891D3186c01223E196a05514M7427B06264b69813e8160l1510j26917
18756b16587B1128b49787B32506a57068H979b34541B42069r4996p3470c99375
18745a47345j73138C11477A220c93844J91048F0379J03356a48371L3510e4534
18734b62049I8052a78372B7896g2900H9591g1974m5250k42859I7201c34080J06968
$$ plain form
18814 104170 185888 -274987 36714 118544 -46048 294854 -32402 98051 228663 14705 -60864
18802 -43402 95210 -116046 -198119 -297846 114970 -260770 -102034 -162368 -2888 -164833 -11176
18790 32246 61107 82871 -309966 -69389 -138467 -118838 91627 14127 -234615 -103430 154449
18778 91638 -217261 -39810 51523 -368151 6439 73027 125083 -109272 -282703 -165097 -181651
18767 -181651 -135760 43186 -301223 5196 -105514 -58087 206264 -269813 -58160 -89670 -216587
18756 -216587 21128 -249787 232506 -157068 8979 -234541 242069 147073 73603 -399375
18745 -147345 -320483 311477 1220 -393844 -202796 60379 163735 -148371 -114861 -54534
18734 -262049 98052 -178372 27896 -72900 89591 -71974 -117224 -360083 97201 -334080 -227112
18723b27112M9609A61996a33707F8982B0195i367l04225H0992J26760A8875N7873
18712G6748l8363i863j05851e4723k70652C27341b08044i2245G2674B918a54602
18700i7455M0191I6592d4197r0068I412b36836D8413P7767a09086l14876a86229
18688c14582c3746F563H78J09981a72691e2976k2041k17217J04350o7963q43J06889
18676a49801B16427a79624D5104a52176H8174a52133P3924k91306D8399c24566
18665B20679a16865e5070l4923h086A1105c53841a06050r2773A17154O3438g799
18653e8080C0386a82164H315a39323A18007b62900a14361k1678A37972b68607
18642A32781A7566J21473f0822B9720b33395h971l33483J71025j03478A93469
$$ plain form
18723 -227112 -177503 161996 -133707 68982 20195 -9367 -313592 80992 207752 18875 76748
18712 76748 38385 -9863 -115714 -54723 -325375 327341 -208044 -92245 72674 2918 -154602
18700 -97455 -57264 96592 -44197 -134265 9412 -236836 48413 126180 -109086 -423962 -186229
18688 -314582 -33746 6563 878 110859 -172691 -52976 -75017 -292234 -187884 -255847 -256690 -149801
18676 -149801 216427 -179624 45104 -152176 88174 -152133 -78209 -369515 48399 -324566
18665 220679 -116865 -55070 -89993 -8086 11105 -353841 -106050 -198823 117154 180592 -7799
18653 -58080 30386 -182164 8315 -139323 118007 -262900 -114361 -136039 137972 -268607
18642 132781 17566 139039 -60822 29720 -233395 -8971 -342454 -171429 -274907 193469
18631A27448i9500J3028B7258O9010c6656o0482B8733K00318G0958f3667B34751
18619H9378I369b39065A84895J5975a18626c7331l22351J51067C00044i8781G3990
18607e3412k38872M169J9542G0444P7534G0804g5369A61652l0831a49814B99341
18595B78126a45712P0737A18809a06460N1024A70217e23980A51212c88852a87871
18584a84492h6288A28947c15570E8957a10477B34357c29845J43026p2347l8307
18574b97473g4560l00828A34902C034M0480c56740h876j38024D1882c68936A41182
18562b09570b8056j75853A58576a54740e6059r9688p3429j98578a45975B7104
18551b69926j2001A31259p383k8772J45207I9889b00363C73003J20547D2767b55442
$$ plain form
18631 127448 -99500 -86472 27258 96268 -36656 -97138 28733 229051 70958 -63667 234751
18619 89378 9369 -239065 184895 200870 -118626 -37331 -359682 -208615 300044 -98781 73990
18607 -53412 -292284 -288115 -268573 70444 147978 70804 -75369 161652 130821 -149814 299341
18595 278126 -145712 -74975 118809 -106460 -55436 170217 -523980 151212 -388852 -187871
18584 -184492 -86288 128947 -315570 58957 -110477 234357 -329845 -186819 -259166 -297473
18574 -297473 -74560 -375388 134902 3034 43514 -356740 -8876 -146900 41882 -368936 141182
18562 -209570 -28056 -203909 158576 -154740 -56059 -155747 -229176 -427754 -145975 27104
18551 -269926 -281927 131259 123876 95104 240311 99889 -200363 373003 493550 42767 -255442
18539e1030j09854b9627B50483b06586p5787B21903H4024B3961a0643l0007r191
18528d9841n2554m6965O561n0464C14257D1295b8391m3465c4922k42781k40416
18517e18119H9527J17600b84227B8129a48645B26476A0849b75672a05545a9490
18506b10172g4331j36196d5349A63537m5626b4877m2128m1114j13081e6042j1884
18495f7926a9953H6059a02978F8192K6881b32551n9434P3362k69137a31443p5164
18484b06607A97235a97314C03797b30224d2672j23311D1280c44377a650j30641
18474a32291i305A03105a32387d4874Q894F580M6258a1376A46054a20067A79566
18462e9644A11419a52597j86989a36954J1522E5086p085e3225C0367J46216a37554
$$ plain form
18539 -51030 -160884 -29627 250483 -206586 -282373 221903 84024 23961 -10643 -40650 -49841
18528 -49841 -102395 -149360 -142799 -193263 314257 41295 -28391 -71856 -34922 -277703 -518119
18517 -518119 89527 207127 -284227 28129 -148645 226476 10849 -275672 -105545 -19490
18506 -210172 -74331 -210527 -45349 163537 117911 -24877 -67005 -108119 -221200 -56042 -67926
18495 -67926 -19953 86059 -102978 68192 95073 -232551 -291985 -218623 -487760 -131443 -206607
18484 -206607 197235 -197314 303797 -230224 -42672 -165983 41280 -344377 -1650 -132291
18474 -132291 -9305 103105 -132387 -44874 -35980 6580 52838 -11376 146054 -120067 179566
18462 -59644 111419 -152597 -339586 -136954 -125432 55086 48001 -53225 30367 176583 -137554
18450e6391q1578f7950J5723C05845j19616a07122k29528a3537j76668G2089P5702
18439A47791n4969L7383J01218a63628a4068l4657A91210a17032A9381b5511l8862
18428f4373k54124h7286j53214A2864c5186G1621a26661A0795J06730i1013D6605
18416A52567g7725j28701e6810A62329j8537c27818a27452m7829H6118a13746
18405h2459j4824q7066B5577a68637B9951j4483R0402k1095Q0616b88367A745
18393A2936J19460b5210B16795k6621a11510A20768a40965A1809J95183J32411
18383C39403a05852L4036k39864D4322b0394A76786k4576b5199j18266L4926k34075
18372c42614f0271j01707A64560J95478a38144e0374B98018g1727j64018L9273
$$ plain form
18450 -56391 -137969 -67950 -52227 305845 186229 -107122 -336650 -13537 -190205 72089 147791
18439 147791 92822 130205 231423 -163628 -14068 -48725 191210 -117032 19381 -25511 -64373
18428 -64373 -318497 -87286 -240500 12864 -35186 71621 -126661 10795 117525 -91013 46605
18416 152567 -77725 -206426 -56810 162329 143792 -327818 -127452 -175281 86118 -113746
18405 -82459 -97283 -184349 25577 -168637 29951 15468 105870 84775 165391 -288367 1745
18393 12936 132396 -25210 216795 190174 -111510 120768 -140965 11809 206992 339403
18383 339403 -105852 -71816 -311680 44322 -20394 176786 152210 -25199 -143465 -108539 -342614
18372 -342614 -60271 -161978 164560 360038 -138144 -50374 298018 -71727 -235745 -196472
18362a96472A1787g5915c140F6143b82387L6944C614K79561b0907k23764h747
18350e2024k09871E2248b3870C73056A69014a93783k71247a79796e9463A19311
18339b4695j15308C290J07112h6031J7541D73742I2740L31874i6809A77541h0205
18327H851b12692h6977j78291C5616b6068o9078A2826b03106A18488a33781A92974
18315C3955b71967A45920i4157l01502A4898h3356J1481A73474e6498o081m04426
18304d67005A1309K70463p0468G6677L8023b18070m8171I7481b93435Q7426h2737
18292G3313b36903p5240a37001A6609J16852C1485J26697d2870E1925a59381A18984
18280d66543g8106C0877q535b8596A78832a87895B60127a21184g300j19724A165
$$ plain form
18362 -196472 11787 -75915 -3140 66143 -282387 -245443 3614 283175 -20907 -244671 -8747
18350 -52024 -261895 52248 -23870 373056 169014 -193783 -465030 -179796 -59463 119311
18339 -24695 -140003 3290 110402 -86031 -68490 473742 92740 424614 -96809 177541 -80205
18327 8851 -212692 -86977 -265268 35616 -26068 -95146 12826 -203106 118488 -133781 192974
18315 33955 -271967 145920 -94157 -395659 14898 -83356 -71875 173474 -56498 -62579 -467005
18304 -467005 11309 281772 211304 76677 114700 -218070 -266241 97481 -293435 -206009 -82737
18292 73313 -236903 -312143 -137001 16609 133461 31485 158182 -42870 51925 -159381 118984
18280 -466543 -78106 30877 22342 -28596 178832 -187895 260127 -121184 -7300 -127024 1165
18268B1665b61231b1448j5573B41522b2224k38891j51179J54479a05197l05379
18258d10576E2296b1862B880b49683a19171j1809D0102a47546F2109M7481c9612
18246B15807O2343a87533o4613C5279K42086D8894L1941N9336F9356J87344o3803
18235A92897d18674a8436j2757j8378j65297g0054j04489B6209J16115a94400
18224C8248d1665B87633d5008J825l55072a8442B34722D7668b46219G0472h3388
18212i6959d4023J6385k9438j65206C24767c36490B43517A10890e5201M252A17522
18200D09296A56527A5904L72557j21075I8499c23269B6489K2645a76461b5292
18189A73068h1427K0290j22905q7553G7399K02033D6797d00230D5644J78207D9268
$$ plain form
18268 21665 -261231 -21448 -37021 241522 -22224 -261115 -412294 -257815 -105197 -410576
18258 -410576 52296 -21862 2880 -249683 -119171 -130980 40102 -147546 62109 109590 -39612
18246 215807 278150 -187533 -252146 35279 277365 48894 80835 140171 69356 256700 192897
18235 192897 -418674 -18436 -31193 -49571 -214868 -70054 -174543 26209 142324 -194400
18224 38248 -41665 287633 -45008 -43183 -398255 -18442 234722 47668 -246219 70472 -83388
18212 -96959 -44023 -27638 -57076 -222282 324767 -336490 243517 110890 -55201 -50949 117522
18200 409296 156527 15904 388461 267386 98499 -323269 26489 49134 -176461 -25292
18189 173068 -81427 -61137 -184042 -271595 77399 279432 46797 -400230 45644 223851 49268
18177b50191E926a31318b6426A28942a93587B56393b13980f3215i817j33911J4667
18166a29061N6472j61276C9369b43196K5332A69769a50158j47239A92871c58600
18155h8073R493A29191b04717B19844b21810q516n4969J07899A6062a72120k26301
18144c98421h2679r239j30364O9814B32073a2949J128k76555e1145J3923B25273
18132A39125i2102A8015d60022K14892H2125a07117M5303A14982b22446A50228
18121c0056M388F8026a51448e5687K4056A6291b27169I6696b74078D3058K3318
18110F6376J32072h8824B32875b7261j68027m08582A14941h9951K5239A81877
18099C6316J62422o054i6089A18517M9769n4247L2598g0424B61234H3490C4176
$$ plain form
18177 -250191 5926 -131318 -26426 128942 -193587 256393 -213980 -63215 -9817 -143728 -129061
18166 -129061 -72589 -233865 39369 -243196 -217864 169769 -150158 -297397 192871 -358600
18155 -88073 -78580 129191 -204717 219844 -221810 -230326 -285295 -177396 16062 -172120 -398421
18144 -398421 -82679 -91918 -222282 -152468 232073 -12949 -11821 -288376 -51145 -37222 225273
18132 139125 -92102 18015 -460022 -245130 82125 -107117 -61814 114982 -222446 150228
18121 -30056 -25668 68026 -151448 -55687 -31631 16291 -227169 96696 -274078 43058 66376
18110 66376 198448 -88824 232875 -27261 -195288 -603870 114941 -89951 -64712 181877
18099 36316 198738 192684 -96089 118517 168286 114039 146637 -70424 261234 83490 34176
18087d982B9205h9772A17070a89136L7644l521b8584r7184A70608a46008f3642
18075a3947A07626d1105j44785I1978a50444C30081E0724L834Q3328g5192A10938
18063a70520C34816d3862G4783a50121j75138a0156a864A97141a15827c6630o3772
18052a00402I4144J57141C5900a95815G645L8249j6910c57271h572j03716c793
18040A21871a80219A03392c1837o9634L643J8183A21407a20811C18659M4384E2113
18028B08887a45000B17318e6029m8206C01622f0456A5869b18479A85052P8127
18018B63179d85251C43495A45907a35387A15614b07898d442C73300A64774a6445
18007i8020a2495k40070a17802n9515A25815b82249A6233O9609A2423b12122d0409
$$ plain form
18087 -4982 29205 -89772 117070 -189136 -151492 -155013 -28584 -125768 170608 -146008 -63642
18075 -13947 107626 -41105 -185890 91978 -150444 330081 50724 54558 137886 -75192 110938
18063 -170520 334816 -43862 74783 -150121 -325259 -10156 -1864 197141 -115827 -36630 -100402
18052 -100402 94144 251285 35900 -195815 7645 45894 28984 -357271 -8572 -112288 -3793
18040 121871 -180219 103392 -31837 -101471 -97828 -79645 121407 -120811 318659 363043 52113
18028 208887 -145000 217318 -56029 -104235 301622 -60456 15869 -218479 185052 263179
18018 263179 -485251 343495 145907 -135387 115614 -207898 -4442 373300 164774 -16445
18007 -98020 -12495 -252565 -117802 -177317 125815 -282249 16233 85842 12423 -212122 -40409
17995f3129n7430G6861K1065J1474k4428a97219E8839R3890J42044b67974J31220
17984a36754A48840B0835c44734G6542M8472K93560I9691O0961A0679i7595H2712
17972b36740A17391a7074n29245b49317F5127b70412d7138r5100H8596a03075
17961a95041A3619m641a96914m37239A07340c8979B02372i3367C5489O0237e2556
17949i6710q1507E1853a0694E3678F727b60248B23522E1191a57618A35412k6613
17938A08799a12337A79334c0331k2989q8677m8422k00216a59497r8493A64688
17927C14522j07176b91847a28883m9932g6833j01437P1500j39123a5458k58737
17917b74195c5874A91550D9737b24676A40166b1063A85452b21590M404A88080
$$ plain form
17995 -63129 -120559 76861 97926 109400 84972 -197219 58839 152729 294773 -267974 -136754
17984 -136754 148840 20835 -344734 76542 125014 418574 99691 160652 10679 -97595 82712
17972 -236740 117391 -17074 -546319 -249317 65127 -270412 -47138 -142238 88596 -103075
17961 -195041 13619 8978 -196914 -634153 107340 -38979 202372 -93367 35489 95726 -52556
17949 -96710 -178217 51853 -10694 53678 6727 -260248 223522 51191 -157618 135412 108799
17938 108799 -112337 179334 -30331 -53320 -141997 -190419 -390635 -159497 -257990 164688
17927 314522 207346 -291847 -128883 -178815 -76833 -178270 -106770 -245893 -15458 -274195
17917 -274195 -35874 191550 49737 -224676 140166 -21063 185452 -221590 -217186 188080
17906b13542H6140b20256A33904o953d2545B86538b0803m1329j90962Q3576B3844
17894i6218k15090h3391j77579c3936B91710a65116k8406M6857B42125p400b5907
17882a89905M7794B02351j0314l3647O0709A00884i5091j97938F5739A7209L46719
17871C63928C571c2723j03771c1508E3202Ba59421P4979k2075b1501j74080J3974
17859a81607d1288p9243k0193K0331D5813J30233B7145L30094a28054k57003B2407
17847a44534I2421a71883H5363h0878L2320j95933D2992d5071m2035A90238a1651
17835D422K95966h1189j30597E7563J52484A1724a5323l14373b0466C885d22956
17823C16507h1191j28509k22021E885L580K14359k4137a86548B15937h9159k6910
$$ plain form
17906 -213542 86140 -220256 133904 126951 -42545 286538 -20803 -62132 -253094 -169518 23844
17894 -96218 -311308 -83391 -260970 -33936 291710 -165116 -193522 -146665 242125 234725 -25907
17882 -189905 -142111 202351 192037 158390 219099 100884 -95091 -293029 65739 17209 363928
17871 363928 3571 -32723 -136494 -31508 53202 2 -159421 -84442 -106517 -21501 -195581 -181607
17859 -181607 -41288 -120531 -140724 -120393 45813 176046 27145 357239 -128054 -385057 22407
17847 -144534 92421 -171883 85363 -80878 -48558 -244491 42992 -45071 -87106 190238 -11651
17835 4422 300388 -81189 -211786 57563 210047 11724 -15323 -329696 -20466 3885 -422956
17823 316507 -81191 -209700 -431721 5885 9465 223824 199687 -186548 215937 -89159 -116069
17812a16069A15156a23856C4871O2471P6693K34966a84882P7998H1265b20530
17801B6283K7600K56080g0638J9546B10910I7351f9628j11102k0862K9077l6B63384
17788A93270d4863B52824q9592a46200A63742a14544B64491j12593A6267J16439
17778A32706G201a65612A94554a3706b787p6608k79525B43472E4864P6931g3491
17766a14665B96512F9710J52395C4264O6791O4340J88771b58702A11463f8562
17755I1619J57049a34681M0542l7098k48749P9510B17245h5340A86729K7424d3925
17743b93992B11926K8373N6736G9187d4854A84057b42531F5665a16684j76898
17733b93582b0671n5269p312B1118a80306A03194c2230j85001B77396a48780j02589
$$ plain form
17812 -116069 115156 -123856 34871 97342 174035 409001 -184882 -106884 81265 -220530
17801 26283 53883 309963 -70638 -51092 210910 97351 -69628 -180730 -201592 -172515 -172551 263384
17788 193270 -44863 252824 163232 -146200 163742 -114544 264491 151898 16267 132706
17778 132706 7201 -165612 194554 -13706 -2787 -79395 -358920 243472 54864 131795 -73491
17766 -114665 296512 69710 222105 34264 101055 165395 354166 -258702 111463 -68562
17755 91619 248668 -134681 -94139 -131237 -379986 -300476 217245 -85340 186729 214153 -43925
17743 -293992 211926 240299 297035 79187 -44854 184057 -242531 65665 -116684 -293582
17733 -293582 -20671 -75940 -83252 21118 -180306 103194 -32230 -217231 277396 -148780 -251369
17722b51369d7903A16735d0963r2676b5273k26B6524b99442h1979b1494B46049
17710B24944b5185A79457c26268g0893j5007A56769J2667e3365B6167K90879g8201
17698a05472M5857C36386a01715E9339a89190M584A21936B1758c9362m34352c5250
17686b40489d3244I352c62750D5124b3522j10971d3991H9351M0168J8213f8921
17674b68071i8511j67984b8437B38296g1301C0247J36125p6665k424H065a1091
17662f740B20213a86391L2324A51843b4766C329K77912q684a3743C22927C06N2047
17650E2353c00519A19072c4225J6529D5298e5350A84146C896K73217a33117f267
17638B48076h9832C3630f5498C13527A51120a04383C5087a3460j7281q408J7168
$$ plain form
17722 -251369 -47903 116735 -40963 -133639 -25273 -25499 26524 -299442 -81979 -21494 246049
17710 224944 -25185 179457 -326268 -70893 -85900 156769 169436 -53365 26167 317046 -78201
17698 -105472 -59615 336386 -101715 59339 -189190 -184606 121936 21758 -39362 -473714 -35250
17686 -240489 -43244 9352 -362750 45124 -23522 -134493 -43991 89351 129519 147732 -68921
17674 -268071 -98511 -266495 -28437 238296 -71301 30247 166372 89707 87283 8065 -11091
17662 -6740 220213 -186391 -154067 151843 -24766 3329 281241 272557 -13743 322927 306 52353
17650 52353 -300519 119072 -34225 -17696 45298 -55350 184146 3896 277113 -133117 -6267
17638 248076 -89832 33630 -65498 313527 151120 -104383 35087 -13460 -30741 -39149 -21981
17627b1981j01560A33228l4156b5090B77999D4037N7968C4867a97678A05857n1671
17616E4186L4438c7471j32778H813J91332m5741j344l415P154C2469c45929e9365
17603a23630B0934K4345L1249A2382J5940K03253h6186D23384b301j4672A32216
17591A06523M7101a29632C61076j70669p9595M9828J1933K77156E4242Q6136E2078
17579a7599F1657J50735a65976A60765b18373D10068A35845e9473B4738i8111
17568A27516K00K2853d02459i8678m313g722B795J535d6831E7896e46252B85288
17555F6709a75844A80684J89206A23965J10281a19920B304d7528B30822H8200
17544C436f2593j11404a378A75134n1307b66803b9710C60441A75482b7972A02342
$$ plain form
17627 -21981 -123541 133228 99072 -25090 277999 44037 102005 34867 -197678 105857 54186
17616 54186 88624 -37471 -170249 8813 200145 154404 153060 149645 156799 32469 -345929 -59365
17603 -123630 20934 45279 76528 12382 28322 231575 -86186 423384 -2301 -16973 132216
17591 106523 153624 -129632 361076 190407 110812 160640 172573 449729 54242 140378 52078
17579 -17599 61657 212392 -165976 160765 -218373 410068 135845 -59473 24738 -98111
17568 127516 127716 150569 -402459 -98678 -102991 -7722 2795 4330 -46831 57896 -546252 285288
17555 66709 -175844 180684 369890 123965 234246 -119920 2304 -47528 230822 88200
17544 3436 -62593 -173997 -1378 175134 123827 -266803 -29710 360441 175482 -27972 102342
17532A85028i7832B1796c1595k19390J02959A59920h6265H0020Q5664E2365P5288
17521A27653h8619A20186B2526K51885A03526C4232a06050A59875o8909O3209
17511A54175J19630M08483k84483D9163a08524A87466p3066j3152a36791A30454
17500A09936D2944J17394J35316a39778A78059e822B60298a59518N5615a255A3087
17488c85342B66748E314K53026a94702b3805A36791D3515N254J03283K25355q7901
17477B89506m6919J68220b0809B07035p1719L5164E6679J41088J70948P5995I519
17465d6212q0372B52971A0620K35001g2169j72689a20799G8818b8424D5667J05576
17454A51243J10651m5105L777n712L0293M4161P193N29127g1477B62901l7105
$$ plain form
17532 185028 -97832 21796 -31595 -250985 -148026 159920 -86265 80020 165684 52365 127653
17521 127653 -88619 120186 22526 274411 103526 34232 -106050 159875 90966 154175
17511 154175 273805 682288 397805 49163 -108524 187466 114400 101248 -136791 130454
17500 109936 42944 160338 295654 -139778 178059 -5822 260298 -159518 -103903 -1255 13087
17488 -385342 266748 5314 258340 -194702 -23805 136791 43515 48769 152052 377407 289506
17477 289506 242587 410807 -20809 207035 135316 170480 56679 197767 368715 444710 9519
17465 -46212 -126584 252971 10620 245621 -72169 -244858 -120799 78818 -28424 45667 151243
17454 151243 261894 216789 220566 214854 245147 289308 296501 825628 -71477 262901 225796
17443B25796m5123n5033K73722K9431j1112j11873A45346R5038J85935A0077K81468
17432B91545L9158J01191B11326P1843j01228k2581J69604B9594K34325A16123
17421B03905K11070j61388L1253a29069A55165M7445a15343C03641j23222M5425
17411B25844C5542Q4873L9226K28094o6830p1730J1002a3124I3700O5964o6037
17400I3627J01750p2357C7242c2241A54185J09797k4557r2809J81348j37349l8845
17389A51770L9288a17301A86427q5418D4123g6768C299i5414A13070k7918e2194
17377a6892A88699J39945g8986l1031M270B90055j2829D4947h482A80204J79729
17366C59933a92552p3592A5093K43130i7103F7257c9672d209C34405N8699l2733
$$ plain form
17443 225796 180673 125640 399362 428793 417681 305808 145346 240384 426319 10077 291545
17432 291545 330703 431894 211326 283169 181941 159360 328964 29594 263919 116123
17421 203905 414975 253587 284840 -129069 155165 202610 -115343 303641 180419 225844
17411 225844 35542 120415 159641 387735 320905 249175 260177 -13124 93700 159664 93627
17400 93627 195377 123020 37242 -32241 154185 263982 239425 146616 327964 190615 151770
17389 151770 191058 -117301 186427 101009 44123 -76768 3299 -95414 113070 85152 -52194
17377 -16892 188699 328644 -78986 -110017 -105747 290055 277226 44947 -8482 180204 359933
17366 359933 -192552 -266144 15093 258223 -97103 67257 -39672 -4209 334405 393104 360371
17355C60371q7242D8069J01580K2814K3139c09497J29566a5246A50448a49303
17344H1564k9599J44139L186o5609j3623a89820E29867B34336J31244j49720H8635
17332c1620E9026K04822b87699G0959J94854k2484L4834l6271L1348a0890B33764
17320A68635B888J50850P3215j3560a15600B88573A09299K82654n241A53536o4911
17309H8625M2089L5649c9911B85638O1014j18507A6985J69781l013b38844C15177
17297B61777a5498C6672J61446J92280J10421k18003E4692f9953E518J29335O0151
17286A95004D6221L28388A63608K25145B0694M70990k24319r0970Q5840b1978
17275C14387A18334b1157m6453B15785J52054F5403O4739J59288A04422k9647
$$ plain form
17355 360371 273129 48069 149649 172463 195602 -309497 -179931 -15246 150448 -149303
17344 81564 51965 196104 199290 133681 120058 -189820 529867 234336 365580 215860 88635
17332 -31620 59026 263848 -287699 70959 265813 243329 278163 241892 273240 -10890 233764
17320 168635 2888 153738 226953 213393 -115600 288573 109299 391953 386712 153536 88625
17309 88625 130714 166363 -39911 285638 346652 228145 16985 186766 183753 -238844 315177
17297 261777 -15498 36672 198118 390398 500819 282816 54692 -69953 5518 134853 195004
17286 195004 46221 374609 163608 388753 20694 491684 267365 176395 262235 -21978
17275 314387 118334 -21157 -67610 215785 367839 65403 130142 289430 104422 74775
17265G4775k140R9549Q5563K9884r5795G9858J61867D9146A1660J96440F9045
17253B65429D7402K4221R1485K17160A75758l7107a871B61220j25497m6429c2854
17241A43812E3842L7649C2472L2350a70776H3674n569J14601M4913b36700B84018
17229B47309N0151i0788J0015C36035R6337H1466J51844A9766J72516L8608q4439
17218A46451a01939H1311L24690J79083k4824q6465d952A68478k2472R5837l0323
17207B11520N5594l8929J02307j56927O5032P3510J21060J44636B49168m1874
17197B07294H9583K47497L12206k05175j0385I5653K51005l2357A39263J22359
17187B61622H9594d8141D9315L49281q1821Q4065A48887L44011A11689J8314O0066
$$ plain form
17265 74775 72635 172184 257747 287631 191836 79858 241725 49146 11660 208100 69045
17253 265429 47402 71623 163108 380268 175758 138651 -1871 261220 135723 89294 -32854
17241 143812 53842 91491 32472 64822 -170776 83674 78105 192706 237619 -236700 284018
17229 247309 297460 -90788 -80773 336035 432372 81466 233310 19766 192282 230890 146451
17218 146451 -101939 81311 406001 585084 560260 473795 -4952 168478 146006 241843 211520
17207 211520 267114 228185 330492 173565 238597 312107 433167 577803 249168 207294
17197 207294 89583 337080 649286 444111 433726 95653 346658 314301 139263 261622
17187 261622 89594 -48141 49315 398596 316775 400840 148887 492898 111689 130003 190069
17176A90069H2262K15233K8537a70423D37817l1710j09834K80847B77445j33956
17166A43489J12444q573K24135A18933K01389J04034J78020j00985B14868B5252
17155A90483M39272B99922q1580J49047J30207k05691P5614A11514J25812J69425
17145D06751G0327K38733f9148D3249J18853L41345j50555A50067J34646K87428
17135E72141A57120O5951J18773J20535j58305B6779L4530K80581j50538k9891
17125A61461m4576L75409j39359N9537l0223J33905k40535L84041k42982K82171
17115F98849A92929L51479A57670K50218C9154L62580j66459K64545B11634J99200
17105D10834J34405k26185l821k9756o9090b49373G38345A92941J90658j40416
$$ plain form
17176 190069 82262 297495 326032 -170423 437817 406107 296273 577120 277445 143489
17166 143489 255933 247360 471495 118933 320322 424356 602376 501391 214868 25252
17155 190483 629755 299922 218342 367389 497596 291905 367519 111514 237326 406751
17145 406751 70327 309060 -69148 43249 162102 503447 352892 150067 284713 572141
17135 572141 157120 223071 341844 462379 304074 26779 61309 341890 191352 161461
17125 161461 116885 492294 352935 412472 382249 516154 275619 659660 416678 698849
17115 698849 192929 544408 157670 407888 39154 401734 235275 499820 211634 410834
17105 410834 545239 319054 315233 285477 216387 -249373 738345 192941 383599 243183
17095B43183K45686A32333M17454j01040K39199A49789K9051M42019k24703K24401
17085F20557j02243J14404j1371k28619I7033J27650L98756B97261M6321J75887
17075E19469K6997I0608L58841j3394m974k00089P0712J57192j2997Q867k7447
17064D27319J3086K22983j54682o7023j48758K98755k6872k41869R1410L71165
17054G85514k26961o1068j69999N02526j32336p1421o2596l4683k02395K50078
17044E76659J52549J174C58716J11363L5470E0363M37131m9066K63315J46272
17034H48015m8252B49462J45920M99833k79988q5159n5504M83898m43508J51150
17024F66104m9636j58964K43676j83600L41536j20705O0117k88947J87926p9092
$$ plain form
17095 243183 488869 132333 549787 448747 687946 149789 178840 620859 396156 620557
17085 620557 518314 632718 621347 392728 97033 224683 623439 297261 343582 519469
17075 519469 546466 90608 449449 436055 431081 230992 301704 458896 445899 454766 427319
17064 427319 440405 663388 508706 441683 292925 591680 564808 322939 414349 785514
17054 785514 558553 497485 327486 830012 697676 626255 563659 528976 326581 576659
17044 576659 729208 730382 358716 470079 505549 50363 487494 438428 701743 848015
17034 848015 799763 249462 395382 895215 615227 530068 474564 958462 514954 666104
17024 666104 616468 457504 701180 517580 859116 738411 798528 509581 697507 618415
17014F18415l06852O97889l90906M61990D68604L08052k84303J40402L05013O99
17004I38467m17016K25846R9609L4999m0492j90222J52021k21986M40840k16042
16994H06024o6363P3183L2033l27065J20989Q6832J48715L1211k19605J45912
16984H31866P4426P5767j44080q4859j9505L91964k36834l2775j72463L99179
16974A082686k35320m7100J79061k74905K260J21346R8252l58182L04390L73799
16964A246287j57425j07178J27616k63534j52103K97235K15757n5039j24612j44330
16954H82674K23494k2314j23888J3600P1359K94859j95420k04690J43740M4840
16944A128254m7064J26730K0613l80176L27643K22K57392J88540n22880L72979
$$ plain form
17014 618415 311563 1009452 618546 1080536 468604 776656 492353 632755 937768 938467
17004 938467 521451 747297 846906 881905 841413 651191 803212 581226 1022066 806024
16994 806024 739661 812844 844877 517812 638801 725633 874348 905559 685954 831866
16984 831866 906292 982059 837979 753120 733615 1125579 888745 855970 683507 1082686
16974 1082686 847366 800266 979327 704422 706682 828028 926280 568098 872488 1246287
16964 1246287 1088862 981684 1109300 845766 693663 990898 1206655 1151616 1027004 882674
16954 882674 1106168 1083854 959966 973566 1044925 1339784 1144364 939674 1083414 1128254
16944 1128254 1081190 1207920 1228533 848357 1176000 1176222 1433614 1622154 1099274 1472253
16934A472253k04908K42383j66308m45384N70053J19357k46170o8369n835K03214
16924A470286k46424J42055J73728l99063L84132Q501J74014m46077L29122p2617
16914A517657j70755K94678j0154Q7979o0018k45633M45951j99844q7256K60563
16904A833168j41378P5025k12537J24862J79337J35189k73782K37014N5117J17529
16894B129544k88076J31848r4852l6528J99589o7965K18833J57466n7399l10907
16884A981553K14727K92425j11186l07278R2029J49457P2150J68473j90585l5775
16874B325990j32947L88132l98275L72066K12828j53269r625q3036K77237N9194
16864B858295k70072j65569K52202m4104K86874K36667j87915R4361J18686K7050
$$ plain form
16934 1472253 1267345 1509728 1343420 898036 1468089 1587446 1341276 1272907 1267072 1470286
16924 1470286 1223862 1365917 1539645 1140582 1524714 1533215 1707229 1261152 1590274 1517657
16914 1517657 1346902 1641580 1631426 1719405 1659387 1413754 1859705 1659861 1572605 1833168
16904 1833168 1691790 1766815 1554278 1679140 1858477 1993666 1719884 1956898 2012015 2129544
16894 2129544 1841468 1973316 1878464 1841936 2041525 1973560 2192393 2349859 2292460 1981553
16884 1981553 2196280 2488705 2377519 2070241 2162270 2311727 2383877 2552350 2361765 2325990
16874 2325990 2193043 2581175 2182900 2554966 2767794 2614525 2604900 2521864 2799101 2858295
16864 2858295 2588223 2422654 2674856 2630752 2917626 3154293 2966378 3060739 3179425 3206475
16854C206475n9107K59719r0803O6780k26364K26116N57857k66663j89363M109
16844C488756K25035N709J38188P8862J52799p6947l5144J3813J33734J18191
16834D242996j59376L16652m8753L40224R7477J2675k35622L19712K26632P0677
16824E183294r9743l7009N20073j39650L77608q3384J71692k13063L79899N3949
16814F113666L47988J2956j24810M02004K51808K83807j15964N9638K49032L9727
16804G519852K33614q8435L29412O15488j45540J22456N56082l17878K80749K90516
16794I396316K46617N56554m0503K60369J16666M98253M63878J24286L50084N89060
16784A2561580n4536K60462O41799K96800O49264J64414M62791J62038O11846
$$ plain form
16854 3206475 3147368 3407087 3316284 3383064 3156700 3382816 3940673 3674010 3484647 3488756
16844 3488756 3713791 3719500 3857688 3936550 4089349 4012402 3977258 3991071 4124805 4242996
16834 4242996 4083620 4400272 4351519 4691743 4789220 4801895 4566273 4885985 5112617 5183294
16824 5183294 5083551 5046542 5566615 5426965 5804573 5721189 5892881 5679818 6059717 6113666
16814 6113666 6461654 6474610 6349800 6751804 7003612 7287419 7171455 7231093 7480125 7519852
16804 7519852 7753466 7665031 7994443 8609931 8464391 8586847 9142929 8825051 9105800 9396316
16794 9396316 9642933 10199487 10158984 10419353 10536019 11034272 11498150 11622436 11972520 12561580
16784 12561580 12507044 12767506 13409305 13706105 14355369 14519783 14982574 15144612 15756458
16775A5756458O55708K94594P72832K71817Q23396J113793M83428M11298Q89500
16766B1472824Q52969P48364P59189R28893Q82318J184471Q43431J111803P50937
16757B9535199J972750J192622J065131J667848J727763J258904J916165K043502
16749D2379884J767486K405592K273385K425502K494900K870188L242710K656625
16741F2516272L439963L332920L646080M396284M261543M110618M930293M809273
16733I5443246N169286N719388N620025O098419O230701N699426O087863O277162
16725A42345516O205629N738906N598703M739647M561361L345915K941447J694807
16717A77171931Q02685K18090j378550k318395k585505m571940m587131n102604
$$ plain form
16775 15756458 16412166 16706760 17479592 17751409 18574805 19688598 20172026 20583324 21472824
16766 21472824 22325793 23074157 23833346 24762239 25644557 26829028 27672459 28784262 29535199
16757 29535199 31507949 32700571 33765702 35433550 37161313 38420217 40336382 42379884
16749 42379884 44147370 46552962 48826347 51251849 53746749 56616937 59859647 62516272
16741 62516272 65956235 69289155 72935235 77331519 81593062 85703680 90633973 95443246
16733 95443246 100612532 106331920 111951945 118050364 124281065 129980491 136068354 142345516
16725 142345516 148551145 154290051 159888754 164628401 169189762 172535677 175477124 177171931
16717 177171931 177974616 178192706 176814156 174495761 171910256 167338316 162751185 157648581
16709A57648581n920091n805585o250960o165162o552267o315724o026943n831197
16701A08780652n854686n555662n107547n138357m336724m959973l787562l910050
16693G0130091l754991l332983l104301l539267k865000k318187k834564k199563
16685D6181235k255907j677121k450077j599451j397180j874042j047884j903363
16677C1976210j138414j480989j356969o87474j260319p23034j306166p46933
16669B3275912r18000o14390q56469q32403p67851m45786q50395n23495n89984
16660A6877139k46258p88564n77135l84750k81516k15303p27006o16480l44011
16651A2696116l89116j80998m17013l25521l92152l63761j38242l81494k76584
$$ plain form
16709 157648581 151728490 145922905 139671945 133506783 126954516 120638792 114611849 108780652
16701 108780652 102925966 97370304 92262757 87124400 82787676 77827703 74040141 70130091
16693 70130091 66375100 63042117 59937816 56398549 53533549 51215362 48380798 46181235
16685 46181235 43925328 42248207 39798130 38198679 36801499 34927457 33879573 31976210
16677 31976210 30837796 29356807 27999838 27312364 26052045 25329011 24022845 23275912
16669 23275912 22357912 21743522 20887053 20054650 19286799 18841013 17990618 17467123 16877139
16660 16877139 16630881 15842317 15265182 14880432 14598916 14383613 13656607 13040127 12696116
16651 12696116 12307000 12126002 11708989 11383468 10991316 10627555 10489313 10107819 9831235
16642I831235K07560p34295j20473l26059j55436q830n72952K92174n57410p7959
16632G777555L929p03079p5880K37714k79466n07004j8481m1456L2982k71604
16622F155210k39696J74757l16727r6248q0302j8549j54532k35974l42116J48945
16612D994768k2178k00735k9208j65200j15941K02514l65520K17326P927o60725
16602C863028K96586l12580J79603R8421n32020L53652j87347j76033L65644k24292
16592C724662m23185L40106l32836q3424K99381l25397J82753j50172l80782K41085
16582C092191k74015K99856j03691l91323J66666O1056j92257Q8457k59564k4225
16572B463151K30646K3575l07955q0209J93874j13495j61656j42038N07894m53842
$$ plain form
16642 9831235 10038795 9304500 9184027 8857968 8702532 8693702 8120750 8412924 7855514 7777555
16632 7777555 7781484 7078405 7002525 7240239 6960773 6453769 6435288 6393832 6426814 6155210
16622 6155210 5915514 6090271 5773544 5677296 5596994 5578445 5423913 5187939 4845823 4994768
16612 4994768 4972590 4771855 4742647 4577447 4461506 4664020 4298500 4515826 4523753 3863028
16602 3863028 4159614 3847034 4026637 4125058 3593038 3946690 3759343 3583310 3948954 3724662
16592 3724662 3301477 3641583 3308747 3225323 3524704 3199307 3382060 3231888 2851106 3092191
16582 3092191 2818176 3118032 3014341 2623018 2789684 2850740 2658483 2746940 2487376 2463151
16572 2463151 2693797 2717372 2409417 2329208 2523082 2409587 2247931 2105893 2613787 2159945
16562B159945J18796L0105j04906j27935K09086m78143N60132n24435l1958N1989
16552A862676l54567M71338k36325K57280l81207K42129n5517O1833M0133m8469
16542A859304n7660k13403L0520M4586p150M9561k98414J20674k2885J90270K73893
16531A969296m75323M0879J24181j98944p2148q1679k39607M47103k59035K68914
16521A523637J90424m39636J602J9632J43294l24912J98563r4653j21988L77694
16511A473657m03569K49427k27496J62459k74839K33224j27437N1158j94371k59725
16501F82488M84615J75202J0970m71733J60028J12935k51848J20493N8053L808
16491A085011J81528l15934j0459O0070p5645k94310J90635K42017k12312m5304
$$ plain form
16562 2159945 2278741 2308846 2203940 2076005 2285091 1806948 2367080 1842645 1810687 1862676
16552 1862676 1508109 1979447 1743122 2000402 1619195 1861324 1805807 1867640 1907773 1859304
16542 1859304 1801644 1588241 1618761 1663347 1656197 1705758 1407344 1528018 1505133 1695403 1969296
16531 1969296 1493973 1534852 1659033 1460089 1387941 1306262 1066655 1513758 1254723 1523637
16521 1523637 1714061 1274425 1276027 1295659 1438953 1114041 1312604 1217951 1095963 1473657
16511 1473657 1070088 1319515 1092019 1254478 979639 1212863 1085426 1136584 942213 682488
16501 682488 1167103 1342305 1353275 881542 1041570 1154505 902657 1023150 1081203 1085011
16491 1085011 1266539 950605 940146 1000216 924571 630261 820896 1062913 850601 805297
16481H05297K370m3071J6655R4576Q6961J80716k05617m24134L02921j16868L95594
16470A095400D37479N55944Q845K24139m95096K14833l14188M34065j94499J9959
16460H91481m4434k49516L07727m07475J98227J16438l16534J99258K43546l11455
16450F27263R0574K25741l56461L07720k63125j26846K09445j4405l05466J27061
16440E21501r3771K68777l13200K53724P7274r3353L70462l05937N2593j65381
16430E72689K23840j67022q5250M7471n3130P1376k48410J29893K41037l63363
16420C69131k8397K19858Q955j94965O4039P5423J58025j5953k59202J47962j43125
16409D01751A47200J35869J78936j0440j47136J74680p816M941j61583J56306
$$ plain form
16481 805297 807667 764596 781251 875827 962788 1143504 937887 513753 816674 699806 1095400
16470 1095400 437479 993423 1002268 1226407 731311 946144 631956 1066021 871522 891481
16460 891481 847047 597531 905258 497783 696010 812448 495914 695172 938718 627263
16450 627263 717837 943578 587117 894837 631712 504866 714311 699906 394440 521501
16440 521501 427730 696507 383307 637031 714305 620952 991414 685477 738070 572689
16430 572689 796529 629507 544257 591728 538598 609974 361564 491457 732494 369131
16420 369131 340734 560592 569547 374582 438621 514044 672069 656116 396914 544876 401751
16409 401751 147200 283069 462005 451565 304429 479109 471293 476234 314651 470957
16399D70957K10362J95260B48493K61168l5633A50363K52759N9454p1730n8062
16389C32784l0341d1585E71397A56969L37854F7897N67221j53809B09955L65572
16379E75527k76816J45720n5092o405K4382j42104J80226j11900K49566A83920
16368C01716j13014J77390J08466J17558B86856p8839J08574J10910k832a62210
16357C31230j23100O4009L10491q9046M3202o1553A09627P5770K06365J56969
16347E48731e0363B95518j01497L6055d3716E84892A48802P8454M5368K98240
16337E70864G5257K56846j5791j42433K54668G2793J29284n2608j6459K95238
16327D28248J5778r7301A56742Q5736r0802J12367e805B83357K28632p7359I2315
$$ plain form
16399 470957 681319 876579 248493 509661 474028 150363 403122 462576 390846 332784
16389 332784 302443 -41585 571397 156969 494823 67897 635118 481309 209955 575527
16379 575527 298711 444431 389339 382934 407316 265212 445438 333538 583104 183920
16368 301716 188702 366092 474558 592116 286856 208017 316591 427501 424669 -162210
16357 331230 208130 272139 582630 493584 536786 475233 109627 185397 391762 548731
16347 548731 -50363 295518 194021 230076 -43716 584892 148802 227256 272624 570864
16337 570864 75257 332103 316312 173879 428547 72793 202077 149469 133010 428248
16327 428248 444026 346725 156742 242478 151676 264043 -5805 283357 511989 434630 92315
16315F85205A18442J4235J17803E5594J91806J77069j65702M5398K63596P6782
16305F44543a18408H7202L87868G1682L33460m7759P3080A64737B7741M13930
16295D41671A10030N69072k59156c5463B7707L5641R2295b03319C46131J9885
16285C66016j63704F6907J51312J01389r7884I8513K19944N8338p9013a054A34056
16273g658C04992o8970j03764n6097N12971L4866B00893a17557D2956J52890K69455
16262D65301A04269O5023E8191A7213K95463O2892a35262D2387J8635a3679B24521
16250B21141a90246A65440b60315I6134L1519E5951Q1524a35594A85133K17796
16240D02929J18281A74391N7161Q4608o0567H0324R1947G6122b21339A99793J0421
$$ plain form
16315 685205 118442 132677 250480 55594 247400 424469 258767 304165 567761 644543
16305 644543 -118408 87202 475070 71682 405142 357383 430463 164737 27741 441671
16295 441671 110030 679102 419946 -35463 27707 63348 155643 -203319 346131 366016
16285 366016 202312 66907 218219 319608 221724 98513 318457 376795 297782 -1054 134056
16273 -7658 304992 236022 132258 76161 589132 623998 200893 -117557 42956 195846 465301
16262 465301 104269 169292 58191 17213 312676 375568 -135262 42387 61022 -13679 224521
16250 221141 -190246 165440 -260315 96134 127653 55951 137475 -135594 185133 402929
16240 402929 521210 174391 231552 316160 255593 80324 172271 76122 -221339 199793 210214
16229B10214j4963J04279p0242j01518d8832j5277C44155J10285d83A00086K65507
16218C65593j62960d4282B15294O7582j15576D1277R0765K62700b65148C48796
16207B94379A917K72800j32736i5260C52479I5115J61185p109F2783j3283K9232
16196G8732i2832A09292i647K998D32484C0069K4829a55841A23242a03662J4182
16185h9480I8487d7310C64J38580i4574B94501O7974E3757j8021J07291b611C30816
16172f5406J8498K2964B10201A3699K06596a62165B26980C6973e5735H6268J04019
16161A90287a79531e2537J4592B27787o9306n6332f8224E11759A1534J66883q2637
16150I5780J35364i2358B373L59667r2320c3329E958L1230a15805B90923B7910
$$ plain form
16229 210214 195251 299530 229288 127770 -48832 -64109 344155 454440 -483 100086 365593
16218 365593 202633 -44282 215294 282876 167300 41277 132042 394742 -265148 348796
16207 294379 1917 274717 141981 -95260 352479 95115 256300 249191 62783 49500 78732
16196 78732 -92832 109292 -9647 -6649 432484 30069 54898 -155841 123242 -103662 -89480
16185 -89480 98487 -47310 364 138944 -94574 294501 362475 53757 35736 143027 -2611 330816
16172 -65406 -46908 -23944 210201 13699 220295 -162165 226980 36973 -55735 86268 190287
16161 190287 -179531 -52537 -37945 227787 158481 102149 -68224 511759 11534 178417 95780
16150 95780 231144 -92358 2373 362040 269720 -33329 5958 37188 -115805 290923 27910
16138b91151R5440E7051a90926K0282C47808E1103J86501a79395a6490A37805
16127a76557A90787A7894J26925a65355A07286R3458k8269b19330b3263B84a72913
16115A71728a0576j6305j051o8498L6102A10742F633K16327G9994c10472D68a2561
16102H7334J40729I795i873A9063K5116g5129A83327q9501A2231h3879A48439
16090B05235m5523d6064o142j12752j94363g6357A14991e9394D9799R6017K50338
16079C96154c04583C9539a13715A95855p0996j9485M0744A2644J00769e817B69831
16067a36661H3086e0277n6634e0680l2k38523f8623B31922o5528P4194r6615M6268
16055A90241D9297b0256B55157D397i8010G5270i9257H6616J42194a78461d2636
$$ plain form
16138 -291151 -195711 57051 -190926 -170644 347808 51103 237604 -179395 -16490 137805
16127 -176557 190787 17894 144819 -165355 107286 200744 172475 -219330 -23263 284 -172913
16115 171728 -10576 -26881 -27932 -96430 -60328 110742 6633 222960 79994 -310472 468 -12561
16102 87334 228063 9795 -9873 19063 44179 -75129 183327 93826 12231 -83879 148439
16090 205235 159712 -46064 -52206 -164958 -359321 -76357 114991 -59394 49799 145816 396154
16079 396154 -304583 39539 -113715 195855 124859 105374 146118 12644 113413 -5817 269831
16067 -136661 83086 -50277 -106911 -50680 -50712 -289235 -68623 231922 166394 240588 143973 190241
16055 190241 49297 -20256 255157 4397 -98010 75270 -99257 86616 228810 -178461 -42636
16043C06329a53671J6202a9137G4674J08666m8297g7259j45140K8298A75484c8433
16031f0747k67092A23460D4797f6624J9834D0487J31600b38484D2554J53767b31850
16019E1118b44079K8117A45458R2787o5375a03649D33952e5273A32249a53715
16008g4252j87918a15326d9638J9897B2961b40056A35121b20238H8279a31112
15997H315a58766A14402K079d3532j16992A0715J58847e4030L005E0849J0480
15986F1329B6723J42060J50201J34044J33031j47189p2425B5981J16584p0275
15976G2290j4171A58b12449a00724E6590b97413d1577j51644B11438j01427l4138
15965G5873K74052d8198q2328A90429a46861A01879f4482F168K03920b21385A61030
$$ plain form
16043 306329 -153671 -137469 -19137 74674 183340 135043 -77259 -222399 -194101 175484 -38433
16031 -60747 -327839 123460 44797 -66624 -46790 40487 172087 -238484 42554 196321 -231850
16019 51118 -244079 -215962 145458 238245 172870 -103649 433952 -55273 132249 -153715
16008 -74252 -262170 -115326 -49638 -29741 22961 -240056 135121 -220238 88279 -131112
15997 8315 -158766 114402 116481 -43532 -160524 10715 169562 -54030 -51025 50849 61329
15986 61329 26723 168783 318984 453028 586059 438870 366445 25981 142565 72290
15976 72290 58119 158 -212449 -100724 56590 -297413 -41577 -193221 211438 110011 75873
15965 75873 349925 -48198 -130526 190429 -146861 101879 -64482 6168 210088 -221385 161030
15953G7427L10215b752k45388f0912g569A37222O7860b366A07676j1608c13548
15941G4767b31140c8104l65739A56477K0633q1079Q616b27064m6649a7541A14476
15929A94126d1601r1795j35672G8639a82240i295j20078A01561c1797j56350D17093
15917D3574a12325j12658g2390K2380k84029F4924a13235H3752a80954e555l58727
15906c64282e0537q1610K5188b3170D1471J21346g0439P789A59330J1410A119
15894a85469H2318a65925C9524a39549E2102b84254R4657j049B57881b10775d1864
15882g4458q468j48541P1443A73361L9913o591D8176h7713k40308C4652J32319
15871A66971b58437A28135K53612d6674F9444M3502b89588H6252j8477c20632
$$ plain form
15953 77427 387642 -2752 -248140 -60912 -7569 137222 205082 -2366 107676 96068 -313548
15941 74767 -231140 -38104 -403843 156477 177110 96031 104647 -227064 -273713 -17541 114476
15929 194126 -41601 -133396 -269068 78639 -182240 -9295 -129373 101561 -31797 -188147 417093
15917 43574 -112325 -224983 -72390 -50010 -334039 64924 -113235 83752 -180954 -5555 -364282
15906 -364282 -50537 -132147 -106959 -23170 41471 162817 -70439 -62650 159330 170740 1119
15894 -185469 82318 -165925 39524 -139549 52102 -284254 -189597 -190646 257881 -210775 -41864
15882 -74458 -82926 -231467 -160024 173361 213274 206683 48176 -87713 -328021 34652 166971
15871 166971 -258437 128135 381747 -46674 69444 112946 -289588 86252 67775 -320632
15860b024k46566a8164B1535a90853A04103c9088A29549O8715b72574C72385A72417
15848a8813m07207J91604E4326J00752a36708j75541C79952b37381h2317B26259
15837c74034J70801A67549i8121j99132O3395A71429b27181o0116B48776d22672
15826a2453D8295g9581A02380B2194a23008b4211j09530j7030n1076N7777D2694
15814f9607o1169h198p5860f806E3449a51614f580J330B73306j34137a00647C08789
15801A42778J6547b1293j76340A67933B5213a80535p9927F5381a14893k31733
15791c46626J60229k3609M5686K6302p3184m482d7199j40714a5374D7645P485
15780E5130K76671a90146h9576M4625B47418c64598B37969a46096H247P2153a41817
$$ plain form
15860 -2024 -248590 -18164 21535 -190853 104103 -39088 129549 198264 -272574 372385 172417
15848 -18813 -426020 -234416 54326 155078 -136708 -312249 379952 -237381 -82317 226259
15837 -374034 -203233 167549 -98121 -297253 -233858 171429 -227181 -287297 248776 -422672
15826 -12453 48295 -79581 102380 22194 -123008 -24211 -133741 -150771 -201847 -144070 42694
15814 -69607 -130776 -8198 -84058 -6806 53449 -151614 -6580 -5250 273306 139169 -100647 308789
15801 142778 159325 -21293 -197633 167933 25213 -180535 -260462 65381 -114893 -346626
15791 -346626 -186397 -210006 -164320 -138018 -211202 -215684 -47199 -187913 -15374 47645 55130
15780 55130 331801 -190146 -89576 -44951 247418 -364598 237969 -146096 8247 80400 -141817
15768D8696J99576a56921M727K1959K6382o1339E5779f3952C9227h4433l584a9881
15755B80530b19135d2742d918C2199J28217j0514R2048l9908e2148C38445a47389
15743B258f2504A27285K8746e3299B61892E0254J06703e8069k4803B6449a09621
15731c85988C4984J05620b07358A457K85471G8638M2141d74608C0278P3103a32791
15719b69449H1145a3620j10013k61077a80914B86865A2033J345K38916b19473
15708b16987E0816b5611o9736F5458h5593r8914B69483a55384g096j80368h6784
15696h8760b7803A90421d789A41534q14K51247j61301a8673A20687b97942J25918
15685a72024C57939b5715m0308A314a0335j41231A070c14200R4178C01292i8457
$$ plain form
15768 48696 248272 -156921 -152194 -130235 -103853 -165192 55779 -63952 39227 -84433 -88017 -19881
15755 280530 -219135 -42742 -4918 32199 160416 149902 241950 202042 -52148 338445 -147389
15743 2258 -62504 127285 156031 -53299 261892 50254 156957 -58069 -82872 26449 -109621
15731 -385988 34984 140604 -207358 1457 286928 78638 120779 -474608 30278 103381 -132791
15719 -269449 81145 -13620 -123633 -384710 -180914 286865 12033 13378 252294 -219473
15708 -216987 50816 -25611 -95347 65458 -85593 -184507 269483 -155384 -7096 -187464 -86784
15696 -88760 -27803 190421 -4789 141534 140720 391967 230666 -18673 120687 -297942 -172024
15685 -172024 357939 -25715 -66023 1314 -10335 -151566 1070 -314200 -220022 301292 -98457
15673b59494A45765n9112c856r2478A22532l9179k6210a3099C39469n9531E2121
15661G4112c6239I8722N4290j1435n6661J86694h415n5491D1915a31643G5964
15649A60645i1174o3547A67739F0287a08187k40323H7196b55540P6376J4597N8172
15638a06395A24125e45535A1556R9920Q6511b9928f143m4520E1820b43675d4168
15626C321d3408p0611A2381L472h809B4203a17169L6659J9j11445N5012M6337
15614i0587a425j34222f1030k18985c0270A60409a78324A24243c79960A0489b28981
15602I5300c55679a02942F0298c58773A67959m8792J00692a34979O1994D0419
15591a786H565J53760E1099a23055j2093A08798J34971C2011b58432j10023A6897
$$ plain form
15673 -259494 145765 86653 -3856 -96334 122532 83353 57143 -13099 339469 279938 52121
15661 74112 -36239 98722 153012 141577 84916 271610 -8415 -63906 41915 -131643 75964
15649 160645 -91174 -154721 167739 60287 -108187 -348510 87196 -255540 -179164 -164567 -106395
15638 -106395 124125 -545535 11556 111476 197987 -29928 -6143 -50663 51820 -243675 -44168
15626 3321 -43408 -114019 12381 15853 -8809 24203 -117169 -80510 -80491 -191936 -136924 -90587
15614 -90587 -1425 -135647 -61030 -280015 -30270 160409 -178324 124243 -379960 10489 -228981
15602 95300 -355679 -102942 60298 -358773 167959 119167 219859 -134979 -72985 40419
15591 -1786 8565 162325 51099 -123055 -135148 108798 243769 32011 -258432 -368455 16897
15579A01334a28404n4593B81362c54536F8203L7824e504m8609A18550b40147B3236
15567B4014R7547a9148A13795J69388c30710A17517e9175A8402K11997q8744n3371
15556H8284g6302K0636D1865c18953f3955A16999M4377h4350j84416A95378o3502
15545A31876C12P1303d6567k78600B2204i301j31694n4414E601Q0002J64694i9610
15532F7400c76888B3K60162l5829c051A14520O1506a11481G8651f0379A46572
15520b45774A1221i1799K2388A81474J90983d5305B18488K75621b07091E5224
15509C30541D3690c03304d4833j43138d2973j46476B77548b86797A25367a35677
15498a03589g054m2669A11426k2842a60045D86600f9334E4656g5199D26792b86549
$$ plain form
15579 101334 -128404 -182997 281362 -354536 68203 106027 -5504 -54113 118550 -240147 23236
15567 24014 121561 -19148 113795 283183 -330710 117517 -59175 18402 230399 141655 88284
15556 88284 -76302 -55666 41865 -318953 -63955 116999 161376 -84350 -268766 195378 131876
15545 131876 312 71615 -46567 -325167 22204 -9301 -140995 -195409 5601 85603 250297 -99610
15532 67400 -376888 23 260185 224356 -3051 114520 176026 -111481 78651 -60379 146572
15520 -245774 11221 -91799 -69411 181474 372457 -45305 218488 494109 -207091 55224
15509 330541 43690 -303304 -44833 -187971 -42973 -189449 277548 -286797 125367 -135677
15498 -103589 -7054 -49723 111426 88584 -160045 486600 -69334 54656 -75199 426792 -286549
15486a07997a1688B315d49526q8593A20398E6124a90199B4917f2471B91731P2931
15475C64662A215J23976j5362D2093L0641P590g2664k40679B13841a38633L4778
15464a03855D2783K70439g0284j71519B31887g54j2785E6323a12590k6377I7078
15452G5697L4818b88910G3558a36251f7889F0269b2556j50295o3402J6074J1863
15441b08316c1668A10978k5527d9490a6727e324k14930h6190L804j50662F3602
15429a00479H1477e333o602F5473b70487B24438a1820B04428A7331h2678c7882
15417b67730i9351A71900e2647B82657e0751B78050E5780A2908c4491b965r4128
15406i7093q6820j31303A27587i1936k10572j576a4153A50783a12425E9329J18280
$$ plain form
15486 -107997 -11688 2315 -449526 -538119 120398 56124 -190199 24917 -62471 291731 364662
15475 364662 1215 125191 109829 42093 72734 80324 -72664 -313343 213841 -138633 -103855
15464 -103855 42783 313222 -70284 -241803 231887 -754 -13539 56323 -112590 -138967 97078
15452 75697 110515 -288910 73558 -136251 -67889 60269 -22556 -172851 -236253 -220179 -208316
15441 -208316 -31668 110978 85451 -49490 -16727 -5324 -220254 -86190 -82386 -233048 63602
15429 -100479 81477 -5333 -11935 65473 -270487 224438 -11820 204428 17331 -82678 -37882
15417 -267730 -99351 171900 -52647 282657 -50751 278050 55780 12908 -34491 -2965 -97093
15406 -97093 -183913 -315216 127587 -91936 -302508 -304084 -14153 150783 -112425 59329 177609
15395A77609P5311c08331R9644c0586j9967H5765c3864a2551d24A872c279l67146
15383c70425D5938c24880i4025M5744D09764d0421A82768D8795J56366e2255m6349
15372i8604C76223D0421e2999D2023O0665j5615P3899b07277E9293a1868n2165
15361f4033j31905A02857i917l06421J52702F9899e6842A63138a73883B37431
15350f5442E0870a5641l6597j07510A00920J0652d7593a2547A43478P6135D2666
15338I4963c07225h2723A53625J12122i8549A05834k5381b06327I8305h014j9179
15327b7193q0964L9389j26444A75345o6765K02121q636c0455B10663E145i6914
15315A3967J4415J2919N487O754a78562D38592A60555F837h4419B95336d9875
$$ plain form
15395 177609 252920 -308331 -208687 -30586 -50553 85765 -33864 -12551 -424 1872 -3279 -370425
15383 -370425 45938 -324880 -94025 -48281 409764 -40421 182768 48795 205161 -52255 -98604
15372 -98604 376223 40421 -52999 42023 102688 87073 160972 -207277 59293 -11868 -64033
15361 -64033 -195938 102857 -9917 -316338 -163636 69899 -56842 163138 -173883 237431
15350 -65442 50870 -15641 -52238 -159748 100920 111572 -47593 -12547 143478 219613 42666
15338 94963 -307225 -82723 153625 265747 -98549 105834 80453 -206327 98305 -8014 -27193
15327 -27193 -108157 -68768 -195212 175345 108580 310701 302065 -30455 210663 5145 -96914
15315 13967 28382 41301 46788 53542 -178562 438592 160555 6837 -84419 295336 -49875
15303B5944n151J63524D1500R2214d8183o9481J1263I973J01885J19332K9838
15292B61028a63716A12265J43064K2284i7923e275r09A30429N7073F4905a07428
15280B49911N066a24629B70751A21122P9850p1546n5339e2291i948q4708A32206
15268C22814a37953j92499d044B29172H5037a51556A92691a74116B10753G8403
15257a47888C36927f2005A90601p9315C6392O4639D6418J05845L43432J107546
15247A603241l14734J16752K93027G70270j51340A57051B4504N469d9271E5700
15236B05163O8524D87a58672f0585q6988C82196a1631K335l2620C4286K41560
15225B75846P4919A0438K47114f917j16625C50065a19051C64716A66328F5391
$$ plain form
15303 25944 20793 184317 41500 133714 -48183 -117664 -106401 9973 111858 231190 261028
15292 261028 -163716 112265 255329 277613 -97923 -5275 -6184 130429 187502 64905 -107428
15280 249911 254977 -124629 270751 121122 200972 129426 74087 -52291 -9948 -94656 132206
15268 322814 -137953 -330452 -4044 229172 85037 -151556 192691 -174116 210753 78403
15257 -147888 336927 -62005 190601 111286 36392 101031 46418 152263 495695 1603241
15247 1603241 1288507 1405259 1698286 770270 618930 157051 24504 29973 -49271 55700
15236 205163 273687 487 -158672 -60585 -147573 382196 -11631 -9296 -41916 34286 275846
15225 275846 350765 10438 257552 -6917 -123542 350065 -119051 364716 166328 65391
15214B81721a91788D990K06469o6526C6758J82471m466b9801k54010B796P0816
15203G3612A4436N645K14518g0730p5173C79281A77427a11536D4719L12886D6840
15191D01743c36050A16433A3613c16164b4924a1687C62266c5719C40349a45737
15180f4436A5666a57467A14878b7243j31929C1198M36511a29299B34135q2824
15170A51311J95245c5304B28202b8927j40510g9174D4027K54012j41647O0075
15160B16467h1995E2248a27725r1466B15672a16731B00569J87168I9501r246J15189
15149B05444R4490E0564J47977A4281a5549D27377j86853j13252l5100O7496L7216
15138A96884b4478A28816M1913o5787f903j7586r5178j27036B93413j24777c3692
$$ plain form
15214 281721 -191788 4990 211459 144933 36758 219229 214763 -29801 -283811 2796 73612
15203 73612 14436 20081 234599 -70730 -145903 379281 177427 -111536 44719 357605 46840
15191 401743 -336050 116433 13613 -316164 -24924 -11687 362266 -35719 340349 -145737
15180 -64436 15666 -157467 114878 -27243 -159172 31198 467709 -129299 234135 151311
15170 151311 346556 -35304 228202 -28927 -169437 -79174 44027 298039 156392 216467
15160 216467 -81995 52248 -127725 -219191 215672 -116731 200569 387737 99501 90255 205444
15149 205444 299934 50564 198541 14281 -15549 427377 240524 127272 92172 159668 196884
15138 196884 -24478 128816 170729 104942 -6903 -24489 -119667 -246703 293413 168636 -33692
15126a7272j61383A91594G7347h498B42812F4442P2407l7181K1764D442a74558
15114a1284A76014F2938N6983c5227A1705O9178L21355I9219K08181q5384c20976
15102B72160m3506a18477j68418g3977C67335r9447r9903q3918a38930b5062j01543
15091a26605B20777k3884E9434J97056A07162L86960j91403A46637P5361J10474
15081C32472j09219Q1952E7085K40654O583a79604B09310p1859n8403C6686K38117
15070B74803i8353B99219n9855c10732D2939i6576A61659K70465D9364a5366B24204
15058B07615b87216a16773d110j17211D6738J07733R8208r7136D8759P8217i4
15046E1338R10K53976j32577k5339j2959J32068a9515A47403i9851c6359C11848
$$ plain form
15126 -17272 -178655 191594 77347 -8498 242812 64442 136849 99668 121432 4442 -174558
15114 -11284 176014 62938 119921 -35227 11705 80883 402238 99219 307400 222016 -320976
15102 272160 228654 -118477 -286895 -73977 367335 267888 167985 84067 -138930 -25062 -126605
15091 -126605 220777 196893 59434 256490 107162 494122 302719 146637 221998 332472
15081 332472 223253 305205 57085 297739 304322 -179604 209310 137451 79048 36686 274803
15070 274803 -98353 299219 239364 -310732 42939 -96576 161659 432124 49364 -15366 224204
15058 207615 -287216 -116773 -4110 -121321 46738 154471 252679 155543 48759 126976 -94
15046 51338 52248 306224 173647 148308 135349 267417 -19515 147403 -99851 -36359 311848
15034G318L02280m3617J07085A46565K94729j97982r0855K04254l4480I1133m0650
15023E0483k5085M90101F5059A6531J95703n3545a11795E80986j54097k7175A59608
15011B86919a44128A0686J63659Q6491k1368G0707J89309l971J22080j17642a70281
14999B1859K52050G7602J12578g130C31916j59619F7424J27794b49011B29685
14988H3661K5278K26508e1636B54849k4025J36136b3074A66362J81916a92247
14977A32033K98970D9153L94019C6500N3561J36597p4719J59120K12779A51050
14966G3154K70323j03101K64977D0017D396K89847J09494j44441K0410A23530
14955C20828A38418K37289a08937B64506L7177a4466A13830K1966L9671K85404
$$ plain form
15034 7318 309598 265981 373066 146565 441294 243312 152457 356711 322231 91133 50483
15023 50483 25398 515499 65059 16531 212234 158689 -111795 580986 426889 399714 159608
15011 286919 -144128 10686 174345 260836 239468 70707 260016 256045 378125 260483 -170281
14999 21859 273909 77602 190180 -7130 331916 172297 67424 195218 -249011 229685
14988 83661 108939 335447 -51636 254849 230824 366960 -23074 166362 348278 -192247
14977 132033 431003 49153 443172 36500 90061 226658 151939 311059 523838 151050
14966 73154 343477 240376 505353 40017 4396 294243 403737 259296 279706 123530
14955 320828 138418 375707 -108937 264506 301683 -14466 113830 135796 175467 460871
14945D60871I1752M9278K84243o0056j7015p3996A10001J01879K7219J04184J1630
14934C54913j13270M5631q5444O9425d6768B79499J6271O8821E1857N9767j236
14923A10388M02618j57675G48M85282k18755o6826R8794Q0997q3332j8650k8184
14912B50074J76399r1365H3008K31932K25536r7701j40918n4242O2446p1485q0755
14901A57821R1327J66767m0600Q9513K00646B08426p7620K53713r614e0153C43671
14889C63422j33968L55879j88261r4121r0998r9611R0636K62974m8700J88493
14879F05745B48170n835M6864l1276a65193F40863o4209B27537J53543r0122Q3595
14868C74553J20983m2122K0192f6975B78625A15472K85044L2456r8277p7211J04116
$$ plain form
14945 460871 91752 141030 425273 365217 348202 274206 110001 211880 239099 343283 354913
14934 354913 241643 287274 201830 271255 -46768 279499 295770 364591 51857 111624 110388
14923 110388 513006 355331 748 486030 267275 200449 299243 380240 296908 278258 250074
14912 250074 426473 335108 83008 314940 540476 442775 301857 247615 310061 238576 157821
14901 157821 249148 415915 375315 464828 665474 208426 130806 384519 374905 -50153 343671
14889 363422 229454 585333 397072 302951 211953 112342 202978 465952 417252 605745
14879 605745 248170 242335 289199 257923 -165193 640863 576654 227537 381080 290958 374553
14868 374553 495536 453414 473606 -66975 278625 115472 400516 432972 334695 257484 361600
14857C61600B3759P25878B24908j0252Q6034l8098J44051R5695k15767J85062
14847D71633L2682j97991K53461N6501q0591A94036J58489L44129k99145K94134
14837F91643o8075B00096L10512j00470k6337D6645N70318k08778K22693g163
14826E91842J6215r0665p2273K34264j92649K5168j20207L98772C37070J07825
14816D44895K49969E1470L25949J07801r5140q662j2490P6465K23490l20933M14471
14805G62421l17852K31076q6262j63686J39171j01439N6878M6518k35341E2334
14794F71402B09462L78531A98647J75001L88723k04096J8372j32213K49065k87410
14784D06089J44638B64419K68550Q934J36617P2007q7403j5142n8275k62174J90839
$$ plain form
14857 361600 23759 749637 224908 214656 300690 262592 406643 502338 286571 471633
14847 471633 504315 306324 559785 616286 535695 194036 352525 696654 397509 691643
14837 691643 623568 200096 510608 410138 383801 46645 616963 408185 630878 -7163
14826 591842 608057 517392 445119 679383 486734 511902 391695 790467 337070 444895
14816 444895 694864 51470 377419 485220 390080 381418 368928 445393 668883 347950 762421
14805 762421 444569 675645 589383 425697 564868 463429 520307 566825 331484 52334
14794 671402 209462 587993 198647 373648 762371 558275 576647 444434 693499 406089
14784 406089 550727 264419 532969 541903 678520 750527 663124 647982 589707 327533 518372
14773E18372J29709j7953q1042j55190j65626J19171J98947K2761j39989k0685
14763D08475J60153J59882j96329m0042J46307B36907L13256J49128o3451l1149
14753F04691J23364l05055K1030m4607K29619P0656j78950P984B22812N16228
14743G39040l0220K47180k95032q309r1766j60448K07464J03372k74059L60527
14733G97749C38984L58614J07424j02762j8708P6590k36254K458L83670k28642
14723F81374J71311j61756j61945K29857J45032m21082K51110j82388K97264k58371
14713E90406K87635Q3000j87206J43922j83866J48178J89403R7811n44304K96524
14703I21503K1968o4184k06253L55885j28290k11942J66219K11426l38064R9043
$$ plain form
14773 518372 648081 630128 549086 393896 228270 347441 546388 569149 429160 408475
14763 408475 568628 728510 532181 492139 638446 236907 550163 699291 635840 604691
14753 604691 728055 423000 444030 399423 629042 699698 520748 528732 222812 739040
14743 739040 708820 956000 660968 652659 560893 400445 607909 711281 437222 797749
14733 797749 338984 697598 805022 702260 683552 760142 523888 526346 910016 681374
14723 681374 852685 690929 528984 758841 903873 482791 733901 551513 848777 590406
14713 590406 878041 961041 773835 917757 733891 882069 1071472 1169283 624979 921503
14703 921503 943471 879287 673034 1028919 900629 688687 854906 1066332 728268 827311
14693H27311M222K59154J6857m63282J57744L84292k39795N2407L9360j77625
14683H60645K9065j11108M4402k47498M78987q1726p4062K84694j03505J1510
14673A091404m71977K71140K02606M6157l17293K83446j74236J10036j52089K13089
14663A102283K3072j7157j87900K65224j73255q0243M2954J2230M52244m52010
14653I87442L43175k30088l81490K64277K80642q8690J85837j42893J7909R823
14643A245944o2940p2803k68724K99825J6566J05510k35415K89953J53928m71726
14633A000118N32782j01622l4458r4889o590N4011l1370n554J3735j15802L0000
14622A240361J33178Q3780j8173N5447k91376J45937O9913J09697j91599J2772
$$ plain form
14693 827311 831533 1090687 1107544 644262 802006 1186298 946503 998910 1038270 860645
14683 860645 889710 778602 823004 575506 1054493 972767 898705 1183399 1079894 1091404
14673 1091404 619427 890567 1093173 1139330 822037 1105483 931247 1041283 889194 1102283
14663 1102283 1125355 1108198 920298 1185522 1012267 932024 974978 987208 1439452 987442
14653 987442 1330617 1100529 719039 983316 1263958 1175268 1361105 1218212 1236121 1245944
14643 1245944 1183004 1110201 841477 1141302 1157868 1263378 1027963 1317916 1471844 1000118
14633 1000118 1532900 1431278 1396820 1301931 1295341 1349352 1317982 1312428 1326163 1210361 1240361
14622 1240361 1373539 1457319 1439146 1494593 1203217 1349154 1419067 1528764 1337165 1349937
14612A349937P7543n6891q9844M05585k30772K05100k2704R4858j13410o00228
14602A019174Q58323m62531O7346P5636j42457L97636j5181j41497j0715J16712
14592A762446K59508p04194O46686j60515J62282j90907p8573J41379K25864k18962
14582A845014N3745k5004k91696L82295k24902L11130m01933M10612P873O0097
14572B127231j15708L60811k4023k82583K45309l7677L35779m50468l188N09707
14562B665190j26817J66450j71111J33035l03864L80358L79082K73452N0373p7422
14552C368726M23580P80871J072911J244365L550760Q793188K1986253O523819
14544D7744473B2871840I228010D530927j989238n28445j46932K97941Q6163j21698
$$ plain form
14612 1349937 1427480 1370589 1280745 1686330 1455558 1660658 1637954 1732812 1619402 1019174
14602 1019174 1877497 1414966 1482312 1557948 1415491 1813127 1797946 1656449 1645734 1762446
14592 1762446 2021954 1317760 1964446 1803931 1966213 1775306 1696733 1838112 2063976 1845014
14582 1845014 1898759 1873755 1582059 1964354 1739452 2050582 1648649 2059261 2067134 2127231
14572 2127231 2011523 2372334 2348311 2065728 2311037 2273360 2609139 2158671 2155483 2665190
14562 2665190 2538373 2704823 2533712 2666747 2362883 2743241 3122323 3395775 3446148 3368726
14552 3368726 3792306 4573177 5646088 6890453 10441213 19234401 41220654 47744473
14544 47744473 22871840 9228010 4530927 2541689 2013244 1866312 2164253 2250416 2128718
14535B128718l07967M9374j45407J34566L54784j59052l45999O76080n20864K15894
14525B080127n8380L87163j2580m6952O1656J22399j46777j5772j46453M28935
14515B653366M5445r8229J9385J32934k55122J68621J71521J18608J0961j72724
14505B794766R3223j43493L1142j34263L32450K95779L4062k3108l62139J95295
14495C113714J77477j6708k40522J35659j21007L41363R376J53775N4541p7934
14485C529734J14162R8179K58828J948k18335j61455L31907k39843K39750M5894
14475D000769k09522J87048K47201l97837O41261j87447J0062Q2329j93187J59538
14465D340215L78465k40983j02984K80544l8812L7622L09690m2639P0228j98039
$$ plain form
14535 2128718 1820751 1870125 1724718 1859284 2214068 2055016 1709017 2385097 1864233 2080127
14525 2080127 2021747 2408910 2396330 2349378 2411034 2533433 2386656 2370884 2224431 2653366
14515 2653366 2698811 2600582 2619967 2752901 2497779 2666400 2837921 2956529 2967490 2794766
14505 2794766 2887989 2744496 2775638 2641375 2973825 3269604 3303666 3280558 2918419 3113714
14495 3113714 3291191 3274483 3033961 3169620 3048613 3389976 3399352 3553127 3607668 3529734
14485 3529734 3643896 3742075 4000903 4002851 3784516 3623061 3954968 3715125 3954875 4000769
14475 4000769 3791247 3978295 4225496 3827659 4468920 4281473 4291535 4373864 4180677 4340215
14465 4340215 4718680 4477697 4374713 4655257 4616445 4654067 4963757 4921118 4991346 4793307
14455D793307M27881m01848K78092k6288M4430j34208J08272K65932J55037J89610
14445E700217K9053l92892N01870J50523k67522J92821J79587j83400r7786p2359
14435E740112L41292N29441j22541q5980K70227O4205K3201M46019l49212K01722
14425G058486M46205l50242L23418j09812M24718M9032j45151K02643J59198l6591
14415H021904L76721l266R065J18856J35961K41810K67692J21580K79750j45675
14405I424398L27164j83042P7688L09811L71178P6494J88250J64453K24864J71643
14395A1152901j83711M83454J5978J30210L21924K65271O51902k89195Q4085L05598
14385A2938417J44105L73699L15160J25411N68271J90856p589K35245M03242M08965
$$ plain form
14455 4793307 5221188 4819340 5097432 5071144 5115574 4981366 5089638 5355570 5510607 5700217
14445 5700217 5729270 5336378 5838248 5988771 5721249 5914070 6093657 5910257 5812471 5740112
14435 5740112 6081404 6610845 6488304 6402324 6672551 6736756 6759957 7205976 6856764 7058486
14425 7058486 7504691 7154449 7477867 7368055 7792773 7841805 7696654 7899297 8058495 8021904
14415 8021904 8398625 8395359 8404424 8523280 8659241 8901051 9168743 9290323 9570073 9424398
14405 9424398 9751562 9568520 9646208 9956019 10327197 10403691 10591941 10756394 10981258 11152901
14395 11152901 10969190 11452644 11468622 11598832 11920756 12186027 12837929 12548734 12632819 12938417
14385 12938417 13082522 13456221 13771381 13896792 14465063 14655919 14648330 14883575 15286817 15695782
14375A5695782J06757M84230L50248J56430M73825J33647P93982k78364L60675
14366A8277212Q36389L82192K01198J90592Q47761K55403N11368M69391L31469
14357B2302975P34372O34122M39393P91723J77840R14857M70576L68762J134032
14348B7968652P16279N83248O70053O86672J042052P46980R04856P73482J171938
14339C5264212R47667O61367J112901J090637Q94705J626756J136894J189345
14331D3924484J219153J339906J815282J187047J820956J677298J954575J696948
14323E6635649J700838K292827K048863K440262K196344K440537K905482K618473
14315G5279275L176099K890538L124106L588451L518457L996709M431720L788140
$$ plain form
14375 15695782 15802539 16286769 16637017 16793447 17267272 17400919 18194901 17916537 18277212
14366 18277212 19113601 19495793 19696991 19887583 20735344 20990747 21502115 21971506 22302975
14357 22302975 23037347 23671469 24110862 24902585 25080425 25995282 26465858 26834620 27968652
14348 27968652 28684931 29268179 29938232 30624904 31666956 32413936 33318792 34092274 35264212
14339 35264212 36211879 36873246 37986147 39076784 39971489 41598245 42735139 43924484
14331 43924484 45143637 46483543 48298825 49485872 51306828 52984126 54938701 56635649
14323 56635649 58336487 60629314 62678177 65118439 67314783 69755320 72660802 75279275
14315 75279275 78455374 81345912 84470018 88058469 91576926 95573635 100005355 103793495
14307A03793495M949206M687914N136608N130828N894004O351644O148864P192636
14299A49285199O770983Q334032P704890Q846993Q781518R894473J0419695J0536748
14291B20574531J1464237J1871269J2703284J3141933J3484312J4379983J4465891
14284C12085440J5102151J5221355J5140843J4999499J5235574J4550964J3807352
14277D16143178J2723306J1988925J0243076Q353413N541197K225067m03147n99062
14269D66215953l594851l936556m595297p357302r497949j1688485j3435226j4896468
14261C97213819j5485624j5768669j6078227j6111022j5841458j5599116j4433680
14254B87896023j3711977j3735741j2959961j2751254j1810599j0910311j0806342
$$ plain form
14307 103793495 108742701 113430615 118567223 123698051 129592055 135943699 142092563 149285199
14299 149285199 156056182 164390214 172095104 180942097 189723615 199618088 210037783 220574531
14291 220574531 232038768 243910037 256613321 269755254 283239566 297619549 312085440
14284 312085440 327187591 342408946 357549789 372549288 387784862 402335826 416143178
14277 416143178 428866484 440855409 451098485 459451898 464993095 467218162 466815015 466215953
14269 466215953 462621102 458684546 454089249 446731947 437233998 425545513 412110287 397213819
14261 397213819 381728195 365959526 349881299 333770277 317928819 302329703 287896023
14254 287896023 274184046 260448305 247488344 234737090 222926491 212016180 201209838
14247B01209838r978861r518588q651988p904870p934330p421486p403070o293034
14239A36103611o385264m898789n326153n648696m759937m662563m589530l757414
14231I6075265l419524l600014l656458l405976l218374k914267k515361l077407
14223G0267884k328175k551558k069180k027857k005505j967948j914917k004985
14215E3397759j713660j459132j309597j486180j871055j243136j386402q98506
14207D2030091k04062j657530j161749j449158j022451r75861p52386l88301j384611
14198C3033982r68077p78521j043916n51007n13137r17974o57646p08004m94983
14189B6400717q95906m25535n57418n21009l72134r63216l87870k62471o05224
$$ plain form
14247 201209838 191230977 181712389 173060401 165155531 157221201 149799715 142396645 136103611
14239 136103611 129718347 124819558 119493405 113844709 109084772 104422209 99832679 96075265
14231 96075265 92655741 89055727 85399269 81993293 78774919 75860652 73345291 70267884
14223 70267884 67939709 65388151 63318971 61291114 59285609 57317661 55402744 53397759
14215 53397759 51684099 50224967 48915370 47429190 45558135 44314999 42928597 42030091
14207 42030091 41826029 40168499 39006750 37557592 36535141 35559280 34806894 34418593 33033982
14198 33033982 32065905 31287384 30243468 29692461 29179324 28261350 27603704 26895700 26400717
14189 26400717 25504811 25079276 24521858 24000849 23628715 22665499 22277629 22015158 21409934
14180B1409934l53624o37280l00027n90060k65325m54156k02087l03688p00874
14171A7602813l2093n92732r341n92160j12124k64534k73143n67631l55663J4777
14161A4818169l44363k31763m53520J46768o40466n5528k69736j38224j82775
14152A2648562m72092j90576j1666o8072l46978l36369j33753j53765k40026J43683
14142A0838948k28534n7673m32566K8474K9139n06525j91951L8083m2998p6850
14132I397547j88652k22465l23649m02382M35950j93862k12472j00325l28413
14123G861277K41146K5144l27199K20212r57727N53362L10m46220P3707p5894
14113G168118l64517K60100l87113m9829J76771n68088K31670J64515m34031J61621
$$ plain form
14180 21409934 21056310 20419030 20119003 19528943 19263618 18809462 18607375 18303687 17602813
14171 17602813 17570720 16977988 16968647 16376487 16264363 15999829 15726686 15159055 14803392 14818169
14161 14818169 14473806 14242043 13788523 13935291 13294825 13239297 12969561 12831337 12648562
14152 12648562 12176470 11985894 11974228 11906156 11559178 11222809 11089056 10935291 10695265 10838948
14142 10838948 10610414 10552741 10120175 10148649 10177788 9671263 9479312 9517395 9474397 9397547
14132 9397547 9208895 8986430 8662781 8260399 8696349 8502487 8290015 8189690 7861277
14123 7861277 8102423 8127567 7800368 8020580 7062853 7616215 7616525 7170305 7244012 7168118
14113 7168118 6803601 7063701 6676588 6626759 6803530 6235442 6467112 6631627 6197596 6359217
14103F359217k85747L2126J5996N37311m35194m37377M6205N9953k71975l01289
14093E319226L43351R6352k3319o40108J65772J39613j8258k26206k36307n7357
14083D862759K0772J60004k62753j42700P2254J09664K3508j07025J4622m83966
14073D267139K27543l71312J18960L06302l84195n40j48449l1673J4419J3649
14063D011843K7559j538m0604M13719m26338m2287R7647k58182j73139r5331K14261
14052C727610N9877n11723L28626K06651r5595k31949j05079n7939K61541k67289
14042C314731M1038k00763l0903j30693L38433j46179Q8606k54550j80355N57928
14032C397293m36293q274J83924j54584k8227j56417j90448J17335k60372K9519
$$ plain form
14103 6359217 6073470 6105596 6121592 6658903 6223709 5786332 5832537 5892490 5620515 5319226
14093 5319226 5662577 5758929 5735610 5095502 5261274 5400887 5382629 5156423 4920116 4862759
14083 4862759 4883531 5043535 4780782 4638082 4710336 4820000 4843508 4736483 4751105 4267139
14073 4267139 4494682 4123370 4242330 4548632 4164437 4163897 4015448 3983775 3998194 4011843
14063 4011843 4039402 4037864 3997260 4410979 3984641 3942354 4040001 3781819 3608680 3513349 3727610
14052 3727610 3787487 3275764 3604390 3811041 3715446 3483497 3378418 3320479 3582020 3314731
14042 3314731 3355769 3155006 3124103 2993410 3331843 3185664 3274270 3019720 2839365 3397293
14032 3397293 2961000 2952726 3136650 2982066 2953839 2797422 2606974 2724309 2463937 2493456
14022B493456P013R3423J75404l16807K4646O3610k91181j668J5000L90158k72648
14011B380406o182L19572m18913J59872l9862l02682J83349L34040J00530m98854
14001B211276L0651j45633N89055o32643N6983j75037p5948O6684J18171O4405
13991B107964q6485N26793R79127J730301O791806K0074319J8144077k3395758
13983B6872144A3145604n160269j998691j348139j164522L45865n41445J6549
13975C294952m36817k00744O4348p2538n1150j98677j86426K26952J37620r6888
13965B480632k66008J58017j76681p5539j44885N03092m88092K88112k75961k12099
13955A790588J61209p974j60829M43545l19573J53584m3777j16913m0218J53638
$$ plain form
14022 2493456 2500469 2593892 2769296 2452489 2477135 2540745 2249564 2247896 2262896 2653054 2380406
14011 2380406 2374224 2693796 2274883 2434755 2394893 2092211 2275560 2609600 2710130 2211276
14001 2211276 2241927 2096294 2685349 2052706 2109689 1934652 1858704 1925388 2043559 2107964
13991 2107964 2021479 2548272 3527399 5257700 12049506 32123825 50267902 26872144
13983 26872144 13145604 7985335 5986644 4638505 3473983 3819848 3278403 3294952
13975 3294952 2858135 2657391 2721739 2649201 2598051 2399374 2212948 2439900 2577520 2480632
13965 2480632 2214624 2372641 2195960 2120421 1975536 2478628 1990536 2278648 2002687 1790588
13955 1790588 1951797 1943823 1782994 2226539 1906966 2060550 2016773 1899860 1859642 2013280
13945B013280M9097m66740J67150J01794J23779n29342N4836M34562j6205l62857
13935A569354O0696O0513j38581L8539J81399n07948L15963j2595l1970L47694
13925A883064k93717J59339n34408K56420M03051k56623m13139M8099L98860J1869
13915A662815m1371k46269j2965K34160j40715N37560k73012m45703J50278K13876
13905A638654l4925K09519l01752k10257l3335L33280k38496M5132P6169l93595
13895A090394L27879j39343K19537k03249K09298j85913k7499k20936j3617M48574
13885A505125m66089k1256J93616M11167n57973J43210p5709L5356J83665j39068
13875A212044o6770J05370j49937J28138m16899M49632P1789p1808J08404l74158
$$ plain form
13945 2013280 2062377 1595637 1762787 1864581 1988360 1459018 1513854 1948416 1932211 1569354
13935 1569354 1630050 1690563 1551982 1590521 1771920 1263972 1579935 1567340 1535370 1883064
13925 1883064 1589347 1748686 1214278 1470698 1873749 1617126 1203987 1252086 1650946 1662815
13915 1662815 1621444 1375175 1362210 1596370 1455655 1993215 1720203 1274500 1424778 1638654
13905 1638654 1603729 1813248 1511496 1301239 1267904 1601184 1362688 1407820 1483989 1090394
13895 1090394 1418273 1278930 1498467 1295218 1504516 1318603 1291104 1070168 1056551 1505125
13885 1505125 1039036 1017780 1211396 1622563 1064590 1207800 1132091 1167447 1351112 1212044
13875 1212044 1145274 1250644 1100707 1228845 811946 1261578 1333367 1261559 1369963 995805
13865I95805j35787J37268l69961M64982l3521j74653L04192K77372l27951o3251
13855A074495N7012l301k30854L40598J29279m93856n712L69728r2504k6076j06204
13844A012605p5139J09270j99166M6483K06751j78977k4260k831q1625K7642K87211
13833A127964n10155L49947Q3152N1672J26497n48125L41240m16024K45038o0693
13823G90513r7715L75234O7421k3622j93893O3357N1643p7254o1323j52883J49469
13812H90947J85742k23503J2887r1566R5203P5698l09109Q1449J31053m6206k18883
13801E83712M11224m1404k65535k7519J39135K1678J01904K88115l29495j98373
13791F83442J46226j12875O9051k55104L44546l8383J3342P7267k62405j08238
$$ plain form
13865 995805 860018 997286 627325 1092307 1058786 884133 1188325 1465697 1137746 1074495
13855 1074495 1131507 1128206 897352 1237950 1367229 873373 867661 1237389 1144885 1118809 1012605
13844 1012605 937466 1046736 847570 894053 1100804 921827 897567 894736 813111 840753 1127964
13833 1127964 617809 967756 1050908 1102580 1229077 680952 1022192 606168 851206 790513
13823 790513 692798 1068032 1135453 1111831 917938 981295 1032938 955684 894361 741478 890947
13812 890947 1076689 853186 866073 774507 869710 945408 636299 717748 848801 802595 583712
13801 583712 994936 953532 687997 660478 799613 821291 923195 1211310 881815 683442
13791 683442 829668 716793 785844 530740 875286 836903 850245 927512 665107 556869
13781E56869K81529J12644J04645C73292N55527l03374K4771J68438j66107l9186
13771F13361M8740J02547k70744K78173r3003K74557j53728Q6883j97626o5335
13761F23825J75695B31261O27472l5684J03039k07231j39687M03707k74704q245
13751F99928j14048O4359K34038l10670m0008j28117L54023k43414L84319D17726
13740D30048J87295J75163l30053K63970L2681C44444K26837m5697j33851K60874
13730F52607L164J59296j39126j55871K6914B71767L16607N9178l6529L21130
13720I32153C68785N0375J66434K11750l18677k2734J6710R8998L7118k05408
13710D03351K65110A63257N58807k30299J76723k8002j64023J26174k77212N9318
$$ plain form
13781 556869 838398 951042 1055687 373292 928819 625445 650216 818654 652547 613361
13771 613361 662101 764648 493904 772077 679074 953631 799903 886786 689160 623825
13761 623825 799520 231261 858733 823049 926088 718857 579170 982877 708173 699928
13751 699928 585880 650239 884277 573607 533599 405482 759505 516091 900410 417726
13740 430048 617343 792506 462453 726423 759104 344444 571281 525584 391733 652607
13730 652607 655771 815067 675941 520070 546984 271767 588374 647552 611023 932153
13720 932153 368785 419160 585594 797344 478667 455933 472643 571641 608759 403351
13710 403351 668461 163257 722064 491765 668488 640486 476463 602637 325425 384743
13700C84743J63683J6114k09734L75674l36613M333L61558k55403J70197m8156
13690F26396B63634K88558J41029j35583p5036K86077k54670j23572J95583j36621
13680D49399J32388k56555J21362P9780q6802j31951K29792A89834L00854p9880
13670D10808J17698q1270A50870M57162P3037l14752j72840Q2017j8369J56051
13660D13176A51944K20740M37846B31216N6039E8312L09972L61795B98357J04267
13650D02624m3075K19376j23185j44612J52601r3850J20932A03491J98086A43986
13639D85310B23080L99853M4226k26280J33484j54819J32854i6368E92195j91641
13629D00554o8864J21919o7198Q5940k3491j64618A40271N27477j67997j2623
$$ plain form
13700 384743 548426 564540 354806 730480 393867 398200 759758 504355 674552 626396
13690 626396 263634 552192 693221 557638 482602 768679 514009 390437 586020 449399
13680 449399 581787 325232 446594 526374 439572 307621 537413 189834 490688 410808
13670 410808 528506 447236 150870 608032 681069 366317 193477 275494 257125 413176
13660 413176 151944 372684 810530 231216 287255 58312 368284 730079 298357 402624
13650 402624 359549 578925 455740 311128 463729 369879 490811 103491 301577 143986
13639 485310 223080 622933 667159 440879 574363 419544 552398 -96368 592195 400554
13629 400554 331690 453609 386411 472351 448860 284242 140271 667748 499751 487128
13619D87128B39549K93975A89839K19846L21494l46450j66308J08564r1512L49361
13609E84834k14250J0775K94124C171N51118j01753q6117p0906J10876l3819j11824
13598B60746J48000K06578j78291K9988J61387k40896j03792F5006K90224q9126
13588B66104K13159K02801I2368L33278M8541q0616j23342K80863B04028L89450
13578E93478B56820A19174K77732M7453L6087q8928A54616L66782o750K0494j29978
13567D05164j26453J24887L08445j98178a58699B67199L03464p2559j67620J10278
13557D40762r9370q9172j03998J41693k0272j11186B6406L41172m3020L222p6980
13546B50800D3894K07560J50477L1971k536a9542D62378L9136j08176A31085N65557
$$ plain form
13619 487128 239549 533524 189839 409685 731179 384729 218421 326985 235473 584834
13609 584834 370584 381359 675483 3171 554289 452536 366419 295513 406389 372570 260746
13598 260746 408746 615324 437033 467021 628408 387512 283720 65006 355230 266104
13588 266104 479263 682064 92368 425646 474187 393571 270229 551092 204028 593478
13578 593478 256820 119174 396906 444359 480446 391518 154616 521398 514648 535142 405164
13567 405164 278711 403598 712043 513865 -158699 267199 570663 498104 330484 440762
13557 440762 341392 252220 148222 289915 269643 158457 26406 367578 324558 327780 250800
13546 250800 43894 251454 401931 433902 431366 -19542 462378 501514 393338 131085 696642
13535F96642f9551E57372j57424A96980k815K29685j54382M7617J53998q7603
13525C83480L7068j66013K5628o4255P5711j34728i194B61606A04387K58605A44916
13513A90274P9692l196B7429b2074B26648n2331q089J50011A00183J80836O193
13502B87212p3434L1677p4382K02805q0874N1626L3292g6075B04148J74502D6441
13490D67786b6277D25751J60881B26754B5652A0052K47571h0727E70322B48394
13479A32269n1090l3950J77758K81076B23278L2768n9075k3974K47693a3396D07646
13467C76447g2747E14014a03046A87466m1081K51689A78678R5423K01475A59961
13456H5538J55076m2192g2748l7220B00172J43875J30714j88632m7146J37304
$$ plain form
13535 696642 -69551 557372 399948 196980 194165 423850 269468 317085 471083 383480
13525 383480 420548 254535 280163 215908 291619 156891 -9194 261606 104387 362992 144916
13513 190274 269966 266770 27429 -22074 226648 174317 166228 316239 100183 281019 287212
13502 287212 213778 245455 171073 373878 293004 344630 377922 -76075 204148 378650 46441
13490 467786 -26277 425751 586632 226754 25652 10052 257623 -80727 570322 248394
13479 132269 81179 47229 224987 506063 223278 256046 196971 172997 420690 -13396 407646
13467 376447 -72747 514014 -103046 187466 146385 398074 178678 274101 475576 159961
13456 85538 240614 198422 -72748 -109968 200172 344047 474761 286129 238983 376287
13446C76287r735Q0475k18604L33424B21220E986L76172A72201G5317K82896j69562
13435A88651R8106j36113n6851l073m2544J35201J13762D6212c8097F9692K51701
13424C21393r3823A06905d232G2600J16470K03464k8570B2727J12323N7540K0587
13413B13177k9744k3499E3397B6658L7227J18584J91226A00957c3925D31028G8060
13401B4477R8685n3982M0889L096L49042A41016D817J94660P4665l7138q3495
13390A53509K78387A75212d4334I6053R4767i4241B66471L5573K64060k57407
13380C08697n6241L4510D197R0840P129K06695I9713J49331f5608C35992I7772
13368I9641Q247P29509C19947P2679L2223c490B25682J13086p0719m9549m0718
$$ plain form
13446 376287 366552 447027 228423 561847 221220 5986 382158 172201 75317 358213 188651
13435 188651 286757 150644 93793 90720 48176 183377 297139 46212 -38097 69692 321393
13424 321393 227570 106905 -4232 72600 189070 392534 363964 22727 135050 192590 213177
13413 213177 183433 159934 53397 26658 63885 182469 373695 100957 -33925 431028 78060
13401 24477 123162 69180 110069 113165 462207 141016 4817 199477 274142 237004 153509
13390 153509 431896 175212 -44334 96053 190820 -94241 266471 302044 566104 308697
13380 308697 252456 286966 4197 95037 102166 308861 99713 249044 -65608 335992 97772
13368 99641 107888 837397 319947 392626 424849 -3490 225682 338768 268049 218500 177782
13357A77782J98118j6351p5040A27382E4243R1265j8466J79013k3458J93788A29714
13345C24882A39805L06053m2468A91781R5157J60846j43898k6677j8113j05341
13335A53755K03021j9333a44308D91876B18480N9606Q7703j80055J19991q4377
13325B21348G3175J70172e1547E28661k57434E1168N4661M51059o6700j95317
13315B94871E0872M41098k34183F0714K64448j42422C5883a03079l0729I9489
13304A6292J92220P7701l5539K17834a16971A88313P872O6647N9020m0123K4474
13293C06203B327a01008E3591J44122m5023f2165m2495B50747G1303Q4700J48381
13282C04384a1626p0641c3322C28650j14603q0298L5747L4711I7961J19827Q2855
$$ plain form
13357 177782 375900 359549 284509 127382 54243 145508 127042 306055 282597 476385 129714
13345 324882 139805 445858 403390 191781 286938 447784 303886 277209 259096 153755
13335 153755 356776 337443 -144308 491876 218480 278086 365789 185734 305725 221348
13325 221348 73175 243347 -51547 528661 271227 51168 105829 556888 490188 294871
13315 294871 50872 491970 257787 60714 325162 182740 35883 -103079 -133808 99489
13304 16292 208512 286213 250674 468508 -116971 188313 196185 262832 321852 281729 306203
13293 306203 2327 -101008 53591 197713 152690 -62165 -104660 250747 71303 156003 304384
13282 304384 -11626 -82267 -33322 328650 214047 133749 169496 204207 97961 217788 300643
13271C00643A25650b3401F4729D044a93124G9408j1944d5083k41282B61779a91840
13259I0856Q0942K7447n3554K32565j03177A32421N0916J02053r6360J17594D0853
13247D80688j36198i2366E5365J96756J76143a3395o4597I3092K14164j17915
13237A89341c9821B3096J82061I4361f4511b7823A85378F5954a9553k3344A54787
13225g6853l0041B90824e2814C21026j42079F3396B0727a57739D79258F4062J38248
13214B02310j5658P6283n0890a08718B28109f8343C74748j78184Q91m7805B1469
13202E2237b9804A02862J34565c61843A58420o3310a62125e9450J5217A85924
13191A0978f4583A73268Q0774P4513B8865d8907A70685N1380D7883J72918a7366
$$ plain form
13271 300643 125650 -23401 64729 4044 -193124 79408 67464 -45083 -286365 261779 -191840
13259 90856 171798 199245 145691 378256 275079 132421 183337 285390 189030 306624 40853
13247 480688 344490 -92366 55365 252121 428264 -13395 -77992 93092 307256 189341
13237 189341 -39821 23096 205157 94361 -64511 -27823 185378 65954 -19553 -42897 154787
13225 -76853 -106894 290824 -52814 321026 178947 63396 20727 -157739 479258 64062 202310
13214 202310 186652 262935 212045 -108718 228109 -68343 374748 196564 197455 149650 21469
13202 52237 -29804 102862 237427 -361843 158420 95110 -162125 -59450 -44233 185924
13191 10978 -64583 173268 254042 328555 28865 -48907 170685 222065 47883 220801 -17366
13179B532K23223a42852L9815B2165a05806B6887J73099c4305B62229A2789L30045
13168C42834o5515B419L56462A27651D248J57825h897r2805d6732A61373e4448
13156C77507c082m6047C69867A80080h2716c6332A78074Q628g4976H6110c2862
13144A47803R0585a70323B96177j45448K12039E9583J2049A5510R0313O4498a06594
13132i0309K075q4493M8522j34598B55375P5681d3734B62807b05785A60118i4663
13120I3481c5736A80079c6667B41999j14551l5634a47886A08628l3471B7478L06961
13109C34439a2602j78434A95288C28a87373E4108L2479M5125E1848M2340J71164
13098B65352d0081J5115H3368d7708E4468a22121j41766A13461d8592A31940k021
$$ plain form
13179 2532 225755 -142852 -103037 22165 -105806 26887 199986 -34305 262229 12789 342834
13168 342834 277319 2419 358881 127651 4248 162073 -8897 -101702 -46732 161373 -54448
13156 377507 -3082 -49129 369867 180080 -82716 -36332 178074 186702 -74976 86110 -32862
13144 147803 238388 -170323 296177 150729 362768 59583 71632 15510 105823 170321 -106594
13132 -90309 -88234 -172727 -124205 -258803 255375 331056 -43734 262807 -205785 160118 -94663
13120 93481 -35736 180079 -36667 241999 127448 91814 -147886 108628 75157 27478 334439
13109 334439 -12602 -191036 195288 328 -187373 54108 86587 131712 51848 94188 265352
13098 265352 -40081 -24966 83368 -47708 54468 -122121 -263887 113461 -48592 131940 129919
13087A29919k120O6169e8942F41022b7065F948J6322K59112j31829J74239j01052
13076B23740D2712f1077E7117i1093B18298B2760J61812F0763M7789R2459K79081
13065D80092E0547P2107K63352j71362m5503R582c1578F4071h5079A02981a23238
13053B65519a17141A52715n3507a57033B78911f167B9130J04686J99875J27905
13043D61596i9274E13905a72546E5457c2580A88372h7263A01076J61744M3860
13033C06680e0676B07709A03795K21209j53622n1697M8334M3767J5369a26401
13022I8969L33584J28601i9245C62093J36215h5385A77615A2493b86004C04537
13011a09471j9283K0262B55203P9305j52998J09540m9498A15946J18754a45182
$$ plain form
13087 129919 127799 193968 -58942 641022 -27065 6948 23270 282382 150553 324792 223740
13076 223740 42712 -61077 57117 -91093 218298 22760 184572 60763 108552 201011 480092
13065 480092 50547 122654 386006 214644 169141 178723 -31578 64071 -85079 102981 -123238
13053 265519 -117141 152715 99208 -157033 278911 -6167 29130 133816 333691 461596
13043 461596 -99274 513905 -172546 55457 -32580 188372 -87263 101076 262820 306680
13033 306680 -50676 207709 103795 325004 171382 119685 168019 211786 227155 -126401
13022 98969 432553 561154 -99245 362093 498308 -85385 177615 12493 -286004 304537
13011 -109471 -128754 -108492 255203 334508 181510 291050 241552 115946 234700 -145182
13000h3487B17613K42401a19160A5952J68313d00789H4532R6485a66373M1852
12990a24521K8329C56260c8211j23793n4452A33674R3525K3531L8013A42148j2936
12979A29212l8223J71787A19353Q5695G2516b6958D84175a94669B08075A9797
12968B9119K4540a00498A87054b10641N8594A87597o7079J10369E4341a78176
12957C45984b49355A8087a01071A74287R7173a1205H0716J81984g390E7912e8103
12945C1254K86414A28578a5335o8522k94380b2673B5940K20146D3211O2649b7641
12933D0646J18217b37703A59475b64062A56920I613b8753A24057D552g912B9355
12921A84260C9123b42735i3424C10950a31589A17866a6728j95181A57949m6059
$$ plain form
13000 -83487 217613 460014 -119160 15952 184265 -400789 84532 181017 -166373 -124521
12990 -124521 -96192 356260 -38211 -162004 -216456 133674 227199 250730 288743 142148 129212
12979 129212 90989 262776 119353 205048 72516 -26958 484175 -194669 208075 19797
12968 29119 53659 -100498 187054 -210641 -152047 187597 120518 230887 54341 -178176
12957 345984 -249355 18087 -101071 174287 271460 -11205 80716 262700 -7390 57912 -58103
12945 31254 317668 128578 -15335 -83857 -378237 -22673 25940 246086 43211 105860 -27641
12933 40646 158863 -237703 159475 -264062 156920 9613 -28753 124057 4552 -7912 29355
12921 184260 39123 -242735 -93424 310950 -131589 117866 -16728 -211909 157949 111890
12911A11890D7153J64750b5343A42763a72732E8266L79642C3243O6626c7745D5371
12899C31419e2438j56358K0961B22336d6063f45B41569A2454K09484B5610b00095
12887A55666A9406G692a02628I6616J81866E9006k3097h0656n1821E7301h4465
12875E3425I235b6113D3863h6347A62143a64866e2668k10458A475R6337J7856
12864A15668b46044c0412C49701p8050a32566G0356J10179q2041h7078A3691b47848
12852b7553I9228J53266H1240m272l3372h0826F2812b9918H2546A6653f7718A28841
12839a58244C0960a0557B64060e5440C37042d84758g9688j84303D5472e48193
12828b9292A3858P1685J00515H6521J00781E6031L00315a7767A32453b68503B7482
$$ plain form
12911 111890 47153 211903 -25343 142763 -172732 58266 437908 33243 99869 -37745 45371
12899 331419 -52438 -208796 -187835 222336 -46063 -645 241569 12454 221938 25610 -200095
12887 155666 19406 7692 -102628 96616 278482 59006 35909 -80656 -132477 57301 -84465
12875 53425 9235 -26113 43863 -86347 162143 -164866 -52668 -263126 1475 97812 115668
12864 115668 -246044 -30412 349701 271651 -132566 70356 180535 98494 -87078 13691 -247848
12852 -27553 99228 252494 81240 76968 43596 -80826 62812 -29918 82546 16653 -67718 128841
12839 -158244 30960 -10557 264060 -55440 337042 -484758 -79688 -263991 45472 -548193
12828 -29292 13858 85543 186058 86521 187302 56031 356346 -17767 132453 -268503 27482
12816b91109A05588m4785i6895I2378a28508N1329D3167a52039B9467P3532B8520
12804C37962a70273C47129H3886J28265i484n5189o5800M8642A16810l4735a259
12792C42215j25657h5997A13310d3285L562B01759b39085C16333j07131a91902
12781A37365f6332A8180N8874h1617j04946a8403G0129a25980A82741B7722b52092
12769A9417K45857N6463j27211a66688j17357O3264c6911J3076j69293o040k12369
12758d11537f0745D9712d675k4153r9391C6480b27000g6989E1735a65873j08999
12747b74872A12198P0853i2455B61937P659G0367f4319A06933O0208p6722N2580
12736A42999P8915j01702a90204R0513D00889b14142A13809J56829m3873K9473
$$ plain form
12816 -291109 105588 60803 -96895 92378 -128508 -77179 43167 -152039 29467 102999 28520
12804 337962 -170273 347129 83886 212151 -9484 -64673 -130473 -81831 116810 82075 -1259
12792 342215 216558 -85997 113310 -43285 -39723 201759 -239085 316333 209202 -191902
12781 137365 -66332 18180 77054 -81617 -186563 -18403 70129 -125980 182741 27722 -252092
12769 19417 265274 321737 194526 -166688 -284045 -220781 -36911 -23835 -193128 -199168 -411537
12758 -411537 -60745 49712 -4675 -28828 -128219 36480 -227000 -76989 51735 -165873 -274872
12747 -274872 112198 183051 -92455 261937 269596 70367 -64319 106933 167141 90419 142999
12736 142999 221914 120212 -190204 -99691 400889 -214142 113809 270638 226765 256238
12726B56238J90635e6111m4612B02754G3414a31204d9248J8347A13940J93861
12716C07801K6179a11962K7288b5151M018E11462e7272A40205J58993j34541b3091
12704b403D08864A54782N8928c9250j14602G6347J81791A12343P1233g592q2680
12693i0272B44809F4677L11827C6590a45455A19279l4920K05191F220J4378K99055
12682C19653O3665J88964D8432K80757p9228d0153F2314J0443J30279c2768A87392
12670A55751a9556A49206J16611A27299a09083B23609a26575D9002a42646A87951
12659A19233J09743n2239G693a65273A17070c07894B29401A6191f6690B82368
12648C1840a57496c0116k31899A52973d5324q3487B10810A02865a23702B04690
$$ plain form
12726 256238 446873 -56111 -100723 202754 73414 -131204 -49248 -30901 113940 307801
12716 307801 333980 -111962 -84674 -25151 -21133 511462 -57272 140205 299198 164657 -23091
12704 -2403 408864 154782 213710 -39250 -153852 76347 258138 112343 183576 -7592 -90272
12693 -90272 244809 64677 376504 36590 -145455 119279 84359 289550 6220 20598 319653
12682 319653 383318 572282 48432 329189 249961 -40153 62314 72757 203036 -32768 187392
12670 155751 -19556 149206 265817 127299 -109083 223609 -126575 49002 -142646 187951
12659 119233 228976 176737 7693 -165273 117070 -307894 229401 16191 -66690 282368
12648 31840 -157496 -30116 -262015 152973 -45324 -128811 210810 102865 -123702 204690
12637A93963a91686A23714L1868e9539j85624D1060J12702L9568J37782a6953
12626A06977J94088i7532B71363g9343A88456n2190R9962b58130d2409O431E3142
12614A09649J39074m5823a21060C0037J38423A0314L2896a99797D1931a16091
12603B87356F3156J66600a40308F4590B3919d8302D6172J02965h9701B1462h2906
12591D8433K95664B0517M8175J71478j760j13070a90925B12846R7675j06056C6743
12579C11558j38206a4087n6587c5300k4829A35768E274J34657l5711e6021k09719
12568b65740B64727F2202L1800a91280D3231K6666a69251j5136I7187J248L2242
12557A30677a82693A56990a53477A47886A3670a58785C39J55068L9494p1483J7214
$$ plain form
12637 193963 -191686 123714 155582 -59539 -245163 41060 153762 193330 331112 -16953
12626 106977 301065 -97532 271363 -79343 188456 136266 236228 -258130 -42409 -35978 53142
12614 109649 248723 202900 -121060 30037 168460 10314 43210 -199797 41931 -116091
12603 287356 63156 229756 -140308 64590 23919 -48302 46172 149137 -89701 21462 -82906
12591 48433 344097 20517 68692 240170 238410 125340 -190925 212846 310521 204465 36743
12579 311558 173352 -14087 -70674 -35300 -60129 135768 5274 139931 104220 -56021 -265740
12568 -265740 264727 62202 94002 -191280 43231 69897 -169251 -184387 97187 98435 130677
12557 130677 -182693 156990 -153477 147886 13670 -158785 339 155407 194901 123418 140632
12546A40632a88026A26602c9498B4071J48553b46200g3304k11575g848C7212l538
12535C3674c39450P2403f9011m9626l475L4827D19057A55050J21514b2573H2154
12523A50471J5696p5886J02601j0953a09937k5264b4661j45116A85447C1690c25884
12511F5306B0091a69650A28699B9474b81576g1467a6833C40392d5601A62467o8496
12500I3971Q967c5150A71111a75391B43571n5766q751a41645J7935J0503j71071
12489b84278A93048f421q1791A03807c20016f2119q2756C08204b7783B33775q3991
12478A49784m2164i1237p7724A19875J04096b19548g8327q8301p0445I0727c85220
12466a35300j2654b5986A81976d718B36932l5153d0254E0265a54688C2456J14936
$$ plain form
12546 140632 -188026 126602 -39498 24071 172624 -246200 -73304 -284879 -7848 37212 33674
12535 33674 -339450 -267047 -69011 -118637 -122112 -87285 419057 155050 276564 -22573 82154
12523 150471 166167 90281 192882 181929 -109937 -135201 -24661 -169777 185447 31690 -325884
12511 65306 20091 -169650 128699 29474 -281576 -71467 -16833 340392 -45601 162467 93971
12500 93971 102938 -35150 171111 -175391 243571 187805 179054 -141645 -123710 -113207 -284278
12489 -284278 193048 -6421 -88212 103807 -320016 -62119 -144875 308204 -27783 233775 149784
12478 149784 107620 -91237 -168961 119875 223971 -219548 -78327 -166628 -237073 90727 -385220
12466 -135300 -147954 -25986 181976 -4718 236932 201779 -40254 50265 -154688 32456 147392
12455A47392o0507B5167a44361j39922a03667E529J63382b64567B5509L48485
12445C73994a11533M0778B76527A23789b43150i3403F683c35495J45965I766J22338
12434A32104b58041f8883j04316g9802L2045r8244E9297a17207k840j02079B29092
12422a57008c2700p7619F1552k6355c1298A52485B4369K24831B6354J05369a5267
12410c03666C2223a22596C1664h9232G0831b13436B54877G9345b99619d0207m39054
12399d79261O9369A40908B692a33939N0480A05172a705A8791a38045j0407D7867
12387A64987c8679A58695d0907j78400G2453C5759c5462D9258a81570j85952B0091
12375B69516c8261j28608A95355K7315f6543G6406h464k61706A6512J26880l6207
$$ plain form
12455 147392 86885 25167 -144361 -284283 -103667 5529 168911 -264567 25509 373994
12445 373994 -111533 -70755 276527 123789 -243150 -93403 6683 -335495 -189530 9766 132104
12434 132104 -258041 -68883 -173199 -79802 -47757 -146001 59297 -117207 -120047 -222126 229092
12422 -157008 -32700 -110319 61552 35197 -31298 152485 24369 249200 26354 131723 -15267
12410 -303666 32223 -122596 31664 -89232 70831 -213436 254877 79345 -299619 -40207 -479261
12399 -479261 -409892 140908 2692 -133939 -83459 105172 -1705 18791 -138045 -148452 47867
12387 164987 -38679 158695 -40907 -219307 72453 35759 -35462 49258 -181570 -367522 20091
12375 269516 -38261 -166869 195355 222670 -66543 76406 -8464 -270170 16512 143392 107185
12364A07185K17083p693c8022q692H8346C7139a88650D4481b60926A4920a41106
12352C43062a39389e4998l7595D14388H826d9172P538b0745H0677b25894B3549
12340A82055e420D5593J22663i3465l17824B33718D7267g1643D1656J12062G1834
12328f9249F0505J30700A479M7576J89310M5483A13788J57020H3728J49801a97543
12316a28181B78100a06754A78368b8682R143q6831A6149C069a81484B23270G5013
12304a783A65234a37577A73299o0600L0835K7211p9661B7206a84157B13176a35523
12292d2234A26323C9061R1773D1202b7751r7450l1169A75773J7192R327J44245
12281C46537G0709e0263A3644a53871B43204K0975Q359H3511J6345k7472a62100
$$ plain form
12364 107185 324268 316575 -38022 -46714 88346 37139 -188650 44481 -260926 14920 -141106
12352 343062 -139389 -54998 -92593 414388 8826 -49172 -41634 -20745 80677 -225894 23549
12340 182055 -5420 45593 168256 -93465 -411289 233718 47267 -71643 41656 153718 71834
12328 -69249 60505 191205 1479 49055 238365 283848 113788 270808 83728 233529 -197543
12316 -128181 278100 -106754 178368 -28682 -19539 -106370 16149 3069 -181484 223270 75013
12304 -1783 165234 -137577 173299 112699 143534 170745 91084 27206 -184157 213176 -135523
12292 -42234 126323 39061 130834 41202 -27751 -125201 -156370 175773 192965 202292 346537
12281 346537 70709 -50263 13644 -153871 243204 264179 272538 83511 99856 72384 -162100
12269a2799C8891a43878A63941d2606B64818B5552O208P9750J8700l1646K48717
12258C47281I1097C5579b57835P4992e6981G7257J22630k156J74515a43581a0456
12246g5684M640j12066G8472J13152B6851b91255B95686p6203l402b3578l0522
12235e4100J8337j66586A51209C9509e3160B139J21868M9825J72171D546M1412
12224D5958M09135j67366j13781J30765b0195I5733R0749b8000A57535l9554a42354
12212i872j98391b3380A83440q7964O7562o2042f9969A75220G6590a17572C18676
12200h5419C93763H087M04833j80015b3662A58283j7328J13594p4651K63907j41803
12189C02002A29736A6836K15776j14155K25188a47824A66619J63504A62964k5085
$$ plain form
12269 -12799 38891 -143878 163941 -42606 264818 25552 31760 111510 130210 98564 347281
12258 347281 91097 35579 -257835 -182843 -56981 77257 199887 197731 372246 -143581 -10456
12246 -75684 -71044 -183110 78472 191624 26851 -291255 295686 219483 216081 -23578 -54100
12235 -54100 -35763 -202349 151209 39509 -53160 2139 124007 173832 346003 4546 45958
12224 45958 455093 287727 173946 304711 -20195 95733 186482 -28000 157535 117981 -142354
12212 -9872 -208263 -23380 183440 95476 163038 100996 -69969 175220 76590 -117572 318676
12200 -85419 393763 8087 412920 232905 -23662 158283 140955 254549 179898 443805 302002
12189 302002 129736 16836 232612 118457 343645 -147824 166619 330123 162964 137879
12179A37879q297g9205B75825D7923b75743C13109B619l2K07603m1864d2007k849
12167d4856A94379J17578R3305a40869L9634F6664B5416c5394H1265k6759a37862
12155B13690a16425j5528I5646J31166j07468m4680b43654B05541a2582I1027
12144C02260H4460P6872l2223l0322c9592A4125K72486I4588J71323a04319e0578
12132A33930b48715R0619H9145m659J6085b38498A69419f4483D62818B25839I7462
12120A03267a06925I2349K63266i5140L1079B66116a72238p7664h6298A58838
12109D486i0195A8848b66924g0788j13509B79878C2259J07785N3523c36721B51690
12097A32012l7225e22252c2696D6169c82892B38711b18269A85109A0192h734m0137
$$ plain form
12179 137879 129582 -79205 275825 47923 -275743 313109 2619 2587 210190 168326 -42007 -44856
12167 -44856 194379 311957 405262 -140869 -101235 66664 25416 -35394 81265 54506 -137862
12155 213690 -116425 -131953 95646 226812 119344 74664 -243654 205541 -12582 91027
12144 302260 84460 161332 129109 98787 -39592 14125 286611 94588 265911 -104319 -50578
12132 133930 -248715 -158096 89145 84486 100571 -238498 169419 -64483 462818 225839 97462
12120 103267 -106925 92349 355615 -95140 -64061 266116 -172238 -249902 -86298 158838
12109 4486 -90195 18848 -266924 -70788 -184297 279878 32259 140044 193567 -336721 251690
12097 132012 94787 -522252 -32696 46169 -382892 238711 -218269 185109 10192 -8734 -48871
12086d8871A07799J07103B438O9820a25877e3762j04106j45594D5422L7103J20231
12075B02756a41097A02353M09507L79089J403545H78234F2541K71025D3727K27791
12065B71518j20861L6059J22596j51355p6131b29378R5094B04757l6126i7852
12054A15266B5364a28663C48602a22632L693e7654o1958a6697N511H2654J90894
12043B73548C4563a06743j3090B48215j13341D9390a4242H0541K30289A27202
12032a35371O1234a6687k46773R8467c61C4803a62472A38892c04577j67256E5360
12020a89794J1297A63370K0674B26O3430J10571J07786n702I5530l4597b30076
12008B29764B2309d1494j07679N6093B96569a63948i655I8803O2874E2253K45584
$$ plain form
12086 -48871 107799 214902 2438 72258 -125877 -53762 -157868 -303462 45422 82525 202756
12075 202756 -141097 102353 511860 890949 2294494 878234 62541 333566 43727 271518
12065 271518 150657 186716 309312 157957 81826 -229378 -134284 204757 168631 -97852
12054 115266 25364 -128663 348602 -122632 -118939 -57654 -119612 -16697 -11186 82654 273548
12043 273548 34563 -106743 -119833 248215 134874 49390 -14242 80541 310830 127202
12032 -135371 -74137 -16687 -263460 -164993 -361 34803 -162472 138892 -304577 -471833 55360
12020 -189794 -178497 163370 184044 226 63656 174227 282013 276311 95530 60933 -230076
12008 229764 22309 -41494 -149173 -93080 296569 -163948 -9655 98803 161677 52253 297837
11997B97837I0458d71403K33928b9319j31826B27352b47851d7210D1676C501b1394
11985E9583d5281j03655A79871Q613a01858k3401B50727H0776b3881B16015C2942
11973A98057B1973b45402A73839h5059l6502c5766A67252d84795K30733P7800
11963a76262g4000k2334K2528A16761j7318I27b5717j11607l6891g8715j05433
11952a84148A66219n9395a11324A75796b77232A03749c97691C3731K2413k2164
11942C3980b08415o7410l5915D0461J58218i937j65402K0467C96436I632a75117
11930B19773a92635m7253p0783H1208Q4076h6637m871j48776g253D9140a07260
11918A49160K1268b79553A80660J9058A8178R6919C2877e7465E19605a1915j95767
$$ plain form
11997 297837 90458 -471403 -237475 -29319 -161145 227352 -247851 -47210 41676 3501 -21394
11985 59583 -45281 -148936 179871 188484 -101858 -125259 250727 80776 -23881 216015 32942
11973 198057 21973 -245402 173839 -85059 -121561 -35766 167252 -484795 -254062 -176262
11963 -176262 -74000 -96334 -73806 116761 99443 927 -25717 -137324 -174215 -78715 -184148
11952 -184148 166219 106824 -111324 175796 -277232 103749 -397691 33731 56144 33980
11942 33980 -208415 -275825 -311740 40461 198679 -9937 -175339 -154872 396436 9632 -175117
11930 219773 -192635 -239888 -310671 81208 165284 -86637 -91508 -240284 -7253 49140 -107260
11918 149160 170428 -279553 180660 199718 18178 115097 32877 -57465 519605 -11915 -207682
11907b07682Q472A43934a43362e6662H8522a58928I2572a14542D9559b6568G8651
11895A8017J01824B3582A0611N9798f5082k97240a7549A76372F7365M7985R1232
11884B06582d3022E9562b0228n6648c2439l05976b392r553k17979h657A21519
11872A05934B7464f431k16432k05779A81160b21060D2566J33816b98267A27363
11861a62800l4049d4326k46355B85568a24709m9411A38327a17734E1133a05851
11850a97504A35464f3634B87c2993C86938A69882b87821g9553A48567G777G00
11838A86959I0696a1326A20082b01727C1859d9171j98209A33567b19913E7456
11827B7456M9114b37343I5870a4022j901j24856E5232J31180o7756L15917B9834
$$ plain form
11907 -207682 -199210 143934 -143362 -56662 88522 -158928 92572 -114542 49559 -26568 78651
11895 18017 119841 23582 10611 70409 -65082 -362322 -17549 176372 67365 115350 206582
11884 206582 -43022 59562 -20228 -76876 -32439 -338415 -2392 -11945 -229924 -8657 121519
11872 105934 27464 -6431 -222863 -428642 181160 -221060 42566 176382 -298267 127363
11861 -162800 -196849 -44326 -290681 285568 -124709 -174120 138327 -117734 51133 -105851
11850 -197504 135464 -63634 287 -32993 386938 169882 -287821 -79553 148567 7777 700
11838 186959 90696 -11326 120082 -201727 31859 -49171 -247380 133567 -219913 57456
11827 27456 76570 -237343 95870 -14022 -15923 -140779 55232 186412 118656 434573 29834
11815G2979a02334j66016e1852E7419J83336a68285g1728J2542N672j5067A10137
11803c19726A98014F6110J44899G841b19489O2452g8059L8095H9024g2601B8317
11791F440J22757f3045k0522K0724m0094L0949B5854b75679B43393a01302K6629
11780g4673B35958a17737A62773d9807C63204A44515C6901H446a50236A27784
11769A50214o2166b9890H9173a04378b5745j16068H7280b7698A16645a88947C09963
11757b46585i9525A68253N4867f1818C304a61648M1793B28080H7272b70277a14946
11745A14275C8194f6036I8000l3279G098K5851J27094E4251K4366R9413a877E2348
11732A53588b91031A47501b70184A27439c6130r5400N200K6885l6283L8935F304
$$ plain form
11815 72979 -102334 -268350 -51852 57419 240755 -168285 -71728 -59186 -53514 -68581 110137
11803 -319726 198014 66110 211009 7841 -219489 -157037 -78059 -39964 89024 -72601 28317
11791 6440 129197 -63045 -83567 -62843 -102937 -71988 25854 -275679 243393 -101302 -74673
11780 -74673 235958 -117737 162773 -49807 363204 144515 36901 8446 -150236 127784
11769 150214 88048 -29890 89173 -104378 -25745 -141813 87280 -27698 116645 -188947 309963
11757 -246585 -99525 168253 223120 -61818 3304 -161648 -119855 228080 87272 -270277 -114946
11745 114275 38194 -66036 98000 64721 7098 32949 160043 54251 78617 178030 -1877 52348
11732 153588 -291031 147501 -270184 127439 -36130 -131530 -126330 -99445 -135728 -96793 6304
11720C26499E2378H376K62939a73500a3252A45294a63417H5812O5664a49328j07735
11709b57063e0826B63431a02677C61167A06685J70208F0632K0857e6399j20536
11699a76935a627A7960K10909r9681a27027J3711H4152d6310j76415D9276j723
11688D7553b13836G0838a15596j03671A45977J79632i223I5229d4356D2934K95456
11677C38390a10821n3999A75972B6792a80413a0429B42335k4319f6497B37743
11666I8124g6780j88553a16426q0857l4848B53638A19115L36478f913C8688b15361
11654I9842K0256J65219I3139R1589a67123f3442D6011Q6082m9543j7128R3342
11643A58764L24283a5652A95360G826a54091B40730J37776j56352c5686C33181
$$ plain form
11720 326499 52378 8376 271315 -173500 -13252 145294 -163417 85812 151476 -149328 -257063
11709 -257063 -50826 263431 -102677 361167 106685 276893 60632 81489 -56399 -176935
11699 -176935 -1627 17960 228869 129188 -127027 -113316 84152 -46310 -222725 49276 47553
11688 47553 -213836 70838 -115596 -219267 145977 325609 -9223 95229 -44356 42934 338390
11677 338390 -110821 -164820 175972 26792 -180413 -10429 242335 218016 -66497 237743
11666 98124 -76780 -265333 -116426 -197283 -232131 253638 119115 455593 -6913 38688 -215361
11654 99842 120098 285317 93139 184728 -167123 -63442 46011 132093 82550 65422 158764
11643 158764 483047 -15652 195360 7826 -154091 240730 378506 222154 -35686 333181
11632g7232A02757R943O8765a4664D22744j84343o66a24502A91262b30901e401
11620C2581e5175J5524j05611L3081o5600C35622G7104J21971k4930J84245b68185
11608B78526k7052d0661k8456j33542d9056r0569A40417o547a48360A79875a9692
11596A15683K18130c23600D6909j0152J05207a81328C91265b29697A63132R8570
11586B61702k0132K89019a02314D24103d1173p4328A0734b8645l03429a62345
11575C1357Q2710b2365H131M8483d1346H2792a4824D09006O4998A23625C633J19337
11563A22970a85317A97298R5276b07762C76201A66371C6109L5590A2279J39407
11553A51686M041J61206a5405r2751H868a05795Q403B33587k3362L573O9977D5314
$$ plain form
11632 -77232 102757 112700 181465 -14664 422744 238401 237735 -124502 191262 -230901 -5401
11620 32581 -55175 -39651 -145262 -112181 -177781 335622 77104 199075 174145 358390 -268185
11608 278526 251474 -40661 -69117 -202659 -49056 -139625 140417 133870 -148360 179875 -19692
11596 115683 333813 -323600 46909 36757 141964 -181328 391265 -229697 163132 261702
11586 261702 241570 530589 -102314 424103 -41173 -115501 10734 -28645 -332074 -162345
11575 31357 114067 -22365 8131 56614 -41346 82792 -14824 409006 474004 123625 3633 122970
11563 122970 -185317 197298 292574 -207762 376201 166371 36109 71699 12279 151686
11553 151686 155727 316933 -15405 -108156 8868 -105795 -97392 233587 210225 213798 283775 45314
11540B22640B3349a77469G3196N0610K08761a76906B5246J11461c6674n4535j36157
11529b27366c3277A35820m2283K14625c35045a15891a487k9578D3754J8417a85523
11517f1311B00594e4671B30894A8263J2421a92243D7910b47351I9807b8192C23941
11505B63403j5458n0430a5691j33167A25266J23162G3336M0332K9024a74700B96941
11493A51706d4258e900k10132g0929B3073K56812N4133G218K01164J73402j75836
11482B05948H2542d4745A60498N3111b0301A46476E5836J50375K0521m9789b3790
11470C98661C6851L51254h1489A68129B7488K17417j8232O4373A21859M9417B6698
11458g3644K3801A70060j1583m5489D5607L6250O4283B7165L08915j32741J10628
$$ plain form
11540 222640 23349 -177469 73196 123806 332567 -176906 25246 136707 -36674 -91209 -227366
11529 -227366 -33277 135820 93537 308162 -335045 -115891 -1487 -31065 43754 62171 -185523
11517 -61311 200594 -54671 230894 18263 30684 -192243 47910 -247351 99807 -28192 323941
11505 263403 247945 197515 -15691 -148858 125266 248428 73336 113668 142692 -174700 296941
11493 151706 -44258 -5900 -216032 -70929 23073 279885 334018 7218 208382 381784 205948
11482 205948 82542 -44745 160498 213609 -20301 146476 55836 206211 226732 176943 -23790
11470 398661 36851 388105 -81489 168129 27488 244905 226673 291046 121859 171276 26698
11458 -73644 -49843 170060 158477 112988 45607 81857 146140 27165 336080 203339 313967
11447C13967D4546J89584D6493J15079E6808K69160A50121D0024J16177K45768
11437D01969C1250a8141j4696A93348M833a50945A03262D9372i7232C813b7866
11425D7927c10385B91490b62398B57267A21980J18847A3252K35126n7115a97982
11414C1091b39711j11669A33731A0481a19420L0286I3744A0350P9675P2405D3083
11402B28791E6728K21511G1324J37385r6805m0110J37968q3865c5558E8486P0635
11391A29121a53839r654q4636d4247B70049a59142c7287O733j01943B5566K56918
11380B82484k5849F6525A4712h7995j52113a03732a7700j08975I0636D1990L8191
11369H0181K71328a38759M3131p0583j8757E3616L3337J24599i5265q5353R820
$$ plain form
11447 313967 44546 234130 46493 161572 56808 325968 150121 40024 156201 401969
11437 401969 31250 -18141 -32837 193348 198181 -150945 103262 49372 -97232 3813 -27866
11425 47927 -310385 291490 -262398 257267 121980 240827 13252 248378 191263 -197982
11414 31091 -239711 -351380 133731 10481 -119420 -89134 93744 10350 90025 162430 43083
11402 228791 56728 278239 71324 208709 111904 71794 209762 125897 -35558 58486 129121
11391 129121 -153839 -163493 -248129 -44247 270049 -159142 -37287 -30554 -132497 25566 282484
11380 282484 256635 66525 14712 -87995 -240108 -103732 -17700 -126675 90636 41990 80181
11369 80181 351509 -138759 -95628 -166211 -184968 53616 86953 211552 -95265 -180618 -170798
11358a70798A93051a02117F4958J54935a28220A28247g9342B80209I7658D1106
11347E40656g8627j95609D7301g7664I6997Q4915f1220C07232a32120O2929A49366
11335c72734A35997b17668B51410a09208D373c202l95336c3438j51312g1196A57011
11323A34961J18905a26849K1394j68970H4505a99816G096c7876G0746B9207R8925
11312A28132a42B84148b9432j6551k2798j9382H6310c35720c0765A53064f1804
11300a50080M4191H9236c13863j10223B50422A19077f1405k0889E9789a09950
11289C633a35979j44039A73762M4614b0604k68526B5019d1604N935l0196j29517
11278a95382d2949l77322J82365O3995b3046A1654J8154b26771N6207A80015b12579
$$ plain form
11358 -170798 193051 -102117 64958 219893 -128220 128247 -79342 280209 97658 41106
11347 540656 -78627 -274236 47301 -77664 96997 181912 -61220 307232 -132120 -69191 149366
11335 -372734 135997 -217668 251410 -109208 4373 -3202 -398538 -33438 -184750 -71196 157011
11323 134961 253866 -126849 -105455 -274425 84505 -199816 7096 -37876 70746 29207 128132
11312 128132 -142 284148 -29432 -45983 -68781 -88163 86310 -335720 -30765 153064 -61804
11300 -150080 -105889 89236 -313863 -424086 250422 119077 -61405 -82294 59789 -109950
11289 3633 -135979 -280018 173762 218376 -20604 -289130 25019 -41604 -35669 -65865 -195382
11278 -195382 -42949 -420271 -237906 -173911 -23046 11654 29808 -226771 -170564 180015 -212579
11266e4894m5818m5764D0079f551D2786b43656d8128k47335N6109b7626A49132
11254i2612c6329a0539E1386e5737A92684D3777h9416J1880I6122J21360a64824
11242b09008K6645P1759e0823D3574a12317C05859J9999b47132i0400r0446O8033
11231a12813e3614B36223f5135J8582B5737J66887a47916B6368a11206G6110O0231
11220A36341J00785b73387k16113f1127A49286j3567i5889m1377f6642A96401
11209e2579p9966j52759B19820b68893A09954f5881E0478a96176b0627I8084m4452
11198E3632N0621b3869g774B50084b15487N0081A18855A6096J90550b48697N3486
11187a95211d2839A56080B4836g2514J6823C8760c38091g3751b838j01708j95458
$$ plain form
11266 -54894 -100712 -146476 40079 -6551 42786 -243656 -48128 -295463 -239354 -27626 149132
11254 -92612 -36329 -10539 51386 -55737 192684 43777 -89416 -77536 96122 217482 -164824
11242 -209008 -182363 -110604 -50823 43574 -112317 305859 325858 -247132 -90400 -180846 -112813
11231 -112813 -53614 236223 -65135 -46553 25737 192624 -147916 26368 -111206 76110 136341
11220 136341 237126 -273387 -489500 -61127 149286 135719 -95889 -137266 -66642 196401
11209 -52579 -132545 -285304 219820 -268893 109954 -65881 50478 -196176 -20627 98084 53632
11198 53632 104253 -23869 -7774 250084 -215487 -165406 118855 16096 206646 -248697 -195211
11187 -195211 -42839 156080 24836 -72514 -55691 38760 -338091 -73751 -2838 -104546 -300004
11176c00004B39533A5406a74378A02268a62237A04333N8020B9318R782j2705b76183
11164a86185A86420A4255J09894a58059O9347l28551a58622d2426k50781J15868
11154a77339K7604O4402K7908Q858k48382a45579A22683b67059M8751B44423D6483
11142D9503c0236l43327C4521J39935G4112a15848A38029J6100a39505D35952
11131A76110L01673a52459j38261C08973I3839P5391a97087R553C2512c14137
11120A01903H490P7278b14360c3226G8194K18097o715d7979D53526A26146e9475
11108a03143D1803h3164D8508K4487d0321q77I3619c4396A84782J28851n5425
11097B58208j22833J00463C086a0757B60041h145A58109p194r673J70030j13126
$$ plain form
11176 -300004 239533 15406 -174378 102268 -162237 104333 162353 29318 39100 26395 -276183
11164 -186185 186420 14255 124149 -158059 -88712 -417263 -158622 -42426 -293207 -177339
11154 -177339 -149735 -85333 -57425 -48567 -296949 -145579 122683 -267059 -218308 244423 46483
11142 49503 -30236 -373563 34521 174456 74112 -115848 138029 154129 -139505 435952
11131 176110 477783 -152459 -290720 308973 93839 169230 -197087 -187534 32512 -314137
11120 101903 8490 85768 -214360 -33226 78194 296291 289576 -47979 453526 126146 -59475
11108 -103143 41803 -83164 48508 72995 -40321 -41198 93619 -34396 184782 313633 258208
11097 258208 135375 235838 3086 -10757 260041 -8145 158109 150915 141242 311272 198146
11086A98146Q1379r9003o3255J45596p5375c5803C8714J72988L14265j40052P6555
11075D62470m5651j84627L09272B25805K01572A36999K16685j36989L1060Q5997
11065C33752L24348k22470j5654J00593K44068L1438k07524j27950J59766K28971
11055H49338l26559J82156j75211m4660K28912K4280N0334C06115L08287B68024
11044E44994J69181K06751m05927N7667k16772L56871J49792k54388M58748k22041
11034H44876j48796k91763L81179l58082K25546K3405J23538q7341j28371K21570
11024H05761J24645j53032j86651K22028L9962k94664m723J42865j14664L7285
11014F18812n4843m6060j87445L33302k7445L1782n8085j30062O8292K03058j61891
$$ plain form
11086 198146 279525 180522 117267 262863 187488 -35803 38714 211702 525967 385915 462470
11075 462470 416819 232192 541464 225805 427377 136999 353684 216695 247755 333752
11065 333752 658100 435630 419976 520569 764637 796075 588551 460601 620367 849338
11055 849338 522779 704935 529724 485064 713976 738256 788590 306115 614402 268024
11044 544994 714175 920926 514999 572666 355894 712765 862557 608169 1066917 844876
11034 844876 696080 404317 785496 427414 652960 676365 799903 712562 584191 805761
11024 805761 930406 777374 590723 812751 852713 558049 553326 696191 581527 618812
11014 618812 563969 517909 330464 663766 636321 668103 610018 479956 548248 751306 589415
11003E89415q3839J42793k6485K56680k16602m902K47093l16668J15286k53698
10993D49073N96255k00881J8501k44283k2907J84581q0752K95063m0916L50987
10983A304721m71827L76925n7416J23811O1720N1463n753K33165L33941L44322
10973B295072j0433O23877k87785L81225m86438O858j25037k81340j41841m61963
10963A512195M55023j31807K34815m96759L92934j08120M4230R8873m7048k90304
10953A664032q8029m36398J7434Q8312m01936j09121k13463j12232J78940A93836
10942D09982K45093j50220B11135P0435C1907J21377M6903i5762F5458f1187B42783
10930D15027F4940b41353c0604p1212O76d3998A85480l5880L09258a1239F1601
$$ plain form
11003 589415 505576 648369 621884 878564 661962 657060 904153 587485 702771 449073
10993 449073 1045328 844447 862948 618665 595758 780339 699587 994650 953734 1304721
10983 1304721 832894 1209819 1152403 1276214 1337934 1389397 1383644 1616809 1950750 2295072
10973 2295072 2284639 2908516 2620731 3001956 2515518 2522376 2397339 2115999 1974158 1512195
10963 1512195 1967218 1835411 2070226 1573467 1966401 1858281 1902511 2001384 1954336 1664032
10953 1664032 1576003 1139605 1157039 1245351 843415 734294 520831 408599 587539 193836
10942 409982 655075 504855 211135 281570 31907 153284 200187 -95762 65458 -61187 242783
10930 415027 64940 -241353 -30604 -101816 -101140 -43998 185480 149600 458858 -11239 61601
10918H035a29938K5800A39713b15654d2828r470r3994B61765e5184l3720n4102
10907a43006D8951J49872e2202B08990C4672a63611A04738e7800q5760D7291g7330
10895a36565A22589c4764q4238A35233b8495m6337j09623K7709M595O5224j0462
10884i7389k5795D9971b21753f063j76308P9234C9079f4240E1319J4817h6447
10872B04358B0020L690K54509b80740A13606H293b47230G1676g3417a7776j29628
10861a47404F4199J1416a1483l08932G115a1520J92A20862a87599A12675M4744
10850A57419p7953Q8628a53813D534a75067B804e6790C4947J35804c75131A46590
10838b40056I4529a8727q5060d560H2502i2080K2424m0016K6416q7077A87491
$$ plain form
10918 8035 -129938 -104138 139713 -215654 -42828 -52298 -146292 261765 -55184 -88904 -143006
10907 -143006 48951 198823 -52202 208990 34672 -163611 104738 -57800 -143560 47291 -77330
10895 -136565 122589 -34764 -119002 135233 -28495 -74832 -184455 -156746 -152151 -86927 -97389
10884 -97389 -123184 49971 -221753 -6063 -182371 -103137 39079 -64240 51319 66136 -86447
10872 204358 20020 23710 278219 -280740 113606 8293 -247230 71676 -73417 -17776 -147404
10861 -147404 64199 75615 -11483 -320415 7115 -11520 -11328 120862 -187599 112675 157419
10850 157419 79466 168094 -153813 4534 -175067 2804 -56790 34947 170751 -375131 146590
10838 -240056 94529 -18727 -103787 -4560 82502 -92080 -69656 -109672 -83256 -170333 187491
10826a98032C40305A59832l9798a81483B81850a64934A11825M1332b69086a1501
10815a84099a6140j1105k23841p1581C49478c26661H7505e0842l01354d1107j26337
10804a67444F8838a26498J1547a3764j00111j45034a22291D7861J24570j2857
10794A59574l8025b08305A2485a85720m969A75765k4834L8738a48269A14206J9468
10783A33674f1363B66926F8727i2252A14739K12552L1463a86187A7683a5989E9514
10771g477q1730o4985b8226k0880B36053F1471b08239j86900a02712E8610j1194
10760D7416b43787g3893l4204B34079C2900g1022H7385c64763a56302G2415a00859
10748B79814a51699C58385A13281N4824a75041b7420A70863e01319K08381n5231
$$ plain form
10826 -198032 340305 159832 120034 -181483 281850 -164934 111825 153157 -269086 -11501
10815 -184099 -16140 -27245 -251086 -322667 349478 -326661 87505 -50842 -352196 -41107 -167444
10804 -167444 68838 -126498 -114951 -13764 -113875 -258909 -122291 47861 172431 159574
10794 159574 121549 -208305 12485 -185720 -190689 175765 150931 189669 -148269 114206 133674
10783 133674 -61363 266926 68727 -92252 114739 327291 358754 -186187 17683 -15989 59514
10771 -7477 -89207 -154192 -28226 -49106 236053 61471 -208239 -395139 -102712 58610 47416
10760 47416 -243787 -73893 -108097 234079 32900 -71022 87385 -364763 -156302 72415 -100859
10748 279814 -151699 358385 113281 168105 -175041 -27420 170863 -501319 -292938 -348169
10738c48169a7538L547A4504J15900f9307B517e9533g5l274A01447R4759i6601
10725a74578C06141j6612A26161a66992k9365A31519E0864b6713A52860d7846
10714a03929B7658e7992q2042O6223b7810j73097G1047b04728E012J25999c1139
10702a93322C2970L7065a5737l55291J53577L1400d6073r6988b9458r0329A4060
10690A8191b9395H4947K61654a53604f5424E9752a0673j90592e3004k02510n0650
10679c06164N5759p0670A59502O4573l3583a67287C62563A7004b69641c9805b008
10667a97392J5157A70492g5071B56975h9876M3405j35287k48596a12175l52408
10657d64583a46687n8637A25396C2786d38750a87111c0797k12170A92446a92804
$$ plain form
10738 -348169 -17538 -13991 14504 130404 -69307 2517 -59533 -75 -3349 101447 196206 -96601
10725 -174578 306141 289529 126161 -166992 -196357 131519 50864 -26713 152860 -47846
10714 -103929 27658 -57992 -140034 -73811 -27810 -200907 71047 -204728 5012 131011 -31139
10702 -193322 32970 70035 -15737 -371028 -217451 -186051 -46073 -143061 -29458 -119787 14060
10690 18191 -29395 84947 346601 -153604 -65424 59752 -10673 -201265 -53004 -255514 -306164
10679 -306164 -250405 -321075 159502 224075 190492 -167287 362563 17004 -269641 -39805 -2008
10667 -197392 -182235 170492 -75071 256975 -89876 -46471 -181758 -430354 -112175 -464583
10657 -464583 -146687 -205324 125396 32786 -438750 -187111 -30797 -242967 192446 -192804
10646B70493a77234O9855a8252j15965j01399d4372p4074n5786B11726G7854c2241
10634f7537B9690d77908B87805A17078P2208a4181A09700h8055A29784D7487a8381
10622b07601j24920A10953B5199a19763I8895m1168c78144J55980C43268i6725
10611d8650r0976j6644l43526a09465A37943e523j25137q3574J0371Q9122C18806
10599F6042P6553a0414A3487a10945N5098A52760d3405j81417J4994f1018k6032
10588h7050j47541D2758g8515A94687a57105C10258a2715A41164a22312I8330
10577a26665D3002b68146M1366q553A45044a7314j15530b4431A02206a13544j93166
10566c06710i9680H3132B0452J08469a4247k25059A36151P2704a13704B93831
$$ plain form
10646 270493 -177234 -107379 -18252 -134217 -235616 -44372 -118446 -174232 211726 77854 -32241
10634 -67537 29690 -477908 287805 117078 189286 -14181 109700 -88055 129784 47487 -18381
10622 -207601 -332521 110953 25199 -119763 98895 57727 -378144 -222164 343268 -96725
10611 -48650 -139626 -156270 -499796 -109465 137943 -5523 -130660 -214234 -203863 -114741 318806
10599 66042 142595 -10414 13487 -110945 -55847 152760 -43405 -224822 -209828 -61018 -87050
10588 -87050 -234591 42758 -78515 194687 -157105 310258 -12715 141164 -122312 98330
10577 -126665 43002 -268146 -226780 -235333 145044 -17314 -132844 -24431 102206 -113544 -306710
10566 -306710 -99680 83132 20452 128921 -14247 -239306 136151 208855 -113704 293831
10555a10370a4192I2796i2743p7198F0086J91529o7640a57551c5356J41k412A58491
10542b6967j74887A15117b96429a2469j38939E6223a80480C8047b82477d5793
10531a09680c0310j12770C00027C3631i3899o8299g97D9308i8222C7380Q4831
10520A22211h9827C4082a45209e2040F4546b18083F2281R1941a27006k7854N3865
10509a00995A1437e3448B70121a03408A14772b18767J9738j3902n5634a12075
10498G9093a7654j40036j28116j3721a11770r8359A23754b9499A5709f3830A54516
10486B25986F2611M31785B33014g4541A29087L31588K64174j90446j25679A49703
10475C87883A12138a05334A77023n9262d819A16379J24789A7408a56471H431c6152
$$ plain form
10555 -110370 -14192 92796 -92743 -169941 60086 251615 183975 -157551 -35356 -35215 -37627 158491
10542 -26967 -201854 115117 -296429 -12469 -151408 56223 -180480 38047 -282477 -45793
10531 -109680 -30310 -143080 300027 33631 -93899 -162198 -797 49308 -98222 37380 122211
10520 122211 -89827 34082 -145209 -52040 64546 -218083 62281 154222 -127006 -154860 -100995
10509 -100995 11437 -53448 270121 -103408 114772 -218767 -199029 -212931 -268565 -112075
10498 79093 -17654 -157690 -285806 -299527 -111770 -210129 123754 -29499 15709 -63830 154516
10486 225986 62611 494396 233014 -74541 129087 460675 724849 534403 408724 149703
10475 387883 112138 -105334 177023 117761 -4819 116379 241168 17408 -156471 8431 -36152
10463B4046A0157a27653l6146o1361B33156b65343A3577c8341p971P522l91298
10452d30088e0373j14763M6714h523m737j62055c0171k9799a1131o1941b4252
10440h5435C9323R0410a74435c016A19150a3763C6754L9009C1804K189a25926
10428b27441g7819F5820b56755f5493j29565F0786M0476a39614o84A57675A4597
10416c19101a28106A2210b00004E4891c46139A50323b63092e3894B2738O4881
10406H7619m3073J56915a07234Q822j93773A9858J80864J12873a19375C22654
10395b40085J4066I8962R1711G9395J79224B2601a19411A96646p3915C8081i9669
10383B4807J59830k7521p7909B5835N5317O5312l2430R0809j4808Q4683J2302
$$ plain form
10463 24046 10157 -127653 -163799 -225160 233156 -265343 13577 -38341 -46312 -38790 -430088
10452 -430088 -50373 -165136 -118422 -8523 -13260 -175315 -30171 -59970 -11131 -73072 -24252
10440 -85435 39323 129733 -174435 -3016 119150 -13763 36754 75763 31804 33993 -125926
10428 -227441 -77819 65820 -256755 -65493 -195058 60786 101262 -139614 -140298 157675 14597
10416 -319101 -128106 12210 -200004 54891 -346139 150323 -263092 -53894 22738 87619
10406 87619 44546 201461 -107234 -98412 -292185 19858 200722 313595 -119375 322654
10395 -240085 -226019 98962 190673 79395 258619 22601 -119411 196646 122731 38081 -99669
10383 24807 184637 157116 79207 25835 81152 146464 114034 204843 190035 274718 287020
10372B87020A30871M8778n4140K56412Q3743l9482K83281C35531J15224n2035
10362C98720j991A68120J23874n5409H4607J16748F7213L28087K6578O7730J43289
10351F32897C13113J0419K96187k57514J6921J05473j01538J50181A62589K93120
10341D55709j50681A1841M01381a65542C22428j15269J80899A90736E1571J11488
10331A63059j8136i8237A65593b04207R8603c3870B30605d1731A18173n149b63436
10319B13537B2396M41516j65218L8656j56331E391K57422F0427h4793j99098D02731
10307a41801N9093j67367c2966o325l55900B18773b42376J7871D0821b04212q1322
10296b85534A26546a40356G8630a27241C21980f2444j3788q7890Q0139A71357
$$ plain form
10372 287020 130871 179649 125509 381921 465664 426182 709463 335531 450755 398720
10362 398720 396729 168120 291994 236585 84607 201355 67213 395300 421878 489608 632897
10351 632897 313113 323532 619719 362205 379126 484599 383061 533242 162589 455709
10341 455709 305028 11841 413222 -165542 322428 207159 388058 190736 51571 163059
10331 163059 144923 -98237 165593 -204207 -105604 -33870 230605 -41731 118173 113024 -263436
10319 213537 22396 463912 298694 337350 181019 5391 262813 60427 -84793 -283891 402731
10307 -141801 -82708 -250075 -32966 -39291 -395191 218773 -242376 -224505 40821 -204212 -285534
10296 -285534 126546 -140356 78630 -127241 321980 -62444 -76232 -164122 -83983 171357
10285a14340j6106a3518C3793d7530A38245J34657a081B19502a04622A810N998
10274G808J53672G6307e1190C29598G1265O1082m3703k5286a74263B23141a7930
10262a5716J60C01041d449E43798o0132A25187K83652j49162j25512a50096O2114
10251h7982A23223a30815B8253a01644A01343D1843R4312a08021G0049c8835l05829
10240c44664A26985D3730r069a76243F9148a81802C62934d5384I344c4356k87858
10229c22214a44317E221j67a84297q2368g978G7440h175B9201p75g0225k52587
10217c22812e0371n0974o2954d9925n8236D54989f7061l1215A61269d2986I2110
10205b34736L5038R0826A30392b2236m831q3349k50930E4639R678A4167a07905
$$ plain form
10285 -114340 -130446 -13518 33793 -47530 138245 272902 -1081 219502 -104622 1810 7808
10274 7808 161480 76307 -51190 329598 71265 132347 88644 63358 -174263 223141 -17930
10262 -15716 -15556 301041 -4449 543798 483666 125187 408839 259677 134165 -150096 -87982
10251 -87982 123223 -130815 28253 -101644 101343 41843 136155 -108021 70049 -38835 -344664
10240 -344664 126985 43730 34661 -176243 69148 -181802 362934 -45384 9344 -34356 -322214
10229 -322214 -144317 5221 5054 -184297 -266665 -7978 77440 -8175 29201 28426 -70225 -322812
10217 -322812 -50371 -101345 -164299 -49925 -108161 454989 -67061 -98276 161269 -42986 92110
10205 -234736 -199698 -108872 130392 -22236 -27067 -110416 -361346 54639 64317 14167 -107905
10193d22578B1107g8361H9938a80849N2142C4183a45250A3370d65412B1960a47987
10181c29944C5744a58182f003C30986b9171I2559b09751n2619A16013g5551j87540
10170b63091J8498b1722j20266c9882g1k98374g8713j5252f860j06134H9257M8432
10158A37689d63027a45795L3138N1287n6938j66242N8818g9562a1958A04182l6795
10147F7387J00798n8665b42238D3852b28158Q2245M1200C8306b07349B2632K40
10136B2872b43806A88300a95724H9135A4172N2455P9843b73624e5923j62366i3700
10124B84663n5410b30515j2275B00345a4258C6485b87035m703a18603N700E21
10112a94851j10316c5545A96636f8468r0721D32136b43608A0782b42608a8324
$$ plain form
10193 -422578 21107 -78361 89938 -180849 -128707 34183 -145250 13370 -465412 21960 -147987
10181 -329944 35744 -158182 -6003 330986 -29171 92559 -209751 -262370 116013 -75551 -263091
10170 -263091 -244593 -21722 -141988 -39882 -71 -298445 -78713 -93965 -6860 -112994 89257 137689
10158 137689 -463027 -145795 -112657 -61370 -118308 -284550 -225732 -79562 -11958 104182 67387
10147 67387 168185 109520 -242238 43852 -228158 -145913 -104713 38306 -207349 22632 22872
10136 22872 -243806 188300 -195724 89135 14172 66627 146470 -273624 -55923 -218289 -93700
10124 284663 229253 -230515 -242790 200345 -14258 36485 -287035 -291738 -118603 -112903 521
10112 -194851 -305167 -35545 196636 -68468 -159189 432136 -243608 10782 -242608 -18324
10101A51926E1561i2281j44672b2596B07856J38275C0205d57495h8298R918J3052
10090f5328l13191a73041C4797b96721a39362j64803D5371J11604D2425M7831
10080I0256c44305B42309e4024j51850k09331a2060j03740C4668N7197c96572
10069a36697q828G404a74449J9016B75759I3573a0730A20147j430c1002A20048
10057c29809a41240e0292r4499A53233a50830A28035B732J15329J05618a40158
10046F3403a58738M3825C97486a87774g2204B4054d4397n8626F5i1709A11492
10034d6794o5957A32156a69195k1076A82816e50343H876J2954J9049b90426E8254
10022c45689A56797b0865p8062q8554P6362B06549a33694j58140L3329A09835
$$ plain form
10101 151926 51561 -92281 -236953 -22596 207856 346131 30205 -457495 -88298 -78380 -65328
10090 -65328 -378519 -173041 34797 -296721 -139362 -304165 45371 156975 42425 90256
10080 90256 -344305 242309 -54024 -205874 -415205 -12060 -115800 34668 91865 -396572
10069 -136697 -145525 7404 -174449 -155433 275759 93573 -10730 120147 118717 -31002 120048
10057 -329809 -141240 -50292 -144791 153233 -150830 128035 2732 118061 223679 -140158
10046 63403 -158738 -114913 397486 -187774 -72204 24054 -44397 -103023 65 -91709 111492
10034 -46794 -112751 132156 -169195 -190271 182816 -550343 8876 21830 40879 -290426 58254
10022 -345689 156797 -20865 -98927 -187481 -111119 206549 -133694 -291834 -258505 109835
10011a17257I1098c23700e872A58518c70588I6783D7232b99517b6989B74860c26553
9999b94766B56557a3695j15849o7973k9574B77546a85830f492j06883r5816l1826
9988b41017A03614c5568k32624k6493A17003b8172C826f184B62367c0012j9608
9977d9620j38453C2959b25405N4843e6104k59527A08115F034J34454a16194F4942
9965A04230a79667F3506a04677K7482H2997i2079m2952b8514A07036a76862k93175
9954d70037e9985j97215E268M0897N1312B6224h803j15127j80413h3159H2496
9942a00987A27708a42120A3745Q2854a24343J3379C14732A44990c89487a48941
9931A53425a0440A17314g1604m1947j43028K798h9593D853O9860b88135I9362
$$ plain form
10011 -117257 91098 -323700 -5872 158518 -370588 96783 47232 -299517 -26989 274860 -326553
9999 -294766 256557 -13695 -129544 -197517 -227091 277546 -185830 -6492 -113375 -209191 -241017
9988 -241017 103614 -35568 -268192 -294685 117003 -28172 3826 -6184 262367 -30012 -49620
9977 -49620 -188073 32959 -225405 -170562 -56104 -315631 108115 6034 140488 -116194 64942
9965 104230 -179667 63506 -104677 -77195 82997 -92079 -135031 -28514 107036 -176862 -470037
9954 -470037 -59985 -257200 5268 46165 97477 26224 -8803 -123930 -304343 -83159 82496
9942 -100987 127708 -142120 13745 96599 -124343 -110964 314732 144990 -389487 -148941
9931 153425 -10440 117314 -71604 -113551 -256579 -253781 -89593 4853 74713 -288135 99362
9919G6310b50440k6739I3960a58487g1980k30740h7713n6620a8742k6208E7446
9907a39063N6046l120l5852o7579a5574A21689c72879i079r89k38337G9106N3427
9895A32533b36671P0825g0581k12805a38491j21192g4388o07D6572c49252B78848
9883A91164E249J05715A9844c31593b8116k75661c2610D4313c27837J6495A15839
9871B53503Q9693c7085j17439e2882j76842o2979q3508e5707C27989c29130a40681
9859B7732c87625A69138a26549o6030H3239a97309A2986c10552M3394f2743j55462
9848b18205B81037b6070B31303r6258a18888k71634a42143A62734o7682a84366
9837A48712h2437j15146F6867F203b61400d1341B23554b89598J00426g567D5842
$$ plain form
9919 76310 -250440 -277179 93960 -158487 -71980 -302720 -87713 -144333 -18742 -44950 57446
9907 -139063 -83017 -86137 -121989 -189568 -15574 121689 -372879 -9079 -10068 -248405 79106 132533
9895 132533 -236671 -165846 -70581 -283386 -138491 -259683 -74388 -74995 46572 -349252 278848
9883 191164 5249 110964 19844 -331593 -28116 -303777 -32610 44313 -327837 -311342 115839
9871 253503 343196 -37085 -154524 -52882 -229724 -292703 -376211 -55707 327989 -329130 -140681
9859 27732 -387625 169138 -126549 -192579 83239 -197309 12986 -310552 -267158 -62743 -218205
9848 -218205 281037 -26070 231303 135045 -118888 -390522 -142143 162734 95052 -184366
9837 148712 -82437 -197583 66867 6203 -261400 -41341 223554 -289598 -189172 -7567 45842
9825e740B29119D6799b52460C6932O4493k0500b7698C3754J2339A4617a64732
9813B44584A06775a17004r9814h7387j29951J00868j7020m2422L4176m5329N9206
9802a27859A14885b66158a15264j89669e5836j83005e2046m49115A9440a59780
9791C0a55322C6873c3033J1868k3473A4538N7339J52677o3681O8018d43170a66584
9778E2698b15430p5499e535k72864F1363g9189j21834d2495o7662A826M1279M4798
9766H7903c82091a54543j22467q7602B46352G0892A1314O5323Q5767c06203K1309
9755b84894p122A70009d88823K33944k18043A05754d31574a49111I2215J43711
9745B35926c61022a2792B29840H0998a18013C64824j72201b75519H8521L4401
$$ plain form
9825 -5740 229119 46799 -252460 36932 101425 80925 -27698 33754 46093 14617 -164732
9813 244584 106775 -117004 -216818 -87387 -217338 -116470 -133490 -175912 -141736 -187065 -127859
9802 -127859 114885 -266158 -115264 -304933 -55836 -238841 -52046 -501161 19440 -159780
9791 30 -155322 36873 -33033 -21165 -44638 14538 71877 224554 160873 228891 -443170 -166584
9778 52698 -215430 -290929 -5535 -278399 61363 -79189 -201023 -42495 -110157 1826 43105 87903
9766 87903 -382091 -154543 -277010 -364612 246352 70892 11314 76637 162404 -306203 -284894
9755 -284894 -292016 170009 -488823 -254879 -472922 105754 -431574 -149111 92215 235926
9745 235926 -361022 -12792 229840 80998 -118013 364824 192623 -275519 88521 122922
9735A22922C0344a78107Q3471r4020A93353h9017g195C4496L13222e6745A23520
9723E8545R8689i3256D1283a69856P9967A86776o7204b231j89718d962l8988G9853
9710A4482a82027N325A9915R8C483b09770A58210a6362A51478c39355A75876i3567
9697A05413A0457d9335l92591a31429M6073j70009O4144G1343b32935A10014B5614
9685b00460I9097a939m6666A16013b03910M3330k07602A3446a31238C1040K53628
9674B84668b30323d0653j70178a4615k95759E2314b04827B10945a34113e3420
9663A03557b01629J6658A43621a03193q003A53295f8898B9751L857J1023J99361
9652B43992f0284C07666a42628A8213c2107j26308d5106B15870b08267A64150
$$ plain form
9735 122922 30344 -178107 -94636 -188656 193353 -89017 -7195 34496 347718 -56745 123520
9723 58545 157234 -93256 41283 -169856 -89889 186776 119572 -2231 -191949 -4962 -43950 79853
9710 14482 -182027 -176702 19915 20013 3483 -209770 158210 -16362 151478 -339355 175876 -93567
9697 105413 10457 -49335 -441926 -131429 -85356 -255365 -191221 71343 -232935 110014 25614
9685 -200460 99097 -1939 -48605 116013 -203910 -160580 -368182 13446 -131238 31040 284668
9674 284668 -230323 -40653 -210831 -14615 -310374 52314 -204827 210945 -134113 -53420
9663 103557 -201629 -184971 143621 -103193 -111196 153295 -68898 29751 33608 44631 243992
9652 243992 -60284 307666 -142628 18213 -32107 -158415 -45106 215870 -208267 164150
9641a27629B1746J07627D4090J5401L9719b95627J03569a1180p3353r1672L9342
9630a36863j29669B47814c46043K8550B51800d6608j23279b4311l1806a8843A07267
9618a79367k05772a55506f647C0422a71918D17310a6346D9541b19228R0446K0807
9607a07975p269E0588f3485j59814d2361k32325a07903I7309b5487j33765j8876
9596a78128j42945A42642p951b02991j81863c0808E2013a97995A17986f0698A05936
9584h8354E1984A4006K989J35367F5751a07799L0155o9687e3232A29203e024F3558
9571A53693p0708b14475h3216A4105K11524a21146j06048d179n87639D2185O3897
9560A06082f9433A58334a29330A68175D2916a54704B00657f928k47559f3628F2269
$$ plain form
9641 -127629 21746 129373 44090 59491 99210 -295627 -192058 -11180 -84533 -176205 -136863
9630 -136863 -266532 247814 -346043 -317493 251800 -46608 -169887 -24311 -56117 -18843 107267
9618 -179367 -385139 -155506 -6647 30422 -171918 417310 -16346 49541 -219228 -128782 -107975
9607 -107975 -115244 50588 -63485 -223299 -42361 -274686 -107903 97309 -25487 -159252 -178128
9596 -178128 -321073 142642 134691 -202991 -384854 -30808 52013 -197995 117986 -60698 105936
9584 -88354 51984 14006 16995 152362 65751 -107799 -77644 -147331 -53232 129203 -5024 63558
9571 153693 82985 -214475 -83216 14105 225629 -121146 -227194 -4179 -591818 42185 106082
9560 106082 -69433 158334 -129330 168175 42916 -154704 200657 -6928 -254487 -63628 62269
9548B73060C8033h1787b5562F499J04881b2417A07091m5571a52433P1783B54900
9536e72986H1601G923J82362c04173r0697J33136C80935a45867a9816j46490O7279
9525i9027k39661J15672F9522g5225j40075E2991b65113O8213a6623j63120g158
9513H868b78524a04891A21753h540l4114r068j26414M4734q8085D0847J04144
9502A44991b3769j31242j9852h1544G7203a61921B96469a05026F1686b15670D9318
9490D176N779a37116e6456A06528L38086j47670a28783A92616F1307c31891g4743
9478a26615k920A28505A7573J19920b80820B66245a72138f2646B2092M7428a54893
9466E9208a9597k73359J1621h9062a3561k55263K9503B15512b3120D5385J94076
$$ plain form
9548 273060 38033 -81787 -25562 6499 111380 -22417 107091 61520 -152433 -80650 254900
9536 -572986 81601 7923 190285 -304173 -394870 -261734 380935 -145867 -19816 -166306 -99027
9525 -99027 -338688 -223016 69522 -75225 -215300 52991 -265113 -196900 -16623 -179743 -7158
9513 8868 -278524 -104891 121753 -8540 -42654 -51722 -178136 -133402 -221487 40847 144991
9502 144991 -23769 -155011 -174863 -81544 77203 -161921 296469 -105026 61686 -215670 49318
9490 4176 9955 -137116 -56456 106528 444614 296944 -128783 192616 61307 -331891 -74743
9478 -126615 -129535 128505 17573 137493 -280820 266245 -172138 -62646 22092 69520 -154893
9466 59208 -19597 -292956 -281335 -89062 -13561 -268824 -239321 215512 -23120 45385 239461
9455B39461b06385A4068O7604J47962a19918H9266Q8474C6335a66122C6881b04918
9443b72681a19364F6018K40648D0360L1588O6799c15209c5871m912B12091c96961
9431a24226A1947J57699i1108k00143A17820P4824c16401A94490a30654k56655
9421c87309a40191A13277b77250J24208B6783c8016C44560a78188A10996J37681
9411B48677b2142j1787m41022a68911d3457A68314c44769h4344c4796k3800j15417
9400a74013L1130E376c42944F1185f2625m4870M4385Q905j48956f5566A74743
9388a74714g8646A24199Q0795F117L0686c58518D7550c54450a71411n2195i7289
9376a46433P2227H8759b4374A38579k0674D2998b60592C552g1214C49d58310a79450
$$ plain form
9455 239461 -206385 14068 81672 229634 -119918 89266 177740 36335 -166122 36881 -204918
9443 -272681 -119364 66018 306666 40360 71948 138747 -315209 -35871 -40783 212091 -396961
9431 -124226 11947 169646 -91108 -291251 117820 192644 -316401 194490 -130654 -387309
9421 -387309 -140191 113277 -277250 -153042 26783 -38016 344560 -178188 110996 248677
9411 248677 -22142 -33929 -474951 -168911 -43457 168314 -344769 -84344 -34796 -58596 -174013
9400 -174013 -142883 5376 -342944 61185 -62625 -107495 -63110 -54205 -203161 -65566 174743
9388 -174714 -78646 124199 204994 6117 36803 -358518 47550 -354450 -171411 -223606 -97289
9376 -146433 -74206 88759 -24374 138579 117905 42998 -260592 3552 -71214 349 -458310 -179450
9363f8547l6396o9568A78563c33151a07178D8027a56454o9817d7613B32182f7817
9351F4416b54803A05686Q558b21525a8169l47357a25018c8991r2687n5582J2143
9340a75117l4457O6246M2031k72084F0134b78911p405P8260m5689h7146B72875
9328b56339c1094B0007b50844K5418I4005a82183k80964g6101B3834a08298j03181
9317b11479o950G0691a50246K5270O1091I3246a79268f2645j6165A31177A3273
9305A04508b25534a5800A08189i0574K7336b4587k27868a4275l39044B44955d07724
9293A17178a62135H8224a04378j27342B05582B9313K43241a59757O5124A27751
9282a2987k76242l2212H4490b28356j27390C72598A74774e2580j1245F4285c25853
$$ plain form
9363 -68547 -104943 -174511 178563 -333151 -107178 48027 -156454 -226271 -47613 232182 -67817
9351 64416 -254803 105686 114244 -221525 -18169 -365526 -125018 -38991 -131678 -187260 -175117
9340 -175117 -209574 -143328 -101297 -373381 60134 -278911 -286316 -208056 -253745 -87146 272875
9328 -256339 -31094 20007 -250844 -225426 94005 -182183 -463147 -76101 23834 -108298 -211479
9317 -211479 -218429 70691 -150246 -124976 -63885 93246 -179268 -62645 -78810 131177 13273
9305 104508 -225534 -15800 108189 -90574 -63238 -24587 -252455 -14275 -353319 244955 -407724
9293 117178 -162135 88224 -104378 -231720 205582 29313 272554 -159757 -94633 127751
9282 -12987 -289229 -321441 84490 -228356 -355746 372598 174774 -52580 -63825 64285 -325853
9270A00663J97184c14449J25696F2262c9022j0636j35668A57983o6223L6881J538
9259A30179b22354k7097C4307a68226k752L6819C2549i5480N419a0358k16529
9248b26887f7931o9373l2466e5582K6756p077B5710a89706j83885f6133E3614
9236I0978b39504a18333B53846C6788a37490O6229p7588K8095L6792H0518a76554
9224B20398g4132K1799a7039A0624b7514D4054A4180a30094I1478a32325M9310
9213h3015J843B18887E976d1606l0796j21459B11198b9797D8378J64843i9696
9201h5506A3733a5179A40326i8148j05356A97104F7250a69050A66092e49543A47665
9189A13573b51973i0967j32909k03742e4264A65512L0835a4613A43158c38222
$$ plain form
9270 100663 297847 -314449 -188753 62262 -39022 -49658 -185326 157983 91760 128641 130179
9259 130179 -222354 -249451 34307 -168226 -170978 -134159 32549 -95480 -90061 -10358 -226887
9248 -226887 -67931 -137304 -169770 -55582 -28826 -35903 25710 -189706 -373591 -66133 53614
9236 90978 -239504 -118333 253846 36788 -137490 -71261 -148849 -120754 -83962 80518 -176554
9224 220398 -74132 -52333 -17039 10624 -27514 44054 14180 -130094 91478 -132325 -83015
9213 -83015 -81172 218887 5976 -41606 -72402 -193861 211198 -29797 48378 213221 -99696
9201 -85506 13733 -15179 140326 -98148 -203504 197104 67250 -169050 166092 -549543 147665
9189 113573 -251973 -90967 -223876 -427618 -54264 165512 196347 -14613 143158 -338222
9178b41248A36665c6865l7340C84324C4229g8098n3810I046a48642m1112l875
9167a93629e3818g502l81844i9800k12571A19513b58051a27601o319A91527b10241
9155a01737j12547h0621A86426J27898a97050f9012B65411b54018g1100A335e9000
9143A73562a15612B81587f6393A94101a19309A5960a8842A59418d3270j8197q8293
9132a49760b4483o5686A73091a1476r165A25003f2288J0890q4324j042d5531m4195
9120h9726b4761o0997j76743R5647L3276B9973e1961A84738C3390a17723A63236
9108B8825c83459E5737e5349r1449k324J5737A31407a38406A56702b34620K1643
9097b12977P3323e2412D5909J96977D931i9257B3580J35921b06033b4668j35051
$$ plain form
9178 -241248 136665 -36865 -74205 384324 34229 -78098 -131908 9046 -148642 -189754 -193629
9167 -193629 -53818 -7502 -389346 -99800 -312371 119513 -258051 -127601 -133920 191527 -210241
9155 -101737 -214284 -80621 186426 314324 -197050 -69012 265411 -254018 -71100 1335 -59000
9143 173562 -115612 281587 -66393 194101 -119309 15960 -18842 159418 -43270 -61467 -149760
9132 -149760 -24483 -90169 173091 -11476 -20641 125003 -62288 -51398 -135722 -136764 -45531 -89726
9120 -89726 -24761 -85758 -262501 -166854 -133578 29973 -51961 184738 33390 -117723 163236
9108 28825 -383459 55737 -55349 -146798 -149122 -133385 131407 -138406 156702 -234620 -212977
9097 -212977 -139654 -52412 45909 242886 4931 -99257 23580 159501 -206033 -24668 -159719
9086a59719H3796i9755F5850h1200B11455a87901d816j62157f9452l941l08303
9075c81696A41263L48112c5529j05460M4474l25245d3183A54299o3706m3821b71262
9063b37811Q2233P4349B12893a83112J9914M448k07805J77362A64503J43465F9888
9051B4774J72203k848j9184G9258a22505k88403i4752A87442b20922A41837C5296
9039g4994B7032a04963L7750j36145k6984k094G0546a51394j53700i5211L3195
9028f2016A23776b5522j25084B9079b7533E7834b10300J4231J7550L0037j20587
9017b69069e5911k36733a10235M6303n4155N8814H9187d7915I3269L4786d20155
9005e0074o9520E9154O5272e254H9914d3434n6656A51975c61947c1466J1482F0273
$$ plain form
9086 -159719 83796 -99755 65850 -81200 211455 -187901 -4816 -166973 -69452 -73393 -381696
9075 -381696 141263 489375 -35529 -140989 -96515 -421760 -43183 154299 90593 46772 -271262
9063 -237811 -155578 -81229 212893 -183112 -163198 -158750 -366555 -189193 164503 307968 69888
9051 24774 196977 194129 174945 79258 -122505 -410908 -94752 187442 -220922 141837 35296
9039 -74994 27032 -104963 -67213 -203358 -230342 -232436 70546 -151394 -305094 -95211 -62016
9028 -62016 123776 -25522 -150606 29079 -27533 57834 -210300 -196069 -178519 -148482 -269069
9017 -269069 -55911 -292644 -110235 -63932 -118087 -59273 89187 -47915 93269 128055 -420155
9005 -50074 -119594 59154 124426 -5254 89914 -43434 -100090 151975 -361947 -31466 -19984 60273
8992g7558j69038a01036p4759L5843j44323i855D4830b49499A17776A3393J93768
8981B07161A837e58203c5475A74268e7627a4832k18179e9933j57996B92998j20816
8970A72182a37558C53413c8723k03974A0203P7518J45495J3749R544D3592L06083
8959C49675a68384I3187O2636a92298A88742b61751d7785p8218j84835k26619
8949e37457a1573B89667a58244e5871A23813j8008j4192a9324j16575n0833A64560
8937D6505g0356J53q0193A27933j0326R1647e0259G8763c47879B19406d4107A80671
8924a4935F3126J07390Q47191Q08545B67699q1273N4791b11647d453B16591c996
8912g3107H102J355d79928A6289Q1399J35876b57215d2313h699B80695A10433
$$ plain form
8992 -77558 -246596 -101036 -175795 -139952 -284275 -9855 44830 -249499 117776 13393 207161
8981 207161 1837 -558203 -35475 174268 -57627 -14832 -233011 -59933 -217929 292998 172182
8970 172182 -137558 353413 -38723 -242697 10203 87721 233216 246965 256509 43592 349675
8959 349675 -168384 93187 155823 -192298 188742 -261751 -47785 -126003 -310838 -537457
8949 -537457 -11573 289667 -158244 -55871 123813 105805 91613 -19324 -135899 -186732 164560
8937 46505 -70356 -70203 -150396 127933 117607 209254 -50259 78763 -347879 219406 -44107 180671
8924 -14935 63126 170516 1017707 1826252 267699 186426 241217 -211647 -4453 216591 -3996
8912 -73107 8102 9457 -479928 16289 97688 233564 -257215 -42313 -8699 280695 110433
8900E8060a7297A79363D7262i4566M1015C30964b5602G0485e92790A56578c7348
8888C3394J41963b9183j4828k52124A3092d6407k2923C66798b94400g7905E8894
8876b67236B13621a39091e5434l5352B02796b07828i3871a6640n4122B11563J70235
8865C81798c19471g8210B3775K21040L401a24728M4526j13947F0658O7381b4227
$$ plain form
8900 58060 -17297 179363 47262 -94566 -53551 330964 -25602 70485 -592790 156578 -37348
8888 33394 175357 -29183 -44011 -296135 13092 -46407 -69330 366798 -294400 -77905 58894
8876 -267236 213621 -139091 -55434 -90786 202796 -207828 -93871 -16640 -70762 211563 381798
8865 381798 -319471 -78210 23775 244815 248216 -124728 -80202 -194149 60658 128039 -24227
$$ [...]
##END NTUPLES=NMR SPECTRUM
##END=
