##TITLE=AC1444_BRAAS13253_8011580_HmZ3cLmx9v
##JCAMPDX= 6.0         $$ Bruker NMR JCAMP-DX V2.0
##DATA TYPE= NMR SPECTRUM
##DATA CLASS= NTUPLES
##ORIGIN= BRUKER
##OWNER= Administrator
$$ 1.72 TOPSPIN		Version 2.1
$$ 2013-07-05 16:26:49.311 -0700  Administrator@X
$$ Compression mode = diff/dup
##.OBSERVE FREQUENCY= 400.02188249412
##.OBSERVE NUCLEUS= ^1H
##.ACQUISITION MODE= SIMULTANEOUS (DQD)
##.ACQUISITION SCHEME= undefined
##.AVERAGES= 64
##.DIGITISER RES= 22
##SPECTROMETER/DATA SYSTEM= spect
##.PULSE SEQUENCE= noesygpps1d.comp
##.SOLVENT NAME= COFFEE_meoh
##.SHIFT REFERENCE= INTERNAL, COFFEE_meoh, 1, 14.96098
##AUDIT TRAIL= $$ (NUMBER, WHEN, WHO, WHERE, PROCESS, VERSION, WHAT)
$$ ##TITLE= Audit trail, TOPSPIN		Version 2.1
$$ ##JCAMPDX= 5.01
$$ ##ORIGIN= Bruker BioSpin GmbH
$$ ##OWNER= Administrator
$$ $$ E:\/data/COFFEE/nmr/AC1444_BRAAS13253_8011580_HmZ3cLmx9v/12/pdata/1/auditp.txt
$$ ##AUDIT TRAIL=  $$ (NUMBER, WHEN, WHO, WHERE, PROCESS, VERSION, WHAT)
(   1,<2013-07-05 16:26:43.982 -0700>,<Administrator>,<X>,<go>,<TOPSPIN 2.1>,
      <created by zg
	started at 2013-07-05 16:15:13.873 -0700,
	POWCHK enabled, PULCHK disabled,
       configuration hash MD5:
       C8 4E 4E 5D D3 5C D8 9E 9F 52 82 E0 59 8A DE 15
       data hash MD5: 64K
       FB 21 CC 81 D8 14 C7 6C 50 F1 A7 9C 72 A7 71 77>)
(   2,<2013-07-05 16:26:47.092 -0700>,<Administrator>,<X>,<proc1d>,<TOPSPIN 2.1>,
      <Start of raw data processing
       efp LB = 0.3 FT_mod = 6 PKNL = 1 PHC0 = 0 PHC1 = 0 SI = 128K 
       data hash MD5: 128K
       96 B1 DF 15 FD 29 A3 8F 85 BF 2F 7A BE 64 13 EA>)
(   3,<2013-07-05 16:26:48.217 -0700>,<Administrator>,<X>,<proc1d>,<TOPSPIN 2.1>,
      <pk PHC0 = -82.29858 PHC1 = 0 
       data hash MD5: 128K
       B8 D3 59 13 F8 DC 40 F2 CD B9 B2 2C 18 90 EA 30>)
(   4,<2013-07-05 16:26:48.701 -0700>,<Administrator>,<X>,<proc1d>,<TOPSPIN 2.1>,
      <abs ABSG = 1 
       data hash MD5: 128K
       F7 BE 71 CD 4B 39 D1 94 44 E3 C4 74 D5 37 A7 4F>)
(   5,<2013-07-05 16:26:48.826 -0700>,<Administrator>,<X>,<proc1d>,<TOPSPIN 2.1>,
      <abs ABSG = 2 
       data hash MD5: 128K
       C5 BE BF E3 CB 09 F8 08 67 83 8B 54 2D 67 6D 64>)
(   6,<2013-07-05 16:26:48.920 -0700>,<Administrator>,<X>,<proc1d>,<TOPSPIN 2.1>,
      <abs ABSG = 3 
       data hash MD5: 128K
       A8 40 3A 31 7F 6E 2D 2E 2A 57 2D B7 86 2B DF D5>)
(   7,<2013-07-05 16:26:49.014 -0700>,<Administrator>,<X>,<proc1d>,<TOPSPIN 2.1>,
      <abs ABSG = 4 
       data hash MD5: 128K
       3E 34 61 4B F6 02 91 E3 48 BF 8A 51 22 01 B5 F5>)
(   8,<2013-07-05 16:26:49.139 -0700>,<Administrator>,<X>,<proc1d>,<TOPSPIN 2.1>,
      <abs ABSG = 5 
       data hash MD5: 128K
       17 FF DC 1F EA 21 A9 C1 B4 CD 2F F0 71 8D 87 AA>)
$$ ##END=
$$ 
$$ $$ hash MD5
$$ $$ AD 28 FB B0 9B FA 67 4C 55 D5 38 8A CF 79 11 A1
##$RELAX= 
##$RELAX= 
##$RELAX= 
##$RELAX= 
##$RELAX= 
##$RELAX= 
##$RELAX= 
##$RELAX= 
$$ Bruker specific parameters
$$ --------------------------
##$DU= <E:\>
##$EXPNO= 12
$$ [...]
##$TP07= 0
##$TPNAME0= <>
##$TPNAME1= <>
##$TPNAME2= <>
##$TPNAME3= <>
##$TPNAME4= <>
##$TPNAME5= <>
##$TPNAME6= <>
##$TPNAME7= <>
##$TPOAL= (0..7)
0.5 0.5 0.5 0.5 0.5 0.5 0.5 0.5
##$TPOFFS= (0..7)
0 0 0 0 0 0 0 0
##$TUNHIN= 0
##$TUNHOUT= 0
##$TUNXOUT= 0
##$USERA1= <user>
##$USERA2= <user>
##$USERA3= <user>
##$USERA4= <user>
##$USERA5= <user>
##$V9= 5
##$VALIST= <valist>
##$VCLIST= <CCCCCCCCCCCCCCC>
##$VD= 0
##$VDLIST= <DDDDDDDDDDDDDDD>
##$VPLIST= <PPPPPPPPPPPPPPP>
##$VTLIST= <TTTTTTTTTTTTTTT>
##$WBST= 1024
##$WBSW= 4
##$XGAIN= (0..3)
0 0 0 0
##$XL= 0
##$YL= 0
##$YMAX_a= 6575940
##$YMIN_a= -12975934
##$ZGOPTNS= <>
##$ZL1= 120
##$ZL2= 120
##$ZL3= 120
##$ZL4= 120
##$ABSF1= 14.96098
##$ABSF2= -5.597201
##$ABSG= 5
##$ABSL= 3
##$ALPHA= 0
##$AQORDER= 0
##$ASSFAC= 0
##$ASSFACI= 0
##$ASSFACX= 0
##$ASSWID= 0
##$AUNMP= <proc_prof1d_extract.lims>
##$AXLEFT= 0
##$AXNAME= <>
##$AXNUC= <1H>
##$AXRIGHT= 0
##$AXTYPE= 0
##$AXUNIT= <>
##$AZFE= 0.1
##$AZFW= 0.1
##$BCFW= 0
##$BC_mod= 0
##$BYTORDP= 0
##$COROFFS= 0
##$CY= 15
##$DATMOD= 1
##$DC= 0
##$DFILT= <>
##$DTYPP= 0
##$F1P= 0
##$F2P= 0
##$FCOR= 0.5
##$FTSIZE= 131072
##$FT_mod= 6
##$GAMMA= 0
##$GB= 0
##$INTBC= 1
##$INTSCL= 1
##$ISEN= 128
##$LB= 0.3
##$LEV0= 0
##$LPBIN= 0
##$MAXI= 10000
##$MC2= 0
##$MEAN= 0
##$ME_mod= 0
##$MI= 0
##$NCOEF= 0
##$NC_proc= -2
##$NLEV= 6
##$NOISF1= 0
##$NOISF2= 0
##$NSP= 0
##$NTH_PI= 0
##$NZP= 0
##$OFFSET= 14.96098
##$PC= 1
##$PHC0= -82.29858
##$PHC1= 0
##$PH_mod= 1
##$PKNL= yes
##$PPARMOD= 0
##$PPDIAG= 0
##$PPIPTYP= 0
##$PPMPNUM= 2147483647
##$PPRESOL= 1
##$PSCAL= 4
##$PSIGN= 0
##$PYNMP= <proc.py>
##$REVERSE= no
##$SF= 400.020009643596
##$SI= 131072
##$SIGF1= 0
##$SIGF2= 0
##$SINO= 400
##$SIOLD= 131072
##$SPECTYP= <>
##$SREGLST= <1H.CDCl3>
##$SSB= 0
##$STSI= 131072
##$STSR= 0
##$SW_p= 8223.68421052631
##$SYMM= 0
##$S_DEV= 0
##$TDeff= 65536
##$TDoff= 0
##$TI= <>
##$TILT= no
##$TM1= 0
##$TM2= 0
##$TOPLEV= 0
##$USERP1= <user>
##$USERP2= <user>
##$USERP3= <user>
##$USERP4= <user>
##$USERP5= <user>
##$WDW= 1
##$XDIM= 131072
##$YMAX_p= 446084349
##$YMIN_p= -11673
##$CURPLOT= <Network HP LaserJet P1505>
##$CURPRIN= <$Network HP LaserJet P1505>
##$DFORMAT= <normdp>
##$LAYOUT= <+/1D_H.xwp>
##$LFORMAT= <normlp>
##$PFORMAT= <normpl>
##$SURQMSG= 1
$$ End of Bruker specific parameters
$$ ---------------------------------
##NTUPLES= NMR SPECTRUM
##VAR_NAME=  FREQUENCY,     SPECTRUM/REAL,   SPECTRUM/IMAG
##SYMBOL=    X,             R,               I
##VAR_TYPE=  INDEPENDENT,   DEPENDENT,       DEPENDENT
##VAR_FORM=  AFFN,          ASDF,            ASDF
##VAR_DIM=   131072,        131072,          131072
##UNITS=     HZ,            ARBITRARY UNITS, ARBITRARY UNITS
##FACTOR=    0.0627417313425164, 1,          1
##FIRST=     8223.62146879497, 6766,         -57226
##LAST=      0,             8346,            -56370
##MIN=       0,             -11673,          0
##MAX=       8223.62146879497, 446084349,    0
$$ Real data points
##PAGE= N=1
##DATA TABLE= (X++(R..R)), XYDATA
$$ [...]
$$ plain form
63902 1199339 1138386 1086724 1042249 1003908 971152 942914 917671 894228 871895 850035 828032
63891 828032 805767 783628 761956 740832 720540 701822 685391 671454 659928 650882 644474 640647
63879 640647 639245 640442 644696 652235 662828 676181 692269 711024 731854 753850 776539 800189
63867 800189 825226 851548 878491 905171 930554 953479 973119 989560 1003518 1015326 1024486 1030342
63855 1030342 1032799 1032003 1027604 1018915 1005824 989111 969772 948359 925081 900151 873746 845915
63843 845915 816831 787022 757113 727446 698143 669370 641238 613612 586350 559767 534539
63832 534539 511145 489638 469929 451898 435161 419120 403509 388631 374894 362336 350759
63821 350759 340036 330107 320957 312877 306405 301612 297695 293723 289652 286065 283044 279937 276362 272840
$$ packed form
63902A199339o0953n1662m4475l8341l2756k8238k5243k3443k2333k1860k2003
63891H28032k2265k2139k1672k1124k0292j8718j6431j3937j1526r046o408l827
63879F40647j402J197M254P539J0593J3353J6088J8755K0830K1996K2689K3650
63867H00189K5037K6322K6943K6680K5383K2925J9640J6441J3958J1808R160N856
63855A030342K457p96m399q689j3091j6713j9339k1413k3278k4930k6405k7831
63843H45915k9084k9809k9909k9667k9303k8773k8132k7626k7262k6583k5228
63832E34539k3394k1507j9709j8031j6737j6041j5611j4878j3737j2558j1577
63821C50759j0723r929r150q080o472m793l917l972m071l587l021l107l575l522
$$ plain form
63807 272840 270083 268024 265977 263569 261163 259362 258311 257518 256274 254266 251812 249497 247621 246099
63793 246099 244760 243472 241992 239972 237235 233924 230405 227179 224762 223291 222271 221128 220045 219777
63779 219777 220521 221499 221939 222006 222327 222977 223449 223374 222789 221828 220721 220023 220269 221219 221828 221213 219485 217576
63761 217576 216446 216502 217495 218754 219615 219806 219486 218970 218451 217963 217534 217407 218052 219813 222485 225432 228267
63744 228267 231143 234234 237185 239440 240961 242240 243608 244918 245965 246933 248278 250326 253029 255923
63730 255923 258305 259662 260159 260625 261987 264622 268277 272498 277060 281935 286884 291331 294852 297637 300104
63715 300104 302155 303242 303284 302900 302432 301313 299005 296155 294018 292841 291650 289784 287957 287361 288213 289687
63699 289687 291088 292555 294560 297071 299550 301716 304036 307203 311241 315384 318861 321419 323063 323791
$$ packed form
63807B72840k757k059k047k408k406j801j051p93j244k008k454k315j876j522
63793B46099j339j288j480k020k737l311l519l226k417j471j020j143j083k68
63779B19777P44R78M40O7L21O50M72p5n85r61j107o98K46R50O09o15j728j909
63761B17576j130N6R93J259Q61J91l20n16n19m88m29j27O45J761K672K947K835
63744B28267K876L091K951K255J521J279J368J310J047R68J345K048K703K894
63730B55923K382J357M97M66J362K635L655M221M562M875M949M447L521K785K467
63715C00104K051J087M2l84m68j119k308k850k137j177j191j866j827n96Q52J474
63699B89687J401J467K005K511K479K166K320L167M038M143L477K558J644P28
$$ plain form
63685 323791 323850 323781 323763 323278 321934 320224 318853 317679 316107 314344 313303 313194 313128 312378 311279 310531 310328
63668 310328 310638 311700 313625 315917 317899 319318 320113 319987 318717 316579 314003 311071 307790 304526 301623
63653 301623 298800 295554 291970 288571 285525 282677 280327 279176 279315 279929 280390 281076 282645 284908 286990
63638 286990 288406 289498 290906 293110 296470 301126 306575 311834 316477 321358 327838 336296 345810 355336
63624 355336 364714 374363 384453 394901 405954 418191 431919 446983 463252 480974 500467 521772
63612 521772 544748 569278 595240 622418 650632 679760 709478 738928 766607 790524 808755
63601 808755 820340 825806 826578 823777 817868 809452 799899 790824 783096 776515 770177 762822 753090 739924
63587 739924 723007 702777 680042 655634 630326 604973 580652 558464 539049 522384 508242
$$ packed form
63685C23791N9o9j8m85j344j710j371j174j572j763j041j09o6p50j099p48k03
63668C10328L10J062J925K292J982J419P95j26j270k138k576k932l281l264k903
63653C01623k823l246l584l399l046k848k350j151J39O14M61O86J569K263K082
63638B86990J416J092J408K204L360M656N449N259M643M881O480Q458R514R526
63624C55336R378R649J0090J0448J1053J2237J3728J5064J6269J7722J9493K1305
63612E21772K2976K4530K5962K7178K8214K9128K9718K9450K7679K3917J8231
63601H08755J1585N466P72k801n909q416r553r075p728o581o338p355r732j3166
63587G39924j6917k0230k2735k4408k5308k5353k4321k2188j9415j6665j4142
$$ plain form
63576 508242 496703 487870 481315 476327 472735 470919 470897 472019 473864 476845 481500 487635 494698 502611
63562 502611 511549 521083 530258 538675 547060 556582 567902 580981 595614 612001 630837 652861 678390
63549 678390 707441 740188 776862 816901 858317 897920 932010 957104 970988 973862 968264 957375
63537 957375 943422 927783 911943 897523 885479 875848 868247 862010 855847 847888 836343 820075
63525 820075 798770 773032 744263 714020 683345 652815 622986 594382 567228 541596 517735
63514 517735 495796 475455 456361 438886 423820 411291 400590 391115 382901 376008 369996 364326
63502 364326 358919 354012 349796 346380 343832 342034 340774 340070 340084 340567 340757 340039 338442 336403 334361 332805
63486 332805 332299 333126 335029 337479 340101 342764 345464 348184 350726 352763 354364 356313 359413 363432 367196
$$ packed form
63576E08242j1539q833o555m988l592j816k2J122J845K981M655O135P063P913
63562E02611Q938R534R175Q417Q385R522J1320J3079J4633J6387J8836K2024K5529
63549F78390K9051L2747L6674M0039M1416L9603L4090K5094J3884K874n598j0889
63537I57375j3953j5639j5840j4420j2044r631p601o237o163p959j1545j6268
63525H20075k1305k5738k8769l0243l0675l0530k9829k8604k7154k5632k3861
63514E17735k1939k0341j9094j7475j5066j2529j0701r475q214o893o012n670
63502C64326n407m907m216l416k548j798j260p04J4M83J90p18j597k039k042j556
63486C32805n06Q27J903K450K622K663K700K720K542K037J601J949L100M019L764
$$ plain form
63471 367196 369742 370809 370229 367694 363549 359108 355583 353042 350795 348339 345441 341881 337878 334483
63457 334483 332814 332907 333858 334963 336234 337952 340326 343675 348389 354584 362032 370413 379398 388674 398297
63442 398297 408841 420779 433925 448118 464333 484340 509060 537746 568791 600538 631061
63431 631061 658016 679547 695194 705569 711559 714374 716054 719067 725171 734914 748306 765622 787453
63418 787453 814180 845503 880277 916680 952608 986020 1014984 1037645 1052567 1059311 1058677 1052372
63406 1052372 1042457 1030936 1019430 1008856 999246 989969 980174 969038 955588 938510 916491 889036
63394 889036 856946 821861 785385 748809 713478 680861 651861 626239 603077 581809 562548
63383 562548 545504 530510 517438 506804 499533 495904 494947 495123 495734 497445 501332 507580 515431 524388
$$ packed form
63471C67196K546J067n80k535m145m441l525k541k247k456k898l560m003l395
63457C34483j669R3R51J105J271J718K374L349M714O195P448Q381Q985R276R623
63442C98297J0544J1938J3146J4193J6215K0007K4720K8686L1045L1747L0523
63431F31061K6955K1531J5647J0375N990K815J680L013O104R743J3392J7316K1831
63418G87453K6727L1323L4774L6403L5928L3412K8964K2661J4922O744o34o305
63406A052372r915j1521j1506j0574r610r277r795j1136j3450j7078k2019k7455
63394H89036l2090l5085l6476l6576l5331l2617k9000k5622k3162k1268j9261
63383E62548j7044j4994j3072j0634p271l629r57J76O11J711L887O248P851Q957
$$ plain form
63369 524388 534967 547988 563437 580482 598457 617371 637492 658977 682108 707403 735128
63358 735128 764973 796519 829703 864422 899770 934007 965201 991647 1011939 1025198 1031364 1031011
63346 1031011 1025018 1014799 1002656 991011 980901 971543 961548 950082 936649 920519 901092 878553
63334 878553 853490 825993 795818 763530 730930 700107 672354 648033 627029 609095 594147
63323 594147 582609 575299 572538 573187 574606 573642 567957 556782 540826 521578 500643 479569 459907
63310 459907 442922 428974 417281 406586 396202 386492 378334 372228 367949 364991 363029 361775 360605
63297 360605 358816 356368 353990 352347 351331 350337 348843 346435 342684 337558 331889 326901 323232 320748
63283 320748 319234 318712 318951 319229 319006 318554 318556 319191 319971 320450 320751 321197 321614 321374 320249 318961 318501 319006
$$ packed form
63369E24388J0579J3021J5449J7045J7975J8914K0121K1485K3131K5295K7725
63358G35128K9845L1546L3184L4719L5348L4237L1194K6446K0292J3259O166l53
63346A031011n993j0219j2143j1645j0110r358r995j1466j3433j6130j9427k2539
63334H78553k5063k7497l0175l2288l2600l0823k7753k4321k1004j7934j4948
63323E94147j1538p310k761O49J419r64n685j1175j5956j9248k0935k1074j9662
63310D59907j6985j3948j1693j0695j0384r710q158o106m279k958j962j254j170
63297C60605j789k448k378j643j016r94j494k408l751n126n669m988l669k484
63283C20748j514n22K39K78k23m52KO35P80M79L01M46M17k40j125j288m60N05
$$ plain form
63265 319006 319729 320174 320722 321859 323329 324634 325942 327858 330477 333421 336747 341013 346229 351515 356191
63250 356191 360668 365792 371743 378055 384458 391232 398829 407562 417617 429034 441590 454857 468560
63237 468560 482926 498782 517116 538240 561356 585188 609141 633649 659448 686802 715416
63226 715416 744590 773329 800682 826372 850938 875144 899395 923841 948714 974334 1000886
63215 1000886 1028213 1055677 1082201 1106706 1128473 1146844 1160777 1169168 1171519 1167696 1157098 1138945
63203 1138945 1113623 1083026 1049183 1013210 975932 938667 902712 868645 836848 808261 783871
63192 783871 763822 747675 735203 726209 719975 715849 714341 716848 724155 735705 750256 766713 784383
63179 784383 803111 823213 844844 867384 889889 911985 933812 955278 976011 996020 1015718
$$ packed form
63265C19006P23M45N48J137J470J305J308J916K619K944L326M266N216N286M676
63250C56191M477N124N951O312O403O774P597Q733J0055J1417J2556J3267J3703
63237D68560J4366J5856J8334K1124K3116K3832K3953K4508K5799K7354K8614
63226G15416K9174K8739K7353K5690K4566K4206K4251K4446K4873K5620K6552
63215A000886K7327K7464K6524K4505K1767J8371J3933Q391K351l823j0598j8153
63203A138945k5322l0597l3843l5973l7278l7265l5955l4067l1797k8587k4390
63192G83871k0049j6147j2472q994o234m126j508K507P307J1550J4551J6457J7670
63179G84383J8728K0102K1631K2540K2505K2096K1827K1466K0733K0009J9698
$$ plain form
63168 1015718 1035211 1054051 1071615 1087187 1099713 1108128 1111924 1110815 1103974 1090463 1070558 1045753
63156 1045753 1017234 985164 949842 912741 875737 839793 804976 771322 739170 708964 681236
63145 681236 656564 635125 616449 599920 585263 572325 560747 550274 541158 533845 528381 524390
63133 524390 521443 519224 517546 516506 516456 517553 519459 521696 524121 526874 530083 533797 538030 542677 547543
63118 547543 552552 557698 562645 566713 569463 571107 572227 573384 575021 577249 579530 581093 581996 583228
63104 583228 585315 587383 588204 587747 586966 586326 585427 584080 582867 582305 582020 581190 579560 577673 576212 575312
63088 575312 574528 573444 572306 571967 573109 575659 579049 582841 586853 590912 594888 598974 603663 609386 616263
63073 616263 624106 632493 640974 649413 658043 667138 676829 687426 699573 713708 729608 746814 765287
$$ packed form
63168A015718J9493J8840J7564J5572J2526Q415L796j109o841j3511j9905k4805
63156A045753k8519l2070l5322l7101l7004l5944l4817l3654l2152l0206k7728
63145F81236k4672k1439j8676j6529j4657j2938j1578j0473r116p313n464l991
63133E24390k947k219j678j040n0J097J906K237K425K753L209L714M233M647M866
63118E47543N009N146M947M068K750J644J120J157J637K228K281J563R03J232
63104E83228K087K068Q21m57p81o40q99j347j213n62k85q30j630j887j461r00
63088E75312p84j084j138l39J142K550L390L792M012M059L976M086M689N723O877
63073F16263P843Q387Q481Q439Q630R095R691J0597J2147J4135J5900J7206J8473
$$ plain form
63060 765287 785284 806962 830645 857277 887857 922398 960104 1000732 1045164 1094352 1148198
63049 1148198 1205794 1266301 1329217 1394063 1460251 1527127 1593947 1659961 1724773 1788443 1851016
63038 1851016 1912133 1971415 2029146 2086304 2143839 2201983 2260181 2317440 2372555 2423953 2469441
63027 2469441 2506434 2532677 2546693 2547484 2534086 2505841 2463072 2407142 2339901 2263500 2180671 2094517
63015 2094517 2007611 1921577 1837824 1758329 1685338 1620470 1564434 1517410 1479347 1449982 1428923
63004 1428923 1415778 1410142 1411569 1419709 1434274 1454671 1479890 1508984 1541462 1576921 1614488 1653025
62992 1653025 1691783 1730539 1769202 1807739 1846316 1884994 1923181 1959852 1994285 2026007 2053765
62981 2053765 2075168 2087880 2090875 2084179 2067779 2041383 2005107 1959737 1906214 1845337 1778195 1706565
$$ packed form
63060G65287J9997K1678K3683K6632L0580L4541L7706M0628M4432M9188N3846
63049A148198N7596O0507O2916O4846O6188O6876O6820O6014O4812O3670O2573
63038A851016O1117N9282N7731N7158N7535N8144N8198N7259N5115N1398M5488
63027B469441L6993K6243J4016P91j3398k8245m2769n5930o7241p6401q2829q6154
63015B094517q6906q6034q3753p9495p2991o4868n6036m7024l8063k9365k1059
63004A428923j3145n636J427Q140J4565K0397K5219K9094L2478L5459L7567L8537
62992A653025L8758L8756L8663L8537L8577L8678L8187L6671L4433L1722K7758
62981B053765K1403J2712K995o696j6400k6396l6276m5370n3523o0877o7142p1630
$$ plain form
62969 1706565 1632682 1558793 1486915 1418604 1354617 1294894 1239035 1186785 1138075 1092910 1051404
62958 1051404 1013685 979568 948391 919356 891911 865775 840835 817216 795141 774447 754487
62947 754487 734829 715769 697737 680491 663558 647298 632695 619960 608144 596526 585641
62936 585641 576306 568239 560479 552894 546328 541259 537117 533178 529526 526755 525144 524518 524558 524850 524775 523767
62920 523767 521759 519190 516602 514254 512059 509795 507419 505162 503116 500776 497321 492523 487131 482140
62906 482140 477951 474536 472031 470559 469570 468044 465639 463176 461645 461107 460971 460971 461188 461275 460501 458822 457211
62889 457211 456424 455962 454914 453478 452813 453444 454615 455411 455747 455902 455810 455397 455154 455669 456808 457921 458649
62872 458649 458974 458750 457849 456707 456028 455856 455530 454669 453615 452787 452150 451525 450859 450023 448880 447819 447617
$$ packed form
62969A706565p3883p3889p1878o8311o3987n9723n5859n2250m8710m5165m1506
62958A051404l7719l4117l1177k9035k7445k6136k4940k3619k2075k0694j9960
62947G54487j9658j9060j8032j7246j6933j6260j4603j2735j1816j1618j0885
62936E85641r335q067p760p585o566n069m142l939l652k771j611o26M0K92p5j008
62920E23767k008k569k588k348k195k264k376k257k046k340l455m798n392m991
62906D82140m189l415k505j472r89j526k405k463j531n38j36%K17Q7p74j679j611
62889D57211p87m62j048j436o65O31J171P96L36J55r2m13k43N15J139J113P28
62872D58649L25k24r01j142o79j72l26q61j054q28o37o25o66q36j143j061k02
$$ plain form
62855 447617 448476 449771 451045 452604 454654 456597 457872 458908 460352 461808 462304 461738 460831 459773 458034
62840 458034 455623 453444 452011 450690 448754 446426 444356 442742 441559 441029 441166 441317 440890 440252 440257 441183
62824 441183 442778 445044 448145 451700 455001 457982 461225 464933 468679 472307 476317 480992 485896 490684
62810 490684 495795 501752 508248 514538 520425 526274 532352 538749 545773 553746 562461 571422 580682 590815
62796 590815 602012 613789 625854 638789 653573 670838 690872 713951 740260 769802 802865
62785 802865 840435 883693 933040 987915 1047637 1112255 1182552 1259430 1343310 1433935 1530560
62774 1530560 1632204 1737633 1845067 1952048 2055671 2152922 2240893 2316980 2378984 2424882
62764 2424882 2452605 2460580 2448735 2418546 2371806 2309786 2234104 2147832 2054820 1957866 1858201
$$ packed form
62855D47617Q59J295J274J559K050J943J275J036J444J456M96n66r07j058j739
62840D58034k411k179j433j321j936k328k070j614j183n30J37J51m27o38NR26
62824D41183J595K266L101L555L301K981L243L708L746L628M010M675M904M788
62810D90684N111N957O496O290N887N849O078O397P024P973Q715Q961R260J0133
62796E90815J1197J1777J2065J2935J4784J7265K0034K3079K6309K9542L3063
62785H02865L7570M3258M9347N4875N9722O4618P0297P6878Q3880R0625R6625
62774A530560J01644J05429J07434J06981J03623R7251Q7971P6087O2004M5898
62764B424882K7723P975j1845l0189m6740o2020p5682q6272r3012r6954r9665
$$ plain form
62753 1858201 1756753 1655153 1555304 1458738 1366822 1281029 1202385 1130897 1065909 1006814 953126
62742 953126 904219 859508 818772 782056 749396 720829 696313 675269 656546 639287 623603
62731 623603 609990 598364 588211 579393 572108 566142 560919 556405 553312 552141 552496 553599 555056 556947
62717 556947 559650 563851 570375 579544 590887 603661 617578 632934 650317 670321 693289 719181
62705 719181 747923 779864 815599 855296 898716 946048 998160 1055674 1118267 1185293 1256702
62694 1256702 1332805 1413367 1497348 1583217 1668993 1752091 1829659 1899162 1958466 2005576 2038701
62683 2038701 2056470 2057842 2042114 2009541 1961835 1901595 1831265 1752936 1668921 1581899 1494386
62672 1494386 1408340 1325130 1245497 1169744 1098450 1032828 973805 920851 872418 827519 786295
$$ packed form
62753A858201j01448j01600r9849r6566r1916q5793p8644p1488o4988n9095n3688
62742I53126m8907m4711m0736l6716l2660k8567k4516k1044j8723j7259j5684
62731F23603j3613j1626j0153q818p285n966n223m514l093j171L55J103J457J891
62717E56947K703M201O524R169J1343J2774J3917J5356J7383K0004K2968K5892
62705G19181K8742L1941L5735L9697M3420M7332N2112N7514O2593O7026P1409
62694A256702P6103Q0562Q3981Q5869Q5776Q3098P7568O9503N9304M7110L3125
62683B038701J7769J372j5728l2573m7706o0240p0330p8329q4015q7022q7513
62672A494386q6046q3210p9633p5753p1294o5622n9023n2954m8433m4899m1224
$$ plain form
62661 786295 749106 715911 686671 661440 639611 619785 600959 583348 567602 553683 541005
62650 541005 529152 517891 506873 496029 486024 477679 470998 465279 460098 455703 452457 450366 449245
62637 449245 448989 449493 450456 451318 451410 450360 448414 446175 443891 441276 438176 435024 432388 430416 429100 428660
62621 428660 429182 430143 430930 431745 433458 436590 440844 445622 450534 455400 460168 464959 469939 475182 480947
62606 480947 487968 496963 507845 519814 532426 546308 562707 582532 605840 632128 661111 693315
62594 693315 729744 770840 815965 863988 913984 965152 1016594 1067582 1117483 1164759 1206595
62583 1206595 1240423 1265541 1282360 1290497 1288777 1276976 1256220 1227545 1191425 1149149 1103277 1055930
62571 1055930 1007694 958972 911375 866583 824661 784705 746720 711690 680104 651568 625795
$$ packed form
62661G86295l7189l3195k9240k5231k1829j9826j8826j7611j5746j3919j2678
62650E41005j1853j1261j1018j0844j0005q345o681n719n181m395l246k091j121
62637D49245k56N04R63Q62R2j050j946k239k284k615l100l152k636j972j316m40
62621D28660N22R61P87Q15J713L132M254M778M912M866M768M791M980N243N765
62606D80947P021Q995J0882J1969J2612J3882J6399J9825K3308K6288K8983L2204
62594F93315L6429M1096M5125M8023M9996N1168N1442N0988M9901M7276M1836
62583A206595L3828K5118J6819Q137j720j1801k0756k8675l6120m2276m5872m7347
62571A055930m8236m8722m7597m4792m1922l9956l7985l5030l1586k8536k5773
$$ plain form
62560 625795 602931 582893 565294 550077 537338 526398 515979 505579 495925 487767 480951 475014
62548 475014 470019 466295 463852 462531 462293 462867 463460 463408 462953 462890 463538 464476 465265 465930 466624 467200 467433 467490
62530 467490 467900 469056 471003 473804 477876 483737 491526 501067 512421 526054 542294 560930 581647
62517 581647 604670 630682 660246 693561 730662 771394 815143 860967 908265 957088 1007579
62506 1007579 1059061 1109727 1157155 1199194 1234549 1262699 1283354 1296024 1300229 1296134 1284982 1268889
62494 1268889 1250152 1230560 1211263 1193169 1177322 1164803 1156482 1153162 1155736 1164737 1179700 1199549
62482 1199549 1223764 1252517 1285234 1319414 1351315 1377578 1396035 1405716 1406913 1400933 1388806 1370027
62470 1370027 1343016 1306819 1261977 1210033 1153005 1093384 1033735 975720 919733 865696 813929
$$ packed form
62560F25795k2864k0038j7599j5217j2739j0940j0419j0400r654q158o816n937
62548D75014m995l724k443j321k38N74N93n2m55o3O48R38P89O65O94N76K33N7
62530D67490M10J156J947K801M072N861P789R541J1354J3633J6240J8636K0717
62517E81647K3023K6012K9564L3315L7101M0732M3749M5824M7298M8823N0491
62506A007579N1482N0666M7428M2039L5355K8150K0655J2670M205m095j1152j6093
62494A268889j8737j9592j9297j8094j5847j2519q321l320K574R001J4963J9849
62482A199549K4215K8753L2717L4180L1901K6263J8457R681J197n980j2127j8779
62470A370027k7011l6197m4842n1944n7028n9621n9649n8015n5987n4037n1767
$$ plain form
62459 813929 765265 720803 681584 648017 619432 594722 573567 556498 543554 533522 524982 517549
62447 517549 511630 507390 504659 503571 504544 507615 512299 518192 525224 533168 541263 548609 554836 560188
62433 560188 564912 568607 570272 569152 565485 560179 553721 545705 535687 524202 512614 502060 492773
62420 492773 484323 476250 468492 461466 455736 451372 447612 443384 438268 432826 427963 424105 421049 418423
62406 418423 416080 414035 412226 410543 409090 408234 408253 409019 410153 411446 413005 415043 417700 420995 424791
62391 424791 428779 432639 436187 439276 441734 443672 445758 448795 452997 457931 463163 468634 474406 480506
62377 480506 487146 494707 503232 512237 521258 530357 539849 549794 560064 570777 582425 595642 610947
62364 610947 628586 648532 670834 696033 725068 758664 797011 840066 887819 940056 996078
$$ packed form
62459H13929m8664m4462l9219l3567k8585k4710k1155j7069j2944j0032q540p433
62447E17549n919m240k731j088R73L071M684N893P032P944Q095P346O227N352
62433E60188M724L695J665j120l667n306o458q016j0018j1485j1588j0554r287
62420D92773q450q073p758p026n730m364l760m228n116n442m863l858l056k626
62406D18423k343k045j809j683j453q56J9P66J134J293J559K038K657L295L796
62391D24791L988L860L548L089K458J938K086L037M202M934N232N471N772O100
62377D80506O640P561Q525R005R021R099R492R945J0270J0713J1648J3217J5305
62364F10947J7639J9946K2302K5199K9035L3596L8347M3055M7753N2237N6022
$$ plain form
62353 996078 1054693 1114145 1172032 1225813 1273613 1314192 1346173 1368221 1380487 1385074 1384251 1378541
62341 1378541 1367193 1349920 1327194 1299240 1266056 1228611 1188986 1148989 1109397 1070791 1034203
62330 1034203 1000372 969088 939979 913469 890257 870083 851637 833548 815046 795877 776079
62319 776079 755791 734891 712947 689936 666833 644946 624655 605383 586894 570011 555714
62308 555714 544010 534148 525654 518567 512788 507891 503776 500978 499873 499854 499796 499267 498812 499025 499853 501042
62292 501042 502791 505462 508861 512304 515401 518389 521677 525416 529545 533800 537516 539847 540598 540632 541066
62277 541066 542165 543425 544713 546808 550602 556048 562266 568629 575420 583400 593051 604359 617176 631584
62263 631584 648069 667494 690777 718320 749924 785541 826020 872534 925142 982359 1042326
$$ packed form
62353I96078N8615N9452N7887N3781M7800M0579L1981K2048J2266M587q23n710
62341A378541j1348j7273k2726k7954l3184l7445l9625l9997l9592l8606l6588
62330A034203l3831l1284k9109k6510k3212k0174j8446j8089j8502j9169j9798
62319G76079k0288k0900k1944k3011k3103k1887k0291j9272j8489j6883j4297
62308E55714j1704r862q494p087n779m897m115k798j105j9n8n29m55K13Q28J189
62292E01042J749K671L399L443L097K988L288L739M129M255L716K331P51L4M34
62277E41066J099J260J288K095L794N446O218O363O791P980R651J1308J2817J4408
62263F31584J6485J9425K3283K7543L1604L5617M0479M6514N2608N7217N9967
$$ plain form
62252 1042326 1103857 1165847 1226168 1281950 1330912 1371815 1403759 1425932 1438389 1442302 1438803 1427919
62240 1427919 1409156 1382717 1349477 1309947 1264132 1212670 1157540 1101325 1046114 993350 944329
62229 944329 900244 861736 828686 800475 776350 755643 737907 722837 709997 698782 688832 680225
62217 680225 672902 666062 658637 650345 641727 633037 623762 613565 603106 593359 584523 576231 568523 561866
62203 561866 556320 551468 547242 544106 542218 541089 540372 540442 541802 544367 547725 551690 556224 561197 566633
62188 566633 572841 579878 587216 594443 602052 611003 621675 633590 645862 657390 667040 674449 680632
62175 680632 687077 694209 701399 708551 716926 728141 743004 761735 784742 812564 845268 882317
62163 882317 922951 966328 1011354 1056496 1099747 1138786 1171555 1196911 1214655 1224998 1228339 1225593
$$ packed form
62252A042326O1531O1990O0321N5782M8962M0903L1944K2173J2457L913l499j0884
62240A427919j8763k6439l3240l9530m5815n1462n5130n6215n5211n2764m9021
62229I44329m4085l8508l3050k8211k4125k0707j7736j5070j2840j1215r950q607
62217F80225p323o840p425q292q618q690r275j0197j0459r747q836q292p708o657
62203E61866n546m852m226l136j888j129p17P0J360K565L358L965M534M973N436
62188E66633O208P037P338P227P609Q951J0672J1915J2272J1528R650P409O183
62175F80632O445P132P190P152Q375J1215J4863J8731K3007K7822L2704L7049
62163H82317M0634M3377M5026M5142M3251L9039L2769K5356J7744J0343L341k746
$$ plain form
62151 1225593 1218171 1207117 1192394 1173238 1149055 1119865 1086333 1049790 1012011 974543 938290
62140 938290 904045 873138 846953 825781 808601 794178 782062 772403 765161 759814 755680 752254
62128 752254 749230 746394 743589 740809 738416 737188 737944 740976 745971 752654 761355 772622 786257 800957
62114 800957 814985 826914 835619 840039 839704 835656 830344 826128 823842 822760 821556 818992 814110 806518
62100 806518 796772 786205 776171 767473 760409 755078 751570 750021 750579 753244 757822 764116 772017 781170
62086 781170 790715 799807 808421 817315 827122 837831 849186 861180 873978 887712 902623 919091
62074 919091 937273 956933 977794 999770 1022624 1045733 1068635 1091572 1115171 1139763 1165369
62063 1165369 1192123 1220107 1248723 1276605 1302238 1324367 1341902 1353978 1360306 1361148 1356813 1347563
$$ packed form
62151A225593p422j1054j4723j9156k4183k9190l3532l6543l7779l7468l6253
62140I38290l4245l0907k6185k1172j7180j4423j2116r659p242n347m134l426
62128G52254l024k836k805k780k393j228P56L032M995O683Q701J1267J3635J4700
62114H00957J4028J1929Q705M420l35m048n312m216k286j082j204k564m882p592
62100H06518r746j0567j0034q698p064n331l508j549N58K665M578O294P901R153
62086G81170R545R092Q614Q894R807J0709J1355J1994J2798J3734J4911J6468
62074I19091J8182J9660K0861K1976K2854K3109K2902K2937K3599K4592K5606
62063A165369K6754K7984K8616K7882K5633K2129J7535J2076O328Q42m335r250
$$ plain form
62051 1347563 1334140 1317839 1299556 1278889 1254598 1225861 1192847 1156281 1116998 1075964 1034226
62040 1034226 992541 951261 910707 871399 833746 797869 763992 732746 704688 679698 657319
62029 657319 637532 620653 606419 593812 582038 571181 561536 552760 544100 535185 526158 517313 508974
62016 508974 501526 495028 489006 483073 477579 473102 469488 466104 462991 461046 460875 462176 464434 467554
62002 467554 471551 476275 481851 488723 496651 504232 510150 514572 518635 522819 526547 529274 531150 532412
61988 532412 532740 531527 528454 523578 517138 509512 501220 492838 484959 478172 472823 468726 465219 461580
61974 461580 457417 452857 448454 444677 441275 437475 433145 429472 427873 428233 428809 427989 425743 423188 421202
61959 421202 419811 418618 417455 416589 416430 417042 418029 419046 420317 422346 425190 428520 432448 437771 445107
$$ packed form
62051A347563j3423j6301j8283k0667k4291k8737l3014l6566l9283m1034m1738
62040A034226m1685m1280m0554l9308l7653l5877l3877l1246k8058k4990k2379
62029F57319j9787j6879j4234j2607j1774j0857r645q776q660q915r027q845q339
62016E08974p448o498o022n933n494m477l614l384l113j945j71J301K258L120
62002D67554L997M724N576O872P928P581N918M422M063M184L728K727J876J262
61988E32412L28j213l073m876o440p626q292q382p879o787n349m097l507l639
61974D61580m163m560m403l777l402l800m330l673j599L60N76q20k246k555j986
61959D21202j391j193j163q66j59O12R87J017J271K029K844L330L928N323P336
$$ plain form
61944 445107 454250 464743 476673 490409 505764 522002 538640 555776 573549 591677 609601 626722
61932 626722 642390 656105 668051 679136 690103 700620 709566 716156 720387 722362 721619 717604 710620
61919 710620 701823 692236 682237 672253 663453 657193 653844 652763 653456 656311 661958 670353 680840 692809
61905 692809 705877 719582 733282 746296 757750 766379 770992 771343 768248 762727 755332 746366 736263
61892 736263 725350 713563 700945 688299 676807 666896 657889 649008 640354 632582 625843 619459 612648
61879 612648 605170 597125 588405 578776 568484 558410 549357 541345 533914 527018 521184 516767 513524 511287
61865 511287 510567 511954 515154 519341 524470 531523 541208 552981 565786 579309 594128 610984 630335
61852 630335 652314 676589 702399 729178 757003 785989 815472 844255 871585 897272 920826
$$ packed form
61944D45107R143J0493J1930J3736J5355J6238J6638J7136J7773J8128J7924J7121
61932F26722J5668J3715J1946J1085J0967J0517Q946O590M231J975p43m015o984
61919G10620q797r587r999r984q800o260l349j081O93K855N647Q395J0487J1969
61905F92809J3068J3705J3700J3014J1454Q629M613L51l095n521p395q966j0103
61892G36263j0913j1787j2618j2646j1492r911r007q881q654p772o739o384o811
61879F12648p478q045q720r629j0292j0074r053q012p431o896n834m417l243k237
61865E11287p20J387L200M187N129P053R685J1773J2805J3523J4819J6856J9351
61852F30335K1979K4275K5810K6779K7825K8986K9483K8783K7330K5687K3554
$$ plain form
61841 920826 941060 956748 967348 972948 973875 970510 963194 952286 938560 923509 908874 895885
61829 895885 885325 878177 875467 877340 882940 891427 902482 915430 928548 939858 948254 953364 954623
61816 954623 951077 941975 927202 907303 883458 857152 829515 801098 772448 744425 717501 691260
61804 691260 665292 640421 618321 599979 585048 572599 561880 552353 543685 535923 529238 523377
61792 523377 517786 512369 507626 503886 500844 498105 495771 494190 493378 493029 492890 492838 492651 491978 490613 488777
61776 488777 487006 485707 484795 483963 483320 483441 484573 486145 487446 488528 490015 492258 495235 499132 504318
61761 504318 510674 517488 524221 530882 537561 544111 550478 556857 563170 568771 572923 575300 575867 574626
61747 574626 571686 567239 561315 553957 545871 538407 532523 528026 524059 519939 515274 509870 504146 499299
$$ packed form
61841I20826K0234J5688J0600N600R27l365p316j0908j3726j5051j4635j2989
61829H95885j0560p148k710J873N600Q487J1055J2948J3118J1310Q396N110J259
61816I54623l546r102j4773j9899k3845k6306k7637k8417k8650k8023k6924k6241
61804F91260k5968k4871k2100j8342j4931j2449j0719r527q668p762o685n861
61792E23377n591n417m743l740l042k739k334j581q12l49j39n2j87o73j365j836
61776D88777j771j299r12q32o43J21J132J572J301J082J487K243K977L897N186
61761E04318O356O814O733O661O679O550O367O379O313N601M152K377N67j241
61747E74626k940m447n924p358q086p464n884m497l967m120m665n404n724m847
$$ plain form
61733 499299 496369 495184 494719 494387 494468 495297 496591 497788 498722 499767 501442 503923 506787 509257 510914 512090
61717 512090 513470 515422 517868 520610 523381 525712 527166 527721 527595 526694 524620 521303 517264 513071 508873
61702 508873 504658 500677 497324 494730 492742 491209 490039 489007 487765 486148 484317 482486 480603 478410
61688 478410 475850 473251 470993 469016 466844 464108 460936 457716 454619 451490 448128 444479 440614 436707
61674 436707 433044 429888 427284 425195 423812 423452 423989 424574 424224 422621 420159 417343 414527 412198 411015
61659 411015 411183 412085 412922 413622 414679 416160 417440 418107 418679 419973 422052 424231 426030 427628 429389 431335
61643 431335 433282 435191 437206 439483 442107 445026 447947 450423 452154 453144 453534 453335 452346 450292 447081
61628 447081 443057 438939 435353 432377 429637 426758 423653 420546 417983 416644 416701 417307 417144 415663 413517
$$ packed form
61733D99299k930j185m65l32Q1Q29J294J197R34J045J675K481K864K470J657J176
61717E12090J380J952K446K742K771K331J454N55j26r01k074l317m039m193m198
61702E08873m215l981l353k594j988j533j170j032j242j617j831j831j883k193
61688D78410k560k599k258j977k172k736l172l220l097l129l362l649l865l907
61674D36707l663l156k604k089j383l60N37N85l50j603k462k816k816k329j183
61659D11015J68R02Q37P00J057J481J280O67N72J294K079K179J799J598J761J946
61643D31335J947J909K015K277K624K919K921K476J731R90L90j99r89k054l211
61628D47081m024m118l586k976k740k879l105l107k563j339N7O06j63j481k146
$$ plain form
61613 413517 411675 410418 409332 407850 405501 401924 397063 391327 385302 379314 373405 367608 362050 356889
61599 356889 352284 348341 344937 341735 338482 335193 331943 328686 325446 322485 320056 318118 316516 315203
61585 315203 314070 312780 311171 309716 309114 309444 310132 310768 311453 312079 311772 309629 305911 302010 299147 297420
61569 297420 296272 295436 295021 294917 294738 294475 294692 295751 297139 298002 298122 297999 298130 298645 299580 300953 302555
61552 302555 304113 305769 307886 310304 312321 313696 315101 317170 319511 321167 321765 321766 321778 322128 322945 324174
61536 324174 325533 326866 328455 330589 332865 334370 334615 333947 332989 331994 330847 329356 327367 324807 321801
61521 321801 318683 315877 313742 312403 311594 310807 309861 309213 309471 310633 312110 313421 314525 315436 315879 315497
61505 315497 314223 312371 310491 309086 308243 307535 306570 305642 305582 306846 309047 311500 314019 316953 320567 324515
$$ packed form
61613D13517j842j257j086j482k349l577m861n736o025n988n909n797n558n161
61599C56889m605l943l404l202l253l289l250l257l240k961k429j938j602j313
61585C15203j133j290j609j455o02L30O88O36O85O26l07k143l718l901k863j727
61569B97420j148q36m15j04j79k63K17J059J388Q63J20j23J31N15R35J373J602
61552C02555J558J656K117K418K017J375J405K069K341J656N98JJ2L50Q17J229
61536C24174J359J333J589K134K276J505K45o68r58r95j147j491j989k560l006
61521C21801l118k806k135j339q09p87r46o48K58J162J477J311J104R11M43l82
61505C15497j274j852j880j405q43p08r65r28o0J264K201K453K519K934L614L948
$$ plain form
61489 324515 327941 330123 331149 331894 333149 334810 336142 336796 337167 337694 338265 338599 338862 339429 340153 340360 339669
61472 339669 338502 337598 337307 337520 338086 338936 339820 340328 340340 340214 340279 340263 339590 338205 336782 336063 336208 336901 337749
61453 337749 338448 338844 339106 339655 340636 341582 341840 341290 340453 339984 340200 341014 342150 343491 345284 347864 351086
61436 351086 354302 357141 360014 363565 367750 371826 375103 377428 379110 380648 382452 384507 386398 387896
61422 387896 389283 390813 392217 393238 394389 396459 399344 402063 404000 405405 406515 406881 406044 404331 402504
61407 402504 400878 399182 397119 394701 392203 390010 388388 387214 386067 384770 383629 382990 382687 382143 380929
61392 380929 379133 377293 375985 375386 375238 375341 375866 376893 377874 378153 378006 378481 380078 382208 384235 386394
61376 386394 389222 392595 395895 398778 401273 403495 405774 408721 412503 416270 418959 420566 421965 423522
$$ packed form
61489C24515L426K182J026P45J255J661J332O54L71N27N71L34K63N67P24K07o91
61472C39669j167r04k91K13N66Q50Q84N08J2j26O5j6o73j385j423p19J45O93Q48
61453C37749O99L96K62N49R81R46K58n50q37m69K16Q14J136J341J793K580L222
61436C51086L216K839K873L551M185M076L277K325J682J538J804K055J891J498
61422C87896J387J530J404J021J151K070K885K719J937J405J110L66q37j713j827
61407D02504j626j696k063k418k498k193j622j174j147j297j141o39l03n44j214
61392C80929j796j840j308n99j48J03N25J027R81K79j47M75J597K130K027K159
61376C86394K828L373L300K883K495K222K279K947L782L767K689J607J399J557
$$ plain form
61362 423522 424670 424998 425050 425706 427285 429744 433272 438090 443746 449292 454386 459864 466800 475039 483053
61347 483053 489421 494196 498455 502706 506323 508649 510078 511620 513801 516494 519583 523116 526789 529814
61333 529814 531563 532022 531535 530352 528576 526254 523393 520057 516587 513533 511302 509982 509578 510143 511624
61318 511624 513791 516489 519804 523860 528652 534187 540630 548099 556470 565589 575557 586612 598812 612042
61304 612042 626207 641034 655523 667932 676684 681381 682875 682389 680686 677969 674178 669135 662575
61291 662575 654371 644832 634613 624274 614024 603895 593977 584443 575505 567448 560527 554694 549615
61278 549615 545132 541556 539373 538775 539687 542002 545440 549265 552622 555279 557695 560207 562526 564344 566204
61263 566204 569366 574850 582870 593064 604819 617216 629117 639661 648542 655648 660684 663557 664989
$$ packed form
61362D23522J148L28N2O56J579K459L528M818N656N546N094N478O936Q239Q014
61347D83053O368M775M259M251L617K326J429J542K181K693L089L533L673L025
61333E29814J749M59m87j183j776k322k861l336l470l054k231j320m04N65J481
61318E11624K167K698L315M056M792N535O443P469Q371R119R968J1055J2200J3230
61304F12042J4165J4827J4489J2409Q752M697J494m86j703k717l791n043o560
61291F62575q204r539j0219j0339j0250j0129r918r534q938q057o921n833n079
61278E49615m483l576k183n98R12K315L438L825L357K657K416K512K319J818J860
61263E66204L162N484Q020J0194J1755J2397J1901J0544Q881P106N036K873J432
$$ plain form
61250 664989 666196 667765 669137 669431 668500 666960 665438 664106 662785 661165 659002 656413 653986 652253 651038
61235 651038 649586 647384 644600 641697 638946 636502 634682 633902 634393 636093 638708 641843 645179 648607 652090
61220 652090 655516 658937 662893 668081 674522 681482 688441 695758 703926 712366 719469 723924 725736 725964
61206 725964 725774 725845 726385 727471 729357 732535 737462 744213 752477 762000 773032 786301 802304 820518
61192 820518 839334 856943 872210 884635 893771 899253 901424 901418 900332 898591 896287 893654 890750 886985
61178 886985 881516 874093 865117 854939 843565 831097 818094 805266 792970 781099 769318 757310
61166 757310 744912 732099 718849 705164 691283 677755 665096 653483 642995 633943 626670 621095
61154 621095 616861 613996 613069 614452 617640 621533 625282 628693 631765 633961 634020 630713 623967 615216 606405
$$ packed form
61250F64989J207J569J372K94r31j540j522j332j321j620k163k589k427j733j215
61235F51038j452k202k784k903k751k444j820p80M91J700K615L135L336L428L483
61220F52090L426L421L956N188O441O960O959P317Q168Q440P103M455J812K28
61206G25964j90P1N40J086J886L178M927O751Q264R523J1032J3269J6003J8214
61192H20518J8816J7609J5267J2425R136N482K171oj086j741k304k633k904l765
61178H86985n469p423q976j0178j1374j2468j3003j2828j2296j1871j1781j2008
61166G57310j2398j2813j3250j3685j3881j3528j2659j1613j0488r052p273n575
61154F21095m234k865r27J383L188L893L749L411L072K196N9l307o746q751q811
$$ plain form
61139 606405 598580 591554 584919 579028 574774 572626 572237 573013 574792 577812 582228 587861 594396 601695 609921
61124 609921 619485 630821 644053 658844 674688 691384 709108 728098 748581 770961 795552 821818
61112 821818 848292 873679 897806 921132 943689 965062 985041 1003501 1019743 1032795 1042418 1049006
61100 1049006 1052359 1051447 1045755 1036062 1023442 1008206 990378 970494 949270 926942 903596 879702
61088 879702 855728 831717 807873 785052 763888 743916 724427 705823 689122 674360 660591
61077 660591 647478 635837 626404 618964 612987 608296 604722 601772 599159 597218 596423 596800 598025 599802
61063 599802 601957 604496 607688 611878 617114 623229 630178 637988 646500 655598 665554 676738 689106 702455
61049 702455 716947 732807 749791 767710 787194 809023 832839 857547 883007 910170 939384
$$ packed form
61139F06405p825p026o635n891m254k148l89P76J779L020M416N633O535P299Q226
61124F09921R564J1336J3232J4791J5844J6696J7724J8990K0483K2380K4591K6266
61112H21818K6474K5387K4127K3326K2557K1373J9979J8460J6242J3052R623O588
61100A049006L353r12n692r693j2620j5236j7828j9884k1224k2328k3346k3894
61088H79702k3974k4011k3844k2821k1164j9972j9489j8604j6701j4762j3769
61077F60591j3113j1641r433p440n977m691l574k950k613j941p95L77J225J777
61063E99802K155K539L192M190N236O115O949P810Q512R098R956J1184J2368J3349
61049G02455J4492J5860J6984J7919J9484K1829K3816K4708K5460K7163K9214
$$ plain form
61038 939384 969767 1000635 1032328 1065061 1098084 1130853 1164169 1199303 1236686 1276305 1318733
61027 1318733 1364720 1413917 1464726 1515306 1564558 1612684 1661326 1712861 1769289 1832258 1904106
61016 1904106 1987701 2084632 2194475 2316464 2451313 2601418 2771081 2967638 3201200 3482343
61006 3482343 3821407 4230927 4726830 5326254 6047632 6916635 7970816 9256656 10826011
60997 10826011 12735551 15026355 17658267 20429718 22973254 24884343 25918439 26109193
60989 26109193 25724467 25121765 24626072 24474304 24773225 25434796 26149540 26482730 26073366
60980 26073366 24802111 22811706 20392475 17841491 15382117 13149378 11204358 9554291
60972 9554291 8174953 7031235 6088257 5313480 4677232 4154606 3725701 3373368 3081710
$$ packed form
61038I39384L0383L0868L1693L2733L3023L2769L3316L5134L7383L9619M2428
61027A318733M5987M9197N0809N0580M9252M8126M8642N1535N6428O2969P1848
61016A904106Q3595R6931J09843J21989J34849J50105J69663J96557K33562K81143
61006C482343L39064M09520M95903N99424P21378Q69003J054181J285840J569355
60997A0826011J909540K290804K631912K771451K543536J911089J034096J90754
60989B6109193l84726o02702m95693j51768K98921O61571P14744L33190m09364
60980B6073366j271255j990405k419231k550984k459374k232739j945020j650067
60972I554291j379338j143718r42978p74777o36248n22626m28905l52333k91658
$$ plain form
60963 3081710 2836756 2627344 2445038 2283938 2140526 2012791 1899215 1798619 1710227 1633073
60953 1633073 1565768 1507521 1458635 1418877 1385782 1355737 1326458 1297386 1268233 1238763 1210013
60942 1210013 1184058 1161915 1142746 1125533 1110444 1097959 1087634 1078581 1070549 1063851 1058695 1055159
60930 1055159 1053439 1053582 1055322 1058557 1063569 1070320 1077886 1085173 1091956 1098773 1105882 1112748 1118448 1122335
60916 1122335 1124324 1124713 1123651 1120761 1115493 1107840 1098296 1087099 1074040 1059245 1043593 1027903 1012059
60903 1012059 995413 977750 959510 941342 923902 907769 892959 878647 863820 848246 832477
60892 832477 817090 802322 788295 775112 762734 751189 740849 732000 724098 715952 706840 697079
60880 697079 687337 677750 667959 657746 647345 637232 627790 619123 611112 603684 596949 590887 585019
$$ packed form
60963C081710k44954k09412j82306j61100j43412j27735j13576j00596q8392p7154
60953A633073o7305n8247m8886l9758l3095l0045k9279k9072k9153k9470k8750
60942A210013k5955k2143j9169j7213j5089j2485j0325r053q032o698n156l536
60930A055159j720J43J740L235N012O751P566P287O783O817P109O866N700L887
60916A122335J989L89j062k890n268p653r544j1197j3059j4795j5652j5690j5844
60903A012059j6646j7663j8240j8168j7440j6133j4810j4312j4827j5574j5769
60892H32477j5387j4768j4027j3183j2378j1545j0340q849p902q146r112r761
60880F97079r742r587r791j0213j0401j0113r442q667q011p428o735o062n868
$$ plain form
60867 585019 578776 572293 566484 562097 558923 556148 553289 550503 548092 546027 543994 541711 539019 535705
60853 535705 531428 526072 520242 515191 511901 510206 509052 507597 505760 503695 501150 497697 493314 488321
60839 488321 482818 476544 469379 461766 454496 448156 442844 438336 434489 431463 429493 428487 428047 427958 428497
60824 428497 430034 432465 435231 437875 440348 442686 444651 445881 446354 446543 447059 448159 449585 450819 451415
60809 451415 451165 450163 448880 448013 447982 448538 449024 449064 448749 448134 446917 444827 442058 439014 435833 432504 429283
60792 429283 426497 423909 420705 416422 411630 407442 404424 402206 400059 397567 394659 391203 386934 381885
60778 381885 376728 372416 369421 367434 365806 364141 362413 360757 359307 358145 357281 356782 356969 358322 360995
60763 360995 364569 368354 371781 374455 376248 377664 379778 383319 387903 392485 396394 399531 401907 403661
$$ packed form
60867E85019o243o483n809m387l174k775k859k786k411k065k033k283k692l314
60853E35705m277n356n830n051l290j695j154j455j837k065k545l453m383m993
60839D88321n503o274p165p613p270o340n312m508l847l026j970j006m40q9N39
60824D28497J537K431K766K644K473K338J965J230M73J89N16J100J426J234N96
60809D51415k50j002j283q67l1N56M86M0l15o15j217k090k769l044l181l329l221
60792D29283k786k588l204m283m792m188l018k218k147k492k908l456m269n049
60778C81885n157m312k995j987j628j665j728j656j450j162q64m99J87J353K673
60763C60995L574L785L427K674J793J416K114L541M584M582L909L137K376J754
$$ plain form
60749 403661 405485 408215 411797 415221 417796 419930 422363 425134 427618 429043 428529 425173 418892 411003
60735 411003 403378 396944 391364 385914 380226 374283 368354 363030 358830 355595 352576 349241 345684 342169
60721 342169 338680 335196 332156 330318 330117 331236 332722 333515 333082 331771 330488 329886 329788 329435 328343 326907
60705 326907 326055 326208 326732 326648 325834 325068 324873 324828 324431 324158 324987 327067 329507 331529 333234 335075 337148
60688 337148 339297 341507 343843 346272 348846 351848 355499 359723 364420 369714 375648 381837 387775 393343
60674 393343 398708 403858 408621 413075 417481 421709 425128 427197 427850 427130 424838 420915 415923 410760 405948
60659 405948 401583 397899 395276 393515 391620 388799 385421 382534 380590 379178 377970 377315 377671 378926 380587
60644 380587 382308 383864 384861 384809 383359 380301 375621 369886 364287 359786 356326 353256 350375 348110 346740
$$ packed form
60749D03661J824K730L582L424K575K134K433K771K484J425n14l356o281p889
60735D11003p625o434n580n450n688n943n929n324m200l235l019l335l557l515
60721C42169l489l484l040j838k01J119J486P93m33j311j283o02r8l53j092j436
60705C26907q52J53N24q4q14p66j95m5l97k73Q29K080K440K022J705J841K073
60688C37148K149K210K336K429K574L002L651M224M697N294N934O189N938N568
60674C93343N365N150M763M454M406M228L419K069O53p20k292l923m992n163m812
60659D05948m365l684k623j761j895k821l378k887j944j412j208o55L56J255J661
60644C80587J721J556R97n2j450l058m680n735n599m501l460l070k881k265j370
$$ plain form
60629 346740 346028 345688 345733 346211 347036 348180 349623 350928 351387 350951 350601 351308 352817 353960 354119 353927 354421
60612 354421 355867 357629 358973 359713 360055 360134 359898 359382 358835 358470 358279 358194 358274 358635 359364 360568 362243 363937
60594 363937 364958 365234 365606 366772 368299 369307 369891 371035 373154 375549 377401 378515 378916 378596 378068 378329
60578 378329 379672 381235 382267 383208 384848 387136 389667 392844 397443 403329 409649 416286 424100 433616
60564 433616 444351 455654 467354 479145 490031 498886 505163 508739 509582 507964 504660 500445 495558
60551 495558 489939 483836 477955 473189 470340 469899 471880 475956 481760 488938 497100 506155 516726 529694
60537 529694 545236 562731 581669 601969 623069 643331 660925 674954 685176 691032 691693 687088
60525 687088 678330 667042 654624 642113 630238 619376 609670 601304 594484 589146 584923 581492 578800
$$ packed form
60629C46740p12l40M5M78Q25J144J443J305M59m36l50P07J509J143J59j92M94
60612C54421J446J762J344P40L42P9k36n16n47l65j91q5Q0L61P29J204J675J694
60594C63937J021K76L72J166J527J008N84J144K119K395J852J114M01l20n28K61
60578C78329J343J563J032R41J640K288K531L177M599N886O320O637P814R516
60564D33616J0735J1303J1700J1791J0886Q855O277L576Q43j618l304m215m887
60551D95558n619o103n881m766k849m41J981M076N804P178Q162R055J0571J2968
60537E29694J5542J7495J8938K0300K1100K0262J7594J4029J0222N856O61m605
60525F87088q758j1288j2418j2511j1875j0862r706q366o820n338m223l431k692
$$ plain form
60512 578800 576918 575815 575343 575382 576018 577623 580717 585614 592337 600901 611567 624744 640923 660904
60498 660904 685741 716020 751264 790471 833183 879570 929365 981087 1032461 1081321 1126013
60487 1126013 1165318 1198351 1224354 1242285 1250565 1247506 1232172 1204961 1167490 1121963 1070572 1015412
60475 1015412 958698 902711 849249 799310 753578 713031 678538 649779 625097 602784 582251
60464 582251 563707 547046 531653 517224 504172 492939 483209 474124 465190 456725 449427 443650 439152
60451 439152 435415 432095 429168 426746 424814 423120 421271 418961 416208 413423 411222 410007 409674 409699 409584
60436 409584 409271 409094 409291 409574 409298 408175 406766 406114 406737 407948 408260 406654 403600 400769 399546 399743
60420 399743 399955 399169 397844 397238 397976 399621 401498 403418 405462 407465 409127 410496 411963 413694 415320
$$ packed form
60512E78800j882j103m72L9O36J605L094M897O723Q564J0666J3177J6179J9981
60498F60904K4837L0279L5244L9207M2712M6387M9795N1722N1374M8860M4692
60487A126013L9305L3033K6003J7931Q280l059j5334k7211l7471m5527n1391n5160
60475A015412n6714n5987n3462m9939m5732m0547l4493k8759k4682k2313k0533
60464E82251j8544j6661j5393j4429j3052j1233r730r085q934q465p298n777m498
60451D39152l737l320k927k422j932j694j849k310k753k785k201j215l33K5j15
60436D09584l13j77J97K83k76j123j409o52O23J211L12j606l054k831j223J97
60420C99743K12p86j325o06P38J645J877J920K044K003J662J369J467J731J626
$$ plain form
60405 415320 416348 416767 417046 417535 418047 418246 418288 418826 420273 422360 424620 427081 430175 434052 438326 442474
60389 442474 446225 449573 452728 456066 459793 463543 466609 468705 470257 471882 473929 476563 479806 483217
60375 483217 486016 487924 489498 491191 492544 492938 492812 493278 494534 495524 495386 494469 493529 492608 491359 490049
60359 490049 489487 490012 491122 492208 493288 494894 497520 501338 506276 512205 519009 526488 534223 541614 548133
60344 548133 553479 557511 560150 561385 561198 559445 556046 551436 546535 542040 537858 533479 528711 523758
60330 523758 518780 513841 509259 505491 502505 499583 496055 492000 488037 484568 481485 478510 475550 472693
60316 472693 470119 468171 467329 467933 469895 472845 476597 481377 487542 495238 504456 515303 527937 542311
60302 542311 558185 575333 593314 611003 626780 639452 648582 653655 653488 647206 635617 620958
$$ packed form
60405D15320J028M19K79M89N12J99M2N38J447K087K260K461L094L877M274M148
60389D42474L751L348L155L338L727L750L066K096J552J625K047K634L243L411
60375D83217K799J908J574J693J353L94j26M66J256R90j38r17r40r21j249j310
60359D90049n62N25J110J086J080J606K626L818M938N929O804P479P735P391O519
60344E48133N346M032K639J235j87j753l399m610m901m495m182m379m768m953
60330E23758m978m939m582l768k986k922l528m055l963l469l083k975k960k857
60316D72693k574j948q42O04J962K950L752M780O165P696R218J0847J2634J4374
60302E42311J5874J7148J7981J7689J5777J2672R130N073j67o282j1589j4659
$$ plain form
60290 620958 605216 589297 573785 559662 547804 538287 530617 524330 518972 513902 508655 503389 498523
60277 498523 494064 489670 485182 480672 476073 471297 466706 462889 459793 456556 452518 448096 444332 441750
60263 441750 439942 438188 436272 434660 433979 434318 434995 435142 434583 434002 434197 435272 436665 437836 438728 439588
60247 439588 440456 440960 440641 439513 438206 437432 437345 437548 437718 437993 438703 439922 441461 443115 444788 446474 448240
60230 448240 450172 452246 454383 456712 459607 463308 467569 471886 475992 479991 484115 488493 493163 498147
60216 498147 503519 509461 516160 523487 530987 538423 546161 554668 563606 571916 579001 585523 592648 600613
60202 600613 608392 614825 619811 624177 628502 632408 635194 636943 638571 640631 642389 642426 640077 635999 631396
60187 631396 627062 623220 619850 616836 613853 610325 605693 599877 593627 588288 584840 583132 582194 581213 579885
$$ packed form
60290F20958j5742j5919j5512j4123j1858r517p670o287n358n070n247n266m866
60277D98523m459m394m488m510m599m776m591l817l096l237m038m422l764k582
60263D41750j808j754j916j612o81L39O77J47n59n81J95J075J393J171Q92Q60
60247D39588Q68N04l19j128j307p74q7K03J70K75P10J219J539J654J673J686J766
60230D48240J932K074K137K329K895L701M261M317M106L999M124M378M670M984
60216D98147N372N942O699P327P500P436P738Q507Q938Q310P085O522P125P965
60202F00613P779O433M986M366M325L906K786J749J628K060J758L7k349m078m603
60187F31396m334l842l370l014k983l528m632n816o250n339l448j708r38r81j328
$$ plain form
60172 579885 577981 575245 572009 569343 568063 567814 567521 566518 564881 562882 560644 558306 556096 554157 552555
60157 552555 551335 550359 549246 547903 546977 547312 548935 551070 553161 555384 558041 560995 563963 566891 569729
60142 569729 572227 574388 576830 580228 584474 588741 592391 595585 599042 603423 608934 615318 622093 628769
60128 628769 634878 639928 643638 646203 648128 649731 651049 652198 653463 654952 656528 658237 660407 663063
60114 663063 665622 667483 668559 668923 668340 666687 664498 662475 660599 658276 655363 652416 649816 647106 643497
60099 643497 638859 634099 630636 629340 629698 630188 629784 628898 628513 628790 629221 629875 631449 633926 636160 637301
60083 637301 637863 638800 640149 641218 641539 640817 638369 633650 627299 620788 614841 608874 602118 594639 586940
60068 586940 579243 571597 564261 557438 550925 544473 538266 532620 527464 522610 518342 515086 512480 509503
$$ packed form
60172E79885j904k736l236k666j280k49k93j003j637j999k238k338k210j939j602
60157E52555j220r76j113j343r26L35J623K135K091K223K657K954K968K928K838
60142E69729K498K161K442L398M246M267L650L194L457M381N511O384O775O676
60128F28769O109N050L710K565J925J603J318J149J265J489J576J709K170K656
60114F63063K559J861J076L64n83j653k189k023j876k323k913k947k600k710l609
60099F43497m638m760l463j296L58M90m04q86l85K77M31O54J574K477K234J141
60083F37301N62R37J349J069L21p22k448m719o351o511n947n967o756p479p699
60068E86940p697p646p336o823o513o452o207n646n156m854m268l256k606k977
$$ plain form
60054 509503 505803 502366 500436 500187 500909 502139 503977 506480 509434 512839 517090 522448 528746 535717 543122
60039 543122 550362 556522 561232 565113 568877 572266 574396 574833 573758 571219 566949 561046 554244 547244
60025 547244 540205 533031 525809 518717 511874 505542 500189 496079 492939 490271 487828 485643 483746 482034
60011 482034 480315 478319 475787 472668 469217 465888 463221 461684 461266 461247 460767 459705 458634 457801 456707
59996 456707 454980 453191 452343 452818 454309 456505 459343 462747 466662 471343 477060 483410 489370 494213 498040
59981 498040 501256 503837 505392 505701 504909 503248 500833 497749 494224 490614 487196 483989 480840 477726 474905
59966 474905 472706 471260 470569 470728 471855 473791 476060 478208 480071 481669 482984 483990 484781 485497 486066
59951 486066 486155 485566 484661 484236 484796 485999 486979 487218 487001 487010 487691 489039 490781 492491 493588 493528 492197 490107
$$ packed form
60054E09503l700l437j930k49P22J230J838K503K954L405M251N358O298O971P405
60039E43122P240O160M710L881L764L389K130M37j075k539m270n903o802p000
60025E47244p039p174p222p092o843o332n353m110l140k668k443k185j897j712
60011D82034j719j996k532l119l451l329k667j537m18j9m80j062j071q33j094
59996D56707j727j789q48M75J491K196K838L404L915M681N717O350N960M843L827
59981D98040L216K581J555L09p92j661k415l084l525l610l418l207l149l114k821
59966D74905k199j446o91J59J127J936K269K148J863J598J315J006P91P16N69
59951D86066Q9n89r05m25N60J203R80K39k17RO81J348J742J710J097o0j331k090
$$ plain form
59933 490107 488045 486516 485580 485351 486440 489565 494628 500520 506120 511257 516468 522159 528456 535554 543485
59918 543485 551566 558851 565368 572294 580563 589811 598999 607463 614855 620562 623970 625202 625065 624302 623181
59903 623181 621576 618977 614656 608368 600891 593469 586812 581060 576494 573610 572448 572435 573109 574527 576777
59888 576777 579525 582380 585456 589236 593940 599214 604485 609591 615051 621571 629232 637316 645074 652387
59874 652387 659430 665922 671119 674423 675704 675174 673337 670850 667959 664270 659586 654740 650854 647782
59860 647782 644127 638983 632930 627009 621431 615889 610575 606239 603464 602357 602809 604705 608049 613178
59846 613178 620619 630281 640869 650398 657242 660607 660464 657620 653796 651101 651038 653821 658352 662655 664707
59831 664707 663449 659222 653199 646451 639578 632859 626283 619525 612289 604815 597895 592359 588634 586595
$$ packed form
59933D90107k062j529r36k29J089L125N063N892N600N137N211N691O297P098P931
59918E43485Q081P285O517O926Q269R248R188Q464P392N707L408J232j37p63j121
59903F23181j605k599m321o288p477p422o657n752m566k884j162j3O74J418K250
59888E76777K748K855L076L780M704N274N271N106N460O520P661Q084P758P313
59874F52387P043O492N197L304J281n30j837k487k891l689m684m846l886l072
59860F47782l655n144o053n921n578n542n314m336k775j107M52J896L344N129
59846F13178P441R662J0588R529O844L365j43k844l824k695o3K783M531M303K052
59831F64707j258m227o023o748o873o719o576o758p236p474o920n536l725k039
$$ plain form
59817 586595 585581 584724 583662 582983 583569 585389 587199 587586 586101 583228 579534 575234 570519 565905 561949
59802 561949 558702 555716 552624 549492 546483 543447 540174 536967 534512 533108 532362 531784 531326 531053 530666
59787 530666 529764 528439 527137 526045 525052 524351 524494 525596 526904 527578 527674 527979 529016 530631 532536 534731
59771 534731 537228 539745 541997 544068 546143 548087 549643 550998 552692 554969 557598 560475 563929 568176
59757 568176 572795 577074 580739 584092 587653 591944 597373 603865 610657 616761 621733 625858 629662 633475
59743 633475 637341 641081 644419 647183 649336 650800 651511 651797 652285 653149 653913 654385 655252 657039 658905 659520
59727 659520 658933 658475 658704 658642 657525 656188 655847 656265 656156 655039 653745 653142 653153 653127 652577 651373 649741 648376
59709 648376 648264 650050 653530 657870 662355 666923 671953 677559 683337 688975 694785 701171 707698 713354
$$ packed form
59817E86595j014q57j062o79N86J820J810L87j485k873l694m300m715m614l956
59802E61949l247k986l092l132l009l036l273l207k455j404p46n78m58k73l87
59787E30666r02j325j302j092r93p01J43J102J308O74R6L05J037J615J905K195
59771E34731K497K517K252K071K075J944J556J355J694K277K629K877L454M247
59757E68176M619M279L665L353L561M291N429O492O792O104M972M125L804L813
59743F33475L866L740L338K764K153J464P11K86M88Q64P64M72Q67J787J866O15
59727F59520n87m58K29o2j117j337l41M18j09j117j294o03J1k6n50j204j632j365
59709F48376j12J786L480M340M485M568N030N606N778N638N810O386O527N656
$$ plain form
59695 713354 717794 721727 725838 729931 733434 736153 738078 738972 738768 737998 737264 736511 735372 733979 732840
59680 732840 731973 730669 728056 723556 716974 708645 699518 690644 682511 675067 668228 662054 656612 651975
59666 651975 648241 645195 642235 639113 636565 635710 636895 639603 643340 647980 653234 658453 663256 667903
59652 667903 672764 677700 682217 686030 689224 691911 693790 694092 692041 687441 680691 672228 662310 651506
59638 651506 640871 631135 622113 613449 605632 599548 595202 591659 588245 585041 582020 578551 574166 569193
59624 569193 564094 558586 552010 544424 536856 530386 525219 520680 515996 510972 505951 501203 496651 492312
59610 492312 488682 486352 485456 485830 487474 490336 493763 496775 498920 500416 501445 501921 502026 502316 502992 503545
59594 503545 503437 502745 501886 501101 500523 500378 500739 501305 501697 501755 501358 500289 498561 496640 495014 493703 492401
$$ packed form
59695G13354M440L933M111M093L503K719J925Q94k04p70p34p53j139j393j139
59680G32840q67j304k613m500o582q329r127q874q133p444o839o174n442m637
59666F51975l734l046k960l122k548q55J185K708L737M640N254N219M803M647
59652F67903M861M936M517L813L194K687J879L02k051m600o750q463r918j0804
59638F51506j0635r736r022q664p817o084m346l543l414l204l021l469m385m973
59624E69193n099n508o576p586p568o470n167m539m684n024n021m748m552m339
59610D92312l630k330q96L74J644K862L427L012K145J496J029M76J05K90O76N53
59594E03545j08o92q59p85n78j45L61N66L92N8l97j069j728j921j626j311j302
$$ plain form
59577 492401 490874 488989 486535 483352 479563 475518 471567 467988 464998 462728 461221 460412 459926 459116 457728
59562 457728 456465 456331 457248 457931 457447 456387 456036 456801 458034 459120 460145 461521 463486 466039 469029 472266
59546 472266 475812 480174 485947 493219 501590 510804 521206 533558 548664 567133 589025 613026 635734
59533 635734 652300 658835 655021 644405 631816 620384 611025 604034 600094 599552 601679 605284 609659
59520 609659 614366 618484 620829 620903 619148 616166 612075 606636 599712 591483 582386 573013 563873 555167 546746
59505 546746 538324 529874 521911 515332 510679 507530 504845 502037 499393 497444 496270 495640 495515 496040 497232
59490 497232 498939 501025 503358 505767 508195 510781 513599 516443 519060 521483 524021 527015 530620 534603
59476 534603 538286 541047 543042 545126 547819 550611 552572 553346 553207 552390 550805 548377 545401 542522 540510
$$ packed form
59577D92401j527j885k454l183l789m045l951l579k990k270j507q09m86q10j388
59562D57728j263j34R17O83m84j060l51P65J233J086J025J376J965K553K990L237
59546D72266L546M362N773P272Q371R214J0402J2352J5106J8469K1892K4001K2708
59533F35734J6566O535l814j0616j2589j1432r359o991l940n42K127L605M375
59520F09659M707M118K345P4j755k982m091n439o924q229r097r373r140q706q421
59505E46746q422q450p963o579m653l149k685k808k644j949j174o30j25N25J192
59490D97232J707K086K333K409K428K586K818K844K617K423K538K994L605L983
59476E34603L683K761J995K084K693K792J961P74j39q17j585k428k976k879k012
$$ plain form
59461 540510 539876 540590 542340 545109 549241 554894 561837 569900 579008 588533 597333 605013 612558 620934 629517
59446 629517 636761 642083 646017 648553 648450 644605 637407 628378 619020 610275 602524 595663 589446 583904
59432 583904 579116 574625 569736 564639 560596 558625 558532 559650 561983 566079 572214 580341 590571 603036
59418 603036 617455 633419 651030 670717 692631 716924 744397 775460 807648 834881 850367
59407 850367 850742 837569 815659 790692 767810 750694 740889 738294 742594 753504 768844 783043
59395 783043 789077 782709 764815 739792 712339 685647 661387 640241 622424 608161 597655 590542
59383 590542 585833 582831 581719 582775 585353 588239 590854 593522 596658 600322 604465 608981 613466 617578
59369 617578 621803 627201 634114 641638 648683 655117 661520 668294 675463 683012 690985 699377 708263 717776
$$ packed form
59461E40510o34P14J750K769M132N653O943Q063R108R525Q800P680P545Q376Q583
59446F29517P244N322L934K536j03l845p198r029r358q745p751o861o217n542
59432E83904m788m491m889n097m043j971r3J118K333M096O135Q127J0230J2465
59418F03036J4419J5964J7611J9687K1914K4293K7473L1063L2188K7233J5486
59407H50367L75j3173k1910k4967k2882j7116r805k595M300J0910J5340J4199
59395G83043O034o368j7894k5023k7453k6692k4260k1146j7817j4263j0506p113
59383E90542m709l002j112J056K578K886K615K668L136L664M143M516M485M112
59369F17578M225N398O913P524P045O434O403O774P169P549P973Q392Q886R513
$$ plain form
59355 717776 727675 737201 745868 754210 763319 773732 785142 797151 809770 823125 837093 851463
59343 851463 866149 881004 895591 909305 921634 932213 940740 946894 950269 950449 947378 941682 934233
59330 934233 925250 914105 900405 885011 869614 855278 841805 828546 815470 803143 792008 782035
59318 782035 773012 764896 757809 751858 746947 742693 738631 734634 731059 728303 726338 724900 724027 724067 725139
59303 725139 726989 729485 732962 737966 744998 754736 767986 784664 802515 817182 824037 820519 807249
59290 807249 787273 764169 740549 717909 697386 680072 666503 656157 647866 640757 634803 630672
59278 630672 629189 630686 634635 639943 645838 652425 660360 670069 681349 693511 705739 717468 728564
59265 728564 739067 748755 757191 764169 769706 773434 774538 772659 768453 762809 755898 747541 738119 728368
$$ packed form
59355G17776R899R526Q667Q342R109J0413J1410J2009J2619J3355J3968J4370
59343H51463J4686J4855J4587J3714J2329J0579Q527O154L375J80l071n696p449
59330I34233q983j1145j3700j5394j5397j4336j3473j3259j3076j2327j1135r973
59318G82035r023q116p087n951m911m254m062l997l575k756j965j438q73M0J072
59303G25139J850K496L477N004P032R738J3250J6678J7851J4667O855l518j3270
59290H07249j9976k3104k3620k2640k0523j7314j3569j0346q291p109n954m131
59278F30672j483J497L949N308N895O587P935R709J1280J2162J2228J1729J1096
59265G28564J0503R688Q436O978N537L728J104j879m206n644o911q357r422r751
$$ plain form
59251 728368 718417 707934 697274 687687 680027 673921 668611 664097 660925 659203 658399 658006 657992 658626 660155
59236 660155 662676 666060 670007 674196 678318 681950 684683 686580 688247 690143 691867 692393 691006 687797
59222 687797 683321 678105 672628 667552 663673 661472 660685 660407 659740 658486 657155 656271 655750 655104 654172 653374
59206 653374 653073 652908 652097 650463 648843 648268 648862 649778 650173 649998 649822 650135 650888 651579 651714 651327 651059 651575
59188 651575 652930 654696 656594 658646 660751 662653 664508 666963 670326 674036 677290 679895 682171 684390
59174 684390 686734 689484 692705 696011 699231 703141 708903 716766 725825 735034 743940 752454 760483 767928
59160 767928 774565 779875 783448 785606 787054 787761 786756 783256 777503 770169 761494 751461 740472 729300
59146 729300 718516 708308 698677 689439 680073 669949 658842 647142 635600 624967 615783 608295
$$ packed form
59251G28368r951j0483j0660r587p660o106n310m514l172j722q04l93j4O34J529
59236F60155K521L384L947M189M122L632K733J897J667J896J724N26j387l209
59222F87797m476n216n477n076l879k201p87k78o67j254j331q84n21o46r32p98
59206F53374l01j65q11j634j620n75N94R16L95j75j76L13P53O91J35l87k68N16
59188F51575J355J766J898K052K105J902J855K455L363L710L254K605K276K219
59174F84390K344K750L221L306L220L910N762P863R059R209Q906Q514Q029P445
59160G67928O637N310L573K158J448P07j005l500n753p334q675j0033j0989j1172
59146G29300j0784j0208r631r238r366j0124j1107j1700j1542j0633r184p488
$$ plain form
59134 608295 602482 598062 594442 590839 586803 582673 579343 577459 577033 577782 579580 582502 586650 592037 598469
59119 598469 605565 613164 621721 631978 644113 657478 671310 685416 700030 715271 730899 746347
59107 746347 760778 773345 783703 792285 799900 807006 813233 817507 818722 816547 811643 804971 796996
59094 796996 787747 777455 766746 756319 746879 739248 733981 730700 728280 725777 722739 718671 712937
59081 712937 705554 697484 689651 682113 674551 667115 660233 653887 647704 641661 636214 631746 628196 625176
59067 625176 622207 618962 615514 612224 609169 605848 601682 596668 591278 585934 580858 576190 571917 567771
59053 567771 563585 559689 556666 554717 553522 552678 552026 551489 550838 549734 548026 546003 544366 543870 544862 547129
59037 547129 550043 552788 554713 555838 556960 558852 561433 564150 567148 571412 577612 585402 594122 603638
$$ packed form
59134F08295n813m420l620l603m036m130l330j884m26P49J798K922M148N387O432
59119E98469P096P599Q557J0257J2135J3365J3832J4106J4614J5241J5628J5448
59107G46347J4431J2567J0358Q582P615P106O227M274J215k175m904o672p975
59094G96996r249j0292j0709j0427r440p631n267l281k420k503l038m068n734
59081G12937p383q070p833p538p562p436o882o346o183o043n447m468l550l020
59067F25176k969l245l448l290l055l321m166n014n390n344n076m668m273m146
59053E67771m186l896l023j949j195q44o52n37o51j104j708k023j637m96R92K267
59037E47129K914K745J925J125J122J892K581K717K998M264O200P790Q720R516
$$ plain form
59023 603638 614167 625839 638826 653287 668594 683146 695625 706090 715127 722257 726089 726027 723038
59010 723038 718692 714000 709308 704651 699953 695368 691636 689736 689969 691736 694396 697982 702784 708506
58996 708506 714185 718823 721893 723349 723511 723039 722735 722985 723291 722653 720630 717904 715516 713787 712430 711557
58980 711557 711810 713392 715681 718169 721198 725351 730738 737513 746425 757894 770849 783474 795100
58967 795100 806532 818429 830267 841234 851375 861250 870901 879750 887341 893720 899016 902894 904522
58954 904522 903074 898230 890152 879068 865145 848909 831479 814048 797228 781139 765933 751929
58942 751929 739309 728068 718183 709661 702591 697360 694470 693731 693924 693887 693699 694160 695229 695851 695443 694714
58926 694714 694545 694607 693623 690749 686308 681391 677081 673918 671730 669903 667859 665322 662364 659495 657627
$$ packed form
59023F03638J0529J1672J2987J4461J5307J4552J2479J0465R037P130L832o2k989
59010G23038m346m692m692m657m698m585l732j900K33J767K660L586M802N722
58996G08506N679M638L070J456J62m72l04K50L06o38k023k726k388j729j357q73
58980G11557K53J582K289K488L029M153N387O775Q912J1469J2955J2625J1626
58967G95100J1432J1897J1838J0967J0141R875R651Q849P591O379N296L878J628
58954I04522j448m844q078j1084j3923j6236j7430j7431j6820j6089j5206j4004
58942G51929j2620j1241r885q522p070n231k890p39J93l7j88M61J069O22m08p29
58926F94714j69O2r84k874m441m917m310l163k188j827k044k537k958k869j868
$$ plain form
58911 657627 657442 658663 660276 661669 663293 666126 670790 677383 685789 695816 707194 719686 733130
58898 733130 747191 761215 774465 786513 797410 807713 818392 830481 844572 860680 878541
58887 878541 897898 918492 939940 961658 982661 1001525 1016971 1028624 1036915 1042113 1043766 1041329
58875 1041329 1034999 1025587 1013774 999845 984107 967239 950191 933910 919088 905934 894181 883548
58863 883548 874240 866764 861094 856222 850780 844116 836621 828999 821478 813836 805992 798262 791003 784213
58849 784213 777580 770819 763917 757043 750194 742917 734593 725154 715353 706031 697268 688596 679877 671490
58835 671490 663776 656956 651610 648442 647208 646550 645332 643670 642208 641027 639922 639283 639832 641632 644039
58820 644039 646532 649024 651466 653788 656210 659048 662115 664824 666918 668663 670275 671541 672074 671626 670139
$$ packed form
58911F57627j85J221J613J393J624K833M664O593Q406J0027J1378J2492J3444
58898G33130J4061J4024J3250J2048J0897J0303J0679J2089J4091J6108J7861
58887H78541J9357K0594K1448K1718K1003J8864J5446J1653Q291N198J653k437
58875A041329o330r412j1813j3929j5738j6868j7048j6281j4822j3154j1753j0633
58863H83548r308p476n670m872n442o664p495p622p521p642p844p730p259o790
58849G84213o633o761o902o874o849p277q324r439r801r322q763q672q719q387
58835F71490p714o820n346l168j234o58j218j662j462j181j105o39N49J800K407
58820F44039K493K492K442K322K422K838L067K709K094J745J612J266N33m48j487
$$ plain form
58805 670139 667752 664744 661240 657147 652564 647919 643333 638242 632200 625735 619786 614580 609695 604979
58791 604979 600663 596765 593233 590617 589758 590737 592858 595686 599387 604078 609653 616285 624136 632483 640105
58776 640105 646753 653292 660085 666254 670890 673886 674981 673106 667619 659467 650245 640742 631210 622265
58762 622265 614354 606780 598511 589915 582628 577669 574615 572728 571920 572188 572949 573626 574465 576126 578598
58747 578598 581046 582809 584149 585861 588454 592083 597085 603990 612704 622152 631224 639832 648559 657552
58733 657552 666458 675372 684906 695084 704878 713272 720194 725941 730256 732502 732447 730358 726560 721401
58719 721401 715454 709382 703726 699070 696069 694903 694928 695246 695526 695981 696750 697564 697893 697153 694907 691064
58703 691064 685724 678810 670143 659973 648938 637277 624629 610941 597046 583878 571598 560081
$$ packed form
58805F70139k387l008l504m093m583m645m586n091o042o465n949n206m885m716
58791F04979m316l898l532k616q59R79K121K828L701M691N575O632P851Q347P622
58776F40105O648O539O793O169M636K996J095j875n487q152r222r503r532q945
58762F22265p911p574q269q596p287m959l054j887q08K68P61O77Q39J661K472
58747E78598K448J763J340J712K593L629N002O905Q714R448R072Q608Q727Q993
58733F57552Q906Q914R534J0178R794Q394O922N747M315K246n5k089l798n159
58719G21401n947o072n656m656l001j166K5L18K80M55P69Q14L29p40k246l843
58703F91064n340o914q667j0170j1035j1661j2648j3688j3895j3168j2280j1517
$$ plain form
58691 560081 549796 541432 534859 529187 523862 519039 514941 511389 508049 504615 500710 496131 491320 487102
58677 487102 483800 481044 478638 477146 477222 478724 480977 483835 488004 494157 502060 510898 520348 531001
58663 531001 543575 557903 572821 586838 598671 607302 612010 612584 609414 603325 595371 586617 577824
58650 577824 569297 561164 553597 546630 540040 533853 528741 525373 523425 521731 519456 516668 513825 511318
58636 511318 509519 508665 508542 508827 509718 511556 513756 514938 514437 512930 511239 509308 506832 504143 501834
58621 501834 500074 498967 499060 500855 504197 508792 514971 523249 533376 544368 555298 565475 574129 580593
58607 580593 584849 587464 589018 589816 590027 589766 589116 588212 587083 585335 582463 578658 574839 571619 568840
58592 568840 566444 565128 565579 567626 570844 575491 582108 590530 600083 610577 622387 635538 649272
$$ packed form
58691E60081j0285q364o573n672n325m823m098l552l340l434l905m579m811m218
58677D87102l302k756k406j492P6J502K253K858M169O153P903Q838R450J0653
58663E31001J2574J4328J4918J4017J1833Q631M708N74l170o089p954q754q793
58650E77824q527q133p567o967o590o187n112l368j948j694k275k788k843k507
58636E11318j799q54j23K85Q91J838K200J182n01j507j691j931k476k689k309
58621E01834j760j107R3J795L342M595O179Q278J0127J0992J0930J0177Q654O464
58607E80593M256K615J554P98K11k61o50r04j129j748k872l805l819l220k779
58592E68840k396j316M51K047L218M647O617Q422R553J0494J1810J3151J3734
$$ plain form
58579 649272 662516 674447 684829 694133 703056 711532 718606 723758 727947 732758 738894 746202 754851
58566 754851 765668 779345 796024 815701 838415 863996 892062 922253 953949 985688 1015232
58555 1015232 1040396 1059829 1073313 1081646 1086023 1087222 1085499 1081303 1075569 1069047 1061845 1053976 1045757
58542 1045757 1037101 1026906 1013738 996805 975906 951120 923319 894454 866458 840106 815527
58531 815527 793286 774109 757916 744119 732676 723934 717555 712470 707949 704020 700872 698517 697043
58518 697043 696523 696688 697052 697255 696884 695386 692719 689644 686719 683503 679602 675951 673918 673371 672745 670986
58502 670986 668425 665767 663318 661376 660377 660246 660274 659873 658990 657821 656728 656420 657483 659752 662736 666601
58486 666601 672099 679654 689229 700868 714523 729527 745237 762213 781759 804139 827972 851421
$$ packed form
58579F49272J3244J1931J0382R304Q923Q476P074N152M189M811O136P308Q649
58566G54851J0817J3677J6679J9677K2714K5581K8066L0191L1696L1739K9544
58555A015232K5164J9433J3484Q333M377J199j723m196n734o522p202p869q219
58542A045757q656j0195j3168j6933k0899k4786k7801k8865k7996k6352k4579
58531H15527k2241j9177j6193j3797j1443q742o379n085m521l929l148k355j474
58518F97043n20J65L64K03l71j498k667l075k925l216l901l651k033n47o26j759
58502F70986k561k658k449j942r99j31K8m01q83j169j093l08J063K269K984L865
58486F66601N498P555R575J1639J3655J5004J5710J6976J9546K2380K3833K3449
$$ plain form
58474 851421 873057 891506 905295 913499 916058 913290 905707 894316 880449 865231 849755 835526
58462 835526 823845 814797 807698 802519 800021 800568 803841 809830 819046 831434 845819 860641 874526
58449 874526 886088 894069 897896 897463 892427 882647 869330 854746 840553 827235 815140 804943 796807
58436 796807 790242 785232 782575 782640 784621 787527 791183 795859 801616 808458 816524 825816 836209 847797
58422 847797 860499 873152 883776 891011 894727 895242 892779 887770 880800 872017 861462 850121 839693
58409 839693 830994 823373 815899 808250 800343 792210 784624 778872 775370 773316 772050 771934 773369 775822
58395 775822 778417 780936 783751 787219 791431 796088 800418 803647 805590 806435 806221 805304 804988 806619 810102
58380 810102 814234 818478 823365 829249 835820 842867 850388 857874 864721 871360 878821 887129 895427 903753
$$ packed form
58474H51421K1636J8449J3789Q204K559k768p583j1391j3867j5218j5476j4229
58462H35526j1681r048p099n179k498N47L273N989R216J2388J4385J4822J3885
58449H74526J1562P981L827m33n036r780j3317j4584j4193j3318j2095j0197q136
58436G96807o565n010k657O5J981K906L656M676N757O842Q066R292J0393J1588
58422H47797J2702J2653J0624P235L716N15k463n009o970q783j0555j1341j0428
58409H39693q699p621p474p649p907q133p586n752l502k054j266j16J435K453
58395G75822K595K519K815L468M212M657M330L229J943Q45k14r17l16J631L483
58380H10102M132M244M887N884O571P047P521P486O847O639P461Q308Q298Q326
$$ plain form
58366 903753 913246 924365 936300 948464 961157 974406 987533 1000316 1013239 1026129 1037831 1047655
58354 1047655 1055886 1062507 1066816 1068703 1069059 1068542 1067298 1066129 1066341 1067997 1069933 1071956 1075420 1081127 1088420
58339 1088420 1096953 1107535 1120400 1134400 1148864 1164589 1182008 1199996 1217507 1234805 1251975
58328 1251975 1267755 1280955 1291680 1300086 1305440 1307558 1307872 1307917 1307977 1308081 1308900 1310684 1312763 1315104 1318881
58313 1318881 1324643 1331477 1338957 1348135 1359418 1371210 1382071 1392689 1404385 1417202 1430777 1445572
58301 1445572 1461775 1478400 1494816 1511802 1529922 1548343 1566493 1585303 1605550 1626591 1647995
58290 1647995 1670737 1695419 1721055 1747001 1774297 1803594 1833606 1863141 1892914 1923840 1955376
58279 1955376 1987176 2020424 2055828 2092119 2128211 2165025 2203552 2243178 2283699 2326831 2373809
$$ packed form
58366I03753R493J1119J1935J2164J2693J3249J3127J2783J2923J2890J1702R824
58354A047655Q231O621M309J887L56n17j244j169K12J656J936K023L464N707P293
58339A088420Q533J0582J2865J4000J4464J5725J7419J7988J7511J7298J7170
58328A251975J5780J3200J0725Q406N354K118L14M5O0J04Q19J784K079K341L777
58313A318881N762O834P480R178J1283J1792J0861J0618J1696J2817J3575J4795
58301A445572J6203J6625J6416J6986J8120J8421J8150J8810K0247K1041K1404
58290A647995K2742K4682K5636K5946K7296K9297L0012K9535K9773L0926L1536
58279A955376L1800L3248L5404L6291L6092L6814L8527L9626M0521M3132M6978
$$ plain form
58268 2373809 2423501 2474817 2528803 2586332 2645984 2706408 2768658 2833968 2901318 2969249 3037780
58257 3037780 3106359 3172489 3234913 3295751 3357100 3418098 3477902 3538765 3603256 3671206 3742459
58246 3742459 3819831 3905919 3999538 4098726 4204722 4319601 4442591 4572368 4710519 4859142
58236 4859142 5017481 5184356 5361248 5549610 5748192 5956604 6178248 6416047 6668888
58227 6668888 6936302 7222592 7531776 7862616 8213729 8589428 8995243 9432114 9900932
58218 9900932 10408474 10962583 11565913 12221034 12937326 13726208 14594646 15550890 16611779
58209 16611779 17797044 19122475 20607708 22285739 24197195 26383188 28894655 31802786
58201 31802786 35192054 39154545 43806430 49304239 55836218 63613078 72885772 83965450
$$ packed form
58268B373809M9692N1316N3986N7529N9652O0424O2250O5310O7350O7931O8531
58257C037780O8579O6130O2424O0838O1349O0998N9804O0863O4491O7950P1253
58246C742459P7372Q6088R3619R9188J05996J14879J22990J29777J38151J48623
58236D859142J58339J66875J76892J88362J98582K08412K21644K37799K52841
58227F668888K67414K86290L09184L30840L51113L75699M05815M36871M68818
58218I900932N07542N54109O03330O55121P16292P88882Q68438R56244J060889
58209A6611779J185265J325431J485233J678031J911456K185993K511467K908131
58201C1802786L389268L962491M651885N497809O531979P776860R272694J1079678
$$ plain form
58193 83965450 97222605 113101257 132166379 155119387 182737641 215771151 254701192
58186 254701192 299057193 346292123 391081833 426261939 445503034 446084349 429736197
58179 429736197 401114480 365375040 326596152 287532997 250024705 215326409 184211514
58172 184211514 157013301 133706985 114018672 97537325 83811181 72404408 62916968
58165 62916968 54997280 48355634 42760720 38021627 33979464 30511163 27524922 24944977
58157 24944977 22704362 20748421 19033571 17519991 16171672 14962506 13874346 12888892
58149 12888892 11988105 11161690 10406721 9719447 9093201 8523451 8008061 7542294 7119277
58140 7119277 6735366 6389651 6078172 5793543 5529874 5283230 5048132 4819230 4596564
$$ packed form
58193H3965450J3257155J5878652J9065122K2953008K7618254L3033510L8930041
58186B54701192M4356001M7234930M4789710L5180106J9241095N81315j6348152
58179D29736197k8621717l5739440l8778888l9063155l7508292l4698296l1114895
58172A84211514k7198213k3306316j9688313j6481347j3726144j1406773r487440
58165F2916968p919688o641646n594914m739093m042163l468301k986241k579945
58157B4944977k240615j955941j714850j513580j348319j209166j088160r85454
58149A2888892r00787q26415p54969o87274o26246n69750n15390m65767m23017
58140G119277l83911l45715l11479k84629k63669k46644k35098k28902k22666
$$ plain form
58131 4596564 4384420 4184923 3996947 3820548 3657405 3506791 3365741 3233411 3111104
58122 3111104 2997922 2890578 2787731 2690596 2599022 2510836 2425414 2344309 2267974 2195106 2125425
58111 2125425 2059884 1997989 1938022 1879999 1825378 1773817 1723282 1673348 1625443 1579822 1535296
58100 1535296 1491990 1451431 1413801 1377908 1343873 1312985 1284850 1257497 1230517 1205402 1182727
58089 1182727 1161666 1142410 1126299 1113262 1101611 1090533 1080342 1070216 1058273 1044138 1029019
58078 1029019 1013170 995704 977025 958787 941164 922650 902933 883533 865199 847096 829068
58067 829068 812427 797848 784495 771698 759608 747843 735553 723182 712351 703596 695935 688640
58055 688640 681518 673509 663265 651407 640117 630255 620864 611601 603430 596581 589989 583186 576668
$$ packed form
58131D596564k12144j99497j87976j76399j63143j50614j41050j32330j22307
58122C111104j13182j07344j02847r7135r1574q8186q5422q1105p6335p2868o9681
58111B125425o5541o1895n9967n8023n4621n1561n0535m9934m7905m5621m4526
58100A535296m3306m0559l7630l5893l4035l0888k8135k7353k6980k5115k2675
58089A182727k1061j9256j6111j3037j1651j1078j0191j0126j1943j4135j5119
58078A029019j5849j7466j8679j8238j7623j8514j9717j9400j8334j8103j8028
58067H29068j6641j4579j3353j2797j2090j1765j2290j2371j0831q755p661p295
58055F88640p122q009j0244j1858j1290r862r391r263q171o849o592o803o518
$$ plain form
58042 576668 570095 562318 553606 545670 538993 532247 524872 518096 512776 508264 504027 500304 496456 490816
58028 490816 483006 474537 466323 457564 447902 438638 430783 423723 416825 410666 405645 401064 396641 393340
58014 393340 391623 390413 388793 387257 386255 384984 382771 380353 378686 377681 377042 377076 377714 377964 377290 376417
57998 376417 375875 374962 373092 370949 369370 368215 367228 366861 367301 367832 368073 368705 370125 371558 372431 373324 374445
57981 374445 374430 371984 367762 363325 359102 354589 349775 345065 340412 335705 331559 328645 326683 324996 323608
57966 323608 322914 322753 322667 322637 322808 322926 322806 322899 323679 324840 325688 325965 325760 325129 324283 323659 323304 322707 321619
57947 321619 320477 319732 319472 320050 322174 325940 330639 336007 342707 351022 360075 369086 378403 388519 398990
57932 398990 409251 419546 429947 439209 445788 449424 450676 449416 444997 437687 428845 419743 411001
$$ packed form
58042E76668o573p777q712p936o677o746p375o776n320m512m237l723l848n640
58028D90816p810q469q214q759r662r264p855p060o898o159n021m581m423l301
58014C93340j717j210j620j536j002j271k213k418j667j005o39L4O38K50o74q73
57998C76417n42r13j870k143j579j155r87l67M40N31K41O32J420J433Q73Q93J121
57981C74445j5k446m222m437m223m513m814m710m653m707m146k914j962j687j388
57966C23608o94j61q6l0J71J18j20R3P80J161Q48K77k05o31q46o24l55n97j088
57947C21619j142p45k60N78K124L766M699N368O700Q315R053R011R317J0116J0471
57932C98990J0261J0295J0401R262O579L636J252j260m419p310q842r102q742
$$ plain form
57919 411001 403010 396015 389753 383616 377281 370908 364963 360141 357060 355533 354452 352836 350720 348712
57905 348712 347093 345763 344663 343729 342716 341371 339532 336960 333568 329972 327169 325431 324203 323282 323261
57890 323261 324375 325783 326608 326956 327329 327659 327522 326733 325215 322877 320113 317719 315820 313608 310648 307625
57874 307625 305195 303004 300633 298677 297921 298147 298729 299855 302190 305756 310048 314833 319966 324804 328737
57859 328737 332092 335696 339762 343810 347378 350179 351960 352864 353514 354087 353722 351570 347958 343773 339221
57844 339221 334029 328453 323072 317893 312597 307470 303241 300105 297696 295889 294832 294276 293694 293021 292671
57829 292671 292902 293768 295498 298214 301412 304311 306661 308655 310287 311399 312146 312715 312793 311991 310672 309603
57813 309603 308932 308126 306802 304878 301966 297422 291172 283958 276618 269566 263018 257267 252634 249387 247622
$$ packed form
57919D11001p991o995o262o137o335o373n945m822l081j527j081j616k116k008
57905C48712j619j330j100r34j013j345j839k572l392l596k803j738j228r21k1
57890C23261J114J408Q25L48L73L30j37p89j518k338k764k394j899k212k960l023
57874C07625k430k191k371j956p56K26N82J126K335L566M292M785N133M838L933
57859C28737L355L604M066M048L568K801J781R04O50N73l65k152l612m185m552
57844C39221n192n576n381n179n296n127m229l136k409j807j057n56n82o73l50
57829B92671K31Q66J730K716L198K899K350J994J632J112P47N69P8q02j319j069
57813C09603o71q06j324j924k912m544o250p214p340p052o548n751m633l247j765
$$ plain form
57798 247622 247022 247050 247652 249467 252950 257694 263035 268863 275205 281484 286983 291860 296949 302717 308993
57783 308993 315496 321961 327908 333026 337707 342565 347495 351771 354888 356711 356976 355388 352143 347626
57769 347626 341631 333560 323462 312321 301260 290879 281273 272105 262783 253139 243934 236187 230181
57756 230181 225696 222974 222654 224711 228233 232432 237274 243007 249621 256886 264375 271325 277008 281407
57742 281407 285087 288288 290574 291537 291398 290734 289906 288919 287629 286010 284379 283244 282758 282485 281894 280890
57726 280890 279638 278221 276842 275971 275744 275600 275084 274684 275162 276242 276777 276109 274498 272275 269438 266261
57710 266261 263419 261119 258711 255595 252042 248664 245433 241766 237487 233267 230018 228046 227031 226718
57696 226718 227244 228553 229786 229889 228750 227150 225521 223469 220812 218268 216641 216026 216392 218222 221791
$$ packed form
57798B47622o00K8O02J815L483M744N341N828O342O279N499M877N089N768O276
57783C08993O503O465N947N118M681M858M930M276L117J823K65j588l245m517
57769C47626n995q071j0098j1141j1061j0381r606r168r322r644r205p747o006
57756B30181m485k722l20K057L522M199M842N733O614P265P489O950N683M399
57742B81407L680L201K286R63j39o64q28r87j290j619j631j135m86k73n91j004
57726B80890j252j417j379q71k27j44n16m00M78J080N35o68j611k223k837l177
57710B66261k842k300k408l116l553l378l231l667m279m220l249j972j015l13
57696B26718N26J309J233J03j139j600j629k052k657k544j627o15L66J830L569
$$ plain form
57681 221791 226377 231144 236500 243778 253944 267408 284714 306415 332457 362745 398376 441522
57669 441522 494235 558160 635008 725322 825227 924244 1006958 1058065 1068094 1036939 973206
57658 973206 889797 798927 709665 627846 556418 495860 445437 404466 372090 346438 325210
57647 325210 307217 292543 281137 272112 264501 257895 252150 247134 242868 239272 235862 232391 229698
57634 229698 228910 229725 230404 229736 228209 227012 226661 226849 226896 225999 223705 220450 217109 213936 210539 206957
57618 206957 203908 201748 199969 198071 196229 194773 193616 192572 191753 191351 191344 191573 191759 191556 191077 191109 192080
57601 192080 193105 192984 191972 191423 191728 191899 191379 190794 190448 189397 186833 183303 179699 176028 172122 168750
57585 168750 166923 166510 166479 166177 165659 165030 164204 163188 162107 161008 159901 158715 157070 154503 151083 147354
$$ packed form
57681B21791M586M767N356P278J0166J3464J7306K1701K6042L0288L5631M3146
57669D41522N2713O3925P6848R0314R9905R9017Q2714N1107J0029l1155o3733
57658I73206q3409r0870q9262q1819p1428o0558n0423m0971l2376k5652k1228
57647C25210j7993j4674j1406r025p611o606n745n016m266l596l410l471k693
57634B29698p88Q15O79o68j527j197l51J88M7q97k294l255l341l173l397l582
57618B06957l049k160j779j898j842j456j157j044q19m02pK29J86k03m79L2R71
57601A92080J025j21j012n49L05J71n20n85l46j051k564l530l604l671l906l372
57585A68750j827m13l1l02n18o29q26j016j081j099j107j186j645k567l420l729
$$ plain form
57569 147354 143617 139853 136409 133925 132361 130989 129636 128975 129111 128967 127795 126386 125867 126035 125878 125210
57553 125210 124872 125620 127512 130068 132463 133953 134704 135704 137360 138794 139185 139088 139521 140321 140472 139722 138901
57536 138901 138720 138990 138927 137647 134643 130416 126323 123249 120879 118844 117854 118639 120242 120706 119354 117307
57520 117307 115705 114504 113223 111881 110843 110394 110713 111709 112751 113190 113287 114012 115845 118394 121278 124694
57504 124694 128813 133296 137748 142214 146889 151708 156467 161020 165101 168232 170072 170701 170462 169711 168753
57489 168753 167773 166732 165499 164063 162389 160180 157127 153411 149570 145862 142062 137954 133679 129457
57475 129457 125305 121191 117308 113987 111378 109250 107097 104525 101694 99309 97960 97455 96936 95715 94017
57460 94017 92953 93703 96439 100008 102902 104646 105955 107489 108878 109314 108684 107673 106920 106481 106077 105576
$$ packed form
57569A47354l737l764l444k484j564j372j353o61J36j44j172j409n19J68j57o68
57553A25210l38P48J892K556K395J490P51J000J656J434L91r7M33Q00J51p50q21
57536A38901j81K70o3j280l004m227m093l074k370k035r90P85J603M64j352k047
57520A17307j602j201j281j342j038m49L19R96J042M39R7P25J833K549K884L416
57504A24694M119M483M452M466M675M819M759M553M081L131J840O29k39p51r58
57489A68753r80j041j233j436j674k209l053l716l841l708l800m108m275m222
57475A29457m152m114l883l321k609k128k153k572k831k385j349n05n19j221j698
57460I4017j064P50K736L569K894J744J309J534J389M36o30j011p53m39m04n01
$$ plain form
57444 105576 105218 105453 106374 107329 107500 107097 107470 109578 112703 115181 116208 116385 116664 117346 118146 118759 119196
57427 119196 119791 120929 122569 124049 124588 123989 122750 121600 121025 121036 121184 120953 120320 119762 119575 119409 118698
57410 118698 117371 115947 115120 115341 116502 117821 118326 117695 116429 115176 114299 114105 114844 116137 117015 117010 116736
57393 116736 117015 117932 119191 120749 122430 123485 123390 122790 122794 123546 124291 124694 125262 126401 127842 129171 130369
57376 130369 131567 132683 133529 134081 134552 135280 136323 137087 136783 135524 134512 134674 135644 136682 138039 140466
57360 140466 143709 146512 148162 149149 150218 151589 153350 155805 159018 162453 165393 167480 168774 169595 170364
57345 170364 171240 171971 172401 172952 174138 175707 176855 177228 177169 177010 176793 176689 177047 177886 178837 179788 181078 182890
57327 182890 184991 187187 189551 191976 193947 195061 195474 195681 196097 196885 197846 198473 198493 198421 199183 201112 203661
$$ packed form
57444A05576l58K35R21R55J71m03L73K108L125K478J027J77K79O82Q00O13M37
57427A19196N95J138J640J480N39n99j239j150n75J1J48k31o33n58j87j66p11
57410A18698j327j424q27K21J161J319N05o31j266j253q77j94P39J293Q78nk74
57393A16736K79R17J259J558J681J055r5o00MP52P45M03N68J139J441J329J198
57376A30369J198J116Q46N52M71P28J043P64l04j259j012J62R70J038J357K427
57360A40466L243K803J650R87J069J371J761K455L213L435K940K087J294Q21P69
57345A70364Q76P31M30N51J186J569J148L73n9j59k17j04L58Q39R51R51J290J812
57327A82890K101K196K364K425J971J114M13K07M16P88R61O27K0p2P62J929K549
$$ plain form
57310 203661 206127 208227 209935 211252 212314 213368 214475 215531 216698 218437 221031 224341 228087 232024
57296 232024 235812 239096 241891 244631 247737 251338 255341 259496 263434 267022 270683 274975 279824 284542
57282 284542 288653 292369 296146 300125 304156 308225 312671 318018 324441 331349 337814 343631 349627 356628
57268 356628 364500 372594 380707 388939 396932 404039 410231 416204 422584 429476 436694 443860 450404 456166
57254 456166 462008 469198 478171 488367 499190 510414 521728 532720 543541 554892 567071 579523
57242 579523 591574 603222 615075 627849 641943 657093 672464 687497 702594 718560 735622
57231 735622 753608 772731 793335 814968 836620 857924 879240 900609 921625 942439 963792
57220 963792 985743 1007355 1028042 1048283 1068582 1088700 1108508 1128660 1149706 1171283 1192906
$$ packed form
57310B03661K466K100J708J317J062J054J107J056J167J739K594L310L746L937
57296B32024L788L284K795K740L106L601M003M155L938L588L661M292M849M718
57282B84542M111L716L777L979M031M069M446N347O423O908O465N817N996P001
57268C56628P872Q094Q113Q232P993P107O192N973O380O892P218P166O544N762
57254D56166N842P190Q973J0196J0823J1224J1314J0992J0821J1351J2179J2452
57242E79523J2051J1648J1853J2774J4094J5150J5371J5033J5097J5966J7062
57231G35622J7986J9123K0604K1633K1652K1304K1316K1369K1016K0814K1353
57220I63792K1951K1612K0687K0241K0299K0118J9808K0152K1046K1577K1623
$$ plain form
57209 1192906 1214855 1237564 1260823 1284342 1308506 1333607 1358853 1383151 1406688 1430783 1456204
57198 1456204 1482381 1508310 1533572 1558382 1583261 1608806 1635333 1662603 1690181 1718150 1747164
57187 1747164 1777758 1809845 1842910 1876416 1909953 1943295 1976572 2010326 2045171 2081235 2118009
57176 2118009 2154928 2192181 2230702 2271187 2313350 2356399 2399989 2444324 2489474 2535084 2580722
57165 2580722 2626102 2670997 2715391 2759705 2804447 2849521 2894257 2938137 2981063 3022933 3063453
57154 3063453 3102555 3140603 3177985 3214751 3250749 3285897 3320236 3353970 3387428 3420771 3453790
57143 3453790 3486243 3518273 3550251 3582358 3614465 3646130 3676483 3704563 3730185 3754046 3776515
57132 3776515 3796893 3814504 3829983 3844742 3859690 3875478 3893580 3916007 3944123 3978675 4020719
$$ packed form
57209A192906K1949K2709K3259K3519K4164K5101K5246K4298K3537K4095K5421
57198A456204K6177K5929K5262K4810K4879K5545K6527K7270K7578K7969K9014
57187A747164L0594L2087L3065L3506L3537L3342L3277L3754L4845L6064L6774
57176B118009L6919L7253L8521M0485M2163M3049M3590M4335M5150M5610M5638
57165B580722M5380M4895M4394M4314M4742M5074M4736M3880M2926M1870M0520
57154C063453L9102L8048L7382L6766L5998L5148L4339L3734L3458L3343L3019
57143C453790L2453L2030L1978L2107L2107L1665L0353K8080K5622K3861K2469
57132C776515K0378J7611J5479J4759J4948J5788J8102K2427K8116L4552M2044
$$ plain form
57121 4020719 4071282 4130084 4195633 4266654 4342614 4423058 4507561 4596480 4690931 4792210 4902279
57110 4902279 5024706 5164112 5324745 5510535 5726293 5977843 6271500 6615109 7019968
57101 7019968 7501131 8076674 8768501 9604004 10615973 11841778 13324596 15115194 17270453
57092 17270453 19849410 22910208 26507008 30684293 35470936 40876408 46884126 53438586
57084 53438586 60435544 67722134 75091308 82254172 88817266 94323575 98370629 100733269
57076 100733269 101400056 100510471 98261844 94853334 90475519 85318081 79576089 73450686
57068 73450686 67142198 60836448 54692392 48837709 43369168 38352072 33820153 29779622
57060 29779622 26215808 23098861 20388909 18041975 16014565 14265110 12754472 11447587
$$ packed form
57121D020719N0563N8802O5549P1021P5960Q0444Q4503Q8919R4451J01279J10069
57110D902279J22427J39406J60633J85790K15758K51550K93657L43609M04859
57101G019968M81163N75543O91827Q35503J011969J225805J482818J790598K155259
57092A7270453K578957L060798L596800M177285M786643N405472O007718O554460
57084E3438586O996958P286590P369174P162864O563094N506309M047054K362640
57076A00733269O66787q89585k248627l408510m377815n157438n741992o125403
57068G3450686o308488o305750o144056n854683n468541n017096m531919m040531
57060B9779622l563814l116947k709952k346934k027410j749455j510638j306885
$$ plain form
57052 11447587 10314546 9329563 8469899 7716527 7054492 6471362 5955773 5497873 5089822
57043 5089822 4724767 4396153 4098839 3829852 3587049 3367803 3169821 2992266 2834817
57034 2834817 2696130 2574124 2467348 2375291 2297916 2235685 2189664 2161166 2151924 2164809 2202282
57023 2202282 2261301 2328792 2383321 2403111 2374883 2298075 2183127 2045873 1901449 1760704
57013 1760704 1629868 1511858 1407513 1316482 1237901 1170562 1112746 1062571 1018731 980573 947282
57002 947282 917593 890510 865787 843332 822458 802004 780994 759179 737272 716589 697969
56991 697969 681127 665593 652102 642255 636786 635134 636918 642852 653586 668141 683887 697526
56979 697526 705888 706590 698851 683785 663769 641491 619214 598246 578934 561489 546594 534748
$$ packed form
57052A1447587j133041r84983q59664p53372o62035n83130n15589m57900m08051
57043E089822l65055l28614k97314k68987k42803k19246j97982j77555j57449
57034B834817j38687j22006j06776r2057p7375o2231m6021k8498r242J2885L7473
57023B202282N9019O7491N4529J9790k8228p6808j14948j37254j44424j40745
57013A760704j30836j18010j04345r1031p8581o7339n7816n0175m3840l8158l3291
57002I47282k9689k7083k4723k2455k0874k0454k1010k1815k1907k0683j8620
56991F97969j6842j5534j3491r847n469j652J784N934J0734J4555J5746J3639
56979F97526Q362P02p739j5066k0016k2278k2277k0968j9312j7445j4895j1846
$$ plain form
56967 534748 525431 517820 512128 509277 509434 512062 517419 526734 540666 558822 581027 607379 636030
56954 636030 661986 679348 684485 676953 658637 632979 604048 574900 546774 520296 496804 477707
56942 477707 463127 452091 443844 438379 436050 437359 442892 452897 467199 485987 510299 541026
56930 541026 577339 616051 652012 679008 691453 686684 666081 633833 594784 553250 512779 475836
56918 475836 443495 415701 391785 370835 352174 335804 321995 310350 299933 290477 282656 276688
56906 276688 271564 266303 261268 257434 254861 252721 250521 248567 247431 247633 249686 253905 260215 268478
56892 268478 278835 291493 306539 324268 345325 370196 398897 431174 466057 500534 529450
56881 529450 547857 553697 548188 534310 515508 495069 475389 457517 441833 429076 420336 416246
$$ packed form
56967E34748r317p611n692k851J57K628N357R315J3932J8156K2205K6352K8651
56954F36030K5956J7362N137p532j8316k5658k8931k9148k8126k6478k3492j9097
56942D77707j4580j1036q247n465k329J309N533J0005J4302J8788K4312L0727
56930E41026L6313L8712L5961K6996J2445m769k0603l2248l9049m1534m0471l6943
56918D75836l2341k7794k3916k0950j8661j6370j3809j1645j0417r456p821n968
56906B76688n124n261n035l834k573k140k200j954j136K02K053M219O310Q263
56892B68478J0357J2658J5046J7729K1057K4871K8701L2277L4883L4477K8916
56881E29450J8407N840n509j3878j8802k0439j9680j7872j5684j2757q740m090
$$ plain form
56869 416246 416744 421609 430874 444897 464377 490170 522891 562958 611212 668858 735870 809029
56857 809029 881296 942921 983961 997693 983429 946463 895044 837133 779182 726093 680875
56846 680875 644523 617007 598342 588597 587562 595193 612036 638737 675652 723563 784359 860199
56834 860199 951973 1058425 1175234 1293233 1397762 1471959 1503059 1487354 1430707 1345203 1244434
56823 1244434 1139832 1039368 948146 869141 803260 749753 707624 676691 657155 648746 650863
56812 650863 663173 685607 718239 761842 818082 888013 969572 1055912 1135602 1194923 1222229
56801 1222229 1212567 1169228 1101103 1018648 931463 847202 770598 703385 645921 598623 561429
56790 561429 532916 511304 496110 487828 486435 491381 502878 521987 549330 584472 626079 671155
$$ packed form
56869D16246M98M865R265J4023J9480K5793L2721M0067M8254N7646O7012P3159
56857H09029P2267O1625M1040J3732j4264l6966n1419n7911n7951n3089m5218
56846F80875l6352k7516j8665r745j035P631J6843K6701L6915M7911O0796P5840
56834H60199R1774J06452J16809J17999J04529P4197L1100j5705n6647q5504j00769
56823A244434j04602j00464r1222p9005o5881n3507m2129l0933j9536q409K117
56812F50863J2310K2434L2632M3603N6240O9931Q1559Q6340P9690N9321K7306
56801A222229r662m3339o8125q2455q7185q4261p6604o7213n7464m7298l7194
56790E61429k8513k1612j5194q282j393M946J1497J9109K7343L5142M1607M5076
$$ plain form
56778 671155 713820 746187 761524 756795 732906 693751 645114 592984 541648 493216 448798 409432
56766 409432 375683 347167 323053 302769 285972 272149 260576 250529 241483 233243 225901 219496
56754 219496 213847 208825 204468 200544 196418 191869 187715 185041 183952 183617 183296 182745 181854 180606 179348
56739 179348 178440 177678 176633 175457 174664 174144 173122 171224 168990 167156 165915 165051 164326 163567 162741 162108
56723 162108 162039 162645 163760 165271 167161 169269 171268 172832 173722 173957 174070 174795 176175 177374 177832 178258
56707 178258 179877 182948 186615 190037 193063 195862 198417 200483 201680 201722 200787 199536 198563 198111 198422 199841
56691 199841 202204 204682 206718 208676 211146 214124 217400 221102 225206 229095 232363 235559 239332 243319
56677 243319 246715 249551 252523 255895 259385 262704 265386 266508 265609 263617 261931 260826 259602 257879
$$ packed form
56778F71155M2665L2367J5337m729k3889l9155m8637n2130n1336m8432m4418l9366
56766D09432l3749k8516k4114k0284j6797j3823j1573j0047r046q240p342o405
56754B19496n649n022m357l924m126m549m154k674j089l35l21n51q91j248j258
56739A79348r08p62j045j176p93n20j022j898k234j834j241q64p25p59q26o33
56723A62108o9O06J115J511J890K108J999J564Q90K35J13P25J380J199M58M26
56707A78258J619L071L667L422L026K799K555K066J197M2r35j251r73m52L11J419
56691A99841K363K478K036J958K470K978L276L702M104L889L268L196L773L987
56677B43319L396K836K972L372L490L319K682J122q99j992j686j105j224j723
$$ plain form
56663 257879 255728 252877 249013 244671 240737 237166 233239 228918 224788 220823 216527 212371 209774 209292
56649 209292 209816 209886 208988 207409 205716 204616 204565 205330 206476 208158 210654 213352 215172 215870 215935 215331 213468
56632 213468 210376 206724 202704 198066 193310 189515 186835 184328 181503 178778 176247 173369 170313 168231
56618 168231 167616 167544 167229 167213 168316 170344 172491 174207 175136 175111 174789 175408 177289 179327 180563 181409 182716
56601 182716 184445 185949 186934 187424 187378 186913 186452 186194 185915 185607 185730 186496 187571 188734 190144 191643 192658
56584 192658 193154 193840 194995 195834 195618 194726 194176 194664 196383 199097 202028 204393 206384 208881 211974 214634
56568 214634 216212 217312 218848 221146 224438 229185 235315 242095 249405 258241 269232 281431 293130
56555 293130 303094 310471 314569 315654 315234 314717 314331 313857 313484 313224 312415 310727 308892 307467 305590 302061
$$ packed form
56663B57879k151k851l864m342l934l571l927m321m130l965m296m156k597m82
56649B09292N24P0q98j579j693j100n1P65J146J682K496K698J820O98O5o04j863
56632B13468l092l652m020m638m756l795k680k507k825k725k531k878l056k082
56618A68231o15p2l15j6J103K028K147J716R29k5l22O19J881K038J236Q46J307
56601A82716J729J504R85M90m6m65m61k58k79l08J23P66J075J163J410J499J015
56584A92658M96O86J155Q39k16q92n50M88J719K714K931K365J991K497L093K660
56568B14634J578J100J536K298L292M747O130O780P310Q836J0991J2199J1699
56555B93130R964P377M098J085m20n17l86m74l73k60q09j688j835j425j877l529
$$ plain form
56539 302061 297109 292084 287739 283781 279799 275744 271587 267286 263076 259320 256152 253494 251127 248578
56525 248578 245482 242269 239921 238732 237965 236910 235501 233670 231129 228262 226131 224921 223397 220615
56511 220615 217222 214241 211588 208780 206196 204449 203210 201790 200328 199349 198649 197719 196842 196767 197497 198327
56495 198327 198834 199137 199494 200321 202169 204998 207848 209876 211226 212385 213352 214129 215212 216753 217925 218020
56479 218020 217513 217071 216317 214722 213043 212617 213685 215604 218214 221644 225050 227010 227220 226640 225948 224949
56463 224949 223569 222399 221961 222185 222722 223171 223039 222204 221343 221269 221874 222321 222148 221561 220851 220218 220053 220706
56445 220706 221932 223022 223458 223170 222446 221940 222311 223398 224229 224244 223977 224070 224326 224383 224548 225123 225580 225348 224911
56426 224911 225145 226043 226985 227866 229079 230729 232655 234771 236619 237189 236147 234703 234278 234814 235440 236257
$$ packed form
56539C02061m952n025m345l958l982m055m157m301m210l756l168k658k367k549
56525B48578l096l213k348j189p67j055j409j831k541k867k131j210j524k782
56511B20615l393k981k653k808k584j747j239j420j462r79p00r30q77p5P30Q30
56495A98327N07L03L57Q27J848K829K850K028J350J159R67P77J083J541J172R5
56479B18020n07m42p54j595j679m26J068J919K610L430L406J960K10n80o92r99
56463B24949j380j170m38K24N37M49j32q35q61p4O05M47j73n87p10o33j65O53
56445B20706J226J090M36k88p24n06L71J087Q31J5k67R3K56N7J65N75M57k32m37
56426B24911K34Q98R42Q81J213J650J926K116J848N70j042j444m25N36O26Q17
$$ plain form
56410 236257 238193 241351 244655 247054 248241 248492 248655 249931 252620 255394 256669 256372 255583 255011 254836 255367
56394 255367 256647 257894 258517 259215 260834 262638 263099 261968 260160 257985 255123 252170 250569 250837 252177
56379 252177 253905 255998 258251 260276 262445 265628 269868 274413 278915 283312 286626 287420 285666 282849
56365 282849 280027 277090 273997 271317 269141 266795 264015 261310 258869 256278 253661 251940 251578 252117 253215
56350 253215 255037 257335 259292 260685 262148 263915 265379 266260 267152 268489 269977 271485 273572 276654 280386
56335 280386 284215 287797 290726 292767 294566 297222 300970 305142 309441 314162 319034 323145 326351 329566
56321 329566 333207 336470 338628 339955 340830 341020 340495 340028 340248 340801 341085 341160 341451 342109 343116 344513 346209
56304 346209 348104 350548 354090 358698 363883 369580 376080 383016 389303 394225 397830 400342 402146 404391
$$ packed form
56410B36257J936L158L304K399J187K51J63J276K689K774J275k97p89n72j75N31
56394B55367J280J247O23O98J619J804M61j131j808k175k862k953j601K68J340
56379B52177J728K093K253K025K169L183M240M545M502M397L314P94j754k817
56365B82849k822k937l093k680k176k346k780k705k441k591k617j721l62N39J098
56350B53215J822K298J957J393J463J767J464Q81Q92J337J488J508K087L082L732
56335B80386L829L582K929K041J799K656L748M172M299M721M872M111L206L215
56321C29566L641L263K158J327Q75J90n25m67K20N53K84P5K91O58J007J397J696
56304C46209J895K444L542M608N185N697O500O936O287M922L605K512J804K245
$$ plain form
56290 404391 408423 414352 421069 427755 434433 441103 447621 454571 462930 472454 481613 489579 497138 505309
56276 505309 514252 524024 535146 547689 560776 573755 587094 601642 617745 635537 655247 676881
56264 676881 700428 726717 757092 791891 830219 871686 917365 968603 1025914 1089640 1160823
56253 1160823 1240729 1330181 1429697 1539558 1659365 1788252 1925761 2071648 2224589 2381955
56243 2381955 2541015 2699279 2853455 2999253 3132686 3250540 3349313 3424969 3474508 3496917
56233 3496917 3492276 3461068 3404944 3327133 3231327 3120821 2998954 2869316 2734909 2597897
56223 2597897 2460516 2325320 2194199 2068050 1947711 1834185 1727710 1627751 1534267 1447863
56213 1447863 1368424 1294800 1226249 1162992 1104940 1051235 1001553 956574 916519 880381 847207
$$ packed form
56290D04391M032N929O717O686O678O670O518O950Q359R524R159P966P559Q171
56276E05309Q943R772J1122J2543J3087J2979J3339J4548J6103J7792J9710K1634
56264F76881K3547K6289L0375L4799L8328M1467M5679N1238N7311O3726P1183
56253A160823P9906Q9452R9516J09861J19807J28887J37509J45887J52941J57366
56243B381955J59060J58264J54176J45798J33433J17854R8773P5656M9539K2409
56233C496917m641l1208n6124p7811r5806j10506j21867j29638j34407j37012
56223B597897j37381j35196j31121j26149j20339j13526j06475r9959r3484q6404
56213A447863p9439p3624o8551o3257n8052n3705m9682m4979m0055l6138l3174
$$ plain form
56202 847207 816960 789588 764527 741735 722014 705549 691282 678383 667231 658214 650645 643579
56190 643579 636780 630356 624403 619421 615919 613197 609793 605560 601964 599835 598300 596543 595099 594555
56176 594555 594403 594161 594387 595662 597707 600246 603541 607257 610112 611640 613257 616676 622182 629091 636866
56161 636866 645140 653721 663104 673956 685817 697607 709672 723738 740454 758807 778527 801161
56149 801161 827958 858605 893117 933224 980843 1036852 1102504 1180295 1272028 1377183 1493868
56138 1493868 1619426 1748872 1874528 1988979 2087739 2169005 2233235 2284338 2328978 2372317
56128 2372317 2414889 2454050 2486571 2508944 2517935 2513400 2499472 2481271 2461189 2438853 2412345 2377663
56116 2377663 2328893 2261371 2174336 2070062 1952529 1828171 1705473 1591232 1488023 1396335
$$ packed form
56202H47207l0247k7372k5061k2792j9721j6465j4267j2899j1152r017p569p066
56190F43579o799o424n953m982l502k722l404m233l596k129j535j757j444n44
56176E94555j52k42K26J275K045K539L295L716K855J528J617L419N506O909P775
56161F36866Q274Q581R383J0852J1861J1790J2065J4066J6716J8353J9720K2634
56149H01161K6797L0647L4512M0107M7619N6009O5652P7791R1733J05155J16685
56138A493868J25558J29446J25656J14451R8760Q1266O4230N1103M4640M3339
56128B372317M2572L9161L2521K2373Q991m535j3928j8201k0082k2336k6508l4682
56116B377663m8770o7522q7035j04274j17533j24358j22698j14241j03209r1688
$$ plain form
56106 1396335 1317235 1251307 1196978 1151998 1115256 1085623 1060883 1039628 1022565 1010143 1000655
56095 1000655 992422 985951 981956 979243 976679 975411 976750 979580 982220 985245 990062 996205 1002409 1008953
56081 1008953 1016614 1024673 1032186 1039821 1048296 1056563 1063833 1071767 1082179 1094112 1105638 1117079 1129941
56068 1129941 1144081 1158534 1173835 1191028 1209506 1228105 1247049 1266644 1285616 1303004 1320053
56057 1320053 1337903 1355182 1370347 1384596 1399802 1415387 1430014 1444559 1460555 1477400 1494032
56046 1494032 1511636 1531820 1553818 1576436 1600904 1628746 1658620 1688427 1718770 1751110 1784315
56035 1784315 1816337 1847646 1879886 1912959 1946637 1982876 2023078 2065014 2105985 2146982 2190227
56024 2190227 2234896 2279054 2323671 2370795 2419894 2469787 2521805 2577073 2633318 2688691 2746097
$$ packed form
56106A396335p9100o5928n4329m4980l6742k9633k4740k1255j7063j2422r488
56095A000655q233o471l995k713k564j268J339K830K640L025M817O143O204O544
56081A008953P661Q059P513P635Q475Q267P270P934J0412J1933J1526J1441J2862
56068A129941J4140J4453J5301J7193J8478J8599J8944J9595J8972J7388J7049
56057A320053J7850J7279J5165J4249J5206J5585J4627J4545J5996J6845J6632
56046A494032J7604K0184K1998K2618K4468K7842K9874K9807L0343L2340L3205
56035A784315L2022L1309L2240L3073L3678L6239M0202M1936M0971M0997M3245
56024B190227M4669M4158M4617M7124M9099M9893N2018N5268N6245N5373N7406
$$ plain form
56013 2746097 2809194 2876801 2946035 3018091 3095722 3177757 3261654 3348918 3442378 3540654 3641200
56002 3641200 3746369 3860398 3982725 4110450 4244897 4389325 4542514 4701290 4867206
55993 4867206 5044157 5231948 5428998 5638605 5865252 6107469 6361915 6631652 6922410
55984 6922410 7233833 7563105 7914326 8295243 8707385 9148730 9623393 10139289 10699391
55975 10699391 11305330 11966483 12695319 13497710 14378946 15355126 16446928 17667510 19030536
55966 19030536 20565938 22314541 24314194 26608730 29266492 32374949 36026403 40330911
55958 40330911 45438236 51528343 58792372 67451064 77787505 90146123 104930954 122653905
55950 122653905 143974413 169650429 200440947 236942721 279060163 324918438 369874938
$$ packed form
56013B746097O3097O7607O9234P2056P7631Q2035Q3897Q7264R3460R8276J00546
56002C641200J05169J14029J22327J27725J34447J44428J53189J58776J65916
55993D867206J76951J87791J97050K09607K26647K42217K54446K69737K90758
55984F922410L11423L29272L51221L80917M12142M41345M74663N15896N60102
55975A0699391O05939O61153P28836Q02391Q81236R76180J091802J220582J363026
55966A9030536J535402J748603J999653K294536K657762L108457L651454M304508
55958D0330911N107325O090107P264029Q658692J0336441J2358618J4784831J7722951
55950A22653905K1320508K5676016L0790518L6501774M2117442M5858275M4956500
$$ plain form
55943 369874938 406931803 429068999 432228447 416856730 387100925 348639333 306757817
55936 306757817 265429474 227170305 193239267 163982379 139210589 118480514 101242301
55929 101242301 86930385 75037721 65141164 56880108 49944709 44088220 39123168 34894173
55921 34894173 31266102 28134670 25424923 23071654 21013185 19203293 17611776 16209140
55913 16209140 14962631 13847827 12850583 11955418 11143466 10402999 9730418 9119144 8557692
55904 8557692 8039587 7564901 7130724 6729565 6358105 6018153 5707828 5420584 5153884
55895 5153884 4910122 4687821 4480340 4284556 4102867 3935356 3777776 3628729 3491295
55886 3491295 3365913 3248650 3138103 3037365 2947597 2865821 2790140 2720545 2653198 2580618
$$ packed form
55943C69874938L7056865K2137196L159448j5371717k9755805l8461592m1881516
55936C06757817m1328343l8259169l3931038k9256888k4771790k0730075j7238213
55929A01242301j4311916j1892664r896557q261056o935399n856489m965052m228995
55921C4894173l628071l131432k709747k353269k058469j809892j591517j402636
55913A6209140j246509j114804r97244q95165q11952p40467o72581o11274n61452
55904H557692n18105m74686m34177m01159l71460l39952l10325k87244k66700
55895E153884k43762k22301k07481j95784j81689j67511j57580j49047j37434
55886C491295j25382j17263j10547j00738q9768q1776p5681o9595o7347p2580
$$ plain form
55876 2580618 2499879 2415205 2330902 2247106 2163814 2083233 2005991 1930041 1855235 1784570 1719494
55865 1719494 1658508 1601438 1550304 1504724 1461292 1418959 1380402 1346676 1315159 1284393 1256344
55854 1256344 1232024 1209164 1186164 1164392 1144627 1125014 1104305 1083616 1063293 1041596 1018151
55843 1018151 995256 974043 952726 930372 909039 890390 873280 856553 841281 828344 816448
55832 816448 804406 792974 782859 773220 763562 754770 746947 738562 729030 719852 711891 703652 693532
55819 693532 681790 669294 656302 643394 631602 620829 610122 599981 592164 586708 581670 576409
55807 576409 572515 570731 569686 568678 569095 571857 575905 580392 586012 592895 599446 604429 608052 609890
55793 609890 608019 601598 592282 581835 570354 558062 546843 538576 533495 531077 530658 530230 526738 518944
$$ packed form
55876B580618q0739q4674q4303q3796q3292q0581p7242p5950p4806p0665o5076
55865A719494o0986n7070n1134m5580m3432m2333l8557l3726l1517l0766k8049
55854A256344k4320k2860k3000k1772j9765j9613k0709k0689k0323k1697k3445
55843A018151k2895k1213k1317k2354k1333j8649j7110j6727j5272j2937j1896
55832H16448j2042j1432j0115r639r658q792p823q385r532r178p961q239j0120
55819F93532j1742j2496j2992j2908j1792j0773j0707j0141p817n456n038n261
55807E76409l894j784j045j008M17K762M048M487N620O883O551M983L623J838
55793F09890j871o421r316j0447j1481j2292j1219q267n081k418m19m28l492p794
$$ plain form
55779 518944 508476 497230 485651 474446 465767 461242 460588 463362 470344 481907 496457 511386 524075
55766 524075 531468 531022 523420 512546 501581 490763 479698 469424 460607 451874 441846 431257 421408
55753 421408 411998 402062 391638 380973 369489 357155 345660 336584 329461 323067 317509 313529 310771
55740 310771 308290 305987 304153 302300 299670 296316 292634 288517 283850 279216 275323 272456 270956 271111
55726 271111 271912 271171 267802 262968 258180 253477 248408 243593 240098 238093 237107 236834 236960 237138 237854 240369
55710 240369 245039 250625 255801 260214 263588 265179 264996 264230 263506 261923 258704 254509 250170 245400 239845
55695 239845 234211 229225 224626 220263 217023 215471 214712 213838 213510 214813 217467 220456 223623 227403 231652
55680 231652 235925 240384 245395 250762 256089 261187 265440 267687 267558 266056 264095 261498 258232 255314
$$ packed form
55779E18944j0468j1246j1579j1205q679m525o54K774O982J1563J4550J4929J2689
55766E24075P393m46p602j0874j0965j0818j1065j0274q817q733j0028j0589r849
55753D21408r410r936j0424j0665j1484j2334j1495r076p123o394n558l980k758
55740C10771k481k303j834j853k630l354l682m117m667m634l893k867j500J55
55726B71111Q01p41l369m834m788m703n069m815l495k005r86k73J26J78P16K515
55710B40369M670N586N176M413L374J591j83p66p24j583l219m195m339m770n555
55695B39845n634m986m599m363l240j552p59q74l28J303K654K989L167L780M249
55680B31652M273M459N011N367N327N098M253K247j29j502j961k597l266k918
$$ plain form
55666 255314 253383 251495 248647 245541 243602 243059 243239 243979 245499 247549 249821 252589 255924 258909 260659
55651 260659 261426 261765 261363 259724 257193 254209 250320 245043 239007 233098 227162 220590 213568 206632 199672
55636 199672 192502 185805 180490 176624 173867 172205 171352 170344 168819 167834 168221 169006 168746 167606 166689 166077
55620 166077 165048 163637 162379 160907 158353 154940 151810 149415 147254 145020 142830 140572 138151 136178
55606 136178 135354 135378 135425 135317 135226 134709 133287 131634 130968 131423 132095 132429 132475 132091 131092 130018 129635 129826 129957
55587 129957 130045 130492 131001 130936 130544 130651 131309 131878 132275 133014 134187 135566 137548 140731 144578 147760 149958
55570 149958 152220 155433 159434 163716 167942 171568 173854 174515 173739 171660 168569 165426 163161 161543 159664
55555 159664 157428 155559 154178 152501 150063 147296 144760 142662 141286 140967 141468 142074 142480 142946 143589 144212
$$ packed form
55666B55314j931j888k848l106j939n43J80P40J520K050K272K768L335K985J750
55651B60659P67L39m02j639k531k984l889n277o036n909n936o572p022o936o960
55636A99672p170o697n315l866k757j662q53j008j525r85L87P85k60j140r17o12
55620A66077j029j411j258j472k554l413l130k395k161k234k190k258k421j973
55606A36178q24K4M7j08r1n17j422j653o66M55O72L34M6l84r99j074l83J91J31
55587A29957Q8M47N09o5l92J07O58N69L97P39J173J379J982L183L847L182K198
55570A49958K262L213M001M282M226L626K286O61p76k079l091l143k265j618j879
55555A59664k236j869j381j677k438k767k536k098j376l19N01O06M06M66O43O23
$$ plain form
55539 144212 144763 145269 145440 145073 144676 144876 145404 145550 145374 145432 145495 144683 142926 141122 139678 137949 135364 132143
55521 132143 128649 124897 121027 117496 114597 112447 111500 112229 114185 116183 117592 118701 119771 120571 120948
55506 120948 121014 120631 119542 118088 116896 115716 113561 110245 106846 104317 102472 100735 99021 97467 96044
55491 96044 94899 94443 94672 94950 94745 94113 93298 92505 92188 92760 93743 94002 93256 92609 93164 94705 96234 97237
55473 97237 97886 98438 98968 99437 99657 99375 98594 97613 96712 96097 96029 96514 96930 96627 95953 95995 97111 98402 98883
55454 98883 98596 98267 98398 99040 99983 100804 101029 100540 99658 98830 98440 98772 99661 100369 100404 100260 100651 101190 100828
55435 100828 99632 99069 100165 102211 103707 103887 102960 101598 100655 100729 101470 101798 101172 100169 99470 98953 98252
55418 98252 97649 97775 98767 100186 101523 102464 102988 103533 104691 106490 108297 109583 110329 110463 109571 107574 105180
$$ packed form
55539A44212N51N06J71l67l97K00N28J46j76N8O3q12j757j804j444j729k585l221
55521A32143l494l752l870l531k899k150r47P29J956J998J409J109J070Q00L77
55506A20948O6l83j089j454j192j180k155l316l399k529j845j737j714j554j423
55491I6044j145m56K29K78k05o32q15p93l17N72R83K59p46o47N55J541J529J003
55473I7237O49N52N30M69K20k82p81r81r01o15o8M85M16l03o74M2J116J291M81
55454I8883k87l29J31O42R43Q21K25m89q82q28l90L32Q89P08L5j44L91N39l62
55435A00828j196n63J096K046J496J80r27j362r43P4P41L28o26j003o99n17p01
55418I8252o03J26R92J419J337R41N24N45J158J799J807J286P46J34q92j997k394
$$ plain form
55401 105180 103180 101703 100553 99766 99343 98863 98012 97221 97147 97716 98195 98109 97554 96759 95868 95194 95148 95737 96479
55382 96479 97008 97527 98457 99798 101065 101848 102206 102465 102759 102960 102936 102661 102139 101538 101319 101762 102242 101566 99421
55363 99421 96993 95681 95576 95710 95437 94908 94457 94200 94161 94249 94199 93990 94118 94901 95776 95937 95402 94754 94018
55344 94018 92704 90896 89426 88815 88784 88912 89081 89230 89371 89932 91300 92959 93851 93691 93174 92780 92243 91412
55326 91412 90723 90462 90347 90241 90519 91296 91961 91924 91305 90569 90047 90051 90841 92119 93184 93855 94551 95214 95009
55307 95009 93523 91551 90154 89603 89666 90202 90889 91089 90638 90265 90619 91403 92022 92463 92914 93040 92439 91483
55289 91483 91008 91367 92307 93497 94697 95750 96774 98020 99193 99509 98890 98417 98926 99801 100039 99925 100548
55272 100548 101982 103149 103487 103650 104294 105127 105567 105641 105655 105521 105021 104550 105024 106888 109437 111278 111504 110381
$$ packed form
55401A05180k000j477j150p87m23m80q51p91p4N69M79q6n55p95q91o74m6N89P42
55382I6479N29N19R30J341J267P83L58K59K94K01k4k75n22o01k19M43M80o76k145
55363I9421k428j312j05J34k73n29m51k57l9Q8n0k09J28P83Q75J61n35o48p36
55344I4018j314j808j470o11l1J28J69J49J41N61J368J659Q92j60n17l94n37q31
55326I1412o89k61j15j06K78P77O65l7o19p36n22MP90J278J065O71O96O63k05
55307I5009j486j972j397n51O3N36O87K00m51l73L54P84O19M41M51J26o01r56
55289I1483m75L59R40J190J200J053J024J246J173L16o19m73N09Q75K38j14O23
55272A00548J434J167L38J63O44Q33M40P4J4j34n00m71M74J864K549J841K26j123
$$ plain form
55254 110381 108892 107751 106971 106251 105445 104529 103470 102324 101288 100473 99788 99172 98834 99079 99910 100832 101083
55237 101083 100302 99117 98781 99868 101570 102652 102766 102281 101285 99694 98149 97650 98083 98121 96958 95248
55221 95248 93982 93369 93359 94258 96024 97679 98335 98329 98587 99310 99978 100280 100268 99876 99046 98121 97503 97073 96476
55202 96476 95812 95574 96013 96991 98263 99570 100698 101693 102691 103340 102948 101602 100503 100562 101224 101384 100985 100935
55184 100935 101728 102905 103751 103859 103175 102035 101032 100369 99597 98393 97217 96690 96800 97305 98370 99950
55168 99950 101063 100778 99721 99507 100681 102221 103184 103821 104804 106176 107491 108368 108517 107763 106411 105214
55152 105214 104690 104731 104987 105235 105214 104530 103027 101033 99063 97423 96178 95342 94975 95178 95950 97027 98021
55135 98021 98760 99241 99265 98616 97834 98107 99863 101979 103078 103201 103405 104017 104253 103545 102327 101364 100989 101255
$$ packed form
55254A10381j489j141p80p20q06r16j059j146j036q15o85o16l38K45Q31R22K51
55237A01083p81j185l36J087J702J082J14m85r96j591j545m99M33L8j163j710
55221I5248j266o13j0Q99J766J655O56oK58P23O68L02j2l92q30r25o18m30n97
55202I6476o64k38M39R78J272J307J128R95R98O49l92j346j099N9O62J60l99n0
55184A00935P93J177Q46J08o84j140j003o63p72j204j176n27J10N05J065J580
55168I9950J113k85j057k14J174J540R63O37R83J372J315Q77J49p54j352j197
55152A05214n24M1K56K48k1o84j503j994j970j640j245q36l67K03P72J077R94
55135I8021P39M81K4o49p82K73J756K116J099J23K04O12K36p08j218r63l75K66
$$ plain form
55117 101255 102169 103466 104602 105271 105646 105994 106369 106755 107208 107718 108166 108418 108267 107459 106090 104830 104362
55100 104362 104694 105408 106329 107456 108420 108675 108286 108007 108456 109598 111010 112273 113123 113635 114189 114907 115324
55083 115324 115055 114520 114411 114652 114621 114261 114168 114577 115068 115360 115593 115657 115098 114046 113431 113784 114434 114391 113559 112599
55063 112599 112027 111898 112082 112394 112644 112902 113491 114484 115458 116003 116229 116536 117150 118057 119071 119666 119102 117135
55045 117135 114489 112292 111071 110491 110022 109639 109805 110788 112093 112755 112354 111544 111297 111754 112199 112022 111237
55028 111237 110138 109008 108331 108623 109698 110472 109971 108438 107132 107105 108272 109604 110142 109921 109887 110741 112007
55011 112007 112536 111857 110622 109760 109695 110474 112080 114231 116294 117825 118952 119916 120461 120172 119314 118873 119580
54994 119580 121169 122740 123659 123867 123449 122412 121118 120505 121257 122774 123618 123188 122308 121838 121460 120480 119254
$$ packed form
55117A01255R14J297J136O69L75L48L75L86M53N10M48K52j51q08j369j260m68
55100A04362L32P14R21J127R64K55l89k79M49J142J412J263Q50N12N54P18M17
55083A15324k69n35j09K41l1l60r3M09M91K92K33O4n59j052o15L53O50m3q32r60
55063A12599n72j29J84L12K50K58N89R93R74N45K26L07O14R07J014N95n64j967
55045A17135k646k197j221n80m69l83J66R83J305O62m01q10k47M57M45j77p85
55028A11237j099j130o77K92J075P74n01j533j306k7J167J332N38k21l4Q54J266
55011A12007N29o79j235q62o5P79J606K151K063J531J127R64N45k89q58m41P07
54994A19580J589J571R19K08m18j037j294o13P52J517Q44m30q80m70l78r80j226
$$ plain form
54977 119254 118858 119580 120680 121618 122565 123597 124239 124208 123889 123724 123710 123868 124552 125832 127081 127778 128322 129451
54959 129451 131050 132130 131948 130695 129092 127724 126852 126522 126587 126732 126705 126609 126891 127883 129288 130276 130253 129475
54941 129475 128744 128614 129046 129743 130546 131447 132428 133314 133788 133740 133678 134525 136781 140119 144009 148378 153328 158684
54923 158684 164436 171291 180001 190180 200432 209654 217610 224224 229014 231403 231085 227963 222215 214520
54909 214520 205776 196549 187234 178577 171329 165356 159859 154685 150625 148162 146662 145189 143484 141707
54895 141707 139885 138169 137115 137049 137511 137888 138320 139486 141576 144016 146131 147848 149816 153025 158153
54880 158153 165042 172918 181215 189911 199045 208240 216877 224369 230007 232889 232387 228645 222494 214974
54866 214974 206856 198400 189561 180638 172539 166017 160862 156349 152307 149016 146216 143201 140046 137715
$$ packed form
54977A19254l96P22J100R38R47J032O42l1l19j65j4J58O84J280J249O97N44J129
54959A29451J599J080j82j253j603j368q72l30O5J45k7r6K82R92J405R88k3p78
54941A29475p31j30M32O97Q03R01R81Q86M74m8o2Q47K256L338L890M369M950N356
54923A58684N752O855Q710J0179J0252R222P956O614M790K389l18l122n748p695
54909B14520q744r227r315q657p248n973n497n174m060k463j500j473j705j777
54895A41707j822j716j054o6M62L77M32J166K090K440K115J717J968L209N128
54880A58153O889P876Q297Q696R134R195Q637P492N638K882n02l742o151p520
54866B14974q118q456q839q923q099o522n155m513m042l291k800l015l155k331
$$ plain form
54852 137715 136519 135379 133214 130319 127742 125969 124909 124553 124785 124925 124301 123087 121975 121198 120535 120073
54836 120073 120211 120967 121872 122640 123473 124572 125700 126374 126314 125691 125021 124762 124974 125461 126164 127022 127531 126976
54818 126976 125315 123369 121965 121303 121263 121700 122164 122028 121309 120781 120877 121142 121211 121554 122568 123615 123898 123774
54800 123774 124283 125701 127476 129350 131496 133588 134694 134338 133006 131453 130091 129190 129093 129893 131182 132313
54784 132313 132767 132425 131752 131599 132502 134280 136504 139069 141953 144851 147580 150630 154712 159913 165801
54769 165801 172137 178971 186231 193853 202181 211491 221084 229442 235394 238717 239645 238299 234716 229025
54755 229025 221537 212915 204160 196054 188724 181992 175894 170503 165607 161070 157180 154109 151447 148951
54741 148951 147296 147126 147713 147650 146770 146257 146802 147846 148898 150448 153070 156578 160675 165528 171093 176651
$$ packed form
54852A37715j196j140k165k895k577j773j060l56K32J40o24j214j112p77o63m62
54836A20073J38P56R05P68Q33J099J128O74o0o23o70k59K12M87P03Q58N09n55
54818A26976j661j946j404o62m0M37M64j36p19n28R6K65O9L43J014J047K83j24
54800A23774N09J418J775J874K146K092J106l56j332j553j362r01r7Q00J289J131
54784A32313M54l42o73j53R03J778K224K565K884K898K729L050M082N201N888
54769A65801O336O834P260P622Q328R310R593Q358N952L323R28j346l583n691
54755B29025p488q622q755q106p330o732o098n391m896m537l890l071k662k496
54741A48951j655j70N87o3q80n13N45J044J052J550K622L508M097M853N565N558
$$ plain form
54725 176651 181814 187349 194154 201915 209580 216730 223508 229342 232798 232973 230376 226069 220444 213285
54711 213285 204747 195807 187683 181004 175603 170952 166687 162822 159662 157457 155950 154288 151764 148710
54697 148710 146249 144976 144341 143634 143012 142919 142930 142041 139997 137550 135362 133403 131542 130034 129135 128728 128571
54680 128571 128453 127985 126822 125319 124436 124650 125412 125878 125810 125475 125133 124908 124858 124842 124591 124093 123634 123324 122970
54661 122970 122527 122225 122130 122050 122125 122955 124786 127043 128993 130416 131277 131275 130275 128839 127759 127244 126960 126638
54643 126638 126217 125657 125078 124918 125484 126457 127252 127754 128286 128958 129464 129568 129455 129511 129920 130477 130701 130269 129416
54624 129416 128726 128396 128017 127267 126481 126246 126697 127562 128593 129553 130086 130092 130086 130658 131675 132544 133148 133929 134986
54605 134986 135691 135490 134686 134127 134362 135323 136609 137821 138732 139378 139948 140462 140637 140155 138981 137347 135519
$$ packed form
54725A76651N163N535O805P761P665P150O778N834L456J75k597m307n625p159
54711B13285q538q940q124o679n401m651m265l865l160k205j507j662k524l054
54697A48710k461j273o35p07o22r3J1q89k044k447k188j959j861j508q99m07j57
54680A28571j18m68j163j503q83K14P62M66o8l35l42k25n0j6k51m98m59l10l54
54661A22970m43l02r5q0P5Q30J831K257J950J423Q61kj000j436j080n15k84l22
54643A26638m21n60n79j60N66R73P95N02N32O72N06J04j13N6M09N57K24m32q53
54624A29416o90l30l79p50p86k35M51Q65J031R60N33OoN72J017Q69O04P81J057
54605A34986P05k01q04n59K35R61J286J212R11O46N70N14J75m82j174j634j828
$$ plain form
54588 135519 133705 132181 131329 131362 132006 132604 132730 132650 132936 133658 134265 134391 134397 134805 135455 135686 135275 134696 134409
54569 134409 134345 134315 134520 135256 136265 136877 136850 136721 137106 137893 138441 138442 138214 138063 137716 136769 135467 134657 134906 135962
54549 135962 137190 138241 139135 139924 140572 141112 141687 142390 143196 144100 145213 146651 148372 150195 151965 153604
54533 153604 154934 155610 155420 154617 153621 152388 150443 147751 145170 143544 142641 141565 140117 139087 139056 139494
54517 139494 139389 138385 137005 136016 135865 136441 137109 137214 136826 136774 137607 138791 139284 138825 138242 138549 140081 142456
54499 142456 144977 146911 147723 147368 146377 145513 145231 145434 145667 145538 144966 144088 143044 142004 141263 141127 141636
54482 141636 142580 143811 145318 146975 148479 149654 150558 151177 151318 150993 150604 150504 150619 150815 151354 152533 154042
54465 154042 155196 155819 156406 157257 157934 157882 157304 157027 157625 158921 160275 161110 161137 160370 159100 157754 156633
$$ packed form
54588A35519j814j524q52L3O44N98J26q0K86P22O07J26OM08O50K31m11n79k87
54569A34409o4l0K05P36J009O12k7j29L85P87N48Jk28j51l47r47j302q10K49J056
54549A35962J228J051Q94P89O48N40N75P03Q06R04J113J438J721J823J770J639
54533A53604J330O76j90q03r96j233j945k692k581j626r03j076j448j030l1M38
54517A39494j05j004j380r89j51N76O68J05l88n2Q33J184M93m59n83L07J532K375
54499A42456K521J934Q12l55r91q64k82K03K33j29n72q78j044j040p41j36N09
54482A41636R44J231J507J657J504J175R04O19J41l25l89j00J15J96N39J179J509
54465A54042J154O23N87Q51O77n2n78k77N98J296J354Q35K7p67j270j346j121
$$ plain form
54448 156633 155771 154988 154019 152612 150700 148604 146982 146347 146633 147294 147808 147987 147872 147656 147729 148541 150120
54431 150120 151832 152834 152787 152088 151467 151474 152198 153303 154356 155230 156165 157402 158878 160319 161436 161931 161571
54414 161571 160542 159492 158943 158778 158553 158138 157682 157137 156305 155325 154713 154803 155499 156576 157918 159409 160916
54397 160916 162449 164073 165577 166538 166770 166561 166411 166708 167477 168203 168107 167005 165754 165333 165654 165796 165345
54380 165345 164807 164686 164914 165323 165954 166628 166921 166891 167086 167501 167311 166258 165558 166593 169134 171664 173185
54363 173185 173901 174352 174716 175074 175721 177009 179142 182075 185318 188072 190054 191992 194808 198420 201826
54348 201826 204259 205653 206043 205190 202996 199760 195823 191384 186869 183040 180399 178634 176918 174666 172007
54333 172007 169639 168264 167946 168005 167652 166695 165496 164418 163620 163252 163427 163972 164589 165282 166212 167093 167219 166380
$$ packed form
54448A56633q62p83r69j407j912k096j622o35K86O61N14J79j15k16P3Q12J579
54431A50120J712J002m7o99o21PP24J105J053Q74R35J237J476J441J117M95l60
54414A61571j029j050n49j65k25m15m56n45q32r80o12R0O96J077J342J491J507
54397A60916J533J624J504R61K32k09j50K97P69P26r6j102j251m21L21J42m51
54380A65345n38j21K28M09O31O74K93l0J95M15j90j053p00J035K541K530J521
54363A73185P16M51L64L58O47J288K133K933L243K754J982J938K816L612L406
54348B01826K433J394L90q53k194l236l937m439m515l829k641j765j716k252k659
54333A72007k368j375l18N9l53r57j199j078p98l68J75N45O17O93R30Q81J26q39
$$ plain form
54315 166380 165346 165080 165655 166292 166376 166063 165798 165540 164719 162903 160320 157674 155616 154507 154500 155472 156839
54298 156839 157778 157843 157216 156312 155456 155022 155448 156710 158076 158792 158855 158776 158840 159027 159512 160605 162176 163608
54280 163608 164469 164800 164673 163910 162479 160818 159511 158825 158755 159296 160448 162092 164054 166147 168066 169419
54264 169419 170060 170281 170504 170873 171325 171975 173141 174897 176798 178275 179246 180091 180913 181137 180126 178156 176333
54247 176333 175423 175082 174460 173276 171967 170957 170175 169294 168165 166920 165812 164985 164333 163608 162746 161954 161409
54230 161409 161004 160581 160283 160461 161275 162502 163687 164426 164613 164503 164406 164267 163791 163030 162505 162585 163098 163755 164535
54211 164535 165281 165400 164522 163194 162371 162371 162882 163730 164953 166148 166516 165766 164447 163183 162080 161034 160145
54194 160145 159516 159034 158635 158502 158767 159285 159890 160568 161207 161495 161344 161140 161264 161591 161810 162053 162771 163981
$$ packed form
54315A66380j034k66N75O37Q4l13k65k58q21j816k583k646k058j109pR72J367
54298A56839R39O5o27r04q56m34M26J262J366P16O3p9O4J87M85J093J571J432
54280A63608Q61L31j27p63j431j661j307o86p0N41J152J644J962K093J919J353
54264A69419O41K21K23L69M52O50J166J756J901J477R71Q45Q22K24j011j970j823
54247A76333r10l41o22j184j309j010p82q81j129j245j108q27o52p25q62p92n45
54230A61409m05m23k98J78Q14J227J185P39J87j10r7j39m76p61n25Q0N13O57P80
54211A64535P46J19q78j328q23%N11Q48J223J195L68p50j319j264j103j046q89
54194A60145o29m82l99j33K65N18O05O78O39K88j51k04J24L27K19K43P18J210
$$ plain form
54176 163981 165010 165183 164589 163964 163862 164143 164342 164340 164390 164539 164399 163675 162612 161671 160966 160354 159856 159614 159548
54157 159548 159472 159486 159802 160155 159895 158878 157866 157728 158454 159292 159710 159962 160586 161561 162188 161928 161183 160919 161469
54138 161469 162151 162275 162161 162655 163845 164842 164867 164134 163525 163698 164625 165753 166492 166690 166639 166657 166827 167233 168116
54119 168116 169484 170862 171837 172627 173650 174809 175775 176775 178385 180510 182199 182675 182022 180782 179350
54104 179350 177922 176611 175451 174570 174283 174663 175126 175075 174807 175114 176012 176746 177119 177845 179225 180407 180614
54087 180614 180303 180431 181179 182235 183823 186503 190095 193668 196710 199767 203800 209293 215987 223100 229709
54072 229709 235164 239192 241573 241897 239896 235850 230492 224620 218935 213985 209981 206734 203888 201118
54058 201118 198114 194807 191740 189874 189748 191113 193464 196492 199828 202920 205562 208188 211178 214275
$$ packed form
54176A63981J029J73n94o25j02K81J99kN0J49j40p24j063r41p05o12m98k42o6
54157A59548p6J4L16L53k60j017j012j38P26Q38M18K52O24R75O27k60p45k64N50
54138A61469O82J24j14M94J190R97K5p33o09J73R27J128P39J98n1J8J70M06Q83
54119A68116J368J378R75P90J023J159R66J000J610K125J689M76o53j240j432
54104A79350j428j311j160q81k87L80M63n1k68L07Q98P34L73P26J380J182K07
54087A80614l11J28P48J056J588K680L592L573L042L057M033N493O694P113O609
54072B29709N455M028K381L24k001m046n358n872n685m950m004l247k846k770
54058B01118l004l307l067j866j26J365K351L028L336L092K642K626K990L097
$$ plain form
54044 214275 217049 219549 222052 224562 227093 230052 233748 237844 241962 246515 252228 258974 265894 272646
54030 272646 279743 287512 295402 302648 309016 314554 319060 322298 324539 326518 328855 331627 334463 336954
54016 336954 338999 340742 342190 343085 343273 343017 342634 341914 340174 336937 332354 326979 321346 315747 310215
54001 310215 304655 299036 293391 287667 281764 275813 270159 264939 259958 255139 250723 246788 242975 239121
53987 239121 235758 233486 232121 231015 229993 229298 228696 227421 225166 222594 220610 219472 218782 218060 217176
53972 217176 216435 216300 216830 217492 217818 218080 218886 220170 221124 221242 220926 220911 221488 222421 223248 223515 223147 222788 223392
53953 223392 225190 227392 229170 230660 232670 235615 239051 242209 244771 247136 250009 253723 258007 262550
53939 262550 267661 274000 281737 290346 299332 308697 318534 328625 338793 349390 361064 374204 388693
$$ packed form
54044B14275K774K500K503K510K531K959L696M096M118M553N713O746O920O752
54030B72646P097P769P890P246O368N538M506L238K241J979K337K772K836K491
54016C36954K045J743J448Q95J88k56l83p20j740l237m583n375n633n599n532
54001C10215n560n619n645n724n903n951n654n220m981m819m416l935l813l854
53987B39121l363k272j365j106j022o95o02j275k255k572j984j138o90p22q84
53972B17176p41j35N30O62L26K62Q06J284R54J18l16j5N77R33Q27K67l68l59O04
53953B23392J798K202J778J490K010K945L436L158K562K365K873L714M284M543
53939B62550N111O339P737Q609Q986R365R837J0091J0168J0597J1674J3140J4489
$$ plain form
53926 388693 403777 417703 427898 432394 431370 426974 421460 415829 410305 405522 402553 401895 403113 405787
53912 405787 410332 417334 426288 435593 443950 451198 457578 462680 465685 466377 465343 463209 460175 456358
53898 456358 452084 447619 442908 437863 432682 427697 422936 417973 412190 405213 397173 388505 379452 369927
53884 369927 360058 350553 342152 334787 327807 320998 314918 310044 306043 302184 298088 293807 289418 284966
53870 284966 280676 276868 273606 270570 267302 263566 259520 255640 252374 249839 247921 246535 245534 244396
53856 244396 242378 239238 235567 232231 229627 227632 226041 224737 223555 222261 220789 219359 218348 218004
53842 218004 218221 218554 218551 218138 217601 217190 216885 216581 216256 215893 215484 215291 215840 217334 219158 220349 220657 220870
53824 220870 221922 223838 225789 227141 228150 229485 231240 232761 233449 233460 233460 233980 235211 237180 239733 242421
$$ packed form
53926C88693J5084J3926J0195M496j024m396n514n631n524m783k969o58J218K674
53912D05787M545P002Q954R305Q357P248O380N102L005O92j034k134l034l817
53898D56358m274m465m711n045n181m985m761m963n783o977q040q668r053r525
53884C69927r869r505q401p365o980o809o080m874m001l859m096m281m389m452
53870B84966m290l808l262l036l268l736m046l880l266k535j918j386j001j138
53856B44396k018l140l671l336k604j995j591j304j182j294j472j430j011l44
53842B18004K17L33lm13n37m11l05l04l25l63m09j93N49J494J824J191L08K13
53824B20870J052J916J951J352J009J335J755J521O88J1%N20J231J969K553K688
$$ plain form
53808 242421 244807 246954 249410 252680 256967 262364 268881 276120 283252 289617 295220 300506 305763 310883
53794 310883 315569 319671 323400 327214 331355 335429 338664 340649 341657 342188 342455 342429 342081 341329 339911 337556
53778 337556 334239 330098 325246 319839 314197 308582 302862 296597 289518 281898 274532 268388 264051 261224
53764 261224 258851 255956 252468 249112 246573 244880 243575 242252 240843 239523 238448 237537 236457 234874
53750 234874 232800 230657 228923 227719 226802 225933 225102 224343 223537 222633 221927 221859 222487 223402 224200 224712 224699 223784
53732 223784 222060 220457 220000 220764 222008 223255 224742 226714 228794 230392 231458 232495 233862 235295 236203
53717 236203 236411 236540 237483 239398 241433 242662 243097 243522 244555 246344 249044 252898 257647 262363 266231
53702 266231 269188 271600 273654 275446 277345 279909 283426 287736 292412 296949 300909 304049 306319 307750
$$ packed form
53808B42421K386K147K456L270M287N397O517P239P132O365N603N286N257N120
53794C10883M686M102L729L814M141M074L235J985J008N31K67k6l48p52j418k355
53778C37556l317m141m852n407n642n615n720o265p079p620p366o144m337k827
53764B61224k373k895l488l356k539j693j305j323j409j320j075r11j080j583
53750B34874k074k143j734j204r17q69q31p59q06r04p06o8O28R15P98N12j3r15
53732B23784j724j603m57P64J244J247J487J972K080J598J066J037J367J433R08
53717B36203K08J29R43J915K035J229M35M25J033J789K700L854M749M716L868
53702B66231K957K412K054J792J899K564L517M310M676M537L960L140K270J431
$$ plain form
53688 307750 308533 309065 309567 309632 308574 306368 303857 301825 300296 298983 297983 297622 297890 298444 298963 299154 298719
53671 298719 297682 296534 295643 294756 293478 291952 290540 289132 287479 286086 285925 287089 288454 289015 289008 289276
53655 289276 290045 290794 291052 290766 290024 288902 287581 286230 284776 283160 281894 281940 283767 286748 289720 292016
53639 292016 293794 295535 297569 299993 302681 305225 307185 308577 309854 311218 312236 312505 312508 313256 315098
53624 315098 317358 319340 321236 323722 326974 330502 333833 337012 340421 344278 348402 352360 355930 359484
53610 359484 363760 369115 375127 381067 386640 392072 397549 402872 407665 411735 415126 417948 420201 421748
53596 421748 422471 422529 422439 422752 423533 424125 423577 421472 418412 415537 413489 411948 410267 408278 406262 404384
53580 404384 402554 400740 398931 396908 394564 392425 391218 390831 390368 389488 388926 389236 389690 389198 387867 386843
$$ packed form
53688C07750P83N32N02O5j058k206k511k032j529j313j000l61K68N54N19J91m35
53671B98719j037j148q91q87j278j526j412j408j653j393j61J164J365N61pK68
53655B89276P69P49K58k86p42j122j321j351j454j616j266M6J827K981K972K296
53639B92016J778J741K034K424K688K544J960J392J277J364J018K69LP48J842
53624C15098K260J982J896K486L252L528L331L179L409L857M124L958L570L554
53610C59484M276N355O012N940N573N432N477N323M793M070L391K822K253J547
53596D21748P23N8r0L13P81N92n48k105l060k875k048j541j681j989k016j878
53580D04384j830j814j809k023k344k139j207l87m63q80n62L10M54m92j331j024
$$ plain form
53564 386843 386825 387450 388111 388567 388671 388210 387328 386707 387017 388360 390329 392323 393787 394477 394645 394730 394941 395373
53546 395373 396392 398407 401121 403572 405136 406176 407513 409609 412510 416224 420773 426019 431714 437611
53532 437611 443433 448943 454307 460194 467245 475502 484481 493707 503010 512514 522568 533588 545704
53519 545704 558626 572072 586226 601466 617680 634229 650752 667742 686105 706319 728214
53508 728214 751390 775493 800065 824533 848580 872385 896272 920220 943875 966918 989219
53497 989219 1010717 1031493 1051929 1072481 1093137 1113377 1132802 1151596 1170248 1189082 1208186
53486 1208186 1227555 1247011 1266196 1284882 1303110 1320789 1337437 1352767 1367388 1382392 1398131
53475 1398131 1413760 1428110 1440672 1451540 1460697 1467681 1471945 1473337 1472214 1469122 1464304 1457453 1448011
$$ packed form
53564C86843j8O25O61M56J04m61q82o21L10J343J969J994J464O90J68Q5K11M32
53546C95373J019K015K714K451J564J040J337K096K901L714M549N246N695N897
53532D37611N822N510N364N887P051Q257Q979R226R303R504J0054J1020J2116
53519E45704J2922J3446J4154J5240J6214J6549J6523J6990J8363K0214K1895
53508G28214K3176K4103K4572K4468K4047K3805K3887K3948K3655K3043K2301
53497I89219K1498K0776K0436K0552K0656K0240J9425J8794J8652J8834J9104
53486A208186J9369J9456J9185J8686J8228J7679J6648J5330J4621J5004J5739
53475A398131J5629J4350J2562J0868R157O984M264J392j123l092m818o851r442
$$ plain form
53462 1448011 1435809 1421467 1406166 1390979 1376322 1361983 1347610 1333028 1318019 1302023 1284456
53451 1284456 1265356 1245406 1225272 1205222 1185500 1166551 1148493 1130732 1112603 1094276 1076615
53440 1076615 1060307 1045551 1032517 1021600 1013142 1007200 1003548 1001563 1000196 998603 996958 996271 997256
53427 997256 999698 1003013 1007006 1011821 1017480 1023841 1030945 1039158 1048967 1060744 1074668 1090811 1109234
53414 1109234 1129816 1151937 1174574 1197072 1219723 1243334 1268330 1294581 1321941 1350491 1380308
53403 1380308 1411508 1444591 1480278 1518852 1560028 1603502 1649161 1696700 1745613 1795826 1847751
53392 1847751 1901328 1955558 2009480 2063212 2117497 2172532 2227821 2282907 2337533 2391097 2442570
53381 2442570 2491193 2536841 2579626 2619486 2656364 2690420 2721768 2750064 2774552 2794447 2809270
$$ packed form
53462A448011j2202j4342j5301j5187j4657j4339j4373j4582j5009j5996j7567
53451A284456j9100j9950k0134k0050j9722j8949j8058j7761j8129j8327j7661
53440A076615j6308j4756j3034j0917q458n942l652j985j367j593j645o87R85
53427I97256K442L315L993M815N659O361P104Q213R809J1777J3924J6143J8423
53414A109234K0582K2121K2637K2498K2651K3611K4996K6251K7360K8550K9817
53403A380308L1200L3083L5687L8574M1176M3474M5659M7539M8913N0213N1925
53392A847751N3577N4230N3922N3732N4285N5035N5289N5086N4626N3564N1473
53381B442570M8623M5648M2785L9860L6878L4056L1348K8296K4488J9895J4823
$$ plain form
53370 2809270 2818915 2823564 2823469 2818730 2809117 2793997 2772392 2743337 2706540 2662910 2614406 2563223 2510951
53357 2510951 2458325 2405649 2353329 2301828 2251144 2200707 2150221 2100570 2053389 2009559 1968442
53346 1968442 1928751 1889742 1851234 1812849 1773946 1734358 1694751 1656088 1619033 1583941 1551059
53335 1551059 1520484 1492133 1465992 1442297 1421199 1402368 1385257 1369817 1356649 1346101 1337304
53324 1337304 1328435 1318098 1306240 1293572 1280358 1266205 1251058 1235927 1222267 1210752 1200852 1191603
53312 1191603 1182628 1174429 1167845 1163360 1160879 1160020 1160366 1161437 1162689 1163935 1165739 1169144 1174884 1183052
53298 1183052 1193505 1206254 1221237 1237986 1255881 1274766 1295141 1317677 1342637 1369676 1398038
53287 1398038 1426790 1454984 1481809 1506828 1530098 1551883 1572147 1590485 1606606 1620649 1632788
$$ packed form
53370B809270R645M649r5m739r613j5120k1605k9055l6797m3630m8504n1183n2272
53357B510951n2626n2676n2320n1501n0684n0437n0486m9651m7181m3830m1117
53346A968442l9691l9009l8508l8385l8903l9588l9607l8663l7055l5092l2882
53335A551059l0575k8351k6141k3695k1098j8831j7111j5440j3168j0548q797
53324A337304q869j0337j1858j2668j3214j4153j5147j5131j3660j1515r900r249
53312A191603q975q199o584m485k481q59L46J071J252J246J804L405N740Q168
53298A183052J0453J2749J4983J6749J7895J8885K0375K2536K4960K7039K8362
53287A398038K8752K8194K6825K5019K3270K1785K0264J8338J6121J4043J2139
$$ plain form
53276 1632788 1642744 1649971 1654205 1655464 1653688 1648853 1641442 1632259 1621609 1609073 1594224 1577099 1557781
53263 1557781 1535955 1511312 1484161 1455416 1426210 1397591 1370090 1343192 1315677 1286972 1257885
53252 1257885 1229602 1202303 1175372 1148705 1123061 1098987 1076017 1053129 1029581 1005184 980157
53241 980157 955062 930614 907290 885129 863942 843575 823940 805073 787210 770641 755380
53230 755380 741225 728226 716828 707277 698981 690788 681983 672836 664041 655660 646903 637000 625973
53217 625973 614255 601795 588049 572918 557183 541762 527002 512988 500117 488861 479149 470446
53205 470446 462316 454549 446976 439564 432528 425815 418690 410503 401793 393922 387409 381310 374545 367210
53191 367210 360075 353278 346218 338665 331356 325324 320910 317521 314260 310715 307133 303856 300739 297361
$$ packed form
53276A632788R956P227M234J259j776m835p411r183j0650j2536j4849j7125j9318
53263A557781k1826k4643k7151k8745k9206k8619k7501k6898k7515k8705k9087
53252A257885k8283k7299k6931k6667k5644k4074k2970k2888k3548k4397k5027
53241I80157k5095k4448k3324k2161k1187k0367j9635j8867j7863j6569j5261
53230G55380j4155j2999j1398r551q296q193q805r147q795q381q757r903j1027
53217F25973j1718j2460j3746j5131j5735j5421j4760j4014j2871j1256r712q703
53205D70446q130p767p573p412p036o713p125q187q710p871o513o099o765p335
53191C67210p135o797p060p553p309o032m414l389l261l545l582l277l117l378
$$ plain form
53177 297361 293810 290846 289112 288403 287931 287104 285816 284195 282395 280567 278754 276846 274811 272956 271751
53162 271751 271363 271494 271641 271420 270749 269832 268983 268334 267761 267115 266391 265566 264510 263277 262300 261916 261780 261199
53144 261199 260117 259352 259618 260620 261446 261625 261488 261577 262077 262807 263449 263658 263280 262632 262391 262984 264184 265453
53126 265453 266534 267483 268228 268494 268276 268085 268447 269239 269738 269366 268263 267040 266102 265342 264500 263637 263087 262958
53108 262958 262888 262426 261551 260606 259800 258953 257839 256604 255661 255180 254791 253902 252374 250826 250079 250305 250935 251509
53090 251509 252261 253582 255236 256552 257256 257605 257775 257716 257647 257927 258193 257335 254945 252287 251162 252039 253874
53073 253874 255441 256181 255932 254706 253009 251753 251468 251866 252322 252485 252295 251748 250840 249577 247915 245975
53057 245975 244339 243749 244342 245402 246064 246061 245783 245927 247174 249717 252826 255248 256377 256755 257078 257115 256141
$$ packed form
53177B97361l551k964j734p09m72q27j288j621j800j828j813j908k035j855j205
53162B71751l88J31J47k21o71r17q49o49n73o46p24q25j056j233r77l84j36n81
53144B61199j082p65K66J002Q26J79j37Q9N00P30O42K09l78o48k41N93J200J269
53126B65453J081R49P45K66k18j91L62P92M99l72j103j223r38p60q42q63n50j29
53108B62958p0m62q75r45q06q47j114j235r43m81l89q89j528j548p47K26O30N74
53090B51509P52J321J654J316P04L49J70n9o9K80K66q58k390k658j125Q77J835
53073B53874J567P40k49j226j697j256k85L98M56J63j90n47r08j263j662j940
53057B45975j636n90N93J060O62lk78J44J247K543L109K422J129L78L23L7r74
$$ plain form
53040 256141 254225 252380 251324 250659 249614 248216 247318 247572 248786 250253 251372 251803 251378 250248 249077
53025 249077 248668 249191 250021 250503 250655 250937 251577 252511 253752 255315 256855 257899 258550 259421 260741 262036 262994
53008 262994 264070 265721 267511 268569 268727 268526 268267 267745 266937 266242 265817 265280 264484 264036 264528 265566 266159
52991 266159 265985 265769 266350 267830 269720 271554 273118 274344 275333 276417 277957 280013 282283 284411 286264
52976 286264 287938 289581 291303 293238 295567 298262 300726 301900 301039 298531 295788 294156 293971 294635 295379
52961 295379 295777 295716 295230 294403 293282 291900 290474 289467 289158 289159 288644 287145 284951 282722 280900 279511 278222
52944 278222 276586 274523 272645 271715 271686 271726 271345 270962 270963 270795 269701 267966 266661 266216 266067 265750 265550 265805
52926 265805 266241 266473 266675 267237 268056 268583 268478 267896 267293 267141 267630 268399 268786 268619 268534 269145 270083 270331 269472
$$ packed form
53040B56141j916j845j056o65j045j398q98K54J214J467J119M31m25j130j171
53025B49077m09N23Q30M82J52K82O40R34J241J563J540J044O51Q71J320J295R58
53008B62994J076J651J790J058J58k01k59n22q08o95m25n37p96m48M92J038N93
52991B66159j74k16N81J480J890J834J564J226R89J084J540K056K270K128J853
52976B86264J674J643J722J935K329K695K464J174q61k508k743j632j85O64P44
52961B95379L98o1m86q27j121j382j426j007l09Jn15j499k194k229j822j389j289
52944B78222j636k063j878r30k9M0l81l83Jj68j094j735j305m45j49l17k00K55
52926B65805M36K32K02N62Q19N27j05n82o03j52M89P69L87j67q5O11R38K48q59
$$ plain form
52907 269472 268203 267509 267631 268000 267984 267471 266749 265990 265033 263795 262726 262494 263107 263718 263582 262940 262598 262881
52889 262881 263446 264049 264901 266142 267439 268407 269112 269823 270467 270667 270218 269318 268408 267957 268272 269201 270095 270377
52871 270377 270225 270408 271410 273018 274902 277197 280148 283381 286016 287567 288336 288752 288696 287780 286100 284303
52855 284303 282877 281606 279847 277196 273788 270064 266380 262881 259672 256958 254907 253426 252223 251128
52841 251128 250175 249333 248396 247297 246329 245794 245572 245267 244745 244299 244287 244847 245905 247204 248251 248500 247711 246109
52823 246109 244170 242350 240919 239854 238910 237968 237288 237258 237960 239172 240704 242513 244612 247150 250415 254300
52807 254300 257835 259760 259669 258133 255705 252408 248373 244302 240829 237867 235103 232744 231264 230668 230540
52792 230540 230639 230903 231043 230710 230071 229746 230118 231104 232564 234494 236752 239023 241133 243091 244751 245874
$$ packed form
52907B69472j269o94J22L69j6n13p22p59r57j238j069k32O13O11j36o42l42K83
52889B62881N65O03Q52J241J297R68P05P11O44K00m49r00r10m51L15R29Q94K82
52871B70377j52J83J002J608J884K295K951L233K635J551P69M16n6r16j680j797
52855B84303j426j271j759k651l408l724l684l499l209k714k051j481j203j095
52841B51128r53q42r37j099r68n35k22l05n22m46j2N60J058J299J047K49p89j602
52823B46109j939j820j431j065r44r42o80l0P02J212J532J809K099K538L265L885
52807B54300L535J925r1j536k428l297m035m071l473k962k764k359j480n96j28
52792B30540R9K64J40l33o39l25L72R86J460J930K258K271K110J958J660J123
$$ plain form
52776 245874 246589 247328 248139 248497 248101 247440 247165 247197 246910 246098 245198 244535 243824 242693 241393 240569 240441 240549
52758 240549 240434 240210 240224 240405 240367 240105 240094 240566 241122 241387 241689 242704 244616 247078 249850 252943 256121 258782
52740 258782 260585 261869 263275 265158 267497 270027 272275 273742 274412 274963 276232 278424 280924 282816 283541
52725 283541 283206 282365 281398 280143 278363 276511 275541 275685 275898 274976 273014 271183 270216 269687 268831 267452 265787
52708 265787 264012 262360 261341 261326 261954 262358 261994 261035 260078 259784 260672 262770 265310 267155 267712 267236 266268
52691 266268 265221 264651 265301 267292 269582 270873 270978 270802 270983 271132 270522 269005 266986 264938 263281 262376
52675 262376 262220 262285 261993 261242 260289 259300 258296 257374 256659 256171 256027 256625 258214 260400 262469 264254 266251
52658 266251 268773 271420 273647 275572 277902 281105 284867 288302 290531 291127 290154 287977 285064 281954 279196
$$ packed form
52776B45874P15P39Q11L58l96o61k75L2k87q12r00o63p11j131j300q24j28J08
52758B40549j15k24J4J81l8k62j1M72N56K65L02J015J912K462K772L093L178K661
52740B58782J803J284J406J883K339K530K248J467O70N51J269K192K500J892P25
52725B83541l35q41r67j255j780j852r70J44K13r22j962j831r67n29q56j379j665
52708B65787j775j652j019j5O28M04l64r59r57k94Q88K098K540J845N57m76r68
52691B66268j047n70O50J991K290J291J05j76J81J49o10j517k019k048j657r05
52675B62376j56O5k92p51r53r89j004r22p15m88j44N98J589K186K069J785J997
52658B66251K522K647K227J925K330L203L762L435K229N96r73k177k913l110k758
$$ plain form
52643 279196 277066 275361 273638 271764 270056 268891 268313 268099 268083 268267 268726 269459 270327 271110 271753 272485 273490
52626 273490 274410 274393 272885 270246 267447 265218 263650 262481 261511 260694 260045 259604 259435 259552 259908 260485 261377
52609 261377 262712 264507 266577 268600 270260 271418 272159 272658 273018 273289 273642 274319 275340 276337 276900 277082
52593 277082 277424 278420 280016 281644 282635 282653 281934 281171 280973 281338 281796 282105 282507 283173 283776 283904 283589 283022
52575 283022 282090 280728 279495 279050 279104 278678 277526 276437 275831 274958 273181 271301 270637 271194 271731 271540 271219
52558 271219 271487 272087 272215 271487 270121 268565 267262 266501 266186 265958 265763 265993 266852 267805 268015 267201 265890
52541 265890 264855 264466 264515 264499 264070 263303 262577 262237 262406 262993 263769 264488 265105 265807 266678 267560 268424 269654 271532
52522 271532 273563 274816 274971 274558 274162 273931 274007 274818 276516 278654 280868 283573 287433 292274 297004 300536
$$ packed form
52643B79196k130j705j723j874j708j165n78k14j6J84M59P33Q68P83O43P32J005
52626B73490R20j7j508k639k799k229j568j169r70q17o49m41j69J17L56N77Q92
52609B61377J335J795K070K023J660J158P41M99L60K71L53O77J021R97N63J82
52593B77082L42R96J596J628R91J8p19p63j98L65M58L09M02O66O03J28l15n67
52575B83022r32j362j233m45N4m26j152j089o06q73j777j880o64N57N37j91l21
52558B71219K68O00J28p28j366j556j303p61l15k28j95K30Q59R53K10q14j311
52541B65890j035l89M9j6m29p67p26l40J69N87P76P19O17P02Q71Q82Q64J230J878
52522B71532K031J253J55m13l96k31P6Q11J698K138K214K705L860M841M730L532
$$ plain form
52506 300536 302511 303238 303335 303371 303437 303012 301486 298848 295629 292252 288756 285205 281959 279394 277610 276587
52490 276587 276359 276770 277215 277065 276380 275959 276478 277807 279348 280836 282439 284131 285521 286478 287525 289151
52474 289151 291062 292607 293770 295166 297057 298982 300541 302012 303938 306529 309678 313105 316136 317833
52460 317833 317868 317011 316306 315953 315362 314011 311711 308302 303776 298779 294355 291014 288440 286183 284193 282508
52444 282508 280888 279126 277421 276111 275196 274389 273586 273040 273082 273692 274306 274134 272900 271279 270340 270456 271069
52427 271069 271631 272349 273565 274761 274845 273557 272077 271896 273335 275505 277539 279390 281366 283319 284721
52412 284721 285429 286043 287409 290004 293899 299069 305516 313176 321909 331479 341294 350140 356493 359282 358444
52397 358444 354702 348987 342097 334756 327715 321633 316845 313326 310882 309372 308722 308814 309426 310279 311021 311280
$$ packed form
52506C00536J975P27R7L6O6m25j526k638l219l377l496l551l246k565j784j023
52490B76587k28M11M45j50o85m21N19J329J541J488J603J692J390R57J047J626
52474B89151J911J545J163J396J891J925J559J471J926K591L149L427L031J697
52460C17833L5q57p05l53n91j351k300l409m526m997m424l341k574k257j990j685
52444B82508j620j762j705j310r15q07q03n46M2O10O14j72j234j621r39J16O13
52427B71069N62P18J216J196Q4j288j480j81J439K170K034J851J976J953J402
52412B84721P08O14J366K595L895N170O447P660Q733R570R815Q846O353K789q38
52397C58444l742n715o890p341p041o082m788l519k444j510o50R2O12Q53P42K59
$$ plain form
52381 311280 311006 310799 311560 313551 315973 317780 318855 320121 322520 326200 330742 335795 341227 346829 352196
52366 352196 356863 360431 362587 363230 362650 361464 360256 359286 358524 357914 357551 357624 358221 359169 360070 360594 360847
52349 360847 361447 363050 365688 368662 371239 373363 375510 377908 380210 382055 383677 385764 388790 392733
52335 392733 397384 402692 408778 415760 423713 432729 442928 454318 466604 479272 492028 505154 519297
52322 519297 534890 551921 570179 589336 608674 627203 644439 660871 677333 694186 711471
52311 711471 729573 749035 769708 790767 811727 832940 854772 876852 898592 920041 941666
52300 941666 963368 984296 1003642 1021261 1037440 1052343 1065729 1076881 1084722 1088378 1087896 1084353
52288 1084353 1079101 1072952 1066114 1058650 1050787 1042824 1034930 1027079 1019135 1011100 1003369 996702 991825 989021
$$ packed form
52381C11280k74k07P61J991K422J807J075J266K399L680M542N053N432N602N367
52366C52196M667L568K156O43n80j186j208r70p62o10l63P3N97R48R01N24K53
52349C60847O00J603K638K974K577K124K147K398K302J845J622K087L026L943
52335C92733M651N308O086O982P953R016J0199J1390J2286J2668J2756J3126J4143
52322E19297J5593J7031J8258J9157J9338J8529J7236J6432J6462J6853J7285
52311G11471J8102J9462K0673K1059K0960K1213K1832K2080K1740K1449K1625
52300I41666K1702K0928J9346J7619J6179J4903J3386J1152P841L656m82l543
52288A084353n252o149o838p464p863p963p894p851p944q035p731o667m877k804
$$ plain form
52274 989021 988095 988674 990455 993274 997082 1001900 1007806 1014954 1023510 1033339 1043721 1053667 1062838 1072083
52260 1072083 1082780 1095716 1110780 1127625 1146064 1165737 1185929 1206062 1226011 1245534 1263753
52249 1263753 1279729 1293335 1304952 1314403 1320920 1324296 1325368 1324999 1323097 1319111 1313075 1305544 1296778
52236 1296778 1286617 1275133 1262860 1250249 1237314 1223985 1210476 1197139 1184256 1172059 1160668
52225 1160668 1149777 1138729 1127281 1116153 1106491 1098805 1092634 1087183 1081964 1076859 1072029 1068013 1065584
52212 1065584 1065067 1065926 1067336 1069143 1071871 1075745 1080177 1084407 1088250 1091920 1095494 1099096 1103340 1108886
52198 1108886 1115548 1122411 1128998 1135776 1143322 1151521 1159885 1168103 1175800 1182255 1186975 1190308 1192850 1194340
52184 1194340 1193787 1190677 1185495 1178983 1171409 1162767 1153223 1143132 1132926 1123182 1114428 1106624 1099153 1091585
$$ packed form
52274I89021r26N79J781K819L808M818N906P148Q556R829J0382R946R171R245
52260A072083J0697J2936J5064J6845J8439J9673K0192K0133J9949J9523J8219
52249A263753J5976J3606J1617R451O517L376J072l69j902l986o036p531q766
52236A296778j0161j1484j2273j2611j2935j3329j3509j3337j2883j2197j1391
52225A160668j0891j1048j1448j1128r662p686o171n451n219n105m830m016k429
52212A065584n17Q59J410J807K728L874M432M230L843L670L574L602M244N546
52198A108886O662O863O587O778P546Q199Q364Q218P697O455M720L333K542J490
52184A194340n53l110n182o512p574q642r544j0091j0206r744q754p804p471p568
$$ plain form
52170 1091585 1084209 1077630 1072145 1067816 1064812 1063243 1062810 1063079 1064070 1066161 1069312 1072741 1075565 1077538 1078985
52155 1078985 1080172 1080925 1080833 1079697 1077776 1075687 1074063 1073264 1073328 1074152 1075640 1077667 1079952 1082039 1083432 1083785
52139 1083785 1083085 1081722 1080331 1079378 1078879 1078664 1078997 1080796 1084973 1091639 1100203 1110263 1122082 1136085
52125 1136085 1152260 1170333 1190235 1212003 1235293 1259470 1284240 1309830 1336439 1363800 1391472
52114 1391472 1419261 1447115 1474817 1502063 1528653 1554262 1578116 1599369 1618004 1635078 1651782
$$ packed form
52170A091585p376o579n485m329l004j569m33K69R91K091L151L429K824J973J447
52155A078985J187P53r2j136j921k089j624p99O4Q24J488K027K285K087J393L53
52139A083785p00j363j391r53m99k15L33J799M177O666Q564J0060J1819J4003
52125A136085J6175J8073J9902K1768K3290K4177K4770K5590K6609K7361K7672
52114A391472K7789K7854K7702K7246K6590K5609K3854K1253J8635J7074J6704
$$ [...]
##END NTUPLES=NMR SPECTRUM
##END=
