##TITLE=AC1445_MSMAH13254_7819446_XAmqYB4Ni6
##JCAMPDX= 6.0         $$ Bruker NMR JCAMP-DX V2.0
##DATA TYPE= NMR SPECTRUM
##DATA CLASS= NTUPLES
##ORIGIN= BRUKER
##OWNER= Administrator
$$ 1.72 TOPSPIN		Version 2.1
$$ 2013-05-01 00:35:31.211 -0700  Administrator@X
$$ Compression mode = diff/dup
##.OBSERVE FREQUENCY= 400.02188249412
##.OBSERVE NUCLEUS= ^1H
##.ACQUISITION MODE= SIMULTANEOUS (DQD)
##.ACQUISITION SCHEME= undefined
##.AVERAGES= 8
##.DIGITISER RES= 22
##SPECTROMETER/DATA SYSTEM= spect
##.PULSE SEQUENCE= zg30
##.SOLVENT NAME= COFFEE_meoh
##.SHIFT REFERENCE= INTERNAL, COFFEE_meoh, 1, 14.98509
##AUDIT TRAIL= $$ (NUMBER, WHEN, WHO, WHERE, PROCESS, VERSION, WHAT)
$$ ##TITLE= Audit trail, TOPSPIN		Version 2.1
$$ ##JCAMPDX= 5.01
$$ ##ORIGIN= Bruker BioSpin GmbH
$$ ##OWNER= Administrator
$$ $$ E:\/data/COFFEE/nmr/AC1445_MSMAH13254_7819446_XAmqYB4Ni6/10/pdata/1/auditp.txt
$$ ##AUDIT TRAIL=  $$ (NUMBER, WHEN, WHO, WHERE, PROCESS, VERSION, WHAT)
(   1,<2013-05-01 00:35:24.539 -0700>,<Administrator>,<X>,<go>,<TOPSPIN 2.1>,
      <created by zg
	started at 2013-05-01 00:34:18.618 -0700,
	POWCHK enabled, PULCHK disabled,
       configuration hash MD5:
       F7 49 AB AC A2 8D 51 76 73 8D C1 9A A6 38 9F DE
       data hash MD5: 64K
       48 8A 3B E8 2A 99 DC D0 95 4C C5 AB F3 CB 1F 76>)
(   2,<2013-05-01 00:35:27.461 -0700>,<Administrator>,<X>,<proc1d>,<TOPSPIN 2.1>,
      <Start of raw data processing
       efp LB = 0 FT_mod = 6 PKNL = 1 PHC0 = 0 PHC1 = 0 SI = 32K 
       data hash MD5: 32K
       40 73 47 11 4B 49 4B D6 DD F5 E3 ED 32 C0 70 BB>)
(   3,<2013-05-01 00:35:27.758 -0700>,<Administrator>,<X>,<proc1d>,<TOPSPIN 2.1>,
      <pk PHC0 = 98.38257 PHC1 = 0 
       data hash MD5: 32K
       9F 89 55 6D AF D5 2F 4E DB EC B6 84 71 F9 55 42>)
(   4,<2013-05-01 00:35:27.868 -0700>,<Administrator>,<X>,<proc1d>,<TOPSPIN 2.1>,
      <abs ABSG = 1 
       data hash MD5: 32K
       7A F6 11 73 06 40 E7 DF C4 F2 22 FE 9D 6D 8A 87>)
(   5,<2013-05-01 00:35:27.977 -0700>,<Administrator>,<X>,<proc1d>,<TOPSPIN 2.1>,
      <abs ABSG = 2 
       data hash MD5: 32K
       B1 AA D0 29 AE CB 88 C2 19 CA C2 7D 90 EF EE A4>)
(   6,<2013-05-01 00:35:28.039 -0700>,<Administrator>,<X>,<proc1d>,<TOPSPIN 2.1>,
      <abs ABSG = 3 
       data hash MD5: 32K
       35 4B D8 0C FE 71 C4 4B D6 DC E0 DE E1 90 1B 23>)
(   7,<2013-05-01 00:35:28.086 -0700>,<Administrator>,<X>,<proc1d>,<TOPSPIN 2.1>,
      <abs ABSG = 4 
       data hash MD5: 32K
       4C F6 05 5C 8A 13 11 66 19 39 F1 F9 8D 7F 85 F4>)
(   8,<2013-05-01 00:35:28.133 -0700>,<Administrator>,<X>,<proc1d>,<TOPSPIN 2.1>,
      <abs ABSG = 5 
       data hash MD5: 32K
       ED 74 46 9B 9A E7 EE A3 01 A6 E2 65 0D C4 9B 07>)
$$ ##END=
$$ 
$$ $$ hash MD5
$$ $$ 94 0C 76 5E 25 11 F4 E8 AE 77 B9 71 52 B1 27 F7
##$RELAX= 
##$RELAX= 
##$RELAX= 
##$RELAX= 
##$RELAX= 
##$RELAX= 
##$RELAX= 
$$ Bruker specific parameters
$$ --------------------------
##$DU= <E:\>
##$EXPNO= 10
##$NAME= <AC1445_MSMAH13254_7819446_XAmqYB4Ni6>
$$ [...]
##$TP= (0..7)
150 150 150 150 150 150 150 150
##$TP07= 0
##$TPNAME0= <>
##$TPNAME1= <>
##$TPNAME2= <>
##$TPNAME3= <>
##$TPNAME4= <>
##$TPNAME5= <>
##$TPNAME6= <>
##$TPNAME7= <>
##$TPOAL= (0..7)
0.5 0.5 0.5 0.5 0.5 0.5 0.5 0.5
##$TPOFFS= (0..7)
0 0 0 0 0 0 0 0
##$TUNHIN= 0
##$TUNHOUT= 0
##$TUNXOUT= 0
##$USERA1= <user>
##$USERA2= <user>
##$USERA3= <user>
##$USERA4= <user>
##$USERA5= <user>
##$V9= 5
##$VALIST= <valist>
##$VCLIST= <CCCCCCCCCCCCCCC>
##$VD= 0
##$VDLIST= <DDDDDDDDDDDDDDD>
##$VPLIST= <PPPPPPPPPPPPPPP>
##$VTLIST= <TTTTTTTTTTTTTTT>
##$WBST= 1024
##$WBSW= 4
##$XGAIN= (0..3)
0 0 0 0
##$XL= 0
##$YL= 0
##$YMAX_a= 658913
##$YMIN_a= -560420
##$ZGOPTNS= <>
##$ZL1= 120
##$ZL2= 120
##$ZL3= 120
##$ZL4= 120
##$ABSF1= 14.98509
##$ABSF2= -5.573092
##$ABSG= 5
##$ABSL= 3
##$ALPHA= 0
##$AQORDER= 0
##$ASSFAC= 0
##$ASSFACI= 0
##$ASSFACX= 0
##$ASSWID= 0
##$AUNMP= <proc_prof1d_extract_pilot.lims>
##$AXLEFT= 0
##$AXNAME= <>
##$AXNUC= <1H>
##$AXRIGHT= 0
##$AXTYPE= 0
##$AXUNIT= <>
##$AZFE= 0.1
##$AZFW= 0.1
##$BCFW= 0
##$BC_mod= 0
##$BYTORDP= 0
##$COROFFS= 0
##$CY= 15
##$DATMOD= 1
##$DC= 0
##$DFILT= <>
##$DTYPP= 0
##$F1P= 0
##$F2P= 0
##$FCOR= 0.5
##$FTSIZE= 32768
##$FT_mod= 6
##$GAMMA= 0
##$GB= 0
##$INTBC= 1
##$INTSCL= 1
##$ISEN= 128
##$LB= 0
##$LEV0= 0
##$LPBIN= 0
##$MAXI= 10000
##$MC2= 0
##$MEAN= 0
##$ME_mod= 0
##$MI= 0
##$NCOEF= 0
##$NC_proc= -8
##$NLEV= 6
##$NOISF1= 0
##$NOISF2= 0
##$NSP= 0
##$NTH_PI= 0
##$NZP= 0
##$OFFSET= 14.98509
##$PC= 1
##$PHC0= 98.38257
##$PHC1= 0
##$PH_mod= 1
##$PKNL= yes
##$PPARMOD= 0
##$PPDIAG= 0
##$PPIPTYP= 0
##$PPMPNUM= 2147483647
##$PPRESOL= 1
##$PSCAL= 4
##$PSIGN= 0
##$PYNMP= <proc.py>
##$REVERSE= no
##$SF= 400.02
##$SI= 32768
##$SIGF1= 0
##$SIGF2= 0
##$SINO= 400
##$SIOLD= 32768
##$SPECTYP= <>
##$SREGLST= <1H.CDCl3>
##$SSB= 0
##$STSI= 32768
##$STSR= 0
##$SW_p= 8223.68421052631
##$SYMM= 0
##$S_DEV= 0
##$TDeff= 65536
##$TDoff= 0
##$TI= <>
##$TILT= no
##$TM1= 0
##$TM2= 0
##$TOPLEV= 0
##$USERP1= <user>
##$USERP2= <user>
##$USERP3= <user>
##$USERP4= <user>
##$USERP5= <user>
##$WDW= 1
##$XDIM= 32768
##$YMAX_p= 458110616
##$YMIN_p= -726047
##$CURPLOT= <Network HP LaserJet P1505>
##$CURPRIN= <$Network HP LaserJet P1505>
##$DFORMAT= <normdp>
##$LAYOUT= <+/1D_H.xwp>
##$LFORMAT= <normlp>
##$PFORMAT= <normpl>
##$SURQMSG= 1
$$ End of Bruker specific parameters
$$ ---------------------------------
##NTUPLES= NMR SPECTRUM
##VAR_NAME=  FREQUENCY,     SPECTRUM/REAL,   SPECTRUM/IMAG
##SYMBOL=    X,             R,               I
##VAR_TYPE=  INDEPENDENT,   DEPENDENT,       DEPENDENT
##VAR_FORM=  AFFN,          ASDF,            ASDF
##VAR_DIM=   32768,         32768,           32768
##UNITS=     HZ,            ARBITRARY UNITS, ARBITRARY UNITS
##FACTOR=    0.250966925370066, 1,           1
##FIRST=     8223.43324360094, -54895,       78142
##LAST=      0,             26959,           -40939
##MIN=       0,             -726047,         0
##MAX=       8223.43324360094, 458110616,    0
$$ Real data points
##PAGE= N=1
##DATA TABLE= (X++(R..R)), XYDATA
$$ [...]
$$ plain form
19554 163976 -126209 -163326 -153040 144405 83668 -166088 -19864 -25211 29890 125531 -140236
19542 61591 11160 -93944 -127110 -399907 186455 -327399 -75977 -340059 -89074 125536 404796
19531 404796 -218551 -227862 -43079 -193575 -402439 -196378 -237791 22050 -75944 -109233 232967
19519 99482 -220511 -120349 101052 73778 -219211 -18934 151329 4163 -165006 -345188
19509 -345188 -129642 -35903 -235422 -312154 175761 60507 34671 43031 -284922 -10170 133092
19497 84930 64333 -251898 -208429 207281 18953 -52947 270613 -90012 87614 87403 -7289 -6073
19485 -6073 45433 -123228 -61317 -103139 -100876 9090 -234008 -222198 -86037 29520 364075 -109295
19472 -247322 -131026 -13209 109866 -95637 -338689 167772 102273 -127251 -275614 -98227
$$ packed form
19554A63976a26209l7117J0286A44405o0737a66088a9864n347B9890R5641a40236
19542F1591A1160i3944l3166k72797A86455c27399g5977k64082h9074A25536K79260
19531D04796b18551r311d3079j50496k08864a96378m1413B2050g5944l3289B32967
19519I9482b20511J00162A01052k7274b19211a8934A51329D163a65006j80182
19509c45188a29642c5903j99519p6732A75761F0507k5836Q360b84922a0170A33092
19497H4930k0597b51898M3469B07281A8953e2947B70613i0012H7614k11g289J216
19485f073D5433a23228f1317m1822K263I090b34008J1810h6037B9520L34555a09295
19472b47322J16296a3209A09866i5637k43052A67772o5499a27251j48363i8227
$$ plain form
19461 -382471 -73187 -348984 229024 -76916 -161112 -56385 -24771 80765 -122520 -24818 -184914
19450 -184914 -9718 210271 -145069 -81774 28536 -54009 62554 -241948 -86672 -638 121460
19438 -169402 -165773 -43793 -6259 213887 268425 -22901 -76468 -73480 -124881 -123467 297670 -247558
19425 -246876 12202 -182967 -160721 192001 -432548 -317214 -49887 -453621 149803 312692
19415 312692 83566 -47800 -139260 70146 203140 -31655 -63486 -240347 -19116 262135 -143628
19403 -368935 -5299 -438727 -155382 -94258 248019 -411453 -74964 -270835 -161607 -108305
19393 -108305 -220006 58900 68309 -44908 63613 -199885 -264784 -150950 -269906 -307119 12783
19381 48826 206205 254239 189507 -121607 -48611 36820 -73502 142004 -274046 150666 -158236
$$ packed form
19461c82471g3187k75797B29024g6916q4196e6385b4771H0765a22520b4818j60096
19450a84914i718B10271a45069O3295B8536e4009F2554b41948h6672f38A21460
19438a69402L629d3793f259B13887N4538b2901n3567K988n1401J414B97670b47558
19425b46876A2202a82967K2246A92001d32548J15334d9887m03734A49803J62889
19415C12692H3566d7800r1460G0146J32994c1655l1831j76861a9116B62135a43628
19403c68935e299m33428a55382O1124B48019d11453g4964j95871J09228N3302
19393a08305j11701E8900R409d4908F3613a99885o4899J13834j18956l7213A2783
19381D8826J57379M8034o4732a21607d8611C6820g3502A42004b74046A50666a58236
$$ plain form
19369 67193 -149081 -186328 -164770 105427 230858 -79519 -229186 -117117 66046 241384
19359 241384 307067 14108 -221478 188483 163819 -68394 -41823 -228937 -127240 -21078 -137465
19348 -137465 -9934 51799 -177796 -88630 -172525 -162499 143500 -151039 -266853 202973 -368507
19336 -474453 -93853 -300443 239179 147414 -81180 -107296 55340 -453225 218224 67588 -135728
19324 527603 -70951 67184 -210490 111941 -185485 70744 -81040 19485 -183207 -143566 -165827
19313 -165827 -119300 68575 -46673 -85318 -55333 176077 -74286 -137640 -157892 -263156 -39939
19301 -35164 120918 34281 -15189 -110907 -28252 -41153 -63 34258 240576 172856 261120 -130996
19288 74576 -126612 224847 -75608 -181368 -63382 162962 -170882 28944 -123605 -394074
$$ packed form
19369F7193a49081l7247K1558A05427J25431g9519j49667J12069F6046J75338
19359B41384O5683A4108b21478A88483k4664f8394K6571j87114J01697b1078j16387
19348a37465i934E1799a77796h8630q3895J0026A43500a51039j15814B02973c68507
19336d74453i3853k06590B39179r1765h1180k6116E5340d53225B18224F7588a35728
19324E27603g0951F7184b10490A11941a85485G0744h1040A9485a83207L9641k2261
19313a65827M6527F8575d6673l8645K9985A76077g4286o3354k0252j05264c9939
19301c5164A20918C4281a5189r5718b8252j2901f3C4258K06318o7720Q8264a30996
19288G4576a26612B24847g5608j05760f3382A62962a70882B8944a23605k70469
$$ plain form
19278 -394074 -311136 -129444 -45085 -222577 406628 30684 -401656 109005 -71018 -82577
19268 -82577 -165501 -56460 -109932 45662 140704 23667 -66314 -109197 123157 -93538 -114466
19257 -114466 -74872 -258071 206461 -227264 143060 10056 -224338 -249541 -289288 -234680
19247 -234680 143825 49358 -47552 -197138 -73121 -304874 -240729 14315 -466478 -3824 -327503
19236 -327503 -69779 -20430 -238756 -77173 125833 -23674 91037 -176614 10360 29501 66976
19225 66976 248977 -11915 -681551 2122 132306 -87996 -252573 -207606 9156 -171922 -17051
19213 190399 -237751 -327999 -80268 -463381 54783 -509405 -248336 35235 -39027 -462308
19203 -462308 231412 -108649 -242241 -114362 -275216 24122 -252871 -213783 31327 -115117
$$ packed form
19278c94074Q2938a29444d5085j77492D06628C0684d01656A09005g1018j1559
19268h2577q2924e6460n3472D5662R5042B3667f6314m2883A23157i3538k0928
19257a14466L9594j83199B06461b27264A43060A0056b24338k5203l9747N4608
19247b34680A43825D9358d7552j49586g3121k31753O4145A4315d66478c824l23679
19236c27503f9779b0430k18326g7173A25833b3674I1037a76614A0360J9141L7475
19225F6976J82001a1915o69636B122J30184h7996j64577M4967I156a71922a7051
19213A90399b37751r0248h0268l83113E4783e09405b48336C5235c9027m23281
19203d62308B31412a08649j33592a14362j60854B4122b52871L9088C1327a15117
$$ plain form
19192 62644 123895 -39027 -257249 -4120 -104252 -193046 -37802 59608 79179 -125943 -310041
19181 -310041 -205089 -149984 -191569 403736 -205557 43576 141688 43344 91221 -183922 -201698
19170 -201698 105829 -135896 -2790 -20647 290291 95718 83769 -261933 199929 -228170
19159 -52113 65932 -245297 -28812 45763 16532 127733 -106317 -75430 114780 -265749 -5606
19147 51474 -90822 -14925 51597 -116110 277779 -243364 -152044 29952 -222963 -146905 -20280
19135 -50222 171131 -65887 -253699 120885 -83251 -100643 -68349 -76224 196266 179823 91338
19124 91338 205229 -165331 -60344 -185681 -399579 -139410 230843 -226506 -259522 -26425
19113 43803 162715 -276639 260307 179985 100985 -68683 -27173 -230731 30826 -71123 -182027
$$ packed form
19192F2644O1251c9027k18222d120j00132q8794c7802E9608J9571a25943j84098
19181c10041J04952N5105m1585D03736b05557D3576R8112D3344M7877a83922j7776
19170b01698A05829a35896b790j7857B90291I5718j1949b61933A99929b28170
19159e2113F5932b45297b8812D5763A6532J11201a06317L0887A14780b65749e606
19147E1474i0822a4925E1597a16110B77779b43364R1320B9952b22963P6058b0280
19135e0222A71131f5887j87812A20885h3251j7392L2294p875A96266j6443q8485
19124I1338J13891a65331f0344j25337k13898a39410B30843b26506l3016b6425
19113D3803J18912b76639B60307q0322p9000f8683b7173k03558C0826g1123j10904
$$ plain form
19102 -182027 -227527 -311831 -138654 23907 -51186 -216160 -95191 -74996 -58279 40774 -331852
19090 174435 -114034 71154 -101462 -86848 -391415 -158394 -162500 10287 -330165 -339339 129558
19078 416478 121709 112321 -468986 -115957 240149 -339390 143534 -73625 -160762 -396527
19068 -396527 203487 -61242 -462116 24802 -313309 63994 -472286 194745 18938 -424093
19057 -28252 -63316 191412 133284 74454 -242535 76540 -65034 -166869 -76805 -87771 173089
19045 -59649 -149933 -60209 -486831 -224829 -66790 -41045 -122692 -109379 -167647 -130040 -248555
19034 -248555 -212552 -290117 53804 390799 -60767 -68314 80916 -167374 4980 117668 -83525
19022 -22175 129170 19479 69800 -115653 293408 -398245 -228221 182249 136341 -93004
$$ packed form
19102a82027m5500q4304a38654B3907e1186j64974i5191K0195J6717D0774c31852
19090A74435a14034G1154a01462J4614l04567a58394m106A0287c30165r174A29558
19078D16478A21709r388d68986a15957B40149c39390A43534g3625q7137k35765
19068c96527B03487f1242m00874B4802c13309F3994d72286A94745A8938d24093
19057b8252l5064A91412n8128n8830b42535G6540f5034j01835g6805j0966A73089
19045e9649r0284f0209m26622b24829f6790K5745q1647J3313n8268L7607j18515
19034b48555L6003p7565E3804L36995f0767p547H0916a67374D980J12688h3525
19022b2175A29170A9479N0321a15653B93408c98245J70024A82249m5908i3004
$$ plain form
19011 -162581 -24610 96150 -35109 199619 -246274 1179 164055 132607 179511 -80229 50248
18999 225254 -186275 -287097 -150977 -235483 -70247 102135 -379568 -71343 361418 -137135
18988 -24289 7218 245312 -70961 -279303 3758 -41224 -80295 -2822 449375 -382485 81789
18976 -153056 92889 -65342 -58165 -164890 -147726 82364 393789 313829 -273719 -27567 -62422
18965 -62422 -248099 144749 192734 462 51508 -194064 -14006 -201750 15485 -76727 163411
18953 610 -227972 154226 -328211 -26285 -21076 -151734 351710 -1613 -18445 106095 -200121
18941 244723 -207013 -24512 58668 40907 -30268 -218326 -232572 -4869 81639 17666 -218406
18929 61980 135790 37068 207459 -128712 87762 138823 57706 -229938 -208839 -25018 10539
$$ packed form
19011a62581b4610I6150c5109A99619b46274A179J62876l1448M6904h0229E0248
18999B25254a86275j00822J36120q4506g0247A02135c79568g1343C61418a37135
18988b4289G218K38094g0961k08342C758d1224l9071b822D49375c82485H1789
18976a53056I2889f5342P177j06725J7164H2364L11425p9960b73719b7567l4855
18965f2422j85677A44749M7985D62N1046a94064a4006j87744A5485g6727A63411
18953F10b27972A54226c28211b6285N209j30658C51710a613j6832A06095b00121
18941B44723b07013b4512E8668j7761c0268j88058j4246d869H1639A7666b18406
18929F1980P3810C7068J70391a28712H7762N1061E7706b29938K1099b5018A0539
$$ plain form
18917 -26097 142098 -17134 -30540 36048 -65500 5355 -23784 105594 208630 201803 -70992
18905 -220512 168710 71496 -145691 -183278 -19400 -140402 180507 -14505 28493 200482
18895 200482 -137752 -211008 47384 -4587 -52618 13052 -178910 -39050 -224449 -164586 -122636
18884 -122636 212777 -236246 -87412 244295 249559 -340072 14456 -209700 81128 -5370 67184
18872 -71324 58062 -24771 -200718 69227 124159 -158393 62407 -145538 66539 -159471 -107387
18861 -107387 -5917 -231262 -22774 -15215 -170126 -6939 20156 -38641 -407646 80945 -85066
18849 -26000 -366656 136287 -48216 -170037 370496 -843 -235213 146898 -99301 72650 61319
18838 61319 86236 -163454 106033 218711 -148388 -64630 -32434 -165977 70697 -20491 239608
$$ packed form
18917b6097A42098a7134j3406C6048f5500E355b3784A05594J03036o827g0992
18905b20512A68710G1496a45691l7587a9400j21002A80507a4505B8493J71989
18895B00482a37752p3256D7384d587m8031A3052a78910c9050j85399N9863M1950
18884a22636B12777b36246h7412B44295N264c40072A4456b09700H1128e370F7184
18872g1324E8062b4771j75947F9227N4932a58393F2407a45538F6539a59471N2084
18861a07387e917k25345b2774P559j54911f939B0156c8641l69005H0945h5066
18849b6000l40656A36287d8216j21821C70496h43k34370A46898i9301G2650j1331
18838F1319K4917a63454A06033J12678a48388f4630L2196j33543G0697b0491B39608
$$ plain form
18826 168778 6724 -149329 -53765 5555 -103072 -234641 141760 221442 -126790 265857 104752
18814 77907 -18957 114041 -2910 111763 -55037 270765 21304 160121 -57211 169284 228872
18803 228872 -228228 55681 -298251 -110059 109785 4169 88081 -15737 14369 9049 -335959
18791 160785 -249851 -20674 -81501 126034 -194196 -280777 197462 -63057 -86940 107680
18780 88614 344445 -18046 -103709 -33856 77052 38352 194297 42091 -158243 -275778 -392457
18769 -392457 -170365 -328147 -77471 51658 366180 -369185 -137737 -146534 -64268 -117250 263535
18757 -314406 -125930 51442 102774 -121528 -52196 -148370 -125175 156977 211197 59394 -277909
18745 92140 -204386 -70045 14525 -201745 241102 376256 -37543 -177238 33897 47525 -21770
$$ packed form
18826A68778F724a49329e3765E555a03072j31569A41760P9682a26790B65857A04752
18814G7907a8957A14041b910A11763e5037B70765B1304J38817e7211A69284N9588
18803B28872b28228E5681b98251a10059A09785D169Q3912a5737A4369n320c35959
18791A60785b49851b0674o0827A26034a94196q6581A97462f3057k3883A07680
18780H8614K55831a8046q5663c3856G7052C8352J55945D2091a58243j17535j16679
18769c92457a70365j57782g7471E1658L14522c69185a37737q797f4268n2982B63535
18757c14406a25930E1442N1332a21528e2196r6174K3195A56977N4220E9394b77909
18745I2140b04386g0045A4525b01745B41102J35154c7543j39695C3897J3628b1770
$$ plain form
18733 108423 -162508 -143549 -294533 35376 -8739 2917 -440686 89758 40569 -211114 -56172
18721 191327 -169716 55912 -5573 -400951 512190 -371012 108469 -154234 -125000 -40110
18710 16992 -184723 -323439 -83056 12663 -348034 -196059 -119154 122341 -207134 -157475
18700 -157475 -161294 -159509 -206702 140710 -377718 192641 228265 221950 -82928 62393 70803 -75078
18687 -333399 126272 -75981 67165 139276 -80427 -267712 -178110 -195553 170183 -70581 108217
18675 102341 22392 -200242 64883 194782 112505 -84058 53789 -268413 -2431 -48485 -224799
18664 -224799 175359 -83081 -1015 -203857 -261546 -323381 -372105 193009 -356757 210878 -46549
18652 -86311 -126176 126890 75767 -40422 -170746 -146912 -241359 -180762 -62372 321156 -56660
$$ packed form
18733A08423a62508J8959j50984C5376h739B917d40686H9758D0569b11114e6172
18721A91327a69716E5912e573l95378E12190c71012A08469a54234K9234d0110
18710A6992a84723j38716h3056A2663c48034J51975P6905A22341b07134M9659
18700a57475l819J785m7193A40710c77718A92641L5624o315h2928F2393Q410g5078
18687c33399A26272g5981F7165P2111h0427j87285Q9602j7443A70183g0581A08217
18675A02341B2392b00242F4883J29899q2277h4058E3789b68413b431m6054j76314
18664b24799A75359h3081a015k02842n7689o1835m8724A93009c56757B10878d6549
18652h6311l9865A26890n1123d0422j30324K3834r4447O0597f2372C21156e6660
$$ plain form
18640 -305012 -34522 -358803 75138 -211358 11704 68228 -53065 -429800 153681 2644 -54614
18628 -12546 121239 138863 75753 -71942 -50304 70316 -45974 -140584 240980 11619 53044
18617 53044 -169462 -225524 -156933 -177109 58608 -56969 -167046 256305 -103877 -307043 -405461
18606 -405461 -3347 -233039 -280812 -95097 -91107 -185975 -214261 -247563 88943 -41747 -163652
18595 -163652 -125276 -215709 -274475 24658 18338 301542 73682 -10339 427855 8622 -230420
18583 -211861 -63041 39314 -149360 134310 19862 -12511 -217414 -42216 68725 3610 -63505
18571 -230963 3666 -309123 -301688 63581 114493 -226939 -291968 -61730 -32829 -136695 -220294
18560 -220294 -165628 -347327 -59871 25950 16851 -93316 28451 16924 16450 -134412 139489
$$ packed form
18640c05012c4522l24281G5138b11358A1704N6524e3065l76735A53681B644e4614
18628a2546A21239J7624o3110g1942K1638G0316d5974r4610B40980A1619M1425
18617E3044a69462n6062O8591k0176E8608e6969j10077B56305a03877k03166r8418
18606d05461c347k29692m7773i5097L990r4868k8286l3302H8943d1747j21905
18595a63652L8376r0433n8766B4658o320K83204G3682a0339D27855H622b30420
18583b11861f3041C9314a49360A34310A9862a2511k04903d2216F8725C610f3505
18571b30963C666c09123P435F3581N0912b26939o5029f1730K8901j03866q3599
18560b20294N4666j81699e9871B5950r099i3316B8451j1527m74a34412A39489
$$ plain form
18548 -8829 -236298 98140 198811 3266 157636 -236196 -217022 14749 -355866 -338781 123259
18536 -299918 7508 206269 -461533 -56504 73814 -296780 -81813 -169781 205595 31699 -184091
18524 -100766 -265565 -59355 -130680 24578 37970 66773 69696 -230713 130870 32096 -60881
18512 130458 246767 109371 261749 225297 105283 190980 -245779 -64636 -35607 182867
18501 97885 -143886 -70642 -118409 -189049 82117 151922 -184962 -212712 -113024 -123182 -11989
18489 176892 -66017 27868 -39897 -86060 -298291 -173533 44804 420929 -137322 191309
18478 32032 -138174 -256230 17059 124454 -65073 193864 -170414 -168404 -42389 -93366 -98047
18467 -98047 50796 -75795 -60412 -254674 -123428 -112135 -127806 -113117 -110864 117558 -117926
$$ packed form
18548h829k27469I8140J00671C266J54370b36196J9174A4749c55866J7085A23259
18536b99918G508J98761d61533e6504G3814b96780h1813q7968B05595C1699a84091
18524a00766j64799e9355p1325B4578J3392K8803K923b30713A30870C2096f0881
18512A30458J16309A09371J52378l6452A05283Q5697b45779f4636K9029A82867
18501I7885a43886g0642m7767p0640H2117O9805a84962k7750R9688j0158a1989
18489A76892f6017B7868c9897m6163k12231J24758D4804L76125a37322A91309
18478C2032a38174j18056A7059J07395f5073A93864a70414K010d2389n0977m681
18467i8047E0796g5795J5383j94262a23428J1293j5671J4689K253A17558a17926
$$ plain form
18455 -53048 -57930 127119 -6864 51571 -416748 -76836 8211 47577 250185 -512254 61517
18443 -18830 115429 -112753 -36113 164628 -16975 -255885 -108803 -96151 -26531 -92347 -28884
18431 94962 -114386 -208827 -369133 -274653 -27926 -3102 -101267 -48339 -79024 383379 -52022
18419 -125944 -183264 -121709 48312 74540 -97272 66738 -199660 -98756 -135834 -274577 -125347
18407 -162063 5253 -75001 335401 -447647 191463 -180787 250700 -153126 -8374 -22419 -183834
18396 -183834 -309691 -20915 -192253 -85880 -352818 -160673 -160766 -223935 -31382 -29332 -113354
18385 -113354 -244036 -69979 -11988 -173080 -339304 30139 309157 -61090 167964 -11081
18374 231104 112717 -152885 101588 -103225 -82092 -10426 46386 11194 37574 12655 79139
$$ packed form
18455e3048m882A27119f864E1571d16748g6836H211L9366K02608e12254F1517
18443a8830A15429a12753c6113A64628a6975k38910a08803J2652b6531o5816b8884
18431I4962a14386r4441j60306R4480b7926c102r8165d8339l0685C83379e2022
18419a25944n7320O1555D8312K6228i7272F6738a99660i8756l7078j38743a25347
18407a62063E253g5001C35401d47647A91463a80787B50700a53126h374j4045j61415
18396a83834j25857b0915j71338h5880k66938a60673r3o3169c1382K050q4022
18385a13354j30682f9979a1988j61092j66224C0139K79018f1090A67964a1081
18374B31104A12717a52885A01588a03225K1133a0426D6386A1194K6380A2655O6484
$$ plain form
18363 79139 -156507 95112 -44646 99733 -126511 -154654 -196933 -117551 -121992 120108 -30281
18351 -98648 16673 -347844 -6708 -220426 -164239 92573 -89934 187722 -81088 46213 -91767
18339 -256421 -321450 -7889 32402 -127015 -262824 10166 222553 -62982 -260933 176482 134766
18328 134766 12441 -286053 221445 -177194 -205357 -266618 -110985 392822 135427 258906
18318 258906 136875 -58890 -14910 -69325 -35057 101436 -116217 -133836 -212180 -67813 -25872
18306 150617 8143 131301 -99463 75981 -201505 -247 60160 -61719 -284963 10914 -243082
18294 -128727 -6058 204307 234073 38629 67112 134062 -22646 206809 -99614 -12565 -34098
18283 -34098 168053 -394490 -28753 -223733 -80531 24641 167429 116046 103081 52037 -142372
$$ packed form
18363G9139a56507I5112d4646I9733a26511k8143m2279P9382m441A20108c0281
18351i8648A6673c47844f708k13718N6187I2573h9934A87722h1088D6213i1767
18339b56421o5029g889C2402a27015j35809A0166K12387f2982j97951A76482m1716
18328A34766A2441b86053B21445a77194k8163o1261a10985C92822A35427J23479
18318B58906j22031e8890a4910n4415L4268A01436a16217j7619p8344f7813b5872
18306A50617H143J23158i9463G5981b01505b47F0160f1719k23244A0914b43082
18294a28727f058B04307K9766C8629K8483O6950b2646B06809i9614a2565k1533
18283c4098A68053c94490b8753j94980h0531B4641J42788n1383j2965n1044a42372
$$ plain form
18271 -95266 -106860 -154174 -85333 -8194 111495 59022 -72451 93410 -39324 16932 199911
18260 199911 301154 -103447 -189048 103255 -55971 -246345 -26328 8962 -125881 75694 -44775
18248 -94817 93938 304318 28929 -184996 148252 -171627 -61538 76539 87555 -186386 19546
18236 -23695 -66782 221574 310119 -129920 -16570 20914 -312240 13188 -98727 -81472 -55979
18225 -55979 -189585 75819 -54826 178172 210574 -164053 -152228 24562 -89375 84040 -140784
18213 -70887 230023 -93799 -56540 -181187 -17787 -96 289936 -4942 57941 81698 -143158 121794
18200 368984 191876 -53874 -95272 -23298 -105226 -219999 3476 26553 -214697 43719 -144888
18188 121245 -334007 -421391 -236192 -340578 -148786 -34018 -218202 -331517 352213 18860
$$ packed form
18271i5266j1594m7314O8841h194A11495n2473g2451I3410c9324A6932J82979
18260A99911J01243a03447q5601A03255e5971j90374b6328H962a25881G5694d4775
18248i4817I3938K10380B8929a84996A48252a71627f1538G6539J1016a86386A9546
18236b3695m3087B21574Q8545a29920a6570B0914c12240A3188i8727J7255K5493
18225e5979j33606G5819e4826A78172L2402a64053J1825B4562h9375H4040a40784
18213g0887B30023i3799L7259j24647a7787i6B89936d942E7941K3757a43158A21794
18200C68984j77108e3874m1398b3298q1928j14773C476K3077b14697D3719a44888
18188A21245c34007q7384J85199j04386a48786c4018j84184j13315C52213A8860
$$ plain form
18177 36792 -10760 50803 78554 98244 -131991 -67907 -154628 -167803 178895 -147356 179448
18165 -222775 184686 -49157 -176135 -426502 -244224 45595 108173 10713 172771 70538
18154 16279 -108144 -88936 -94552 117208 -114493 57077 114154 -60237 56888 79937 -340946
18142 -354102 -135965 -131571 -60003 210284 -18412 -75508 -232541 -81553 -150983 549 -398838
18130 138545 -377156 -71279 -308356 -25347 -220894 -318657 10245 -225633 -17519 87142 -91661
18118 62975 -64115 31215 91540 -311530 -295712 -176627 147139 8243 127627 135762 -169320
18106 73525 44664 142212 -210268 -211554 -202363 -278219 79822 49764 43007 -484351 41928 -2918
18093 -28823 -27976 81780 83271 207516 150192 82694 64435 -154189 153756 -219261 -206 103184
$$ packed form
18177C6792a0760E0803K7751J9690a31991O4084q6721j3175A78895a47356A79448
18165b22775A84686d9157j26978k50367J82278D5595O2578A0713J62058G0538
18154A6279a08144J9208n616A17208a14493E7077N7077f0237E6888K3049c40946
18142c54102a35965M394f0003B10284a8412n7096j57033h1553o9430E49c98838
18130A38545c77156g1279k37077b5347j95547r7763A0245b25633a7519H7142i1661
18118F2975f4115C1215O0325c11530J5818J19085A47139H243J19384Q135a69320
18106G3525k8861R7548b10268j286R191p5856G9822l0058o757d84351D1928b918
18093b8823Q47H1780J491J24245n7324o7498j8259a54189A53756b19261b06A03184
$$ plain form
18080 -200825 -139567 229642 -277363 -49351 15184 -125010 -177887 -4728 -7293 -51886 -177489
18069 -177489 17145 -14085 -328554 -29251 -294001 -148972 -101025 155388 -127673 7871 122972
18058 122972 -109291 6820 36453 41964 116974 -202100 63523 -324484 84077 98101 13034
18046 -108562 -100678 -38801 364382 -104013 178990 42491 180323 -349523 13747 -539856
18035 -382915 -317965 262989 -46593 -143253 2044 81081 -87260 -79244 -277461 -280944 -12627 -132406
18023 -132406 156632 -60261 -157842 -235340 -208028 -286234 -308517 -242056 31275 -200093 238610
18011 -170930 293757 20090 27447 -317151 58684 375419 -182854 -59728 81957 -88192 65586
17999 225033 -81704 16114 74209 137153 219109 -243403 78408 65940 -2435 -190187 411857
$$ packed form
18080b00825O1258B29642b77363d9351A5184a25010n2877d728k565m4593j25603
18069a77489A7145a4085l14469b9251k64750J45029M7947A55388a27673G871J15101
18058A22972a09291F820K9633N511P5010b02100F3523c24484H4077J4024A3034
18046a08562P884c8801C64382a04013A78990D2491J37832c49523A3747e39856
18035c82915O4950B62989d6593r6660B044P9037h7260Q016j98217l483a2627j19779
18023a32406A56632f0261r7581p7498K7312p8206k2283O6461C1275b00093B38610
18011a70930B93757B0090P357c17151E8684L16735a82854e9728H1957h8192F5586
17999B25033h1704A6114N8095O2944Q1956b43403G8408j2468b435j87752D11857
$$ plain form
17987 167220 -162761 -29645 186614 -298849 -119776 142550 -90139 215273 -85217 114653
17976 155576 15725 -93885 -18482 -166786 -39947 -168216 -59972 -126341 -69892 -154982 286880
17964 45272 -187324 247717 48945 144514 -256933 -222836 -109106 10560 -63528 85280 2478
17952 85513 60492 193216 -194585 -267899 33351 147046 -93678 -82145 110240 -213084 37927
17940 -2068 -153959 -42359 -726047 17660 -69843 -155267 -63895 77525 -231867 218226 -177294
17928 -108427 26735 -179880 -103129 -37960 164058 -196757 -259709 160325 207840 -150053
17917 -279910 82104 -130405 -277927 -271722 34420 -126282 -113832 76241 69479 21539 -162360
17905 27272 -26003 69105 -61256 -408841 -111292 -52243 222614 105014 -337687 19982 86064
$$ packed form
17987A67220a62761b9645A86614b98849a19776A42550i0139B15273h5217A14653
17976A55576A5725i3885a8482j48304c9947j28269e9972o6369N6449q5090B86880
17964D5272a87324B47717D8945R5569b56933L4097a09106A0560f3528H5280B478
17952H5513k5021J32724a94585p3314C3351J13695i3678J1533A10240b13084C7927
17940b068j51891d2359o83688A7660f9843q5424f3895G7525b31867B18226a77294
17928a08427B6735a79880P6751c7960A64058a96757o2952A60325M7515a50053
17917b79910H2104a30405j47522O205C4420a26282J2450G6241o762B1539a62360
17905B7272b6003F9105f1256l47585a11292e2243B22614A05014c37687A9982O6082
$$ plain form
17894 86064 311134 -68670 -96617 146744 -3781 24196 -100384 3394 10140 48225 -75361 -76646
17882 -76646 -467084 226929 -26943 153216 162555 -47554 -219997 260842 -22658 -418442 305722
17870 -136222 62906 -350481 -277856 -17667 -53269 200306 116811 -159596 324464 -134138
17859 55788 -48593 -317703 -74292 -191286 55185 -39820 -37953 147965 -173045 203968 62267
17847 86024 141056 52185 -156452 17744 -36897 -91674 119887 107767 106292 -77681 -285942
17836 -285942 -93523 14611 36766 31322 -160775 70157 226926 -157157 46438 226991 -299753
17824 -299795 60351 -68583 126705 70091 -207129 165188 1838 -96453 -100274 -348422 203286
17812 124866 119889 125659 -48625 -197586 116269 -26369 69873 -305166 52944 203600 -11535
$$ packed form
17894H6064K25070f8670k7947A46744c781B4196a00384C394O746L8085g5361j285
17882g6646l90438B26929b6943A53216R339d7554j72443B60842b2658l95784C05722
17870a36222F2906c50481P2625a7667l5602B00306q3495a59596C24464a34138
17859E5788d8593k69110g4292j16994E5185c9820J867A47965a73045B03968F2267
17847H6024N5032E2185a56452A7744c6897n4777A19887j2120j475g7681k08261
17836b85942i3523A4611K2155n444a60775G0157J56769a57157D6438J80553b99753
17824b99795F0351f8583A26705n6614b07129A65188A838i6453l821k48148B03286
17812A24866m977N770d8625j48961A16269b6369F9873c05166E2944J50656a1535
$$ plain form
17800 -177467 -43148 -142695 59410 27863 72096 -2889 120905 -89765 -193773 187413 176767
17789 176767 -14341 -4208 27313 -346068 66291 5438 -160653 171322 -104906 117051 12663
17777 -52048 -54064 87207 180038 142500 -13781 -32587 -270254 -96196 165431 178080 153306
17766 153306 -47282 124354 279821 -84932 -160809 -140652 269925 -86193 -233152 514096
17755 297230 108558 -379166 -6162 -283550 42608 165640 125715 -75598 -267681 -69263 -202465
17744 -202465 71450 -152039 320404 -126673 -195545 163545 -191665 -163012 503312 -60841
17733 -137920 106411 50470 -153808 157883 -85622 179694 83465 -329692 -190281 3324
17722 -209086 -119643 97605 -233129 -127208 801 36766 -45771 -145014 120480 -111488 196814
$$ packed form
17800a77467d3148r9547E9410B7863M4233b889A20905h9765j04008A87413j0646
17789A76767a4341d208B7313c46068F6291E438a60653A71322a04906A17051A2663
17777e2048k016H7207R2831l7538a3781j8806k37667i6196A65431J2649k4774
17766A53306d7282A24354J55467h4932p5877K0157B69925h6193j46959E14096
17755B97230A08558c79166f162k77388D2608J23032l9925g5598j92083f9263j33202
17744b02465G1450a52039C20404a26673o8872A63545a91665K8653E03312f0841
17733a37920A06411E0470a53808A57883h5622A79694H3465c29692J39411C324
17722b09086Q9443I7605b33129J05921H01L5965d5771r9243A20480a11488A96814
$$ plain form
17710 135278 234102 -272497 -197391 -32866 126293 -47731 243862 67393 -77642 -15927 -15208
17699 -15208 -146843 74290 365448 10698 -277162 -212688 -168034 6562 -179249 -77816 143332
17687 -76913 -173696 21456 60009 -164018 -282461 -150837 -86645 -336671 -294337 78548 117607
17676 117607 -240395 189100 22187 97829 -185938 -16112 -207936 142015 -207498 259627
17665 -30597 -275051 -218276 -53273 161358 378881 317304 507764 207220 -141376 -58527
17654 224736 280679 216122 -172542 10506 452282 160764 121001 418906 14697 204631
17644 204631 150723 -197431 270102 108534 -13298 265106 -180250 -162777 36185 -48081
17633 -412841 106674 -113775 252858 300584 -23556 178671 101682 16065 119976 58852
$$ packed form
17710A35278R8824b72497P5106c2866A26293d7731B43862F7393g7642a5927P19
17699a5208j31635G4290K91158A0698b77162O4474M4654F562a79249g7816A43332
17687g6913r6783B1456L8553a64018j18443J31624O4192k50026M2334G8548L9059
17676A17607b40395A89100B2187P5642a85938a6112j91824A42015b07498B59627
17665c0597k44454N6775e3273A61358K17523o1577J90460B07220a41376e8527
17654B24736N5943o4557a72542A0506M41776A60764l9763K97905A4697J89934
17644B04631n3908a97431B70102A08534a3298B65106a80250J7473C6185d8081
17633d12841A06674a13775B52858M7726b3556A78671p6989A6065J03911E8852
$$ plain form
17622 -182344 -86565 -135218 54892 -201173 -238833 -63042 156375 454578 -4176 -22486 21341
17610 -266175 -18024 -50551 64882 197502 93881 89876 -131177 41447 -71247 -110671 275294
17598 -4943 61360 -7704 -166390 -153032 -104265 -163206 197202 165966 197934 -32236 197669
17586 135665 -9032 -61201 210513 -226125 -143350 355098 174806 93231 3537 -63997 109611
17574 23575 -329504 -118778 -47068 -12249 79874 -73343 -212270 -224349 -134780 107751 170139
17563 170139 109973 291773 165602 218181 233980 -5307 103284 -68275 111604 202849 -44821
17551 151599 105709 100617 -89920 -212450 323482 -159544 -151176 -223579 193382 194414 -112589
17539 55682 -75761 -192693 209173 153074 492454 175723 133973 137685 159655 66638 -152404
$$ packed form
17622a82344h6565m8653E4892b01173l7660f3042A56375K98203d176j8310B1341
17610b66175a8024l2527F4882J32620I3881m005a31177D1447g1247l9424B75294
17598d943F1360g704j58686J3358M8767n8941A97202l1236L1968c2236A97669
17586A35665i032n2169B10513b26125Q2775C55098A74806q1575C537f3997A09611
17574B3575c29504a18778d7068a2249G9874g3343j38927j2079Q9569A07751O2388
17563A70139o0166J81800j26171N2579J5799e307A03284f8275A11604R1245d4821
17551A51599m5890n092h9920j22530C23482a59544Q368p2403A93382J032a12589
17539E5682g5761j16932B09173n6099L39380A75723m1750L712K1970F6638a52404
$$ plain form
17527 -109779 365745 110398 53251 84671 272245 65664 6427 23620 55749 364564 28791
17515 195714 10096 163693 -109937 -107699 147046 -60263 353625 -179372 83909 261025
17505 261025 -140332 -163834 267102 -128365 -105954 95840 280516 10713 94921 427842
17495 427842 -166365 27420 218594 -279319 77253 -165834 137931 226533 -32907 299388
17484 7159 -133017 104694 197833 -20164 -31738 314745 340427 43564 -30179 331913 324995
17473 324995 -80687 -63659 53059 375236 -110794 -52765 -245401 161634 125385 230288
17463 230288 88610 41867 -54746 161820 108867 -72880 9037 -82564 461805 44022 7343
17451 284396 267659 324666 298249 271028 571804 563034 478057 160196 281149 430752 375899
$$ packed form
17527a09779C65745A10398E3251L1420J87574F5664F427J7193L2129L08815B8791
17515A95714A0096J53597a09937K238A47046f0263C53625a79372H3909J77116
17505B61025a40332k3502B67102a28365K2411I5840J84676A0713Q4208L32921
17495D27842a66365B7420J91174b79319G7253a65834A37931Q8602c2907B99388
17484G159a33017A04694R3139b0164j1574C14745K5682D3564c0179C31913o918
17473C24995h0687J7028E3059L22177a10794e2765j92636A61634l6249J04903
17463B30288H8610D1867e4746A61820n2953g2880I037h2564D61805D4022G343
17451B84396j6737N7007k6417k7221L00776q770q4977A60196J20953J49603n4853
$$ plain form
17440 375899 133665 -98086 109387 354261 245774 132068 -345719 408738 169892 303772
17430 303772 293810 429127 121928 303279 515741 -99872 18688 203708 146516 -89981 113189
17418 200530 70150 206154 184561 321723 440085 208368 214522 318485 231345 -2041 142108
17406 63546 188302 -144606 152262 421137 44213 -126139 -39348 145294 -177195 410413
17395 205089 237153 227733 207447 324906 350651 -172535 316925 137352 278728 235819 266649
17384 266649 223883 -9330 327605 274567 109868 192848 91538 567251 149804 303293 131784
17372 203403 -51078 12509 187310 113584 167761 62815 410713 -72012 165494 398835 -69060
17360 -75645 144953 35343 176550 -84129 167565 74034 224988 -117185 -34043 435030
$$ packed form
17440C75899A33665i8086A09387K44874j08487j13706c45719D08738A69892J33880
17430C03772r962J35317A21928J81351K12462i9872A8688J85020n7192h9981A13189
17418B00530G0150J36004k1593J37162J18362B08368O154J03963q7140b041A42108
17406F3546J24756a44606A52262K68875D4213a26139c9348A45294a77195D10413
17395B05089L2064r420k0286J17459K5745a72535C16925A37352J41376m2909L0830
17384B66649m2766i330C27605n3038A09868Q2980I1538M75713A49804J53489A31784
17372B03403e1078A2509J74801p3726N4177F2815L47898g2012A65494K33341f9060
17360g5645A44953C5343J41207h4129A67565G4034J50954a17185c4043D35030
$$ plain form
17349 -29988 60318 118784 242717 51601 -255625 117327 -78803 155043 126240 -32389 -53857
17338 -53857 113385 152524 213237 -11505 91200 172406 156443 264971 52809 -49841 227878
17326 208112 275882 68973 167232 253059 4876 187294 225071 -29800 -87012 -42995 139021
17314 176827 -190351 -51245 -91559 246149 -130233 101 191693 -27054 311680 106817 -112012
17302 432893 394635 14186 134663 281008 176272 87352 229640 -92301 412731 353767
17292 353767 27954 116818 -240525 -293338 380136 68060 226970 259952 -26627 66869 121704
17281 121704 64622 143184 427085 -205991 169087 276980 150069 48637 -136272 1124
17270 283822 243927 22722 257725 180750 275146 156580 176283 -65004 254858 167293 597407
$$ packed form
17349b9988F0318N8466J23933E1601b55625A17327g8803A55043k8803c2389k1468
17338e3857A13385L9139O0713a1505I1200Q1206j5963J08528E2809d9841B27878
17326B08112O7770F8973R8259Q5827D876J82418L7777b9800n7212d2995A39021
17314A76827a90351e1245m0314B46149a30233A01J91592b7054C11680A06817a12012
17302D32893l8258A4186J20477J46345j04736H7352J42288i2301D12731n8964
17292C53767B7954Q8864b40525n2813C80136F8060J58910L2982b6627F6869N4835
17281A21704n7082P8562K83901b05991A69087J07893j26911D8637a36272A124
17270B83822l9895B2722K35003p6975R4396j18566J9703f5004B54858q7565M30114
$$ plain form
17259 597407 427891 -287181 111618 25797 38010 217489 35742 -55048 298819 163609
17249 163609 34632 63842 380304 529024 -123860 241617 275981 342863 -5834 327968 243942
17238 243942 245589 312224 25481 -213210 263709 218174 154905 270677 296207 -82541 174458
17226 366109 408574 246894 222155 384385 251811 178390 88907 20626 124404 361439
17216 361439 52992 107323 483435 341090 312795 301308 228351 102250 176770 149786 366814
17205 366814 321613 183614 263203 325247 182639 374311 405224 243949 607278 84646
17194 343097 184795 242758 179198 -7566 367899 350240 344328 255169 471338 300006 258868
17183 258868 345934 218356 529480 154197 305281 263397 230723 348812 130747 78469
$$ packed form
17259E97407j69516b87181A11618B5797J2213J79479C5742e5048B98819j35210
17249A63609C4632K9210L16462J48720a23860B41617L4364O6882e834C27968q4026
17238B43942J647O6635B5481b13210B63709m5535o3269J15772K5530h2541A74458
17226C66109M2465j61680k4739J62230j32574p3421H8907B0626J03778K37035
17216C61439E2992N4331L76112j42345k8295j1487p2957A02250P4520k6984K17028
17205C66814m5201j37999P9589O2044j42608J91672L0913j61275L63329H4646
17194C43097j58302N7963o3560g566C67899j7659n912q9159K16169j71332m1138
17183B58868Q7066j27578L11124A54197J51084m1884l2674J18089A30747n2278
$$ plain form
17173 78469 247766 386102 124614 149272 225386 242794 351221 417524 346821 228373 93273
17161 402433 197565 300148 356902 393474 137646 203303 120466 467288 243088 247536 235742
17150 235742 109122 265172 713200 123757 160439 145892 307176 374799 320591 780990
17140 780990 350091 57248 188570 488722 35571 624905 253471 339440 415512 364394
17130 364394 470756 200547 186271 503069 494847 86332 570205 52375 295823 31748 465514
17119 465514 660031 508750 313083 252134 269090 76623 232564 255184 258086 398149 381517
17108 381517 513941 153119 450666 108090 418171 389008 599748 130971 207563 203870
17098 203870 379202 533020 678499 239241 292896 487432 298046 628268 51190 428589
$$ packed form
17173G8469J69297J38336A24614K4658P6114J7408J08427O6303p0703j18448I3273
17161D02433A97565J02583N6754L6572A37646O5657q2837L46822k24200M448j1794
17150B35742A09122J56050M48028A23757L6682j4547J61284O7623n4208M60399
17140G80990C50091E7248J31322L00152C5571N89334B53471Q5969P6072n1118
17130C64394J06362B00547j4276L16798q222H6332M83873E2375K43448C1748M33766
17119D65514J94517j51281j95667o0949J6956G6623J55941K2620K902J40063j6632
17108C81517J32424A53119K97547A08090L10081k9163K10740A30971P6592l693
17098B03870J75332J53818J45479B39241N3655J94536j89386L30222E1190L77399
$$ plain form
17088 428589 600496 612033 212419 327703 535730 600952 270838 547432 714027 311140
17077 312685 622497 447968 465002 631016 490727 111853 177800 495572 951975 126192
17066 476868 502457 723051 407533 777008 596176 517126 598403 407879 429352 568666
17056 568666 273614 234019 403386 465334 358262 506215 476838 432857 346374 490753
17046 490753 535690 622141 477535 511911 716890 862065 595282 696723 808819 700011
17036 700011 608776 805975 295671 358858 622681 723457 966611 472573 793004 -74507
17025 630335 480280 876094 899434 216010 832869 536619 648491 727277 1039888 795159
17015 795159 677808 639117 611570 1046586 938055 477136 423515 500385 749020 820473
$$ packed form
17088D28589J71907J1537B12419J15284K08027O5222B70838K76594J66595C11140
17077C12685L09812j74529J7034J66014j40289A11853O5947L17772M56403A26192
17066D76868K5589K20594l15518L69475j80832p9050Q1277j90524K1473J39314
17056E68666B73614l9595J69367O1948j07072J47953k9377m3981q6483J44379
17046D90753M4937Q6451j44606L4376K04979J45175k66783J01441J12096j08808
17036G00011r1235J97199B95671O3187K63823J00776K43154D72573L20431g4507
17025F30335j50055L95814K3340B16010O16859k96250J11872P8786L12611k44729
17015G95159j17351l8691k7547M35016j08531m60919n3621P6870K48635P1453
$$ plain form
17005 820473 720870 772629 796945 639520 587414 769214 555709 811176 662435 593915
16995 593915 710184 726536 702324 860138 410474 840179 619439 892122 823269 734025
16985 734025 861797 575150 482330 1072840 834088 1135079 711782 553299 908097 1013220
16975 1013220 1018165 722046 867422 1158916 795481 810517 846205 976102 883362 960949
16965 960949 963734 1009210 1037918 979434 729419 991603 752371 938196 945189 1103557 792566
16954 792566 821168 1154904 922228 1209870 1225728 924452 1548329 843308 839758 853160
16944 853160 772966 1417738 1300048 927235 1325222 1398267 1378806 1217946 1022978 1403333
16934 1403333 1117787 1079116 1296409 1031465 955359 1408224 1439645 1777881 1406222 1325553
$$ packed form
17005H20473r9603N1759K4316j57425n2106J81800k13505K55467j48741o8520
16995E93915J16269J6352k4212J57814D10474M29705k20740K72683o8853q9244
16985G34025J27772k86647r2820N90510k38752L00991m23297j58483L54798J05123
16975A013220M945k96119J45376K91494l63435J5036L5688J29897r2740P7587
16965I60949K785M5476K8708n8484k50015K62184k39232J85825O993J58368l10991
16954G92566K8602L33736k32676K87642J5858l01276O23877p05021l550J3402
16944H53160q0194O44772j17690l72813L97987P3045j9461j60860j94968L80355
16934A403333k85546l8671K17293k64944p6106M52865L1421L38236l71659q0669
$$ plain form
16924 1325553 1295843 1261816 1499018 1445292 1723219 1567753 1583370 1408336 1688128 1595522
16914 1595522 1956436 1413546 1435569 1426313 1430975 1552047 1995847 1668605 1699749 1683257 1709786
16903 1709786 1580940 1656330 2144067 1699717 2125064 1578367 1806521 1839475 1761920 1813794
16893 1813794 1692565 1817578 2098489 1905238 2304956 1960755 1810339 1993532 2000860 1677206
16883 1677206 2107546 2284522 1775671 2378108 2733646 1990102 2372201 2370676 2392389 2364843
16873 2364843 2453393 2295866 2723618 2802127 2695145 2161799 2484901 2338589 2694705 2842592
16863 2842592 2939967 2645875 2940918 3106722 3060823 3082119 2768567 2981132 2892126 3212416
16853 3212416 3196140 3474392 3302082 3199182 3314565 2991980 3449128 3413942 3411336 3730743
$$ packed form
16924A325553k9710l4027K37202n3726K77927j55466J5617j75034K79792r2606
16914A595522L60914n42890K2023r256M662J21072M43800l27242L1144j6492K6529
16903A709786j28846P5390M87737m44350M25347n46697K28154L2954p7555N1874
16893A813794j21229J25013K80911j93251L99718l44201j50416J83193P328l23654
16883A677206M30340J76976n08851O02437L55538p43544L82099j525K1713k7546
16873B364843Q8550j57527M27752P8509j06982n33346L23102j46312L56116J47887
16863B842592R7375k94092K95043J65804m5899K1296l13552K12565q9006L20290
16853C212416j6276K78252j72310j02900J15383l22585M57148l5186k606L19407
$$ plain form
16843 3730743 3612590 3798375 3802800 3494105 4266155 4036906 4190749 3985295 4072093 4376549
16833 4376549 3982434 4501806 4762456 4196629 4801709 4505544 4749711 4840651 4949789 4835325
16823 4835325 5003950 5025503 5579029 5430580 5597662 5923413 5634466 5943814 5972465 5846375
16813 5846375 6370192 6348560 6375583 6415850 6869968 6819269 6965286 7219616 7220443 7425233 7754077
16802 7754077 7576565 7993027 7826769 8156600 8650578 8678322 8778871 8931641 9289108 9840106
16792 9840106 9804803 10063188 10520809 10754947 10827331 11465474 11534207 11831163 11713026 12563966
16782 12563966 13163745 13559142 13545489 14067672 14519361 14765615 15200103 15803786 16563173
16773 16563173 16689347 16918383 17915118 18540690 19386743 19595536 20948218 21219053 22408175
$$ packed form
16843C730743j18153J85785M425l08695P72050k29249J53843k05454Q6798L04456
16833D376549l94115N19372K60650n65827O05080k96165K44167R0940J09138j14464
16823D835325J68625K1553N53526j48449J67082L25751k88947L09348K8651j26090
16813E846375N23817k1632K7023M0267M54118n0699J46017K54330Q27K04790L28844
16802G754077j77512M16462j66258L29831M93978K7744J00549J52770L57467N50998
16792I840106l5303K58385M57621K34138P2384O38143O8733K96956j18137Q50940
16782A2563966N99779L95397j3653N22183M51689K46254M34488O03683P59387
16773A6563173J26174K29036R96735O25572Q46053K08793J352682K70835J189122
$$ plain form
16764 22408175 22949179 23731767 24489519 25785408 27125424 27780571 29130907 30225060 31823128
16755 31823128 32922808 34253606 35946415 37377766 39203005 41601871 43363433 45469117
16747 45469117 47762785 50269740 52852994 55447118 58590898 61958855 65133013 68970787
16739 68970787 72770533 76960274 81712550 86338005 91521847 97002098 102602805 108999944
16731 108999944 115141506 121824402 128621591 135902967 142973317 150398215 157666923 164532207
16723 164532207 171269050 177093608 182112222 186966264 190445539 192417771 193539017 193402617
16715 193402617 192068740 189374948 185512642 180813147 175069277 169079695 162296051 155497628
16707 155497628 147985512 140303040 133494728 126018937 119358127 112691502 106237493 99959247
$$ packed form
16764B2408175N41004P82588P57752J295889J340016O55147J350336J094153J598068
16755C1823128J099680J330798J692809J431351J825239K398866J761562K105684
16747D5469117K293668K506955K583254K594124L143780L367957L174158L837774
16739F8970787L799746M189741M752276M625455N183842N480251N600707O397139
16731A08999944O141562O682896O797189P281376P070350P424898P268708O865284
16723A64532207O736843N824558N018614M854042L479275J972232J121246j36400
16715A93402617j333877k693792l862306m699495n743870n989582o783644o798423
16707A55497628p512116p682472o808312p475791o660810o666625o454009o278246
$$ plain form
16699 99959247 94184499 88740149 83775752 78647074 74405041 70228393 66456306 62359661
16691 62359661 59254568 56188855 53161134 50304123 47790208 45108032 43385495 41289847
16683 41289847 39191068 37033875 35417801 33801153 32583891 30807305 29963018 28381171
16675 28381171 27134599 26110463 24950256 24280257 23244183 22150637 21399988 20794528
16667 20794528 19874533 19114000 18414735 18007649 17178192 16581043 15819348 15593442 14889500
16658 14889500 14447263 14109003 13420446 13063495 12813626 12371532 12088140 11550615 11365694
16649 11365694 11159249 11015442 10344687 10180698 9611895 9633427 9430229 9361956 8884928 8483233
16639 8483233 8406765 8050296 8170912 7785229 7761810 7268631 7180241 7304561 6731044 6618269
$$ packed form
16699I9959247n774748n444350m964397n128678m242033m176648l772087m096645
16691F2359661l105093l065713l027721k857011k513915k682176j722537k095648
16683D1289847k098779k157193j616074j616648j217262j776586q44287j581847
16675B8381171j246572j024136j160207o69999j036074j093546p50649o05460
16667B0794528r19995p60533o99265m07086q29457n97149p61695k25906p03942
16658A4889500m42237l38260o88557l56951k49869m42094k83392n37525j84921
16649A1365694k06445j43807o70755j63989n68803K1532k03198o8273m77028m01695
16639H483233p6468l56469J20616l85683k3419m93179q8390J24320n73517j12775
$$ plain form
16629 6618269 6487028 6444803 6006465 6265935 5506913 5863210 5947436 5987080 5078748 5114721
16619 5114721 5224214 5059062 5103258 5062096 4641703 4923869 4727687 4276646 4541457 4369847
16609 4369847 4545067 4277801 4202310 4244122 3859704 3882695 3877855 4085989 3874352 3964424
16599 3964424 3652652 3596849 3698138 3649734 3268615 3199872 3431746 2829513 3331279 3248819
16589 3248819 3106452 3045037 2912205 3008135 2821503 2854232 2614823 2776590 2533651 2531471
16579 2531471 2450033 2620026 2769818 2719072 2640231 2317549 2413457 1986912 2334867 2151909
16569 2151909 2181078 2349647 2352224 2108995 2146362 1821260 2012084 2078680 1761354 2285414
16559 2285414 1839404 1735488 2095697 2054104 1867074 1510483 1516755 1813345 1508757 1358602
$$ packed form
16629F618269j31241m2225m38338K59470p59022L56297Q4226L9644r08332L5973
16619E114721J09493j65152M4196m1162m20393K82166j96182m51041K64811j71610
16609D369847J75220k67266p5491M1812l84418K2991m840K08134k11637R0072
16599C964424l11772n5803J01289m8404l81119o8743K31874o02233N01766q2460
16589C248819j42367o1415j32832R5930j86632L2729k39409J61767k42939k180
16579B531471q1438J69993J49792n0746p8841l22682R5908m26545L47955j82958
16569B151909K9169J68569K577k43229L7367l25102J90824O6596l17326N24060
16559B285414m46010j03916L60209m1593j87030l56591O272K96590l04588j50155
$$ plain form
16549 1358602 1359842 1565167 1635654 1572810 1611933 1639428 1572231 1716043 1633969 1412468 1777931
16538 1777931 1210362 1298331 1636047 1703740 1544220 1335142 1324793 1388807 1692516 1357680
16528 1357680 1262987 1113985 1190866 1515079 1330332 1059414 1240839 1213777 1001020 1041476
16518 1041476 1285297 1181987 1167202 1099546 902237 1162086 1258182 990378 1298727 784460
16508 784460 820903 1032212 939087 975201 1002825 1228074 845833 940515 958453 972400 1128427
16497 1128427 1057763 721241 993102 803618 599678 824451 942199 945770 924147 943752
16487 943752 818374 736524 790786 700953 672300 778319 705940 1035417 1127341 671848 717542
16476 717542 529405 739612 703486 598390 608796 768524 817155 562469 733872 710912
$$ packed form
16549A358602J240K05325P0487o2844L9123K7495o7197J43812q2074k21501L65463
16538A777931n67569Q7969L37716O7693j59520k09078j0349O4014L03709l34836
16528A357680r4693j49002P6881L24213j84747k70918J81425k7062k12757M0456
16518A041476K43821j03310j4785o7656j97309K59849R6096k67804L08349n14267
16508G84460L6443K11309r3125L6114K7624K25249l82241R4682J7938J3947J56027
16497A128427p0664l36522K71861j89484k03940K24773J17748L571k1623J9605
16487I43752j25378q1850N4262q9833k8653J06019p2379L29477R1924m55493M5694
16476G17542j88137K10207l6126j05096J0406J59728M8631k54686J71403k2960
$$ plain form
16466 710912 542663 598597 576132 738792 778625 299584 486009 800075 726981 744701
16456 744701 251105 713306 670180 862812 513063 439953 541901 705331 396743 319245
16446 319245 481779 695242 340196 -9727 383495 406963 734214 454593 412576 678328
16436 678328 484356 572789 436455 463020 486442 552712 552925 462682 446814 371931 320075
16425 320075 325047 122184 227918 751945 351090 174561 430891 562044 280999 244225
16415 244225 365157 352243 711761 499376 573681 289094 300245 229747 492151 162854
16404 603794 650205 404503 157432 674256 178701 490836 406918 227236 399640 364435
16394 364435 29445 161538 491954 540783 268483 230618 -33818 411139 465826 406631 365393
$$ packed form
16466G10912j68249N5934k2465J62660L9833B99584J86425L14066p3094J7720
16456G44701B51105M62201m3126J92632l49749p3110J01948J63430l08588p7498
16446C19245J62534K13463C40196i727C83495K3468L27251k79621m2017K65752
16436F78328j93972Q8433j36334K6565K3422O6270K13r0243j5868p4883n1856
16425C20075M972A22184J05734N24027C51090A74561K56330J31153B80999l6774
16415B44225J20932j2914L59518k12385P4305k84587J1151p0498K62404A62854
16404F03794M6411k45702A57432N16824A78701L12135q3918j79682J72404l5205
16394C64435B9445J32093L30416M8829B68483l7865c3818D11139N4687n9195m1238
$$ plain form
16383 365393 308808 227928 762844 214812 437611 343444 202090 259922 487970 239436
16372 143169 273804 209948 243680 135320 105326 568658 52316 303580 149891 422532
16362 422532 20608 239630 322878 344717 233344 210874 379469 33582 401125 37443 171764
16351 171764 440604 469613 250804 371100 438722 394977 81017 421109 327916 382947 195076
16340 195076 219193 244997 308630 -64740 487546 619946 109021 209380 -87981 240315
16329 215213 302047 515383 273391 220823 188822 -325241 -17322 9327 149154 218816 242341
16318 242341 408053 -111834 134376 78362 166027 -266308 361718 -56304 238702 434247
16308 434247 -53272 429319 300709 337876 438544 117900 56433 213074 120293 181468
$$ packed form
16383C65393n6585q0880N34916B14812K22799r4167j41354N7832K28048B39436
16372A43169J30635o3856L3732j08360k9994M63332E2316K51264A49891K72641
16362D22532B0608K19022Q3248K1839j11373k2470J68595C3582L67543C7443J34321
16351A71764K68840K9009k18809J20296O7622m3745H1017L40092r3193N5031j87871
16340A95076K4117K5804O3633f4740D87546J32400A09021J00359h7981B40315
16329B15213Q6834K13336k41992n2568l2001c25241a7322I327J39827O9662K3525
16318B42341J65712a11834A34376n6014Q7665b66308C61718e6304B38702J95545
16308D34247e3272D29319j28610L7167J00668A17900E6433J56641r2781O1175
$$ plain form
16298 181468 28082 -29309 90016 -126031 182696 85436 399916 46046 210638 285168 22906
16286 93632 451165 208610 304419 -31720 -15617 158505 400860 470831 12997 218755 -13010
16274 102305 -56453 222981 141437 -98220 225683 92647 219738 173874 330516 226684
16264 226684 -115850 6645 44895 128145 -238026 103154 -30033 346499 -3726 139853 205989
16253 205989 65795 135164 6065 -149020 215690 -302989 96339 42387 222271 131752 106623
16242 106623 -44706 -89690 495314 325636 44300 -76629 229733 354897 21856 168488
16232 168488 227183 60549 193059 141600 336226 -137831 -150120 309394 48846 277318
16222 277318 -3162 101605 -136323 116275 198294 194294 128364 402254 -153290 243719 22614
$$ packed form
16298A81468B8082b9309I0016a26031A82696H5436L14480D6046J64592P4530B2906
16286I3632L57533B08610R5809c1720a5617A58505K42355O9971A2997K05758a3010
16274A02305e6453B22981q1544i8220B25683I2647J27091m5864J56642j03832
16264B26684a15850F645L8250Q3250b38026A03154c0033C46499c726A39853O6136
16253B05989F5795O9369F065a49020B15690c02989I6339D2387J79884r0519k5129
16242A06623d4706m4984D95314j69678D4300g6629B29733J25164B1856J46632
16232A68488N8695F0549J32510n1459J94626a37831j2289C09394D8846K28472
16222B77318c162A01605a36323A16275Q2019m000o5930K73890a53290B43719B2614
$$ plain form
16210 -132332 -70169 269298 -134842 27635 56067 -111350 -246209 46561 483557 -1418 41215
16198 205625 97573 310005 207820 127398 96024 211759 518914 229484 380824 294935
16188 294935 -59473 189206 -93584 45820 -148230 -117129 114897 -65755 129156 256132
16178 256132 205785 -282591 77312 573724 5662 82695 491404 66824 104771 350031 322116
16167 322116 -220794 -271599 -199459 131874 -38930 -4536 57665 -64262 123865 418343 175198
16155 42499 57919 27561 -183206 -19520 132796 294352 140050 172346 129810 -147635 13418
16143 106609 -104216 -94124 182790 -154989 -39865 22588 125822 -146618 153344 308801
16133 308801 274426 -59534 -53632 -133884 160187 -95207 -57698 -13450 -163024 -137311 25839
$$ packed form
16210a32332O2163B69298a34842B7635K8432a11350j34859D6561M36996a418D1215
16198B05625I7573K12432j02185q0422l1374J15735L07155B29484J51340q5889
16188B94935e9473A89206i3584D5820a48230L1101A14897f5755A29156J26976
16178B56132n0347b82591G7312M96412E662P7033M08709F6824L7947K45260k7915
16167C22116b20794n0805P2140A31874c8930d536E7665f4262A23865K94478A75198
16155D2499J5420B7561a83206a9520A32796J61556A40050L2296m2536a47635A3418
16143A06609a04216J0092A82790a54989c9865B2588J03234a46618A53344J55457
16133C08801l4375e9534N902q0252A60187i5207L7509a3450j49574K5713B5839
$$ plain form
16121 -130833 -34242 -106254 69154 -48791 213914 -142315 -209414 -175964 -112829 29801 -9826
16109 -61367 -119577 -233212 -30757 61049 259811 -107231 242210 107363 126019 6826 378373
16098 378373 113223 -99547 94103 151349 -155712 -139715 -108257 142210 -168238 277871
16087 -60750 -100935 -255163 -183962 -238259 -93401 231988 -83696 58514 -230073 -31776 -89536
16076 -89536 -80701 -5000 274641 -254131 131158 143578 -44618 242170 -68333 310189 128214
16064 11134 -79615 261727 -68 31071 -156753 18481 -83474 40070 -105516 -69593 -129455 -358954
16052 -358954 353646 -187840 112072 40745 -14802 -62824 -251845 -339127 176529 -7038 219204
16040 -378089 -10107 208737 -282853 -34274 145245 -31671 -199658 -149735 -232557 -132939 -139119
$$ packed form
16121a30833c4242p2012F9154d8791B13914a42315o7099L3450O3135B9801i826
16109f1367n8210j13635c0757F1049J98762a07231B42210A07363J8656F826L71547
16098C78373A13223i9547I4103N7246a55712J5997L1458A42210a68238B77871
16087f0750m0185j54228P1201n4297i3401B31988h3696E8514b30073c1776n7760
16076h9536Q835e000B74641b54131A31158J2420d4618B42170f8333C10189A28214
16064A1134g9615B61727f8C1071a56753A8481h3474D0070a05516L5923n9862k29499
16052c58954C53646a87840A12072D0745a4802m8022j89021q7282A76529g038B19204
16040c78089a0107B08737b82853c4274A45245c1671j67987M9923q2822R9618o180
$$ plain form
16029 -139119 321664 -92232 -34696 -123009 -132820 -253649 12047 -353018 -181903 28803 -226493
16017 69598 -114023 374774 -177424 85562 -323967 131497 -80636 21981 150288 -262052
16006 109601 152389 -1590 224754 -156873 -93012 -85120 -136448 -130428 74371 48392 -16377 -30926
15994 -30926 442744 157220 24757 -43201 -290673 19656 -69467 231034 93637 -192907 28723
15982 505238 297575 201247 81162 413101 368969 80823 -162013 56515 7509 185526 177164
15971 177164 -5643 91730 -146886 -118331 -135865 -180898 318709 291895 -7986 97729 373974
15960 373974 -253152 -222831 226834 -4491 60408 -237779 -182191 68601 -143070 -189087 -358560
15949 -358560 79310 -201881 -268131 56762 108707 134936 -147684 -50775 77172 -188332 169958
$$ packed form
16029a39119C21664i2232c4696q8313r811j20829A2047c53018J71115B8803b26493
16017F9598a14023C74774a77424H5562c23967A31497h0636B1981J28307b62052
16006A09601M2788a590B24754a56873O3861P892n1328O020G4371k5979a6377j4549
15994c0926D42744A57220B4757d3201k47472A9656f9467B31034I3637a92907B8723
15982E05238k07663r6328H1162L31939m4132H0823a62013E6515G509J78017q362
15971A77164e643I1730a46886K8555j7534m5033C18709k6814g986I7729K76245
15960C73974b53152L0321B26834d491F0408b37779N5588F8601a43070m6017j69473
15949c58560G9310b01881o6250E6762N1945K6229a47684e0775G7172a88332A69958
$$ plain form
15937 215865 -72619 -179027 136122 -175149 208915 106001 -226410 -81819 -33271 -172905
15927 -172905 -23343 102521 3886 90352 5725 170805 22012 88215 101632 156789 170083
15916 170083 -259803 -340973 -21088 -172869 42951 29282 94238 216870 379149 -376736
15905 -273008 1129 121883 122482 23266 -286579 -205470 -127475 209914 334538 18528 11565
15894 11565 206398 81486 -280057 127122 -170237 185591 -94216 -11151 71253 -41100 -159395
15883 -159395 -144747 -479218 217880 321312 21136 -201491 -22490 98925 -30062 -43622 7797
15871 -111464 92876 234345 -282985 -118829 -127902 180793 15174 -29435 -123040 159362 -168865
15859 149040 -50900 -151656 -152898 349355 -178929 -106027 102067 158011 186098 239596 -26216
$$ packed form
15937B15865g2619j06408A36122a75149B08915j02914b26410h1819c3271j39634
15927a72905b3343A02521C886Q6466E725J65080B2012O6203J3417N5157J3294
15916A70083b59803q1170b1088j51781D2951j3669O4956J22632J62279c76736
15905b73008A129J20754N99B3266b86579Q1109P7995B09914J24624A8528o963
15894A1565J94833H1486b80057A27122a70237A85591i4216a1151G1253d1100j18295
15883a59395J4648l34471B17880J03432B1136b01491b2490I8925c0062j3560G797
15871a11464I2876J41469b82985a18829r073A80793A5174b9435r3605A59362a68865
15859A49040e0900j00756j242C49355a78929P2902A02067N5944K8087N3498b6216
$$ plain form
15847 -174206 238388 -345994 -288645 107599 106854 -298052 -288618 -139807 126427 -268364 -180286
15836 -180286 -309238 -69575 12702 -422299 140608 -104925 -36883 -28176 82523 10619 -107251
15824 58241 89248 -250292 -116267 -321771 -20793 31446 252260 -103173 139440 -246127
15813 -113168 -59679 122920 -681334 176673 -106874 -230664 -265419 -354565 -118441 -246306
15803 -246306 21423 224746 -116462 -167138 -198135 -387818 189021 -430316 -191371 36425
15792 -91347 -150143 212879 198602 -132681 72553 34306 18915 -237739 21831 -119382 -14504
15780 -96901 -53599 -226844 152027 99196 37475 389771 -153005 -45562 216044 243234 11946
15768 -137241 9923 -32382 81665 136474 -161275 -369112 -192551 -99910 -183049 126523 263383
$$ packed form
15847a74206B38388c45994N7349A07599p45b98052R434a39807A26427b68364Q8078
15836a80286j28952f9575A2702d22299A40608a04925c6883Q707H2523A0619a07251
15824E8241L1007b50292a16267k05504b0793C1446K20814a03173A39440b46127
15813a13168N3489A22920f81334A76673a06874j23790l4755q9146a18441j27865
15803b46306B1423K03323a16462n0676l0997j89683A89021d30316a91371C6425
15792i1347n8796B12879j4277a32681G2553C4306j5391b37739B1831a19382a4504
15780i6901M3302j73245A52027n2831C7475L52296a53005d5562B16044K7190A1946
15768a37241I923c2382H1665N4809a61275k07837J76561R2641q3139A26523J36860
$$ plain form
15757 263383 190135 -36672 -321158 226023 376114 -334064 -139335 -169799 -7336 21006 281839
15746 281839 177553 77105 -12817 -161657 54725 -40758 267064 -113775 115630 -163144
15735 -20458 -129568 -286226 16259 106660 118079 -89433 19115 138679 65406 -233905 214548
15723 49751 -5653 187819 57122 -111081 359138 -62672 192756 -935 -312335 222243 -190124
15711 -28487 37248 -342647 -178368 -285234 -146202 4043 -71467 -519425 80549 -61165 -80709
15700 -80709 36289 -95200 -198538 -252232 213311 492626 -20388 -61993 -376145 61281 142988
15689 142988 110088 179885 -277425 -8751 -213591 82660 46889 -153203 784 234995 -199267
15677 -80435 322606 -143666 62768 -78734 143936 118872 363830 -149560 71613 -156514
$$ packed form
15757B63383p3248c6672k84486B26023J50091c34064a39335l0464g336B1006K60833
15746B81839j04286G7105a2817j48840E4725d0758B67064a13775A15630a63144
15735b0458j09110j56658A6259R0401J1419h9433A9115J19564F5406b33905B14548
15723D9751e653A87819E7122a11081C59138f2672A92756i35l11400B22243a90124
15711b8487C7248c42647J64279j06866J39032D043g1467m47958H0549f1165j9544
15700h0709C6289i5200j03338n3694B13311K79315b0388m1605l14152F1281Q1707
15689A42988l2900O9797b77425h751k04840H2660l5771a53203G84K34211a99267
15677h0435C22606a43666F2768g8734A43936k5064K44958a49560G1613a56514
$$ plain form
15666 1489 114942 -235322 -35514 -294479 -231962 -131063 -286758 16453 30857 -14303 -287270
15655 -287270 172026 -201475 220708 36806 -168782 -167169 -112217 21618 22350 418690 -227709
15643 -4323 -31010 21882 52942 227063 182592 -86067 8021 95426 -411755 356050 -89549
15631 -323867 130914 214122 143709 -117645 171822 -271599 -30023 -116743 73262 233035
15621 233035 -109449 -459473 -74470 380638 220469 -180172 -87669 -195283 -122007 145261
15610 143927 31193 5488 228112 78156 -15085 95826 -29170 118496 15642 -51254 -206056
15599 -206056 115871 10254 -402192 -50320 146496 126023 -184845 -190300 -143976 38638 -337170
15587 -54886 221335 -386356 65356 -76643 49022 -96210 201325 127306 -27810 -37631 -92179
$$ packed form
15666A489J13453b35322c5514k58965O2517J00899j55695A6453J4404a4303k72967
15655b87270A72026b01475B20708C6806a68782J613N4952B1618P32L96340b27709
15643d323k6687B1882L1060J74121m4471h6067H021Q7405d11755C56050h9549
15631c23867A30914Q3208p0413a17645A71822b71599c0023q6720G3262J59773
15621B33035a09449l50024g4470C80638j60169a80172h7669j07614P3276A45261
15610A43927C1193E488K22624G8156a5085I5826b9170A18496A5642e1254j54802
15599b06056A15871A0254d02192e0320A46496k0473a84845n455M6324C8638c37170
15587e4886B21335c86356F5356g6643D9022i6210B01325p4019b7810r821n4548
$$ plain form
15576 -92179 -133696 -277854 17513 217501 -16323 92327 166437 100605 -122678 -80659 -199265
15565 -199265 -254905 27215 75398 191548 -252721 42495 -150400 -201674 -194644 291652 -35824
15553 -61094 66583 303479 -62031 107345 -261453 19189 122166 -62214 -382357 195819
15542 -44583 -20654 161650 261673 180122 -251439 206006 -248873 187471 -118236 244099
15531 -78069 -119244 69719 -147217 -128530 -18982 -135466 -8401 28847 -174987 -187582 51187
15519 62599 -19875 124721 -17487 -268310 123434 -39713 138579 281712 39336 80552 -104023
15507 30491 -351372 72330 -21888 112455 -148486 -165884 78762 110965 -181395 97474 4398
15495 41652 -95918 -112118 -304055 32461 57070 -372091 -271979 -469311 101335 113640 -208468
$$ packed form
15576i2179m1517j44158A7513J99988a6323I2327P4110o5832a22678M2019j18606
15565a99265n5640B7215M8183J16150b52721D2495a50400n1274P030B91652c5824
15553f1094F6583K36896f2031A07345b61453A9189J02977f2214l20143A95819
15542d4583b0654A61650J00023q1551b51439B06006b48873A87471a18236B44099
15531g8069m1175F9719a47217J8687a8982j16484h401B8847a74987j2595E1187
15519F2599a9875A24721a7487k50823A23434c9713A38579J43133C9336M1216a04023
15507C0491c51372G2330b1888A12455a48486j7398G8762L2203a81395I7474D398
15495D1652i5918j6200j91937C2461K4609c72091J00112j97332A01335J2305b08468
$$ plain form
15483 13899 35918 -221308 184273 -8653 39385 227863 268990 7335 -52353 -33723 92638
15471 36738 18981 343558 -71137 -84162 -217950 -200070 6643 14532 224355 52968 -187902
15459 -444480 -199324 152075 -63110 60210 117580 -249181 54951 139355 35089 264529 -100379
15447 195605 84678 19833 -46228 14362 10588 -174211 -232425 -87986 66749 165201 -41934
15435 -29161 64388 -211304 -239098 120868 -34778 108928 68314 -56450 -114795 -206002 56044
15423 -235869 -148633 -229901 99325 -100718 -16940 -71123 -188815 28524 66548 -440415 -159197
15411 342528 -47807 -286704 185612 218301 -282096 -122670 -167633 179984 -168174 32589
15400 188151 149698 -264078 -57927 -287342 210155 188712 291159 -72367 101264 115739
$$ packed form
15483A3899K2019b21308A84273h653C9385J88478M1127G335e2353J8630I2638
15471C6738j7757L24577g1137j3025j33788J7880F643P889K09823E2968a87902
15459d44480a99324A52075f3110F0210N7370b49181E4951Q4404C5089K29440a00379
15447A95605H4678A9833d6228A4362l774a74211n8214h7986F6749R8452d1934
15435b9161F4388b11304k7794A20868c4778A08928m0614e6450n8345r1207E6044
15423b35869Q7236q1268I9325a00718a6940n4183j17692B8524L8024d40415a59197
15411C42528d7807k38897A85612L2689b82096a22670m4963A79984a68174C2589
15400A88151l8453b64078e7927k29415B10155k1443J02447g2367A01264J4475
$$ plain form
15390 115739 -61688 224357 -10022 -153891 131481 26561 502915 -114950 127526 225982
15380 225982 276131 -241186 -85094 -192324 195739 156784 148855 -41103 -28335 128768 63110
15368 -189409 -138376 209059 -74010 3914 -152053 -146588 -11989 23367 109062 -350168 -251303
15357 -251303 -15664 -58232 165187 43121 226276 -38269 61229 -165952 -133732 -139145 124436
15345 13796 271559 -177676 185368 166965 -187947 -334501 82510 -204208 -148712 244150
15334 -190543 149181 138474 -99950 46576 101729 172440 -171684 -321418 194786 211609 118460
15323 118460 73841 -105107 179266 252978 31094 -178044 -44546 67673 -249531 97017 -135630
15311 -3812 25984 140353 -59669 -49079 -176442 -55337 8376 36317 63708 -165973 -191069
$$ packed form
15390A15739f1688B24357a0022j43869A31481B6561M76354a14950A27526R8456
15380B25982N0149b41186h5094j07230A95739l8955p929d1103J2768A28768F3110
15368a89409N1033B09059g4010C914a52053N465a1989B3367Q5695c50168R8865
15357b51303a5664m2568A65187D3121J83155c8269F1229a65952L2220n413A24436
15345A3796K57763a77676A85368j8403a87947j46554H2510b04208N5496B44150
15334a90543A49181j0707i9950D6576N5153P0711a71684j49734A94786J6823r3149
15323A18460m4619a05107A79266P3712C1094a78044d4546F7673b49531I7017a35630
15311c812B5984J14369e9669J0590j27363e5337H376K7941K7391a65973k5096
$$ plain form
15300 -191069 -195125 107524 179201 214627 13295 156095 -112193 1152 180672 -220592 -50212
15288 56462 53445 -40546 48925 178664 81117 -273066 242271 313810 385052 -26948 -160938
15277 -160938 -36444 54291 46288 -82333 57225 -159284 -71447 3170 125482 107859 238057
15266 238057 206968 41364 100527 1003 158333 -318376 -352734 143487 49130 160227 16452
15254 -217104 181229 146560 90044 236596 497602 401186 1119008 1116989 1076877 1382132 874933
15243 874933 335186 208692 101726 -234080 -132620 -182251 -44898 180281 218503 111073
15233 111073 54125 55258 123668 69530 249422 158818 -126002 2124 -365492 184760 307967
15222 307967 304990 -216138 235981 45303 170817 -91937 -65837 68874 -255737 184560 364359
$$ packed form
15300a91069m056A07524P1677L5426A3295J42800a12193A152J79520b20592e0212
15288E6462l017d0546D8925J29739H1117b73066B42271P1539P1242b6948j33990
15277a60938c6444E4291q003h2333E7225a59284g1447C170J22312j7623J30198
15266B38057l1089D1364N9163A003J57330c18376l4358A43487D9130J11097A6452
15254b17104A81229l4669n6516J46552K61006r6416P17822k019m0112L05255n07199
15243H74933C35186j26494A01726b34080J01460m9631d4898A80281L8222j07430
15233A11073E4125J133O8410n4138J79892r0604a26002B124c65492A84760J23207
15222C07967k977b16138B35981D5303J25514i1937K6100F8874b55737A84560J79799
$$ plain form
15211 364359 -106416 -140724 -129577 -35665 51117 -212317 -17068 28609 -326702 106372 99034
15200 99034 70678 -52096 255735 215685 249142 111444 75164 143569 152895 112359 -96903
15188 -25506 199443 -120414 -299207 -202699 235914 39501 121405 -167068 220320 182030
15178 182030 201137 44186 -147258 256952 -49785 84152 3561 100095 140010 290409 257940
15167 257940 383902 215182 -299705 31148 167222 277220 208387 119918 -3228 27032 92921
15156 92921 -218675 -214425 53551 -53283 -12558 72118 -99006 -50251 8974 -185577 38995 111253
15144 111253 165897 52755 102506 -80217 301692 -205963 252887 -7789 95683 102827 140414
15133 140414 149161 276097 10676 83214 108728 255997 373974 -113196 359661 247306
$$ packed form
15211C64359a06416l4308J1147c5665E1117b12317a7068B8609c26702A06372p338
15200I9034k8356e2096B55735m0050L3457A11444l6280O8405R326m0536i6903
15188b5506A99443a20414j78793R6508B35914C9501Q1904a67068B20320l8290
15178A82030J9107D4186a47258B56952d9785H4152C561R6534L9915J50399l2469
15167B57940J25962j68720b99705C1148J36074J09998o8833q8469c228B7032O5889
15156I2921b18675M250E3551e3283a2558G2118i9006M8755H974a85577C8995P2258
15144A11253N4644E2755M9751h0217C01692b05963B52887g789I5683P144L7587
15133A40414Q747J26936A0676P2538K5514J47269J17977a13196C59661j12355
$$ plain form
15123 247306 108788 354638 77585 200659 168018 26512 -33948 254926 205124 150491 224428
15112 224428 -80230 96842 -107099 206325 157602 245402 175415 238812 214178 570070 436930
15101 436930 -170230 283170 -46860 298064 296042 87296 217601 242786 7928 108250 136981
15090 136981 157211 35372 -247774 40460 -24847 -115480 -27546 84038 321294 119632 -205326
15078 54459 8200 -131166 2907 30281 448392 281200 287949 190010 407618 37775 99559
15067 99559 80084 117895 437949 201777 280777 -27316 99087 140165 23518 272055 271101
15056 271101 -214137 76405 187343 100233 313473 192312 -185782 -60146 136017 -71774
15045 134550 108321 -65884 121892 346595 24192 225506 268979 285250 457157 -7519 445050
$$ packed form
15123B47306A08788K45850G7585J23074l2641B6512c3948B54926m9802n4633P3937
15112B24428h0230I6842a07099B06325m8723Q7800o9987O3397k4634L55892j33140
15101D36930a70230B83170d6860B98064k022H7296J30305K5185G928J00322K8731
15090A36981K0230C5372b47774D0460b4847r0633b7546H4038K37256A19632b05326
15078E4459H200a31166B907K7374M18111j67192O749r7939K17608C7775O1784
15067I9559j9475L7811L20054B01777P9000b7316I9087M1078B3518K48537r54
15056B71101b14137G6405J10938q7110K13240j21161a85782f0146A36017g1774
15045A34550k6229f5884A21892K24703B4192K01314M3473J6271J71907g519D45050
$$ plain form
15033 146180 -96784 198254 17118 -166475 147309 216538 455823 -65507 241849 286304
15023 286304 56322 561108 517462 458795 212289 -44210 335379 76722 189532 240503 40526
15011 350907 -160538 434972 166494 195249 283701 481879 608428 435191 228017 80445
15000 310446 293733 -51970 476204 745 130404 376176 221893 96891 -187638 265653 84560
14988 257208 268547 319866 278816 256211 293625 39683 250247 333140 175102 111680 147569
14977 147569 147641 258440 82262 61930 441318 175262 866277 245383 326847 171517 25273
14965 203441 32422 231575 -50980 196339 333407 75823 136668 47680 -56626 185550 -238480
14953 537239 -59178 57595 314655 114043 228947 163327 72837 -192076 229391 3663 389135
$$ packed form
15033A46180i6784A98254A7118a66475A47309O9229K39285f5507B41849M4455
15023B86304E6322N04786m3646n8667B12289d4210C35379G6722J12810N0971D0526
15011C50907a60538D34972A66494K8755Q8452J98178J26549j73237k07174H0445
15000C10446j6713e1970D76204G45J29659K45772j54283I6891a87638B65653H4560
14988B57208J1339N1319m1050k2605L7414C9683K10564Q2893j58038o3422L5889
14977A47569P2J10799H2262k0332L79388A75262O91015B45383Q1464j55330B5273
14965B03441C2422J99153e0980A96339J37068G5823O0845D7680e6626A85550b38480
14953E37239e9178E7595K57060A14043J14904o5620G2837a92076B29391C663L85472
$$ plain form
14942 389135 350966 329809 426238 426161 328893 211160 241402 132610 121314 55133 24531 12008
14929 253520 72593 442649 81468 353294 320667 340789 302474 3023 29247 378924 176587
14917 420490 -51568 75839 233126 351167 158977 237900 1577 64998 754411 498217 366821
14906 366821 372756 233658 11708 103521 402875 310273 257156 432534 119082 5229 295393
14895 295393 77114 187554 144626 519481 390605 356726 407912 367270 351030 108273 590240
14884 590240 636289 328048 323387 237190 -28926 541439 497208 379771 298765 762778 569378
14873 569378 510323 75642 115233 228516 136543 430837 70920 687491 360756 134310
14862 609995 44109 240108 302785 281065 399875 357142 200457 248774 538212 316506
$$ packed form
14942C89135l8169k1157R6429p7r7268j17733L0242j08792j1296E5133B4531A2008
14929B53520G2593L70056H1468K71826l2627K0122l8315C023K6224L49677A76587
14917D20490e1568G5839J57287J18041A58977P8923A577O3421O89413k56194j31396
14906C66821N935j39098A1708R1813K99354r2602n3117J75378A19082E229K90164
14895B95393G7114J10440m2928L74855j28876l3879N1186m0642j6240A08273M81967
14884E90240M6049l08241m661q6197b8926E41439m4231j17437q1006M64013j93400
14873E69378n9055G5642L9591J13283r1973K94294G0920O16571l26735A34310
14862F09995D4109J95999O2677k1720J18810m2733j56685M8317K89438k21706
$$ plain form
14852 316506 510752 604955 318332 436244 402546 422830 387746 331294 670194 541196
14842 541196 151539 496131 321967 553881 629304 288102 721112 457947 642345 573963
14832 573963 602179 447687 128348 412485 236813 241971 657198 398473 516187 913058
14822 913058 529030 568129 368442 381629 345335 401246 641134 741727 238007 547676
14812 547676 451856 643264 724644 512754 591133 202857 475043 450236 641195 240512
14801 506736 556024 616193 548721 614897 367537 469676 783590 852603 371311 492851
14791 492851 536896 538384 384921 456501 641424 532479 565674 485929 910456 738498 298890
14779 441843 438504 674734 718008 719062 519013 657203 499465 564203 718821 430649 687536
$$ packed form
14852C16506J94246R4203k86623J17912l3698K0284l5084n6452L38900j28998
14842E41196A51539L44592j74164K31914P5423B88102M33010k63165J84398o8382
14832E73963K8216j54492A28348K84137j75672N158M15227k58725J17714L96871
14822I13058l84028L9099j99687J3187l6294N5911K39888J00593B38007L09669
14812E47676r5820J91408Q1380k11890P8379B02857K72186k4807J90959B40512
14801E06736M9288O0169o7472O6176k47360J02139L13914O9013C71311J21540
14791D92851M4045J488j53463P1580J84923j08945L3195p9745M24527j71958B98890
14779D41843l339K36230M3274J054k00049J38190j57738O4738J54618k88172K56887
$$ plain form
14768 687536 792768 797989 507446 782109 122724 337495 495829 467199 535545 394511
14758 394511 441653 255031 519156 782902 689049 939743 673788 588238 926985 793452
14748 793452 327397 633924 567884 645602 414419 662256 652925 658428 628690 233847 888756
14737 888756 646870 476530 674620 738563 470871 802097 765601 961473 492282 600851
14727 600851 797722 587656 722942 352301 622529 749430 819455 1031234 634448 907197
14717 907197 648048 809222 381722 764474 714270 955843 608857 909935 539334 547885
14707 547885 986937 625328 758173 912762 942265 941617 827576 805496 1042614 905735
14697 905735 1240130 822794 1020072 997259 818650 1201117 921869 846486 836666 864066
$$ packed form
14768F87536J05232N221k90543K74663A22724K14771J58334k8630O8346j41034
14758C94511M7142j86622K64125K63746r3853K50694k65955q5550L38747j33533
14748G93452C27397L06527o6040P7718k31183K47837r331N503k9738B33847O54909
14737H88756k41886j70340J98090O3943k67692L31226l6496J95872m69191J08569
14727F00851J96871k10066J35286C52301K70228J26901P0025K11779l96786K72749
14717I07197k59149J61174C81722L82752n0204K41573l46986L01078l70601Q551
14707E47885M39052l61609J32845J54589K9503o48j14041k2080K37118j36879
14697I05735L34395m17336J97278k2813j78609L82467k79248p5383r820K7400
$$ plain form
14687 864066 680890 829546 906072 1235652 776779 842220 1201303 1020472 1069857 1103631
14677 1103631 976785 837122 921205 939121 1459915 1438967 1146036 752108 1057644 982032
14667 982032 1135715 856921 963311 951037 753212 1156971 897326 992265 653886 973388
14657 973388 1176368 1123984 1293543 1083550 1461536 1037551 1233636 1155870 1239267 1067052
14647 1067052 1250399 1128503 1367229 957273 984921 1296118 1378250 1033808 1383216 1015287
14637 1015287 1438973 1216315 1315435 1126602 1197017 1465298 1375938 1474000 1289074 1407579
14627 1407579 1508402 1343769 1469056 1272571 1479327 1338005 1416418 1392166 1459494 1305532
14617 1305532 1573340 1750772 1533289 1278361 1394315 1632684 1629323 1498107 1521037 1656697
$$ packed form
14687H64066j83176J48656P6526L29580m58873O5441L59083j80831M9385L3774
14677A103631j26846j39663Q4083J7916N20794k0948k92931l93928L05536p5612
14667I82032J53683k78794J06390j2274j97825M03759k59645R4939l38379L19502
14657I73388K02980n2384J69559k09993L77986m23985J96085p7766Q3397j72215
14647A067052J83347j21896K38726m09956K7648L11197Q2132l44442L49408l67929
14637A015287M23686k22658R9120j88833P0415K68281q9360R8062j84926J18505
14627A407579J00823j64633J25287j96485K06756j41322P8413k4252O7328j53962
14617A305532K67808J77432k17483k54928J15954K38369l361j31216K2930J35660
$$ plain form
14607 1656697 1627559 1315839 1328303 1522279 1550068 1577143 1458944 1773774 1574758 1703974
14597 1703974 1819575 1775381 1675329 1513122 1750016 1961147 1624564 1984250 1963536 1955239
14587 1955239 1629209 1816811 1598740 2024896 2246235 2114714 1906568 2243640 2046429
14578 2046429 1902520 1880499 2041718 2257361 1983271 2078547 2362590 2426748 2350686 2263157
14568 2263157 2085132 2349808 2435252 2447128 2530210 2638297 2330454 2393274 2611899 2892948
14558 2892948 2875578 2734413 2853640 3239820 3696071 3625280 4147761 4572351 5922402 8344105
14548 8344105 13403636 22333771 38407695 43030764 22617400 10019190 5034876 3177821
14540 3177821 2618290 2361350 2126829 2122147 1860588 2090331 2055748 2083924 1895589 1909843
$$ packed form
14607A656697k9138l11720J2464J93976K7789K7075j18199L14830j99016J29216
14597A703974J15601m4194j00052j62207K36894K11131l36583L59686k0714q297
14587A955239l26030J87602k18071M26156K21339j31521k08146L37072j97211
14578B046429j43909k2021J61219K15643k74090R5276K84043O4158p6062q7529
14568B263157j78025K64676Q5444J1876Q3082J08087l07843O2820K18625K81049
14558B892948j7370j41165J19227L86180M56251p0791N22481M24590J350051K421703
14548H344105N059531Q930135J6073924M623069k0413364A0019190m984314j857055
14540C177821n59531k56940k34521m682k61559K29743l4583K8176j88335J4254
$$ plain form
14530 1909843 1969537 2027806 2342122 2109249 2400330 2164493 2070081 2345694 2742376 2617540
14520 2617540 2579896 2501768 2635358 2915424 2709398 2784814 2910475 2677619 2639273 2831354
14510 2831354 2725720 2712390 2616805 3153147 3045832 3218307 2941836 2924320 3079870 3080121
14500 3080121 2908380 3186961 3325429 3565002 3339272 3110555 3420915 3494191 3450481 3419277
14490 3419277 3593136 3517801 3780104 3558028 3853132 3597853 3887582 4011140 3930759 3902729
14480 3902729 3918658 3613645 4026666 4051222 3850113 4291553 4180840 4542677 4335663 4158243
14470 4158243 4457710 4440750 4432081 4726238 4563152 4480119 4887747 4530245 4693895 4834276
14460 4834276 4507457 4915887 4952067 5021814 4996987 4751403 5079026 5380666 5433872 5556973
$$ packed form
14530A909843N9694N8269L14316k32873K91081k35837r4412K75613L96682j24836
14520B617540l7644p8128J33590K80066k06026P5416J25661k32856l8346J92081
14510B831354j05634j3330r5585N36342j07315J72475k76471j7516J55550K51
14500C080121j71741K78581J38468K39573k25730k28717L10360P3276m3710l1204
14490C419277J73859p5335K62303k22076K95104k55279K89729J23558q0381k8030
14480C902729J5929l05013M13021K4556k01109M41440j10713L61837k07014j77420
14470D158243K99467j6960q669K94157j63086q3033M07628l57502J63650J40381
14460D834276l26819M08430L6180O9747k4827k45584L27623L01640N3206J23101
$$ plain form
14450 5556973 5705920 5474075 5614022 5430945 6007705 5754434 5917065 5888837 6115380 5982346
14440 5982346 6150680 5965481 6299919 6013175 6481808 6911424 6590376 6855851 6974164
14431 6974164 7048611 7207046 7128052 6950930 7078638 7446364 7724731 7581238 7578406 7724794
14421 7724794 7933952 8096997 8243959 8196293 8282012 8682288 8196006 8868368 8861504 8810278
14411 8810278 9066835 9059423 9052348 9257456 9375072 9755908 10046679 10221107 10355172 10432903
14401 10432903 10445446 10554126 10718060 10982276 11301196 11181786 11408970 11854768 11831844 12062207
14391 12062207 12303503 12579832 12843541 12873806 13358286 12946694 13674176 13901243 14111260
14382 14111260 14291720 14502189 15048246 14979752 15524492 15947434 16130414 16243690 16784675
$$ packed form
14450E556973J48947k31845J39947j83077N76760k53271J62631k8228K26543j33034
14440E982346J68334j85199L34438k86744M68633M29616l21048K65475J18313
14431F974164P4447J58435p8994j77122J27708L67726K78367j43493k832J46388
14421G724794K09158J63045J46962m7666Q5719M00276m86282O72362o864n1226
14411H810278K56557p412p075K05108J17616L80836K90771J74428J34065P7731
14401A0432903J2543J08680J63934K64216L18920j19410K27184M45798k2924K30363
14391A2062207K41296K76329K63709L0265M84480m11592P27482K27067K10017
14382A4111260J80460K10469N46057o8494N44740M22942J82980J13276N40985
$$ plain form
14373 16784675 16773376 16901883 17332192 17974177 18190291 18989365 19037212 19643342 19954772 20589365
14363 20589365 20565870 21209083 21407712 22135606 22696187 23107540 23672370 24278081 24787597
14354 24787597 25430856 25808889 26464524 26972751 28041235 28602689 29272919 30051795 30635935
14345 30635935 31394831 31985661 33447803 33909860 34747777 35848819 36629229 37753510 38897349
14336 38897349 40135305 41252398 42200037 43490411 44465344 45797596 47363968 48773295
14328 48773295 50437371 51920114 53838567 55289530 57217683 59116263 61151279 63328600
14320 63328600 65987233 67864427 70475954 72882350 75513206 78573649 81638899 84560764
14312 84560764 88281754 91653407 95255569 99201322 103512304 108026162 112179603 117749332
$$ packed form
14373A6784675j1299J28507M30309O41985K16114P99074M7847O06130L11430O34593
14363B0589365k3495O43213J98629P27894N60581M11353N64830O05711N09516
14354B4787597O43259L78033O55635N08227J068484N61454O70230P78876N84140
14345C0635935P58896N90830J462142M62057Q37917J101042P80410J124281J143839
14336C8897349J237956J117093R47639J290374R74933J332252J566372J409327
14328D8773295J664076J482743J918453J450963J928153J898580K035016K177321
14320F3328600K658633J877194K611527K406396K630856L060443L065250K921865
14312H4560764L720990L371653L602162L945753M310982M513858M153441N569729
$$ plain form
14304 117749332 122434026 128327626 134275701 140390549 146487587 153896522 161447122 169061496
14296 169061496 177234439 186352240 195368221 205229196 215709424 226463025 238099322
14289 238099322 250119143 262559997 275985702 289487673 303766905 318403564 333150372
14282 333150372 348188178 363872020 378881799 393949128 408130308 421673513 434040690
14275 434040690 444198317 451172824 454246072 455329194 456381191 458110616 457509798 457027721
14267 457027721 453154132 447949716 441448504 431990568 421241896 410211374 396856122
14260 396856122 382553080 367354095 351957423 336709929 321437783 306889054 292905507
14253 292905507 279039494 265640356 252597715 240122401 228284418 217289869 206860838
$$ packed form
14304A17749332M684694N893600N948075O114848O097038P408935P550600P614374
14296A69061496Q172943R117801R015981R860975J0480228J0753601J1636297
14289B38099322J2019821J2440854J3425705J3501971J4279232J4636659J4746808
14282C33150372J5037806J5683842J5009779J5067329J4181180J3543205J2367177
14275D34040690J0157627O974507L073248J083122J051997J729425o00818m82077
14267D57027721l873589n204416o501212r457936j0748672j1030522j3355252
14260C96856122j4303042j5198985j5396672j5247494j5272146j4548729j3983547
14253B92905507j3866013j3399138j3042641j2475314j1837983j0994549j0429031
$$ plain form
14246 206860838 196584212 187156418 178454345 170157025 162272409 154543541 147645631 140971131
14238 140971131 135007442 129031528 123334734 117984956 113296053 108448867 104111188 100220785
14230 100220785 96444214 92623557 89092902 85412778 82095204 79001345 76410239 73705148
14222 73705148 70913409 68581339 66251535 63706915 61601711 59793850 57873713 56053487
14214 56053487 54398047 52887461 51047867 49432950 47958645 46729140 45279717 44439049
14206 44439049 43168644 41834127 40442014 39594184 38476629 37661169 36719255 35767499 34225150
14197 34225150 33559573 32830210 32088266 31399643 30229147 29773384 28972450 28226218 27420431
14188 27420431 26759444 26332246 25726828 24923321 24411574 24005295 23709621 22856635 22274313
$$ packed form
14246B06860838j0276626r427794q702073q297320p884616p728868o897910o674500
14238A40971131n963689n975914n696794n349778m688903m847186m337679l890403
14230A00220785l776571l820657l530655l680124l317574l093859k591106k705091
14222G3705148k791739k332070k329804k544620k105204j807861j920137j820226
14214E6053487j655440j510586j839594j614917j474305j229505j449423q40668
14206D4439049j270405j334517j392113q47830j117555q15460r41914r51756j542349
14197C4225150o65577p29363p41944o88623j170496m55763q00934p46232q05787
14188B7420431o60987m27198o05418q03507n11747m06279k95674q52986n82322
$$ plain form
14179 22274313 21971589 21442603 21013726 20917660 20335658 19882958 19393246 19562463 18909223
14170 18909223 18783184 18134070 17593411 17272230 16892929 16857247 16363426 16019304 15870178
14161 15870178 15474932 15328991 15093069 14728228 14299486 14076518 14131253 13923308 13431124
14152 13431124 13329621 13139911 12476879 12920856 12378380 12174032 11756169 11985452 11784925
14143 11784925 11662150 11722012 11235641 11204581 10473206 10645445 10622171 10267293 10279173 10117911
14133 10117911 10060803 9916500 9612208 9258076 9298119 9393600 9033309 8919462 9061040 9017509
14123 9017509 8392371 8183524 8436489 8089120 8083757 8213267 7817754 7519021 7747877 7714952
14113 7714952 7354689 7405328 7386054 7354897 7213049 7134975 6630002 6892487 6368545 6769449
$$ packed form
14179B2274313l02724n28986m28877r6066n82002m52700m89712J69217o53240
14170A8909223j26039o49114n40659l21181l79301l5682m93821l44122j49126
14161A5870178l95246j45941k35922l64841m28742k22968N4735k07945m92184
14152A3431124j01503j89710o63032M43977n42476k04348m17863K29283k00527
14143A1784925j22775N9862m86371l1060p31375J72239k3274l54878J1880j61262
14133A0117911n7108j44303l04292l54132M0043R5481l60291j13847J41578m3531
14123I017509o25138k08847K52965l47369n363J29510l95513k98733K28856l2925
14113G714952l60263N0639j9274l1157j41848p8074n04973K62485n23942M00904
$$ plain form
14103 6769449 6915116 6454642 6587319 6376652 6166106 6536972 6014787 6208366 6023175
14094 6023175 6213625 5821734 5736784 5582117 5834979 5514979 5792828 5340132 5232564 5305648
14084 5305648 5256871 5024470 5241490 5267323 5192135 5036872 4789702 5065137 4935017 4694049
14074 4694049 4921294 5014343 4750202 4287617 4350590 4858295 4455406 4523115 4576022 4518613
14064 4518613 4233527 4194617 4248290 4279881 4500653 4192565 4407078 4342997 4145903 3965757
14054 3965757 4147819 4181562 3802488 3784501 3875007 3875889 3736152 3685495 3886597 3983690 3508496
14043 3508496 3433260 3629435 3548088 3478212 3499524 3583942 3823264 3246277 3051394 3214339
14033 3214339 2819403 3209847 3118232 3107823 3121749 3097910 3160444 3103748 3249491 3059168
$$ packed form
14103F769449J45667m60474J32677k10667k10546L70866n22185J93579j85191
14094F023175J90450l91891q4950j54667K52862l20000K77849m52696j07568P3084
14084E305648m8777k32401K17020K5833p5188j55263k47170K75435j30120k40968
14074D694049K27245R3049k64141m62585O2973N07705m02889O7709N2907n7409
14064D518613k85086l8910N3673L1591K20772l08088K14513o4081j97094j80146
14054C965757J82062L3743l79074j7987R0506Q82j39737n0657K01102R7093m75194
14043C508496p5236J96175q1347o9876K1312Q4418K39322n76987j94883J62945
14033C214339l94936L90444r1615j0409J3926k3839O2534n6696J45743j90323
$$ plain form
14023 3059168 2937347 2879574 2918335 2626071 2644045 2676074 2847439 2665667 2795518 2853557
14013 2853557 2809748 2603732 2719134 2396665 2524065 2488184 2304891 2538339 2368735 2374464
14003 2374464 2296886 2221574 2369832 2078834 2084048 2303341 1957488 2594927 2218062 2189442
13993 2189442 2337700 1818607 2374719 2529572 4440613 8082141 15852206 32033541 44634290
13984 44634290 27180053 14283121 8972400 6488005 5367366 4667222 4073048 3495017
13976 3495017 3178821 3085343 2923017 2982754 2728310 3028453 2774264 2478726 2616633 2510798
13966 2510798 2451804 2571571 2386709 2352520 1995097 2443121 2266398 2150785 2392415 2003491
13956 2003491 1975941 2249265 2036224 2042477 2428095 1935266 1847868 2221210 2123496 2064751
$$ packed form
14023C059168j21821n7773L8761k92264J7974L2029J71365j81772J29851N8039
14013B853557m3809k06016J15402l22469J27400l5881j83293K33448j69604N729
14003B374464p7578p5312J48258k90998N214K19293l45853O37439l76865k8620
13993B189442J48258n19093N56112J54853J911041L641528P770065J6181335J2600749
13984D4634290j7454237j2896932n310721k484395j120639p00144n94174n78031
13976C495017l16196r3478j62326N9737k54444L00143k54189k95538J37907j05835
13966B510798n8994J19767j84862l4189l57423M48024j76723j15613K41630l88924
13956B003491k7550K73324k13041O253L85618m92829q7398L73342r7714n8745
$$ plain form
13946 2064751 2102934 2069033 1977583 2122049 1874423 1881183 2092167 1676050 1433093 2121639
13936 2121639 1875554 1793519 1798192 1513864 1814760 1301223 1814569 1896156 1479580 1804971
13926 1804971 2124931 1741403 1421723 1525813 1586815 1515296 1658082 1707367 1537270 1826999
13916 1826999 1461780 1863539 1716397 1726285 1526304 1624640 1614170 1165951 1388322 1388320 1553000
13905 1553000 1335599 1490379 1567842 1571992 1847631 1259179 1408938 1522571 1492064 1180080
13895 1180080 1243298 1327521 1385473 1391666 1598296 1332943 1311183 1524220 1311843 1427346
13885 1427346 1529848 1227950 1060916 1396266 1127774 1192559 1572448 1369676 1356610 1209338
13875 1209338 1093893 933798 1234942 1234602 1212694 1386113 1303732 1185251 1388629 1409031
$$ packed form
13946B064751L8183l3901r1450J44466k47626O760K10984m16117k42957O88546
13936B121639k46085q2035M673k84328L00896n13537N13346Q1587m16576L25391
13926A804971L19960l83528l19680J04090O1002p1519J42786M9285j70097K89729
13916A826999l65219M01759j47142R888j99981R8336j0470m48219K22371kJ64680
13905A553000k17401J54780P7463M150K75639n88452J49759J13633l0507l11984
13895A180080O3218Q4223N7952O193K06630k65353k1760K13037k12377J15503
13885A427346J02502l01898j67034L35350k68492O4785L79889k02772j3066j47272
13875A209338j15445j60095L01144l40k1908J73419q2381j18481K03378K0402
$$ plain form
13865 1409031 1214411 1143585 1216889 1197296 735033 1040350 1458245 1195915 1060885 1275460
13855 1275460 1225328 1028393 1203960 826323 634579 1170355 1026720 1063032 983927 1134628
13845 1134628 974313 1427211 990019 1157288 1090160 966855 1241597 841648 1020213 1020438
13835 1020438 1239030 772087 1040140 799341 983739 1365467 1163213 1072569 951413 1127631
13825 1127631 1108991 821531 757205 800600 1002185 1153824 970814 934216 1013036 1052014
13815 1052014 1018824 735192 1086020 878592 1225875 749884 1247841 856332 1039812 795893
13805 795893 928680 992361 784628 713700 855282 801077 761093 914216 597509 986657
13795 986657 481714 895221 838020 942196 534090 787333 894580 842120 652724 833215
$$ packed form
13865A409031j94620p0826P3304j9593m62263L05317M17895k62330j35030K14575
13855A275460n0132j96935J75567l77637j91744N35776j43635L6312p9105J50701
13845A134628j60315M52898m37192J67269o7128j23305K74742l99949J78565K25
13835A020438K18592m66943K68053k40799J84398L81728k02254r0644j21156J76218
13825A127631j8640k87460o4326M3395K01585J51639j83010l6598P8820L8978
13815A052014l3190k83632L50828k07428L47283m75991M97957l91509J83480k43919
13805G95893J32787O3681k07733p0928J41582n4205l9984J53123l16707L89148
13795I86657D81714M13507n7201J04176m08106K53243J07247n2460j89396J80491
$$ plain form
13785 833215 911447 902420 1119872 687108 526846 684763 876937 812717 1209476 996072
13775 996072 521415 874458 567236 970687 877462 852114 684285 1033921 878436 806370
13765 806370 802750 431986 747875 664937 615254 810585 726598 642450 705409 730535 602928
13754 602928 657172 814220 892568 542093 725546 732340 1111653 522837 837712 568988
13744 568988 770047 441264 640265 483708 395886 771186 711637 873361 762820 441587
13734 441587 592863 420398 260696 484464 381477 777563 762587 339893 807731 575311
13724 575311 548466 554289 1052939 494519 765092 647815 753872 738388 542725 381967
13714 381967 680697 534087 575044 816315 699687 533757 446223 379649 709786 525229
$$ packed form
13785H33215P8232r027K17452m32764j60262J57917J92174o4220L96759k13404
13775I96072m74657L53043l07222M03451r3225k5348j67829L49636j55485p2066
13765H06370l620l70764L15889q2938m9683J95331q3987q4148O2959K5126j27607
13754F02928N4244J57048P8348l50475J83453O794L79313E22837L14875k68724
13744E68988K01059l28783J99001j56557q7822L75300n9549J61724j10541l21233
13734D41587J51276j72465j59702K23768j02987L96086j4976C39893M67838k32420
13724E75311k6845N823M98650D94519K70573j17277J06057j5484j95663j60758
13714C81967K98730j46610M0957K41271j16628j65930q7534o6574L30137j84557
$$ plain form
13704 525229 801460 662801 717129 301392 246516 837729 804880 330777 740031 719311
13694 719311 483961 502597 392465 575674 385424 520593 507339 591542 874006 494569
13684 494569 227007 237880 586212 648384 690737 331715 547260 339365 416365 548330
13674 548330 383284 412264 322705 149420 507447 298057 365137 362530 520450 475071 589891
13663 589891 836465 460524 122683 431498 323496 665757 446493 511774 227647 639813
13653 639813 555590 519705 485520 323305 428350 433983 428790 438782 588051 361521 363733
13642 363733 869580 491335 250861 637400 292433 282958 206064 119350 512362 522925
13632 522925 497236 420378 433390 351275 661089 384555 661883 178391 245117 281245 -280039
$$ packed form
13704E25229K76231j38659N4328C01392n4876N91213l2849C30777M09254k0720
13694G19311k35350J8636j10132J83209j90250J35169j3254Q4203K82464l79437
13684D94569B27007J0873L48332O2172M2353C31715K15545k07895P7000J31965
13674E48330j65046K8980q9559A49420L58027k09390O7080k607J57920m5379J14820
13663E89891K46574l75941A22683L08815j08002L42261k19264O5281B27647M12166
13653F39813q4223l5885l4185j62215J05045N633n193R992J49269k26530K212
13642C63733N05847l78245k40474L86539B92433r475p6894q6714L93012J0563
13632E22925k5689p6858J3012q2115L09814k76534K77328A78391O6726L6128b80039
$$ plain form
13620 470521 461516 427428 588332 545141 512372 673585 478158 266047 246496 399790 537798
13609 537798 226844 170462 398778 312645 322771 199677 326925 71459 618614 468787
13599 468787 538445 377131 205681 419080 249513 487228 198068 515157 597780 309503
13589 309503 302178 414359 49229 493020 237287 496413 227478 159138 362378 540008
13579 540008 728761 25535 524232 458052 675122 410874 248940 492057 300035 439990
13569 439990 528522 714874 268450 21022 192063 279881 -3680 198373 172498 448249 408153
13558 408153 5855 228176 286143 285847 294434 257314 570327 322350 364014 241707 313118
13547 313118 141279 94296 613986 410364 475781 180786 -40266 227449 -61372 385588
$$ packed form
13620D70521r005l4088J60904m3191l2769J61213j95427k12111j9551J53294J38008
13609E37798B26844n6382K28316q6133J0126j23094J27248G1459N47155j49827
13599D68787O9658j61314j71450K13399j69567K37715A98068L17089Q2623k88277
13589C09503p325J12181D9229M43791B37287K59126B27478o8340K03240J77630
13579E40008J88753B5535M98697o6180K17070k64248j61934K43117j92022J39955
13569D39990Q8532J86352B68450B1022J71041Q7818c680A98373k5875K75751m0096
13558D08153E855K22321N7967k96Q587l7120L13013k47977M1664j22307P1411
13547C13118A41279m6983N19690k03622O5417A80786d0266B27449f1372C85588
$$ plain form
13536 59254 392483 82240 249623 124089 155938 504164 107887 450232 92770 204769
13526 204769 184880 446688 462537 634809 204582 397348 466910 260867 190147 310692
13516 310692 221669 180046 234100 385637 462059 294070 297383 382748 129133 411422 628074
13505 628074 271130 750696 146006 339012 189479 386459 30367 409701 283139 423907
13495 423907 231839 44641 167069 434101 -39147 166375 199675 206054 631006 -31693 115127
13483 70815 268515 418807 390842 334854 477666 286246 251877 226496 272743 534171 268043
13472 268043 286901 131824 463626 264728 484496 594277 149659 270861 438636 377342
13462 377342 105615 340967 327821 -40704 419346 701869 170426 405019 391041 329034
$$ packed form
13536E9254L33229H2240J67383A24089L1849L48226A07887L42345I2770J11999
13526B04769j9889K61808J5849J72272B04582J92766O9562k06043p0720J20545
13516C10692q9023m1623N4054J51537P6422j67989L313Q5365A29133K82289K16652
13505F28074B71130M79566A46006J93006j49533J96980C0367L79334j26562J40768
13495D23907j92068D4641J22428K67032c9147A66375L3300O379M24952c1693A15127
13483G0815J97700J50292k7965n5988J42812j91420l4369k5381M6247K61428k66128
13472B68043J8858A31824L31802j98898K19768J09781A49659J21202J67775o1294
13462C77342A05615K35352j3146d0704D19346K82523A70426K34593j3978o2007
$$ plain form
13452 329034 363015 223986 429827 262392 428788 209893 -137864 164645 395612 311718
13442 311718 278717 121695 297899 429200 180677 274681 372205 385725 173777 391888
13432 391888 539646 210704 289577 221032 434338 221095 76075 292382 166211 373164
13422 373164 550027 319972 -77640 266288 127084 182116 1717 -69114 200937 276924 301361
13411 301361 118953 554514 403643 147954 285501 543335 322611 57729 93839 219327
13401 219327 172730 140783 -191795 368490 320143 -252181 440581 560366 101486 37961
13390 264830 -138081 -10446 267111 469815 177518 201069 -94996 161100 295653 432496
13380 432496 -37658 -87436 310596 664677 123375 306187 554933 232139 335938 132066
$$ packed form
13452C29034L3981j39029K05841j67435J66396B09893a37864A64645K30967q3894
13442C11718l3001A21695J76204J31301A80677R4004R7524J3520A73777K18111
13432C91888J47758B10704P8873o8545K13306k13243G6075K16307j26171K06953
13422C73164J76863k30055g7640B66288A27084N5032A717f9114B00937P5987K4437
13411C01361A18953M35561j50871A47954J37547K57834k20724E7729L6110J25488
13401B19327m6597l1947a91795C68490m8347b52181D40581J19785A01486C7961
13390B64830a38081a0446B67111K02704A77518K3551i4996A61100J34553J36843
13380D32496c7658m9778C10596L54081A23375J82812K48746B32139J03799A32066
$$ plain form
13369 264398 -41011 102756 541063 165409 207048 546164 142599 17954 -89399 346037
13358 104331 147580 122855 196464 232740 292810 11227 649766 149942 118945 -71148 159657
13346 202550 48721 325047 -6433 220331 337881 139846 381605 229087 217533 573152
13336 573152 13684 495115 261818 21982 276357 234155 109765 6968 -102040 274507
13325 347016 -62845 174916 17803 -33251 134917 342254 224812 -101745 221910 14655
13314 345506 251572 289848 73966 -54315 -196019 35219 374513 -40186 131817 335412 160701
13302 178323 435482 303780 309383 430797 -10569 90133 113737 102900 71622 102429 18006
13290 135749 157816 239347 144756 123061 -1434 153142 191203 296617 37397 202811 105882
$$ packed form
13369B64398d1011A02756M38307A65409M1639L39116A42599A7954h9399C46037
13358A04331M3249k4725P3609L6276O0070A1227O38539A49942l0997g1148A59657
13346B02550D8721K76326f433B20331J17550A39846K41759j52518j1554L55619
13336E73152A3684M81431k33297B1982K54375m2202A09765F968a02040B74507
13325C47016f2845A74916A7803c3251A34917K07337j17442a01745B21910A4655
13314C45506r3934L8276G3966e4315j41704C5219L39294d0186A31817K03595A60701
13302A78323K57159j31702N603J21414a0569I0133K3604j0837l1278L0807A8006
13290A35749K2067Q1531r4591k1695a434A53142L8061J05414C7397J65414r6929
$$ plain form
13279 105882 258397 268797 -3126 294170 98498 -204834 235964 93467 34201 103374 -1744
13267 -23196 325260 133355 24089 252491 178434 329016 90345 439834 300312 289592
13257 289592 251795 -58749 210809 85508 168129 122398 103809 109471 343807 256015 -167873
13245 -103388 -12401 49550 292791 214009 237650 26223 -46247 -50901 301906 468197 196263
13233 -14612 47850 254051 144150 50940 312464 186777 32419 160447 93823 152745 153259
13222 153259 149551 120569 306735 -163871 554509 55138 -38023 43399 33662 -28931 205466
13210 119157 114643 12793 128970 411649 28201 285565 356184 76056 102616 -13276 398770
13198 297884 212235 124616 -40741 38255 258546 300035 123058 162353 54330 -68899 421520
$$ packed form
13279A05882J52515J0400c126B94170I8498b04834B35964I3467C4201O9173a744
13267b3196C25260A33355B4089K28402p4057J50582I0345L49489j39522j0720
13257B89592l7797e8749B10809H5508Q2621m5731j8589N662K34336q7792a67873
13245a03388a2401D9550K43241p8782K3641B6223d6247m654C01906J66291A96263
13233a4612D7850K06201j09901E0940K61524j25687C2419J28028o6624N8922N14
13222A53259l708k8982J86166a63871E54509E5138c8023D3399r737b8931B05466
13210A19157m514A2793J16177K82679B8201K57364P0619G6056K6560a3276C98770
13198B97884q5649q7619d0741C8255K20291M1489A23058L9295E4330f8899D21520
$$ plain form
13186 403222 266392 202166 376 411757 22405 147902 -113255 112439 270561 206591 217050
13175 217050 499018 -135845 130743 660652 117628 -94038 -121627 288160 6649 -78861
13164 -317545 -204278 -30021 88106 257147 -85886 -67210 16177 158632 -1955 217976 133534
13153 133534 -119403 312098 42107 -111209 97973 584597 43232 111057 238900 44978
13142 -184876 -140088 243780 270716 19858 24111 23694 -101598 162792 78353 106187 165740
13131 165740 166642 34125 99540 135584 -39099 -185347 258116 334155 192619 -2092 -154987
13120 -154987 -248076 355294 -47041 129182 361533 68624 -80352 145542 -149148 -25409
13109 283514 -363787 254649 163131 205278 143130 -217077 -36090 175691 -96654 -108397 29702
$$ packed form
13186D03222j36830o4226C76M11381B2405J25497a13255A12439J58122o3970J0459
13175B17050K81968a35845A30743N29909A17628i4038k7589B88160F649g8861
13164c17545J13267c0021H8106J69041h5886J8676A6177J42455a955B17976q4442
13153A33534a19403C12098D2107a11209I7973M86624D3232O7825J27843D4978
13142a84876M4788B43780K6936A9858M253m17a01598A62792G8353K7834N9553
13131A65740R02C4125O5415L6044c9099j46248B58116P6039j41536b092j52895
13120a54987r3089C55294d7041A29182K32351F8624h0352A45542a49148b5409
13109B83514c63787B54649r1518M2147o2148b17077c6090A75691i6654j1743B9702
$$ plain form
13097 88678 250900 12713 -140039 -166392 268631 -55288 57164 117771 391383 78846 78769
13086 78769 117193 -334804 40838 -231907 429917 186061 125846 197374 12803 198283 126158
13075 126158 406563 111122 121533 157091 -127019 173419 108044 -84863 140185 -1767 45094
13063 -51230 -291072 332561 193974 93583 14089 384297 254512 314339 103050 -108781
13052 147288 150264 -86089 421000 347683 -203184 76950 -70674 232291 137161 338763 -157042
13040 -280901 -73760 20101 424461 409571 37115 -108864 198998 -165003 35672 86449 147313
13029 147313 11104 220400 448177 -46801 -197182 274976 455996 265888 51029 143557
13019 143557 22161 336942 226814 309643 25813 -32158 109557 132804 82310 567264 -5972
$$ packed form
13097H8678J62222A2713a40039k6353B68631e5288E7164O0607K73612G8846p7
13086G8769L8424c34804D0838b31907D29917A86061o0215P1528A2803J85480p2125
13075A26158K80405A11122J0411L5558a27019A73419o5375h4863A40185a767D5094
13063e1230k39842C32561j38587I3583A4089L70208j29785N9827A03050a08781
13052A47288K976h6089D21000p3317b03184G6950g0674B32291r5130K01602a57042
13040b80901g3760B0101M04360j4890C7115a08864A98998a65003C5672N0777O0864
13029A47313A1104K09296K27777d6801j50381B74976J81020j90108E1029R2528
13019A43557B2161L14781j10128Q2829B5813c2158A09557K3247n0494M84954e972
$$ plain form
13007 298852 -18112 -95243 -57043 137947 -232305 163801 301708 -137037 129366 446069
12997 446069 138439 40933 -140866 307041 -47055 29920 208828 -136870 36263 150384
12987 150384 121328 -6674 141108 311559 132434 289133 -8422 125748 -191132 121617
12976 48909 -344 -28816 141919 64360 58108 99577 128803 -72352 111810 192647 -42877 179312
12963 177004 147651 -112829 2002 158724 7275 -51810 -27096 407946 258274 69769 -103711
12951 -191593 1766 280991 102577 153886 -14215 2205 55535 155154 74445 383185 482374
12940 482374 -1457 -16129 -276921 122713 209832 143383 84027 59846 154741 -82880 -101598
12929 -101598 -2217 199455 -219407 -74741 -71497 -93130 -141157 324021 -75453 -116164 -241828
$$ packed form
13007B98852a8112p7131L8200A37947b32305A63801J37907a37037A29366L16703
12997D46069A38439D0933a40866C07041d7055B9920J78908a36870C6263J14121
12987A50384k9056f674A41108J70451A32434J56699h422A25748a91132A21617
12976D8909c44k8472A41919F4360o252M1469K9226g2352A11810Q0837d2877A79312
12963A77004k9353a12829B002J56722G275e1810K4714D07946j49672F9769a03711
12951a91593A766K79225A02577N1309a4215B205N3330R9619G4445L08740R9189
12940D82374a457j4672k60792A22713Q7119o6449n9356k4181R4895h2880j8718
12929a01598b217A99455b19407g4741L244k1633m8027C24021g5453m0711j25664
$$ plain form
12918 -241828 82024 -220579 79851 95065 -27228 175852 80567 5782 -23123 -5185 306906
12906 145038 90377 225699 -22069 85796 72522 106245 -10278 19092 83841 267428 -48284
12894 313626 119700 26471 81583 108501 165308 43770 7929 -52646 5122 217985 169572
12883 169572 -49019 73667 298944 -198917 55882 -106265 -33334 -130614 180109 106588 -2420
12871 -157096 -1935 -48622 -27083 -271009 -5313 141305 72707 27087 42883 -99146 -216020
12860 -216020 -25524 179664 -233218 -162808 -208473 -148343 140761 96190 -30067 486539 324410
12849 324410 18126 256819 -100809 -136493 -192716 24096 -206203 87634 120972 358921 225916
12838 225916 119755 -44559 106954 -63182 7945 240741 41640 -218588 78132 -63811 958
$$ packed form
12918b41828H2024b20579G9851J5214b7228A75852H0567E782b3123e185C06906
12906A45038n4661J35322b2069H5796j3274L3723a0278A9092O4749J83587d8284
12894C13626A19700B6471N5112K6918N6807D3770G929e2646E122K12863m8413
12883A69572d9019G3667K25277a98917E5882a06265c3334r7280A80109p3521b420
12871a57096a935m6687K1539k43926e313A41305o8598B7087J5796i9146j16874
12860b16020b5524A79664b33218P0410m5665O0130A40761m4571c0067D86539j62129
12849C24410A8126K38693a00809l5684n6223B4096b06203H7634L3338K37949j33005
12838B25916j06161d4559A06954f3182G945K32796D1640b18588G8132f3811I58
$$ plain form
12826 69774 -199265 -20424 191256 -17650 157855 -80983 195705 294251 123747 312763
12816 312763 50852 239733 49535 -100651 280426 41287 -43748 21941 325012 -75081 351015
12804 -205434 176044 162895 -257583 116421 4044 37232 53409 87978 -241334 134946 -137647
12792 19751 -25478 112398 249315 -40859 -241165 332511 -440479 73291 135316 298064
12782 298064 150683 -58488 301592 72760 96027 -57827 461934 -181544 -269211 -64524 200980
12770 -128042 259336 332894 224302 104796 41066 -30421 -176757 217908 40089 208962
12760 208962 186428 -33583 -301623 85279 117115 11961 -151478 444368 258009 56673 261671
12749 261671 392051 305300 107995 -10292 -74123 184713 -185487 209313 7088 339468
$$ packed form
12826F9774a99265b0424A91256a7650A57855h0983A95705R8546A23747J89016
12816C12763E0852J88881D9535a00651B80426D1287d3748B1941L03071g5081C51015
12804b05434A76044j3149b57583A16421D044L3188J6177L4569b41334A34946a37647
12792A9751b5478A12398J36917d0859k00306C32511d40479G3291O2025J62748
12782B98064j47381e8488C01592G2760K3267e7827D61934a81544q7667f4524B00980
12770a28042B59336P3558j08592A04796D1066c0421j46336B17908D0089J68873
12760B08962k2534c3583k68040H5279L1836A1961a51478D44368j86359E6673K04998
12749B61671J30380q6751A07995a0292o3831A84713a85487B09313G088L32380
$$ plain form
12739 339468 53373 22941 2486 291194 -183693 256517 194283 170360 -151287 45361 117456
12728 117456 -3794 27717 -95514 39254 80282 54206 104227 -54637 85258 112947 87759 5890
12715 60490 112960 37059 -13943 442358 37318 318776 205838 102817 65803 124388 313826
12704 313826 212756 266590 -75759 -160733 202493 10539 -278777 290555 -89012 20419 224717
12693 224717 44789 143828 -17028 82706 152880 409627 218470 -72650 -356633 96569 -31257
12681 34090 -106155 174376 187314 -21298 76023 -28662 68611 118253 69799 66557 -310195
12669 -48689 -244130 -113508 23150 -223708 -124963 -203687 -117348 94592 3277 126979 -121092
12657 338393 -7090 -13914 161189 429887 38307 148081 -337735 -113098 271910 237728 279727
$$ packed form
12739C39468E3373B2941B486K88708a83693B56517o2234k3923a51287D5361P2095
12728A17456c794B7717i5514C9254M1028k6076N0021e4637H5258K7689k5188E890
12715F0490N2470C7059a3943D42358C7318K81458j12938A02817l7014N8585J89438
12704C13826j01070N3834g5759q4974B02493A0539b78777B90555h9012B0419K04298
12693B24717D4789R9039a7028H2706P0174K56747j91157g2650k83983I6569c1257
12681C4090a06155A74376J2938b1298G6023b8662F8611M9642m8454l242c10195
12669d8689j95441a13508B3150b23708R8745p8724Q6339I4592C277J23702a21092
12657C38393g090o824A61189K68698C8307J09774c37735a13098B71910l4182M1999
$$ plain form
12646 279727 -187972 77616 -52085 -18977 9184 -72058 -290898 294154 19203 -237135 80298
12634 231638 -295816 -2859 70421 217763 144996 45928 32330 345875 548151 12340 88847
12623 88847 222340 350375 -141774 125633 157210 290082 98501 -311279 -100746 -93061
12613 -93061 -394752 -82341 -43276 499354 -15250 284311 403847 86877 -101523 93060 -155547
12601 474522 227804 144097 284287 157416 -68942 152347 41497 -47347 -17407 275442
12590 -173292 57470 133204 -15671 153217 305417 97536 -233370 -39526 307192 188702
12580 188702 -64293 201386 84775 15335 185841 -45981 169558 -172183 -137551 234735
12569 -160989 163917 71705 -183303 -190904 111951 250414 370021 -74012 -90507 125521
$$ packed form
12646B79727a87972G7616e2085a8977I184g2058k18840B94154A9203b37135H0298
12634B31638b95816b859G0421J47342p2767D5928j3598L13545K02276A2340P6507
12623H8847J33493J28035a41774A25633L1577J32872I8501c11279a00746P685
12613i3061l01691h2341L9065D99354a5250B84311J19536H6877a01523I3060a55547
12601D74522B27804q3707J40190j26871f8942A52347D1497d7347a7407B75442
12590a73292E7470P5734a5671A53217J52200I7536b33370c9526C07192j18490
12580A88702f4293B01386H4775A5335J70506d5981A69558a72183L4632B34735
12569a60989A63917G1705a83303p601A11951J38463J19607g4012j6495A25521
$$ plain form
12558 253359 -119379 160704 94406 184744 372953 -147119 109899 -52897 -397888 357524
12547 -67858 -143163 77611 125431 -93788 -120441 -90713 -174392 234473 -191960 -133724 -83629
12536 -83629 -17910 10084 -62430 -258444 -177292 72616 -86903 -58330 175341 53051 431525
12525 431525 -89607 152783 -70058 -169403 343902 50379 116825 -42971 73295 266914 33983
12513 237190 74501 -82097 217255 174762 226725 23739 -212583 -151603 184809 -13420 58080
12501 -72254 -30279 -160239 79329 -104756 23467 94113 -17720 108901 15612 108640 -344178
12489 -283988 170677 -101780 77877 155109 52451 -85156 252040 -85310 -13425 152953 -184881
12477 66861 -11304 116880 -199337 -45692 -158926 -243414 55085 -98702 -160206 268547 132874
$$ packed form
12558B53359a19379A60704o6298R0338J88209a47119A09899e2897l44991C57524
12547f7858p5305G7611M7820i3788k6653K9728q3679B34473a91960N8236N0095
12536h3629a7910A0084f2430j96014Q1152G2616h6903K8573A75341E3051L78474
12525D31525h9607A52783g0058r9345C43902E0379O6446d2971G3295J93619C3983
12513B37190G4501h2097B17255m2493N1963B3739b12583O0980A84809a3420E8080
12501g2254c0279j29960G9329a04756B3467P0646a7720A08901A5612R3028c44178
12489b83988A70677a01780G7877P7232E2451h5156B52040h5310a3425A52953a84881
12477F6861a1304A16880a99337d5692j13234q4488E5085i8702o1504B68547A32874
$$ plain form
12465 142397 217722 -35240 -130047 217432 156662 -145623 85729 -42738 223873 -111370 440569
12453 177986 237766 -131262 132082 -53061 -126762 -62681 86471 40753 153094 144654 41851
12441 31198 -28291 91906 -86375 49724 37223 14384 140121 52494 -97747 201435 -400539
12429 -194089 198178 303017 -154512 -73504 119007 63269 -176938 117134 -272833 -167581
12419 -167581 27710 346015 -28210 75422 -118229 273895 123707 29839 -365701 232124
12408 32232 -190534 -268657 -154530 -332528 -139577 144638 41713 -381142 -67128 -114288
12398 -114288 -259378 -105942 392084 -99637 434355 371516 360591 -284436 -64207 -28879
12387 338717 -394114 -11607 287249 129264 443836 -160279 115188 -6602 -50493 -289175
$$ packed form
12465A42397P5325c5240r4807B17432o0770a45623H5729d2738B23873a11370D40569
12453A77986N9780a31262A32082e3061p3701f2681H6471D0753J12341q440D1851
12441C1198b8291I1906h6375D9724j2501A4384J25737E2494i7747B01435d00539
12429a94089A98178J04839a54512g3504A19007n5738a76938A17134b72833J05252
12419a67581B7710L18305b8210G5422a18229B73895A23707B9839c65701B32124
12408C2232a90534p8123J14127j77998a39577A44638D1713c81142f7128m7160
12398a14288j45090a05942C92084i9637D34355o2839j0925b84436f4207b8879
12387C38717c94114a1607B87249A29264L14572a60279A15188f602m3891k38682
$$ plain form
12377 -289175 57870 -209982 -116321 62854 208110 -4390 274173 44435 209673 -33698 91196
12365 -47856 -216841 -219649 232585 233738 -8170 18129 -169925 18168 76062 -163622 98557
12353 184032 19978 310203 -91010 418648 137170 171484 245065 187123 -283620 159023
12342 147382 -70704 201081 54718 278071 36915 14377 6894 -57309 -178999 217546 -8239
12330 -109789 885 119651 392051 109779 92502 -15900 36025 -2140 3101 98601 -139830
12318 -55709 78980 -210942 -178837 104483 47944 -96929 39659 -169693 325349 -160552 196163
12306 49421 -63714 -136394 -112766 85547 27900 -21686 -111706 30713 -186271 234267 -133134
12294 2632 30912 -19187 -71540 568563 -219248 -50981 281880 88585 380124 248490 124759
$$ packed form
12377b89175E7870b09982R3661F2854J45256d390B74173D4435J65238c3698I1196
12365d7856j68985k808B32585J153h170A8129a69925A8168N7894a63622I8557
12353A84032A9978K90225i1010D18648A37170L4314P3581n7942b83620A59023
12342A47382g0704B01081E4718K23353C6915A4377F894e7309j21690B17546h239
12330a09789H85J18766K72400A09779j7277a5900C6025b140C101R5500a39830
12318e5709G8980b10942L2105A04483D7944i6929C9659a69693C25349a60552A96163
12306D9421f3714p2680K3628H5547B7900b1686r0020C0713a86271B34267a33134
12294B632K8280a9187n2353E68563b19248e0981B81880H8585K91539j31634j23731
$$ plain form
12283 124759 242702 -85554 307869 87042 6373 184274 36964 403114 186616 -196430
12272 142217 40384 7890 102642 -241119 150625 182448 -80791 56317 13958 34021 224171
12261 224171 -260544 308689 -187339 7520 -202269 355515 205641 337267 172362 142329
12251 142329 60965 -148144 156290 176311 -114472 -198600 -40722 139378 70187 -113014
12240 541778 372604 38191 -54537 309818 -1379 -213764 136797 147943 252384 -115467
12229 45016 279176 428637 -6318 349294 24728 62962 -123952 32961 140286 329860 267908
12218 267908 552607 169873 270733 160655 119102 66610 -13068 240993 84103 170104
12208 170104 79745 385479 183033 260060 143637 129171 41694 -250008 -29111 225800
$$ packed form
12283A24759J17943h5554C07869H7042F373J77901C6964L66150A86616a96430
12272A42217D0384G890R4752b41119A50625L1823h0791E6317A3958K0063J90150
12261B24171b60544C08689a87339G520b02269C55515j49874J31626j64905l0033
12251A42329F0965a48144A56290K0021a14472q4128d0722A39378o9191a13014
12240E41778j69174C8191e4537C09818a379k12385A36797J1146J04441a15467
12229D5016K34160J49461f318C49294B4728L8234a23952C2961J07325J89574o1952
12218B67908K84699A69873J00860j10078m1553n2492a3068B40993H4103Q6001
12208A70104G9745L05734A83033P7027j16423j4466D1694b50008b9111B25800
$$ plain form
12197 33277 290798 275090 452930 -98446 98819 -17233 150527 289898 230612 120727 284193
12186 284193 -13296 210179 -117013 77351 14704 -11996 188964 310980 421236 244123
12176 244123 -111346 116363 206033 136209 193180 103472 455213 87182 -668 25069 230882
12165 230882 -107282 -15477 196265 229820 96138 272527 -59053 -31164 79189 29632 186745
12154 186745 68879 129272 -121311 -89221 -93741 -1743 -79334 140403 -206479 5462 -32217
12142 169298 81562 436923 65020 249483 89110 219126 162730 -103628 -125141 -113292 -154611
12131 -154611 236631 -35947 39415 17281 104321 123970 312307 -256337 -177403 61656 -77179
12119 310496 -438327 92862 126887 140261 19662 -59164 -188536 74680 33177 -94858 -112
$$ packed form
12197C3277K57521j5708J77840i8446I8819a7233A50527J39371n9286j09885J63466
12186B84193a3296B10179a17013G7351A4704a1996A88964J22016J10256j77113
12176B44123a11346A16363Q9670o9824N6971q9708L51741H7182f68B5069K05813
12165B30882a07282a5477A96265L3555I6138J76389e9053K7889G9189B9632J57113
12154A86745F8879O0393a21311L2090m520a743p7591A40403b06479E462c2217
12142A69298H1562L55361F5020J84463H9110J30016n6396a03628k1513J1849m1319
12131a54611B36631c5947C9415A7281Q7040J9649J88337b56337P8934F1656g7179
12119C10496d38327I2862L4025J3374A9662e9164j29372G4680C3177i4858a12
$$ plain form
12107 151521 22759 2676 -33478 47416 159796 -18362 -170965 22469 12537 -167304 244254
12095 -12146 -50023 272219 24853 -133092 -362418 70279 -20348 111857 -9080 -18884 2308
12083 -202839 28224 78003 91143 55360 -70612 208802 86707 94722 63548 222325 664946
12072 664946 1407292 1621742 359617 510748 257000 105432 136611 -58366 295464 106441
12061 -128985 -327748 146043 279449 -225152 -200775 -24329 -139435 74338 20732 140016
12051 140016 -84825 164044 167651 -24338 18523 19686 150627 183243 -101405 114596 100884
12040 100884 -113922 -83012 95232 49604 49042 360969 229076 -121496 82373 178935 -35934
12028 10625 -95366 279883 -233018 -90949 487533 308796 -139924 -135934 322779 -220335
$$ packed form
12107A51521B2759B676c3478D7416J12380a8362j52603B2469r932a67304B44254
12095a2146l7877B72219B4853a33092k29326G0279b0348A11857i080r804B308
12083b02839B8224M9779J3140l5783g0612B08802H6707Q015l1174J58777M42621
12072F64946P42346K14450C59617J51131k53748A05432L1179e8366B95464A06441
12061a28985j98763A46043J33406b25152K4377b4329j15106G4338B0732J19284
12051A40016h4825A64044L607b4338A8523J163J30941L2616a01405A14596j3712
12040A00884a13922L0910I5232m5628n62L11927j31893a21496H2373R6562c5934
12028A0625i5366B79883b33018i0949D87533j78737a39924L990C22779b20335
$$ plain form
12017 169198 -33433 -363401 -84622 78121 -115102 5519 -61300 -77233 311574 -46012 -243568
12006 -243568 -132920 77049 -313497 79372 -247037 -117163 -258108 276134 119567 -161158
11995 -314082 -7106 -143748 -90383 -142350 -106682 172575 -7223 -205962 -200730 159790 -181468
11983 39618 232374 -156632 -11376 382401 272799 168272 -89951 32101 72529 -146975
11972 182656 -46009 -116793 107481 139730 -282386 -110637 -85583 81221 107088 172085 -88767
11960 13531 -142982 167780 -98366 41547 5343 -49039 144127 -185818 -55301 451155 -77459
11948 -2264 74197 33300 -4199 158195 -139035 310767 -133934 143349 -214074 115487 207084
11937 207084 -121654 -39695 -109838 -17354 231721 -19735 -197924 38092 103852 156619 -79241
$$ packed form
12017A69198c3433l29968h4622G8121a15102E519f1300j5933C11574d6012j97556
12006b43568J10648G7049c13497G9372b47037a17163j40945B76134A19567a61158
11995c14082g106j36642N3365n1967L5668A72575g223j98739N232A59790a81468
11983C9618J92756a56632a1376C82401j09602j04527h9951C2101M0428a46975
11972A82656d6009p0784A07481L2249b82386a10637K5054H1221K5867O4997h8767
11960A3531a42982A67780i8366D1547E343d9039A44127a85818e5301D51155g7459
11948b264G4197C3300d199A58195a39035C10767a33934A43349b14074A15487R1597
11937B07084a21654c9695p0143a7354B31721a9735j78189C8092O5760N2767g9241
$$ plain form
11925 -15175 -404936 9295 96583 -52331 68373 59461 -63827 -35419 124668 23680 3156 107491
11913 107491 -66328 -7301 129283 -191233 -190899 73999 -9184 -252220 -42662 51810 300844
11902 300844 277550 -115180 57180 217951 520790 -191765 -118080 209132 95978 -257834
11891 53857 326701 -302736 147573 -70701 -127505 104904 -221021 -64260 -114732 -146190 56375
11879 -410698 225695 218017 160510 -89236 100550 -115654 146071 -196605 -81273 -155111 -44654
11867 225576 -133017 -201993 403856 48729 147859 149050 -95752 -291799 -162954 -229769 141479
11855 -24183 -66588 136519 -62922 -220180 -268291 -85466 -112834 -127118 -50307 122246 -314633
11843 90039 172325 362852 -14657 -9297 -430700 242340 306651 -137862 13422 -411411 2095
$$ packed form
11925a5175l89761I295Q7288e2331F8373q912f3827K8408A24668B3680C156J04335
11913A07491f6328g301A29283a91233L34G3999i184k43036d2662E1810K49034
11902C00844k3294a15180E7180J60771L02839a91765P3685B09132I5978b57834
11891E3857K72844c02736A47573g0701n6804A04904b21021f4260n0472l1458E6375
11879d10698B25695p678n7507h9236A00550a15654A46071a96605h1273p3838d4654
11867B25576a33017o8976D03856D8729R9130J191i5752j96047J28845o6815A41479
11855b4183m2405A36519f2922j57258m8111h5466k7368j4284e0307A22246c14633
11843I0039Q2286J90527a4657N360m21403B42340O4311a37862A3422d11411B095
$$ plain form
11831 92722 -241272 -71400 -219803 -210859 -324744 -211336 -302054 138314 -13136 -125867 112414
11819 -35172 122881 127189 -306565 310227 -144770 -366814 -827 61046 149532 -91610 419871
11807 -386811 -106399 44056 -221445 159028 -282642 -137034 -223822 -168655 48445 74266
11797 74266 -102605 367173 -208359 17858 43124 -59518 381670 -33805 -219782 98731 291137
11786 291137 230097 402067 299660 -111009 -109682 31274 -24979 159096 248356 14014 327680
11775 327680 -86553 262561 -260 -9149 109532 15150 150730 -392116 91359 44813 -44912
11763 97211 293631 142600 -150569 52512 12395 173359 -30534 80965 129351 52918 -24502
11751 77940 116304 301407 363955 -183615 243651 19975 -10132 67095 -156032 -58784 -89114
$$ packed form
11831I2722b41272g1400j48403Q944j13885J13408r0718A38314a3136j12731A12414
11819c5172A22881M308c06565C10227a44770k22044h27F1046Q8486i1610D19871
11807c86811a06399D4056b21445A59028b82642a37034q6788N5167D8445K5821
11797G4266a02605C67173b08359A7858K5266e9518C81670c3805j85977I8731J92406
11786B91137o1040J71970j02407a11009J327C1274b4979A59096Q9260A4014L13666
11775C27680h6553B62561b60q889A09532A5150J35580c92116I1359D4813d4912
11763I7211J96420A42600a50569E2512A2395J60964c0534H0965M8386E2918b4502
11751G7940L8364J85103O2548a83615B43651A9975a0132F7095a56032e8784l0330
$$ plain form
11740 -89114 -105610 157332 216119 -305876 9783 -372211 27324 -252453 -345769 2044 383421
11729 383421 -69035 125256 321973 -12364 -33688 -103025 74253 161652 47638 -10610 -287449
11718 -287449 -51868 -2425 -283504 307854 184154 -213589 -105454 347593 63547 209152
11708 209152 154102 -8048 226591 -30771 -131655 -128755 182095 -108050 -26634 12974 124176
11697 124176 -467181 -166751 15241 -71590 180256 54672 170070 126986 194118 22361 242072
11686 242072 -253282 -6878 -158070 9124 317676 -181950 -303371 313234 282235 200505 -77280
11674 -175630 -104022 75127 -36834 -406302 22572 40536 268441 419044 212324 94475 -80644
11662 -175709 66335 156345 160040 213662 136681 -371638 77742 201616 272199 257797 -120946
$$ packed form
11740h9114j6496A57332N8787c05876I783c72211B7324b52453r3316B044L81377
11729C83421f9035A25256J96717a2364k1324o9337G4253Q7399D7638a0610k76839
11718b87449e1868b425k81079C07854j23700b13589a05454C47593F3547J45605
11708B09152n5050h048B26591c0771j00884K900A82095a08050b6634A2974J11202
11697A24176d67181a66751A5241g1590A80256E4672J15398m3084O7132B2361K19711
11686B42072b53282f878j51192I124L08552a81950j21421C13234l0999q1730g7280
11674a75630P1608G5127c6834l69468B2572J7964K27905J50603k06720I4475h0644
11662a75709F6335R0010L695N3622p6981c71638G7742J23874P0583j4402a20946
$$ plain form
11650 463109 -127851 161053 52754 215808 -401271 -67407 268160 269913 -70204 -20040 -103706
11639 -103706 212897 139417 -143893 202275 -225298 -202954 117228 -273129 -37530 161445
11628 -27712 99590 338412 123787 98175 89825 -90029 103092 67988 66007 258304 -213464
11616 153384 80376 -136655 -41809 18041 288062 -79852 162477 -136281 223550 -58981
11605 -198799 158746 -7944 222758 535275 54081 93310 113343 270669 -187309 103534
11594 187018 100321 -109398 331622 87698 -116664 603258 7012 63267 171066 3784 174843
11583 174843 -71493 63180 133810 40598 -106491 165351 -55859 -68975 17232 -124700 133889
11571 306569 -23682 324555 -3339 -238920 344863 -39869 249383 90856 -217119 88733 -286
$$ packed form
11650D63109a27851A61053E2754J63054d01271f7407B68160J753g0204b0040q3666
11639a03706B12897p3480a43893B02275b25298K2344A17228b73129c7530A61445
11628b7712I9590K38822A23787k5612q350i0029A03092l5104j981J92297b13464
11616A53384p3008a36655d1809A8041K70021g9852A62477a36281B23550e8981
11605a98799A58746g944B22758L12517E4081L9229K0033J57326a87309A03534
11594A87018q6697a09398C31622H7698a16664F03258G012N6255J07799C784J71059
11583A74843g1493F3180P0630D0598a06491A65351e5859j3116A7232a24700A33889
11571C06569b3682C24555c339k35581C44863c9869B49383I0856b17119H8733b86
$$ plain form
11559 -60003 168054 -126558 405685 -326327 -93509 -112215 233423 134928 16427 18306 -94137
11547 -40533 -283715 -48349 313580 -71187 75425 91817 -45679 103899 -39006 174334 270277
11536 270277 -11509 -1069 430920 182578 317647 -83614 -63157 187789 -71645 379155 -16650
11524 88259 -139623 287465 -14284 316627 92033 30407 75927 -117408 76235 10180 68803
11513 68803 11440 276999 110949 -301058 -67612 71675 -164347 -8899 -68452 229861 156219
11502 156219 217392 120236 172166 102058 240989 -14560 384390 370624 321391 -135125 254327
11490 434412 82259 158303 79844 33250 252326 286427 137178 -33796 428764 141769 69876
11478 -19054 520074 87155 -164766 149580 -119726 384484 422302 207516 277700 210469
$$ packed form
11559f0003A68054a26558D05685c26327i3509j8706B33423r8495A6427J879i4137
11547d0533k43182d8349C13580g1187G5425J6392d5679A03899c9006A74334R5943
11536B70277a1509a069D30920A82578J35069h3614K0457A87789g1645C79155a6650
11524H8259a39623B87465a4284C16627I2033C0407M5520a17408G6235A0180N8623
11513F8803A1440K65559A10949c01058f7612G1675a64347h899n9553B29861p3642
11502A56219O1173r7156N1930p0108J38931a4560C84390j3766m9233a35125B54327
11490D34412H2259P6044p8459C3250K19076L4101A37178c3796D28764A41769F9876
11478a9054E20074H7155a64766A49580a19726C84484L7818B07516P0184o7231
$$ plain form
11468 210469 325879 368221 210757 234288 305982 74517 64717 228165 122596 163975 359067
11457 359067 142150 -116871 -158308 306663 249414 -93866 46408 135841 -175086 259102
11446 -86116 123915 85704 36372 88886 238845 53253 102686 -314135 -176851 77903 -36006
11434 4648 331779 447162 -86528 -291553 -4130 363843 23256 -112154 -84656 -249749 179586
11422 281506 32873 -176878 -162246 331074 -24726 38125 -2464 99711 25859 318843 91737
11410 -152131 109523 29833 9278 -68393 -101948 97209 116528 103467 -31688 179610 240888
11399 240888 -27352 36325 81311 28011 264118 -213440 141355 3987 410924 263213 84920
11387 -149487 -117788 42032 -170443 292946 45389 296183 -251311 232233 -370401 -77964
$$ packed form
11468B10469J15410M2342j57464K3531P1694G4517r800J63448j05569M1379J95092
11457C59067A42150a16871m1437C06663n7249i3866D6408Q9433a75086B59102
11446h6116A23915l8211C6372N2514J49959E3253M9433c14135J37284G7903c6006
11434D648L27131J15383h6528k05025d130C63843B3256a12154K7498j65093A79586
11422B81506C2873a76878J4632C31074b4726C8125b464I9711B5859K92984I1737
11410a52131A09523B9833I278f8393l3555I7209J9319j3061c1688A79610O1278
11399B40888b7352C6325M4986B8011K36107b13440A41355C987M06937j47711H4920
11387a49487L1699D2032a70443B92946D5389K50794b51311B32233c70401g7964
$$ plain form
11376 72379 97371 191184 -127095 338335 -48426 35871 -170756 76428 -51143 -143545 -45090
11364 173533 286087 -95510 -18136 228062 -261480 202503 81418 -65399 -390918 -173740
11353 27257 -254910 -148231 298074 -53656 -23369 -213543 267107 -30895 6488 255809 192681
11342 192681 127298 -65085 -63124 -34074 -343159 -50779 97489 128239 -129930 212914 197657
11331 197657 185632 -51766 87912 122703 257622 41159 -62634 -154354 -512966 358730 -80602
11319 -19105 254889 9182 17622 -129784 -110055 196407 -32727 -14101 64536 -125035 -29357
11307 -58942 46231 112397 460322 344114 -215393 -206568 -135535 -232850 153184 79361 -426705
11295 58009 374666 -108680 -150951 -92784 96667 258602 61473 -39400 63808 -94393 -121082
$$ packed form
11376G2379K4992R3813a27095C38335d8426C5871a70756G6428e1143r2402d5090
11364A73533J12554i5510a8136B28062b61480B02503H1418f5399l25519a73740
11353B7257b54910J06679B98074e3656b3369j90174B67107c0895F488K49321o3128
11342A92681o5383f5085J961K9050l09085e0779I7489L0750a29930B12914j5257
11331A97657j2025e1766H7912L4791J34919D1159f2634r1720l58612C58730h0602
11319a9105B54889I182Q440a29784J9729A96407c2727a4101F4536a25035b9357
11307e8942D6231O6166L47925j16208b15393Q825P1033r7315A53184p3823d26705
11295E8009L16657a08680m2271N8167I6667J61935F1473c9400F3808i4393k6689
$$ plain form
11284 -121082 -337281 35263 88742 273056 55465 186617 46664 -23579 -189676 -66903 -276352
11273 -276352 -24127 -547884 -127609 -314537 -22705 82328 225229 10565 -535757 181593
11262 -46931 273341 -350508 -168290 -92818 -122146 -153668 132783 -144679 -32141 -120866 -30779
11250 -44839 -110613 -229192 71093 -180511 171411 19786 123901 -83860 240039 -113292
11239 172598 -138445 -231414 -160367 -175188 -179027 12536 -94555 -126449 -196862 42721 44724 287991
11227 287991 163292 -242472 -188016 155078 -259567 -88909 38192 -80645 263924 95882
11216 389287 61710 226764 -311707 -164238 162052 -150614 -189222 -117147 -75191 -109614
11206 -109614 -149301 -56361 -276305 -216993 220801 -150125 -82805 -335485 -83197 -267904
$$ packed form
11284a21082k16199C5263N3479J84314E5465J31152D6664b3579j66097f6903k09449
11273b76352b4127n23757a27609j86928b2705H2328J42901A0565e35757A81593
11262d6931B73341c50508a68290P5472k9328l1522A32783a44679c2141q8725c0779
11250d4839o5774j18579G1093a80511A71411A9786J04115h3860B40039a13292
11239A72598a38445r2969P1047j4821l839A2536i4555l1894p0413D2721K003K43267
11227B87991j24699b42472N4456A55078b59567h8909C8192h0645B63924I5882
11216C89287F1710J65054c11707J47469A62052a50614l8608P2075M1956l4423
11206a09614l9687e6361k19944N9312B20801a50125O7320k52680h3197j84707
$$ plain form
11196 -267904 -121078 -106922 101179 -270767 -36687 306133 -181412 -95025 -114297 -136539
11186 -136539 -70895 25828 169683 116960 -146279 89382 197607 67743 -180844 -482753
11176 -482753 -78924 -28711 272599 9508 -83180 -235138 7865 73983 -274115 67225 -346209
11164 211202 -220809 19470 -109340 157542 86163 -39124 -233974 -218974 -87227 21910 -38833
11152 -167749 -9191 281428 120745 -243314 -106405 -101546 460504 -8579 -181455 -131596 17072
11140 108305 -71091 83662 62748 -114774 88326 -153040 182386 -47097 -31487 -293566 46577
11128 469662 566608 107401 26547 179772 -119254 -32355 -121689 84670 370006 -36224 111795
11116 -528716 -105722 73340 197374 29520 292869 -237798 -324305 27288 -155495 235043
$$ packed form
11196b67904a21078J4156A01179b70767c6687C06133a81412Q6387j9272k2242
11186a36539O5644B5828J43855n2723a46279H9382J08225F7743a80844l01909
11176d82753g8924b8711B72599I508h3180j51958G865O6118b74115F7225c46209
11164B11202b20809A9470a09340A57542p1379c9124j94850J5000h7227B1910c8833
11152a67749i191B81428A20745b43314a06405M859D60504h579j72876M9859A7072
11140A08305g1091H3662k0914a14774H8326a53040A82386d7097J5610k62079D6577
11128D69662R6946A07401B6547J53225a19254c2355q9334H4670K85336c6224A11795
11116e28716a05722G3340J24034B9520K63349b37798q6507B7288a55495B35043
$$ plain form
11105 -194841 132889 409051 385624 -61494 -57430 346144 154572 31241 303675 92295 -99651
11093 254568 -39021 402630 415758 -3695 7539 -17793 92309 260484 106684 257320 207108
11082 207108 53125 249353 125910 -10613 120491 354501 472384 276071 98601 38912
11071 400704 352338 308408 455308 192722 510795 155081 527612 572260 517376 449479
11061 449479 598638 386556 173918 653192 427380 156454 635209 591274 667967 1035647
11051 1035647 844961 612682 855768 629173 710335 698670 895113 594169 824411 618270
11041 618270 570976 887027 560472 690074 671530 759687 694017 738307 448817 1066171
11031 1066171 484265 875095 978048 1035001 858529 463005 587680 849811 678480 731713
$$ packed form
11105a94841A32889K76162k3427f1494M064C46144A54572C1241K72434I2295i9651
11093B54568c9021D02630J3128c695G539a7793I2309J68175A06684J50636n0212
11082B07108E3125J96228j23443a0613A20491K34010J17883j96313I8601C8912
11071D00704m8366m3930J46900A92722L18073A55081L72531M4648n4884o7897
11061D49479J49159k12082A73918M79274k25812A56454M78755m3935P6693L67680
11051A035647j90686k32279K43086k26595Q1162j1665J96443l00944K30242k06141
11041F18270m7294L16051l26555J29602j8544Q8157o5670M4290k89490O17354
11031A066171D84265L90830J02953N6953j76472l95524J24675K62131j71331N3233
$$ plain form
11021 731713 694013 275673 566025 1187253 426825 633003 542567 420194 530542 655983
11011 655983 624519 934740 259938 589471 808699 747776 536327 861755 577635 352186
11001 352186 713638 766579 465596 748780 699918 683157 847727 944147 614178 636134
10991 636134 1070803 612016 632927 750079 1145922 1086282 945493 910358 886622 1108969
10981 1108969 1289882 1184837 1295611 1720131 1403654 2137401 2363494 2408184 2653013 2763931
10971 2763931 2844672 2710905 2587593 2731781 2608519 2107204 2080932 1613143 1766247 1948028
10961 1948028 1610462 2110690 2118112 2199173 1963737 1954009 2078064 1807682 1368848 1466842
10951 1466842 1252616 1185494 851926 519336 547274 517288 435618 314726 115861 160584
$$ packed form
11021G31713l7700B75673K90352O21228D26825K06178r0436j22373J10348J25441
11011F55983l1464L10221B59938L29533K19228o0923k11449L25428k84120k25449
11001C52186L61452N2941l00983K83184m8862j6761J64570R6420l29969K1956
10991F36134M34669m58787K0911J17152L95843n9640j40789l5135k3736K22347
10981A108969J80913j05045J10774M24520l16477P33747K26093M4690K44829J10918
10971B763931Q0741j33767j23312J44188j23262n01315k6272m67789J53104J81781
10961A948028l37566N00228P422Q1061k35436r728J24055k70382m38834R7994
10951A466842k14226o7122l33568l32590K7938k9986q1670j20892A15861M4723
$$ plain form
10941 160584 237277 137127 241639 480272 169970 195938 3466 -83735 304679 -12353 298712
10929 147596 -90108 -349982 269571 -37954 100780 -134745 172835 183637 -90409 343396
10918 -65790 223988 49702 79582 -182766 -8637 -169588 85401 87565 86020 -257635 72476
10906 -242891 96601 -14792 60707 2465 70036 -175565 -177550 209883 -89883 -260277 295903
10894 31271 56006 -63297 -22819 362013 79806 64160 -13085 -110495 -198394 -131528 154068
10882 48036 -55776 127657 -90737 -135433 -48122 39148 -97611 173406 161306 103346 -100888
10870 195853 -47119 38715 46963 -23897 181438 -21810 -89236 -31132 316945 -203262 26210
10858 42374 81226 59577 -122734 -53701 157114 125632 81495 -91710 -172533 17687 -82589
$$ packed form
10941A60584P6693j00150J04512K38633A69970K5968C466h3735C04679a2353B98712
10929A47596i0108k59874B69571c7954A00780a34745A72835J0802i0409C43396
10918f5790B23988D9702K9880a82766h637j60951H5401K164j545b57635G2476
10906b42891I6601a4792F0707B465O7571a75565j985B09883h9883j70394B95903
10894C1271K4735f3297b2819C62013G9806j5646a3085r7410q7899O6866A54068
10882D8036e5776A27657i0737m4696d8122C9148i7611A73406j2100n7960a00888
10870A95853d7119C8715Q248b3897A81438b1810o7426c1132C16945b03262B6210
10858D2374L8852k1649a22734e3701A57114l1482m4137i1710q0823A7687h2589
$$ plain form
10846 263437 219671 -177199 99784 44260 -144980 -57040 -178464 72967 -57006 -137746 -93487
10835 -93487 -101545 39201 -28940 -269879 -88557 -294640 60463 -208675 138078 -23184 -204111
10824 -204111 98228 -246799 -192963 3329 -240428 -82914 -454574 193846 -113258 -63544 6727
10812 300587 -209546 109340 -32571 -72472 -76897 44479 20760 18791 -52822 -19219 -244202
10801 -244202 -154015 -447243 44312 -3669 -124500 184417 -244199 -231192 -157473 -268355 240483
10789 -170377 -160521 62465 102017 65445 64933 -132011 101655 -46444 39987 37788 144476 29118
10776 380722 113451 -219544 76889 -138371 -135331 86736 31282 56290 254042 11020 -17751
10764 99858 -85703 -172568 5393 -163552 -52717 -134302 -128739 -33028 7835 -206749 -80511 115050
$$ packed form
10846B63437m3766a77199I9784D4260a44980e7040j21424G2967e7006q0740M4259
10835i3487q058C9201b8940k40939h8557k06083F0463b08675A38078b3184j80927
10824b04111I8228b46799N3836C329b40428h2914l71660A93846a13258M9714F727
10812C00587b09546A09340c2571l9901m425D4479B0760j969e2822a9219k24983
10801b44202R0187k93228D4312c669j20831A84417b44199J3007P3719j10882B40483
10789a70377R856F2465L9552l6572n12a32011A01655d6444C9987k199J06688B9118
10776C80722A13451b19544G6889a38371L040H6736C1282K5008J97752A1020a7751
10764I9858h5703q6865E393a63552e2717q1585N563c3028G835b06749h0511A15050
$$ plain form
10751 -212748 34219 -175618 -297723 -91711 155133 191926 62438 259424 225107 -36305 251124
10739 -63409 52340 112556 -325090 -221781 -67733 -25730 -137757 74088 -102783 44528 -62740
10727 11866 -26083 -241118 -351845 -154036 -29021 -158467 -418444 -265165 142403 99096
10717 99096 301749 303574 -196361 206801 -46933 62046 -46588 91398 105921 9952 34310
10706 34310 481182 86816 240604 -135887 -107420 191652 -228091 -28156 60126 -98833 -160148
10695 -160148 -212790 41456 -159520 -75611 -62045 -64123 298368 -73265 -132156 -70277 -308276
10684 -308276 -51089 -130630 -346284 -338032 -105202 90008 -325082 -32452 221079 -351212 -37014
10672 61449 55796 -64391 -116009 76901 -173179 -396189 375104 -22113 -22403 55254 -253052
$$ packed form
10751b12748C4219a75618j22105i1711A55133L6793F2438J96986l4317c6305B51124
10739f3409E2340O0216c25090J03309f7733b5730j12027G4088a02783D4528f2740
10727A1866b6083k15035j10727a54036b9021j29446k59977J53279A42403m3307
10717I9096K02653J825a96361B06801d6933F2046d6588I1398J4523I952K4358
10706C4310M46872H6816J53788a35887K8467A91652b28091b8156F0126i8833o1315
10695a60148n2642D1456a59520g5611J3566k078B98368g3265n8891O1879k37999
10684c08276e1089p9541k15654Q252a05202I0008c25082c2452B21079c51212c7014
10672F1449n653f4391n1618G6901a73179k23010C75104b2113k90E5254b53052
$$ plain form
10660 60268 -191355 -210799 -42036 -220264 -129329 -43262 45891 38377 -47710 -83697 -22801
10648 111300 -330308 64777 -43201 78809 70033 -105566 -91525 -241947 99472 38033 -330725
10636 -17574 -51686 29561 56354 -185627 -276391 -119634 -428756 -394513 -76979 -64496 23391
10624 14712 26947 -243960 -51223 -1752 -119178 -77554 -123191 -105426 77145 -322224 -31142
10612 -171659 -407172 206968 -216805 -63836 -255746 -67836 -216991 57686 -158920 -139224
10602 -139224 14361 -201459 -110927 101322 -161914 -171230 85087 100891 -9911 -29389 322743
10590 103114 131091 -146585 -267543 245832 5378 199334 57379 35098 69884 289910 -124322
10578 -336876 -85139 74576 201995 -286793 -160813 130218 -297620 344097 48487 -39162
$$ packed form
10660F0268a91355j9444d2036j78228R0935d3262D5891p514d7710l5987b2801
10648A11300c30308F4777d3201G8809q776a05566J4041j50422I9472C8033c30725
10636a7574l4112B9561K6793a85627r0764a19634l09122L4243g6979J2483B3391
10624A4712J2235b43960e1223a752j17426M1624m5637J7765G7145c22224c1142
10612a71659k35513B06968b16805f3836j91910f7836j49155E7686a58920J9696
10602a39224A4361b01459R0532A01322a61914r316H5087J5804i911j9478C22743
10590A03114K7977a46585j20958B45832E378J93956E7379k2281L4786K20026a24322
10578c36876h5139G4576J27419b86793J25980A30218b97620C44097D8487c9162
$$ plain form
10567 -223339 -221247 -123887 45411 -297699 -244494 103663 -402436 48449 18436 229371 109785
10555 252568 -169153 162277 45834 152727 -251980 -72704 266382 235118 -362897 -201015
10545 -201015 -175176 195843 -207686 74773 13348 -185719 163362 35918 247679 116860
10534 -284440 366136 -54757 -11144 -216557 -33178 38501 77640 -267414 -210547 19576 -297094
10522 -37218 72818 -53417 -108850 20960 21210 48286 -252000 142941 -236220 -90389 229513
10510 251053 -138424 -46366 38934 48564 -415240 -136363 279085 -90187 -28568 -45999 -54497
10499 -54497 240056 361173 -22758 169924 56075 -125774 -137522 352455 -214377 61743
10488 -59216 179284 -5215 87723 243030 -45555 233370 420739 150024 594360 284329
$$ packed form
10567b23339K092R7360D5411b97699N3205A03663d02436D8449A8436K10935A09785
10555B52568a69153A62277D5834J06893b51980g2704B66382l1264c62897J61882
10545b01015K5839A95843b07686G4773A3348a85719A63362C5918K11761A16860
10534b84440C66136e4757a1144k05413c3178C8501L9139b67414N6867A9576b97094
10522c7218G2818e3417n5433B0960K50K7076b52000A42941b36220i0389B29513
10510B51053a38424d6366C8934R630d15240a36363B79085i0187b8568j7431q498
10499e4497B40056J21117b2758A69924E6075a25774j1748C52455b14377F1743
10488e9216A79284e215H7723J55307d5555B33370J87369A50024M44336B84329
$$ plain form
10477 242148 352289 89639 6139 67883 278576 98198 144066 -64675 57847 -200820 57198
10465 91551 222526 110461 -270685 -204177 18095 -138600 8200 -245927 -144152 -95041 -173767
10454 -173767 -117895 -140701 -26532 -42518 -75894 32785 -7039 107220 -262735 -211473 48702
10442 50343 136939 167066 -153634 -101415 -174797 -23969 -89755 -74948 49827 -259299 176056
10430 -316311 313135 -173844 -139563 75165 111322 50461 -244829 -309989 -257342 -239617 -255976
10419 -255976 -143142 69079 138627 369827 29487 -175876 34244 -115020 242423 81726
10408 122535 -142720 184547 -18946 -78873 148097 -433979 13312 48353 -120810 -107845
10398 -107845 74836 142824 23767 -184596 52813 -26040 -203214 264170 171619 216177 215927
$$ packed form
10477B42148J10141H9639F139O1744K10693I8198M5868f4675E7847b00820E7198
10465I1551J30975A10461b70685O6508A8095a38600H200b45927J01775M9111p8726
10454a73767N5872k2806b6532j5986l3376C2785g039A07220b62735N1262D8702
10442E0343Q6596L0127a53634N2219p3382b3969o5786J4807D9827b59299A76056
10430c16311C13135a73844L4281G5165L6157E0461b44829o5160N2647J7725j6359
10419b55976J12834F9079O9548K31200B9487a75876C4244a15020B42423H1726
10408A22535a42720A84547a8946n9927A48097d33979A3312L5041a20810J2965
10398a07845G4836O7988B3767a84596E2813b6040j77174B64170r2551M4558k50
$$ plain form
10387 215927 -40333 125644 111821 -219813 13477 210375 180161 -72203 172961 50899 398641
10376 398641 91224 63873 -31246 132354 435256 492759 -24734 51856 454106 230411 246257
10365 246257 366287 349318 399731 302901 272129 65832 204675 -22021 295225 331272 429894
10354 429894 161842 122508 -67958 528455 415121 478596 292337 673155 264321 443668
10344 443668 290720 405730 306181 281279 331383 261559 572481 560426 107470 263922
10334 263922 21676 156113 412300 232374 95577 -85179 27956 106595 -98013 314396 66776
10322 56165 288248 369540 94250 345896 162769 -1377 99656 65640 45905 -10616 21165
10310 -91862 69766 29185 116700 165311 302560 -159600 -157399 -139520 55974 -366825 361723
$$ packed form
10387B15927d0333A25644j3823b19813A3477J96898l0214g2203A72961E0899L47742
10376C98641I1224k7351c1246A32354L02902N7503b4734E1856M02250k23695J5846
10365B46257J20030j6969N0413r6830l0772F5832J38843b2021B95225L6047R8622
10354D29894A61842l9334f7958E28455j13334O3475j86259L80818B64321J79347
10344D43668j52948J15010r9549k4902N0104o9824L10922j2055A07470J56452
10334B63922B1676J34437K56187j79926I5577h5179B7956P8639i8013C14396F6776
10322E6165K32083Q1292I4250K51646A62769a377I9656l4016j9735a0616B1165
10310i1862F9766B9185Q7515M8611J37249a59600K201J7879E5974c66825C61723
$$ plain form
10298 -146986 -25219 -67421 80580 -167971 24424 -9144 66225 -239261 -95177 60780 -154182
10286 -38223 32492 -225006 -75847 208245 -324514 -89815 87677 223582 -162947 -327825
10276 -327825 21446 98667 241134 -209210 106629 4 32268 110036 -238700 147896 -141087
10264 20627 38504 11721 548968 293633 -58203 475385 491285 419569 507801 338746 280234
10253 280234 135915 114587 -213822 195192 -216395 -191927 326745 73049 71825 180790
10243 180790 261111 -532534 -217734 -221442 65198 110353 331914 -222235 -221214 76024 14657
10231 207746 41152 -137688 -396965 155676 -12368 82288 -156346 -117631 -26191 -4256 -2984
10220 -2984 -194024 107080 -137146 -337002 2422 -149222 -60440 -168647 -258686 -61203 -41074
$$ packed form
10298a46986b5219m2202H0580a67971B4424i144F6225b39261i5177F0780a54182
10286c8223C2492b25006g5847B08245c24514h9815H7677J35905a62947j64878
10276c27825B1446P7221J42467b09210A06629DL2264P7768b38700A47896a41087
10264B0627J7877A1721N37247k55335e8203D75385J5900p1716Q8232j69055n8512
10253B80234A35915k1328b13822A95192b16395K4468C26745G3049j224J08965
10243A80790Q0321e32534b17734l708F5198M5155K21561b22235J021G6024A4657
10231B07746D1152a37688k59277A55676a2368H2288a56346L8715b6191d256J272
10220b984j91040A07080a37146j99856B422a49222f0440j08207r0039f1203K0129
$$ plain form
10209 -41074 133652 -91673 -231650 -3987 172859 -109172 30378 -330460 3151 131246 -45925
10197 -8518 -254544 -236442 316806 -8284 58175 115349 -34450 -236848 76046 264909 -159603
10185 231274 -210908 -168584 -133068 -45388 -111920 109175 431221 -116316 -137850 -201744 32610
10173 -65257 -66445 37383 -112216 -183938 -18424 -220373 -37073 -19967 -294007 9427 198067
10162 198067 -94107 45955 -15374 -66010 -286617 60499 -287443 -147342 -19122 118622 -367363
10150 -236399 63147 -56348 182519 93232 257544 344429 -349318 91349 -23939 171176 -23017
10138 -25666 175338 -15970 -278420 -392323 -234521 17622 -18725 -139697 333692 -244300
10127 -50183 -310106 15227 66283 -37295 31374 261919 -138469 -113593 -69126 -9507 -19951
$$ packed form
10209d1074A33652i1673j39977c987A72859a09172C0378c30460C151J28095d5925
10197h518k46026J8102C16806h284E8175N7174c4450k02398G6046J88863a59603
10185B31274b10908M2324L5516d5388o6532A09175L22046a16316k1534o3894C2610
10173f5257j188C7383a12216p1722a8424k01949c7073J7106k74040I427J88640
10162A98067i4107D5955a5374n0636k20607F0499b87443J40101a9122A18622c67363
10150b36399F3147e6348A82519q9287J64312Q6885c49318I1349b3939A71176b3017
10138b5666A75338a5970k62450j13903J57802A7622a8725j20972C33692b44300
10127e0183k59923A5227N1056c7295C1374K30545a38469K4876M4467i507j0444
$$ plain form
10116 -19951 -238768 66733 -95489 -361014 -129481 181363 -94662 -141238 -187334 -10129 60348
10104 -71862 -381137 -248106 160410 -144037 38461 139219 -50053 88949 174852 264960 -285538
10092 71028 76051 -206714 -52033 -210977 -304868 -179259 47460 -12904 -77650 -69796 -503510
10081 -503510 -270713 -178375 -120358 46612 -187351 498159 -166808 -124298 20012 -95630 -169292
10070 -169292 84503 -60631 -269972 -47828 -94880 145249 -32959 -232088 -200340 80581 142168
10059 142168 -107286 141044 -86848 -98550 -186488 -201625 292672 28805 -55121 344409 93469
10047 -262506 -35105 -147886 -288674 199140 -334294 78987 -18226 -17964 -58147 34750 -303730
10035 -51833 -48534 -231135 153126 -178075 -2856 437722 -265913 -17098 -250386 13451 -65645
$$ packed form
10116a9951k18817F6733i5489k65525a29481A81363i4662m6576m6096a0129F0348
10104g1862l09275J33031A60410a44037C8461J00758e0053H8949Q5903R0108b85538
10092G1028N023b06714e2033j58944r3891J25609D7460a2904o4746P854m33714
10081e03510K32797R2338N8017D6612a87351D98159a66808M2510B0012i5630p3662
10070a69292H4503f0631k09341d7828m7052A45249c2959j99129L1748H0581O1587
10059A42168a07286A41044h6848j1702q7938j5137B92672B8805e5121C44409I3469
10047b62506c5105j12781j40788A99140c34294G8987a8226K62m0183C4750c03730
10035e1833L299j82601A53126a78075b856D37722b65913a7098k33288A3451f5645
$$ plain form
10023 -110985 35111 -260441 -221692 29370 15959 -228308 -83028 -532113 431695 -179838
10012 -207016 -283436 -44438 -161343 -93029 -150639 172779 83337 -308970 88665 -283154 -212637
10001 -212637 -138942 -6315 -169789 -93104 -243454 175796 158265 -46475 -283815 12671 -337320
9989 53400 -607466 93957 75916 -68782 -27736 613257 37645 -73384 155081 -146755 -272645
9978 -272645 -34316 426037 -22270 117192 15980 -99998 -47745 -42976 -406286 -108637 -23775
9966 -69658 -129158 121284 -34382 -472784 14608 -216960 -77246 88649 143936 -56969 -362828
9955 -362828 236628 -308513 40328 -74933 38918 89500 -269495 166290 119988 -195477 -288692
9944 -288692 -371400 -119413 -91507 -28352 153664 -333039 -103945 237911 -292358 -94414
$$ packed form
10023a10985C5111b60441L8749B9370j3411b28308h3028m49085D31695a79838
10012b07016p6420d4438j16905O8314n7610A72779H3337c08970H8665b83154P0517
10001b12637P3695f315j63474P6685j50350A75796j7531d6475k37340A2671c37320
9989E3400f07466I3957j8041f8782b7736F13257C7645g3384A55081a46755j25890
9978b72645c4316D26037b2270A17192A5980i9998d7745M769l63310a08637b3775
9966f9658n9500A21284c4382m38402A4608b16960g7246H8649N5287e6969l05859
9955c62828B36628c08513D0328g4933C8918N0582b69495A66290m6302a95477r3215
9944b88692q2708a19413K7906b8352A53664c33039a03945B37911b92358i4414
$$ plain form
9933 -12806 -245344 -104152 -179097 88554 -152391 -30591 -355909 204217 150385 26356 -1468
9921 -122488 -135331 -11676 -246320 -332382 -125510 205724 189439 -32165 -282815 239301 54772
9909 -178384 150372 22661 -116562 -237825 -90652 49365 9326 90771 -105081 -498214 -55914
9897 -345372 -72686 -269747 -160442 -124154 242727 228475 -74328 -59809 168699 -117740 -139507
9886 -139507 -258207 -40693 -153770 -21839 118469 -152339 -138826 -327964 56949 -40449 -213492
9875 -213492 -154156 122854 -111939 -192747 -170335 -234189 209885 -111470 -163668 -104553 -77512
9864 -77512 -165424 114061 114539 -24313 -19664 77292 -236562 6306 28215 224102 -232846 -34651
9851 -33970 -373283 -77998 -103776 21204 -76210 -62024 26017 72239 43448 -194643 349290
$$ packed form
9933a2806k32538a04152p4945H8554a52391c0591l25318B04217n3832B6356a468
9921a22488j2843a1676k34644q6062a25510B05724j6285c2165k50650B39301E4772
9909a78384A50372B2661a16562j21263i0652D9365I326Q1445a05081l93133e5914
9897c45372g2686j97061J09305L6288B42727j4252g4328J4519A68699a17740k1767
9886a39507j18700d0693j13077b1839A18469a52339J3513j89138E6949d0449j73043
9875b13492N9336A22854a11939q0808K2412o3854B09885a11470n2198N9115K7041
9864g7512q7912A14061M78b4313M649G7292b36562F306K1909J95887b32846c4651
9851c3970l39313g7998k5778B1204g6210J4186B6017M6222k8791a94643C49290
$$ plain form
9839 -150644 -35388 -434207 -73829 28219 -16155 211423 -136146 -170232 -99424 36599 -267219
9827 -296541 -395669 -55429 159405 -84458 -385860 -164372 -100243 -367164 -421183 23944 -136604
9815 150808 112011 -154755 -191720 41190 -12805 -275016 -7937 -154482 -51447 131929 -93968
9803 -394549 -110909 -42163 114705 -120545 168487 86044 -154182 4028 -41920 373555 -140012
9791 38821 -163918 -305517 -164678 281 -212515 -45791 54615 13180 -251312 -223614 -153487
9780 -153487 -240905 -121237 156031 -59456 10178 -228757 -90726 356116 302871 -47305 18765
9768 -23239 181291 -247508 -156718 -229575 -160389 -141296 -96183 101632 34698 -180376 -255680
9757 -255680 -303747 -108377 16437 -19122 -36793 45900 -58529 52265 -19961 -164365 -180808
$$ packed form
9839a50644c5388l98819g3829B8219a6155B11423a36146l4086P0808C6599b67219
9827b96541r9128e5429A59405h4458l01402a64372O4129k66921n4019B3944a36604
9815A50808l8797a54755l6965D1190a2805k62211g937j46545e1447A31929i3968
9803c94549a10909d2163A14705a20545A68487q2443a54182D028d1920C73555a40012
9791C8821a63918j41599J40839B81b12515d5791E4615A3180b51312K7698P0127
9780a53487q7418J19668A56031e9456A0178b28757i0726C56116n3245d7305A8765
9768b3239A81291b47508R0790p2857O9186J9093M5113A01632C4698a80376p5304
9757b55680m8067a08377A6437a9122j7671D5900e8529E2265a9961j44404j6443
$$ plain form
9746 -180808 73020 222279 -61215 278151 -407763 -145504 -197990 -15203 188562 -2044 -158991
9735 -158991 -208862 7654 -13461 -86374 -275058 60376 106652 161327 -332319 6052 59052 -157045
9722 53095 141944 -9936 23694 104734 -190140 143008 174363 -148202 99319 65096 -335268
9710 367400 -128519 69217 -184793 -227998 50176 -44283 -61767 195574 69457 35460 -217116
9698 -91990 -298143 -325775 60637 180782 174846 -95500 -33824 -71239 -276712 -241137 -59902
9686 -76769 66957 -347728 -66290 -88503 -145904 -104685 55478 30310 -54856 -199612 -145938
9675 -145938 47128 24201 173512 -264082 -158622 -219768 -170623 234336 35664 -400924 -126002
9663 -17832 -487932 172799 -113687 59445 82585 -303667 -228379 -26927 -92019 87433 -32730
$$ packed form
9746a80808G3020J49259f1215B78151d07763a45504n2486a5203A88562b044j56947
9735a58991m9871G654a3461p2913j88684F0376M6276N4675c32319F052N3000a57045
9722E3095Q8849i936B3694Q1040a90140A43008L1355a48202I9319l4223c35268
9710C67400a28519F9217a84793m3205E0176d4283j7484A95574F9457l3997b17116
9698i1990k06153k7632F0637J20145n936i5500c3824l7415k05473L5575e9902
9686g6769F6957c47728f6290k2213n7401M1219E5478k5168e4856j44756N3674
9675a45938D7128k2927J49311b64082J05460o1146M9145B34336C5664d00924a26002
9663a7832m70100A72799a13687E9445K3140c03667P5288b6927o5092H7433c2730
$$ plain form
9651 -105172 -88345 -202389 -301317 -264490 -325857 -89990 194132 46589 -283618 -450480 104577
9639 -173318 845 -143483 22488 -256798 74500 -320554 41215 336065 -22243 324749 -291983
9627 -33862 4061 -125104 204441 84274 -163871 -23075 -198906 256765 -201936 -476775 -49692
9615 200480 280051 -18218 -78148 -118155 -58313 127616 -181105 76296 -56837 184117 -21950
9603 -347124 -111799 132097 9518 -76101 183040 -467799 -124485 -121925 -32722 67536 -53148
9591 -183096 -203368 -178387 118918 -57088 131156 -178384 124455 -304757 -146491 -330220
9581 -330220 146289 -187801 160638 876 -106004 -118909 358275 -68633 -118485 130056 -89003
9569 69653 89892 -309257 -542962 -166179 -133023 -65321 179407 161920 268287 252548 78873
$$ packed form
9651a05172J6827j14044r8928L6827o1367h9990A94132D6589b83618j66862A04577
9639a73318H45a43483B2488b56798G4500c20554D1215K94850b2243C24749b91983
9627c3862D061a25104B04441H4274a63871b3075j75831B56765b01936k74839d9692
9615B00480P9571a8218n9930m0007e8313A27616a81105G6296e6837A84117b1950
9603c47124a11799A32097I518g6101A83040d67799a24485K560c2722F7536e3148
9591a83096k0272K4981A18918e7088A31156a78384A24455c04757a46491j83729
9581c30220A46289a87801A60638H76a06004j2905C58275f8633m9852A30056h9003
9569F9653K0239c09257k33705a66179L3156f5321A79407j7487J06367j5739G8873
$$ plain form
9557 -303441 -159033 -104232 -238069 1627 -248946 -243663 -177671 -247529 -86038 159557 58019
9545 -168647 -157511 262222 -8487 -64057 -32539 -509610 11623 -47738 106133 -453246 -24097
9533 -393044 -100494 -57989 24204 -179684 130174 -148094 22824 -31959 46353 -168789 -290090
9522 -290090 -87353 -153260 33249 284596 -121905 -114632 -61931 96798 96820 40040 -74607 -122033
9510 -122033 -27878 -129535 139583 -21390 -17766 -83449 -444754 -71723 -131806 -124335 -99855
9499 -99855 131258 46142 -222689 181961 293236 -96109 -237627 62661 215333 -75897 -79235
9488 -79235 48855 -161136 -45090 -273905 -214769 -51324 -138157 -234790 -226019 -462666 106355
9476 54641 -103793 -185845 -253654 -175018 54821 -64451 -199608 -116123 -122710 219472 -56724
$$ packed form
9557c03441J44408N4801j33837A627b48946N283O5992o9858h6038A59557E8019
9545a68647J1136B62222h487n5570L1518m77071A1623d7738A06133d53246b4097
9533c93044a00494M2505B4204a79684A30174a48094B2824c1959D6353a68789j21301
9522b90090h7353o5907C3249K51347a21905P273N2701I6798K2D0040g4607m7426
9510a22033b7878j01657A39583b1390L624o5683l61305g1723o0083P471K4480
9499i9855A31258D6142b22689A81961J11275i6109j41518F2661J52672g5897l338
9488g9235D8855a61136d5090k28815N9136e1324q6833r6633Q771k36647A06355
9476E4641a03793q2052o7809P8636E4821f4451j35157Q3485o587B19472e6724
$$ plain form
9464 -14947 23553 -232450 -338324 44048 11348 198915 -19646 -157560 -62298 -320500 -328699
9453 -328699 -172084 -216816 -371847 66446 206347 88180 8247 18685 -133594 -165104 -59984
9441 17528 274371 331610 179403 -135110 -266684 -329826 -299468 -122961 195050 -156942
9430 -302927 264609 -113563 56252 -126662 -113444 -21091 -101876 -34412 13200 -24490 -95257
9419 -95257 36821 -235866 -19978 -14172 -54894 -376774 -107132 -52529 -182748 -124849 -198695
9408 -198695 32666 -333885 -138832 325728 160149 -55301 62083 52060 134955 26812 -131868
9396 -119837 7829 -19743 -117339 -198060 -127839 -133160 -443760 -215205 222367 74945 -47430
9384 -26729 -81301 -160541 -295552 -126955 82949 18467 209502 -119068 19236 -243795 -259901
$$ packed form
9464a4947B3553b32450j05874D4048A1348J87567a9646j37914f2298k58202q199
9453c28699J56615m4732j55031F6446J39901H8180H247J0438a33594l1510e9984
9441A7528K56843N7239j52207a35110j31574o3142L0358a22961A95050a56942
9430c02927B64609a13563E6252a26662J3218b1091q0785c4412A3200b4490p0767
9419i5257C6821b35866a9978N806m0722l21880a07132e2529j30219N7899p3846
9408a98695C2666c33885a38832C25728A60149e5301F2083j0023Q2895B6812a31868
9396a19837G829a9743r7596q0721P0221n321l10600b15205B22367G4945d7430
9384b6729n4572p9240j35011a26955H2949A8467J91035a19068A9236b43795j6106
$$ plain form
9373 -259901 361153 -175846 47864 309472 -71371 24092 -14456 -225871 -152169 -82214 -167972
9362 -167972 -246800 -107285 18806 -38343 -297075 -53090 -215380 -71156 -253115 -122428 269024
9350 117220 -71425 394964 238816 74217 -39338 -178427 -175365 8624 -136915 -33022 283904
9338 -93039 -113332 211601 282480 -242618 -173948 73919 -83071 -317929 -163983 247149 -64025
9326 20896 45126 -100048 12000 23394 -56432 -92390 -324290 -182952 -21631 207992 -118187
9314 -10583 6873 -151467 -124067 -165859 -61977 -90065 197422 -207226 -199902 -278854 -226518 -104362
9301 -194659 194526 155788 145192 -3149 -26688 102340 -229672 -154747 114781 10071 152581
9290 152581 -147338 -258977 6401 -250675 -102652 -200853 -285766 81869 214135 87212 198620
$$ packed form
9373b59901C61153a75846D7864K61608g1371B4092a4456k11415P3702O9955q5758
9362a67972p8828a07285A8806c8343k58732e3090j62290g1156j81959a22428B69024
9350A17220g1425C94964j56148G4217c9338j39089L062H624a36915c3022B83904
9338i3039k0293B11601P0879b42618O8670G3919h3071k34858J53946B47149f4025
9326B0896K4230a00048A2000J1394e6432l5958k31900J41338b1631B07992a18187
9314a0583F873a51467K7400m1792f1977k8088A97422b07226P324p8952N2336a04362
9301a94659A94526l8738j0596c149k3539A02340b29672P4925A14781A0071J42510
9290A52581a47338j11639F401b50675a02652r8201q4913H1869J32266H7212J11408
$$ plain form
9279 198620 -157852 -336337 -144029 387140 -32445 -161892 -243175 90025 -120973 756 7968
9268 7968 -89203 -229518 177697 2870 68352 -348574 142882 -34737 -226565 -409183 -170480
9256 53090 131288 -161002 -260196 -199453 -124208 73116 -43021 -230135 82831 -247876 111665
9244 -8773 -119966 69035 86027 -76236 -372310 -331574 -223269 -61623 -9854 32083 -40968 75480
9231 -55242 -145742 124595 172990 -252229 16602 198296 -131304 -251665 -99359 75502 183818
9220 183818 -49553 -144923 -70048 157311 13256 9283 -43226 297497 -36079 146840 174448
9209 174448 -248659 82032 -216349 9000 186294 58246 22694 -293632 -7052 -98302 218098
9197 -46697 44838 122896 -58071 -22314 -105249 237286 -154907 -207341 -39607 -10423 173675
$$ packed form
9279A98620a57852j78485a44029C87140c2445j29447q1283I0025a20973G56P212
9268G968h9203j40315A77697B870O5482c48574A42882c4737j91828j82618a70480
9256E3090P8198a61002r9194O0743P5245G3116d3021j87114H2831b47876A11665
9244h773j11193F9035J6992g6236k96074M0736J08305f1623i854C2083d0968G5480
9231e5242r0500A24595M8395b52229A6602J81694a31304j20361i9359G5502J08316
9220A83818d9553r5370g0048A57311A3256l973d3226B97497c6079A46840K7608
9209A74448b48659H2032b16349I000J77294E8246B2694b93632g052r1250B18098
9197d6697D4838P8058e8071b2314q2935B37286a54907n2434c9607a0423A73675
$$ plain form
9185 -209287 -92334 -29175 35371 -352253 65119 60222 35907 135305 -123735 252080 -44566
9173 -159292 -71959 -20213 -124746 -58146 106321 -211909 158687 -216646 238657 -150647
9162 -196974 -291202 66860 -160461 265135 -117424 -415240 199059 158461 -165124 -153497
9152 -153497 -51106 -55206 54697 -342036 -28030 -45785 45100 207599 19586 -90524 -273797
9141 -273797 17418 -83304 -86206 -41885 184070 -270713 -166996 -262660 69344 -282780 239353
9129 -79376 -198005 122370 64586 -42690 125464 -137934 62387 -405517 -219770 -310464 -194553
9118 -194553 -60548 -369496 189823 49657 -298267 -59416 -108260 -82165 -114878 48190 5905
9106 -10507 84749 -136194 51864 -123633 179508 311900 -407984 50051 -281289 -255624 -89724
$$ packed form
9185b09287i2334b9175C5371c52253F5119m897k4315R9398a23735B52080d4566
9173a59292g1959b0213j04533e8146A06321b11909A58687b16646B38657a50647
9162a96974r4228F6860a60461B65135a17424k97816A99059m0598a65124J1627
9152a53497e1106m100E4697c42036b8030j7755D5100J62499A9586i0524j83273
9141b73797A7418h3304k902d1885A84070b70713J03717r5664F9344b82780B39353
9129g9376j18629A22370n7784d2690A25464a37934F2387d05517J85747r0694J15911
9118a94553f0548l08948A89823D9657b98267e9416m8844K6095l2713D8190E905
9106a0507H4749a36194E1864a23633A79508J32392d07984E0051b81289K5665h9724
$$ plain form
9094 77516 -159430 191727 -69116 -318058 -63091 -312491 -294229 -252374 -8585 104427 3169
9082 146255 89868 -112811 -12186 48948 -8295 -130829 21055 34141 45222 27509 279586
9071 279586 59009 -73407 -188284 -271028 67017 -185946 90659 -66074 122918 -109397 -234229
9060 -234229 -84335 -322091 781 154019 -36008 -159420 297003 -258087 -332342 133480 -83290
9048 255288 20529 23392 20501 171784 42966 -152340 35716 200928 9223 -48847 165782
9036 -69361 173300 -163303 -307532 18662 375830 -23758 -371848 -212888 137211 126751
9026 126751 -495666 31202 -20557 93490 27124 192226 -284859 -269791 201037 97045 -30097
9014 -17372 -55028 -448197 -262046 -10109 -253420 -169478 -403602 -28711 -86399 77254 -184435
$$ packed form
9094G7516a59430A91727f9116k48942f3091k49400J8262M1855h585A04427C169
9082A46255n6387a12811a2186D8948h295j22534B1055J3086J1081j7713K52077
9071B79586E9009g3407j14877q2744F7017a85946I0659f6074A22918a09397j24832
9060b34229h4335k37756G81J53238c6008j23412B97003b58087p4255A33480h3290
9048B55288B0529K863k891J51283D2966a52340C5716J65212I223d8847A65782
9036f9361A73300a63303j44229A8662L57168b3758l48090J58960A37211j0460
9026A26751d95666C1202b0557I3490B7124J65102b84859J5068B01037I7045c0097
9014a7372l7656l93169J86151a0109k43311Q3942k34124b8711n7688G7254a84435
$$ plain form
9002 -158603 84182 -203554 237824 -130903 -334518 199945 -38228 44743 -142574 -254734
8992 -254734 394591 -105650 161374 -44897 186922 -239507 345120 -195983 -157342 -210098
8982 -210098 141005 -86695 -326081 -98119 -34847 3069 174793 -107066 -269481 142250 47547
8970 -267544 -97376 54843 60176 106450 108216 154229 -133851 -174400 -74 183743 -189004 -265124
8958 -265124 -223123 -194761 171203 -194707 266346 -20330 -46543 -30800 -209837 -178908 116604
8946 -101509 -80162 -250095 -62751 -125185 250902 86356 -135998 -120322 3216 -73052 74787
8934 -105159 -35898 5007 -398338 109315 78758 -191628 53406 11240 240795 121588 328566
8923 328566 190385 1189029 1630571 518040 195699 -250951 142693 -22902 -257097 -71078
$$ packed form
9002a58603H4182b03554B37824a30903k03615A99945c8228D4743a42574j12160
8992b54734C94591a05650A61374d4897A86922b39507C45120a95983L8641n2756
8982b10098A41005h6695k39386i8119c4847C069J71724a07066j62415A42250D7547
8970b67544i7376E4843N333M6274J766M6013a33851m0549g4A83743a89004p6120
8958b65124M2001K8362A71203a94707B66346b0330k6213J5743j79037L0929A16604
8946a01509K1347j69933f2751o2434B50902H6356a35998J5676C216g3052G4787
8934a05159c5898E007c98338A09315l0557a91628E3406A1240K29555j19207K06978
8923C28566j38181R98644M41542E18040A95699b50951A42693b2902k34195g1078
$$ plain form
8912 -189832 6139 124224 -32648 -235998 220308 273735 216282 -242451 115084 -42014 -380713
8901 -380713 119694 -298389 143417 5992 265388 134340 -211307 -258433 -196483 -50196 -78918
8890 -78918 -44732 176311 -228729 -93272 -277906 -110257 35589 -282850 -120160 59500 242591
8879 242591 -293197 -335031 217938 -323419 -467304 285942 179077 -249387 181296 -233089
$$ packed form
8912a89832F139J18085c2648k03350B20308N3427n7453b42451A15084d2014l38699
8901c80713A19694b98389A43417E992K59396j31048b11307m7126O1950e0196k8722
8890g8918L4186A76311b28729i3272j84634a10257C5589b82850a20160E9500J83091
8879B42591b93197m1834B17938c23419j43885B85942j06865b49387A81296b33089
$$ [...]
##END NTUPLES=NMR SPECTRUM
##END=
