##TITLE=AC1445_MSMAH13254_7819446_XAmqYB4Ni6
##JCAMPDX= 6.0         $$ Bruker NMR JCAMP-DX V2.0
##DATA TYPE= NMR SPECTRUM
##DATA CLASS= NTUPLES
##ORIGIN= BRUKER
##OWNER= Administrator
$$ 1.72 TOPSPIN		Version 2.1
$$ 2013-05-01 00:48:29.946 -0700  Administrator@X
$$ Compression mode = diff/dup
##.OBSERVE FREQUENCY= 400.02188249412
##.OBSERVE NUCLEUS= ^1H
##.ACQUISITION MODE= SIMULTANEOUS (DQD)
##.ACQUISITION SCHEME= undefined
##.AVERAGES= 64
##.DIGITISER RES= 22
##SPECTROMETER/DATA SYSTEM= spect
##.PULSE SEQUENCE= noesygpps1d.comp
##.SOLVENT NAME= COFFEE_meoh
##.SHIFT REFERENCE= INTERNAL, COFFEE_meoh, 1, 14.96095
##AUDIT TRAIL= $$ (NUMBER, WHEN, WHO, WHERE, PROCESS, VERSION, WHAT)
$$ ##TITLE= Audit trail, TOPSPIN		Version 2.1
$$ ##JCAMPDX= 5.01
$$ ##ORIGIN= Bruker BioSpin GmbH
$$ ##OWNER= Administrator
$$ $$ E:\/data/COFFEE/nmr/AC1445_MSMAH13254_7819446_XAmqYB4Ni6/12/pdata/1/auditp.txt
$$ ##AUDIT TRAIL=  $$ (NUMBER, WHEN, WHO, WHERE, PROCESS, VERSION, WHAT)
(   1,<2013-05-01 00:48:24.946 -0700>,<Administrator>,<X>,<go>,<TOPSPIN 2.1>,
      <created by zg
	started at 2013-05-01 00:36:55.289 -0700,
	POWCHK enabled, PULCHK disabled,
       configuration hash MD5:
       F7 49 AB AC A2 8D 51 76 73 8D C1 9A A6 38 9F DE
       data hash MD5: 64K
       99 F0 9C 7D 05 9E 87 7B BC 91 50 12 91 B2 77 46>)
(   2,<2013-05-01 00:48:27.961 -0700>,<Administrator>,<X>,<proc1d>,<TOPSPIN 2.1>,
      <Start of raw data processing
       efp LB = 0.3 FT_mod = 6 PKNL = 1 PHC0 = 0 PHC1 = 0 SI = 128K 
       data hash MD5: 128K
       7C 42 D8 03 76 65 53 1D CA 9B 0C B2 72 8B 95 C9>)
(   3,<2013-05-01 00:48:28.961 -0700>,<Administrator>,<X>,<proc1d>,<TOPSPIN 2.1>,
      <pk PHC0 = -79.15649 PHC1 = 0 
       data hash MD5: 128K
       E1 B0 26 08 41 85 E3 B6 11 CC 0A DF 6E F7 73 B0>)
(   4,<2013-05-01 00:48:29.352 -0700>,<Administrator>,<X>,<proc1d>,<TOPSPIN 2.1>,
      <abs ABSG = 1 
       data hash MD5: 128K
       26 A4 F6 AF 9E 38 62 7B FB AC 5C 66 2F 5B EB BE>)
(   5,<2013-05-01 00:48:29.477 -0700>,<Administrator>,<X>,<proc1d>,<TOPSPIN 2.1>,
      <abs ABSG = 2 
       data hash MD5: 128K
       FB B2 8F 46 16 72 AE 68 0E 72 5D D5 A0 36 2B FF>)
(   6,<2013-05-01 00:48:29.571 -0700>,<Administrator>,<X>,<proc1d>,<TOPSPIN 2.1>,
      <abs ABSG = 3 
       data hash MD5: 128K
       FF 8F 0C 64 BD C1 71 4E 7C 0A F4 BE 5A 9E 36 7B>)
(   7,<2013-05-01 00:48:29.664 -0700>,<Administrator>,<X>,<proc1d>,<TOPSPIN 2.1>,
      <abs ABSG = 4 
       data hash MD5: 128K
       FF 41 01 2B AA F4 77 D6 7B BC 0F 6C A7 3B D7 30>)
(   8,<2013-05-01 00:48:29.758 -0700>,<Administrator>,<X>,<proc1d>,<TOPSPIN 2.1>,
      <abs ABSG = 5 
       data hash MD5: 128K
       98 44 2E CC AA 8F 6D 05 AE 30 04 FD 5A 3B 4D F7>)
$$ ##END=
$$ 
$$ $$ hash MD5
$$ $$ 3C D3 37 10 78 FC F4 1E A1 CE 9B A8 F1 63 EA 3A
##$RELAX= 
##$RELAX= 
##$RELAX= 
##$RELAX= 
##$RELAX= 
##$RELAX= 
##$RELAX= 
##$RELAX= 
$$ Bruker specific parameters
$$ --------------------------
##$DU= <E:\>
##$EXPNO= 12
$$ [...]
##$TP07= 0
##$TPNAME0= <>
##$TPNAME1= <>
##$TPNAME2= <>
##$TPNAME3= <>
##$TPNAME4= <>
##$TPNAME5= <>
##$TPNAME6= <>
##$TPNAME7= <>
##$TPOAL= (0..7)
0.5 0.5 0.5 0.5 0.5 0.5 0.5 0.5
##$TPOFFS= (0..7)
0 0 0 0 0 0 0 0
##$TUNHIN= 0
##$TUNHOUT= 0
##$TUNXOUT= 0
##$USERA1= <user>
##$USERA2= <user>
##$USERA3= <user>
##$USERA4= <user>
##$USERA5= <user>
##$V9= 5
##$VALIST= <valist>
##$VCLIST= <CCCCCCCCCCCCCCC>
##$VD= 0
##$VDLIST= <DDDDDDDDDDDDDDD>
##$VPLIST= <PPPPPPPPPPPPPPP>
##$VTLIST= <TTTTTTTTTTTTTTT>
##$WBST= 1024
##$WBSW= 4
##$XGAIN= (0..3)
0 0 0 0
##$XL= 0
##$YL= 0
##$YMAX_a= 6229858
##$YMIN_a= -13012845
##$ZGOPTNS= <>
##$ZL1= 120
##$ZL2= 120
##$ZL3= 120
##$ZL4= 120
##$ABSF1= 14.96095
##$ABSF2= -5.597232
##$ABSG= 5
##$ABSL= 3
##$ALPHA= 0
##$AQORDER= 0
##$ASSFAC= 0
##$ASSFACI= 0
##$ASSFACX= 0
##$ASSWID= 0
##$AUNMP= <proc_prof1d_extract.lims>
##$AXLEFT= 0
##$AXNAME= <>
##$AXNUC= <1H>
##$AXRIGHT= 0
##$AXTYPE= 0
##$AXUNIT= <>
##$AZFE= 0.1
##$AZFW= 0.1
##$BCFW= 0
##$BC_mod= 0
##$BYTORDP= 0
##$COROFFS= 0
##$CY= 15
##$DATMOD= 1
##$DC= 0
##$DFILT= <>
##$DTYPP= 0
##$F1P= 0
##$F2P= 0
##$FCOR= 0.5
##$FTSIZE= 131072
##$FT_mod= 6
##$GAMMA= 0
##$GB= 0
##$INTBC= 1
##$INTSCL= 1
##$ISEN= 128
##$LB= 0.3
##$LEV0= 0
##$LPBIN= 0
##$MAXI= 10000
##$MC2= 0
##$MEAN= 0
##$ME_mod= 0
##$MI= 0
##$NCOEF= 0
##$NC_proc= -2
##$NLEV= 6
##$NOISF1= 0
##$NOISF2= 0
##$NSP= 0
##$NTH_PI= 0
##$NZP= 0
##$OFFSET= 14.96095
##$PC= 1
##$PHC0= -79.15649
##$PHC1= 0
##$PH_mod= 1
##$PKNL= yes
##$PPARMOD= 0
##$PPDIAG= 0
##$PPIPTYP= 0
##$PPMPNUM= 2147483647
##$PPRESOL= 1
##$PSCAL= 4
##$PSIGN= 0
##$PYNMP= <proc.py>
##$REVERSE= no
##$SF= 400.020009658792
##$SI= 131072
##$SIGF1= 0
##$SIGF2= 0
##$SINO= 400
##$SIOLD= 131072
##$SPECTYP= <>
##$SREGLST= <1H.CDCl3>
##$SSB= 0
##$STSI= 131072
##$STSR= 0
##$SW_p= 8223.68421052631
##$SYMM= 0
##$S_DEV= 0
##$TDeff= 65536
##$TDoff= 0
##$TI= <>
##$TILT= no
##$TM1= 0
##$TM2= 0
##$TOPLEV= 0
##$USERP1= <user>
##$USERP2= <user>
##$USERP3= <user>
##$USERP4= <user>
##$USERP5= <user>
##$WDW= 1
##$XDIM= 131072
##$YMAX_p= 447723820
##$YMIN_p= -13546
##$CURPLOT= <Network HP LaserJet P1505>
##$CURPRIN= <$Network HP LaserJet P1505>
##$DFORMAT= <normdp>
##$LAYOUT= <+/1D_H.xwp>
##$LFORMAT= <normlp>
##$PFORMAT= <normpl>
##$SURQMSG= 1
$$ End of Bruker specific parameters
$$ ---------------------------------
##NTUPLES= NMR SPECTRUM
##VAR_NAME=  FREQUENCY,     SPECTRUM/REAL,   SPECTRUM/IMAG
##SYMBOL=    X,             R,               I
##VAR_TYPE=  INDEPENDENT,   DEPENDENT,       DEPENDENT
##VAR_FORM=  AFFN,          ASDF,            ASDF
##VAR_DIM=   131072,        131072,          131072
##UNITS=     HZ,            ARBITRARY UNITS, ARBITRARY UNITS
##FACTOR=    0.0627417313425164, 1,          1
##FIRST=     8223.62146879497, 3325,         -54739
##LAST=      0,             3891,            -54358
##MIN=       0,             -13546,          0
##MAX=       8223.62146879497, 447723820,    0
$$ Real data points
##PAGE= N=1
##DATA TABLE= (X++(R..R)), XYDATA
$$ [...]
63869F14293J2332J3626J5516J8112K0705K2513K3404K3872K4432K5128K5602
63858H39535K5641K5467K5230K4432K2255J8652J4545J0783P327L780K78k818
63846A015107n757r200j3114j6601j9075k1085k3548k6456k8930l0452l1488l2626
63834G56775l3546l3405l2139l0767l0055k9452k7892k5319k2712k0716j8970
63823D51802j7002j5063j3677j2816j1989j0885r613q505p880p721p473o530n120
63810C17528m149l942l757l006k275k419l125l344k861k499k724l025k865k484
63796B75053k332k372k366k369k502k605k537k588l075l718l842l205k263j589
63782B37690j309j218j225j432j803k003j648p86M4L00Pl07k36L3K9k97l80L07
$$ y = [614293, 626625, 640251, 655767, 673879, 694584, 717097, 740501, 764373, 788805, 813933, 839535, 865176, 890643, 915873, 940305, 962560, 981212, 995757, 1006540, 1013867, 1017647, 1017925, 1015107, 1009350, 1000150, 987036, 970435, 951360, 930275, 906727, 880271, 851341, 820889, 789401, 756775, 723229, 689824, 657685, 626918, 596863, 567411, 539519, 514200, 491488, 470772, 451802, 434800, 419737, 406060, 393244, 381255, 370370, 360757, 352252, 344372, 336651, 329178, 322648, 317528, 313379, 309437, 305680, 302674, 300399, 297980, 294855, 291511, 288650, 286151, 283427, 280402, 277537, 275053, 272721, 270349, 267983, 265614, 263112, 260507, 257970, 255382, 252307, 248589, 244747, 241542, 239279, 237690, 236381, 235163, 233938, 232506, 230703, 228700, 227052, 226266, 226310, 226610, 226617, 226310, 226074, 226107, 226136, 225839, 225459, 225766]
63764B25766J480K203J873Q21j35n51n37l19k3J87J36p2q0K39O11P37O74O37O51
63745B34298N88M49M76R09J652K209K114J544J239J637K303K589K570K758L081
63730B60416K877K030J349J592K588L647M317M497M300M143M502N216N541N149
63716C12164M560M243L853K910J600L86p57k035l240m016m364m313l516j961o16
63701C04898m61j188j657j449j029n78K74J551K724L500L985L975L150K093J959
63686C21747K774L178K429J504J380J365L45j071j211J29J313J243P30R90J801
63671C38646K061J508R48R87J308J290Q20L76M82J136J577Q48j125l216m291m505
63655C38850m876n679o095n574m698m228m047l653l087k571j758l56Q87R66K72
$$ y = [225766, 227246, 229449, 231322, 232143, 232008, 231457, 230920, 230601, 230578, 230765, 230901, 230829, 230749, 230988, 231599, 232336, 233010, 233647, 234298, 234886, 235335, 235811, 236720, 238372, 240581, 242695, 244239, 245478, 247115, 249418, 252007, 254577, 257335, 260416, 263293, 265323, 266672, 268264, 270852, 274499, 278816, 283313, 287613, 291756, 296258, 301474, 307015, 312164, 316724, 320967, 324820, 327730, 329330, 329716, 328959, 326924, 323684, 319668, 315304, 310991, 307475, 305514, 304898, 304437, 303249, 301592, 300143, 299114, 298536, 298810, 300361, 303085, 306585, 310570, 314545, 317695, 319788, 321747, 324521, 327699, 330128, 331632, 333012, 334377, 334722, 333651, 332440, 332569, 333882, 335125, 335855, 336845, 338646, 340707, 342215, 343163, 344150, 345458, 346748, 347568, 347944, 348426, 349562, 351139, 351987, 350862, 347646, 343355, 338850, 333974, 328295, 322200, 316626, 311928, 307700, 303653, 300000, 296913, 294342, 292584, 292228, 293115, 294081, 294353]
63640B94353K79J438K560K663K344K691L731M726N351N776O070O228O399O588
63626C51197O498O181O344P418Q864R916J0594J1332J2225J3287J4924J7279J9626
63613D95685K1283K2717K4852K7637L0279L2561L4844L6990L8363L8767L8285
63602H42263L6289L1854K5250J7879J0652L570k881p328r110r246r120r075q900
63589I12097q891r711j1740j5088j9544k4126k7431k9055k9895l0530l0172k8045
63577F47869k4950k2310k0165j7342j3436r520o808n436m705l821k230J05K535
63564E19786M230N029N460N997O671P427Q340R392J0455J1626J3237J5402J7880
63551F40932K0469K3263K6315K9449L2617L6237M0713M5629M9553N0735M7911
$$ y = [294353, 294632, 296070, 298630, 301293, 303637, 306328, 310059, 314785, 320136, 325912, 331982, 338210, 344609, 351197, 357695, 363876, 370220, 377638, 386502, 396418, 407012, 418344, 430569, 443856, 458780, 476059, 495685, 516968, 539685, 564537, 592174, 622453, 655014, 689858, 726848, 765211, 803978, 842263, 878552, 910406, 935656, 953535, 964187, 967757, 964876, 957548, 948438, 939192, 930072, 920997, 912097, 903206, 893495, 881755, 866667, 847123, 822997, 795566, 766511, 736616, 706086, 675914, 647869, 622919, 600609, 580444, 563102, 549666, 540146, 533338, 527902, 523197, 519376, 517146, 517251, 519786, 524016, 529045, 534505, 540502, 547173, 554600, 562940, 572332, 582787, 594413, 607650, 623052, 640932, 661401, 684664, 710979, 740428, 773045, 809282, 849995, 895624, 945177, 995912, 1043823]
63540A043823M0694K9630J6312L177p345j3955j6854j7014j5321j2524r586p517
63528A033520o805p403r386j3188j8937k5689l1764l5968l8365l9764m0551m0321
63516G25379l8724l6285l3892l1662k8920k5467k2060j9326j6886j4219j1788
63505D46150j0408r904r269q129p102o676o518o128n451m647l783k997k443j987
63491C60708j421r76j031j291j004q2P36J010J106J379J654J845K280L025L586
63476C71524L775M055M568M577L531K032R88M26j59q74j606k590l873m696m342
63461C77336l369k951l184l024j875l46P08J111J123J054J280K062L125L985M819
63446C81854O310Q406R992J0275R906J0025J0738J1298J1653J2822J5508J9081
$$ y = [1043823, 1084517, 1114147, 1130459, 1133636, 1126291, 1112336, 1095482, 1078468, 1063147, 1050623, 1041037, 1033520, 1026715, 1019312, 1009926, 996738, 977801, 952112, 920348, 884380, 846015, 806251, 765700, 725379, 686655, 650370, 616478, 584816, 555896, 530429, 508369, 489043, 472157, 457938, 446150, 435742, 425838, 416569, 408440, 401338, 394662, 388144, 382016, 376565, 371918, 368135, 365138, 362695, 360708, 359287, 358311, 357280, 355989, 354985, 354903, 355639, 356649, 357755, 359134, 360788, 362633, 364913, 367938, 371524, 375299, 379354, 383922, 388499, 392030, 394062, 395050, 395476, 395317, 394443, 392837, 390247, 386374, 381678, 377336, 373967, 371016, 367832, 364808, 362933, 362587, 363295, 364406, 365529, 366583, 367863, 369925, 373050, 377035, 381854, 388164, 396570, 406562, 416837, 426743, 436768, 447506, 458804, 470457, 483279, 498787, 517868]
63434E17868K2515K5857K9912L4454L7520L6967L2432K5482J8214J2119P939N805
63422H07084N422O630R755J4943K1224K7004L1659L5903M0247M3775M5007M3389
63410A132042L9261L2811K4052J3749L617m708j0532j3818j4652j3357j0988r200
63398A168277r327j1617j5510k0526k6487l2776l8041m1158m2255m2201m1374
63387H47005l9602l7114l4584l2213k9572k6516k3421k0337j6845j3120j0136
63376E63545q297o703m452j845M01K359M510O769Q853J1047J3722J6454J8503
63363F24866J9897K1260K2929K4990K7757L1286L4781L7441L9663M2381M5336
63352I72587M7016M6296M3135L7749L0209K1137J1890L530l723r696j3596j4670
$$ y = [517868, 540383, 566240, 596152, 630606, 668126, 705093, 737525, 763007, 781221, 793340, 801279, 807084, 812506, 819136, 828891, 843834, 865058, 892062, 923721, 959624, 999871, 1043646, 1088653, 1132042, 1171303, 1204114, 1228166, 1241915, 1245532, 1240824, 1230292, 1216474, 1201822, 1188465, 1177477, 1168277, 1158950, 1147333, 1131823, 1111297, 1084810, 1052034, 1013993, 972835, 930580, 888379, 847005, 807403, 770289, 735705, 703492, 673920, 647404, 623983, 603646, 586801, 573681, 563545, 555248, 548545, 544093, 542248, 542649, 545008, 549518, 556287, 565140, 576187, 589909, 606363, 624866, 644763, 666023, 688952, 713942, 741699, 772985, 807766, 845207, 884870, 927251, 972587, 1019603, 1065899, 1109034, 1146783, 1176992, 1198129, 1210019, 1213549, 1209826, 1200130, 1186534, 1171864]
63340A171864j3294j1050r756j0332j2471j5436j9235k4410l0528l5708l8448
63329I51196l9207l9276l8711l6653l3223k9584k6244k2719j8920j5334j1686
63318F39639p103k312j34k661q821j5588k0709k3496k4069k3086k1603k0131j8159
63305D51767j5353j2585j0885r951q798p371o360n777m924l719k865k616k461
63292C58102k203k342l065l774m027m141m384m346l694k907k606k590k257j624
63278C14142j268j324j244n90M09J179J322P80j59r06r55l57M15J033J536J942
63262C15955K060J877J755K031K600L100L316L267L151L331M066N042N550N363
63248C62464N053N123N317N299N492O463P851Q848R511J0606J2211J3530J4311
$$ y = [1171864, 1158570, 1147520, 1137764, 1127432, 1114961, 1099525, 1080290, 1055880, 1025352, 989644, 951196, 911989, 872713, 834002, 797349, 764126, 734542, 708298, 685579, 666659, 651325, 639639, 632536, 630224, 630090, 627429, 618608, 603020, 582311, 558815, 534746, 511660, 490057, 469926, 451767, 436414, 423829, 412944, 402993, 394195, 386824, 380464, 374687, 369763, 366044, 363179, 360563, 358102, 355899, 353557, 350492, 346718, 342691, 338550, 334166, 329820, 326126, 323219, 320613, 318023, 315766, 314142, 312874, 311550, 310306, 309716, 310125, 311304, 312626, 313406, 313247, 312341, 311386, 311029, 311444, 312477, 314013, 315955, 318015, 319892, 321647, 323678, 326278, 329378, 332694, 335961, 339112, 342443, 346509, 351551, 357101, 362464, 367517, 372640, 377957, 383256, 388748, 395211, 403062, 411910, 421421, 432027, 444238, 457768, 472079]
63235D72079J5302J6942J8624J9798K0858K2221K3451K4093K4581K5391K5966
63224G09306K5535K4519K4021K4255K4520K4607K5091K6195K7343K8016K8262
63213I91670K8051K6799K3924J9487J4085Q321K386l997j1013j8030k3807k7768
63201A030108l0479l2506l3469l2935l1433k9572k6875k2807j8424j5365j3374
63190G42869j0528o104j608J584L995O704R605J2104J4427J7044J9530K1153K2152
63177H52927K3292K4544K5167K5005K4777K4979K5224K4860K3816K2603K1594
63166A118788K0414J8097J4008Q515K494l717j0314j7051k3101k8038l2296l6185
63154A031614l9193m0728m0967m0395l9044l6845l4245l1758k9167k5924k2234
$$ y = [472079, 487381, 504323, 522947, 542745, 563603, 585824, 609275, 633368, 657949, 683340, 709306, 734841, 759360, 783381, 807636, 832156, 856763, 881854, 908049, 935392, 963408, 991670, 1019721, 1046520, 1070444, 1089931, 1104016, 1112337, 1114723, 1110726, 1099713, 1081683, 1057876, 1030108, 999629, 967123, 933654, 900719, 869286, 839714, 812839, 790032, 771608, 756243, 742869, 732341, 726237, 724629, 726213, 730208, 736912, 746517, 758621, 773048, 790092, 809622, 830775, 852927, 876219, 900763, 925930, 950935, 975712, 1000691, 1025915, 1050775, 1074591, 1097194, 1118788, 1139202, 1157299, 1171307, 1179822, 1182316, 1178599, 1168285, 1151234, 1128133, 1100095, 1067799, 1031614, 992421, 951693, 910726, 870331, 831287, 794442, 760197, 728439, 699272, 673348, 651114]
63143F51114j9007j6765j5110j3476j1859j0612r794q984p733o051m386l102k118
63130E22117j185k95M90J416K739M161N050N297N400N663N785N439M657L617K540
63115E72891J930K211K968L161K422J514J247J550J911K051J798R96nm32j43N5
63099E96125m04r97j051q11q50r82o15K08R28J310J503J533J383J316J483J506
63083F01585J072O26P82J368J841K283L168M309M905M735M516M959O061P402Q580
63068F58192R280R394R305R722J1065J3135J5205J6426J6554J6571J8087K1642
63056H24578K6007K9684L2597L5615L8963M2114M4962M7972N1178N3963N6022
63045A283655N7668N9007N9667N9655N9671O0205O0926O1395O1807O2549O3478
$$ y = [651114, 632107, 615342, 600232, 586756, 574897, 564285, 554491, 545507, 537774, 531723, 527337, 524235, 522117, 520932, 520637, 521127, 522543, 525282, 529443, 534493, 539790, 545190, 550853, 556638, 562077, 566734, 570351, 572891, 574821, 577032, 580000, 583161, 585583, 587097, 588344, 589894, 591805, 593856, 595654, 596650, 596645, 596213, 596070, 596125, 595721, 594724, 593673, 592862, 592012, 591030, 590415, 590623, 591551, 592861, 594364, 595897, 597280, 598596, 600079, 601585, 602657, 603283, 604065, 605433, 607274, 609557, 612725, 617034, 621939, 626674, 631190, 636149, 642210, 649612, 658192, 667472, 676866, 686171, 695893, 706958, 720093, 735298, 751724, 768278, 784849, 802936, 824578, 850585, 880269, 912866, 948481, 987444, 1029558, 1074520, 1122492, 1173670, 1227633, 1283655, 1341323, 1400330, 1459997, 1519652, 1579323, 1639528, 1700454, 1761849, 1823656, 1886205, 1949683]
63034A949683O4085O4098O3400O1614N8244N3208M6829L9191K9809J8147M454
63023B452762j0160k4623l8598n1939o3662p2237p7101p9207p9627p8256p4580
63012A802772o9136o3224n7316n0677m2680l3760k4873j6589q943j756N197J1987
63000A451002J8408K4178K9221L3479L6674L8652L9843M0910M2057M3090M4003
62989A841517M4941M5727M5970M5565M4515M2321L8233L2121K4518J5756N711
62978B226895n516j7300k9016m0305n0733n9782o7351p3636p8347q0671q0321
62967A643917p8013p4607p0336o5260n9899n4911n0411m6126m1987l8237l5079
62956A029051l2517l0455k8840k7742k7230k6991k6306k4829k3176k2186k1683
$$ y = [1949683, 2013768, 2077866, 2141266, 2202880, 2261124, 2314332, 2361161, 2400352, 2430161, 2448308, 2452762, 2442602, 2417979, 2379381, 2327442, 2263780, 2191543, 2114442, 2035235, 1955608, 1877352, 1802772, 1733636, 1670412, 1613096, 1562419, 1519739, 1485979, 1461106, 1444517, 1435574, 1433818, 1439015, 1451002, 1469410, 1493588, 1522809, 1556288, 1592962, 1631614, 1671457, 1712367, 1754424, 1797514, 1841517, 1886458, 1932185, 1978155, 2023720, 2068235, 2110556, 2148789, 2180910, 2205428, 2221184, 2226895, 2221379, 2204079, 2175063, 2134758, 2084025, 2024243, 1956892, 1883256, 1804909, 1724238, 1643917, 1565904, 1491297, 1420961, 1355701, 1295802, 1240891, 1190480, 1144354, 1102367, 1064130, 1029051, 996534, 966079, 937239, 909497, 882267, 855276, 828970, 804141, 780965, 758779, 737096]
62945G37096k0728j9077j7517j6567j5701j4352j2875j1909j1406j0955j0497
62934E75512j0060r251p782o195n272m905m305l255k420k301k527k413j825j215
62920E11786j086j529k097k148j516q27q93j835k998l678l618k968k125j589j635
62905D81244k027k363k635l020l276k879j936j296j398j544q73L39J015P74K84
62890D60409J04r8p33j367j229l23N28P52N19K12j14m68n68p9Q71J732K068J933
62872D64149J674J402Q61p7r43j145r10j082j748j799o10N53J1j785k578j331
62856D54642N36J406J562K054K649K358J331P78J131J607J591J378J274R60J44
62841D75401q28j425j560j463j272j048q74p67o07l01J11M78N79K83j77l17Q3
$$ y = [737096, 716368, 697291, 679774, 663207, 647506, 633154, 620279, 608370, 596964, 586009, 575512, 565452, 556201, 548419, 542224, 536952, 532047, 527742, 524487, 522067, 519766, 517239, 514826, 513001, 511786, 510700, 509171, 507074, 504926, 503410, 502583, 501690, 499855, 496857, 493179, 489561, 486593, 484468, 482879, 481244, 479217, 476854, 474219, 471199, 467923, 465044, 463108, 461812, 460414, 458870, 457997, 458336, 459351, 460125, 460409, 460513, 460415, 459682, 458315, 457086, 456763, 457291, 458043, 458562, 458774, 458660, 458192, 457624, 457545, 458416, 460148, 462216, 464149, 465823, 467225, 468086, 468009, 467066, 465921, 465011, 463929, 462181, 460382, 459772, 460325, 460336, 458551, 455973, 454642, 455178, 456584, 458146, 460200, 462849, 465207, 466538, 467316, 468447, 470054, 471645, 473023, 474297, 475257, 475401, 474573, 473148, 471588, 470125, 468853, 467805, 466931, 466164, 465557, 465256, 465367, 465845, 466424, 466707, 466530, 466213, 466296]
62824D66296Q70J926L221M231M100K859J779J779K198K030J695K381L983N083
62810E04431M934M245L813L546L244L299M081N303O438P244P670P778P951Q610
62796E82587R632J0527J1214J2054J3164J4428J6068J8473K1469K4602K8056L2355
62784G94629L7210M1751M6049N1196N7636O4491P0914P7009Q2936Q8200R2382
62773A504403R5575R7514R7230R4105Q8407Q0365O9735N6844M2851K8273J2400
62762B267702m995k2436l8267n2254o4679p4866q1998q6550q9628r1357r1235
62751A569437q9468q6716q2945p7819p1868o6015o0352n4573m9240m5236m2170
62740H43035l8716l4536l0563k7326k4306k1136j8193j5682j3250j0874r162q318
$$ y = [466296, 467166, 469092, 472313, 476544, 480644, 483503, 485282, 487061, 489259, 491289, 492984, 495365, 499348, 504431, 509365, 513610, 517423, 520969, 524213, 527512, 531593, 536896, 543334, 550578, 558248, 566026, 573977, 582587, 592219, 602746, 613960, 626014, 639178, 653606, 669674, 688147, 709616, 734218, 762274, 794629, 831839, 873590, 919639, 970835, 1028471, 1092962, 1163876, 1240885, 1323821, 1412021, 1504403, 1599978, 1697492, 1794722, 1888827, 1977234, 2057599, 2127334, 2184178, 2227029, 2255302, 2267702, 2262707, 2240271, 2202004, 2149750, 2085071, 2010205, 1928207, 1841657, 1752029, 1660672, 1569437, 1479969, 1393253, 1310308, 1232489, 1160621, 1094606, 1034254, 979681, 930441, 885205, 843035, 804319, 769783, 739220, 711894, 687588, 666452, 648259, 632577, 619327, 608453, 599291, 590973]
62728E90973p654o566n300m294l442k357r25O51K017K792L004L367M575O465Q404
62713E91710J0298J2432J4598J6373J8161K0885K4458K7719L0131L2547L5940
62702H35252M0384M5664N1793N8357O4220O8718P2509P6577Q1003Q5242Q8912
62691A568631R1561R2164Q9819Q4573P6953O6934N4097L8614K1424L557j4156
62680B174171l0872m5885n9008p0304p9505q6129r0125r1907r1724q9472q5366
62669A353874q0376p5571p1179o6572o1247n5538n0195m5434m0822l6143l1948
62658G38849k8839k6570k4291k1575j8729j6204j4221j2936j2370j2063j1401
62647E39650j0431r806r725r507q569p256o214n374m231k800j660r91k54R27J953
$$ y = [590973, 583319, 576753, 571453, 567159, 563717, 561360, 560435, 561086, 563103, 565895, 568899, 572266, 576841, 583306, 591710, 602008, 614440, 629038, 645411, 663572, 684457, 708915, 736634, 766765, 799312, 835252, 875636, 921300, 973093, 1031450, 1095670, 1164388, 1236897, 1313474, 1394477, 1479719, 1568631, 1660192, 1752356, 1842175, 1926748, 2003701, 2070635, 2124732, 2163346, 2184770, 2188327, 2174171, 2143299, 2097414, 2038406, 1968102, 1888597, 1802468, 1712343, 1620436, 1528712, 1439240, 1353874, 1273498, 1197927, 1126748, 1060176, 998929, 943391, 893196, 847762, 806940, 770797, 738849, 710010, 683440, 659149, 637574, 618845, 602641, 588420, 575484, 563114, 551051, 539650, 529219, 519413, 509688, 500181, 491612, 484356, 478142, 472768, 468537, 465737, 464077, 463086, 462832, 463759, 465712]
62632D65712J788K62j565k515k576k614k949k855j806n08Rj57r4L89N86L02L88
62615D51797J466K972M061M713N437O354P203P857Q280Q399Q422Q943J0203J1666
62601E47773J2792J3917J5784J8567K1890K5510K9336L3057L6427L9647M2846
62590H37546M5338M6272M5918M5418M5079M3682L9870L3613K5873J7348Q107j756
62578A232308j1589k0403k7470l2757l6779l9933m1992m2504m1665m0460l9701
62567H57055l9209l8141l6035l3242l0450k7923k5315k2172j8609j5344j3007
62556E57608j1490j0153q643p254o475o345o434o296n846n262m617l708k386r67
62542D71732r5m8l68m04rN04R46J409J904K158J896J205N42N22J542L385N292
$$ y = [465712, 467500, 467762, 466197, 463682, 461106, 458492, 455543, 452688, 450882, 450374, 450383, 450226, 450132, 450521, 451107, 451409, 451797, 453263, 456235, 460296, 465009, 470446, 476800, 484003, 491860, 500140, 508539, 516961, 525904, 536107, 547773, 560565, 574482, 590266, 608833, 630723, 656233, 685569, 718626, 755053, 794700, 837546, 882884, 929156, 975074, 1020492, 1065571, 1109253, 1149123, 1182736, 1208609, 1225957, 1234064, 1232308, 1220719, 1200316, 1172846, 1140089, 1103310, 1063377, 1021385, 978881, 937216, 896756, 857055, 817846, 779705, 743670, 710428, 679978, 652055, 626740, 604568, 585959, 570615, 557608, 546118, 535965, 527322, 520068, 513593, 507248, 500814, 494518, 488672, 483410, 478793, 475085, 472699, 471732, 471637, 471589, 471221, 470817, 470808, 471312, 472258, 473667, 475571, 477729, 479625, 480830, 481372, 481894, 483436, 486821, 492113]
62525D92113O692P825R368J1495J3775J5921J8232K1062K4267K7447L0516L3753
62513G12466L7421M1470M5498M8955N1514N3258N4320N4364N2827M9656M5357
62502A247106M0174L3765K5928J7102P865j495j0355j7340k1388k2946k3262k2622
62490A252532k0191j5617r824l857K212Q739J5466K1733K7275L2273L6863M0992
62478A388596M4409M6142M4367L7738K7114J5357N061l372j1409k0643l1525m3188
62466A498647n3949o2086o6805o8720o9216o9117o8078o5400o1168n6242n1281
62455H06585m6200m0809l5423l0487k5945k1533j7474j4232j1734r427p134n159
62443E41028l477j616M77K247L535M913O547P589P434O766O428N896M086J204
$$ y = [492113, 498805, 506630, 515998, 527493, 541268, 557189, 575421, 596483, 620750, 648197, 678713, 712466, 749887, 791357, 836855, 885810, 937324, 990582, 1044902, 1099266, 1152093, 1201749, 1247106, 1287280, 1321045, 1346973, 1364075, 1371940, 1370445, 1360090, 1342750, 1321362, 1298416, 1275154, 1252532, 1232341, 1216724, 1206900, 1203043, 1205255, 1213994, 1229460, 1251193, 1278468, 1310741, 1347604, 1388596, 1433005, 1479147, 1523514, 1561252, 1588366, 1603723, 1608784, 1605412, 1594003, 1573360, 1541835, 1498647, 1444698, 1382612, 1315807, 1247087, 1177871, 1108754, 1040676, 975276, 914108, 857866, 806585, 760385, 719576, 684153, 653666, 627721, 606188, 588714, 574482, 562748, 553321, 546187, 541028, 537551, 535935, 536412, 538659, 542194, 547107, 553654, 561243, 568677, 575443, 581871, 587767, 591853, 593057]
62429E93057j414l188m822o826q673r657r732r200q358p708p668p883p622o983
62415D93323o805p149o991n892m816m616m699m137l208k835l035l063k732k494
62401D30851k386j860p22N27J347J586J345J008J235K292L417L562K749K036K054
62386D49041K286K037J539J672K843M519N797O288O383O664P144P312O963O621
62372E17109O907P823Q933R995J1096J2362J3835J5504J7265J9128K1546K5092
62360F86595K9652L4443L9113M4157M9860N5538O0465O4826O8868P1696P1856
62349A277069O8778O2797N4132M3085L0963J9634R908J317o531j3440j9621k6063
62337A502028l3316m0606m6657n0863n3271n3969n2977n0426m6583m1949l7363
$$ y = [593057, 591643, 588455, 583633, 576807, 568134, 558477, 548745, 539545, 531187, 523479, 515811, 507928, 500306, 493323, 486518, 479369, 472378, 466486, 461670, 457054, 452355, 448218, 445010, 442175, 439140, 436077, 433345, 430851, 428465, 426605, 425883, 426410, 427757, 429343, 430688, 431696, 432931, 435223, 438640, 442202, 444951, 446987, 449041, 451327, 453364, 454903, 456575, 459418, 463937, 469734, 476022, 482405, 489069, 496213, 503525, 510488, 517109, 524016, 531839, 540772, 550767, 561863, 574225, 588060, 603564, 620829, 639957, 661503, 686595, 716247, 750690, 789803, 833960, 883820, 939358, 999823, 1064649, 1133517, 1205213, 1277069, 1345847, 1408644, 1462776, 1505861, 1536824, 1556458, 1566366, 1567683, 1561152, 1547712, 1528091, 1502028, 1468712, 1428106, 1381449, 1330586, 1277315, 1223346, 1170369, 1119943, 1073360, 1031411, 994048]
62326I94048l3581l0639k7989k5351k3018k1369k0591k0758k1659k2555k2734
62315G23804k2266k1672k0949j9647j7866j6301j5203j4050j2459j0673r027p609
62303E36082o552n951n429m551l633l236k909j605M92J862J715R61O19O04O99
62288E09168J392K740L570L037K065K095L144M184M770N034M755L770K913L180
62274E55817M208M770M592M485M839N226N611O706Q835J1442J4017J6707J9744
62261F66999K3024K6509L0408L4758L9441M4678N0831N7528O3718O8745P2621
62250A179260P4991P4652P0650O3406N4266M4239L3526K2117J0477l45r419j6936
62238A600884k4246l2485m1239m9030n4974n9217o1820o2213o0132n6399n2197
$$ y = [994048, 960467, 929828, 901839, 876488, 853470, 832101, 811510, 790752, 769093, 746538, 723804, 701538, 679866, 658917, 639270, 621404, 605103, 589900, 575850, 563391, 552718, 543691, 536082, 529530, 523579, 518150, 513599, 509966, 506730, 503821, 502216, 502708, 504570, 506285, 507246, 507865, 508469, 509168, 510560, 513300, 516870, 519907, 521972, 524067, 527211, 531395, 536165, 541199, 545954, 549724, 552637, 555817, 560025, 564795, 569387, 573872, 578711, 583937, 589548, 596254, 605089, 616531, 630548, 647255, 666999, 690023, 716532, 746940, 781698, 821139, 865817, 916648, 974176, 1037894, 1106639, 1179260, 1254251, 1328903, 1399553, 1462959, 1517225, 1561464, 1594990, 1617107, 1627584, 1627239, 1617820, 1600884, 1576638, 1544153, 1502914, 1453884, 1398910, 1339693, 1277873, 1215660, 1155528, 1099129, 1046932]
62227A046932m8006m3671l9228l5123l1771k9172k6960k4670k2136j9719j7923
62216G08553j6790j5852j4775j3652j2667j1850j1270j1063j1008j0483r147p441
62204E62555o166n662n535n047l702j689J69J166J477J932K910L895M281M268
62190E54852M599N677P191Q538R332R631R844J0346J1052J1497J1358J0711R726
62177F74354Q478P233O500O482O759O949P486R257J2508J6587K0824K5195K9968
62164H38580L5144M0512M5897N0888N4501N5622N3833M9552M3345L5542K6623
62153A330039J7479Q929J217n710j1762j7007k2102k7760l3752l8968m2571m4563
62141A113469m5143m4206m1845l8722l5373l1631k7206k2547j8474j5154j2121
$$ y = [1046932, 998926, 955255, 916027, 880904, 849133, 819961, 793001, 768331, 746195, 726476, 708553, 691763, 675911, 661136, 647484, 634817, 622967, 611697, 600634, 589626, 579143, 569996, 562555, 556389, 550727, 545192, 540145, 536443, 534754, 534923, 536089, 537566, 539498, 542408, 546303, 550584, 554852, 559451, 565128, 572319, 580857, 590189, 599820, 609664, 620010, 631062, 642559, 653917, 664628, 674354, 682832, 690065, 696565, 703047, 709806, 716755, 724241, 733498, 746006, 762593, 783417, 808612, 838580, 873724, 914236, 960133, 1011021, 1065522, 1121144, 1174977, 1224529, 1267874, 1303416, 1330039, 1347518, 1356447, 1357664, 1351954, 1340192, 1323185, 1301083, 1273323, 1239571, 1200603, 1158032, 1113469, 1068326, 1024120, 982275, 943553, 908180, 876549, 849343, 826796, 808322, 793168, 781047]
62130G81047r254p141o300o413o535n877m377k641j273j15J527L829N998P339
62116G49814Q313R832J1711J2634J1688R191N923K349j080l572m532m084k724
62103H05463r11O18P15j175m066o156o527n607m070j961P61L549N665P037Q136
62088H01471R102R549R400R350J0088J1354J2286J2619J3074J4377J6331J8115
62076I47116J9311K0305K1669K3359K4593K4626K3620K2620K2480K3009K3523
62065A196231K3957K4850K6363K8108L0052L2610L5376L6621L4867L0396K4483
62054A523914J7740J0194K510m112r305j3800j8225k2598k7136l2460l8550m4300
62042A343872m8630n1442n3063n3414n2344n0262m7811m5183m2208l8896l5458
$$ y = [781047, 771793, 764652, 758352, 751939, 745404, 739527, 735150, 732509, 731236, 731121, 732648, 736477, 742475, 749814, 758127, 767959, 779670, 792304, 803992, 813183, 819106, 821455, 820375, 816803, 812271, 808187, 805463, 804552, 805170, 805885, 804710, 800644, 794488, 787961, 782354, 778284, 776323, 777084, 780633, 786298, 793335, 801471, 810573, 820122, 829522, 838872, 848960, 860314, 872600, 885219, 898293, 912670, 929001, 947116, 966427, 986732, 1008401, 1031760, 1056353, 1080979, 1104599, 1127219, 1149699, 1172708, 1196231, 1220188, 1245038, 1271401, 1299509, 1329561, 1362171, 1397547, 1434168, 1469035, 1499431, 1523914, 1541654, 1551848, 1554358, 1550246, 1540941, 1527141, 1508916, 1486318, 1459182, 1426722, 1388172, 1343872, 1295242, 1243800, 1190737, 1137323, 1084979, 1034717, 986906, 941723, 899515, 860619, 825161]
62031H25161l2051k8820k5972k3460k0940j8293j5950j4327j3213j2092j0843
62020F09200r748r032q685q541q308p743p054o762o841o473n134l485k510k080
62006E16804j094R98L617N923P565Q423Q434P923P532P370O788N360L616K371
61992E91630J758J412J206J157Q25m13k536m914p175r316j0977j1435j0710r935
61978E30577r918r951q810o636m826m119l741k753j396n72n37p77q94j019j346
61963D73282j708j716j171l40J24k05r31j101k80R69J861K224K260J969J441J349
61947D78027K377M286O093P203P767Q108Q440R184J0759J2865J4532J5190J5092
61934E99923J4612J3754J2707J2121J2212J2195J1214R549Q129P113N713L439
$$ y = [825161, 793110, 764290, 738318, 714858, 693918, 675625, 659675, 645348, 632135, 620043, 609200, 599452, 590420, 581735, 573194, 564886, 557143, 550089, 543327, 536486, 530013, 524879, 521394, 518884, 516804, 515710, 516708, 520325, 526248, 533813, 542236, 550670, 558593, 566125, 573495, 580283, 585643, 589259, 591630, 593388, 594800, 596006, 597163, 597988, 597575, 595039, 590125, 582950, 573634, 562657, 551222, 540512, 530577, 520659, 510708, 501898, 495262, 490436, 486317, 482576, 479823, 478427, 477855, 477318, 476541, 475647, 474628, 473282, 471574, 469858, 468687, 468347, 468471, 468266, 467335, 466234, 465954, 466923, 468784, 471008, 473268, 475237, 476678, 478027, 480404, 484690, 490783, 497986, 505753, 513861, 522301, 531485, 542244, 555109, 569641, 584831, 599923, 614535, 628289, 640996, 653117, 665329, 677524, 688738, 698287, 706416, 713529, 719242, 722681]
61922G22681Q02j436l201m952o901q639r490r060p545n614l863k309m99J878M625
61907F66477P378J0045J2630J4722J5561J4792J2900J0640Q205N313J966j341
61895G79288m235o773q998j0665j1706j2493j3218j3391j2563j1205j0225r773
61883F54043r236q384p718p589p686p721q001q792r695j0048r713q988p996o591
61869E35885m781k846j127J77J158K272M093O679R296J1051J1690J1749J1991
61856E97287J2921J4567J6539J8360J9891K1391K3075K4795K6195K6991K7045
61845H29057K6359K5208K3995K2775K1037J8135J3873Q629L109j969o192r648
61833I74368j2570j4770j5700j5213j3813j1877r077m973K5M810Q588J1305J3057
$$ y = [722681, 723483, 722047, 718846, 713894, 706993, 698354, 688864, 679804, 672259, 666645, 662782, 660473, 659974, 661852, 666477, 673855, 683900, 696530, 711252, 726813, 741605, 754505, 765145, 773350, 778663, 780629, 779288, 775053, 768280, 759282, 748617, 736911, 724418, 711200, 697809, 685246, 674041, 663816, 654043, 644807, 636423, 628705, 621116, 613430, 605709, 597708, 588916, 579221, 569173, 559460, 550472, 542476, 535885, 531104, 528258, 527131, 527308, 528466, 530738, 534831, 541510, 550806, 561857, 573547, 585296, 597287, 610208, 624775, 641314, 659674, 679565, 700956, 724031, 748826, 775021, 802012, 829057, 855416, 880624, 904619, 927394, 948431, 966566, 980439, 989068, 992177, 990208, 984016, 974368, 961798, 947028, 931328, 916115, 902302, 890425, 881348, 876375, 876400, 881210, 889798, 901103, 914160]
61820I14160J3565J2471R929O494K510k196p717j3400j8087k1246k3538k5911
61808H47034k8254k9478k8857k6856k4525k2569k1170k0224j9353j7974j5836
61797E91938j3417j1550j0671j0505j0332r511p994o408n397m868m190l168k324
61784D91603k052k003j678j182r64j058j062o70J4O08O63L0p82r11q5J058J858
61767D83387K405L081L766M085M104M223M538M797M914N059N461O331P638Q593
61753E52382P971N677L480L160M149M114J886j303l675m853n483n916o084o042
61739E49463n807n090l866k875k843l391l415k483j241m31m5M05J171K047K629
61724E24228K745K665K898L588M220M139L324K435K120K462L007L178K708J914
$$ y = [914160, 927725, 940196, 950125, 956619, 959129, 956933, 949216, 935816, 917729, 896483, 872945, 847034, 818780, 789302, 760445, 733589, 709064, 686495, 665325, 645101, 625748, 607774, 591938, 578521, 566971, 556300, 545795, 535463, 525952, 517958, 511550, 506153, 501285, 497095, 493927, 491603, 489551, 487548, 485870, 484688, 483724, 482666, 481604, 480934, 480948, 481556, 482219, 482249, 481467, 480556, 480471, 481529, 483387, 485792, 488873, 492639, 496724, 500828, 505051, 509589, 514386, 519300, 524359, 529820, 536151, 543789, 552382, 560353, 566030, 569510, 572670, 576819, 580933, 582819, 581516, 577841, 572988, 567505, 561589, 555505, 549463, 543656, 538566, 534700, 531825, 528982, 525591, 522176, 519693, 518452, 518021, 517976, 518381, 519552, 521599, 524228, 526973, 529638, 532536, 536124, 540344, 544483, 547807, 550242, 552362, 554824, 557831, 561009, 563717, 565631]
61710E65631J357J084M23j085k807l624l338k865k878l069k971k818k954l032
61696E37054k567j969k103k945l529l303k746k471k480k591k875l204l088k450
61682D98733k032k346k789k464j512q47q56j125j288j315j072l75M73R17R41R42
61666D83985Q64K96n22p70l40j67p90j441j188k57M21M06o6o48r27m21P73J634
61648D80842J307K74j92L72J261J725J814J952K263K471K258J570P25J54l4q6
61632D98676j91m19j054k376l803m002k529p37l32j348k389k571k226j889j601
61617D71209j334j248j247r83n59n68j263k210l018l785m587n126n259n385n872
61602D28765o476o727o545o133n594m982m507m385m519m647m645m518m259l850
$$ y = [565631, 566988, 568072, 568495, 567410, 564603, 560979, 557641, 554776, 551898, 548829, 545858, 543040, 540086, 537054, 534487, 532518, 530415, 527470, 523941, 520638, 517892, 515421, 512941, 510350, 507475, 504271, 501183, 498733, 496701, 494355, 491566, 489102, 487590, 486743, 485887, 484762, 483474, 482159, 481087, 480712, 481185, 482102, 483043, 483985, 484849, 485145, 484623, 483853, 483513, 483346, 482556, 481115, 479927, 479670, 480091, 480497, 480431, 479783, 478856, 478435, 479208, 480842, 482149, 482423, 482231, 482603, 483864, 485589, 487403, 489355, 491618, 494089, 496347, 497917, 498642, 498796, 498762, 498676, 498485, 498066, 497012, 494636, 490833, 486831, 484302, 483565, 483233, 481885, 479496, 476925, 474699, 472810, 471209, 469875, 468627, 467380, 466397, 465838, 465270, 464007, 461797, 458779, 454994, 450407, 445281, 440022, 434637, 428765, 422289, 415562, 409017, 402884, 397290, 392308, 387801, 383416, 378897, 374250, 369605, 365087, 360828, 356978]
61588C56978l326k796k440k476k864l161k981k540k332k286j857j025n45q77j504
61573C23968j764j830k207k695k608j871j134q10o98o56q91j285j091J36J628
61558C06192K081J153j89q26n47J57Q93J593K199K510K397J984J529J236J140
61543C23502J105R24N75L30M47Q47J150J099P99N85Q18J638K696L251K785J557
61527C44108K35q95k007l116l861m024l796l368k725k009j551j366j016l37J80
61512C14452J18j87j73J67N08P91J126J275Q58o2j080j952k607k821k391j499
61496C06523m82N91J661K361K447K303K369K304J535M59J87R29J538J041j07o86
61480C24973j80R20J926K583L000L253L197K657J812J106N91k00j383k103j557
$$ y = [356978, 353652, 350856, 348416, 345940, 343076, 339915, 336934, 334394, 332062, 329776, 327919, 326894, 326349, 325472, 323968, 322204, 320374, 318167, 315472, 312864, 310993, 309859, 309049, 308351, 307695, 306804, 305519, 304428, 304564, 306192, 308273, 309426, 309237, 308411, 307864, 308021, 308914, 310507, 312706, 315216, 317613, 319597, 321126, 322362, 323502, 324607, 325531, 326106, 326436, 326883, 327730, 328880, 329979, 330778, 331363, 332181, 333819, 336515, 339766, 342551, 344108, 344343, 343448, 341441, 338325, 334464, 330440, 326644, 323276, 320551, 318542, 316991, 315625, 314609, 314272, 314452, 314570, 314383, 314210, 314377, 314885, 315676, 316802, 318077, 318935, 318873, 317793, 315841, 313234, 310413, 308022, 306523, 306041, 306632, 308293, 310654, 313101, 315404, 317773, 320077, 321612, 322071, 322258, 323187, 324725, 325766, 325659, 324973, 324793, 325713, 327639, 330222, 333222, 336475, 339672, 342329, 344141, 345247, 345838, 345638, 344255, 342152, 340595]
61465C40595l42O7p90j817j858r30K37J041J029m3j558k108r27J082K355K364
61449C38397J761J209P73L67O9m9K5M64J468K805L799L945L404K778K518K651
61433C66384K956L240L415L380L021K372J644J054P02O43Q98J287J587J915K577
61418C97075L312L247K101R22Q90J726K057J261K9q32j315j671j814j610j250
61403D04128r92j000j553k824m260m767l913k425j323r91j254j709j783j105j30
61388C74099K06l34r87j154j036q78m18L43P56N48M92J219K111K290K123K551
61372C81931L363L372K335J493J888K987L465K836J843J470J819K065J466L69
61358D12702j72K74J114J870K935M622O172O693O616P242Q870J0408J0866J0359
$$ y = [340595, 340253, 340320, 339530, 337713, 335855, 334925, 335162, 336203, 337232, 337189, 335631, 333523, 332596, 333678, 336033, 338397, 340158, 341367, 342140, 342507, 342576, 342527, 342552, 343016, 344484, 347289, 351088, 355033, 358437, 361215, 363733, 366384, 369340, 372580, 375995, 379375, 382396, 384768, 386412, 387466, 388168, 388811, 389709, 390996, 392583, 394498, 397075, 400387, 403634, 405735, 406657, 407547, 409273, 411330, 412591, 412620, 411788, 410473, 408802, 406988, 405378, 404128, 403136, 402136, 400583, 397759, 393499, 388732, 384819, 382394, 381071, 380080, 378826, 377117, 375334, 374229, 374099, 374305, 373971, 372984, 371830, 370794, 369916, 369498, 369841, 370597, 371145, 371637, 372856, 374967, 377257, 379380, 381931, 385294, 388666, 391001, 392494, 394382, 397369, 400834, 403670, 405513, 406983, 408802, 410867, 412333, 412702, 412530, 412804, 413918, 415788, 418723, 423345, 429517, 436210, 442826, 450068, 458938, 469346, 480212, 490571]
61344D90571R428Q196O629N080M064L711L733L695L309K613J937J488J093N62
61330E46109J01o0k08q30j873k860l571m077m135l339j927p32l4Q48K416M005
61314E29833M444L494K162J646K267L419M381N047N868P169Q778J0388J1913J3126
61300F13935J3338J1974R342O291L233P4k987n336o758p707q531q990q871q519
61286F00488q416q620q946r272r344q746p454o110n235m484l163j286M54J688
61272E21554K739L938M996N435N286N065N059M988M496L824L693M525O017P579
61258E89194Q946J0181J1293J2158J2603J2312J0854Q278N491L541K512J638M90
61245F89491n71j275k099l628n618p179p608o851n382l980l365l661m302m620
$$ y = [490571, 499999, 508195, 514824, 519904, 523968, 527679, 531412, 535107, 538416, 541029, 542966, 544454, 545547, 546109, 546210, 546150, 545942, 545112, 543239, 540379, 536808, 532731, 528596, 525257, 523330, 522598, 522564, 523412, 525828, 529833, 534277, 537771, 539933, 541579, 543846, 547265, 551646, 556693, 562561, 569730, 578508, 588896, 600809, 613935, 627273, 639247, 648589, 654880, 658113, 658187, 655200, 649864, 643106, 635399, 626868, 617878, 609007, 600488, 592072, 583452, 574506, 565234, 555890, 547144, 539690, 533580, 528345, 523861, 520698, 519412, 519866, 521554, 524293, 528231, 533227, 538662, 543948, 549013, 554072, 559060, 563556, 567380, 571073, 575598, 581615, 589194, 598140, 608321, 619614, 631772, 644375, 656687, 667541, 675819, 681310, 684851, 687363, 689001, 689491, 688920, 687645, 685546, 681918, 676300, 669121, 661513, 654662, 649280, 645300, 641935, 638274, 633972, 629352]
61231F29352m434l938l267k401j310NJ480K890M018M960N929O708O798O313O094
61216F59197O539O898O334N217M615M812N122M989M448L519K104O02j54L5M23
61201G14700M63O36J669L436N230O821Q613J0916J3533J6070J8204J9633K0017
61188H39941J9101J6781J3221R045N232K551J101M37l4q48k274l937n020n309
61174H89988n739p286r487j0767j0379r356r219j0292j1692j2594j2957j3179
61162G67041j3518j3965j4386j4613j4478j3822j2598j1029r578q550p597n998
61150F26909l510p81J296K502L261L899M135L364J248j967n467q182r333q898
61136F08476p622o460n827n328m304k646r49K95J386K967N071P077Q686J0318
$$ y = [629352, 624918, 620980, 617713, 615312, 614002, 614007, 615487, 618377, 622395, 627355, 633284, 639992, 646790, 653103, 659197, 665736, 672634, 678968, 684185, 688800, 693612, 698734, 703723, 708171, 711690, 713794, 714396, 714242, 714277, 714700, 715163, 715799, 717468, 720904, 726134, 732955, 741568, 752484, 766017, 782087, 800291, 819924, 839941, 859042, 875823, 889044, 898089, 903321, 905872, 906973, 907410, 907376, 906528, 904254, 900317, 895297, 889988, 884249, 876963, 867476, 856709, 846330, 836974, 827755, 817463, 805771, 793177, 780220, 767041, 753523, 739558, 725172, 710559, 696081, 682259, 669661, 658632, 649054, 640504, 632907, 626909, 623399, 622618, 623914, 626416, 629677, 633576, 637711, 641075, 642323, 640356, 634889, 626707, 617374, 608476, 600854, 594394, 588567, 583239, 578935, 576289, 575340, 575635, 577021, 579988, 585059, 592136, 600822, 611140]
61122F11140J2283J4096J5170J5881J7298J9800K2525K4393K5238K5663K6108
61111H29595K6501K6683K6706K6479K5553K3665K1342J9435J8012J6243J3576
61100A073790J0405P238L775m48m943q749j1803j4940j8484k1760k4195k5998
61088I63888k7408k8147k8067k7561k6862k5675k4023k2629k1849k0940j9234
61077F91493j7254j5776j4460j2457j0008q234p466o898n857m516l277k263j547
61064E81480j156p44J32J345K334K806K847K560K257K772M733P568R957J1264
61050F30155J1849J2181J2481J3177J4726J6862J8778K0212K1618K3179K4453
61039H19671K5206K5895K7020K8431K9535K9906K9694K9711L0832L2983L5053
$$ y = [611140, 623423, 637519, 652689, 668570, 685868, 705668, 728193, 752586, 777824, 803487, 829595, 856096, 882779, 909485, 935964, 961517, 985182, 1006524, 1025959, 1043971, 1060214, 1073790, 1084195, 1091433, 1095208, 1094760, 1089817, 1081068, 1069265, 1054325, 1035841, 1014081, 989886, 963888, 936480, 908333, 880266, 852705, 825843, 800168, 776145, 753516, 731667, 710727, 691493, 674239, 658463, 644003, 631546, 621538, 613304, 605838, 598940, 593083, 588567, 585290, 583027, 581480, 580324, 579580, 579712, 581057, 583391, 586197, 589044, 591604, 593861, 596633, 601366, 608934, 618891, 630155, 642004, 654185, 666666, 679843, 694569, 711431, 730209, 750421, 772039, 795218, 819671, 844877, 870772, 897792, 926223, 955758, 985664, 1015358, 1045069, 1075901, 1108884, 1143937]
61028A143937L6324L7380L9044M1044M2541M3299M3401M2688M1649M2021M5119
61017A598447N0251N6262O3715P3685Q5229R6425J07417J20160J35782J54997
61007B542370J80560K16133K62727L19619L88600M73399N75166O93782Q34301
60998F486657J005890J213067J454917J730801K024283K261217K299515K007565
60990B0483912J388375O22818l3272m08066m79826l17423n005L53442N94948N36289
60980B2736192R9137o04423j331872j866527k125718k147637k013700j795456
60972A0949996j546452j305306j092049r09509p54518o25468n19881m32170l57747
60963C406896k95993k47155k09279j79749j57027j39317j23985j09766r7332q6638
$$ y = [1143937, 1180261, 1217641, 1256685, 1297729, 1340270, 1383569, 1426970, 1469658, 1511307, 1553328, 1598447, 1648698, 1704960, 1768675, 1842360, 1927589, 2024014, 2131431, 2251591, 2387373, 2542370, 2722930, 2939063, 3201790, 3521409, 3910009, 4383408, 4958574, 5652356, 6486657, 7492547, 8705614, 10160531, 11891332, 13915615, 16176832, 18476347, 20483912, 21872287, 22495105, 22461833, 22053767, 21573941, 21256518, 21251513, 21604955, 22199903, 22736192, 22835329, 22230906, 20899034, 19032507, 16906789, 14759152, 12745452, 10949996, 9403544, 8098238, 7006189, 6096680, 5342162, 4716694, 4196813, 3764643, 3406896, 3110903, 2863748, 2654469, 2474720, 2317693, 2178376, 2054391, 1944625, 1847293, 1760655]
60953A760655p5960o4629n4327m6254l9229l2004k5572k1592k0055j9837k0161
60942A341035k0306j9247j6764j3802j0971p945m936k969j848K69M272Q787J2585
60929A268160J6433K1147K5676K8809L1197L3797L5682L5384L3334L0918K7939
60918A588476K2937J5589O986k134j1704k1161k9446l6136m1435m5249m7353m8200
60906A351170m8376m7522m5030m1525l8503l6504l4697l2266k9282k6190k3317
60895I47958k0894j8990j7436j6202j5534j5277j4633j3241j1926j1581j1810
60884G80434j1594j0894j0542j0800j0976j0499r673r251r655j0503j0748r655
60872F55644p926p153p784q478q039p098o986p711q181p861p110o286n532n162
$$ y = [1760655, 1684695, 1620066, 1565739, 1519485, 1480256, 1448252, 1422680, 1401088, 1381033, 1361196, 1341035, 1320729, 1301482, 1284718, 1270916, 1259945, 1252000, 1247064, 1244095, 1242247, 1242516, 1246788, 1255575, 1268160, 1284593, 1305740, 1331416, 1360225, 1391422, 1425219, 1460901, 1496285, 1529619, 1560537, 1588476, 1611413, 1627002, 1633988, 1631854, 1620150, 1598989, 1569543, 1533407, 1491972, 1446723, 1399370, 1351170, 1302794, 1255272, 1210242, 1168717, 1130214, 1093710, 1059013, 1026747, 997465, 971275, 947958, 927064, 908074, 890638, 874436, 858902, 843625, 828992, 815751, 803825, 792244, 780434, 768840, 757946, 747404, 736604, 725628, 715129, 705456, 696205, 686550, 676047, 665299, 655644, 647718, 640565, 632781, 624303, 616264, 609166, 602180, 594469, 586288, 578427, 571317, 565031, 559499, 554337]
60858E54337n278n290m735m228m685n857o640o571o048n250l920k240r60n42p65
60843D91328j263j770j958j715j479j762k470l218l995m896n484n199m143k812
60829D49164j314M04J939K804L219L706M237M494M710N323O058O266N901N307
60815E02218M331K787J429J253J785J404m05k300k881k248j313n77j63k59q47
60800E04214j463j742j891k269k860l434l904m342m849n524o250o598o226n407
60786D47455m770m599m709m911n144n267n177n061n074m930m294l397k756k397
60772C84969j935j306p90m43r5J53R0M3O86K153L820M950N140M335L082K551L539
60755D10942N384O553O401N674N318N473N778N921N657M841L771K983K619K266
$$ y = [554337, 549059, 543769, 539034, 534806, 530121, 524264, 517624, 511053, 505005, 499755, 495835, 493595, 492635, 492093, 491328, 490065, 488295, 486337, 484622, 483143, 481381, 478911, 475693, 471698, 466802, 461318, 456119, 451976, 449164, 447850, 448254, 450193, 452997, 456216, 459922, 464159, 468653, 473363, 478686, 484744, 491010, 496911, 502218, 506549, 509336, 510765, 512018, 513803, 515207, 514802, 512502, 509621, 507373, 506060, 505483, 505320, 505061, 504214, 502751, 501009, 499118, 496849, 493989, 490555, 486651, 482309, 477460, 471936, 465686, 459088, 452862, 447455, 442685, 438086, 433377, 428466, 423322, 418055, 412878, 407817, 402743, 397813, 393519, 390122, 387366, 384969, 383034, 381728, 380938, 380495, 380400, 380553, 380643, 380686, 381372, 383525, 387345, 392295, 397435, 401770, 404852, 407403, 410942, 416326, 422879, 429280, 434954, 440272, 445745, 451523, 457444, 463101, 467942, 471713, 474696, 477315, 479581]
60741D79581J462pk237n038p671r338r986j0143j0011r371q347p550p327p379
60727C86638p286o869o007m697l411k827l063l545l686l281k280r11Q0Pp88j192
60711C36882p60j61o4k47j96O9J97J39R8J31J60J87K02R3j59l19j08N06J281J911
60691C39842K313K765L538M347M541M022L555L787M468N094N794O903Q086Q704
60677D07759Q748Q666Q450P785O875O293O032N535M647L683K643J138q06k702
60663D74746m321n769o821p119o964p004p097o492n247m377m318m297l639k687
60649C98594j922j120L6J157J691J648J259M31r03k346l427m051m302m242m127
60634C78376m296m572m359l556k775k285j508m9J431J965J462O14M7MN03J283
$$ y = [479581, 481043, 481036, 478799, 473761, 466090, 456752, 446766, 436623, 426612, 417241, 408894, 401344, 394017, 386638, 379352, 372483, 366476, 361779, 358368, 355541, 352478, 348933, 345247, 341966, 339686, 338775, 338855, 338862, 338074, 336882, 336122, 335961, 335897, 335650, 335454, 335523, 335720, 335859, 335957, 336088, 336248, 336435, 336637, 336730, 336571, 336252, 336144, 336650, 337931, 339842, 342155, 344920, 348458, 352805, 357346, 361368, 364923, 368710, 373178, 378272, 384066, 390969, 399055, 407759, 416507, 425173, 433623, 441408, 448283, 454576, 460608, 466143, 470790, 474473, 477116, 478254, 477448, 474746, 470425, 464656, 457835, 450716, 443752, 436748, 429651, 423159, 417912, 413535, 409217, 404920, 401281, 398594, 396672, 395552, 395588, 396745, 398436, 400084, 401343, 401774, 400871, 398525, 395098, 391047, 386745, 382503, 378376, 374080, 369508, 365149, 361593, 358818, 356533, 355025, 354976, 356407, 358372, 359834, 360448, 360495, 360499, 361002, 362285]
60618C62285J836J855J451P89o8p70o99K10J099J110L29n00q34n81J46J080J778
60601C70516J941J624J063N07K24L12M55K72m2J29R27J818K330K507K487K227
60585C89297J825J517J221O27j05m12k40j81m30l62M39J502K303L100M335N792
60569D10228O980P953R064J0253J1164J1759J2282J2695J2610J1742J0138Q019
60557E34887N566K880Q2k485m332n309n760n884n179l153l51K085L793N337P036
60542E29213Q563R847J1393J3390J5294J6708J7937J9225K0114J9924J8371J5399
60530G15378J1070N925R16l357o847r518j1175j1895j1895j1002r136p174o226
60517F45064o023n390m378m291n111m791k141J150K787K862L110M201N443O620
$$ y = [362285, 364121, 365976, 367427, 368216, 368148, 367378, 366679, 366889, 367988, 369098, 369427, 368927, 368093, 367512, 367658, 368738, 370516, 372457, 374081, 375144, 375651, 375875, 376187, 376642, 376914, 376872, 377001, 377928, 379746, 382076, 384583, 387070, 389297, 391122, 392639, 393860, 394487, 394382, 393970, 393730, 393549, 393119, 392757, 393196, 394698, 397001, 400101, 404436, 410228, 417208, 425161, 434225, 444478, 455642, 467401, 479683, 492378, 504988, 516730, 526868, 534887, 540453, 543333, 543415, 540930, 536598, 531289, 525529, 519645, 514466, 511313, 510962, 513047, 516840, 522177, 529213, 537776, 547623, 559016, 572406, 587700, 604408, 622345, 641570, 661684, 681608, 699979, 715378, 726448, 732373, 733289, 729932, 723085, 713567, 702392, 690497, 678602, 667600, 658464, 651290, 645064, 639041, 633651, 629273, 624982, 619871, 615080, 612939, 614089, 616876, 619738, 622848, 627049, 632492, 639112]
60503F39112Q462J1501J5587K0443K5665L0531L4704L8886M3856M9179N3724N7062
60491A028712N9386O0434N9336N5345M7983L7027K3176Q153o754k1795l7269n1591
60479A262143o2105o7667o9193o7918o4445n9392n3659m7790m1935l6537l2055
60468F59447k8103k3956j9953j7237j5899j4610j2478j0257r106r009r010q484
60456D81345p542o581n873n442n074m605m167l945l798l516l223l034k551j401
60442D20593j50O1j071k577l319k972j917p46n2j53p54j220j302j265j325j324
60426D00507j145r69j074j486j920j926j267l10L06N51J064K013K467J607P8p19
60410C97777l68L31O87P83Q57R19J087J583K193K335J833J155Q06R07J372K020
$$ y = [639112, 647574, 659075, 674662, 695105, 720770, 751301, 786005, 824891, 868747, 917926, 971650, 1028712, 1088098, 1148532, 1207868, 1263213, 1311196, 1348223, 1371399, 1379552, 1372798, 1351003, 1313734, 1262143, 1200038, 1132371, 1063178, 995260, 930815, 871423, 817764, 769974, 728039, 691502, 659447, 631344, 607388, 587435, 570198, 554299, 539689, 527211, 516954, 507848, 498839, 489829, 481345, 473803, 467222, 461349, 455907, 450833, 446228, 442061, 438116, 434318, 430802, 427579, 424545, 421994, 420593, 420443, 420504, 419433, 416856, 413537, 410565, 408648, 407902, 407850, 407697, 406943, 405723, 404421, 403156, 401831, 400507, 399362, 398393, 397319, 395833, 393913, 391987, 390720, 390410, 390716, 391267, 392331, 394344, 396811, 398418, 398496, 397777, 397409, 397740, 398427, 399210, 400067, 400986, 402073, 403656, 405849, 408184, 410017, 411172, 411978, 412885, 414257, 416277]
60394D16277K481K424J971J497J189J089J371K088K819L050K787K400K137K163
60380D45743K664L337L340K440J693K107L101L384K848K424K297J772Q47M78R12
60365D79387J138M36n96j081q89j50J132K393K539J492P80J657L362M217L876
60350D99693L403L519L911M204M576N150N479N052L911K499J130j51j260j966
60336E39150k223k433l081m039m549m207l556l355l582l658l404l099k769k179
60322D93016j555j464j818j818j160n34m82n10P5J060J777K247L041M237N316
60307E01428O186P517R712J2152J3950J5163J6581J8307J9209J8071J4902J0614
60295F63792N783L95n305j0543j4743j7791j9297j8493j5429j1619q736p019n678
$$ y = [416277, 418758, 421182, 423153, 424650, 425839, 426928, 428299, 430387, 433206, 436256, 439043, 441443, 443580, 445743, 448407, 451744, 455084, 457524, 459217, 461324, 464425, 467809, 470657, 473081, 475378, 477150, 477997, 478475, 479387, 480525, 480961, 480365, 479284, 478395, 478245, 479377, 481770, 484309, 485801, 486581, 488238, 491600, 495817, 499693, 503096, 506615, 510526, 514730, 519306, 524456, 529935, 534987, 538898, 541397, 542527, 542376, 541116, 539150, 536927, 534494, 531413, 527374, 522825, 518618, 515062, 511707, 508125, 504467, 501063, 497964, 495195, 493016, 491461, 489997, 488179, 486361, 485201, 484667, 484185, 483675, 483750, 484810, 486587, 488834, 491875, 496112, 501428, 507614, 515131, 524843, 536995, 550945, 566108, 582689, 600996, 620205, 638276, 653178, 663792, 669575, 669970, 664665, 654122, 639379, 621588, 602291, 583798, 568369, 556750, 548014, 540995, 535317]
60282E35317m385l544l343l408l390l287l192l215l551m141m478m272m008m207
60268D82896m446l953k898k251k383k721k759k591k350j883j235p21m25j56K1
60253D52145j18l35p5O35J146J126Q94O95L92N7J32O97J141Q72Jr07j379j254
60235D55865p41k95j13J43P48J371J640J913K698L627L892L525L282L362L283
60220D84200L028L226M042M899N486O078O701O974P024P480Q304Q670Q433Q539
60206E73084R434J0123R561Q111O866O202N765N300M805M269L764L416L036K225
60192F55961J130L81R9k87r82j520j862k802m633o386p117p191p407p641p293
60177F02450o555o198o354o297n405l806k189j309j367j663j276l15J49m24j348
$$ y = [535317, 530932, 527388, 524045, 520637, 517247, 513960, 510768, 507553, 504002, 499861, 495383, 491111, 487103, 482896, 478450, 474497, 471599, 469348, 466965, 464244, 461485, 458894, 456544, 454661, 453426, 452705, 452280, 452124, 452145, 452027, 451692, 451617, 452252, 453398, 454524, 455418, 456113, 456505, 456562, 456694, 457391, 458532, 459404, 459405, 458498, 457119, 455865, 455124, 454829, 454716, 454859, 455607, 456978, 458618, 460531, 463229, 466856, 470748, 474273, 477555, 480917, 484200, 487228, 490454, 494496, 499395, 504881, 510959, 517660, 524634, 531658, 539138, 547442, 556112, 564545, 573084, 582518, 592641, 602202, 610313, 617179, 623381, 629146, 634446, 639251, 643520, 647284, 650700, 653736, 655961, 657091, 657472, 657571, 657284, 656302, 654782, 652920, 650118, 645485, 639099, 631982, 624791, 617384, 609743, 602450, 595895, 589697, 583343, 577046, 571641, 567835, 565646, 564337, 562970, 561307, 560031, 559716, 559865, 559441, 558093]
60162E58093j926k428l196l599k840j246J03P66J145J629K161K554K637K278J708
60147E57839J526J957K408K251J688J438J816K546L160L326L115L160M079N548
60133E95857O588O928P287P987Q263P572O604O159N799M645K870J406O54M35Q54
60118F69908K076L503M135L757L057K612K422K317K127J564M55r29k222l414m550
60103F86818n338n500n213m773m228l749l823m458m845m437l750l342k725j272
60089F29365L84J086R16R55J519J906J841J870K123J939J072K07k08p15j840l115
60073F39305l806m087m830o423q308r603r818r102q000p064o511o269o185o130
60059E43169n979n698n303m742l966l177k650k172j139N02J892K273K039K195
$$ y = [558093, 556167, 553739, 550543, 546944, 544104, 542858, 542961, 543727, 544872, 546501, 548662, 551216, 553853, 556131, 557839, 559365, 561322, 563730, 565981, 567669, 569107, 570923, 573469, 576629, 579955, 583070, 586230, 590309, 595857, 602445, 609373, 616660, 624647, 632910, 640482, 647086, 653245, 659044, 663689, 666559, 667965, 668619, 669054, 669908, 671984, 675487, 679622, 683379, 686436, 689048, 691470, 693787, 695914, 697478, 697933, 697004, 694782, 691368, 686818, 681480, 675980, 670767, 665994, 661766, 658017, 654194, 649736, 644891, 640454, 636704, 633362, 630637, 629365, 629749, 630835, 631751, 632706, 634225, 636131, 637972, 639842, 641965, 643904, 644976, 645183, 644975, 644260, 642420, 639305, 635499, 631412, 626582, 620159, 611851, 602248, 592430, 583328, 575328, 568264, 561753, 555484, 549299, 543169, 537190, 531492, 526189, 521447, 517481, 514304, 511654, 509482, 508343, 508845, 510737, 513010, 515049, 517244]
60045E17244L103M241N030N410N693O200O973P581P479O708N875N246M364K913
60031E94060J348J53r13k199l400m211n139o753q440q977q267p450p284p292o722
60016E18514n599m501l818l568l595l743l988m432m969n158m688l777k907k292
60002D61479j938j810j674j124j84M90M37N4m8J36L17N92J151J773K251K933M128
59985D68963N350N911N898N811N542M594L072J544J04j554l248m322m562m350
59971D88753l999l598l411l628l814l326k268j306o52M2Q55J409J521J382J195
59956D69155J209J803K913L593L011J631N37l2m72m96O19K466L518K994J651M64
59940D94564l98j051j424j788k634l587l441j881j81M56M28Q72K000L128L814
$$ y = [517244, 520347, 524588, 529618, 535028, 540721, 546921, 553894, 561475, 568954, 575662, 581537, 586783, 591147, 594060, 595408, 595561, 594648, 592449, 589049, 584838, 579699, 572946, 564506, 555529, 547262, 539812, 532528, 525236, 518514, 512915, 508414, 504596, 501028, 497433, 493690, 489702, 485270, 480301, 475143, 470455, 466678, 463771, 461479, 459541, 457731, 456057, 454933, 454749, 455239, 455676, 455730, 455682, 455818, 456135, 456727, 457878, 459651, 461902, 464835, 468963, 474313, 480224, 486122, 491933, 497475, 502069, 505141, 506685, 506789, 505235, 501987, 497665, 493103, 488753, 484754, 481156, 477745, 474117, 470303, 466977, 464709, 463403, 462751, 462793, 463648, 465057, 466578, 467960, 469155, 470364, 472167, 475080, 478673, 481684, 483315, 483852, 483820, 483348, 482852, 483471, 485937, 489455, 492449, 494100, 494564, 494166, 493115, 491691, 489903, 487269, 483682, 480241, 478360, 478179, 478635, 479063, 479935, 481935, 485063, 488877]
59925D88877M134M136L881L828M552O023P620Q916J0094J1520J2994J3641J2715
59912E92931J0511Q168O348M544K141l45j845k208k237k322k124j647j639k496
59898F07780l586m130m084l760l198k379j566r59l50M84J371K044K550L092L711
59883E97020M369N055N673O070O287O582P002P242O985O259N381M597L805K541
59869F74868N33j689l185l769m221m983n451n101m503m331m165l382k575k689
59855F25357l225k859j640r32j106r80J32J413K171K989M464O062P055P453P161
59840F53515N370J868j879m033m187l004r01J788L920M051J920j356m443o572
59826F46057p431p049n917m771m161m178m388m044k795j267l73kQ22K258L070
$$ y = [488877, 493011, 497147, 501028, 504856, 509408, 515431, 523051, 531967, 542061, 553581, 566575, 580216, 592931, 603442, 611610, 617958, 622502, 624643, 624298, 622453, 620245, 618008, 615686, 613562, 611915, 610276, 607780, 604194, 600064, 595980, 592220, 589022, 586643, 585077, 584118, 583768, 584252, 585623, 587667, 590217, 593309, 597020, 601389, 606444, 612117, 618187, 624474, 631056, 638058, 645300, 652285, 658544, 663925, 668522, 672327, 674868, 675401, 673712, 670527, 666758, 662537, 657554, 652103, 647002, 642499, 638168, 634003, 630621, 628046, 625357, 622132, 619273, 617633, 616701, 615595, 614615, 614747, 616160, 618331, 621320, 625784, 631846, 638901, 646354, 653515, 658885, 660753, 658874, 654841, 650654, 647650, 646749, 648537, 652457, 656508, 658428, 657072, 652629, 646057, 638626, 631577, 625660, 620889, 616728, 612550, 608162, 604118, 601323, 600056, 599683, 599681, 600503, 602761, 605831]
59811F05831K224K92j423k403k896l030k870k895l490m154m077l366l013l544
59797E71186m347m492l825l059k921l364l669l311k568j946j419p54l89j074k473
59782E31575l145k256n94N97J086J379J654J715J598J528J503J412J361J520J819
59767E42752K127K474K807K917K806K849L296L978M611N020M952M264L470L422
59753E91745M157M767M734M637N047N484N131M030K929K320K202K415K652K484
59739F44734J799R37J10q37j768k053j437n66m9L49J020J593J459Q34N31R14J602
59722F49172K047J952J384Q41Q61J256J174K65q09j386j650j954k049j632j083
59707F48389q72p88m35K8M20J218K798M441N073M717M363M696N730P338R138J0069
$$ y = [605831, 608055, 608347, 606924, 604521, 601625, 598595, 595725, 592830, 589340, 585186, 581109, 577743, 574730, 571186, 566839, 562347, 558522, 555463, 552542, 549178, 545509, 542198, 539630, 537684, 536265, 535511, 535122, 534048, 531575, 528430, 526174, 525580, 526177, 527263, 528642, 530296, 532011, 533609, 535137, 536640, 538052, 539413, 540933, 542752, 544879, 547353, 550160, 553077, 555883, 558732, 562028, 566006, 570617, 575637, 580589, 584853, 588323, 591745, 595902, 600669, 605403, 610040, 615087, 620571, 625702, 629732, 632661, 634981, 637183, 639598, 642250, 644734, 646533, 647470, 647580, 646743, 644975, 642922, 641485, 640919, 640870, 641219, 642239, 643832, 645291, 646125, 646656, 647570, 649172, 651219, 653171, 654555, 655396, 656257, 657513, 658687, 658952, 658143, 656757, 655107, 653153, 651104, 649472, 648389, 647517, 646729, 646294, 646322, 646742, 647960, 650758, 655199, 660272, 664989, 669352, 674048, 679778, 687116, 696254, 706323]
59691G06323R168O760M132K052M54o87j154j162j200j182o59ml12j834l523m549
59675G12623n392o697p900p978p083o471o849p603p777p128n883m120k042n05
59661F29195l97j315j609k21K016L543M028M414N236N914N849N280M664L958K994
59646F73549J994J148J55j340l247n240p143q646r201q614p477o559o081n774
59632F07524n290m274k576p22K99N6r08j930k867l691m158m342m728n305n290
59617E61798m418l691m031m873n060m550m108l748k699q92O54J144Q71N73N70
59602E27540P58R86J120J067Q29M83J43K9L22Q24J085J019R95J118R57L17k96
59585E39296m35m04p25j372k038k666l179l254k883k709l137l638l538l018k628
$$ y = [706323, 715491, 722251, 726383, 728435, 728889, 728202, 727048, 725886, 724686, 723504, 722845, 722841, 722529, 720695, 717172, 712623, 707231, 700534, 692634, 684656, 677573, 671102, 664253, 656650, 648873, 641745, 635862, 631742, 629700, 629195, 628798, 627483, 625874, 625653, 627669, 631212, 635240, 639654, 644890, 650804, 656653, 661933, 666597, 670555, 673549, 675543, 676691, 676846, 675506, 672259, 667019, 659876, 651230, 642029, 633415, 625938, 619379, 613298, 607524, 602234, 597960, 595384, 594662, 594961, 595017, 594109, 592179, 589312, 585621, 581463, 577121, 572393, 567088, 561798, 557380, 553689, 549658, 544785, 539725, 535175, 531067, 527319, 524620, 523728, 524382, 525526, 526397, 526970, 527540, 528298, 529284, 530404, 531471, 532300, 532783, 532926, 532955, 533277, 534101, 535186, 536205, 537200, 538318, 539275, 539592, 539296, 538861, 538457, 537732, 536360, 534322, 531656, 528477, 525223, 522340, 519631, 516494, 512856, 509318, 506300, 503672]
59570E03672k307j658q65n02o62r60j186j353j364j110p32l21K05O21L91l15l43
59553D91211R38K546L145K773K358K155J815J602K234L549M503M661M827O034
59539E34351Q475J1580J4681J7589K0596K3459K4280K0466J1751J517o044r571
59527F73130j0438r894p865m367m68K580M172M203K951J264Rp86j724l051m559
59512F45157o184p932r334r822r543r121q799q452q124p819p121n827m530l775
59498E38774l112k002r93q00p98J43J630K146J335M36L49P74J366K317L505M290
59482E49360M564M929N558N931N908N996O432O956P603Q526R096Q316O344M311
59468F39830K583N26j845l505m049m184m151l170j077R06J962K874M554O529P902
$$ y = [503672, 501365, 499707, 498842, 498340, 497678, 496718, 495532, 494179, 492815, 491705, 490973, 490652, 490857, 491478, 491869, 491554, 491211, 492149, 494695, 497840, 500613, 502971, 505126, 506941, 508543, 510777, 514326, 518829, 523490, 528317, 534351, 542826, 554406, 569087, 586676, 607272, 630731, 655011, 675477, 687228, 688745, 682701, 673130, 662692, 652798, 644933, 640566, 640098, 642678, 646850, 651053, 654004, 655268, 655277, 654491, 652767, 649716, 645157, 638973, 631041, 621707, 611885, 602342, 593221, 584422, 575970, 567846, 560027, 552906, 547079, 542549, 538774, 535662, 533660, 532667, 531867, 531069, 531212, 532842, 534988, 536323, 536759, 537108, 537882, 539248, 541565, 545070, 549360, 553924, 558853, 564411, 570342, 576250, 582246, 588678, 595634, 603237, 611763, 620859, 629175, 635519, 639830, 642413, 642939, 641094, 637589, 633540, 629356, 625205, 622035, 620958, 621864, 623826, 626700, 631254, 637783, 645685]
59453F45685Q867J0115J1521J2373J2474J2145J1548J0659R485P788N064J293
59441G59017k728o229r140j1589j3296j3837j3098j1300r057p413p067p451p377
59428F39435o591n799n202m123k349n27J129L398O686J0213J3105J5386J7379
59415F82140J9034K0348K1617K2985K4647K7267L0534L1112K4428R938o985j9794
59403H87271k6053k7039k4194j8300j0823l279M393J2389J7982J6458O183q757
59391H26231k1832k9090l0569k8367k4591k0596j6864j3311r947p201n464m511
59379F13888l666k450r30N21J665K530L150L398L268L114L243L472L486L548M171
59364F42408N128N559N310N354O478Q163R326R711J0028J0939J2410J3897J4936
$$ y = [645685, 654552, 664667, 676188, 688561, 701035, 713180, 724728, 735387, 744872, 752660, 757724, 759017, 756289, 750060, 740920, 729331, 716035, 702198, 689100, 677800, 668743, 661330, 654263, 646812, 639435, 632844, 627045, 621843, 617720, 615371, 614844, 615973, 619371, 626057, 636270, 649375, 664761, 682140, 701174, 721522, 743139, 766124, 790771, 818038, 848572, 879684, 904112, 914050, 907065, 887271, 861218, 834179, 809985, 791685, 780862, 777583, 781976, 794365, 812347, 828805, 834988, 826231, 804399, 775309, 744740, 716373, 691782, 671186, 654322, 641011, 631064, 623863, 618399, 613888, 610222, 607772, 606842, 607363, 609028, 611558, 614708, 618106, 621374, 624488, 627731, 631203, 634689, 638237, 642408, 647536, 653095, 658405, 663759, 670237, 678400, 687726, 697437, 707465, 718404, 730814, 744711, 759647]
59351G59647J5606J6459J7832J9282K0133K0355K0409K0372J9916J9008J7887
59340I66906J6337J3911J0853P874M900J178l215p142j0059j2674j5435j7583
59328I55851j8466j8660j8913j8944j8200j6961j5803j4653j3299j2077j1122
59317G78753r741p551n553m941n377n529m927m107l261j953j33J541K570L106
59303G32897L687M893P064R763J1955J3259J4525J6332J7353J5337R523J317p203
59290H50702j4419j9062k0427j9223j7321j6041j5097j3559j1289r009p301o057
59278F81897m816l275j401P46L075N352P222Q553R594J0607J1414J1611J1067
59265G51646R903Q143N880L582J628l64l023o059q388r506j0038j0664j1279j1434
$$ y = [759647, 775253, 791712, 809544, 828826, 848959, 869314, 889723, 910095, 930011, 949019, 966906, 983243, 997154, 1008007, 1015881, 1020781, 1021959, 1018744, 1011602, 1001543, 988869, 973434, 955851, 937385, 918725, 899812, 880868, 862668, 845707, 829904, 815251, 801952, 789875, 778753, 769012, 761461, 755908, 750967, 745590, 740061, 735134, 731027, 727766, 725813, 725680, 727221, 729791, 732897, 736584, 741477, 748541, 758304, 770259, 783518, 798043, 814375, 831728, 847065, 856588, 857905, 850702, 836283, 817221, 796794, 777571, 760250, 744209, 729112, 715553, 704264, 695255, 687954, 681897, 677081, 673806, 672405, 673151, 676226, 681578, 688800, 697353, 706947, 717554, 728968, 740579, 751646, 761549, 769692, 775572, 779154, 780782, 780418, 777395, 771336, 762948, 753442, 743404, 732740, 721461, 710027]
59251G10027j0915r732q161o976o771o947o245m499k869k043j323N1J758L214
59237F48569M493N690O307O082N639N478N030L608J674K88l10p47j560k804m191
59222F83246n195n405n165n263n661n419m211k998k581k512k137j756j832j893
59208F31218j253j38Q32J658K646L611M218M534M638M287L685L668M397M776M015
59193F76792K910K538K569K055J120O55Q47J104J092Q74M57K4O9N57O41j3m96
59176F93795r3N05M53K45O98J509K101K990M742O481P071P103P962R441J0048
59161G55051R315Q068O731N047L350K334J615J14k102l866m807n663o641o959
59147G61587o310n393m786m464m497n035n551n418n259o291q298r636r531q913
$$ y = [710027, 699112, 689380, 681219, 674243, 667472, 660525, 654280, 649781, 646912, 644869, 643546, 643597, 645355, 648569, 653062, 658752, 665059, 671141, 676780, 682258, 687288, 690896, 692570, 692858, 692548, 691801, 690241, 687437, 683246, 678051, 672646, 667481, 662218, 656557, 651138, 646927, 643929, 641348, 638836, 636699, 634943, 633111, 631218, 629965, 629827, 630659, 632317, 634963, 638574, 642792, 647326, 651964, 656251, 659936, 663604, 668001, 672777, 676792, 679702, 682240, 684809, 686864, 687984, 688639, 689486, 690590, 691682, 692556, 693013, 693037, 693106, 693663, 694304, 694291, 693795, 693702, 694207, 694660, 694905, 695603, 697112, 699213, 702203, 706945, 713426, 720497, 727600, 735562, 745003, 755051, 764366, 772434, 779165, 784212, 787562, 789896, 791511, 791625, 789523, 785657, 780850, 775187, 768546, 761587, 755277, 749884, 745098, 740634, 736137, 731102, 725551, 720133, 714874, 708583, 700285, 690649, 681118, 672205]
59133F72205q690q550p985p213o537n789m905m178l583k699j551o10K24J708M040
59118F15887O410Q057R022R660J0212J0986J2147J3192J3340J2472J1092R509
59106G41986P910O900O939P366O994N624M002K504R32n41j497k205l286m496n084
59091G74048n163n351n227l738j285K47j08j414k644l981n687p144p799q053q457
59076G08244q951r311r568r544q888p926p468p496p102o060n316n407n512m743
59062F04952l487k769k987l807m676n090m836m288l930l563k718j710j333j570
59048E58188j584j092n94k62K48P69O47l5m34l90n51r00n74M77J113Q20N56J148
59030E57550K134K897L721M980O401P847R718J1869J3259J3481J3577J4415J5282
$$ y = [672205, 663515, 654965, 646980, 639767, 633230, 627441, 622536, 618358, 614775, 612076, 610525, 609915, 610139, 611847, 615887, 622297, 630354, 639376, 649036, 659248, 670234, 682381, 695573, 708913, 721385, 732477, 741986, 749896, 756796, 763735, 771101, 778095, 783719, 787721, 790225, 791157, 790616, 789119, 786914, 783628, 779132, 774048, 768885, 763534, 758307, 754569, 753284, 753531, 753423, 752009, 749365, 745384, 739697, 732553, 724754, 716701, 708244, 699293, 689982, 680414, 670870, 661982, 654056, 646588, 639092, 631990, 625930, 620614, 615207, 609695, 604952, 601465, 598696, 595709, 591902, 587226, 582136, 577300, 573012, 569082, 565519, 562801, 561091, 559758, 558188, 556604, 555512, 554918, 554656, 554904, 555673, 556320, 556285, 555851, 555461, 554910, 554010, 553436, 553913, 555026, 555846, 556402, 557550, 559684, 562581, 566302, 571282, 577683, 585530, 595248, 607117, 620376, 633857, 647434, 661849, 677131]
59017F77131J4983J3456J1372Q943O088L176P48j121k522l381l843m329m710m153
59003G11838k391l72R96J999L402N168O609P321P343O805N854M638L157J512K37
58988G64116k78o49j930m102o052p063p293o791n301l321j948j263j52J813L629
58973G23415M586N371O723Q270R546J0964J2748J3998J3864J2845J1979J1464
58961H45773J0926J0291R508Q116N907L417J086j461m674q227j1469j4041j5713
58948H39439j6404j6674j7236j7602j6446j3870j1910j1855j2371j1396q882o419
58936F78374m973m250l772l381k998k717k814l104k826j748o82l44m07l21k58
58921F43779n67j027j350j662j862j336l1J014J065P98J230K263L171L774M354
$$ y = [677131, 692114, 705570, 716942, 725885, 731973, 735149, 735897, 734776, 732254, 728873, 725030, 720701, 715991, 711838, 709447, 709075, 710071, 712070, 715472, 720640, 727249, 734570, 741913, 748718, 754572, 759210, 762367, 763879, 764116, 763838, 763189, 761259, 757157, 751105, 744042, 736749, 729958, 724657, 721336, 719388, 718125, 717973, 719786, 723415, 728001, 733372, 740095, 748365, 757911, 768875, 781623, 795621, 809485, 822330, 834309, 845773, 856699, 866990, 876498, 884614, 890521, 893938, 895024, 893563, 888889, 880662, 869193, 855152, 839439, 823035, 806361, 789125, 771523, 755077, 741207, 729297, 717442, 705071, 693675, 684793, 678374, 673401, 669151, 665379, 661998, 659000, 656283, 653469, 650365, 647539, 645791, 645109, 644765, 644358, 644037, 643779, 643212, 642185, 640835, 639173, 637311, 635975, 635944, 636958, 638023, 638821, 640051, 642314, 645485, 649259, 653613]
58906F53613M941N491O263P400Q694J0170J2119J4182J5350J5356J5020J4769
58894G83368J4003J2639J1921J2673J4020J4927J5941J8090K1002K3373K4513
58883I66470K4383K2824J9908J6404J2856Q885M304M4l075n690q857j2406j5354
58870A030696j7269j8208j8075j7033j5804j4649j2920j0589r095r412j0311j0034
58858H67297q816q275q996j0237j1420j2345j2457j1448j0245r966j0183r577
58846G43332q082o926o772p192p816q698r493r438q469p423p043p334p871q118
58832F32657p680o685n666m838l992l299l246l368k307J29K269K906L007L908
58818F03795N170N686N696O039O390O007N422N531N680M593K673J494J323J047
$$ y = [653613, 658554, 664045, 670308, 677708, 686402, 696572, 708691, 722873, 738223, 753579, 768599, 783368, 797371, 810010, 821931, 834604, 848624, 863551, 879492, 897582, 918584, 941957, 966470, 990853, 1013677, 1033585, 1049989, 1062845, 1071730, 1076034, 1076078, 1073003, 1067313, 1058456, 1046050, 1030696, 1013427, 995219, 977144, 960111, 944307, 929658, 916738, 906149, 897054, 887642, 877331, 867297, 858481, 850206, 841210, 830973, 819553, 807208, 794751, 783303, 773058, 763092, 752909, 743332, 735250, 728324, 721552, 714360, 706544, 697846, 688353, 678915, 670446, 663023, 655980, 648646, 640775, 632657, 624977, 618292, 612626, 607788, 603796, 600497, 597251, 593883, 591576, 591705, 593974, 596880, 599887, 603795, 608965, 614651, 620347, 626386, 632776, 638783, 644205, 649736, 655416, 660009, 662682, 664176, 665499, 666546]
58804F66546L20j14j79p47j963k906l184l408l904m265m362m574m827m644m197
58789F23592m185m507m212k905j106Q13K945M942O023O184O449P561R122J0234
58775F60950J0376R484P752N470K746n10m112p452j0122j2119j3174j2749j1141
58762F25399r628q778p689n697l666k518j680l11J029J399J244J511J854J381
58748E93850M92K41N18N32O13J673L287M179M370N064O458P378P205O568O043
58733F48471N581N329N691O415O703O301N584M764L990L766M246M569M002L145
58719G18557K884K887K510K382L448N100N955N933N927N924N292M353L797K983
58705G77932P38k471n112p006r144j1502j3154j4358j6213j8273j8761j7422j5892
$$ y = [666546, 666866, 666752, 666573, 665826, 663863, 660957, 657773, 654365, 650461, 646196, 641834, 637260, 632433, 627789, 623592, 619407, 614900, 610688, 607783, 606677, 607490, 610435, 615377, 621400, 627584, 634033, 641594, 650716, 660950, 671326, 680810, 688562, 694032, 696778, 696268, 692156, 684704, 674582, 662463, 649289, 636540, 625399, 615771, 606993, 599304, 593607, 589941, 587423, 585743, 585432, 586461, 587860, 589104, 590615, 592469, 593850, 594342, 594583, 595101, 595633, 596246, 597919, 601206, 605385, 609755, 614819, 621277, 628655, 635860, 642428, 648471, 654052, 659381, 665072, 671487, 678190, 684491, 690075, 694839, 698829, 702595, 706841, 711410, 715412, 718557, 721441, 724328, 726838, 729220, 732668, 737768, 743723, 749656, 755583, 761507, 766799, 771152, 774949, 777932, 778670, 776199, 771087, 764081, 754937, 743435, 730281, 715923, 699710, 681437, 662676, 645254, 629362]
58692F29362j4990j3790j1865j0267r495q473o515m645m056m531n183n584n528
58679E24440m747l419k181j343p94n17l84K04J433K384K483K929N108Q227J0405
58664E44228J1605J3275J5379J6104J4647J2114R308N693J009l809p793j0561
58652F21199j1673j0997r754r478r895r450p910o564n980n484m819m346l625j831
58638E19393L57J408J436J927L024L408K937K890L380L042J663N83N7j138k918
58623E41449l406k027n33j7N76J895K674K024J087J156K113L682O117Q578R078
58608E74446P195M894L614K603J161J85K32J96o66j401j350j537k613l385k829
58593E80745j779j232p03L77J382J966L048N021O691P421Q482J0781J2961J3354
$$ y = [629362, 614372, 600582, 588717, 578450, 568955, 560482, 553967, 549322, 545266, 540735, 535552, 529968, 524440, 519693, 516274, 514093, 512750, 511956, 511439, 511055, 511259, 512692, 515076, 517559, 520488, 525596, 533823, 544228, 555833, 569108, 584487, 600591, 615238, 627352, 636660, 642353, 643362, 639553, 631760, 621199, 609526, 598529, 588775, 579297, 569402, 559952, 552042, 545478, 539498, 534014, 529195, 524849, 521224, 519393, 519750, 521158, 522594, 524521, 527545, 530953, 533890, 536780, 540160, 543202, 544865, 545448, 545505, 544367, 541449, 538043, 536016, 535483, 535466, 536042, 537937, 540611, 542635, 543722, 544878, 546991, 550673, 556790, 565368, 574446, 581641, 586535, 590149, 592752, 593913, 594098, 594330, 594526, 593860, 592459, 591109, 589572, 586959, 583574, 580745, 578966, 577734, 577031, 577408, 578790, 580756, 583804, 588825, 595516, 602937, 611419, 622200, 635161, 648515]
58579F48515J2335J1211J0206R014Q001P428O715N696N447O696Q684J0590J2694
58566G63232J5250J7653J9751K2399K5764K8608L0215L1318L2200L1656K8861
58555A046907K4558J9457J3329O659J177k424n305p953q965p745o134n821o141
58542A061599o107o622q904j2460j6330k0648k5294k8685k9600k8742k7149k4621
58530H26437k1125j7944j5853j3907j1378r113p610n782l209j426j352j504o13
58517G15621J91l06j043q24p09j943l367l361k685k942l668l442k513k067j975
58502F84967j473r52j070j213o94k28n17p25q7N01K96M40J926L556L991M182N600
58485F98500P584Q709R306J0473J1971J3290J5208J8168K0587K1043K0588K0626
$$ y = [648515, 660850, 672061, 682267, 691281, 699282, 706710, 713425, 719121, 724568, 731264, 739948, 750538, 763232, 778482, 796135, 815886, 838285, 864049, 892657, 922872, 954190, 986390, 1018046, 1046907, 1071465, 1090922, 1104251, 1110910, 1112087, 1109663, 1104358, 1096405, 1087440, 1079695, 1073561, 1067740, 1061599, 1055492, 1048870, 1039966, 1027506, 1011176, 990528, 965234, 936549, 906949, 878207, 851058, 826437, 805312, 787368, 771515, 757608, 746230, 737117, 729507, 723725, 720516, 719090, 717738, 716234, 715621, 715812, 715506, 714463, 713639, 712930, 710987, 707620, 704259, 701574, 698632, 694964, 691522, 689009, 686942, 684967, 683494, 682542, 681472, 680259, 679565, 679337, 678820, 678095, 678008, 678509, 678805, 679245, 681171, 684727, 688718, 692900, 698500, 706084, 714793, 724099, 734572, 746543, 759833, 775041, 793209, 813796, 834839, 855427, 876053]
58473H76053K0025J6853J1488N626m13o842j2208j4760j5047j4734j3942j1969
58461H40130r479p556n592k442J325M490P388J0888J4251J6172J6839J6854J5387
58448I18655J1552O412J529l256q541j3271j6037j7155j7446j6419j3726j0800
58436H21497q877o972l939q62Q92K054L648M758M649M989P338J0321J2084J3467
58422H65047J5741J7340J6050J2723R542O382K142k080m580o249q776j1242j1881
58409I00159j1556j2035j2420j0995r012q826r629q932o990n947n657m274k039
58396G91847o59J79J973M034M525L963M079M324L102J345J060J489N60r32o10
58381H20279J065J682J247J614K547K486K319M162P166Q674Q828R768J1094J0520
$$ y = [876053, 896078, 912931, 924419, 930045, 929632, 922790, 910582, 895822, 880775, 866041, 852099, 840130, 830651, 823095, 817503, 815061, 816386, 820876, 828264, 839152, 853403, 869575, 886414, 903268, 918655, 930207, 936619, 938148, 934892, 926351, 913080, 897043, 879888, 862442, 846023, 832297, 821497, 812620, 805648, 801709, 800847, 801739, 803793, 807441, 812199, 816848, 821837, 829175, 839496, 851580, 865047, 880788, 898128, 914178, 926901, 936443, 942825, 944967, 942887, 938307, 932058, 923282, 912040, 900159, 888603, 876568, 864148, 853153, 844141, 835315, 825686, 816754, 809764, 803817, 798160, 793886, 791847, 791188, 791367, 793340, 797374, 801899, 805862, 809941, 814265, 817367, 818712, 819772, 821261, 821821, 820889, 820279, 821344, 823026, 824273, 825887, 828434, 830920, 833239, 837401, 844567, 853241, 862069, 871837, 882931, 893451]
58367H93451Q514P908R274J0758J1977J3953J5800J5704J4630J4923J5905J5042
58355A047839J2636J0985R723O631K418l7o95j807l034j979P83K201K086L152
58341A090902N767P486P734Q430J0010J1243J2652J5617J8601J8891J7521J7672
58329A242526J8997J8506J6266J4845J3823J0489N491K234R67r12l119k835m09
58316A336869J104J718L905O725O824N072N775R284J1734J2099J3017J4688J4586
58303A443400J3396J4443J7119J7555J5957J6214J8194J7852J5249J4842J7252
58292A621473J8425J7635J8481K1122K1575J9792K0354K3865K5757K4997K5726
58281A859202K8777K9948K8429K8527L1176L2149L0683L1324L5151L7736L7914
$$ y = [893451, 901965, 909873, 919147, 929905, 941882, 955835, 971635, 987339, 1001969, 1016892, 1032797, 1047839, 1060475, 1071460, 1081183, 1087814, 1090232, 1090195, 1089500, 1087693, 1084659, 1082680, 1083463, 1085664, 1087750, 1090902, 1096669, 1104155, 1111889, 1120319, 1130329, 1141572, 1154224, 1169841, 1188442, 1207333, 1224854, 1242526, 1261523, 1280029, 1296295, 1311140, 1324963, 1335452, 1340943, 1343177, 1344144, 1343232, 1340113, 1337278, 1336869, 1337973, 1339691, 1343596, 1350321, 1357145, 1362217, 1367992, 1377276, 1389010, 1401109, 1414126, 1428814, 1443400, 1456796, 1471239, 1488358, 1505913, 1521870, 1538084, 1556278, 1574130, 1589379, 1604221, 1621473, 1639898, 1657533, 1676014, 1697136, 1718711, 1738503, 1758857, 1782722, 1808479, 1833476, 1859202, 1887979, 1917927, 1946356, 1974883, 2006059, 2038208, 2068891, 2100215, 2135366, 2173102, 2211016]
58270B211016L9898M4553M7365M7340M8960N3160N5487N5457N8098O3866O6812
58259B792012O5363O4972O7286O7120O3171O1212O3292O4408O3249O5367P2033
58248C509485P7030P8351Q1866Q9618R5931R9025J04626J14124J21433J25508
58238D496997J33142J45232J53832J57325J64326J77675J89350J96484K07036
58229F021399K23794K38802K49937K66422K91094L14384L33027L56979L90188
58220H686026M23405M54063M93394N45024N97441O47405P08842P88231Q74518
58211A4218349R64611J074146J210719J363115J530760J736119J993695K297248
58203B6388762K653124L092617L633870M269019N009958N908201P009853Q337554
$$ y = [2211016, 2250914, 2295467, 2342832, 2390172, 2439132, 2492292, 2547779, 2603236, 2661334, 2725200, 2792012, 2857375, 2922347, 2989633, 3056753, 3119924, 3181136, 3244428, 3308836, 3372085, 3437452, 3509485, 3586515, 3664866, 3746732, 3836350, 3932281, 4031306, 4135932, 4250056, 4371489, 4496997, 4630139, 4775371, 4929203, 5086528, 5250854, 5428529, 5617879, 5814363, 6021399, 6245193, 6483995, 6733932, 7000354, 7291448, 7605832, 7938859, 8295838, 8686026, 9109431, 9563494, 10056888, 10601912, 11199353, 11846758, 12555600, 13343831, 14218349, 15182960, 16257106, 17467825, 18830940, 20361700, 22097819, 24091514, 26388762, 29041886, 32134503, 35768373, 40037392, 45047350, 50955551, 57965404, 66302958]
58195F6302958R939527J1900528J4275999J7079853K0367671K4245400K8741991
58188A92853927L3735001L8933566M3568384M5832197M3014467L3078549J6707729
58181D47723820k309842j9144354l0690989l6659571l8539937l7978053l6000912
58174B46400162l3135176k9723506k6065665k2438357j9070741j6092904j3523979
58167H6349834j1334396r500463p990426o744866n707488m852149m158166l586227
58159C2475653l101016k693354k359252k079089j835604j630602j465469j324543
58151A5986724j194252j079888r87380r05999q24389p47167o80990o19732n57436
58142H389491n01089m56818m17149l74925l36740l10235k90474k70695k54413
$$ y = [66302958, 76242485, 88143013, 102419012, 119498865, 139866536, 164111936, 192853927, 226588928, 265522494, 309090878, 354923075, 397937542, 431016091, 447723820, 445413978, 426269624, 395578635, 358919064, 320379127, 282401074, 246400162, 213264986, 183541480, 157475815, 135037458, 115966717, 99873813, 86349834, 75015438, 65514975, 57524549, 50779683, 45072195, 40220046, 36061880, 32475653, 29374637, 26681283, 24322031, 22242942, 20407338, 18776736, 17311267, 15986724, 14792472, 13712584, 12725204, 11819205, 10994816, 10247649, 9566659, 8946927, 8389491, 7888402, 7431584, 7014435, 6639510, 6302770, 5992535, 5702061, 5431366, 5176953]
58133E176953k45240k36288k21157k04790j92887j81237j65661j51827j44737
58124C433129j38618j27522j16176j10279j05665r7237q9368q7079q5651p9353
58114B396181p2386p0832p1314o7777o2536o0670n9916n5842n1113n0221n0454
58103A723120m7141m2677m1715m2246l9820l6036l4893l4986l2873l0059k9451
58092A311223k9142k6402k3631k3799k4364k2066j9274j9200j9492j7107j4856
58081A071890j6444j9374j9479j8288j9203k0556j9240j7337j8302k0105j8847
58070H64715j5894j5000j5489j4539j3093j3380j3668j1486r023r361j0434q724
58058G14624n891n673p152p220o942r175j2282j2513j0523r731j0090r171p449
$$ y = [5176953, 4931713, 4695425, 4474268, 4269478, 4076591, 3895354, 3729693, 3577866, 3433129, 3294511, 3166989, 3050813, 2940534, 2834869, 2737632, 2648264, 2561185, 2475534, 2396181, 2323795, 2252963, 2181649, 2113872, 2051336, 1990666, 1930750, 1874908, 1823795, 1773574, 1723120, 1675979, 1633302, 1591587, 1549341, 1509521, 1473485, 1438592, 1403606, 1370733, 1340674, 1311223, 1282081, 1255679, 1232048, 1208249, 1183885, 1161819, 1142545, 1123345, 1103853, 1086746, 1071890, 1055446, 1036072, 1016593, 998305, 979102, 958546, 939306, 921969, 903667, 883562, 864715, 848821, 833821, 818332, 803793, 790700, 777320, 763652, 752166, 743143, 733782, 723348, 714624, 708733, 703060, 695908, 688688, 681746, 672571, 660289, 647776, 637253, 627522, 617432, 608261, 600812]
58045F00812p010o880n033l070l615n137m628l347m422o770o955n386n033n611
58031E27915m642k966l658o370p971p928q220q842q168o918p109p973p336n933
58017D33881n982o700n697l699l319m276m283l515l808m487l502j597j004j133
58003C80879j5J305N16j112n12J565J760J54JJ836K902K269J778J836R10o19o36
57986C94817N20K96j413k119j398j530l057l911l391l192l814l666k392j599j747
57971C62404j520o95m98r09o73j1k56r55n71K91k89j720j569P9O71l90j119r30
57953C51340j495l154m113l706l179k805j557L3J39q78o37J159K249J890J948
57938C37234L274M455M915N895P604Q614Q879J0061J2025J2350J0289P999O772
$$ y = [600812, 593802, 586922, 581889, 578819, 575204, 570067, 565439, 562092, 557670, 550900, 543945, 538559, 533526, 527915, 523273, 520307, 516649, 510279, 502308, 494380, 486160, 477318, 469150, 462232, 455123, 447150, 439814, 433881, 427899, 421199, 415502, 411803, 408484, 404208, 399925, 396410, 392602, 388115, 384613, 383016, 382012, 380879, 380864, 382169, 382685, 381573, 381061, 382626, 384386, 384540, 384541, 386377, 389279, 391548, 393326, 395162, 396072, 395453, 394817, 395337, 395633, 394220, 392101, 390703, 389173, 386116, 382205, 378814, 375622, 371808, 368142, 365750, 364151, 362404, 360884, 360189, 359691, 358782, 358109, 358098, 357842, 356887, 356316, 356607, 356318, 354598, 353029, 353108, 353779, 353389, 352270, 351340, 349845, 346691, 342578, 338872, 335693, 332888, 331331, 331364, 331503, 330625, 329988, 331147, 333396, 335286, 337234, 340508, 344963, 349878, 355773, 363377, 371991, 380870, 390931, 402956, 415306, 425595, 433594, 440366]
57925D40366N260K550m8j590k940m458n042m699n185o812p394n745l603k655k181
57910C95824j158k25k4K28R99J298N54l07q04j935m076n819o129n872n984n967
57894C60603n281m547m294m048l519l148k793j563L55J463J209P72R75J264J274
57879C38722J558K096J915Q23k30r99k183l425l288j834r90j539j848n59J481
57864C29700K859L345L119K134J054J108K268L197L503M137N203N499M845M598
57850C76569N093M870L271J588P22j22j441k399k778l717n385o140n283m405m673
57835C55770m942m117l320l903n094n369m737m011l224k202j499j376j058j07
57821C10811O81P19O54R69J024M28j05j92n23j250j358o65p27k467m525n260m911
$$ y = [440366, 445626, 448176, 448128, 446538, 443598, 439140, 434098, 429399, 424214, 417402, 410008, 404263, 400660, 398005, 395824, 394666, 394441, 394417, 394645, 395644, 396942, 397496, 397189, 396385, 394450, 390374, 384555, 378426, 372554, 366570, 360603, 355322, 350775, 346481, 342433, 338914, 335766, 332973, 331410, 331765, 333228, 334437, 335209, 336184, 337448, 338722, 340280, 342376, 344291, 345114, 344884, 343885, 341702, 338277, 334989, 333155, 332165, 330626, 328778, 328219, 329700, 332559, 335904, 339023, 341157, 342211, 343319, 345587, 348784, 352287, 356424, 361627, 367126, 371971, 376569, 381662, 386532, 389803, 391391, 392113, 391991, 390550, 388151, 385373, 381656, 376271, 370131, 364848, 360443, 355770, 350828, 346711, 343391, 339488, 334394, 329025, 324288, 320277, 317053, 314851, 313352, 311976, 310918, 310811, 311492, 312211, 312865, 313834, 314858, 315286, 315181, 314989, 314466, 313216, 311858, 311193, 310466, 307999, 303474, 298214, 293303]
57804B93303m508m105l359k608k144j644j175j378j890j214Q72K574K769K546
57790B78039L031L602L607L902N047N828N233M377M680N610N895N609N462N299
57776C45221M920N009N710N629L911J901J166J129L81j010k193l284m634n528
57762C58328n399n219n906o510n807m607m535n418n800n308m631l870k703j510
57748B91105p25K72K050L675L996L514L329L154K169J017R48J629J754J377J667
57733C20931K663L175K767K137J686J263J114J509J653N10j385k457k293j904
57719C31369j974k253k619l261l816l568k610j723j289j265j939l446m850m996
57705B91760m172l695l948m052l412k398j430m59N10J304J991K717L127K660J240
$$ y = [293303, 288795, 284690, 281331, 278723, 276579, 274935, 273760, 272382, 270492, 269278, 270150, 272724, 275493, 278039, 281070, 284672, 288279, 292181, 297228, 303056, 308289, 312666, 317346, 322956, 328851, 334460, 339922, 345221, 350141, 355150, 360860, 366489, 370400, 372301, 373467, 374596, 374977, 373967, 371774, 368490, 363856, 358328, 352929, 347710, 341804, 335294, 329487, 324880, 320345, 314927, 309127, 303819, 299188, 295318, 292615, 291105, 290380, 290652, 292702, 296377, 300373, 303887, 307216, 310370, 312539, 313556, 314504, 316133, 317887, 319264, 320931, 323594, 326769, 329536, 331673, 333359, 334622, 335736, 337245, 338898, 339408, 338023, 335566, 333273, 331369, 329395, 327142, 324523, 321262, 317446, 313878, 311268, 309545, 308256, 306991, 305052, 301606, 296756, 291760, 287588, 283893, 279945, 275893, 272481, 270083, 268653, 268194, 268704, 270008, 271999, 274716, 277843, 280503, 281743]
57690B81743p47k896m634n286m897m406m294l840k464r58k24L29J913M487P040
57675B60866R294J1862J5099J8947K3546K9027L5011M1345M8764N7593O5898O9812
57663F87064O5501N0813K6430l133l0639n0173o0360o3209o0934n5064m7449l9963
57651D18884l3251k7124k1919j8186j5453j2707r882p627n964m479l427l296l496
57638B52073k893j423m4O75P68J27j111j900j375l21j77q91j296j205j516k290
57622B37201k474j707r55j078j874k782l422l373k467j354q45p85m03M44J291
57607B15417J925K322K136J380R97J563J961Q32j234k506k696l032l950m486m050
57592B06579l227k627k267k170k380k438k025j809k389k802j732J52Q90J26o05
$$ y = [281743, 280996, 278100, 273466, 268180, 263283, 258877, 254583, 250743, 248279, 247321, 247097, 247426, 249339, 253826, 260866, 270160, 282022, 297121, 316068, 339614, 368641, 403652, 444997, 493761, 551354, 617252, 687064, 752565, 803378, 829808, 826675, 796036, 745863, 685503, 622294, 561360, 506296, 458847, 418884, 385633, 358509, 336590, 318404, 302951, 290244, 280362, 272735, 266771, 262292, 258865, 255569, 252073, 249180, 247757, 247713, 248388, 249156, 249283, 248172, 246272, 244897, 244576, 244399, 243508, 242212, 241007, 239491, 237201, 234727, 233020, 232065, 230987, 229113, 226331, 222909, 219536, 217069, 215715, 214870, 214085, 213682, 214126, 215417, 217342, 219664, 221800, 223180, 224177, 225740, 227701, 228533, 227299, 224793, 222097, 219065, 215115, 210629, 206579, 203352, 200725, 198458, 196288, 193908, 191470, 189445, 187636, 185247, 182445, 180713, 180865, 181755, 181881, 181276]
57577A81276n42o24j465k277k461k588l100l455l205k758k499k248k021k214k679
57562A47140k685k003j123l10M49O74l5p75k26J231J860J229P86J523K723L532
57546A53990M088M490M140K905J628Q77M01K42R96K393L064K362J213N28N4n58
57530A82813r15q14q52j346j752j755j868k362k691k560k401k225j298L71J496
57515A61841J256N12M32Q58Q65J38q58j487j242j59Q58R52N59O81J064N56p38
57498A66088j420j230j523k784l596l015k130k069k169j481n97n59j088j346j419
57483A39662j714j846j369q04q37j232j506j705j720r04N16R08n97k487k802j761
57467A19802j018j119j289j133r42o17K46J330J795J479R76O65M39K12K3j57l01
$$ y = [181276, 180734, 180110, 178645, 176368, 173907, 171319, 168219, 164764, 161559, 158801, 156302, 154054, 152033, 149819, 147140, 144455, 142452, 141329, 141019, 141468, 142142, 142107, 141332, 141106, 142337, 144197, 145426, 146212, 147735, 150458, 153990, 158078, 162568, 166708, 169613, 171241, 172118, 172519, 172761, 173757, 176150, 179214, 181576, 182789, 183317, 183371, 182813, 181898, 181084, 180232, 178886, 177134, 175379, 173511, 171149, 168458, 165898, 163497, 161272, 159974, 160345, 161841, 163097, 163609, 164041, 164899, 165764, 165902, 165044, 163557, 162315, 162156, 163014, 163966, 164525, 165206, 166270, 166826, 166088, 164668, 163438, 161915, 159131, 155535, 152520, 150390, 148321, 146152, 144671, 144074, 143515, 142427, 141081, 139662, 137948, 136102, 134733, 133929, 133092, 131860, 130354, 128649, 126929, 126025, 126541, 127449, 126852, 124365, 121563, 119802, 118784, 117665, 116376, 115243, 114301, 113684, 113930, 115260, 117055, 118534, 119510, 120175, 120614, 120826, 120849, 120692, 120391]
57450A20391k50j07j33l0Q17K062K435J575O48N09M92q2n35j15N34N45M27J044
57432A30227J858J743Q79L42K81n0p59j186j068p06k04M67Q98P52M28L84K67l51
57414A34202r47q77n79p65r58j44J429K444K317J635R50K83k51m02l54n23q54
57397A36606j079j305j636j529n29P45J292J114R72J144J341J585K073K465K290
57382A45549J865J914K472K973L163L068K485J393M98K94J01r66k411k941k356
57367A57101j646j393j262j067j093j275j092m17K91P45J021J095Q47M89L33K83
57351A52960J60J76N02P84Q54J257K258K924K282Q75L1RL5k52n96r68j391j314
57333A60586l87N08L56k64j1J020J499J072O74O71L81l50p64o71p82j126p11O71
$$ y = [120391, 120141, 120034, 119901, 119871, 120688, 122750, 125185, 126760, 127408, 127917, 128409, 128327, 127792, 127677, 128211, 128756, 129183, 130227, 132085, 133828, 134707, 135049, 135330, 135280, 134521, 133335, 132267, 131561, 131357, 131824, 132722, 133474, 133902, 134286, 134553, 134202, 133255, 132378, 131799, 131034, 130076, 129932, 131361, 133805, 136122, 137757, 138707, 138990, 138739, 138337, 137983, 137460, 136606, 135527, 134222, 132586, 131057, 130528, 131273, 132565, 133679, 134651, 135795, 137136, 138721, 140794, 143259, 145549, 147414, 149328, 151800, 154773, 157936, 161004, 163489, 164882, 165380, 165674, 165775, 164809, 162398, 159457, 157101, 155455, 154062, 152800, 151733, 150640, 149365, 148273, 147856, 148147, 148892, 149913, 151008, 151855, 152344, 152677, 152960, 153120, 153296, 153798, 154582, 155436, 156693, 158951, 161875, 164157, 165032, 165063, 165072, 165107, 164855, 164259, 163291, 161900, 160586, 160199, 160707, 161063, 160799, 160788, 161808, 163307, 164379, 165053, 165724, 166105, 165755, 164991, 164320, 163538, 162412, 161701, 162372]
57315A62372J778J709J090P97O64K63j16j33j33m37o34k79K73M25K20R5K41N53
57297A68748Q69Q74L29m48p42l94J7N4j6K07O83J086J154P80J69j50O3K65j62
57278A73386r10j122o20l3J61M7j23k6P76K154K988K441J325J156K029K697K560
57261A88886K230K067J598P69L97Q80J492J518J187J023J092J271J537J705J578
57246B09230J501J972K679K796K359K287K891L355K977K011J065N79R43K134L185
57231B41964L032K038J565K022K558K742L098L734L947L599L544M159M781N120
57217B87903N819P042P908P942P794P823P423O497O146O880P566P178O352O082
57203C86355O126N990O246P493Q954R556R667J0338J1514J2344J2692J3049J3363
$$ y = [162372, 164150, 165859, 166949, 167746, 168410, 168673, 168557, 168424, 168291, 167854, 167220, 166941, 167214, 167639, 167859, 167954, 168195, 168748, 169617, 170491, 170820, 170372, 169630, 169236, 169253, 169307, 169291, 169498, 170181, 171267, 172421, 173201, 173370, 173220, 173283, 173548, 173386, 172476, 171354, 170734, 170701, 170862, 170909, 170786, 170760, 171536, 173690, 176678, 179119, 180444, 181600, 183629, 186326, 188886, 191116, 193183, 194781, 195550, 195947, 196827, 198319, 199837, 201024, 202047, 203139, 204410, 205947, 207652, 209230, 210731, 212703, 215382, 218178, 220537, 222824, 225715, 229070, 232047, 234058, 235123, 235702, 236645, 238779, 241964, 244996, 247034, 248599, 250621, 253179, 255921, 259019, 262753, 266700, 270299, 273843, 278002, 282783, 287903, 293722, 300764, 308672, 316614, 324408, 332231, 339654, 346151, 352297, 359177, 366743, 373921, 380273, 386355, 392481, 398471, 404717, 412210, 421164, 430720, 440387, 450725, 462239, 474583, 487275, 500324, 513687]
57190E13687J3214J2788J2521J2152J1264J0417J0622J1897J3339J4369J5043
57179F51313J5350J5284J5405J6379J7941J9076J9259J8890J8646J8864J9441
57168H45848J9852J9515J8510J7600J7264J7167J6948J6831J7057J7380J7689
57157A041661J8398J9628K0709K1146K1355K1715K1804K1272K0719K0780K1157
57146A270344K1443K2001K3083K3915K3870K3713K4369K5312K5591K5720K6858
57135A536219K8649K9677K9906L0819L3006L5298L6711L7800L9553M2010M4589
57124A924237M6916M9021N1293N4467N8966O4304O9798P5665Q2623R0762R9857
57113B667909J10468J23543J39081J56533J76408K00174K28628K61711K99988
$$ y = [513687, 526901, 539689, 552210, 564362, 575626, 586043, 596665, 608562, 621901, 636270, 651313, 666663, 681947, 697352, 713731, 731672, 750748, 770007, 788897, 807543, 826407, 845848, 865700, 885215, 903725, 921325, 938589, 955756, 972704, 989535, 1006592, 1023972, 1041661, 1060059, 1079687, 1100396, 1121542, 1142897, 1164612, 1186416, 1207688, 1228407, 1249187, 1270344, 1291787, 1313788, 1336871, 1360786, 1384656, 1408369, 1432738, 1458050, 1483641, 1509361, 1536219, 1564868, 1594545, 1624451, 1655270, 1688276, 1723574, 1760285, 1798085, 1837638, 1879648, 1924237, 1971153, 2020174, 2071467, 2125934, 2184900, 2249204, 2319002, 2394667, 2477290, 2568052, 2667909, 2778377, 2901920, 3041001, 3197534, 3373942, 3574116, 3802744, 4064455, 4364443]
57104D364443L44913L97675M59504N33081O21698P26688Q47744R86274J146174
57095A0428194J330438J539126J771219K025088K295048K570806K843311L108498
57087B7911728L362053L594134L793647L949845M032297L962510L621725K915229
57079E7143168J850882N63859p35302j848883k659172l147958l374627l431894
57071D4360073l401114l327930l225667l093646k931193k741138k529333k304714
57063B0805338k077910j857851j650196j458866j287059j135926j003836q88190
57055I445504p87406p00751o27344n65961n14947m71727m33308l97865l65131
57046D581064l34943l06401k78935k53166k29892k09051j90310j73722j59058
$$ y = [4364443, 4709356, 5107031, 5566535, 6099616, 6721314, 7448002, 8295746, 9282020, 10428194, 11758632, 13297758, 15068977, 17094065, 19389113, 21959919, 24803230, 27911728, 31273781, 34867915, 38661562, 42611407, 46643704, 50606214, 54227939, 57143168, 58994050, 59557909, 58822607, 56973724, 54314552, 51166594, 47791967, 44360073, 40958959, 37631029, 34405362, 31311716, 28380523, 25639385, 23110052, 20805338, 18727428, 16869577, 15219381, 13760515, 12473456, 11337530, 10333694, 9445504, 8658098, 7957347, 7330003, 6764042, 6249095, 5777368, 5344060, 4946195, 4581064, 4246121, 3939720, 3660785, 3407619, 3177727, 2968676, 2778366, 2604644, 2445586]
57037B445586j45316j31761j18732j06646r5089q3804p3578o4855n6228m5983
57027A523594l4686k4466j5590n942M763J1618P481j0104l5731o0179p7073q5460
57015A198225q7223q4044p7286o9065o1541n5308m9626m4124l9222l5006l0966
57004E64814k7042k3812k1347j8994j6649j5095j4640j4464j3792j2835j1959
56993C74185j0928r511p938o233l977j228J368L803O885J0519J3115J3427J1815
56980C95302Q825M011k603r173j3667j6005j7188j7293j5820j3322j1035r308
56968B82724p736o335n209l623r43K026M122N885Q878J3235J7469K0618K2782
56955C53893K3494K1232J5193O369l448j2563j9260k2241k1902k0150j8392j6469
$$ y = [2445586, 2300270, 2168509, 2049777, 1943131, 1848042, 1764238, 1690660, 1625805, 1569577, 1523594, 1488908, 1464442, 1448852, 1442910, 1447673, 1459291, 1466772, 1456668, 1420937, 1360758, 1283685, 1198225, 1111002, 1026958, 949672, 880607, 819066, 763758, 714132, 670008, 630786, 595780, 564814, 537772, 513960, 492613, 473619, 456970, 441875, 427235, 412771, 398979, 386144, 374185, 363257, 353746, 345808, 339575, 335598, 334370, 335738, 339541, 346426, 356945, 370060, 383487, 395302, 404127, 408138, 405535, 396362, 382695, 366690, 349502, 332209, 316389, 303067, 292032, 282724, 274988, 268653, 263444, 259821, 258878, 260904, 265026, 270911, 279789, 293024, 310493, 331111, 353893, 377387, 398619, 413812, 420181, 416733, 404170, 384910, 362669, 340767, 320617, 302225, 285756]
56943B85756j3839j0777p866n131k315N50L400O447R930J3827J8104K2864K7908
56930C48858L2255L4145L1587K3499J0846l388j5849k4512k8961k9802k8264k5760
56918C24654k3060k0124j7060j4590j2986j1472r471p720p092p030o368n136m311
56905A78234m098l825l285k924k682j903m93Q27J554J899K222K715L502M459N202
56890A81404N956P833J1375J5322J7947J9053J9395J8629J5423R512K277m695
56878C19431j0397j3908j4600j3084j0825q596o237l754j368J364N202R856J4280
56865B67364J8352K3006K8522L4045L9160M4597N0633N5508N5919M8888L3583
56854F99577J2510r121k6264l6785m1290m1060l7292l1619k5608j9580j3042o224
$$ y = [285756, 271917, 261140, 253274, 248143, 245828, 246378, 249778, 256225, 266155, 279982, 298086, 320950, 348858, 381113, 415258, 446845, 470344, 481190, 477802, 461953, 437441, 408480, 378678, 350414, 324654, 301594, 281470, 264410, 249820, 236834, 225362, 215891, 208171, 201079, 194049, 187681, 182545, 178234, 174136, 170311, 167026, 164102, 161420, 159517, 159024, 159851, 161405, 163304, 165526, 168241, 171743, 176202, 181404, 187360, 195193, 206568, 221890, 239837, 258890, 278285, 296914, 312337, 321849, 324126, 319431, 309034, 295126, 280526, 267442, 256617, 248021, 241784, 238030, 236662, 238026, 243228, 253084, 267364, 285716, 308722, 337244, 371289, 410449, 455046, 505679, 561187, 617106, 665994, 699577, 712087, 702966, 676702, 639917, 598627, 557567, 520275, 488656, 463048, 443468, 430426, 424202]
56842D24202J12O093J2675K0278K8701L8172M8986O0465P1674Q2537R2013R5323
56830I81231Q5890O1319K6311j0697m2443o4688p6232p8820p5801o9648o1257
56819F75165n1600m2257l3803k5309j6239p391P30Q950J7942K7101L5858M4830
56807F33977N4507O3424O8209O4866N0422K5317n114l3086n3314o4933o9021o6611
56795F68643n9711n1726m4913l8695l1682k4117j7146j1029n502p28L350P728
56783C94472J3260J9643K6215L2508L7023L6775K9523J6016o77j7106l0249l8054
56771E19349m0590l9923l7871l4781l0837k7106k4217k1445j8272j5563j4045
56760B14699j2957j1412r829q738p495n576l996l853m502m625m143l676l142k323
$$ y = [424202, 424314, 430407, 443082, 463360, 492061, 530233, 579219, 639684, 711358, 793895, 885908, 981231, 1067121, 1128440, 1154751, 1144054, 1101611, 1036923, 960691, 881871, 806070, 736422, 675165, 623565, 581308, 547505, 522196, 505957, 498566, 499296, 508246, 526188, 553289, 589147, 633977, 688484, 751908, 820117, 884983, 935405, 960722, 955608, 922522, 869208, 804275, 735254, 668643, 608932, 557206, 512293, 473598, 441916, 417799, 400653, 389624, 384122, 383394, 386744, 394472, 407732, 427375, 453590, 486098, 523121, 559896, 589419, 605435, 604758, 587652, 557403, 519349, 478759, 438836, 400965, 366184, 335347, 308241, 284024, 262579, 244307, 228744, 214699, 201742, 190330, 180501, 171763, 164268, 158692, 154696, 150843, 146341, 141716, 137573, 133897, 130755, 128432]
56746A28432j827k008j895p00N79N96k27o30o26r59j310q77o7J02j89r2J99l9
56728A18462l52K04J081Q39m19j087m98M61J173K031L043L308K429J262P65R67
56712A33669J376J659J679J522J491J662J647J349J389K061K495J847P51M50R50
56697A55997J209P99J80n07j615k921l468k761j420n51p71j730k288j570j16O78
56681A39145N16N74J419J939J197Q5j54J48K4k54N1M00j40r00l29J532L058L406
56663A51717L178K821J981O87k56m43l26k89k11q8j79m04l46N6M59O97Q58R76
56645A60888J119J423J640J224L40l3M58R11O45J68j51r84k477l159k007m27l62
56628A59216j482k034j699j565j854j803j520j930k932l365k855k195j864j581
$$ y = [128432, 126605, 124597, 122702, 122002, 122581, 123177, 122950, 122320, 121694, 120735, 119425, 118548, 118481, 118583, 118394, 118302, 118501, 118462, 118110, 118314, 119395, 120234, 119815, 118728, 118230, 118691, 119864, 121895, 124938, 128246, 130675, 131937, 132702, 133669, 135045, 136704, 138383, 139905, 141396, 143058, 144705, 146054, 147443, 149504, 151999, 153846, 154597, 155047, 155997, 157206, 158005, 158185, 157678, 156063, 153142, 149674, 146913, 145493, 144942, 144171, 142441, 140153, 138583, 138467, 139145, 139661, 140235, 141654, 143593, 144790, 144875, 144721, 144869, 144893, 144639, 144690, 145090, 144950, 144050, 143721, 145253, 148311, 151717, 154895, 157716, 159697, 160384, 160128, 159685, 159359, 159070, 158859, 158771, 158592, 158188, 157842, 157898, 158357, 159054, 159912, 160888, 162007, 163430, 165070, 166294, 166634, 166601, 167059, 167970, 168615, 168783, 168632, 167648, 165171, 162012, 160005, 159578, 159216, 157734, 155700, 154001, 152436, 150582, 148779, 147259, 145329, 142397, 139032, 136177, 133982, 132118, 130537]
56614A30537j237r57m38N68J389J332R30R70R54Q7r09p38J79L22m11p87n10l84
56596A30897l35N99K203K995K484J728J394J042N70O32J268J646J537J554J762
56581A51976J533R01O36P71N75L7j18J03M3o7O44J823K106J431J303K438L819
56564A69954M582N162O046O893P540Q520J0063J1605J2524J2331J0320O416K265
56551B74221p2n70q56j625k132k184k465k835k348j377j509k802l270j954n38
56536B47684q45k401l604l889l709l445l251l182k940k376k226l205m396m065
56522B04150k202n76r2J27P20J034P15N67J001J230P32J28o3k51p25j076j152
56505B04267j307j376p54K04L33m94j155j142j058j073o47l1k40j155j529j187
$$ y = [130537, 129300, 128343, 127905, 128473, 129862, 131194, 132124, 133094, 134048, 134135, 133226, 132488, 132667, 132989, 132578, 131791, 131281, 130897, 130562, 131161, 133364, 136359, 138843, 140571, 141965, 143007, 143577, 144209, 145477, 147123, 148660, 150214, 151976, 153509, 154410, 155046, 155817, 156392, 156429, 156311, 156414, 156457, 156390, 157034, 158857, 160963, 162394, 163697, 166135, 169954, 174536, 179698, 185744, 192637, 200177, 208697, 218760, 230365, 242889, 255220, 265540, 271956, 274221, 274149, 273579, 272723, 271098, 268966, 266782, 264317, 261482, 259134, 257757, 256248, 253446, 250176, 248222, 247684, 246839, 244438, 240834, 236945, 233236, 229791, 226540, 223358, 220418, 218042, 215816, 212611, 208215, 204150, 201948, 201372, 201280, 201407, 202127, 203161, 203876, 204443, 205444, 206674, 207406, 207534, 207471, 207220, 206495, 205419, 204267, 202960, 201584, 200830, 201034, 201367, 200873, 199718, 198576, 197518, 196445, 195798, 195767, 195527, 194372, 192843, 191656]
56489A91656j210j587r14Q63J786Q71l33k63M52N27n5p46j487j990j514k47N57
56472A86366N13N04O61j5j261j148P72K181J350k86o02M6K4p24j001m60K45P29
56454A87894Q94N14k65p86r36j298j693j088M45J305Q05K89Q10J447J131M99N87
56437A90554J114J386J586J896J689Q01L09Q72J569J455J010R55R86O95M93O01
56421B07971M06l05p34n14k66j08O75J862K075J162P24J402J818J207P95J270
56405B19440J297P5r07l77N80O89O12J028Q65n45j543o64P68Q47J01LJ92l64q96
56386B21201o5J446J964J420Q51L29m78q48j35O15J87p02o38K46J056J847K650
56369B30946K298L18j327p21R83J302Q5q80r29o83l3J555L184L234J728J87m48
$$ y = [191656, 190446, 188859, 187945, 188808, 190594, 191465, 191132, 190869, 191321, 191848, 191793, 191047, 189560, 187570, 186056, 185809, 186366, 186879, 187383, 188044, 188029, 186768, 185620, 186392, 188573, 189923, 189637, 189035, 189081, 189105, 188381, 187380, 186920, 187165, 187894, 188788, 189302, 189037, 188251, 187315, 186017, 184324, 183236, 183681, 184986, 185791, 186080, 186890, 188337, 189468, 189967, 190554, 191668, 193054, 194640, 196536, 198225, 199026, 199335, 200207, 201776, 203231, 204241, 205196, 206182, 206877, 207370, 207971, 208377, 208072, 207338, 206824, 206558, 206450, 207125, 208987, 211062, 212224, 212948, 214350, 216168, 217375, 218170, 219440, 220737, 220812, 219905, 219528, 220108, 220797, 221409, 222437, 223302, 222757, 221214, 220550, 221318, 222165, 222266, 222269, 222461, 222097, 221201, 221136, 222582, 224546, 225966, 226817, 227146, 226668, 225820, 225685, 226300, 226487, 225785, 225147, 225393, 226449, 228296, 230946, 233244, 233562, 232235, 231514, 232497, 233799, 233884, 233004, 232075, 231392, 231359, 232914, 236098, 239332, 241060, 241247, 240799]
56352B40799k38P51K172K884K240J176P10M13k42m09N81J595J453J016J552K428
56336B58881K405J935K043K210J559R49J592K709K792K227K385L084L234L057
56322B91062L397L746L121K104J848J970J454P38P97J175R68O68J065J475J152
56307C16740J114K312L449L050K234K809L996L947L288L977N592N812M152K307
56293C64779J289Q73J271K734L966L547K380K418L604M534N180O386P503P303
56279D17767O460O445O803O248N591O559Q503R328R097R630J0982J1508J1138
56266E26059J1566J3271J5078J6498J8067J9702K1221K3736K8013L2370L5032
56255G60613L7597M2903N0369N6909O1974O8077P6476Q5811R4991J04134J12618
$$ y = [240799, 240561, 241312, 243484, 246368, 248608, 249784, 250494, 250907, 250665, 250256, 250837, 252432, 253885, 254901, 256453, 258881, 261286, 263221, 265264, 267474, 269033, 269982, 271574, 274283, 277075, 279302, 281687, 284771, 288005, 291062, 294459, 298205, 301326, 303430, 305278, 307248, 308702, 309440, 310237, 311412, 312380, 313048, 314113, 315588, 316740, 317854, 320166, 323615, 326665, 328899, 331708, 335704, 339651, 342939, 346916, 352508, 358320, 362472, 364779, 366068, 366941, 368212, 370946, 374912, 378459, 380839, 383257, 386861, 391395, 396575, 402961, 410464, 417767, 424227, 430672, 437475, 443723, 449314, 455873, 464376, 473704, 482801, 492431, 503413, 514921, 526059, 537625, 550896, 565974, 582472, 600539, 620241, 641462, 665198, 693211, 725581, 760613, 798210, 841113, 891482, 948391, 1010365, 1078442, 1154918, 1240729, 1335720, 1439854, 1552472]
56244A552472J19283J24683J30159J34848J36566J35266J32397J27168J17019
56235B709861J01858Q4288O5465M4218K0697k597k4105m4443o3652q0073r2726
56224B718791j02339j09482j14012j16487j17757j17156j13552j08006j02832
56215A717168r8270r2783q6267q0146p4563o8491o2291n7328n3262m8683m4012
56204I51072m0775l8421l5062l0926k7855k5841k3365k0659j9169j8221j5873
56193F54905j2704j1117j1106j0436q710p598p218o118m625m388m786l687j554
56180E60858q89j780j995j334j642k700k352p11j4l50K33J499J398N22J518M012
56164E56273M980M175M389O050O664N964O503Q534R422Q826R384J1506J2661J2497
$$ y = [1552472, 1671755, 1796438, 1926597, 2061445, 2198011, 2333277, 2465674, 2592842, 2709861, 2811719, 2896007, 2961472, 3005690, 3026387, 3023790, 2999685, 2955242, 2891590, 2811517, 2718791, 2616452, 2506970, 2392958, 2276471, 2158714, 2041558, 1928006, 1820000, 1717168, 1618898, 1526115, 1439848, 1359702, 1285139, 1216648, 1154357, 1097029, 1043767, 995084, 951072, 910297, 871876, 836814, 805888, 778033, 752192, 728827, 708168, 688999, 670778, 654905, 642201, 631084, 619978, 609542, 600832, 593234, 586016, 579898, 575273, 570885, 566099, 562412, 560858, 559969, 558189, 556194, 554860, 553218, 550518, 548166, 547455, 547441, 547091, 547324, 548823, 550221, 550743, 552261, 556273, 561253, 565428, 569817, 575867, 582531, 588495, 594998, 603532, 612954, 621780, 631164, 642670, 655331, 667828]
56150F67828J3516J5903J7077J7236J9778K5171L0015L3344L8192M5512N2426
56139I75998N8180O5939P6730Q7138R5098J02211J08183J08701J01601R0091P7588
56128A947458O4636N2981M6807M6788M7848M5559M0129L2057J9649L677j0722
56117B336867j9992k5660k9849l2562l5598m3330n6543p0535q1931r1996j00755
56106A748116j03987r9575r1319q2967p3700o2751n2948m5956l9146l0831k3626
56095A041310j9339j5612j0949p783p161n774j829J440J715J651L463M878M207
56082I90217M002N867O998N690M935O768Q420P826P471R064R990Q809Q522J0675
56068A095254J2086J1162J1334J4235J5993J4368J3164J5126J7045J6348J5864
$$ y = [667828, 681344, 697247, 714324, 731560, 751338, 776509, 806524, 839868, 878060, 923572, 975998, 1034178, 1100117, 1176847, 1263985, 1359083, 1461294, 1569477, 1678178, 1779779, 1869870, 1947458, 2012094, 2065075, 2111882, 2158670, 2206518, 2252077, 2292206, 2324263, 2343912, 2347589, 2336867, 2316875, 2291215, 2261366, 2228804, 2193206, 2149876, 2093333, 2022798, 1940867, 1848871, 1748116, 1644129, 1544554, 1453235, 1370268, 1296568, 1233817, 1180869, 1134913, 1095767, 1064936, 1041310, 1021971, 1006359, 995410, 987627, 980466, 974692, 972863, 974303, 976018, 977669, 981132, 986010, 990217, 994219, 1000086, 1007084, 1012774, 1017709, 1024477, 1032897, 1040723, 1048194, 1057258, 1067248, 1076057, 1084579, 1095254, 1107340, 1118502, 1129836, 1144071, 1160064, 1174432, 1187596, 1202722, 1219767, 1236115, 1251979]
56057A251979J7398J7484J4373J2364J4065J5414J3521J2280J4658J6731J5296
56046A415563J4175J6794J9596J9188J8935K1992K4790K4032K3223K5652K7918
56035A651858K7023K6766L0302L3615L3218L2986L6456L9916M0145M1107M5609
56024B039001M8490M5853M2922M4790M7583M6882M6438N0128N3801N3783N4732
56013B574403O0342O5286O5402O6479P3460Q0544Q2012Q2903Q8712R4527R5318
56002C429388R6799J04743J13683J17696J21928J31690J41141J44945J49734J61391
55992D713138J72875J77893J84089J98774K14672K24536K36220K57573K80604
55983F660374K97302L16422L47027L80587M08118M39106M83625N32328N75461
$$ y = [1251979, 1269377, 1286861, 1301234, 1313598, 1327663, 1343077, 1356598, 1368878, 1383536, 1400267, 1415563, 1429738, 1446532, 1466128, 1485316, 1504251, 1526243, 1551033, 1575065, 1598288, 1623940, 1651858, 1678881, 1705647, 1735949, 1769564, 1802782, 1835768, 1872224, 1912140, 1952285, 1993392, 2039001, 2087491, 2133344, 2176266, 2221056, 2268639, 2315521, 2361959, 2412087, 2465888, 2519671, 2574403, 2634745, 2700031, 2765433, 2831912, 2905372, 2985916, 3067928, 3150831, 3239543, 3334070, 3429388, 3526187, 3630930, 3744613, 3862309, 3984237, 4115927, 4257068, 4402013, 4551747, 4713138, 4886013, 5063906, 5247995, 5446769, 5661441, 5885977, 6122197, 6379770, 6660374, 6957676, 7274098, 7621125, 8001712, 8409830, 8848936, 9332561, 9864889, 10440350]
55974A0440350O24514O92433P70455Q48521R39711J058821J196906J344651J520078
55965A9436440J744222K012800K323443K705331L187322L765116M438448N250425
55957D4863547O249612P450998Q882267J0625315J2756326J5295528J8279543
55950A24403136K1814137K5963412L0637701L5602450M0289779M3232621M1887834
55943C63831070L3852174J8972484K87449j7478318l0614747l7929848m0234854
55936B90685410l9030056l5722153l1457740k7058272k2954121j9293435j6134074
55929I9035559j3496137j1319620r502442p984916o742585n725864m871239m153385
55921C5239371l571474l099575k697058k351966k070778j839109j631413j446257
$$ y = [10440350, 11064864, 11757297, 12527752, 13376273, 14315984, 15374805, 16571711, 17916362, 19436440, 21180662, 23193462, 25516905, 28222236, 31409558, 35174674, 39613122, 44863547, 51113159, 58564157, 67446424, 78071739, 90828065, 106123593, 124403136, 146217273, 172180685, 202818386, 238420836, 278710615, 321943236, 363831070, 397683244, 416655728, 416943177, 399464859, 368850112, 330920264, 290685410, 251655354, 215933201, 184475461, 157417189, 134463068, 115169633, 99035559, 85539422, 74219802, 64717360, 56732444, 49989859, 44263995, 39392756, 35239371, 31667897, 28568322, 25871264, 23519298, 21448520, 19609411, 17977998, 16531741]
55913A6531741j295637j171074j053372r44202q56520p84230p11084o39737n83673
55904H492212n39179m92089m44189m07469l79405l48102l15276k91341k73781
55895E001381k52066k28252k12072k01028j85156j66451j54541j47853j37199
55886C316763j23532j14761j09271r9433q7337q0872p8327p2575o6345o7714p4201
55875B342395p6494p4497p4961p6783p3455o7090o5430o7293o4841n8086n3821
55864A589644n2222m7614m0670l7180l6351l2600k7368k7143l1038l2047k9367
55853A196044k8317k9221k7526k3893k3412k5535k5095k2416k2367k4413k3551
55842I20298k0251j9656k1607k1089j7977j6946j8186j7380j4493j3640j4619
$$ y = [16531741, 15236104, 14065030, 13011658, 12067456, 11210936, 10426706, 9715622, 9075885, 8492212, 7953033, 7460944, 7016755, 6609286, 6229881, 5881779, 5566503, 5275162, 5001381, 4749315, 4521063, 4308991, 4107963, 3922807, 3756356, 3601815, 3453962, 3316763, 3193231, 3078470, 2969199, 2869766, 2782429, 2701557, 2623230, 2550655, 2484310, 2416596, 2342395, 2265901, 2191404, 2116443, 2039660, 1966205, 1899115, 1833685, 1766392, 1701551, 1643465, 1589644, 1537422, 1489808, 1449138, 1411958, 1375607, 1343007, 1315639, 1288496, 1257458, 1225411, 1196044, 1167727, 1138506, 1110980, 1087087, 1063675, 1038140, 1013045, 990629, 968262, 943849, 920298, 900047, 880391, 858784, 837695, 819718, 802772, 784586, 767206, 752713, 739073, 724454]
55831G24454j3264r923r039j0586j0150p303n956o687o485n678p425j0703j1368
55818F09887r714r654j1123j0646q667q834j0646j0229p748o719o763m513r29
55805E03702j38j573q23K248L786L748N624Q795R021O487N535O228M044j465n507
55790E49712o357p466j0142j1348j0035q898q552o390k639j195l177n463o566
55777D61484q155r924r075n746l150j488K417Q745J3836J6355J8089J7973J1975
55764E13336M56j0515j6893k0147k1836k0747j7175j4291j3099j1082p618n651
55752C54738o343p054o338o045o886o692m857l843m572m796l521k701l078k762
55738B85250j304p71j536j344J18J92j903l601l659l876m874m698l082k683m421
$$ y = [724454, 711190, 701267, 692228, 681642, 671492, 664189, 658233, 651546, 645061, 639383, 631958, 621255, 609887, 600173, 590519, 579396, 568750, 560083, 551249, 540603, 530374, 522626, 515907, 509144, 504631, 503702, 503564, 501991, 501168, 503416, 507202, 510950, 516574, 525369, 534390, 540877, 546412, 552640, 556684, 555219, 549712, 543355, 535889, 525747, 514399, 504364, 495466, 486914, 480524, 477885, 476690, 473513, 468050, 461484, 453329, 443405, 434330, 428584, 425434, 423946, 426363, 435108, 448944, 465299, 483388, 501361, 513336, 513792, 503277, 486384, 466237, 444401, 423654, 406479, 392188, 379089, 368007, 360389, 354738, 348395, 341341, 335003, 328958, 322072, 315380, 310523, 306680, 302108, 297312, 293791, 291090, 288012, 285250, 283946, 283175, 281639, 280295, 280413, 280605, 278702, 275101, 271442, 267566, 262692, 257994, 254912, 252229, 247808]
55723B47808n762n249m675n195n249l899k437j387L84K529L117K507L305N580
55709B31377O490N497N309O478O013K892J64m50j371m334p183p869p681q109q149
55694B19074p026o071n853m884k949k189l042k890o38J113N96j33R81K692L291
55679A92072L504M251M514L701L210L628L240J199o67j084j407k689l591l025
55665B06856k092j653q02O53J143L02R1J394K500K396K409L134L053J809J401
55650B22594K410K458M16j407j301r69k081l413l731m247n656o035m318k894l925
55635A87901n792n962m827m039l452k417j885k570l080k163q82m75k64L94M19
55620A50906o86j259l62L35m06r87l6P84l51k086k222j315j262k005k275k042
$$ y = [247808, 242046, 236797, 232122, 226927, 221678, 217779, 215342, 213955, 214339, 216868, 219985, 222492, 225797, 231377, 237867, 243364, 248673, 255151, 261164, 264056, 264220, 263770, 262399, 258065, 250882, 243013, 235332, 227223, 219074, 212048, 205977, 200124, 195240, 192291, 190102, 187060, 184170, 183532, 184645, 185241, 185108, 186089, 188781, 192072, 195576, 199827, 204341, 208042, 211252, 214880, 218120, 219319, 218652, 217568, 216161, 213472, 209881, 206856, 204764, 203111, 202309, 202962, 204105, 204407, 204498, 205892, 208392, 210788, 213197, 216331, 219384, 221193, 222594, 225004, 227462, 227878, 226471, 225170, 224201, 222120, 218707, 214976, 210729, 205073, 199038, 194720, 191826, 187901, 182109, 176147, 171320, 167281, 163829, 161412, 159527, 156957, 153877, 151714, 150832, 150357, 150093, 150487, 150906, 150220, 148961, 148599, 148934, 148528, 147541, 147505, 148289, 147938, 145852, 143630, 142315, 141053, 139048, 136773, 134731]
55604A34731j875j391l99oo52q54K46R83j59j975k604k249j824r65N07J174K72
55587A22960n37J74J095N45n14k28J076J890K095K438K830L029L618M669N109
55572A50249M898N743Q065R627R066Q315R241J0346R327O683M059J161k753o207
55558B27820p380p185p657q611q641q078q163q389p365n457m118l431k601j875
55544A38869j905k087j566q91q40p67jN62J27k15N81J406Q77k07m97n83j483k223
55526A29157j516m31p76k041k500k200k287k483j811r19j124j927j910j316j418
55511A04498k117k339k085j995j776j060p58j588k372j908j233j732k477j902
55497G9156q03q50j355n24J037J173j01o78J36J002J231J436J629J116K84K11
$$ y = [134731, 132856, 131465, 131066, 131060, 130408, 129554, 129800, 130783, 130624, 128649, 126045, 123796, 121972, 121007, 121514, 122688, 122960, 122423, 122597, 123692, 124237, 123723, 123495, 124571, 126461, 128556, 130994, 133824, 136853, 140471, 145140, 150249, 155147, 160890, 168955, 178582, 187648, 195963, 205204, 215550, 224877, 231560, 235619, 236780, 234027, 227820, 220440, 213255, 205598, 196987, 188346, 180268, 172105, 163716, 156351, 150894, 146776, 143345, 140744, 138869, 136964, 134877, 133311, 132420, 131580, 130813, 130812, 131374, 131501, 131286, 131867, 133273, 134150, 133943, 133446, 132863, 131380, 129157, 127641, 127210, 126434, 124393, 121893, 119693, 117406, 114923, 113112, 112193, 111069, 109142, 107232, 105916, 104498, 102381, 100042, 97957, 95962, 94186, 93126, 92368, 90780, 88408, 86500, 85267, 83535, 81058, 79156, 78353, 77503, 76148, 75624, 76661, 77834, 77733, 77055, 77191, 78193, 79424, 80860, 82489, 83605, 83889, 84100]
55481H4100O48M65j61l7P70J107Q09O97P81M14r2P8N60M17j77n36r84j905k163
55462H4791o89J229J523M46k21l23j070k185k056n72O61R23J013J283J265J093
55446H7111J300J398N95m08l86J52j95j069r04K55Q11L08k51n28j005j265l99
55429H5520R44J273P97R44J573J186j06n10M02J095Q48O79J002P86k83r29l51
55412I4870O61J264J539J490P51l17p81o68q08j159r53m02n18j218j445j096r62
55395I0248r20k03N67p9j777k441j383j69L7j80j81k33l00K24R60O90n07j066
55377H3287m09K71J53j51k38o65j426j415k15J178J982K497K810K335J182M46
55361I1622N25N94J98j09r8l05p46p25l34n21j271j296j13J129J406R88M20k58
$$ y = [84100, 84748, 85213, 85052, 85015, 85785, 86892, 87701, 88398, 89179, 89593, 89501, 89579, 90139, 90556, 90379, 89843, 88859, 86954, 84791, 84102, 85331, 86854, 87300, 87079, 86756, 85686, 83501, 81445, 80873, 81534, 82457, 83470, 84753, 86018, 87111, 88411, 89809, 90404, 89996, 89610, 89762, 89567, 88498, 87594, 87849, 88660, 88968, 88717, 88189, 87184, 85919, 85520, 86464, 87737, 88534, 89478, 91051, 92237, 92131, 91621, 92023, 93118, 93966, 94645, 95647, 96433, 96150, 95221, 94870, 95531, 96795, 98334, 99824, 100575, 100258, 99477, 98809, 98001, 96842, 95889, 95487, 94969, 93751, 92306, 91210, 90248, 89328, 89125, 89692, 89613, 87836, 85395, 84012, 83843, 83880, 83700, 83519, 83286, 82986, 83210, 84170, 84860, 84353, 83287, 82878, 83149, 83302, 83151, 82913, 82248, 80822, 79407, 79192, 80370, 82352, 84849, 87659, 89994, 91176, 91622, 92147, 92741, 92939, 92830, 92732, 92427, 91681, 90956, 90622, 90101, 88830, 87534, 87421, 88550, 89956, 90944, 91364, 91106]
55343I1106p97p03k43k72p55q11k89R1J56K93K13n78j220m68Q81P84o93j292k36
55324H5167O07K8n72K40J571J832J004Lp46j001l73O91J028N92O70J567J859Q40
55306I5007j02K59J035Q13j77q28q61n60J23J061J470R23K9n77r88j230q74j5
55288I4508M88L56K88N64N94K74K82N62J09j044j409l63P48Q02N48R84J637J637
55270A01565J131N58k24j079j177m54r6n93q03n7M19m54j613j496m62O7j17j90
55252I4925Nl7l16m70n89q26p22M7P79N80l79j257j607j456r31l93k84l26K30
55233H6973J201J435O33n3M8R4n16q39p4P80M02p36j219q34l97j69J88M78J38
55214H7533o54j100q15p9O81J070R22P40J307K367K553J274k26m61L93J030P48
$$ y = [91106, 90309, 89606, 89363, 89091, 88336, 87525, 87236, 87327, 87483, 87776, 87989, 87411, 86191, 85723, 86604, 87388, 86695, 85403, 85167, 85774, 85802, 85230, 85470, 87041, 88873, 89877, 89880, 89134, 88133, 87760, 88451, 89479, 90071, 90741, 92308, 94167, 95007, 94905, 95164, 96199, 97012, 96835, 96007, 95146, 94586, 94709, 95770, 97240, 98163, 98192, 97615, 96627, 95397, 94523, 94508, 94996, 95352, 95640, 96204, 96798, 97072, 97354, 97916, 98025, 96981, 95572, 95209, 95957, 96759, 97307, 98291, 99928, 101565, 102696, 103254, 103030, 101951, 100774, 100320, 100224, 99631, 98828, 98771, 99190, 98736, 97123, 95627, 95165, 95232, 95115, 94925, 94930, 94893, 94577, 94107, 93518, 92692, 91970, 92017, 92796, 93376, 92997, 91740, 90133, 88677, 87746, 87353, 87069, 86743, 86973, 88174, 89609, 90242, 90189, 90237, 90331, 89815, 88976, 88902, 89682, 90084, 89348, 88129, 87295, 86898, 86729, 86917, 87395, 87533, 86879, 85779, 84964, 84885, 85566, 86636, 87558, 88298, 89605, 91972, 94525, 95799, 95573, 95112, 95505, 96535, 97283]
55197I7283j04q10q01nQ13P38l2m05j23p7o05q30l03Q9k99p51n39j33j30j52J90
55176I3014L94J59K08R58J516J079K76j3oq9K27J142J510M75q44q77J3K18o15
55157I8745j382j340p82j00N21P74N10J35J8L4J59P64J567J398n0j312j109j48
55139I8402K23J51O41J605K081J757J017oj132j585r99l45n91j183j106o82q52
55122I7396j326j122l79j8J3N19J310J321M28k93k04K40N28O60O74N19M26N41
55104A01233M80J2k28L21J089J264J241J842K612K338J015j05l63k23n1L82J026
55087A13885J337J137P97M99J72K3K98N57J04r30j729j878j559r34j15M21K80
55070A12365k28o33j020j493j476n76M13M83k9q6L18L70L3J4K33j39j036j305
$$ y = [97283, 97179, 96369, 95568, 95563, 96376, 97114, 97082, 96677, 96554, 96477, 95872, 95042, 94739, 94828, 94529, 93778, 93239, 93106, 92976, 92824, 93014, 93408, 93567, 93775, 94733, 96249, 97328, 97604, 97591, 97585, 97496, 97723, 98865, 100375, 100850, 100006, 99129, 99142, 99360, 98745, 97363, 96023, 95241, 95141, 95662, 96436, 96946, 97081, 97099, 97133, 97292, 98056, 99623, 101021, 100971, 99659, 98550, 98402, 98625, 98776, 99417, 101022, 103103, 104860, 105877, 105871, 104739, 103154, 102155, 101810, 101219, 100036, 98930, 98248, 97396, 96070, 94948, 94569, 94551, 94564, 95083, 96393, 97714, 98142, 97849, 97645, 97885, 98413, 99073, 99747, 100266, 100692, 101233, 101713, 101725, 101497, 101818, 102907, 104171, 105412, 107254, 109866, 112204, 113219, 113114, 112751, 112528, 112477, 112859, 113885, 115222, 116359, 117156, 117655, 117827, 117850, 118148, 118705, 118809, 117879, 116150, 114272, 112713, 111779, 111664, 112085, 112365, 112137, 111504, 110484, 108991, 107515, 106939, 107352, 107835, 107806, 107720, 108038, 108408, 108441, 108455, 108688, 108549, 107513, 106208]
55052A06208m81M66N90J45j32o6R4J92J98J59K55N32N53j81j485k562k802k146
55034I9537r63P3L03k21o96n39j0N15J139J795J837R77l6m53n00n37j46R00J655
55015A04630J164J2n50l82j51J29Q19J458J269N86L67O07N42J67J46L92J94l35
54997A11064l28L49R53J192J500J887J782J063K26n11j241j656j306n21K2M33
54981A14908J174J817J500M72j36j4J27m2j77l17q82j504j271k65M76N45N30P07
54963A17648O92N47Q06J226Q46l84j347j413j100q04j99P13J198R47N12K15k60
54946A19843q55q79k24K68J46KL13O64O32M67M28L08M5k2J45K19L56J152K452
54927A25460L263L182K929L118L513L900M522N287N587N468N842O951P581O558
$$ y = [106208, 105727, 106193, 106783, 106928, 106796, 106730, 106824, 107016, 107214, 107373, 107628, 108160, 108713, 108532, 107047, 104485, 101683, 99537, 98574, 98647, 98950, 98729, 98033, 97494, 97484, 97999, 99138, 100933, 102770, 103747, 103711, 103258, 102758, 102221, 102075, 102975, 104630, 105794, 105806, 105256, 104874, 104723, 104852, 105671, 107129, 108398, 108984, 109351, 109958, 110500, 110667, 110813, 111205, 111399, 111064, 110736, 111085, 112038, 113230, 114730, 116617, 118399, 119462, 119688, 119177, 117936, 116280, 114974, 114453, 114475, 114908, 116082, 117899, 119399, 119871, 119735, 119721, 119848, 119806, 119629, 119312, 118430, 116926, 115655, 115390, 115866, 116411, 116941, 117648, 118340, 118887, 119693, 120919, 121765, 121381, 120034, 118621, 117521, 116717, 116518, 117231, 118429, 119376, 119888, 120103, 119843, 118988, 118109, 117885, 118153, 118299, 118301, 118614, 119278, 119910, 120377, 120805, 121113, 121158, 121136, 121281, 121500, 121856, 123008, 125460, 128723, 131905, 134834, 137952, 141465, 145365, 149887, 155174, 160761, 166229, 172071, 179022, 186603, 193161]
54913A93161M138J360j139l030m008m330m891o017o831o520n532m827m572m259
54899A42703l696l097k554j975j400r36n84l47k73k09J12O62J171J567J912K012
54883A35068J656J174J151J596K113K785M053N730O966P303O970O160M874L478
54869A91077K476J622J64j936l966n622p131q149p787o055m167k995k222j440
54855A43869j028j407k258l010l396l276k606j870j699j900j691r70m29l37l32
54840A17660m29r69j440q00O31J174J81r16p75J01O07P29R53J073P30K74J20%
54822A18904l02l44Q%p36j213n05O97J104P21M70N08J80o30j270j360j165q69
54804A14198l16N23J360J877J833J134J22m72k54L67P67Q01P01O36O12M40k29
$$ y = [193161, 197299, 198659, 197520, 194490, 190482, 186152, 181261, 175244, 168413, 161893, 156361, 151534, 146962, 142703, 139007, 135910, 133356, 131381, 129981, 129045, 128461, 128114, 127841, 127632, 127744, 128406, 129577, 131144, 133056, 135068, 136724, 137898, 139049, 140645, 142758, 145543, 149596, 155326, 162292, 169595, 176565, 182725, 187599, 191077, 193553, 195175, 195339, 193403, 189437, 183815, 176684, 168535, 160748, 154693, 150526, 147531, 145309, 143869, 142841, 141434, 139176, 136166, 132770, 129494, 126888, 125018, 123319, 121419, 119728, 118758, 118329, 117992, 117660, 117231, 116262, 114822, 114022, 114653, 115827, 116008, 115092, 114317, 114418, 115025, 115754, 116707, 117780, 118510, 118784, 118904, 118904, 118602, 118258, 118266, 118266, 117530, 116317, 115812, 116509, 117613, 118334, 118804, 119312, 119492, 118862, 117592, 116232, 115067, 114198, 113882, 114405, 115765, 117642, 119475, 120609, 120731, 120259, 120005, 120372, 121139, 121940, 122641, 123277, 123889, 124329, 124100]
54787A24100j400k238j885p54j12k71k43M92J113R67P17J189K023K457K568K780
54771A31503K852K431K083K708M190N582O396O991P724Q360Q309P188N263L371
54757B04951K078R05r89l406n241o034o350o506o140n395n160n486n123l515k005
54742A46584j881k410k102j005l18m17o52o87p16o53j93N19J176J890K669K881
54726A44685K278J935K977M727N493M913M283M496M974M809L920K710J368p6j542
54711A91950k959m225n100n507n733n985n951n312m366l610k993k146j174n34
54697A36355l15k35k21m76j003j538j868j942j763j440j116o53J86J044J060N3
54681A26128r54r48j53N07O37N10L39J33r1l67q29j297j279p36l15l93n10k33
$$ y = [124100, 122700, 120462, 118577, 117823, 117711, 117440, 117197, 117689, 118802, 119769, 120486, 121675, 123698, 126155, 128723, 131503, 134355, 136786, 138869, 141577, 145767, 151349, 157745, 164736, 172460, 180820, 189129, 196317, 201580, 204951, 207029, 207934, 206945, 203539, 198298, 192264, 185914, 179408, 173268, 167873, 162713, 157227, 152104, 148589, 146584, 144703, 142293, 140191, 139186, 138868, 138451, 137799, 137112, 136396, 135743, 135550, 136069, 137245, 139135, 141804, 144685, 146963, 148898, 151875, 156602, 162095, 167008, 171291, 175787, 180761, 185570, 189490, 192200, 193568, 193492, 191950, 188991, 184766, 179666, 174159, 168426, 162441, 156490, 151178, 146812, 143202, 140209, 138063, 136889, 136355, 136040, 135805, 135584, 135108, 134105, 132567, 130699, 128757, 126994, 125554, 124438, 123785, 123971, 125015, 126075, 126128, 125174, 124226, 124073, 124580, 125217, 125727, 126066, 126199, 126108, 125741, 124912, 123615, 122336, 121600, 121285, 120892, 120382, 120149]
54663A20149O8n1k58m5L55L91J81K60P16J133J134N91l36j016p71K09R66J079
54645A24755J049J078N68n63j222o75K58M81J49o8k41o22o80qO02K65n01o32j95
54626A23798P0K15O37Q35J43q41j038o62o74r30n26K95M09j59k96J33Q6o24q20
54607A20051K2R47J170J150J337J300Q08N72J067J631J456O55k32r86j400j079
54591A28469j16O23N05j63p64j064r93m45L24P12O22O16R44J093O03k39r24j327
54573A28476j485j309q69m53j32K58N73M08m0O5J009J940J912J079L39K11M21
54556A32403M04j32r46j415j119l35K58L88L66N21P86R14Q10O49Q18J525K332
54539A38227K477J923J497J598J470N04m68l23M96N61l23r77q90r46j692k276
$$ y = [120149, 120217, 120166, 119908, 119863, 120218, 120609, 120790, 121050, 121766, 122899, 124033, 124624, 124288, 123272, 122501, 122710, 123676, 124755, 125804, 126882, 127450, 126887, 125665, 124990, 125248, 125729, 125878, 125810, 125569, 124947, 124267, 124259, 124861, 125126, 124625, 123993, 123798, 123868, 124083, 124720, 125555, 125698, 124857, 123819, 123157, 122483, 121553, 121027, 121322, 121731, 121572, 121276, 121409, 121495, 120871, 120051, 120073, 121020, 122190, 123340, 124677, 125977, 126785, 127357, 128424, 130055, 131511, 132166, 131934, 130948, 129548, 128469, 128353, 128976, 129481, 129318, 128554, 127490, 126497, 126052, 126376, 127088, 127710, 128326, 129270, 130363, 130966, 130727, 129803, 128476, 126991, 125682, 124813, 124360, 124228, 124486, 125059, 125467, 125427, 125492, 126501, 128441, 130353, 131432, 131771, 131982, 132403, 132807, 132675, 131729, 130314, 129195, 128860, 129118, 129506, 129872, 130393, 131179, 132093, 132903, 133552, 134370, 135895, 138227, 140704, 142627, 144124, 145722, 147192, 147696, 147228, 146905, 147401, 147962, 147639, 146662, 145772, 144826, 143134, 140858]
54523A40858j789o58N9R6j26l41n74p36o99n94o41q11q90p68n40m42o83j098j177
54504A28446p16j70L4J48N81J065J023N54K85L42L01m9m99q77j064o72M33J535
54486A30700J805J424J117Q48P9q29p82L53J369J340O64K04K81P39J174R82L9
54469A41507o10J87J892K711K011R92O57N09p9n74k89K72K62j65k55L9J06k93
54451A48880p85j006r30p85q84j263j396p20M20J013P25K67J83J85Nl6K07J93
54433A44273l63p63l67L41M63M5r5L99J084J464J461J246R83P91O83O16O27P14
54415A53602O29J90k26r3M57P40M98R1k76p55j176j038l86P1Nj65j51j78k08L00
54395A51931J419K348K488K171J845J349N45q1r0K25L73L40K58M8k77m83o22r20
$$ y = [140858, 139069, 138411, 138470, 138566, 138440, 138099, 137525, 136789, 136090, 135496, 134855, 134044, 133154, 132386, 131846, 131404, 130721, 129623, 128446, 127730, 127560, 127594, 127742, 128323, 129388, 130411, 130965, 131250, 131592, 131893, 131844, 131345, 130468, 129404, 128732, 129165, 130700, 132505, 133929, 135046, 135894, 135973, 135144, 134362, 134715, 136084, 137424, 138088, 138292, 138573, 139312, 140486, 141468, 141507, 140897, 141084, 142976, 145687, 147698, 148690, 149347, 149856, 149777, 149203, 148914, 149186, 149448, 149283, 149028, 149067, 149173, 148880, 148095, 147089, 146159, 145374, 144490, 143227, 141831, 141111, 141531, 142544, 143269, 143536, 143719, 143904, 143909, 143873, 144080, 144273, 143910, 143147, 142780, 143121, 143584, 143629, 143534, 143933, 145017, 146481, 147942, 149188, 150171, 150962, 151645, 152261, 152888, 153602, 154231, 154421, 154195, 154102, 154559, 155299, 155797, 155888, 155612, 154857, 153681, 152643, 152257, 152328, 152333, 152168, 152017, 151839, 151631, 151931, 153350, 155698, 158186, 160357, 162202, 163551, 164096, 164015, 163925, 164150, 164523, 164863, 165121, 165169, 164892, 164409, 163787, 162867]
54377A62867j043l48P32P95n18j697j376j41O22P04Q10J124J290J310J428J532
54361A68091J531J751K211K200J509J287K457M005M212L106K141J789J058m75
54347A96873j788k057j828j953k345k508k536k846l353l555l192k403j445n65
54333A64499n7j56p73j437j554q70K49J125J394J172O54om36k13M09N46j57j001
54315A63388j252j128j162j213q46k98k19o06q10n44j52P7K11K61M1l93o54m83
54297A54218k4M04N00N5p74j378j231n16J02K68K17L34O96J057J099P67M16M49
54279A56659P53Q30N46L83O91J171J340J117O87J76k14k24k8j63o38p05j6O45
54261A63010M43k60n15j35L41P20J215J666J571R48L99K44K77L01L62L31o6p51
$$ y = [162867, 161824, 161476, 162208, 163003, 162485, 160788, 159412, 159271, 159893, 160597, 161407, 162531, 163821, 165131, 166559, 168091, 169622, 171373, 173584, 175784, 177293, 178580, 181037, 185042, 189254, 192360, 194501, 196290, 197348, 196873, 195085, 193028, 191200, 189247, 186902, 184394, 181858, 179012, 175659, 172104, 168912, 166509, 165064, 164499, 164442, 164286, 163513, 162076, 160522, 159652, 159901, 161026, 162420, 163592, 164246, 164240, 163804, 163591, 164000, 164546, 164389, 163388, 162136, 161008, 159846, 158633, 157787, 157489, 157270, 156664, 155854, 155310, 155158, 155235, 155446, 155707, 155748, 155355, 154701, 154218, 154194, 154598, 155098, 155153, 154379, 153001, 151770, 151254, 151356, 151624, 151841, 152175, 152871, 153928, 155027, 155794, 156210, 156659, 157412, 158242, 158788, 159171, 159862, 161033, 162373, 163490, 164177, 164353, 164139, 163915, 163887, 163724, 163086, 162381, 162365, 163010, 163453, 163193, 162678, 162543, 162884, 163604, 164819, 166485, 168056, 169004, 169403, 169647, 169924, 170225, 170587, 170918, 170852, 170101]
54243A70101j304j504j422j047l76J67M7n84r88q38o13p79j151j279j035m83L75
54226A57287J368J922J562N89r2P0O52Q12K82l56m25O5N78P42O64O36P87R78P82
54207A68903j31j382j916j245k87k88j105j442q07j17j88o57q18o75m68l8O84
54190A58023J160R49M00M6j55m37o00m72m03o76q59m49K76P47R73J258J422J120
54172A62323N73K60J51r3m33o30q12j199j493j236n34J42O31R50Q56K36l90l87
54154A58915J46O52R23J041R24N43K92L84K77n55j671k227k140j838j294k61P94
54137A54905J074O57L84O21J002J294J538J466P58p4j00N94Q71J82o77p92l10
54120A63393nj99n68n92LR45J544J432J083J134J412J278O95K83L31N29O06N91
$$ y = [170101, 168797, 167293, 165871, 164824, 164448, 164615, 164662, 164078, 163090, 162252, 161639, 160860, 159709, 158430, 157395, 156912, 157287, 158655, 160577, 162139, 162728, 162636, 162706, 163358, 164170, 164452, 164096, 163671, 163736, 164314, 165056, 165720, 166356, 167143, 168121, 168903, 168772, 167390, 165474, 164229, 163942, 163654, 162549, 161107, 160300, 160183, 159995, 159338, 158520, 157845, 157377, 157339, 158023, 159183, 160132, 160532, 160578, 160423, 159986, 159386, 158914, 158511, 157835, 156976, 156527, 156803, 157550, 158523, 159781, 161203, 162323, 162896, 163156, 163307, 163214, 162781, 162151, 161339, 160140, 158647, 157411, 156877, 157019, 157650, 158600, 159456, 159692, 159302, 158915, 159061, 159713, 160636, 161677, 162601, 163144, 163436, 163820, 164097, 163542, 161871, 159644, 157504, 155666, 154372, 154111, 154905, 155979, 156636, 157020, 157641, 158643, 159937, 161475, 162941, 163699, 163625, 163525, 164119, 164990, 165172, 164495, 163703, 163393, 163388, 163189, 162621, 162029, 162032, 162977, 164521, 165953, 167036, 168170, 169582, 170860, 171555, 171838, 172169, 172698, 173304, 173895]
54102A73895M02j04o48p57m67j74O3M26O67M20P1M04J315J793J326M60j59m51
54084A78482l93K27J184J717J487J042J031J582K682M453O576Q071Q132O840M801
54069B27914K487K07j722l083l789l814l306k772k628k644k298j604j010o16j86
54054B01136J69R4k47k55J82O05R04J454K240K725K780K849L022K856K400K497
54038B25411L546M860N692O137O537O783O743O705O767O445N500M543M264M542
54024C04475M826M864M526L568K200J365J665K392K364J400L84J5J81L37q7j480
54008C32995l670n835p195p819q279q730q801q299p498o594n406l826k314j612
53994B47117j980k871l487l509l212k918k632k276j954j762j584j367j317j497
$$ y = [173895, 174297, 174193, 173545, 172788, 172321, 172147, 172210, 172636, 173303, 173723, 173794, 174198, 175513, 177306, 178632, 179092, 178933, 178482, 178089, 178316, 179500, 181217, 182704, 183746, 184777, 186359, 189041, 193494, 200070, 208141, 216273, 223113, 227914, 230401, 230608, 228886, 225803, 222014, 218200, 214894, 212122, 209494, 206850, 204552, 202948, 201938, 201322, 201136, 201305, 201399, 201152, 200897, 201079, 201684, 202588, 204042, 206282, 209007, 211787, 214636, 217658, 220514, 222914, 225411, 228957, 233817, 239509, 245646, 252183, 258966, 265709, 272414, 279181, 285626, 291126, 295669, 299933, 304475, 309301, 314165, 318691, 322259, 324459, 325824, 327489, 329881, 332245, 333645, 334029, 334044, 334225, 334562, 334475, 332995, 329325, 323490, 316295, 308476, 300197, 291467, 282666, 274367, 266869, 260275, 254869, 251043, 248729, 247117, 245137, 242266, 238779, 235270, 232058, 229140, 226508, 224232, 222278, 220516, 218932, 217565, 216248, 214751]
53980B14751j547j190p74o99p09l39J55J50k79m80l80o13j285j582q95L68J414
53963B06066J897J796J194N80O96J656K606K740K210J757J809K240K664K670K134
53948B34715J508J423J946K601L141L708M175M144L813M052N200O461O960O820
53934B90667O693O841P194P850Q858R914J0794J1838J3448J5263J6211J5258J1961
53921D32790O709Q12l966o490o860n880m166j980M25K647M261M979M850M359M004
53906D36494L722K970J462n02k372l737m401m412m104l771l483l410l973n154
53892D05329o101o134n788n978o543o673o521p059q293r051q777q216p931p402
53878C04862o150m575l114j794j060j764l542m528l719k423k262k886l003k702
$$ y = [214751, 213204, 212014, 211240, 210541, 209832, 209493, 209648, 209798, 209519, 209039, 208659, 208046, 206761, 205179, 204284, 204652, 206066, 207963, 209759, 210953, 211533, 212229, 213885, 216491, 219231, 221441, 223198, 225007, 227247, 229911, 232581, 234715, 236223, 237646, 239592, 242193, 245334, 249042, 253217, 257361, 261174, 265226, 270426, 276887, 283847, 290667, 297360, 304201, 311395, 319245, 328103, 338017, 348811, 360649, 374097, 389360, 405571, 420829, 432790, 439499, 440311, 436345, 429855, 422995, 417115, 412949, 410969, 411394, 414041, 418302, 423281, 428131, 432490, 436494, 440216, 443186, 444648, 444146, 441774, 438037, 433636, 429224, 425120, 421349, 417866, 414456, 410483, 405329, 399228, 393094, 387306, 381328, 374785, 368112, 361591, 354532, 346239, 337188, 328411, 320195, 312264, 304862, 298712, 294137, 291023, 289229, 288169, 286405, 282863, 278335, 274616, 272193, 269931, 267045, 264042, 261340]
53864B61340l064m069m492l773k690k081j958j976j920j657j289j218j609j971
53850B27573j821j388j074p30j59J57k28p50n35J79L57k62q95j025r37r51q80
53833B16631n79k99j96l2M14R12R68K77q73j633j309k77L21M9k63J06O14M27n0
53814B15208K83J462K371K399K201K664L876N300O277O261N182L828L375M219
53800B64906N559O230N785M774M190M560N348N511M703L630K974K568K091J908
53786C24737K472L254L181K040O63l17j125k183l384m339m945n478o204o993p291
53771B94088o701n543m538l930l394k898k887l346l513l019k527k641k892k612
53757B43647k089k018k340k554k655k834k686j771o24j90n05q68r98j088j003
$$ y = [261340, 258276, 254207, 249715, 245942, 243252, 241171, 239213, 237237, 235317, 233660, 232371, 231153, 229544, 227573, 225752, 224364, 223290, 222560, 222401, 222558, 222330, 221580, 221045, 221224, 221581, 221319, 220424, 219399, 218462, 217511, 216631, 216052, 215753, 215557, 215525, 215939, 216851, 217819, 218096, 217223, 215590, 214281, 214004, 214325, 214374, 214111, 214217, 214831, 215258, 215208, 215491, 216953, 219324, 221723, 223924, 226588, 230464, 235764, 242041, 248302, 253484, 257312, 260687, 264906, 270465, 276695, 282480, 287254, 291444, 296004, 301352, 306863, 311566, 315196, 318170, 320738, 322829, 324737, 327209, 330463, 333644, 335684, 336347, 336030, 334905, 332722, 329338, 324999, 320054, 314576, 308372, 301379, 294088, 287387, 281844, 277306, 273376, 269982, 267084, 264197, 260851, 257338, 254319, 251792, 249151, 246259, 243647, 241558, 239540, 237200, 234646, 231991, 229157, 226471, 224700, 224076, 223886, 223381, 222513, 221515, 220427, 219424]
53742B19424n04m4k08n52o2J220K200K334K130J971J590R18M60M84O75Q23J066
53725B33925J286J106O49M96P55J014J274J959K793K776J687O58P17J532K115
53710B54742K086J737J462J598K317L226L547L046K362K135K362K783L361M009
53696B90773M436M591M792N087N042M443L667L026K310J305K85m02q49j255j518
53681C25733j555j653k069k542k606k165j539j105j065j291j249m66P32J307O44
53666C09111o62j453j264p04o81j432k337k568j920r21k04J1j73n20o05m0Q71
53649B94509J230O80k8j55j7j61j63P28K126K828K492J919J731J752J741J738
53633C12950J582J096P55J193K030K295K088K537L837M735M449L802L749L956
$$ y = [219424, 218920, 218876, 218668, 218116, 218054, 219274, 221474, 223808, 225938, 227909, 229499, 230417, 230877, 231361, 232036, 232859, 233925, 235211, 236317, 236966, 237462, 238217, 239231, 240505, 242464, 245257, 248033, 249720, 250378, 251095, 252627, 254742, 256828, 258565, 260027, 261625, 263942, 267168, 270715, 273761, 276123, 278258, 280620, 283403, 286764, 290773, 295209, 299800, 304592, 309679, 314721, 319164, 322831, 325857, 328167, 329472, 329757, 329355, 328506, 327251, 325733, 324178, 322525, 320456, 317914, 315308, 313143, 311604, 310499, 309434, 308143, 306894, 306428, 307160, 308467, 309111, 308449, 306996, 305732, 305028, 304347, 302915, 300578, 298010, 296090, 295169, 294965, 294976, 294803, 294283, 293678, 293638, 294509, 295739, 296419, 296391, 296236, 296219, 296058, 295895, 296623, 298749, 301577, 304069, 305988, 307719, 309471, 311212, 312950, 314532, 315628, 316383, 317576, 319606, 321901, 323989, 326526, 330363, 335098, 339547, 343349, 347098, 351054]
53619C51054L751L471L793M497M919N143N730O640P219P108O538N918N600N811
53605D27192O390O890P111P216P178O675N781M951M083K459J15j675j976j482
53591D80908j435j954k373k557k873l220l129k669k360k356k426k616l140l726
53577D44074l794l333k902k800k730k365j742j118q26j160k033k815k918k443
53563D11095j904j538j255j114j271j636j930k033j914j396m36N79J179J378J507
53548C99311J602J409Q76L64L31J048K387L655L993L285K396K193K672L435M497
53533D33454O039P643Q562Q681Q599Q772R164R736J0676J1981J3265J4172J4677
53520E65421J4974J5258J5720J6426J7242J8045J8921J9992K1180K2372K3628
$$ y = [351054, 354805, 358276, 362069, 366566, 371485, 376628, 382358, 388998, 396217, 403325, 409863, 415781, 421381, 427192, 433582, 440472, 447583, 454799, 461977, 468652, 474433, 479384, 483467, 485926, 486041, 484366, 482390, 480908, 479473, 477519, 475146, 472589, 469716, 466496, 463367, 460698, 458338, 455982, 453556, 450940, 447800, 444074, 440280, 436947, 434045, 431245, 428515, 426150, 424408, 423290, 422464, 421304, 419271, 416456, 413538, 411095, 409191, 407653, 406398, 405284, 404013, 402377, 400447, 398414, 396500, 395104, 394668, 395247, 396426, 397804, 399311, 400913, 402322, 403198, 403562, 403893, 404941, 407328, 410983, 414976, 418261, 420657, 422850, 425522, 428957, 433454, 439493, 447136, 455698, 464379, 472978, 481750, 490914, 500650, 511326, 523307, 536572, 550744, 565421, 580395, 595653, 611373, 627799, 645041, 663086, 682007, 701999, 723179, 745551, 769179]
53509G69179K4915K5896K6372K6721K7410K8217K8421K7738K6564K5336K4175
53498A060944K3169K2488K1954K1076J9732J8564J8272J8780J9395J9669J9762
53487A283805J9928K0001J9636J8913J8366J8316J8460J8343J7967J7577J6974
53476A488286J5610J3401J0977Q909P082N114K965P60j626m408p454j0397j3046
53463A516173j5387j7306j8626j9343j9567j9347j8824j8454j8754j9844k1363
53452A309358k2778k3629k3692k3151k2492k1991k1429k0519j9498j8936j8975
53441A072268j9005j8187j6153j3166r783o547l960k509k316k726k578j209R39
53428I75068K959M462N679O809P871Q982J0246J1451J2427J3617J5567J7938J9827
$$ y = [769179, 794094, 819990, 846362, 873083, 900493, 928710, 957131, 984869, 1011433, 1036769, 1060944, 1084113, 1106601, 1128555, 1149631, 1169363, 1187927, 1206199, 1224979, 1244374, 1264043, 1283805, 1303733, 1323734, 1343370, 1362283, 1380649, 1398965, 1417425, 1435768, 1453735, 1471312, 1488286, 1503896, 1517297, 1528274, 1537183, 1544265, 1549379, 1552344, 1553104, 1551478, 1547070, 1539616, 1529219, 1516173, 1500786, 1483480, 1464854, 1445511, 1425944, 1406597, 1387773, 1369319, 1350565, 1330721, 1309358, 1286580, 1262951, 1239259, 1216108, 1193616, 1171625, 1150196, 1129677, 1110179, 1091243, 1072268, 1053263, 1035076, 1018923, 1005757, 995974, 989427, 985467, 982958, 980642, 977916, 975338, 974129, 975068, 978027, 982489, 988168, 994977, 1002848, 1011830, 1022076, 1033527, 1045954, 1059571, 1075138, 1093076, 1112903]
53415A112903K1149K2716K4772K6469K7307K8068K9578L1422L2764L3823L5441
53404A426412L7648L9648M1118M2579M4526M6944M9702N2697N5489N7442N8432
53393A952637N8981N9570O0177O0553O0607O0448O0229N9941N9236N7635N5223
53382B605237N2771N0813M8885M6103M2276L7880L3190K8064K2557J7105J2013
53371B996894P206K563j998o875j2757j9946k7945l5830m2894m8861n3700n7378
53359B698479n9763o0774o0698o0195n9850n9731n9500n8791n7374n5174n2370
53348B054259m9382m6661m4533m3221m2701m2616m2609m2727m3014m2740m0809
53337A573246l7238l3487l0846k9049k7054k4513k1804j9096j6316j3789j2026
$$ y = [1112903, 1134052, 1156768, 1181540, 1208009, 1235316, 1263384, 1292962, 1324384, 1357148, 1390971, 1426412, 1464060, 1503708, 1544826, 1587405, 1631931, 1678875, 1728577, 1781274, 1836763, 1894205, 1952637, 2011618, 2071188, 2131365, 2191918, 2252525, 2312973, 2373202, 2433143, 2492379, 2550014, 2605237, 2658008, 2708821, 2757706, 2803809, 2846085, 2883965, 2917155, 2945219, 2967776, 2984881, 2996894, 3004100, 3006663, 3004665, 2997790, 2985033, 2965087, 2937142, 2901312, 2858418, 2809557, 2755857, 2698479, 2638716, 2577942, 2517244, 2457049, 2397199, 2337468, 2277968, 2219177, 2161803, 2106629, 2054259, 2004877, 1958216, 1913683, 1870462, 1827761, 1785145, 1742536, 1699809, 1656795, 1614055, 1573246, 1536008, 1502521, 1471675, 1442626, 1415572, 1391059, 1369255, 1350159, 1333843, 1320054, 1308028]
53326A308028j0988j0283j0031j0721j2213j3560j4042j3694j2770j1256r253
53315A179217p303n905m947l868k362p00O15J467K358L866N892P679Q710R252
53301A193971R955J1245J3295J6036J8902K1007K2087K2922K4355K6290K8064
53290A408129K9402L0410L0958L0783L0017K9011K7735K5878K3455K0813J8234
53279A704825J5845J3660J1274P937L424j449n774r568j3168j6162j7908j8786
53267A674150j9877k1483k3016k4293k5867k7856k9471l0163l0330l0513l0628
53256A380653l0503l0534l1186l2247l2980l2840l1754l0070k8513k7830k8150
53245A044046k8810k8967k8300k7118k6001k5288k4759k3870k2467k1036j9946
$$ y = [1308028, 1297040, 1286757, 1276726, 1266005, 1253792, 1240232, 1226190, 1212496, 1199726, 1188470, 1179217, 1171914, 1166009, 1161062, 1157194, 1154832, 1154132, 1154747, 1156214, 1158572, 1162438, 1168330, 1176009, 1184719, 1193971, 1203926, 1215171, 1228466, 1244502, 1263404, 1284411, 1306498, 1329420, 1353775, 1380065, 1408129, 1437531, 1467941, 1498899, 1529682, 1559699, 1588710, 1616445, 1642323, 1665778, 1686591, 1704825, 1720670, 1734330, 1745604, 1753541, 1756965, 1755516, 1749742, 1740174, 1727006, 1710844, 1692936, 1674150, 1654273, 1632790, 1609774, 1585481, 1559614, 1531758, 1502287, 1472124, 1441794, 1411281, 1380653, 1350150, 1319616, 1288430, 1256183, 1223203, 1190363, 1158609, 1128539, 1100026, 1072196, 1044046, 1015236, 986269, 957969, 930851, 904850, 879562, 854803, 830933, 808466, 787430, 767484]
53234G67484j8829j7170j5186j3536j2387j1405j0470r725r082q385p950q179
53222F25180q775r102r279j0052j1567j3103j4115j4662j4772j4279j3488j3020
53210D78966j2763j1859j0117q462p669p409p122o871o836o676o105n488n300
53197C76289n483n842o427o990o834n837n030n300n998n760m386l074k883l651
53183C02794m443m494l713k672k081k007j848j303r45j344k068k178j556j024
53169B71118j177j699j944j657j007k86K22K74j60q49j425j615j438j273j562
53154B55522k329l052l098k233p76N79J204J033O12M51M50L55L85Q24J183P17
53138B51827k25m01M74J163P52O9L77J448K031J730J282J195J239J232J332J393
$$ y = [767484, 748655, 731485, 716299, 702763, 690376, 678971, 668501, 658776, 649694, 641309, 633359, 625180, 616405, 607303, 598024, 587972, 576405, 563302, 549187, 534525, 519753, 505474, 491986, 478966, 466203, 454344, 444227, 435765, 428096, 420687, 413565, 406694, 399858, 393182, 387077, 381589, 376289, 370806, 364964, 358537, 351547, 344713, 338876, 333846, 328546, 322548, 316788, 312402, 309328, 306445, 302794, 298351, 293857, 290144, 287472, 285391, 283384, 281536, 280233, 279288, 277944, 275876, 273698, 272142, 271118, 269941, 268242, 266298, 264641, 263634, 263348, 263570, 263844, 263684, 262835, 261410, 259795, 258357, 257084, 255522, 253193, 250141, 247043, 244810, 244034, 244613, 245817, 246850, 247462, 247913, 248363, 248718, 249103, 249927, 251110, 251827, 251602, 251201, 251675, 252838, 253590, 253659, 254036, 255484, 257515, 259245, 260527, 261722, 262961, 264193, 265525, 266918]
53122B66918R19r5r41j131q98n36P5R44J579J578J224J011R24O40J45l52q98j663
53104B69443k342k347j684j143j290j720j744j492j651k195k114p70J071K072
53090B52094J888J276Q65M46k91j040j210p18o6K23J3m94j011j312j308j028o23
53073B47704l00j08K24R20J573J335O1j192j333o27k20n10q23o60l44k16p8J45
53055B45551K3n72r05l60N63R33P50P61J206J482J136M52j31o04j109j507j522
53038B46147j154o67k80k4J77L63M65L72O1l27n88o02l82J0M82Q54Q13J22r85
53019B44857j696j273J39J555K200K118J614O83m68r00J12J790K421J400j02p20
53003B53730l54K86P56R78Q29L32p9q1N8m8j66J88Q90J214P22k48j003j119o49
$$ y = [266918, 267837, 267742, 266801, 265670, 264772, 264236, 264311, 265255, 266834, 268412, 269636, 270647, 271571, 272211, 272356, 272004, 271106, 269443, 267101, 264754, 263070, 261927, 260637, 258917, 257173, 255681, 254030, 251835, 249721, 248951, 250022, 252094, 253982, 255258, 256123, 256569, 256278, 255238, 254028, 253310, 253244, 253467, 253480, 252986, 251975, 250663, 249355, 248327, 247704, 247404, 247296, 247520, 248440, 250013, 251348, 251409, 250217, 248884, 248257, 248037, 247527, 246704, 246044, 245700, 245484, 245406, 245551, 245574, 245002, 244097, 243737, 244300, 245233, 245983, 246744, 247950, 249432, 250568, 251020, 250889, 250285, 249176, 247669, 246147, 244993, 244326, 244046, 244022, 244199, 244562, 245027, 245399, 245460, 245133, 244545, 243943, 243561, 243571, 244053, 244907, 245720, 245842, 244857, 243161, 241888, 242027, 243582, 245782, 247900, 249514, 250197, 249729, 248829, 248941, 250731, 253152, 254552, 254450, 253730, 253376, 253662, 254418, 255396, 256225, 256557, 256478, 256397, 256455, 256407, 256241, 256429, 257319, 258533, 259255, 259007, 258004, 256885, 256236]
52984B56236J8M77O89R55J505K156K548K532K211J724J276J190J692K581L226
52969B81016L047K026P95L3k21m76r70j277r88l87l3j0r5m01j112j817j885j470
52951B75775j310j540j575j298j349j970k423k104j413r55o39j74J62M0j71P7
52935B59133N52N65Pn74q15q63q79p26k07O25J409J653J184M50R9K43M59N22N84
52916B63421N41Nr04j427j185o55k90Q5N31N33j17o78n30j53k66n50k38M81O42
52897B59246j23j161j660j276j49J035J342N99j88p6N21N79N9k38p4j7k63l40
52879B57816o9N4k66o62p21m86j22L80R82J506J875K088K039J784J781K330K939
52862B73248K839K080J335Q49L17k66m59k45j73m38o12n72r53k129l360l600k865
$$ y = [256236, 256254, 256731, 257420, 258375, 259880, 262036, 264584, 267116, 269327, 271051, 272327, 273517, 275209, 277790, 281016, 284063, 286089, 286884, 286917, 286696, 286220, 285250, 283973, 282985, 282598, 282565, 282555, 282460, 282059, 280947, 279130, 277245, 275775, 274465, 272925, 271350, 270052, 268703, 266733, 264310, 262206, 260793, 259838, 259199, 259025, 259187, 259227, 259056, 259133, 259685, 260250, 260257, 259683, 258868, 258005, 257126, 256400, 256193, 256818, 258227, 259880, 261064, 261514, 261613, 261856, 262315, 262837, 263421, 263962, 263967, 263063, 261636, 260451, 259796, 259506, 259591, 260122, 260655, 260538, 259860, 259330, 259177, 258911, 258361, 258123, 258604, 259246, 259123, 257962, 256302, 255026, 254877, 255912, 257254, 257853, 257665, 257589, 258110, 258689, 258748, 258510, 258436, 258419, 258156, 257816, 257747, 257801, 257535, 256873, 256152, 255666, 255544, 255924, 256906, 258412, 260287, 262375, 264414, 266198, 267979, 270309, 273248, 276087, 278167, 279502, 280351, 280668, 280402, 279943, 279698, 279525, 279087, 278475, 277903, 276950, 274821, 271461, 267861, 264996]
52845B64996k264k681l809m487l905k360q84j43K4Pk13p83j428j696j530j230
52829B37614r35n71j20L32P42R39O63N4k82j13j4m32q26n19Q3O3n43q07l14M90
52809B35504J289K231L130L291K458J230K98k60p52j490k596l739m110l319k110
52794B31055j500j358p91K52P69K62n88r88q44k55Q54K123K648K025Q76pl73j85
52776B33975N92J506J704R55p5q70j546k043j764o66K16O2n80p16l17l6j11k83
52758B30003m52o24n48q3L47L37J78L61O64M90j07l86J02J022J803K178K263K371
52740B39919K772L316L420K689J464N25L38P24J095R08J82m19k11O73J494J851
52724B60740J873J482K62j540k739k520j473o84l58o7J51k29j253k251k568j963
$$ y = [264996, 262732, 260051, 256242, 251755, 247850, 245490, 244606, 244463, 244487, 244494, 244281, 243498, 242070, 240374, 238844, 237614, 236679, 236108, 235988, 236320, 237062, 238001, 238664, 238718, 238436, 238323, 238309, 237877, 237051, 236532, 236615, 236678, 236135, 235328, 235014, 235504, 236793, 239024, 242154, 245445, 247903, 249133, 249431, 249171, 248419, 246929, 244333, 240594, 236484, 233165, 231055, 229555, 228197, 227406, 227658, 228427, 228689, 228101, 227113, 226269, 226014, 226868, 228991, 231639, 233664, 234540, 234533, 234160, 233975, 234567, 236073, 237777, 238732, 238657, 237787, 236241, 234198, 232434, 231768, 231984, 232046, 231466, 230750, 230433, 230397, 230286, 230003, 229551, 228927, 228379, 228296, 228643, 228980, 229158, 229519, 230183, 230673, 230566, 230180, 230282, 231304, 233107, 235285, 237548, 239919, 242691, 246007, 249427, 252116, 253580, 254105, 254443, 255167, 256262, 257170, 257352, 256933, 256722, 257395, 258889, 260740, 262613, 264095, 264357, 262817, 260078, 257558, 256085, 255401, 255043, 254976, 255127, 254898, 253645, 251394, 248826, 246863]
52708B46863n92R62J740J253J87k89P6M48J75m04o21m22k66l31k66K69J046J481
52690B51309J348J014R01R32Q07N41L48J55k13m98l30K5p9n51o06q9J78k59p07
52671B54226n31j55j38n6O50J366J034j69j018r59o44o82q48o57m8P35J372J588
52653B55066J526J928L288M864N278M051J958p9j648k423k126j213q24j488k446
52638B65712k656j986j045l36l3j46l95k17O23J580J931J647J364J538J927J895
52622B71403J032m37j728k110j572q33n99r38j441j753j718j192o4J473K805L218
52606B65546K458J039j19n12m67n17n95j50R11J964K405K234J654O33p38j755
52590B73991j683p04K76P39R55J189J167O81J93L17R21J324J235J034J015R48
$$ y = [246863, 246271, 247233, 248973, 250226, 250413, 250124, 250200, 250648, 250823, 250419, 249798, 249376, 249110, 248779, 248513, 248782, 249828, 251309, 252657, 253671, 254572, 255504, 256311, 256852, 257200, 257355, 257142, 256644, 256314, 256339, 256260, 255709, 255103, 255014, 255192, 254933, 254226, 253695, 253540, 253402, 253346, 253996, 255362, 256396, 256227, 255209, 254250, 253606, 252924, 252076, 251419, 251371, 252106, 253478, 255066, 256592, 258520, 261808, 266672, 271950, 276001, 277959, 277880, 276232, 273809, 271683, 270470, 269646, 268158, 265712, 263056, 261070, 260025, 259689, 259656, 259510, 259115, 258898, 259521, 261101, 263032, 264679, 266043, 267581, 269508, 271403, 272435, 271998, 270270, 268160, 266588, 265755, 265156, 264218, 262777, 261024, 259306, 258114, 258050, 259523, 262328, 265546, 268004, 269043, 268924, 268412, 267945, 267428, 266833, 266683, 267594, 269558, 271963, 274197, 275851, 276484, 275746, 273991, 272308, 271604, 271880, 272619, 273574, 274763, 275930, 276611, 276804, 277121, 278042, 279366, 280601, 281635, 282650, 283598]
52574B83598N33q2n05n42k84N8K13K5k49j51K64K96m56j412j740j466j235j159
52556B75706o25O18J796J898O79j239k976l840l574k511j338n27n0L44P72J149
52540B66282J248Q39M1n59m05L39R95J210J198J204J198J171J167R69L38l61m21
52523B76453J16L96J22J01Q93J651J298K39j07P19J837K537L104L842M303M080
52507C01584L617L485L329K318M93j194k215l033l972m361l520k177j833k728
52493B89793l442k836j483n83l03o0K06J59J27P45J601J488K53q12q06l33k26
52476B83488k06L33J082J370J336J607K132K270J827J240Q45O92R14J630K525
52461C03085L062L115K890K405J479J27j454l055m234m276l066j653j243j802
$$ y = [283598, 284131, 284049, 283544, 283002, 282718, 282776, 282989, 283014, 282765, 282614, 282878, 283174, 282718, 281306, 279566, 278100, 276865, 275706, 275081, 275699, 277495, 279393, 280072, 278833, 275857, 272017, 268443, 265932, 264594, 264067, 264017, 264361, 265133, 266282, 267530, 268369, 268410, 267851, 267446, 267785, 268780, 269990, 271188, 272392, 273590, 274761, 275928, 276897, 277235, 276874, 276453, 276569, 276965, 277087, 277188, 278081, 279732, 281030, 281269, 281162, 281881, 283718, 286255, 289359, 293201, 297504, 301584, 305201, 308686, 312015, 314333, 314826, 313632, 311417, 308384, 304412, 300051, 296531, 294354, 292521, 289793, 286351, 283515, 282032, 281449, 281146, 281086, 281292, 281451, 281578, 282323, 283924, 285412, 285665, 284853, 284047, 283714, 283488, 283282, 283615, 284697, 286067, 287403, 289010, 291142, 293412, 295239, 296479, 297324, 298016, 298930, 300560, 303085, 306147, 309262, 312152, 314557, 316036, 316163, 314709, 311654, 307420, 303144, 300078, 298425, 297182, 295380]
52447B95380k350k477k679l173l320k539j186j26J98m8m45o63p00q75j335j615
52431B72047j111N7J056J334J092O97J82l53m22L19J378J823J365O70M93P95R54
52414B82376P55P42J446K538L218L354L700M851O487P991R329J0794J2088J2225
52400C61894J0351O416J190m017p763r184q566p098n967n545n337m619l257j929
52386C16569j340j341j176n74J6L19O93J303J626J321J036J622K919M002M465
52371C31460M754N402O420P380P648O740M816K689R43m98j639j929j156l20n40
52356C72170j493j833j035J95J193K013K694K858K394J768J427J377J565K017
52342C87310K477K616K671L281M440N334N406N072N080N753P040Q732J0339J1236
$$ y = [295380, 293030, 290553, 287874, 284701, 281381, 278842, 277656, 277530, 277728, 277680, 277235, 276572, 275872, 274997, 273662, 272047, 270936, 270993, 272049, 273383, 274475, 275172, 275354, 275001, 274579, 274898, 276276, 278099, 279464, 280134, 280627, 281422, 282376, 283131, 283873, 285319, 287857, 291075, 294429, 298129, 302980, 309467, 317458, 326787, 337581, 349669, 361894, 372245, 378661, 379851, 375834, 368071, 358887, 350321, 343223, 337256, 331711, 326374, 321755, 318498, 316569, 315229, 313888, 312712, 312138, 312154, 312473, 313166, 314469, 316095, 317416, 318452, 320074, 322993, 326995, 331460, 336214, 341616, 348036, 355416, 363064, 369804, 374620, 377309, 378252, 377754, 376115, 374186, 373030, 372710, 372170, 370677, 368844, 367809, 368004, 369197, 371210, 373904, 376762, 379156, 380924, 382351, 383728, 385293, 387310, 389787, 392403, 395074, 398355, 402795, 408129, 413535, 418607, 423687, 429440, 436480, 445212, 455551, 466787]
52328D66787J1297J1088J1304J2345J4309J6798J8773J9306J8728J8321J8642
52317F37698J8874J8147J6909J6343J6990J8355J9624K0317K0408K0200J9958
52306H43823J9603J8914J8025J7368J7064J6763J6168J5299J4274J3195J2281
52295A022777J1484J0015O977K652j490m359o215p783r089r686r543r126q854
52282I87760q772q581p820o294m449k966j874o00J020K405L186L945N518P954
52268I70432J0535J2456J3323J3332J3214J3598J4279J4540J4272J4180J4659
52257A118820J5239J5427J5402J5436J5349J5013J4759J4616J3849J1869R123
52246A274902O368L613N05k680n242o985q176q877r080r278j0049j1184j1941
$$ y = [466787, 478084, 489172, 500476, 512821, 527130, 543928, 562701, 582007, 600735, 619056, 637698, 656572, 674719, 691628, 707971, 724961, 743316, 762940, 783257, 803665, 823865, 843823, 863426, 882340, 900365, 917733, 934797, 951560, 967728, 983027, 997301, 1010496, 1022777, 1034261, 1044276, 1051253, 1053905, 1052415, 1048056, 1041841, 1034058, 1024969, 1015283, 1005740, 996614, 987760, 978988, 970407, 962587, 956293, 951844, 948878, 947004, 946404, 947424, 949829, 953015, 956960, 962478, 970432, 980967, 993423, 1006746, 1020078, 1033292, 1046890, 1061169, 1075709, 1089981, 1104161, 1118820, 1134059, 1149486, 1164888, 1180324, 1195673, 1210686, 1225445, 1240061, 1253910, 1265779, 1274902, 1281270, 1284883, 1285388, 1282708, 1277466, 1270481, 1262305, 1253428, 1244348, 1235070, 1225021, 1213837, 1201896]
52233A201896j2077j1974j1843j1554j1197j1022j0737r696p957o466n836n539
52221A085998m732l425k330j860j707j319m73O39J695K559L346M226N185O067
52207A093869O675O824O395N531M659M122L889L789L897M394N146N716N805N537
52193A166248N285N399O028O943P579P461O641N513M237K536K51k220m222n605
52179A212074o886q508j0147j1053j1015j0585j0250r853r090q155p380o521n055
52166A097576l089j328j85N44J074J433J879K771L855M339L985L382K808J696
52152A120740j79j786j986j167o85r24q73K68J880K688K247J349J057J642K351
52137A126622K241J141k63j164j171o9K219N159P585Q844R721J1650J5018J8799
$$ y = [1201896, 1189819, 1177845, 1166002, 1154448, 1143251, 1132229, 1121492, 1111796, 1103839, 1097373, 1091537, 1085998, 1081266, 1077841, 1075511, 1073651, 1071944, 1070625, 1070152, 1070791, 1072486, 1075045, 1078391, 1082617, 1087802, 1093869, 1100544, 1107368, 1113763, 1119294, 1123953, 1128075, 1131964, 1135753, 1139650, 1144044, 1149190, 1154906, 1160711, 1166248, 1171533, 1176932, 1182960, 1189903, 1197482, 1204943, 1211584, 1217097, 1221334, 1223870, 1224121, 1221901, 1217679, 1212074, 1205188, 1196680, 1186533, 1175480, 1164465, 1153880, 1143630, 1133777, 1124687, 1116532, 1109152, 1102631, 1097576, 1094487, 1093159, 1092974, 1093518, 1094592, 1096025, 1097904, 1100675, 1104530, 1108869, 1112854, 1116236, 1119044, 1120740, 1120561, 1118775, 1116789, 1115622, 1114937, 1114013, 1113140, 1113408, 1115288, 1117976, 1120223, 1121572, 1122629, 1124271, 1126622, 1128863, 1130004, 1129741, 1128577, 1127406, 1127337, 1129556, 1134715, 1142300, 1151144, 1160865, 1172515, 1187533, 1206332]
52123A206332K1809K3918K5796K7822K9572L0355L0073K9325K8634K7849K6595
52112A508080K5103K3973K3174K1929J9780J7137J4498J1886R448P904P680Q026
52100A698618P804O813N666M637L333J419j053l957p190j0422j3318j5986j8681
52087A657683k1113k2581k2763k1950k0501j8628j6613j4702j2642r953o813m171
52075A465253k685j935r32R05L515O567R646J2235J3898J4689J5212J6033J6995
52062A569396J7306J6540J5306J4621J4666J4702J4190J3399J2591J1306R037
$$ y = [1206332, 1228141, 1252059, 1277855, 1305677, 1335249, 1365604, 1395677, 1425002, 1453636, 1481485, 1508080, 1533183, 1557156, 1580330, 1602259, 1622039, 1639176, 1653674, 1665560, 1675008, 1682912, 1690592, 1698618, 1706422, 1713235, 1718901, 1723538, 1726871, 1728290, 1727237, 1723280, 1716090, 1705668, 1692350, 1676364, 1657683, 1636570, 1613989, 1591226, 1569276, 1548775, 1530147, 1513534, 1498832, 1486190, 1476237, 1469424, 1465253, 1462568, 1460633, 1459701, 1460606, 1464121, 1470688, 1480334, 1492569, 1506467, 1521156, 1536368, 1552401, 1569396, 1586702, 1603242, 1618548, 1633169, 1647835, 1662537, 1676727, 1690126, 1702717, 1714023, 1723060]
$$ [...]
##END NTUPLES=NMR SPECTRUM
##END=
