##TITLE=AC1446_MARAH13255_8011360_fo3Y4vQq3J
##JCAMPDX= 6.0         $$ Bruker NMR JCAMP-DX V2.0
##DATA TYPE= NMR SPECTRUM
##DATA CLASS= NTUPLES
##ORIGIN= BRUKER
##OWNER= Administrator
$$ 1.72 TOPSPIN		Version 2.1
$$ 2013-07-05 19:26:32.850 -0700  Administrator@X
$$ Compression mode = diff/dup
##.OBSERVE FREQUENCY= 400.02188249412
##.OBSERVE NUCLEUS= ^1H
##.ACQUISITION MODE= SIMULTANEOUS (DQD)
##.ACQUISITION SCHEME= undefined
##.AVERAGES= 8
##.DIGITISER RES= 22
##SPECTROMETER/DATA SYSTEM= spect
##.PULSE SEQUENCE= zg30
##.SOLVENT NAME= COFFEE_meoh
##.SHIFT REFERENCE= INTERNAL, COFFEE_meoh, 1, 14.98509
##AUDIT TRAIL= $$ (NUMBER, WHEN, WHO, WHERE, PROCESS, VERSION, WHAT)
$$ ##TITLE= Audit trail, TOPSPIN		Version 2.1
$$ ##JCAMPDX= 5.01
$$ ##ORIGIN= Bruker BioSpin GmbH
$$ ##OWNER= Administrator
$$ $$ E:\/data/COFFEE/nmr/AC1446_MARAH13255_8011360_fo3Y4vQq3J/10/pdata/1/auditp.txt
$$ ##AUDIT TRAIL=  $$ (NUMBER, WHEN, WHO, WHERE, PROCESS, VERSION, WHAT)
(   1,<2013-07-05 19:26:25.569 -0700>,<Administrator>,<X>,<go>,<TOPSPIN 2.1>,
      <created by zg
	started at 2013-07-05 19:25:19.366 -0700,
	POWCHK enabled, PULCHK disabled,
       configuration hash MD5:
       C8 4E 4E 5D D3 5C D8 9E 9F 52 82 E0 59 8A DE 15
       data hash MD5: 64K
       06 91 59 FB B8 13 26 BC 12 E8 D0 A1 10 74 8E 06>)
(   2,<2013-07-05 19:26:28.772 -0700>,<Administrator>,<X>,<proc1d>,<TOPSPIN 2.1>,
      <Start of raw data processing
       efp LB = 0 FT_mod = 6 PKNL = 1 PHC0 = 0 PHC1 = 0 SI = 32K 
       data hash MD5: 32K
       23 71 16 D2 50 76 24 71 FA 4B 4D 35 86 6F 35 F2>)
(   3,<2013-07-05 19:26:29.163 -0700>,<Administrator>,<X>,<proc1d>,<TOPSPIN 2.1>,
      <pk PHC0 = 95.36133 PHC1 = 0 
       data hash MD5: 32K
       C4 B2 9F 5F 2F D6 B2 3B 07 3F ED 64 84 36 26 9A>)
(   4,<2013-07-05 19:26:29.350 -0700>,<Administrator>,<X>,<proc1d>,<TOPSPIN 2.1>,
      <abs ABSG = 1 
       data hash MD5: 32K
       32 CC 8F 65 37 D3 33 5C 5D 33 47 D4 E9 AF 34 2C>)
(   5,<2013-07-05 19:26:29.429 -0700>,<Administrator>,<X>,<proc1d>,<TOPSPIN 2.1>,
      <abs ABSG = 2 
       data hash MD5: 32K
       C7 0E 0B A9 51 3E F4 B2 FA FC 3C 41 22 A0 C8 31>)
(   6,<2013-07-05 19:26:29.491 -0700>,<Administrator>,<X>,<proc1d>,<TOPSPIN 2.1>,
      <abs ABSG = 3 
       data hash MD5: 32K
       00 B5 E1 2E 7E AC BD 9D 8F 53 26 8A 9C 68 B4 19>)
(   7,<2013-07-05 19:26:29.538 -0700>,<Administrator>,<X>,<proc1d>,<TOPSPIN 2.1>,
      <abs ABSG = 4 
       data hash MD5: 32K
       72 F2 E4 16 15 1C BC 75 C2 77 FD 47 D4 B3 CC 96>)
(   8,<2013-07-05 19:26:29.600 -0700>,<Administrator>,<X>,<proc1d>,<TOPSPIN 2.1>,
      <abs ABSG = 5 
       data hash MD5: 32K
       AA C7 CB 61 BA 83 ED AD 63 4C 76 8C BF E9 6F C3>)
$$ ##END=
$$ 
$$ $$ hash MD5
$$ $$ 8D A1 A5 1E DD 4F 00 AF 08 E4 22 46 DA 71 61 F7
##$RELAX= 
##$RELAX= 
##$RELAX= 
##$RELAX= 
##$RELAX= 
##$RELAX= 
##$RELAX= 
$$ Bruker specific parameters
$$ --------------------------
##$DU= <E:\>
##$EXPNO= 10
##$NAME= <AC1446_MARAH13255_8011360_fo3Y4vQq3J>
$$ [...]
150 150 150 150 150 150 150 150
##$TP07= 0
##$TPNAME0= <>
##$TPNAME1= <>
##$TPNAME2= <>
##$TPNAME3= <>
##$TPNAME4= <>
##$TPNAME5= <>
##$TPNAME6= <>
##$TPNAME7= <>
##$TPOAL= (0..7)
0.5 0.5 0.5 0.5 0.5 0.5 0.5 0.5
##$TPOFFS= (0..7)
0 0 0 0 0 0 0 0
##$TUNHIN= 0
##$TUNHOUT= 0
##$TUNXOUT= 0
##$USERA1= <user>
##$USERA2= <user>
##$USERA3= <user>
##$USERA4= <user>
##$USERA5= <user>
##$V9= 5
##$VALIST= <valist>
##$VCLIST= <CCCCCCCCCCCCCCC>
##$VD= 0
##$VDLIST= <DDDDDDDDDDDDDDD>
##$VPLIST= <PPPPPPPPPPPPPPP>
##$VTLIST= <TTTTTTTTTTTTTTT>
##$WBST= 1024
##$WBSW= 4
##$XGAIN= (0..3)
0 0 0 0
##$XL= 0
##$YL= 0
##$YMAX_a= 638657
##$YMIN_a= -542636
##$ZGOPTNS= <>
##$ZL1= 120
##$ZL2= 120
##$ZL3= 120
##$ZL4= 120
##$ABSF1= 14.98509
##$ABSF2= -5.573092
##$ABSG= 5
##$ABSL= 3
##$ALPHA= 0
##$AQORDER= 0
##$ASSFAC= 0
##$ASSFACI= 0
##$ASSFACX= 0
##$ASSWID= 0
##$AUNMP= <proc_prof1d_extract_pilot.lims>
##$AXLEFT= 0
##$AXNAME= <>
##$AXNUC= <1H>
##$AXRIGHT= 0
##$AXTYPE= 0
##$AXUNIT= <>
##$AZFE= 0.1
##$AZFW= 0.1
##$BCFW= 0
##$BC_mod= 0
##$BYTORDP= 0
##$COROFFS= 0
##$CY= 15
##$DATMOD= 1
##$DC= 0
##$DFILT= <>
##$DTYPP= 0
##$F1P= 0
##$F2P= 0
##$FCOR= 0.5
##$FTSIZE= 32768
##$FT_mod= 6
##$GAMMA= 0
##$GB= 0
##$INTBC= 1
##$INTSCL= 1
##$ISEN= 128
##$LB= 0
##$LEV0= 0
##$LPBIN= 0
##$MAXI= 10000
##$MC2= 0
##$MEAN= 0
##$ME_mod= 0
##$MI= 0
##$NCOEF= 0
##$NC_proc= -8
##$NLEV= 6
##$NOISF1= 0
##$NOISF2= 0
##$NSP= 0
##$NTH_PI= 0
##$NZP= 0
##$OFFSET= 14.98509
##$PC= 1
##$PHC0= 95.36133
##$PHC1= 0
##$PH_mod= 1
##$PKNL= yes
##$PPARMOD= 0
##$PPDIAG= 0
##$PPIPTYP= 0
##$PPMPNUM= 2147483647
##$PPRESOL= 1
##$PSCAL= 4
##$PSIGN= 0
##$PYNMP= <proc.py>
##$REVERSE= no
##$SF= 400.02
##$SI= 32768
##$SIGF1= 0
##$SIGF2= 0
##$SINO= 400
##$SIOLD= 32768
##$SPECTYP= <>
##$SREGLST= <1H.CDCl3>
##$SSB= 0
##$STSI= 32768
##$STSR= 0
##$SW_p= 8223.68421052631
##$SYMM= 0
##$S_DEV= 0
##$TDeff= 65536
##$TDoff= 0
##$TI= <>
##$TILT= no
##$TM1= 0
##$TM2= 0
##$TOPLEV= 0
##$USERP1= <user>
##$USERP2= <user>
##$USERP3= <user>
##$USERP4= <user>
##$USERP5= <user>
##$WDW= 1
##$XDIM= 32768
##$YMAX_p= 468081449
##$YMIN_p= -711755
##$CURPLOT= <Network HP LaserJet P1505>
##$CURPRIN= <$Network HP LaserJet P1505>
##$DFORMAT= <normdp>
##$LAYOUT= <+/1D_H.xwp>
##$LFORMAT= <normlp>
##$PFORMAT= <normpl>
##$SURQMSG= 1
$$ End of Bruker specific parameters
$$ ---------------------------------
##NTUPLES= NMR SPECTRUM
##VAR_NAME=  FREQUENCY,     SPECTRUM/REAL,   SPECTRUM/IMAG
##SYMBOL=    X,             R,               I
##VAR_TYPE=  INDEPENDENT,   DEPENDENT,       DEPENDENT
##VAR_FORM=  AFFN,          ASDF,            ASDF
##VAR_DIM=   32768,         32768,           32768
##UNITS=     HZ,            ARBITRARY UNITS, ARBITRARY UNITS
##FACTOR=    0.250966925370066, 1,           1
##FIRST=     8223.43324360094, 230928,       -144304
##LAST=      0,             -51859,          -48013
##MIN=       0,             -711755,         0
##MAX=       8223.43324360094, 468081449,    0
$$ Real data points
##PAGE= N=1
##DATA TABLE= (X++(R..R)), XYDATA
$$ [...]
19557d7542k24192A29714b84907a01585A11379i6378j2724p7658K9996f0409A8471
19545D9875P0448b23500P6811N314j58222a08189k35322f5258l7582j12819C84122
19533B81076b51751J00761G2995b58250a9165j33842I5256E016K2691g0297B91523
19521b05081A54442K4685C992J78300e7084B27095b7345o5081A49331B5814b68203
19509D11169a69839b6775j52062j84958E609P9175a23982e9138m7095d8124n7330
19498a05454K2425I4084J1060b97286C7686a53197r2763g084l60539A51561c4098
19486C33606G0357B4090e9301A95881b32128C01979f0572j38426d131j94663H8784
19474c00006G8633b15400a07571o1855m073a747k93098P4270G5988J03907H8492
$$ y = [-47542, -271734, 129714, -284907, -101585, 111379, -96378, -109102, -186760, -156764, -60409, 18471, 49875, 120323, -223500, -146689, -141375, -299597, -108189, -343511, -65258, -102840, -215659, 384122, 281076, -251751, -150990, 72995, -258250, -19165, -153007, 95256, 5016, 27707, -70297, 291523, -205081, 154442, 179127, 3992, 182292, -57084, 227095, -27345, -92426, 149331, 25814, -268203, 411169, -169839, -26775, -178837, -363795, 5609, 84784, -123982, -59138, -106233, -48124, -105454, -83029, 94084, 105144, -297286, 37686, -153197, -245960, -7084, -367623, 151561, -34098, 333606, 70357, 24090, -59301, 195881, -232128, 301979, -60572, -198998, -4131, -198794, 88784, -300006, 78633, -215400, -107571, -169426, -173499, -1747, -294845, -220575, 75988, 179895, 88492]
19462F864h0485p0253C02715j08942p1431C8918c62026C38731A30918g6095q8497
19451a64592M159J3175k71712A81288p763d5323j17915d9672I8031K74672g5247
19439b3570A42130e2573B03715c43051A35488O8905h5512k67092m1515g0277n3574
19428a23851L4248k6623A5621J13870b57115H4118K37702c48591g8356E3606b92082
19416A9174Q2337a35859A52218D3528K58535b05476A63627F0453a90704m6293
19406b36997A00196a96052l1284C6076a70001N5273I4470a96049B85230A2931
19395b56666A16176c34737a53373B0159b04176n8581d8090A87428b11643j09773
19385c21416A36181b66382G2840b54359K6623A9722N9307b53706e9147k03555
$$ y = [6864, -80485, -150738, 302715, 193773, 122342, 38918, -362026, 338731, 130918, -76095, -164592, -160433, -147258, -418970, 181288, 173525, -45323, -163238, -49672, 98031, 372703, -75247, -23570, 142130, -52573, 203715, -343051, 135488, 204393, -85512, -352604, -394119, -70277, -123851, -89603, -116226, 15621, 129491, -257115, 84118, 321820, -348591, -78356, 53606, -292082, 19174, 101511, -135859, 152218, 43528, 302063, -205476, 163627, 60453, -190704, -236997, 100196, -196052, -227336, 36076, -170001, -114728, 94470, -196049, 285230, 12931, -256666, 116176, -334737, -153373, 20159, -204176, -262757, -48090, 187428, -211643, -321416, 136181, -266382, 72840, -254359, -227736, 19722, 79029, -253706, -59147, -262702]
19375b62702j25726a07436M0242C7730a38106A8580a55417c0084j32052d960k5513
19364c0473A46338b84918c2079l62197C1736d7846m8443C9395c13290N5829A81302
19352I1262a63820A37970a38243K2872k361k86605i2146j05072p5217O1360d4594
19340B9965c7609F6061f2040l10524a18771A09184c72523n9466c5136F2334b5221
19328i7805C39404D6791a81452c4305n6825A25128K96270A37052E2540Q5526a01387
19316A87524i7823J1962L761k00680b6816r6760k11857F0370a86629L8744k1898
19305a69783a2400A571b05963r7220B13274m8960k4426a57425B63935A17805b8360
19293C779b99097A78891b37506B74598o2520m2546a70600H8370a45392D3933L0573
$$ y = [-262702, -388428, -107436, -67194, 37730, -138106, 18580, -155417, -30084, -162136, -4960, -30473, 146338, -284918, -32079, -394276, 31736, -47846, -96289, 39395, -313290, -257461, 181302, 91262, -163820, 137970, -138243, -115371, -117732, -404337, -92146, -197218, -272435, -211075, -44594, 29965, -37609, 66061, -62040, -372564, -118771, 109184, -372523, -431989, -35136, 62334, -25221, -97805, 339404, 46791, -181452, -34305, -91130, 125128, 421398, 137052, 52540, 138066, -101387, 187524, -97823, -85861, -82100, -282780, -26816, -123576, -335433, 60370, -186629, -147885, -169783, -12400, 1571, -205963, -303183, 213274, 164314, 139888, -157425, 263935, 117805, -28360, 3779, -299097, 178891, -237506, 274598, 212078, 169532, -170600, 88370, -145392, 43933, 74506]
19282G4506i8652d3647j39057e0248m4078q2175A17455c09608n7652J38585G4146
19270a45190k93184a51769m4206p8417A62817e2438A04913b2864B28784c9826
19259a36458I7456b474G0396a35368p8226a5971j53452I7329h3115q285A47301
19247D2205L8457b92365j3143B40544c05556A11778n3322b27352N8097j21317
19237b90572A06016b93712c9322l6619j58383f9340C0493b1759j11480B07491
19226f2309j32468C62971a91223f8978N277j5609k797a5590k45467d1300A57499
19214h6574j43989m176E8663A1317J45091c84231A67436f1126k01629N991K7882
19203b28882e3883B55468J43672j78168q3851b4791E8999e5558j03983c4616k9001
$$ y = [74506, -98652, -43647, -182704, -50248, -94326, -176501, 117455, -309608, -367260, -228675, 74146, -145190, -438374, -151769, -195975, -274392, 162817, -52438, 104913, -22864, 228784, -39826, -136458, 97456, -2474, 70396, -135368, -213594, -15971, -169423, 97329, -83115, -91400, 147301, 42205, 80662, -292365, -305508, 240544, -305556, 111778, 58456, -227352, -169255, -290572, 106016, -293712, -39322, -75941, -234324, -69340, 30493, -21759, -133239, 207491, -62309, -194777, 362971, -191223, -68978, -63701, -79310, -82107, -15590, -261057, -41300, 157499, -86574, -230563, -234739, 58663, 11317, 156408, -384231, 167436, -61126, -262755, -256764, -228882, -53883, 255468, 399140, 220972, 137121, -24791, 58999, -55558, -159541, -34616, -63617]
19192f3617n1236C827a15235k73324A01903b7743a073H3224J65992f7990E4389
19180b48354Q8884f8584l47479a92330D8793n575c1755o209B53537l374c92704
19168f5996j30194K3647C8497c50734J13830N8020d3931A02252i8307d540A753
19156G1570B5723b76292a25375A34273h0416A83126a76398b4688l9818M012l9864
19145a00358F8023a4736l2182j08626O0411L4570r5091A92234J07845a78450H6919
19133A77451A8307F254O8568N4081d940k3712j18649F1007J27174d8801f646k11280
19121b17926A16183a92723M7666G6304c40542h6484G4699L590J6182j170a37144
19109E075b5192D3399h2035E6232a72189N029j32697J12670h1722k23558J42426
$$ y = [-63617, -114853, 3827, -115235, -388559, 101903, -27743, -1073, 83224, 249216, -67990, 54389, -248354, -159470, -68584, -416063, -192330, 48793, 43218, -31755, -37964, 253537, 250163, -392704, -65996, -196190, -172543, 38497, -350734, -236904, -178884, -43931, 102252, -98307, -4540, 1753, 71570, 25723, -276292, -125375, 134273, -80416, 183126, -176398, -24688, -64506, -60494, -100358, 68023, -14736, -46918, -155544, -95133, -60563, -155654, 192234, 300079, -178450, 86919, 177451, 18307, 6254, 74822, 128903, -4940, -28652, -147301, 61007, 188181, -48801, -6646, -217926, 116183, -192723, -145057, 76304, -340542, -86484, 74699, 78289, 94471, 93301, -137144, 5075, -25192, 43399, -82035, 56232, -172189, -167160, -299857, -187187, -81722, -305280, -162854]
19098a62854A5109b81594B8490j3788c18090A1952a14425n97330B43007d25294
19087B49463a8534k98963a7935j12574C62610H7712a55597J2318o9110G4728K132
19076G6860a58217N7193E4253i0313n5909O6307B60309c7184F1915K1331q130
19065G5116B1194a62693K3117j78776A90673c16417A2131J9015b3590q5304j5062
19054a23956m73281b03244i2510L7697j29445n3078m7373J29200b3541E798M9331
19043E5129L5324A0508d85806E9781a5488j4131G9875B2083a30579C24273I2407
19031d3062F1472A4106R717f3271A01965d35757B63184A23307c58097d1296E2118
19019b5715H0756P578O7904d8608a4257m0663a8433l34026a39160C43316g9688
$$ y = [-162854, 15109, -281594, 28490, 14702, -318090, 11952, -114425, -711755, 243007, -425294, 249463, -18534, -317497, -17935, -130509, 362610, 87712, -155597, -143279, -212389, 74728, 76860, -158217, -101024, 54253, -90313, -146222, -79915, 260309, -37184, 61915, 83246, 75116, 21194, -162693, -139576, -318352, 190673, -316417, 12131, 31146, -23590, -108894, -123956, -597237, -203244, -92510, -54813, -184258, -237336, -284709, -155509, -23541, 5798, 55129, 90453, 10508, -485806, 59781, -15488, -29619, 79875, 22083, -130579, 324273, 92407, -43062, 61472, 14106, 23823, -63271, 101965, -435757, 263184, 123307, -358097, -41296, 52118, -25715, 80756, 88334, 156238, -48608, -14257, -54920, -18433, -352459, -139160, 343316, -79688]
19007b25298M7413A08286c89344A42372h3281k21135A32056E6550b30110n0377
18997b80487B1903b59535f3965m0456a0058l97933B58327c19690J16403f0009
18986b83625g0647I1309a52168l44067b27927C09957e7933a418A33738M7973D4616
18974i2129c371B9821a00050o9338P7863j07000q1807B52936F799d9515j18971
18963a68486A34290c0011l72007H9954l6617b21242m2367c3024m4014i458Q10
18952h648l1032m0654L6720A26504a03774n3699B48878c75473A11494A5900a78406
18940e5799A74117b57285I7463d07651J65266F2515b66723F4125A0344a52845
18929A3546J68938G533b15786C72655c4260j73600e8556l0212C6401d9239k05720
$$ y = [-225298, -177885, 108286, -389344, 142372, -83281, -304416, 132056, 56550, -230110, -280487, 21903, -259535, -63965, -104421, -10058, -407991, 258327, -319690, -203287, -60009, -283625, -70647, 91309, -152168, -496235, -227927, 309957, -57933, -1418, 133738, 181711, 44616, -92129, -3371, 29821, -100050, -169388, -91525, -198525, -280332, 252936, 6799, -49515, -168486, 134290, -30011, -402018, 89954, 53337, -221242, -263609, -33024, -77038, -9458, -8648, -39680, -80334, -43614, 126504, -103774, -157473, 248878, -375473, 111494, 15900, -178406, -55799, 174117, -257285, 97463, -407651, -242385, 62515, -266723, 64125, 10344, -152845, 13546, 182484, 7533, -215786, 372655, -34260, -207860, -58556, -88768, 36401, -49239, -254959]
18918b54959a1537J923B80964b13067H0667L119b27575k0861a03671d0556l0297
18907g0853j34720a3772A97258a0471p5835C6935J67106a2378A48943g9580B2686
18895A1562g3499A22633a11999d177p7235L1658q6803A43244P3858a5181l80529
18884c95710B10776M2757c0098n3392A1648P1572a53833B56620p8492e7008A5641
18872b64206P4881l4051j19190L4706A58342a01576a5731A96408B4334g0712A89226
18860H5831a6071q2859j06109C6337b1218k5553J2903G6832f2697l14030A2476
18848A90420e0226A53819R215M4995a16318j08925I2055C936c1994A21220e76824
18836b86142O3331A841K5297a7797k6696j17838C4291J9771d8478k17385a30217
$$ y = [-254959, -11537, -9614, 280964, -213067, 80667, 83786, -227575, -248436, -103671, -40556, -70853, -205573, -13772, 197258, -10471, -86306, 36935, 204041, -12378, 148943, -79580, 22686, 11562, -73499, 122633, -111999, -4177, -81412, -49754, -136557, 143244, 217102, -15181, -395710, 210776, 253533, -30098, -83490, 11648, 83220, -153833, 256620, 178128, -57008, 15641, -264206, -189325, -223376, -342566, -307860, 158342, -101576, -15731, 196408, 24334, -70712, 189226, 85831, -16071, -98930, -205039, 36337, -21218, -46771, -33868, 76832, -62697, -376727, 12476, 190420, -50226, 153819, 163034, 208029, -116318, -225243, 92055, 3936, -31994, 121220, -576824, -286142, -222811, 1841, 27138, -17797, -44493, -162331, 34291, 54062, -48478, -265863, -130217]
18824A23331l8769C238J8360a33251q7470E1958c9815k6490j97688B53758C8508
18812B40804A10018n3096M0653E826a35315O3693E7156J27236b4364k31244h8193
18800C54384a10770j72553O8812A40949b94064M4273O5642L9878j63934j2504
18790c20709Q6472E9444Q0478F3861N1047K90792e290l099G9877b15553B8509
18778b30116e2783G8969a08129n6345F5492i9779r393j38777d4878A37236b51940
18766H9791h034r527A8464b59129J29034B6155K28567c50505c4696m846k75868
18755c15410J44033k00980a10081q2985A0335g6293D7966a37783h352o4839D7193
18743B06886a87356E4082b3558A60643C8360g9011I9678b1399O573q3201A20476
$$ y = [123331, 84562, 3238, 21598, -133251, -220721, 51958, -39815, -66305, -263993, 253758, 38508, 240804, 110018, 56922, 97575, 5826, -135315, -71622, 57156, 184392, -24364, -255608, -88193, 354384, -110770, -283323, -214511, 140949, -294064, -249791, -184149, -144271, -308205, -320709, -234237, 59444, 139922, 63861, 114908, 405700, -5290, -8389, 79877, -215553, 28509, -230116, -52783, 78969, -108129, -164474, 65492, -99779, -109172, -247949, -44878, 137236, -251940, 89791, -8034, -17561, 18464, -259129, -130095, 26155, 254722, -350505, -34696, -39542, -315410, -171377, -372357, -110081, -193066, 10335, -76293, 47966, -137783, -8352, -73191, 47193, 206886, -187356, 54082, -23558, 160643, 38360, -79011, 99678, -21399, -14826, -98027, 120476]
18731I0514D3026j9650c14073d235C80298A13900b52639A44166a44335H0614J4105
18720I4719m5626b24588R5658B9265J79238e02725A58618b00961F9597a98566
18709d0787j53896r3022C01045H5862L6450J23213a70239f874E4976e703p1277
18698g6980j744A89711d14232h7795j82057N4401d0422I0088a37661q9534o773
18687b33968h5225b8671j07496B48847d41290J14003K5784N8246b0196C63411
18676d16928J46276A86086I1541a16440e6344l3147K5987n7311c7629B36793b12857
18664b05077K5624p836B4332L21367A33526a608C3056J26027i8147q3483Q3429
18653i8201A06106b72628K4669A05544b56787P8567j03161L4804B1320Q565e208
$$ y = [90514, 43026, 23376, -314073, -4235, 380298, 113900, -252639, 144166, -144335, 80614, 94719, 49093, -224588, -128930, 29265, 208503, -502725, 158618, -200961, 69597, -198566, -40787, -194683, -287705, 301045, 85862, 122312, 245525, -170239, -6874, 54976, -5703, -76980, -78724, 189711, -414232, -87795, -269852, -215451, -40422, 90088, -137661, -227195, -233968, -85225, -28671, -136167, 248847, -441290, -327287, -301503, -243257, -20196, 363411, -416928, -270652, 186086, 91541, -116440, -56344, -89491, -63504, -120815, -37629, 236793, -212857, -205077, -179453, -187289, 24332, 345699, 133526, -1608, 33056, 159083, -98147, -181630, -98201, 106106, -272628, -247959, 105544, -256787, -178220, -281381, -246577, 21320, 29885, -5208]
18641c52816B0412b42108C05724a14104A13652d77995K30656I034c96907J78633
18631b18274D6227a4345k61425j58333K06347A77058L5158c716q9188D240a57761
18619B18140d2004I4482b73471e14k48899i4031j44754b0140k6969E6155a34494
18607G2235A4059b24396A73442d9212k31371a0561I4871J5412A2806a82311k33348
18596d15659a13934E8298b06403B035b31672a02753j29201f0894q8124H5785J10961
18585A96746d9483F4908g0859p6352H4799b13973j55200p8030B037R8770M8943
18574A49750b59297A88368q206D6310f9402A21872c21351a22906l7036J3669f5886
18562h7928E648a14997j18983Q1087B44417A08776b30360D1303a21299B4647Q2426
$$ y = [-352816, 20412, -242108, 305724, -114104, 113652, -477995, -247339, 9034, -396907, -218274, 46227, -14345, -275770, -434103, -227756, 177058, 212216, -3716, -92904, 4240, -157761, 218140, -42004, 94482, -273471, -514, -249413, -94031, -238785, -20140, -47109, 56155, -134494, 72235, 14059, -224396, 173442, -49212, -280583, -10561, 94871, 110283, 12806, -182311, -415659, -113934, 58298, -206403, 2035, -231672, -102753, -231954, -60894, -149018, 85785, 196746, -49483, 64908, -70859, -147211, 84799, -213973, -369173, -447203, 2037, 100807, 149750, -259297, 188368, 180162, 46310, -69402, 121872, -321351, -122906, -159942, -146273, -65886, -87928, 5648, -114997, -233980, -152893, 244417, 108776, -230360, 41303, -121299, 24647, 107073]
18551A07073a21867J4606B05398n1070h3343j66386F0837B847a14348G8846f594
18539b15618f2537k61902F8527B6318a9614k7493A06716i4368A32787a10300l5507
18528a45807a0391j03078D6560f6864j14532C2666K47376e8012B13835G8828l6399
18517D2429d716l12044i731E9937g7308A53974D03Q3150b07328A4034c7661A35867
18504C47482i4170j41541R7521F7287h4511D5513A1857d2112A47203a68661A1916
18492c19287J38757A55627d6894i502p9440m528j17440M7550l6790A22062a0035
18480c07145C5880a00391G7255a62117G8962a93894K7566C1869c09940a19769
18469f884j95232H8415d9273f996o4667A85885b82151R9915c3270n16A14892J08188
$$ y = [107073, -121867, -107261, 205398, 154328, -83343, -249729, 60837, 2847, -114348, 78846, -6594, -215618, -62537, -324439, 68527, 26318, -19614, -47107, 106716, -94368, 132787, -110300, -145807, -10391, -113469, 46560, -66864, -181396, 32666, 280042, -58012, 213835, 78828, 42429, -4716, -316760, -9731, 59937, -77308, 153974, 403, 83553, -207328, 14034, -37661, 135867, 347482, -94170, -235711, -138190, 67287, -84511, 45513, 11857, -42112, 147203, -168661, 11916, -319287, -180530, 155627, -46894, -9502, -88942, -93470, -210910, -163360, -200150, 122062, -10035, -307145, 35880, -100391, 77255, -162117, 78962, -193894, -166328, 31869, -309940, -119769, -6884, -202116, 88415, -49273, -6996, -71663, 185885, -282151, -182236, -33270, -33786, 114892, 223080]
18457B23080J0275a75980p6915N9284j23173J39016l0764A51434a00245A08263
18446a95685D9953J23847d14240C29113G5040c18193R2395i2774L8552j01869
18436a56091r6771r567k63453f4447k36638a34644F9718J5695b4644B9901c3772
18424a61492P3274F1493a97730j24721M1952B19537f5831A50003E3738b03838
18413A07529h7064A57951c9480o4847A22811n4887F910a56400B7542J50203Q218
18402A85963f1967q5948q2616e1475A49908O5964c70875h262B23576E6307n182
18391E1125i3068G0215c64050J44162N5962j02370c8815B8744b25410k68744B55236
18379a05274c4109I6545R9736o305K2559f9022r404m4685c798E6470i1875C2238
$$ y = [223080, 233355, -175980, -252895, -193611, -316784, -177768, -208532, 151434, -100245, 108263, -195685, 49953, 173800, -414240, 329113, 75040, -318193, -225798, -92774, -54222, -156091, -252862, -262429, -525882, -64447, -301085, -134644, 69718, 85413, -24644, 29901, -33772, -161492, -88218, 61493, -197730, -322451, -280499, 219537, -65831, 150003, 53738, -203838, 107529, -87064, 157951, -39480, -104327, 122811, 67924, 6910, -156400, 27542, 177745, 185963, -61967, -147915, -230531, -51475, 149908, 215872, -370875, -8262, 223576, 56307, 51125, -93068, 70215, -364050, -219888, -163926, -266296, -38815, 28744, -225410, -494154, 255236, -105274, -34109, 96545, 196281, 189976, 212535, -69022, -78426, -123111, -3798, 56470, -91875, 32238]
18366B8912N1837k2387P959J945P4461o3207j4329a18931A68919h6190k4858k98318
18354d09366a44806j2747k51057e7137A26461N1639C0988e85B45J40055f2882
18342E8832b42364B78327B0119Q1785b09526d2865j58082A8226N0112J92117I4654
18330b16367B06804o1379b01068e6355k68950K7380B83192e9511J117k81069b9737
18318b15445j9920j6742l1572P6315K5948h9007j7781A47183a34004j2692a9200
18306F6773a7240I9566C7489a56843A10035f2196p3461o0827l0778Q6229L1162
18295a09871k21616a21416j86665a44619K5856A8878J40029M3144d3382j24329
18285a67711f8877m49233h3386k45329a51875B87873b82163B7208b14086A33247
$$ y = [28912, 80749, 58362, 66321, 68266, 142727, 79520, 65191, -118931, 168919, -86190, -111048, -409366, -144806, -157553, -408610, -57137, 126461, 178100, 30988, -585, 245, 140300, -62882, 58832, -242364, 278327, 20119, 101904, -209526, -42865, -200947, 18226, 68338, 260455, 94654, -216367, 206804, 145425, -201068, -56355, -325305, -297925, 283192, -59511, -58394, -339463, -29737, -215445, -235365, -252107, -283679, -207364, -181416, -89007, -106788, 147183, -134004, -146696, -19200, 66773, -17240, 99566, 37489, -156843, 110035, -62196, -135657, -196484, -227262, -141033, -109871, -331487, -121416, -308081, -144619, -118763, 18878, 158907, 202051, -43382, -167711, -68877, -518110, -83386, -328715, -151875, 287873, -282163, 27208, -214086, 133247]
18274b80104a10964Q82B74313I7798M6923D7867a26665N8096b0902A8755M1263
18263F0018a51954A21393R4568I6239j2990N5g2013j8483j65080A0578c9563j21500
18251a61063A32816K3607Q0284A2753a24765H0829c9093p8974a2190A73174F9513
18239b42153b9733a2255A42724f0917p9518B5796g7222k37495A90150F3842c0626
18227h5239B03385L5113b4538A9133D539a45487L4009j77387c1314j00137I6196
18215f7748F47K3190J7779K28633G2018b03357c5757j22937D21399H4483J79195
18204B63678j04737p048c56902a65744m2506B53628A9631g8968B7247F770c8395
18192b0271d163l78402C6356J87857a90661B73676I1393c14438a10945N2993m7996
$$ y = [-280104, -110964, -110082, 274313, 97798, 144721, 47867, -126665, -68569, -20902, 18755, 60018, -151954, 121393, 215961, 96239, 83249, 83304, -72013, -90496, -255576, 10578, -39563, -161063, 132816, 156423, 236707, 12753, -124765, 80829, -39093, -118067, -12190, 173174, 69513, -242153, -29733, -12255, 142724, -60917, -140435, 25796, -77222, -314717, 190150, 63842, -30626, -85239, 203385, 238498, -24538, 19133, 4539, -145487, -111478, -288865, -31314, -131451, 96196, -67748, 647, 23837, 41616, 270249, 72018, -203357, -35757, -158694, 421399, 84483, 263678, 158941, 151893, -356902, -165744, -208250, 253628, 19631, -78968, 27247, 6770, -38395, -20271, -4163, -382565, 36356, 224213, -190661, 273676, 91393, -314438, -110945, -57952, -105948]
18181a05948J2338d3355F0516a4283B96665e9785j27426k76980c7573j56499G7613
18169a53335a9634q9129A06050a50160j4632j9471c0532k32688A13715c26920
18158A6490h1218j76314A44879a85204O3058A92872n5050L2169A6012O3809j4132
18147F5689j0377L5599a56040B36427a62918m9180A7213K58639A04850C0833R4494
18136A25327J59628A6375i3036b2561j86795d1257P080B99085A3545J9300f5176
18124A21037a79441b7185B67748f9444A35351a59333d0946k5180j75680f2516
18113a64417P7738r1032J6028C04022G0734c63856A34003c62345A8947a80360
18102G8000c24702I8365d5748j06938b6900F1205d18170a64190p3833a9333A27780
$$ y = [-105948, -93610, -43355, 60516, -14283, 296665, -59785, -187211, -464191, -37573, -194072, 77613, -153335, -19634, -108763, 106050, -150160, -164792, -184263, -30532, -263220, 113715, -326920, 16490, -81218, -257532, 144879, -185204, -122146, 192872, 137822, 169991, 16012, 79821, 65689, 55312, 90911, -156040, 236427, -162918, -212098, 17213, 275852, 104850, 30833, 125327, 284955, 16375, -93036, -22561, -209356, -41257, -34177, 299085, 13545, 32845, -65176, 121037, -179441, -27185, 267748, -69444, 135351, -159333, -40946, -66126, -241806, -62516, -164417, -86679, -177711, -161683, 304022, 70734, -363856, 134003, -362345, 18947, -180360, 78000, -324702, 98365, -45748, -152686, -26900, 61205, -418170, -164190, -238023, -19333, 127780]
18090D6202h5878o691K2574A36497b77681c6840k5115B3667g3165A26241C8673
18078b72337a05625a0277p1723j87596g7356r9568B1770a06598A90831K9220I8903
18066g6080b70D28792A9134P8964d06963D2338N519R1353a06463J5875l1771K3570
18054i8789m58744a33945d7904B7912M7434a45160B32988f0867a9047j03028f354
18042b9255j110C5536O733f098B14822j06867l6032a17349K2250B3783N5605l5180
18030D4208J07922A6071K5514f879E1808M0651d98775b12437j17236D9968M2842
18019I2810a05503b1682k45164A3527a78302j30729Q7300A58685E1960K95968
18009C47928g0846A20603b07857C33182a08396A52872Q6257a35070e3492I2915
$$ y = [46202, -85878, -92569, -69995, 136497, -277681, -36840, -61955, 23667, -73165, 126241, 38673, -272337, -105625, -10277, -82000, -269596, -77356, -176924, 21770, -106598, 190831, 220051, 98903, -76080, -270, 428792, 19134, 98098, -406963, 42338, 47857, 139210, -106463, -90588, -122359, -98789, -557533, -133945, -47904, 27912, 75346, -145160, 232988, -60867, -19047, -122075, -6354, -29255, -30365, 35536, 42269, -6098, 214822, 107955, 71923, -117349, -95099, 23783, 79388, 44208, 152130, 16071, 41585, -6879, 51808, 92459, -498775, -212437, -329673, 49968, 92810, -105503, -21682, -266846, 13527, -178302, -309031, -221731, 158685, 51960, 347928, -70846, 120603, -207857, 333182, -108396, 152872, 239129, -135070, -53492, 92915]
17998a70402A05087b35150j47102F2044h5387A81324A4211c98475I3560N6868
17988A50428m8279b7425H3224k1667d5110G037L46140i3273j34632d4332F9398
17976A76934a6593l7157b1794l29879B33078g2949E1794K3855l3509c2973A34020
17964C5565K21482b0454C8547a42428K186B54564b20492E4766A334J57314n5874
17953A02774d7303H7813k4910N3379a30745l8159a532l35514J08778d3807j5945
17942e9752j18099H7833a72146G4995B8141h873B996L0030M8432b4095H4844b04888
17929A73853a46010r9392c4705m3830q4511E313J44713b99602a07564o558j32066
17918b46188R2945k75223d5497j4392A90430E5686h9237b3961N686A19354a02528
$$ y = [-170402, 105087, -235150, -382252, 62044, -85387, 181324, 14211, -398475, 93560, 150428, 102149, -27425, 83224, 61557, -45110, 7037, 353177, -93273, -227905, -44332, 69398, 176934, -16593, -53750, -21794, -351673, 233078, -72949, 51794, 75649, 42140, -32973, 134020, 35565, 257047, -20454, 38547, -142428, -140242, 254564, -220492, 54766, 1334, 158648, 102774, -47303, 87813, 62903, 116282, -130745, -168904, -1532, -337046, -228268, -43807, -59752, -177851, 87833, -172146, 74995, 28141, -8873, 2996, 33026, 81458, -24095, 84844, -204888, 173853, -146010, -245402, -34705, -78535, -163046, 5313, 150026, -299602, -107564, -114122, -246188, -153243, -428466, -45497, -59889, 190430, 55686, -89237, -23961, -18275, 119354, -102528]
17906A8077N8778l3651i5458b002j2250j13221B56760a02241C26495d7829A60576
17894a13198I7444J64735l9091M8973q3625d49020B9709J2257J78854n3820d7534
17882b14419A18131l9756a44641J2646c7018A06163b69392F1945a34482O1619
17872g2863i538B15041l0872e1525p4501p7707A60204Q8440a11438j23535d678
17860d699j04929G7619d4111n8287k153j27459d4387j39298F203c31290A65654
17848C0903a31407C5439b59841d8420p1741D7714J71473b30374f2311F0598h9259
17836c1394k2091A74715R3956j4009D7968J73505a24335A82896J848e3492B05247
17824G2715L0983a97675A96047b72405a36131l238f0618A04991b57551D0771b07871
$$ y = [18077, 76855, 43204, -95458, -2002, -14252, -127473, 256760, -102241, 326495, -47829, 160576, -113198, 97444, 262179, 223088, 272061, 188436, -449020, 29709, 41966, 220820, 167000, -47534, -214419, 118131, 78375, -144641, -131995, -37018, 106163, -269392, 61945, -134482, -72863, -9538, 215041, 184169, -51525, -126026, -203733, 160204, 248644, -111438, -234973, -4678, -4699, -109628, 77619, -44111, -102398, -104551, -232010, -44387, -183685, 6203, -331290, 165654, 30903, -131407, 35439, -259841, -48420, -120161, 47714, 219187, -230374, -62311, 60598, -89259, -31394, -53485, 174715, 268671, 254662, 47968, 221473, -124335, 182896, 184744, -53492, 205247, 72715, 103698, -197675, 196047, -272405, -136131, -139369, -60618, 104991, -257551, 40771, -207871]
17812E0656a75012n6279P1042j1372k7074D7823f1834A81040b12066E9057a93482
17800D1710b80857a4587C4994c8143B8681f3135q711k57188a42791l5300J8004
17789a60087j2650N4421B4010O8237a27910A71864G608b04916h887l178E0086
17777I261a89795A11474i9206A03613L02589A41981a16050A04098m1683c4606
17766A85938c67815N2684A33642a39613I213J75404F5435b5176B85949F5503P645
17755G3148j3378e2179a9435k320j98328a01191o1131B2288a33875C204J43559
17744A46763K26201D8855J7093R2162n7644a29039D6606c55502J51647A10122
17733a67281C5437b11824B24193b05883D6839j2851O8570d0009k8827A11507a23474
$$ y = [50656, -175012, -231291, -160249, -171621, -198695, 47823, -61834, 181040, -212066, 59057, -193482, 41710, -280857, -14587, 34994, -38143, 28681, -63135, -71846, -329034, -142791, -178091, -160087, -172737, -118316, 24010, 92247, -127910, 171864, 7608, -204916, -8887, -12065, 50086, 9261, -189795, 111474, -99206, 103613, 406202, 141981, -116050, 104098, 62415, -34606, 185938, -367815, -315131, 133642, -139613, 9213, 184617, 65435, -25176, 285949, 65503, 73148, 59770, -52179, -19435, -21755, -220083, -101191, -162322, 22288, -133875, 3204, 146763, 372964, 48855, 65948, 158110, 100466, -129039, 46606, -355502, -203855, 110122, -167281, 35437, -211824, 224193, -205883, 46839, 33988, 102558, -40009, -68836, 111507, -123474]
17721C12248A4762O9641a96597C9848c5144j9336k73306g1518j53341M7979a3477
17709A83618F2382R3422k8747J0999e3996H0765b07867A23604d9252a9337B55324
17697F121a18265N0033M126A63463m482L73164e3367D2907J19125p6458j8630
17686F6944L3182b1765j59789e8225l87633B49067l6139E2065b98119J33234I7113
17674C18534F8958a10150K928r8751H5169j1837b7177l290A39932R875a0279E5530
17661b90376a41173p0390C6889f7172A15341b22498D9867K13325a42101C6922
17650A81780H1800m0767j2980e5759j23140J2775A03971J2490q523a29579E6953
17638G4246O6014J2824n3133b09271A57599h6730j60039F0356A7734J36901i4045
$$ y = [312248, 14762, 84403, -196597, 39848, -35144, -54480, -327786, -71518, -224859, -176880, -13477, 183618, 62382, 155804, 127057, 138056, -53996, 80765, -207867, 123604, -49252, -19337, 255324, 6121, -118265, -68232, -64106, 163463, 158981, 532145, -53367, 42907, 162032, 85574, 66944, 100126, -21765, -181554, -58225, -445858, 249067, 212928, 52065, -298119, -164885, 97113, 318534, 68958, -110150, -107222, -205973, 85169, 73332, -27177, -30467, 139932, 149807, -10279, 55530, -290376, -141173, -211563, 36889, -67172, 115341, -222498, 49867, 263192, -142101, 36922, 181780, 81800, 41033, 28053, -55759, -178899, -166124, 103971, 116461, 107938, -129579, 56953, 74246, 140260, 153084, 99951, -209271, 157599, -86730, -246769, 60356, 17734, 154635, -94045]
17626b53354B1719M0415j7503J00283C6048a12225C29733i2695B59987Q9299f7310
17614A21012D9218K56914b1207B68668g0361G7898a70460m865f7856A23965b68710
17602a15277j07319c0361B56977H7652b18253B68467B1367L69582A61618i053
17591G6570c28881A0577c8322K807J5628E5098a44335k59483B9756d7690B09111
17579h2084A05809B4060J15160a09010j3782F1090J41893F1302h8008F7698f779
17567B25651g4630A46006P152p2102a08228B57644G2776a53613A5936a6359j34472
17556a50831B20063r5346p148j9988J56290j17554b53968a11707N3867A29495
17545d7971E8749J03974g3378A07557d6665o8935M8308B32531j12293a3665j45944
$$ y = [-253354, 21719, 62134, 44631, 144914, 36048, -112225, 329733, -92695, 259987, 349286, -67310, 121012, 49218, 306132, -21207, 268668, -70361, 77898, -170460, -175325, -67856, 123965, -268710, -115277, -222596, -30361, 256977, 87652, -218253, 268467, 21367, 390949, 161618, -9053, 76570, -328881, 10577, -38322, -35515, -19887, 55098, -144335, -403818, 29756, -47690, 209111, -82084, 105809, 24060, 139220, -109010, -122792, 61090, 202983, 61302, -88008, 67698, -6779, 225651, -74630, 146006, 153158, 81056, -108228, 257644, 72776, -153613, 15936, -16359, -150831, 220063, 124717, 117569, 97581, 253871, 136317, -253968, -111707, -57840, 129495, -47971, 58749, 162723, -73378, 107557, -46665, -115600, -67292, 232531, 120238, -13665, -159609]
17534a59609C6986K26458a52901B50672a30995l04518B40394b11027Q8346h816
17523a76828I1646M187a36632A93554n2924D5360L88960j77849b08640B70839
17512h901G4688R8210K5699b14706f7335b5775B20032K88679A18392D422J87678
17501A92100d0893A98477J79544A0276J82310J10269a96544B21827E7020J82337
17491B39357H2238a38961B71109J00827b11536A72973d2552j57943K706C09535
17480C85196E5172J76631K12365j83793G0733J69875a515B76603H7511h4244A32327
17468H1015J67585J01749A30547l5226a23671A49438a93956c4800F5491b9788
17457g6136A27618L62194j72428H9623M17135a88502f8841F01711B0226L45802
$$ y = [-159609, 36986, 263444, -152901, 250672, -130995, -435513, 240394, -211027, -122681, -8816, -176828, 91646, 95833, -136632, 193554, 140630, 45360, 434320, 256471, -208640, 270839, -8901, 74688, 172898, 198597, -214706, -67335, -25775, 220032, 508711, 118392, 4422, 192100, -40893, 198477, 378021, 10276, 192586, 302855, -196544, 221827, 57020, 239357, 82238, -138961, 271109, 371936, -211536, 172973, -42552, -200495, -197789, 309535, 385196, 55172, 231803, 444168, 260375, 70733, 240608, -1515, 276603, 87511, -84244, 132327, 81015, 248600, 350349, 130547, 95321, -123671, 149438, -193956, -34800, 65491, -29788, -76136, 127618, 489812, 317384, 89623, 506758, -188502, -68841, 601711, 20226, 366028]
17447C66028A63650m0761K633k8412a67792B8083N5479J41437l4707J95936j30220
17436B56008M43771l04014j26285E7881K22333j05865M6435C0303J39449r699
17426A60053B1810K45873b4890B40282l8266C8900a11438A68387K77590g518H5214
17414I8931N46492k19343j16009j25983q2880f0240C44165A61593f8230c67l0904
17403c1271l7524E8906b46427n1489a32288A74774F9671c9739B82386j02467K13690
17392C93609L637j25100A03905Q8063Q66Q5172h251C12576n2053o6909d5598B03918
17379B65566A5557O8586j5045j4548O9443J85788D7380J43782G0252l5003K13333
17368B48582m4978J74357A20399d7179p8274C93838b059A89143L228A8567J61347
$$ y = [366028, 163650, 122889, 125522, 97110, -167792, 28083, 83562, 224999, 190292, 386228, 256008, 699779, 395765, 269480, 57881, 280214, 174349, 220784, 30303, 169752, 160053, 21810, 267683, -24890, 240282, 202016, 38900, -111438, 168387, 445977, -7518, 85214, 98931, 645423, 426080, 310071, 184088, 101208, -60240, 344165, 161593, -68230, -367, -31271, -68795, 58906, -246427, -297916, -132288, 174774, 69671, -39739, 282386, 179919, 393609, 397246, 272146, 103905, 191968, 192834, 278006, -8251, 312576, 260523, 193614, -45598, 203918, 265566, 15557, 84143, 69098, 54550, 123993, 309781, 47380, 191162, 70252, 35249, 248582, 203604, 377961, 120399, -47179, -125453, 393838, -2059, 189143, 192371, 18567, 179914]
17357A79914m3922L4497J09410G9865L40769A45971F0431a11282A5470L1117J89642
17346B36229J49164a59313A95331C8136J22926J77569a56770j9770K7501P4155
17336g4884B68169c2852C10355n1494r6882N2870q7663Q2820J50867E6057g3346
17324g8788C70570j01978A02288A269N4646O8267R3243J61181j60393b8906B00737
17312A63802a53710P0313C07298A43105L3746l1289J58541K28078E0403K65587
17302C15990C1846L37691g7168H8688a29147J4656C49453A43504G1732e2399C0283
17290a7489g416p3352A9819J68892r2853K17364L835h0163A44210J5486m097n0424
17278A05175g6510j090I1971J38811h2302I5151a1210p548B06153J8656J52270
$$ y = [179914, 135992, 170489, 279899, 79865, 420634, 145971, 60431, -111282, 15470, 46587, 236229, 385393, -159313, 195331, 38136, 161062, 338631, -156770, -176540, -149039, -74884, 268169, -32852, 310355, 258861, 161979, 214849, 127186, 210006, 360873, 56057, -73346, -78788, 370570, 268592, 102288, 1269, 55915, 124182, 217425, 378606, 218213, -28906, 200737, 163802, -153710, -83397, 307298, 143105, 176851, 145562, 304103, 532181, 50403, 315990, 31846, 369537, -77168, 88688, -129147, -114491, 349453, 143504, 71732, -52399, 30283, -17489, -7416, -80768, 19819, 188711, 95858, 313222, 317057, -80163, 144210, 159696, 155599, 105175, -76510, -77600, 91971, 230782, -82302, 95151, -11210, -18758, 206153, 224809, 377079]
17267C77079A66143M0004p7844k965m2997J31955D2774a06476A46208R4788R0387
17256C31383q7904n0754A3793L0554K39629B8014L05835a36144C23844l7778R434
17245B95500n9829J43350j20405A27167a16139a2328G5611a79050B97976R0921
17235C88897F5642p418K43410k2972q6524q7864J33749p6829J57226a397H3857
17223B60560a73438J231C66194A02083M49597B48205N1529p999m9143J25163j16890
17212B50865Q2669N9031F0155O0425K87173J3017r0983J8340K1070B5167L17389
17201C42556p5665j09676R0071E0414R1411K96854A55971M24393B34052Q049p5649
17190A66452K39981j81549o7610J92580o0612d9622C11320r7531J5285J13920
$$ y = [377079, 166143, 206147, 128303, 125338, 82341, 214296, 42774, -106476, 146208, 240996, 331383, 243479, 192725, 13793, 44347, 283976, 28014, 333849, -136144, 323844, 286066, 295500, 235671, 379021, 258616, 127167, -116139, -12328, 75611, -179050, 297976, 388897, 65642, 58224, 301634, 278662, 192138, 104274, 238023, 161194, 318420, -1397, 83857, 260560, -173438, -172207, 366194, 102083, 551680, 248205, 299734, 291735, 242592, 367755, 250865, 333534, 392565, 60155, 120580, 407753, 420770, 329787, 348127, 369197, 25167, 342556, 266891, 157215, 247286, 50414, 141825, 438679, 155971, 580364, 234052, 242101, 166452, 406433, 224884, 157274, 349854, 289242, -49622, 311320, 213789, 229074, 342994]
17180C42994j15071m8831K50066j82909i0356A62372J23797A8391L49428A58418
17169B18093K33674j29636n05l7122R60E0351K60584F3245L87861B18636a0733
17157C06658A48098K08131L9675M01m0599j42870A1417h8469C54884j23823i0280
17145C30852E3737K32033l5752L62622k52841J80548a7870C68898o288J21153
17135D83763J22605q7787n6467I3610K82508R8615j57246J55986j87866N5635
17125C41242K48732J04197C21886J70497K9274J56929C0467L13907q4475r1204
17115A68695K88567K41076C29331A46177k4010N9030c2371C35937J44858Q4127
17105E64922k45591A48984K38638r9145j4209K80609o4779J70268l27703k3955
$$ y = [342994, 227923, 179092, 429158, 246249, -90356, 162372, 286169, 18391, 367819, 158418, 218093, 451767, 322131, 321626, 284504, 285464, 50351, 310935, 63245, 451106, 218636, -10733, 306658, 148098, 356229, 395904, 396305, 355706, 212836, 11417, -88469, 354884, 231061, -90280, 330852, 53737, 285770, 250018, 612640, 359799, 540347, -17870, 368898, 362610, 483763, 606368, 518581, 462114, 93610, 376118, 474733, 317487, 473473, 285607, 341242, 589974, 694171, 321886, 492383, 521657, 678586, 30467, 344374, 259899, 168695, 457262, 698338, 329331, 146177, 122167, 181197, -32371, 335937, 480795, 564922, 319331, 148984, 387622, 288477, 274268, 554877, 490098, 660366, 332663, 308708]
17095C08708K14792J46099k97211j54855N04044A99007Q9809J28089j56054N2812
17085C13663J91040J29245k36928L9198K7669j07563J36340j7961m922j54097
17075C15684q7295L8090M19948C27142N6873j63013J32138J87212k42897K62624
17065E60079B7113N86981p7975R918j45645K45595j93771o3932K67265l26644
17055C28905K46625A57404L15306J50464k08819K12922k91550J18055j8080A38862
17044C43911K4318K04261P6883l0151j70084J68682k54792J41725j53844K36813
17034E87722L20566m07757M2807J2086J68784j01432J66719n2952j99654r2732
17024D44157M07235j49392k43767J10208N3997K22763l26550M5864J39031l24041
$$ y = [308708, 523500, 669599, 372388, 217533, 721577, 199007, 288816, 416905, 260851, 313663, 504703, 633948, 397020, 436218, 463887, 356324, 492664, 474703, 469781, 315684, 228389, 266479, 686427, 327142, 384015, 221002, 353140, 540352, 297455, 560079, 27113, 614094, 536119, 546037, 400392, 645987, 452216, 388284, 655549, 328905, 575530, 157404, 472710, 623174, 414355, 627277, 335727, 453782, 435702, 138862, 343911, 368229, 572490, 649373, 619222, 449138, 617820, 363028, 504753, 350909, 587722, 908288, 500531, 543338, 555424, 724208, 622776, 789495, 736543, 536889, 444157, 851392, 702000, 458233, 568441, 622438, 845201, 518651, 564515, 703546, 379505]
17014C79505L83115k69031L2329P1643K38806J26201j29088j32691K03025j97331
17004G06483N6947O8382k70255J54312J11327k01742K14587j39644M33340C93201
16993H11756k04892K59834l19865K77730k6950k68282N66266k85166J78598P5394
16983A064423l77676J55522J04836j44463L54186m51138J57764J43399K8347D75073
16972I66431k80708J21246O7575K92918m22469K14119P9629j03437J57766m04095
16962F88975j0713J88860L67273j59891J5294m4158k08193L57601n4723J39145
16952A279470j80197k31814L47540j3707j56650J72809J7552J4648k49986J08801
16942A108466J7822J12651j24910K68800R9158l09628P3967L02131m11788L07231
$$ y = [379505, 762620, 493589, 525918, 597561, 836367, 962568, 833480, 700789, 903814, 706483, 763430, 831812, 561557, 715869, 827196, 625454, 840041, 700397, 1133737, 393201, 811756, 606864, 866698, 546833, 824563, 797613, 529331, 1095597, 810431, 989029, 1064423, 686747, 842269, 947105, 802642, 1156828, 705690, 863454, 1006853, 1035200, 475073, 966431, 685723, 806969, 874544, 1167462, 744993, 959112, 1038741, 935304, 1093070, 688975, 678262, 867122, 1234395, 1074504, 1089798, 1045640, 837447, 1195048, 1140325, 1279470, 1099273, 867459, 1214999, 1201292, 1044642, 1217451, 1235003, 1249651, 999665, 1108466, 1126288, 1238939, 1114029, 1382829, 1481987, 1172359, 1246326, 1548457, 1136669, 1443900]
16932A443900K0878l55139K48197j9377k15500J63107J58750j86262K29072O8042
16922A555668k42101J27856O7471J83228j06596k43641K2008j42251M59656k29644
16912A451654J39033R398L45967k22282n6187L31694p74488L96293j06441L80376
16902A895017j75634r5874L63418j45056J2663M0695J16849K04777m70982K62235
16892B008108n6714K21243j37564J311j4228J95927p0319L01393k47839J56057
16882B357375k94582N88956n12830m4692N71650k09851j56481l6263N73494k60389
16872B576387k36183K05749m7679L05335l26796J68334K53597m20796N74570k68662
16862B783856K47162l6715Q188j21193K50803Q4421L41159k53391n6949J28239
$$ y = [1443900, 1464778, 1109639, 1357836, 1338459, 1122959, 1286066, 1444816, 1258554, 1487626, 1555668, 1313567, 1441423, 1508894, 1692122, 1585526, 1341885, 1363893, 1221642, 1681298, 1451654, 1590687, 1600085, 1946052, 1723770, 1667583, 1999277, 1224789, 1621082, 1514641, 1895017, 1719383, 1623509, 1986927, 1841871, 1854534, 1895229, 2012078, 2216855, 1745873, 2008108, 1951394, 2172637, 2035073, 2036384, 2022156, 2218083, 2147764, 2449157, 2201318, 2357375, 2062793, 2651749, 2138919, 2094227, 2665877, 2456026, 2299545, 2263282, 2836776, 2576387, 2340204, 2545953, 2498274, 2803609, 2476813, 2645147, 2898744, 2477948, 3052518, 2783856, 3031018, 2994303, 3002491, 2881298, 3132101, 3216522, 3557681, 3304290, 3247341, 3375580]
16852C375580K1421j13818R715J36687K41366k77129K66431J3395L5145L09528
16842D018321N3807j15779J54333q0369N9254L14823j9490J83623n5621j58581
16832D354321Q1359M23603j22268j96680L13697J56225k28364N11455K3435p8713
16822E238070M88512k09715M01498o13880N52734O5665L57055R8246J78175m8225
16812F508135K37672J64846K06248J41019k64509M89196J09796K22753Q9510L18470
16802H223136j50425L87646L77393J81708N0274J21655O39559j61283K46418N48196
16792A0464277L31538M07907j29391L69753K01677J26022M34842M77441M42386
16783A3126452M52539J24672P94740K97871M60189K00268N20798N33659M15618
$$ y = [3375580, 3397001, 3283183, 3292898, 3429585, 3670951, 3393822, 3660253, 3673648, 3708793, 4018321, 4072128, 3956349, 4110682, 4030313, 4089567, 4404390, 4384900, 4568523, 4512902, 4354321, 4435680, 4859283, 4737015, 4540335, 4854032, 5010257, 4781893, 5293348, 5316783, 5238070, 5726582, 5516867, 5918365, 5304485, 5857219, 5922884, 6279939, 6378185, 6556360, 6508135, 6745807, 6910653, 7116901, 7257920, 6993411, 7482607, 7592403, 7815156, 7904666, 8223136, 8072711, 8460357, 8837750, 9019458, 9069732, 9191387, 9830946, 9669663, 9916081, 10464277, 10795815, 11203722, 11074331, 11444084, 11645761, 11771783, 12206625, 12684066, 13126452, 13578991, 13703663, 14498403, 14796274, 15256463, 15456731, 15977529, 16511188, 16926806]
16774A6926806P38390N84228N32624N02540O36117P18242Q80619N67945J014582
16765B3102093Q45816J150663O78542J153808R02938J118635J577805J007011
16757C1537311J547643J375897J449403J555364J706074J835359K083054J899475
16749D4989580K233055K299503K583333K571958K927864K888163L472401L454370
16741F7420227L524544M069005M445320M540335M330025N379686M742413N667151
16733A04118706N797220O008963O222418O336878O284139O102999O518341O075186
16725A53464850N658637N461866M694041M108026K827909K200625J071860L74513
16717A79862327j247206j803714k693860l982688m367770n316138n827057n563823
$$ y = [16926806, 17665196, 18249424, 18782048, 19284588, 19920705, 20638947, 21519566, 22087511, 23102093, 23947909, 25098572, 25777114, 26930922, 27833860, 28952495, 30530300, 31537311, 33084954, 34460851, 35910254, 37465618, 39171692, 41007051, 43090105, 44989580, 47222635, 49522138, 52105471, 54677429, 57605293, 60493456, 63965857, 67420227, 70944771, 75013776, 79459096, 83999431, 88329456, 93709142, 98451555, 104118706, 109915926, 115924889, 122147307, 128484185, 134768324, 140871323, 147389664, 153464850, 159123487, 164585353, 169279394, 173387420, 176215329, 178415954, 179487814, 179862327, 178615121, 176811407, 174117547, 170134859, 165767089, 160450951, 154623894, 149060071]
16709A49060071o542879o347135o290933o290050o008634o636042n644590n630087
16701I9669721n410530m925677n155413m734423m090466l928980l842221l336846
16693F4245165l405198l316367k829544k690920k590555k438645k280798k110609
16685D2582529j769315j911954k019601j375753j646780j726082j145490j436382
16677B9551172p08432j262804r97321j364846j080988o62525j123115o95001p28882
16668B0927258q35152o53732m31041o80704r95770n59267l41373r66526o1819
16659A5401874k00403m40558m86977q76887l38903k30687m67160o26023R9720
16650A1833996n76222l51771J08145q25717K639j25718m83560j25844m28928m50926
$$ y = [149060071, 142517192, 136170057, 129879124, 123589074, 117580440, 110944398, 105299808, 99669721, 94259191, 89333514, 84178101, 79443678, 75353212, 71424232, 67582011, 64245165, 60839967, 57523600, 54694056, 52003136, 49412581, 46973936, 44693138, 42582529, 40813214, 38901260, 36881659, 35505906, 33859126, 32133044, 30987554, 29551172, 28842740, 27579936, 26582615, 25217769, 24136781, 23474256, 22351141, 21656140, 20927258, 20092106, 19438374, 19007333, 18326629, 17330859, 16771592, 16430219, 15463693, 15401874, 15201471, 14760913, 14273936, 13397049, 13058146, 12827459, 12360299, 11734276, 11833996, 11257774, 10906003, 11014148, 10188431, 10191070, 10065352, 9581792, 9455948, 9027020, 8576094]
16640H576094M82426p30844L0900l12854m59386J57441k16692j93336p7636j79684
16630G076429j7918q4191j13205o85962N70304l23637k78744j67803n9665n8604
16620E857004l22378k66983R9861Q481m9893k29184j90908j52269j0239K00117
16610D943609l19935j87190l85551J24850M03374n63219P8151l26751M89514n56693
16600C700159K79164o8261k9455j97895n8827n62254J94610M24993j95156k35140
16590C251938J95328k88917K87964j24990m53148k7843J2973j08505J05413n43715
16580B306498L89210P4094k32447j04288K90263r6901p4565m35252K56717J22510
16570B495839j90505j92892J34765j58333K20177k9006P31k17605J79059J4492
$$ y = [8576094, 9058520, 8327676, 8358576, 8045722, 7586336, 7743777, 7527085, 7333749, 7256113, 7076429, 7058511, 6974320, 6861115, 6175153, 6745457, 6421820, 6143076, 5975273, 5915608, 5857004, 5534626, 5267643, 5367504, 5375985, 5326092, 5096908, 4906000, 4753731, 4743492, 4943609, 4623674, 4436484, 4050933, 4175783, 4579157, 4015938, 4094089, 3767338, 4256852, 3700159, 3979323, 3911062, 3881607, 3683712, 3624885, 3062631, 3257241, 3682234, 3487078, 3251938, 3447266, 3158349, 3446313, 3321323, 2868175, 2840332, 2853305, 2744800, 2850213, 2306498, 2695708, 2769802, 2537355, 2433067, 2723330, 2626429, 2551864, 2116612, 2373329, 2495839, 2305334, 2112442, 2247207, 2088874, 2309051, 2280045, 2280776, 2063171, 2242230, 2256722]
16560B256722j36566p0740j43914K21794j90867j15172m9196L39472j27990k10593
16550A772950J24705j82473K5459J3616K92077j02553n11496M53395m08132K00634
16540A678182j13103j95865k85976P40841K778m55889K4248L6031l6021j2927
16530A382299L682l5905Q6443l46922M95458k00377N0899k6294j91917K33619
16520A450985m38181P13703p04378M30292m10777P9072j4633j9914K94360j79505
16510A201024J94465m97158L69464m49259m4181L05583m0022N014k4755O3860
16500A084035K19655l76788r7256j52341L91676m8234k02211k71396K94194k203
16490H39131m1025K93781r8074j76209K59876j86658K574k22026L36773J1889
$$ y = [2256722, 2120156, 2049416, 1905502, 2127296, 1936429, 1821257, 1772061, 2111533, 1983543, 1772950, 1897655, 1715182, 1740641, 1754257, 2046334, 1943781, 1432285, 1885680, 1477548, 1678182, 1565079, 1369214, 1083238, 1824079, 1826857, 1370968, 1395216, 1431247, 1395226, 1382299, 1385981, 1350076, 1436519, 1089597, 1585055, 1384678, 1435577, 1409283, 1217366, 1450985, 1012804, 1726507, 1022129, 1452421, 1041644, 1120716, 1106083, 1086169, 1380529, 1201024, 1395489, 898331, 1267795, 818536, 774355, 1079938, 1039916, 1044930, 1020175, 1084035, 1303690, 926902, 829646, 677305, 1068981, 1020747, 818536, 547140, 841334, 839131, 798106, 1091887, 993813, 817604, 1077480, 890822, 893396, 671370, 1008143, 1020032]
16480A020032l10967Q2301J24952O9863l97402N2764j23935N15022k87393q6406
16470F58831l7252J68670L2635j80585m157K46732m366C91490N47208k83714K52790
16459I07774l29898L04771l10772B69931n3834M59366J76528j95382M23288l72611
16449G07286k3971q8362o5403K21928l39888A81513L31306K93189k88747J2341
16439E29602j01358K63910J56969C84333J40438K27759C24217O03511k86304l01070
16429C40354L55991Q235k46334k0665J65498q2362M6831k07170j56924J03675
16419C07129K12969K30039l60647j537K47406A66817K55505K10871p9993k04856
16409C48344p3363L54583m4020k81571A50649M23674k46045J51443M5528j92804
$$ y = [1020032, 709065, 791366, 916318, 986181, 588779, 641543, 517608, 1032630, 745237, 658831, 621579, 790249, 822884, 642299, 638142, 884874, 880508, 391490, 938698, 654984, 907774, 577876, 882647, 571875, 269931, 216097, 675463, 851991, 656609, 1079897, 707286, 683315, 594953, 529550, 751478, 411590, 181513, 512819, 806008, 517261, 529602, 428244, 692154, 849123, 384333, 524771, 752530, 324217, 927728, 641424, 340354, 696345, 704580, 458246, 437581, 603079, 520717, 567548, 360378, 203454, 307129, 520098, 750137, 389490, 387953, 635359, 166817, 422322, 633193, 553200, 348344, 274981, 629564, 585544, 303973, 150649, 574323, 328278, 479721, 525249, 332445]
16399C32445R5170L20097k21113J24494J15023j98576k33937J07654J35296B21801
16388B91206n0237L7376O5889J9161M9523k01226Q821C8778K51285j14400i334
16376C63085o1111L10818B41120Q0839I5377M65817B07616A00195j8011R7010
16366A79194O3192J54313A93314J7713M3266J73134O05j89620L03765k58187R0548
16355C74538n2475P4117q9418q4662K45744j57826K37676k20098O1183i2967A07747
16343B49578j10890D7267M60648B27173K30563l2282K34482A40974K04705G3988
16332B09106k1629J4192N0638J75164j02254j9374j50419M92432B18020J72994
16322C91014H7697K90710l052A59560K53884j76531f2493A89371L16857k36228
$$ y = [332445, 427615, 747712, 526599, 651093, 766116, 567540, 333603, 441257, 576553, 221801, 291206, 240969, 278345, 344234, 363395, 412918, 211692, 220513, 38778, 290063, 175663, -9334, 363085, 301974, 612792, 241120, 321959, 95377, 561194, 207616, 100195, 82184, 179194, 242386, 396699, 193314, 211027, 254293, 427427, 428032, 238412, 542177, 283990, 374538, 322063, 396180, 306762, 222100, 467844, 310018, 547694, 327596, 388779, -92967, 107747, 249578, 138688, 47267, 507915, 227173, 457736, 425454, 659936, 140974, 345679, 73988, 209106, 187477, 201669, 252307, 427471, 325217, 305843, 155424, 647856, 218020, 391014, 87697, 378407, 375355, 159560, 413444, 236913, -62493, 189371, 506228, 270000]
16312B70000A34019F3819J39753K6588E2752c0951m84219E5292J89983k1287J59079
16301C83067A31210J18423J81149h5356B60687K39992A57610J8174J4121Q0912
16291B70817a09550C48663D7157K83099J17A51272F9010e4266a6932B80684A31513
16279h5920L4244A09097k9652J81943J10124a65061A11797b21466B81528J34392
16269D15920A77206A3194J66805q7507c616A10071J6393e1950A66443l475o1547
16258A01421Q5974n18c9819C80478j09799a17978H6932i6414C82793A42730h2793
16246A1874b435B29451g4548C8482J04855O3852K611O363B8725K90992Q7569c6483
16233e7284A47455a31451G7630P8078h7242B5164h8537B63730n5866c19108B47046
$$ y = [270000, 134019, 63819, 203572, 230160, 52752, -30951, -515170, 55292, 245275, 223988, 383067, 131210, 249633, 430782, -85356, 260687, 500679, 157610, 175784, 189905, 270817, -109550, 348663, 47157, 330256, 330373, 151272, 69010, -54266, -16932, 280684, 131513, -85920, -51676, 109097, 79445, 261388, 371512, -165061, 111797, -221466, 281528, 415920, 177206, 13194, 179999, 92492, -3616, 110071, 126464, -51950, 166443, 162968, 101421, 187395, 186877, -39819, 380478, 270679, -117978, 86932, -96414, 382793, 142730, -82793, 11874, -2435, 229451, -74548, 38482, 143337, 207189, 209800, 216163, 28725, 319717, 407286, -36483, -57284, 147455, -131451, 77630, 155708, -87242, 25164, -88537, 263730, 207864, -319108, 247046]
16221B06958b9338j6729B07271D6138k2539c93620A47254j3403d5356o4464l2031
16210a41851C2014Q2214O2563e6106A25190a54589A84533Q1506A00939J62851
16200B63790g592B02228F6330K33460B8634d1894C22996C2178J07107L41165a99944
16188a11693a7612k11929g1375A28395N9266a03209B13461j03293k1137K50154
16178C39185g7021G8634J46867a11287C0351b2166C03044a53667A98228a08655
16167a17001A56749N6657d7811p7816d7844n6902c4564l6844B68798H4470a05855
16155C02853L7135b44425A3098E80a58761f5849k21390n7181A75265J43794J53183
16144D72242b5205r6822B50563d125F8967C0091M776M1407g192A95847d815C08218
$$ y = [206958, -29338, -46067, 207271, 46138, 23599, -393620, 147254, 133851, -45356, -109820, -141851, 32014, 114228, 176791, -56106, 125190, -154589, 184533, 266039, 100939, 263790, -7592, 202228, 66330, 299790, 28634, -41894, 322996, 32178, 139285, 480450, -199944, -111693, -17612, -229541, -71375, 128395, 187661, -103209, 213461, 110168, 89031, 339185, -77021, 78634, 225501, -111287, 30351, -22166, 303044, -153667, 198228, -108655, -117001, 156749, 213406, -47811, -125627, -47844, -104746, -34564, -71408, 268798, 84470, -105855, 302853, 339988, -244425, 13098, 580, -158761, -65849, -287239, -344420, 175265, 319059, 472242, -25205, -122027, 250563, -4125, 68967, 30091, 34867, 76274, -7192, 195847, -4815, 308218]
16131C3454J78025a26143N1789A08918d3098A20083E8964B3783N0083K64668A63280
16119b1605O004A08462J06274H0073a45098f2888j05742B28237a14032M4730B51043
16107a64875A47782q032k3772J16998o2151P0244C4493a17682E2422J88581n9215
16096A81788e2068D11389b36385A04366K62869j14439a55721C56423A18148l9709
16086G8439b49108L0232e0614j63947e8362o4737G3579e4952J6633D1782F82K16362
16074B17044a02196j67660B81530h69G1063B5332d4611a741j26770A8573a52553
16062c0404G4101i3567A01337b7397h610A12866c71693A80071Q0497m089A0581
16050d7741r5848A97157d2102j18693G3688O8464k1658k4596L52k9948i842o0314
$$ y = [33454, 211479, -126143, -74354, 108918, -43098, 120083, 58964, 23783, 73866, 338534, 163280, -21605, -15601, 108462, 214736, 80073, -145098, -62888, -168630, 228237, -114032, -69302, 251043, -164875, 147782, 139750, 115978, 232976, 170825, 241069, 34493, -117682, 52422, 241003, 181788, -52068, 411389, -236385, 104366, 367235, 252796, -155721, 356423, 118148, 78439, -249108, -218876, -50614, -214561, -58362, -123099, 73579, -54952, -38319, 41782, 682, 217044, -102196, -269856, 281530, -869, 71063, 25332, -44611, -1741, -128511, 18573, -152553, -30404, 74101, -93567, 101337, -27397, -8610, 112866, -371693, 180071, 260568, 256479, 10581, -47741, -143589, 197157, -42102, -160795, 73688, 142152, 120494, 95898, 96250, 66302, -9842, -70156]
16038g0156A4398J45407o7519b44977C87217j84304j01035a40452a9584j37804
16028a57388k723a2994k81676a26101B93930c9801a3085J886k34152B18492J91411
16017D09903c67306e2551Q693j20463A03128P0664c80510C92356b67475F7069
16006b34584C16038N5581B8374A097h9517A23868p990N0966b3879b136C23952
15994b06015I5795J74942b917l4574m4979J1838j01108f2902H2325L29550b9101
15982a5145C51709j36572J09823q8167E7871k8768J73118c8692e647j18683L3516
15971i0814a6274p2800m31892a10980A80251a24940e1295g856b618j63310l59839
15960e25767A55174a86171g3789l2690j56915B00994a60221n693F1612a62659
$$ y = [-70156, 14398, 159805, 92286, -244977, 387217, 202913, 101878, -140452, -19584, -157388, -160111, -12994, -294670, -126101, 293930, -39801, -13085, -11199, -245351, 218492, 409903, -367306, -52551, -43858, -164321, 103128, 173792, -380510, 392356, -267475, 67069, -234584, 316038, 371619, 28374, 1097, -89517, 123868, 115878, 166844, -23879, -2136, 323952, -206015, 95795, 270737, -2917, -37491, -82470, -70632, -171740, -62902, 82325, 411875, -29101, -15145, 351709, 215137, 324960, 236793, 57871, 29103, 202221, -38692, -5647, -124330, -90814, -16274, -89074, -520966, -110980, 180251, -124940, -51295, -7856, -2618, -165928, -525767, 155174, -186171, -73789, -106479, -263394, 200994, -160221, -165914, 61612, -162659]
15949a83548E7624K29112e1381C55573a07744d799m30895a50404G260f1899J6411
15938d5488I8825a27490B38533L2418i605l5013B0682a2083D2165J44844Q7356
15927B74365a2711r0220A00178f8566j80272N8001m9027i5202C6713b09349G1121
15915b7427k24126O7433P6422A9655J5569N7627C696a29102H078a18905I5086
15903G4443d37041a29104A21221f7949H3504c21129a28254B29628F1623Q984a59438
15891A4679Q6940P5874b56538a25166M8675H8019h592A73668i4502B69072B4161
15879H4181c5315L656p6063F9207a41306A66850F1555A488J46820D4000b7635
15867b02443B21850f9339o7984A21215b26175c4718G4038b18092Q7123A94222
$$ y = [-183548, 57624, 286736, -51381, 355573, -107744, -4799, -435694, -150404, 7260, -61899, -45488, 98825, -127490, 238533, 270951, -9605, -44618, 20682, -12083, 42165, 187009, 274365, -12711, -102931, 100178, -68566, -248838, -190837, -239864, -95202, 36713, -209349, 71121, -27427, -251553, -184120, -107698, 19655, 35224, 92851, 3696, -129102, 8078, -118905, 95086, 74443, -437041, -129104, 121221, -67949, 83504, -321129, -128254, 229628, 61623, 70607, -159438, 14679, 101619, 177493, -256538, -125166, -76491, 88019, -8592, 173668, -94502, 269072, 24161, 84181, -35315, -31659, -107722, 69207, -141306, 166850, 61555, 1488, 148308, 44000, -27635, -202443, 221850, -69339, -137323, 121215, -226175, -34718, 74038, -218092, -130969, 194222]
15856A16243c85853B01510A9378a63839A30660f7031B94053a29950n5998C7354
15845A06753k9659b5110F3607c532A16911B6822K4255L20511j82051a89405E7905
15833b16233h7261A12096J61146b24556A28199a56217g5741C1142c16917a9758
15822A17438C1816L6436L0244e5233k64408l0257J27246C37485a02927M2868J8856
15811d1203C5852a93294A5238b48070a0266G0591K15868G6342O4336a55453A99343
15799b34618A3172c53693c7217A00263b01278C12198j31923G1490K4280L0920
15789A26690D6575a31385H4504a78740r9002G0532e8698j07278M0415L5114C6350
15777d53618f9014f331D4829J1802b41438B77628I0084J72675C8356c09559R2914
$$ y = [116243, -385853, 201510, 19378, -163839, 130660, -67031, 294053, -129950, -185948, 37354, 106753, 77094, -25110, 63607, -3532, 116911, 26822, 51077, 371588, 189537, -189405, 57905, -216233, -87261, 112096, 273242, -224556, 128199, -156217, -75741, 31142, -316917, -19758, 117438, 31816, 68252, 98496, -55233, -319641, -349898, -222652, 337485, -102927, -60059, -41203, 35852, -193294, 15238, -248070, -10266, 70591, 286459, 76342, 140678, -155453, 199343, -234618, 13172, -353693, -37217, 100263, -201278, 312198, 180275, 71490, 95770, 126690, 46575, -131385, 84504, -178740, -277742, 70532, -58698, -165976, -125561, -90447, 36350, -453618, -69014, -6331, 44829, 56631, -241438, 277628, 90084, 262759, 38356, -309559, -216645]
15766b16645B77377e730I834a93461m0764A42053C8046b43983b9853k39000A8408
15754B3145Q8152K7915a08967C18153j32811l537K31299b73150a19816I1045b7122
15742d5333B14074b16114P1656d7852B93842a09318C36351b01990I0305a1525
15731b80476A37675b95058F6615a34091A01789a5456k45078A52582l8586a96000
15720a40254L4133E8186a45644j8416m8504b5254A1324a25124D6535M41J9327
15709F6303K5268c9674I1566C5430b25102r7838b3994k29822P4878a9324j38387
15698a57711P4179A51894a82316d0584k94282A6103K27651e5510A59784c2163
15687B52575A24169l4220a33439d5851I6892a7620j67879J8814H4907a93686c7476
$$ y = [-216645, 277377, -5730, 9834, -193461, -234225, 142053, 38046, -243983, -29853, -268853, 18408, 23145, 111297, 139212, -108967, 318153, 185342, 181805, 413104, -273150, -119816, 91045, -27122, -45333, 214074, -216114, -144458, -47852, 293842, -109318, 336351, -201990, 90305, -11525, -280476, 137675, -295058, 66615, -134091, 101789, -15456, -260534, 152582, 113996, -196000, -140254, -106121, 58186, -145644, -164060, -212564, -25254, 11324, -125124, 46535, 46976, 66303, 91571, -39674, 91566, 35430, -225102, -322940, -23994, -253816, -178938, -19324, -157711, -83532, 151894, -182316, -40584, -334866, 16103, 243754, -55510, 159784, -32163, 252575, 124169, 89949, -133439, -45851, 96892, -17620, -185499, -166685, 84907, -193686, -37476]
15675b51039a19634a351k3519A69869o8091a85879Q062B49678l6345a84797A12309
15663a06320l9108k9424f1336n774k68200B14065h6624A80321a61261H6150A4701
15651d45749P4894J2477a54356C2969R6425N3146J15852M7984F0073i2631q9224
15640a81855j3183b7506A14330c9057j81363R1952A46859a3855o6049J5568A17145
15628B13287g658H3129b45472k6148H5800N9001B2818O5945b18763e8967J5947
15617d3020D9687J55411a28698L3666d0974l19987i3016n7286A98907k4516K3889
15606A98280b22556A88245M6020b03399P1413d5174j88571A10290l8117J28876
15596B01049d5574F1690Q8805b54691C30770c11519f3287k6969F5820k8116N8744
$$ y = [-251039, -119634, -1351, -24870, 169869, 101778, -185879, -177817, 249678, 213333, -184797, 112309, -106320, -145428, -174852, -61336, -67110, -335310, 214065, -86624, 180321, -161261, 86150, 14701, -445749, -370855, -358378, -154356, 32969, 129394, 182540, 298392, 346376, 60073, -92631, -181855, -195038, -27506, 114330, -39057, -220420, -128468, 146859, -13855, -79904, -64336, 117145, 213287, -7658, 83129, -245472, -271620, 85800, 144801, 22818, 88763, -218763, -58967, -43020, 49687, 205098, -128698, -95032, -40974, -360961, -93016, -150302, 198907, 174391, 198280, -222556, 188245, 234265, -203399, -131986, -45174, -233745, 110290, 72173, 201049, -45574, 61690, 150495, -254691, 330770, -311519, -63287, -90256, 65820, 37704, 96448]
15585I6448d708j26722A3743d11229I470b23610J01116m7204f3290I0817f9500
15573a86176c6173H7314i0396K9700H8055R0715a56402J5200m1323M901A87499
15561A80601b51549B2546J90627a61007B36210h1654j53812B92374e6454I7795
15550A09809M4176b13067B61792b55324b5899C25270c14991A37498d56634J40374
15540c16260A39062m6168C5144g7847A46344M5095p1395b4731E995a6565A1148
15528a34355f2406A98595a14199B2659a32566k62733C83126a83670l36l21276
15518e05282C3652J2087a7531D0878a07969D1457c63948F0478b05723e4269A33655
15506I0961K43591a27613k46612a63457A54170c6721p0796K4189j41237D3839
$$ y = [96448, -4708, -131430, 13743, -411229, 9470, -223610, -122494, -169698, -63290, 90817, -69500, -186176, -36173, 87314, -90396, -60696, 88055, 178770, -156402, -141202, -182525, -177624, 187499, 180601, -251549, 22546, 213173, -161007, 236210, -81654, -235466, 292374, -56454, 97795, 109809, 153985, -213067, 261792, -255324, -25899, 325270, -314991, 137498, -456634, -316260, 139062, 92894, 35144, -77847, 146344, 191439, 120044, -24731, 5995, -16565, 11148, -134355, -62406, 198595, -114199, 22659, -132566, -395299, 383126, -183670, -184006, -505282, 33652, 45739, -17531, 40878, -107969, 41457, -363948, 60478, -205723, -54269, 133655, 90961, 334552, -127613, -374225, -163457, 154170, -36721, -107517, -83328, -224565, 43839]
15495C570b71377A6074a08775p3008O9336A01667a22996J0782j66627G6401J63330
15484B39731n4186a98090D26378c7595j44280B00250B0042f1925F5M3536H280
15472A3026a21868j7285j6868N7600j65813J29830d1335j81619A8773J42631G1922
15460H1238b3425A28437c8424n9302j29751R6160H9178p523g1230A72616b50430
15448b36983d8232b3774q9481B04676J68234a77631A0345b9080J922A21185a17816
15436a7902B2653d4418B38114O3473A05759J30390a9782B64222B4495K94975a8356
15424B19098a03590C6279a08013j13K0760B55988a60304B85533a31645j19181
15414b50826E6350a64776H2234J46271q6528a82389E0420j5496Q2768O2018J7991
$$ y = [3570, -271377, 16074, -108775, -181783, -112447, 101667, -122996, -112214, -278841, 76401, 239731, 185545, -198090, 426378, -37595, -181875, 200250, 20042, -61925, 65, 43601, 8280, 13026, -121868, -139153, -156021, -98421, -264234, -134404, -41335, -222954, 18773, 161404, 71922, 81238, -23425, 128437, -38424, -97726, -227477, -131317, 89178, 81655, -71230, 172616, -250430, -236983, -48232, -23774, -113255, 204676, 372910, -177631, 10345, -29080, -27158, 121185, -117816, -17902, 22653, -44418, 238114, 301587, 105759, 236149, -19782, 264222, 24495, 319470, -18356, 219098, -103590, 36279, -108013, -108126, -87366, 255988, -160304, 285533, -131645, -250826, 56350, -164776, 82234, 228505, 141977, -182389, 50420, 34924, 117692, 179710, 197701]
15403A97701b74303A91336a67641L5429A6717K0708e8350o5065A49466A2597a7432
15391c2905G8529J34008b92945a19337A17508a72843A32530B6361a72028j9269
15381a91297A27627a94133A73761b03927N7350c3462A60210b5339F0182a37035
15370F088J9274F713c36201H5989c06635k67918g771j55835A12831m3074a47557
15358D2300B0186c0759F6203R5524B609J10216a47758B84664i1007F8984K2651
15347I1635K16722C1008c85047j7714h273A17577b704A87547m6158J07531g3411
15335c7654m4642k02306Q9220e7582A19700j5520g7287k12929C6151Q2605b23680
15323D8000A8537J75524a3341A8718c71089J37190C69762A31610H022a40198C72886
$$ y = [197701, -274303, 191336, -167641, -132212, 16717, 37425, -58350, -123415, 149466, 12597, -17432, -32905, 78529, 212537, -292945, -119337, 117508, -172843, 132530, 26361, -172028, -191297, 127627, -194133, 173761, -203927, -146577, -33462, 160210, -25339, 60182, -137035, 6088, 25362, 6713, -336201, 85989, -306635, -574553, -7771, -163606, 112831, 69757, -147557, 42300, 20186, -30759, 66203, 161727, 2609, 112825, -147758, 284664, -91007, 68984, 91635, 308357, 31008, -385047, -402761, -8273, 117577, -2704, 187547, 141389, 248920, -73411, -37654, -82296, -284602, -195382, -57582, 119700, 104180, -77287, -290216, 36151, 118756, -223680, 48000, 18537, 194061, -13341, 18718, -371089, -233899, 369762, 131610, 8022, -140198, 372886]
15311B13917k1091b22448G3305a13190A30708L3239g8482C11942b88063A3363
15300F5824a2038c956D5787Q0910a03857F283a74307A14391J8388a53445B17590
15288B79241a23754N1361B3317L64315d7903q2686k0808Q506I7618N053L0904
15277A33575J41760g851m2773a8768k73904C73531b18092H147J48131a66726B02325
15265C96470I0582D0620a5752k11640D0636K11768c2642l2666D0663J19091N2248
15254B12002L8627D6944O218M13719A07248P79007N08381k85084K64038k82036
15244A091554D17835I2160B962K03039N5185L2407f8608B08838g5589H8293J7594
15233A05887M32996k65433g372j11684C4951J36635N1105j8625A8907i7319A29555
$$ y = [213917, 192826, -222448, 73305, -113190, 130708, 163947, -78482, 311942, -288063, 13363, 65824, -12038, -3956, 45787, 126697, -103857, 6283, -174307, 114391, 132779, -153445, 217590, 279241, -123754, -72393, 23317, 387632, -47903, -130589, -151397, -142891, 97618, 102671, 133575, 275335, -7851, -50624, -18768, -292672, 373531, -218092, 8147, 156278, -166726, 202325, 396470, 90582, 40620, -15752, -227392, 40636, 252404, -32642, -65308, 40663, 159754, 212002, 250629, 46944, 53162, 466881, 107248, 886255, 1394636, 1109552, 1373590, 1091554, 417835, 92160, 2962, 206001, 261186, 293593, -68608, 208838, -75589, 88293, 105887, 538883, 273450, -7372, -119056, 34951, 171586, 222691, 204066, 18907, -97319, 129555]
15221B4038a10499j86437g0673C21685Q3914A89152G0941J3978a48190j54057
15211c02247a07321J5983C38854C7807A1605b98757A11543C3679N70540a54053
15200G4867a9144B4808J7048J82118O516E6068O9563b8038D43183o1774j17178
15189B64231a70278F6853L04387q9148D7541B3323J06454a12234B24457m348d732
15177g793J260j38421f3883c0103l2514A81181b8210n3372A6738J25695a69453
15165A43088J6922J09586q4460H6482C3421K19356J80537l0947G4438h3871b6225
15153B4748P8033h3211j70292h1989C64383A0643a0989C32236G1258g3717A16003
15141G9998b18594B55725i1404C1752a79108l4431A93633H6589c8429B35600A8260
$$ y = [24038, -110499, -296936, -70673, 321685, 405599, 189152, 70941, 84919, -148190, -302247, -107321, -91338, 338854, 37807, 11605, -298757, 111543, 33679, 604219, -154053, 74867, -19144, 24808, 41856, 223974, 230490, 56068, 125631, -28038, 443183, 381409, 264231, -170278, 66853, 371240, 282092, 47541, 23323, 129777, -112234, 224457, 220109, -4732, -7793, -6533, -144954, -63883, -30103, -62617, 181181, -28210, -81582, 16738, 142433, -169453, 143088, 160010, 269596, 185136, 86482, 33421, 252777, 433314, 402367, 74438, -83871, -26225, 24748, 102781, -83211, -253503, -81989, 364383, 10643, -10989, 332236, 71258, -73717, 116003, 79998, -218594, 255725, -91404, 31752, -179108, -213539, 193633, 86589, -38429, 235600, 18260]
15129D66134b77623a22807D59241a8142C7823B112J87736n2849M0615K62478A56920
15117A25990d4160A11461F182a62293b8690J734A95500I929Q1118O0582q209m5366
15105I8054A3605L75049c585E1742J62634J18401J51318A99940G7695J82293H5093
15093A67225a38173D85577j50665I565K43368J53194E452K41790F3582j1637L59812
15082D11757D5231a46044J864C8698K38824J65944I6540J10596b594C0220J10276
15071A40496k078o010E3163O5089L799J19588a30645A44119J41487a04430D14618
15059D6778g638A83417G8700K7809a36719A92047C8038K97451H278L16048j05494
15048B18832J3972d0846A37328h0111E00964J1225a27999B54197a3037n3047F9350
$$ y = [466134, -277623, -122807, 459241, -18142, 37823, 2112, 189848, 136999, 177614, 440092, 156920, 125990, -44160, 111461, 6182, -162293, -28690, -26956, 195500, 9929, 91047, 151629, 143420, 98054, 13605, 388654, -3585, 51742, 214376, 332777, 484095, 199940, 77695, 259988, 85093, 167225, -138173, 485577, 334912, 9565, 252933, 406127, 5452, 247242, 63582, 51945, 411757, 45231, -146044, -144180, 38698, 277522, 443466, 96540, 207136, -2594, 30220, 140496, 138418, 132408, 53163, 118252, 122051, 241639, -130645, 144119, 285606, -104430, 414618, 46778, -7638, 183417, 78700, 106509, -136719, 192047, 38038, 335489, 8278, 324326, 218832, 232804, -40846, 137328, -80111, 500964, 512189, -127999, 254197, -13037, -66084, 69350]
15036a98607B30029a84699B84976N2083c1788A15561K63939G5282P0880K90230
15026D36392A26298M38986k73570A13362l8396L17354P8847b5005A56355J0149
15016A66504J46953D2277J07507A7075a47584E6325O8667a04206B40935A07842
15005a83735c9245A72766A838a8979G4193J68499j06523J97193Q808h307A13087
14993B89327G1353L73332A92155J30125k5298m1748R8158j4921a0028A60899L3255
14982A94154p3256K66458f8707D31072j94121a01202C67331B7549J52871L41052
14972E21472a4652A4861J95898Q8607j27913P9001K65319j42104a63826e862C93800
14960B52755l9808J1212r9994J12482H5179R0828G2338J42666K00390j03311I1522
$$ y = [-198607, 230029, -184699, 284976, 337059, -31788, 115561, 379500, 75282, 146162, 436392, 126298, 565284, 291714, 113362, 74966, 392320, 471167, -25005, 156355, 166504, 313457, 42277, 149784, 17075, -147584, 56325, 124992, -104206, 240935, 107842, -183735, -39245, 172766, 1838, -18979, 74193, 242692, 136169, 333362, 342170, -8307, 113087, 289327, 71353, 444685, 192155, 322280, 296982, 255234, 353392, 338471, -10028, 160899, 194154, 120898, 387356, -68707, 431072, 236951, -101202, 367331, 27549, 180420, 521472, -14652, 14861, 210759, 299366, 171453, 250454, 515773, 373669, -163826, -5862, 393800, 252755, 212947, 224159, 124165, 236647, 85179, 176007, 72338, 215004, 415394, 312083, 91522]
14948A56123L36255m9529D7625L97392l6000L6379j75916e591F8080A0523Q6392
14937I6915g7387B89554J47188H0950J04292J31240j6099j4555H1351R578R1424
14926A82353K06949A18656l4050L68330E4943N6630n4813J79837K27062A62434
14915C88773c0192A71016r822p5550J85144J79669r64L246q4969q5766o5157O6915
14903B83762j23852O9905L780B9667M59445q7149A32223J57226q9541d5708B17201
14891E4712L46095j87942M28166l01799n1828K49494A96888M345n8885R3006J98121
14880D33475L9403j20900q2980L18923q5473j70599p4717K08802o9943M2484G5750
14868A33852k9113Q8871G8717L13556R6596M7037B37123K2027I6887P0851Q4383
$$ y = [156123, 492378, 442849, 47625, 445017, 409017, 445396, 269480, -5591, 68080, 10523, 96915, -77387, 289554, 436742, 80950, 185242, 316482, 300383, 285828, 81351, 90929, 182353, 389302, 118656, 84606, 452936, 54943, 111573, 56760, 236597, 463659, 162434, 388773, -30192, 171016, 161194, 85644, 270788, 450457, 449493, 452739, 367770, 282004, 216847, 283762, 159910, 229815, 233595, 29667, 489112, 401963, 132223, 289449, 199908, -45708, 217201, 54712, 400807, 212865, 641031, 339232, 287404, 536898, 196888, 201233, 142348, 235354, 433475, 472878, 351978, 268998, 587921, 502448, 331849, 257132, 465934, 395991, 438475, 75750, 133852, 104739, 193610, 78717, 392273, 488869, 535906, 237123, 259150, 96887, 167738, 252121]
14857B52121l6147K66171n609k1187j63284P5375K76972j56695o300J10725K010
14846E94152k78718J81424E0451N50938j55078p1271J9742F8685N05113A47002
14835E11899K63149k91764B19241K42049k5287j59176l6319M58863k73158j63359
14825B62854J98739Q4529m6983k08165J57627j8712N6242R2252k29666J14758
14815D63475A90458K07773J03884O6682M9800B86471P3505K55190j35772B11088
14804C72595J2665K05438B88532M4003K10697j89730J38510K5163m1277n8821
14794D17077j54352J42088q8314M66777j42013k45602L45378p3063k1698q2146
14784E64132j75142j62383K70446P0065k35522K97685j52390j26293L79251o1773
$$ y = [252121, 215974, 482145, 476536, 455349, 292065, 367440, 644412, 487717, 481417, 592142, 594152, 315434, 496858, 50451, 601389, 446311, 375040, 394782, 68685, 573798, 147002, 511899, 775048, 483284, 219241, 461290, 436003, 276827, 240508, 699371, 426213, 262854, 461593, 546122, 499139, 290974, 448601, 429889, 486131, 578383, 348717, 463475, 190458, 398231, 502115, 568797, 618597, 286471, 359976, 615166, 479394, 211088, 372595, 385260, 590698, 288532, 332535, 543232, 353502, 492012, 517175, 475898, 417077, 262725, 404813, 316499, 783276, 641263, 395661, 741039, 667976, 646278, 564132, 388990, 226607, 497053, 567118, 331596, 629281, 476891, 350598, 729849, 668076]
14774F68076B91121L84934r4895A29110K88114K16374q8721J57635l17299p5152
14764C10061K65049k34344M05198N6705j88959k38780J59047J40271L17632m41238
14754E50642j89625L28345j07905P1639M2982B61197J25902K71799q2871n8128
14744E17899q8548l4319N07504k61510j78560O1695J81773j2813J57547k01765
14734F48903k768C16841M37588j84856K930k07569L07772P2044k2394o508r5090
14723F20758N28911D99961L63874Q8774k60585J77580J03090j26298l75102J39831
14713F11125Q1831P2154k64207L92474k03827L6785J42166L52204m16393j84691
14703F19621J82407K93305m28001J61526q7248j94880J35429J05309L34170j77888
$$ y = [668076, 291121, 676055, 581160, 129110, 417224, 633598, 544877, 702512, 385213, 310061, 575110, 340766, 745964, 802669, 613710, 374930, 533977, 674248, 991880, 550642, 361017, 689362, 581457, 653096, 696078, 261197, 387099, 658898, 576027, 517899, 429351, 395032, 902536, 641026, 462466, 524161, 705934, 693121, 850668, 648903, 646135, 316841, 754429, 569573, 572503, 364934, 672706, 744750, 722356, 715848, 620758, 1149669, 499961, 863835, 952609, 692024, 869604, 972694, 846396, 471294, 611125, 692956, 765110, 500903, 893377, 689550, 726335, 868501, 1220705, 804312, 619621, 802028, 1095333, 667332, 828858, 741610, 546730, 682159, 787468, 1121638, 943750]
14693I43750l27403N05920k12179J71556j67248K07206l19611k97315L32979j48901
14683F88754L4927J20833J59204j36477J64718l3858R2838K5557k58958Q5515
14673I43053n1599J86128m3801l70780M63440K18190m49471k06553L67877J53557
14663A210041n38950O14227q3869r1273o1611K83305l59578N4976K32045j46710
14653A112603r5505j64721J93754l1301L77834l92364O00972F84456M15739j64637
14643I35558K61703J16665k22200K30665l72650O3946J17797L59865j28294r9971
14633A263084r1780Q0543k1841k5220M1898K93092l62478M9441J44478l01737
14623A069480J29051K08072k13980J46759o8982N1565L55348m37863k5254J26515
$$ y = [943750, 616347, 1122267, 910088, 1081644, 914396, 1121602, 801991, 504676, 837655, 688754, 723681, 844514, 1003718, 867241, 1031959, 998101, 1090939, 1116496, 857538, 943053, 891454, 1077582, 1033781, 663001, 1126441, 1344631, 895160, 688607, 1056484, 1210041, 671091, 1285318, 1201449, 1110176, 1048565, 1331870, 972292, 1027268, 1259313, 1112603, 1017098, 852377, 1046131, 1014830, 1392664, 1000300, 1601272, 684456, 1100195, 935558, 1197261, 1313926, 1091726, 1322391, 949741, 1013687, 1131484, 1491349, 1363055, 1263084, 1171304, 1251847, 1230006, 1204786, 1246684, 1539776, 1177298, 1226739, 1371217, 1069480, 1198531, 1406603, 1192623, 1339382, 1270400, 1321965, 1677313, 1239450, 1214196, 1340711]
14613A340711J57816M5330N3448l01m3173L6909m22354M16736l31280L95856j57874
14602A491824r4413K2607m1493O6251K9183K51920j52876j76R6838j42240J62585
14591A690010j54776R3656K55363J05479J23728k10433l89748P7605K44114q8176
14581A746822K91475p2965j28579N157r4889m6554N59780j38743k07904J99219
14571B112819r0172P724L06680j50327j81082K74643j53101L42737l0514k19311
14561B220096M61097K290N6512j019L59959m2436n1896P3359L75343J87375M85757
14550D126437R04469J839999M934895J1496177K2772269n716660A9495544I511539
14541D836862j774825p42023j78642m70638K20797k7247J06778p5958K38922R761
$$ y = [1340711, 1498527, 1543857, 1597305, 1597004, 1553831, 1590740, 1168386, 1585122, 1253842, 1649698, 1491824, 1397411, 1420018, 1378525, 1444776, 1473959, 1725879, 1573003, 1572827, 1669665, 1527425, 1690010, 1535234, 1628890, 1884253, 1989732, 2113460, 1903027, 1513279, 1590884, 1834998, 1746822, 2038297, 1965332, 1836753, 1841910, 1747021, 1700467, 2260247, 2121504, 1913600, 2112819, 2022647, 2030371, 2337051, 2186724, 2005642, 2280285, 2127184, 2469921, 2439407, 2220096, 2681193, 2683483, 2739995, 2738976, 3098935, 3056499, 3004603, 3077962, 3453305, 3640680, 4126437, 5030906, 6870905, 11805800, 23301977, 46074246, 40357586, 19495544, 9511539, 4836862, 3062037, 2320014, 2141372, 1670734, 1891531, 1864284, 1971062, 1895104, 2134026, 2143787]
14531B143787R4130k94454l2958J24635L06205k86018M77612k06885r145o8014
14521B248895J51433J68078k42361L27142j03309l96741J70226L08953R987n17873
14511B124430M14682M96036j32734l03026M40907m69742M72570k97191L08220
14502C054152n5332j26180j74708L11762q223k8106L1595K07069j16295L14304
14492C410038j42965K25020k54508K73721k39867K97248k89066K02422j44021
14483C338022L28979k45455K38748K32130l8250l14650M08180n3061n3256L10488
14473D151875j13885j05803K24365p4357J81709K08887l42855Q2900L75283O202
14463D594321q7325M7224R217K8656M7731r0313N13832m99639K99093j88943J66726
$$ y = [2143787, 2237917, 1943463, 1910505, 2035140, 2341345, 2055327, 2532939, 2326054, 2316909, 2248895, 2400328, 2568406, 2326045, 2653187, 2549878, 2153137, 2323363, 2632316, 2642303, 2124430, 2539112, 3035148, 2902414, 2599388, 3040295, 2570553, 3043123, 2745932, 3054152, 2998820, 2872640, 2697932, 3009694, 3001471, 2973365, 3004960, 3212029, 3095734, 3410038, 3267073, 3492093, 3237585, 3511306, 3271439, 3568687, 3279621, 3482043, 3338022, 3667001, 3421546, 3660294, 3892424, 3854174, 3539524, 3947704, 3894643, 3841387, 4151875, 4037990, 3932187, 4156552, 4082195, 4263904, 4472791, 4129936, 4212836, 4588119, 4594321, 4506996, 4554220, 4563437, 4592093, 4639824, 4549511, 5063343, 4563704, 4862797, 4673854, 4840580]
14452D840580J30593J94557K3657j45921L02148p4988K29374j38976J52398J18846
14442E632268M87719m75658J78908o7041K43537K46796p9208j4415O17895n79771
14432F191030M9627K12266J21956K61389j4137J40317j465J65492P0601N2462
14422G249538L43246k6820J05594K17496R7372N1419j65118K92189M57819l21695
14412H301040L32068n7627K93173q6957K28690J66132K83294L1030J33678P1978
14402I696499J51446J32349O44881j80331K49200N9156K68331l9859J02235K71271
14392A1355178N61219j34275M55590j03351o32N53128J37523o0147Q95854L4040
14382A3694127K27787J25316L62259K48564K67115K68196L91375K23465L83283
$$ y = [4840580, 4971173, 5165730, 5189387, 5043466, 5345614, 5270626, 5500000, 5361024, 5513422, 5632268, 6119987, 5644329, 5823237, 5756196, 5999733, 6246529, 6167321, 6152906, 6770801, 6191030, 6240657, 6452923, 6574879, 6836268, 6822131, 6962448, 6960983, 7126475, 7197076, 7249538, 7592784, 7565964, 7671558, 7889054, 7986426, 8037845, 7872727, 8164916, 8622735, 8301040, 8633108, 8575481, 8868654, 8781697, 9010387, 9176519, 9459813, 9490843, 9624521, 9696499, 9847945, 9980294, 10625175, 10444844, 10694044, 10753200, 11021531, 10981672, 11083907, 11355178, 11916397, 11782122, 12237712, 12134361, 12133729, 12686857, 12824380, 12764233, 13660087, 13694127, 13921914, 14047230, 14409489, 14658053, 14925168, 15193364, 15584739, 15808204, 16191487]
14373A6191487P6763K17698M78237J07123N32224K79698L99348O9827Q93407r310
14363A9236502N54751O53807L37376N34141P17094K1702N10755N83345M94142
14354B3643615N87442Q68542O16239L44935O53592N52064R86679M63572P12350
14345B9429030O74172P39811J509154L03640P81996R79036R60966J585493P86358
14336C7749656R40674J223206Q49384J392068J164186J751679J043247J904190
14328D8018290J032854J486034J935899K131894J524044J949421J887366J935848
14320F1901650K315791K593110J946275K826851K776062K685599L420192K970682
14312H3436212L282800L072329L979018M224167M281673M396802M689886N100524
$$ y = [16191487, 16268250, 16485948, 16964185, 17071308, 17603532, 17883230, 18282578, 18352405, 19245812, 19236502, 19791253, 20445060, 20782436, 21316577, 22033671, 22055373, 22566128, 23149473, 23643615, 24231057, 25099599, 25715838, 26060773, 26714365, 27266429, 28253108, 28716680, 29429030, 30103202, 30843013, 32352167, 32655807, 33437803, 34416839, 35377805, 36963298, 37749656, 38690330, 39913536, 40762920, 42154988, 43319174, 45070853, 46114100, 48018290, 49051144, 50537178, 52473077, 54604971, 56129015, 58078436, 59965802, 61901650, 64217441, 66810551, 68756826, 71583677, 74359739, 77045338, 80465530, 83436212, 86719012, 89791341, 93770359, 97994526, 102276199, 106673001, 111362887, 116463411]
14304A16463411N111556N499564O593157O215121O515248P557856P301423Q330817
14296A69588153Q675463R113422R544571J0406548J0789714J1669478J1784505
14289B41571854J2972453J3250063J3998754J4218676J4858882J5246572J5731598
14282C41848852J5644426J5696479J5385046J5119995J4246701J3594683J1709513
14275D43245695J0230415P816769N341788J446782l075906k568376m797542n226022
14267D52413603l602692n502762q397283j0185045j2348008j4429781j5292997
14260C82655035j6025566j5852521j6056813j5910436j4949053j4321729j4193659
14253B75345258j3608487j3365461j2463347j2070848j0764423j0433163j0295193
$$ y = [116463411, 121574967, 127074531, 133667688, 139882809, 146398057, 153955913, 161257336, 169588153, 178263616, 187377038, 196921609, 207328157, 218117871, 229787349, 241571854, 254544307, 267794370, 281793124, 296011800, 310870682, 326117254, 341848852, 357493278, 373189757, 388574803, 403694798, 417941499, 431536182, 443245695, 453476110, 461292879, 466634667, 468081449, 465005543, 462437167, 457639625, 452413603, 448810911, 443308149, 434910866, 424725821, 412377813, 397948032, 382655035, 366629469, 350776948, 334720135, 318809699, 303860646, 289538917, 275345258, 261736771, 248371310, 235907963, 223837115, 213072692, 202639529, 192344336]
14246A92344336r473395q587809p947253q275973p337828p368632o266139o391421
14238A30695886n254698n316462n679177m927664m480727m411739m070645l619426
14230I2935348l465895l791654l426838l127697k958040k682298k885654k227965
14222F8369307k482180k486703j949469k083747k369505j680598j985000j370129
14214E1961976j149817j777440j541798j688819j596009j042162r06270p53234
14206D1506427j426870r53160j505361r28137j281934m41082q36463j230656r77113
14197C1925651n16996r26212n41891p18866n20185n38007j068594q96846l94728
14188B5803326q46025q9190q79240p35471j57726q58098m31243J43546q45475
$$ y = [192344336, 182870941, 174283132, 166335879, 158059906, 150722078, 143353446, 137087307, 130695886, 125441188, 120124726, 114445549, 109517885, 105037158, 100625419, 96554774, 92935348, 89469453, 85677799, 82250961, 79123264, 76165224, 73482926, 70597272, 68369307, 65887127, 63400424, 61450955, 59367208, 56997703, 55317105, 53332105, 51961976, 50812159, 49034719, 47492921, 45804102, 44208093, 43165931, 42259661, 41506427, 40079557, 39126397, 37621036, 36692899, 35410965, 34969883, 34133420, 32902764, 31925651, 31408655, 30482443, 29940552, 29221686, 28701501, 28163494, 27094900, 26198054, 25803326, 24957301, 24868111, 23988871, 23253400, 23095674, 22237576, 21806333, 21949879, 21104404]
14179B1104404l41618p06506k17129m31201k37934o07107r6507o11839k18011
14170A7636552o92804k32985j57709l71321m04770P289o19734m46611J65428l59716
14160A4523619k67007j97965k38900k00568n4134o84097J6662j52991o14278J67474
14150A2297815R149n42025k62417J94208m49184P8704o25363p7460q5624J30635
14140A0668438k77445k01784k82856j19016l35795K69559k4147m75909p7581l05058
14130H838406L44055o53916l934J25748N8760n04648j69171j4487l34046J96504
14120G883271j17674k23591M7519k5688N8782l67416n9547k25910j26526O1998
14110F905218m62841J66485J39068j81310j8139k51754j45205J85853Q2371k03762
$$ y = [21104404, 20762786, 20056280, 19839151, 19407950, 19170016, 18562909, 18466402, 17854563, 17636552, 16943748, 16710763, 16553054, 16181733, 15776963, 15784252, 15164518, 14717907, 14883335, 14523619, 14256612, 14058647, 13819747, 13619179, 13565045, 12880948, 12897610, 12744619, 12130341, 12297815, 12306964, 11764939, 11502522, 11696730, 11247546, 11326250, 10700887, 10623427, 10537803, 10668438, 10390993, 10189209, 9906353, 9787337, 9451542, 9721101, 9696954, 9221045, 9143464, 8838406, 9182461, 8528545, 8524611, 8650359, 8709119, 8204471, 8035300, 8020813, 7686767, 7883271, 7765597, 7542006, 7589525, 7563837, 7622619, 7255203, 7195656, 6969746, 6843220, 6905218, 6442377, 6608862, 6747930, 6566620, 6548481, 6296727, 6151522, 6337375, 6419746, 6215984]
14100F215984p9901j94641p3132J01985j46139k12125J71208k84498K09260l51703
14090E356298o0527J14875q5636q1218j70954K01875j61491j22904k42457K10304
14080D958165n8262l09965K83122o9033p0961j08240m3595L9913K67726p6886
14070D811984p49666K89449K26945l51688P4289j34855M96520m98214j66418K8673
14060D027019Q5942l0300k508L29212k12357m63079K19539m33681J50885l70239
14050C300433K82880k42467L16151P6503k80674L09030j54074k27911k74437K88561
14040C393995k08301Q7307k98660L04696m9970J6304m49149N71651l59969M16390
14030C424294l02745J3682j03980j71308N9526j45141L8857K93522j43243j28674
$$ y = [6215984, 6136083, 5941442, 5868310, 5970295, 5824156, 5612031, 5783239, 5498741, 5708001, 5356298, 5295771, 5410646, 5325010, 5243792, 5072838, 5274713, 5113222, 4990318, 4747861, 4958165, 4899903, 4589938, 4873060, 4804027, 4733066, 4624826, 4581231, 4621144, 4888870, 4811984, 4062318, 4351767, 4578712, 4227024, 4301313, 4166458, 4662978, 4164764, 3998346, 4027019, 4112961, 4082661, 4080153, 4409365, 4197008, 3733929, 3953468, 3519787, 3670672, 3300433, 3583313, 3340846, 3656997, 3733500, 3452826, 3761856, 3607782, 3379871, 3105434, 3393995, 3185694, 3273001, 2974341, 3279037, 3229067, 3245371, 2796222, 3367873, 3007904, 3424294, 3121549, 3135231, 3031251, 2859943, 2919469, 2774328, 2813185, 3106707, 2963464, 2834790]
14020B834790l72108L06848j95200L12432m82374m264M74776k90292l06658L68005
14010B645955n26168M05581l32030M651K67048k29765p0669K04052K2303k16960
14000B173998m12546M82344j16984n2833J53984r9671j84058M9419j65663L63651
13990B191641K0954N41908L165636R031590K2850664M709860j8444455j0122266
13982A3945532n468961k368409j499890o35395m55173k3462J17461o82436k45943
13973B683324J27414k25380n1990k88198K1649L00971k91298J51852Q8224p4932
13963B441636m82460L76388k05590J1606m9717j29414J84661J36473k78204m0897
13953A964482J42197j15749J7304q4738r8611O41389p70062K2947J74893k48435
$$ y = [2834790, 2462682, 2769530, 2574330, 2886762, 2404388, 2400124, 2874900, 2584608, 2277950, 2645955, 2119787, 2525368, 2193338, 2197989, 2465037, 2235272, 2164603, 2368655, 2390958, 2173998, 1761452, 2243796, 2126812, 2073979, 2227963, 2128292, 1944234, 1993653, 1827990, 2191641, 2212595, 2754503, 5920139, 14951729, 37802393, 42512253, 24067798, 13945532, 8476571, 6108162, 4608272, 3972877, 3517704, 3494242, 3611703, 2929267, 2683324, 2810738, 2585358, 2533368, 2245170, 2266819, 2567790, 2276492, 2428344, 2516568, 2441636, 1959176, 2335564, 2129974, 2141580, 2091863, 1962449, 2147110, 2283583, 2005379, 1964482, 2106679, 1990930, 2008234, 1923496, 1824885, 2466274, 1696212, 1719159, 1894052, 1645617]
13943A645617L89025k48338k4765K0540Q6096K52932n85966K12622j68261k02717
13933A376785L88310n5275K4182J93227k06893j53384J00365j26194L78398l43141
13923A576380K2388L40494n41085M2145M63145n22107j33579J18667L29884m07235
13913A289097K62702j61777J22225q9734R8055j33754n8086j54610j08844M47944
13903A513218J27832l5364N749o4798j21929m9479N0964m64682K19113L49068
13893A529692n03250L00095O941J19246K2116j93552j21025M95897n63724K71294
13883A363730r6697L1930j36917K17183J7556l40900L45051j18349n0944l19788
13873I11855K54563K6457N6180j56483L71636j78587P2506K63081l17306k34414
$$ y = [1645617, 2034642, 1786304, 1761539, 1782079, 1868175, 2121107, 1535141, 1747763, 1579502, 1376785, 1765095, 1709820, 1734002, 1927229, 1720336, 1566952, 1667317, 1541123, 1919521, 1576380, 1598768, 1939262, 1398177, 1440322, 1903467, 1381360, 1247781, 1366448, 1696332, 1289097, 1551799, 1390022, 1512247, 1422513, 1520568, 1386814, 1328728, 1174118, 1065274, 1513218, 1641050, 1605686, 1611435, 1546637, 1424708, 1375229, 1426193, 961511, 1180624, 1529692, 1026442, 1326537, 1333478, 1452724, 1474840, 1281288, 1160263, 1656160, 1092436, 1363730, 1267033, 1298963, 1162046, 1379229, 1396785, 1055885, 1400936, 1282587, 1231643, 911855, 1166418, 1192875, 1249055, 1092572, 1464208, 1285621, 1358127, 1621208, 1303902, 1069488]
13863A069488J59848q9407k47102L98564j91337K14452k62135K8512R9121J21534
13853A301538k39555K10383n7735l77293L37537l58140J77318J44268l30888Q1091
13843H88524j38626L36810j33707m502M9762J3531j00276j39530n7660L70510
13833A084836j28587j22147l2854l233N7895j29903L09104k03014K61318m88943
13823F04472K14134K20673j88385M9136J42134J22752j99630k06505L4972Q4578
13813H78331K45833m05474O0741q5278J45320P3939Q3505k77774n393o4490K80932
13802I30192j49095o9404r391J0801K25987k27688j03650M33138p8543j95541
13792G66806J91075J635Q3131k67962j4587q5832J78008j94276K36767j6887j02273
$$ y = [1069488, 1229336, 1139929, 892827, 1291391, 1100054, 1314506, 1052371, 1080883, 1180004, 1301538, 1061983, 1272366, 1214631, 837338, 1174875, 816735, 994053, 1138321, 807433, 888524, 749898, 1086708, 953001, 948499, 998261, 1011792, 911516, 771986, 714326, 1084836, 956249, 834102, 801248, 798015, 855910, 726007, 1035111, 832097, 1093415, 604472, 818606, 1039279, 850894, 900030, 1042164, 1164916, 965286, 758781, 793753, 878331, 1124164, 718690, 779431, 694153, 839473, 913412, 996917, 719143, 713750, 649260, 930192, 781097, 711693, 702302, 713103, 939090, 711402, 607752, 1040890, 962347, 766806, 957881, 959516, 1042647, 774685, 760098, 674266, 852274, 657998, 894765, 877878, 775605]
13781G75605k48949K57597J05420J63014m91691K75769P4379p0390q8921C72481
13770F54581R4122l20220L87192q8086O9558r2923R2801j66350J14837j85278
13760E60234J13595M5963P9945l48492K78950r9816J57193k04557M6710j05337
13750E24388K82827o5711k3293J02530n615j61545q0649l318K54589j92778j11063
13739E20362N8674j41414K97050K45030l31746L00769j89247k02769J0139J92572
13729G59420l34007n6548R4667K81550r0396R7875l17656L97587D01278J50480
13719E51758O4351N7829j50771j70296J84081J15512M2392o8856r1944J61565
13709F95621j37234L65279l95568r8416J02285M4446j84133J41008J63915C40263
$$ y = [775605, 526656, 784253, 889673, 1052687, 560996, 836765, 911144, 840754, 751833, 372481, 654581, 748703, 428483, 815675, 727589, 797147, 704224, 797025, 630675, 745512, 560234, 673829, 719792, 799737, 451245, 730195, 630379, 787572, 583015, 629725, 524388, 807215, 741504, 718211, 820741, 815126, 653581, 572932, 569614, 824203, 631425, 520362, 579036, 437622, 734672, 979702, 647956, 948725, 759478, 556709, 566848, 759420, 425413, 368865, 463532, 745082, 654686, 752561, 434905, 832492, 401278, 551758, 616109, 673938, 523167, 352871, 536952, 652464, 694856, 626000, 534056, 695621, 558387, 923666, 528098, 429682, 531967, 576413, 392280, 533288, 697203, 340263]
13698F28754j71222o2487K05470O3004N8692k50415j3943J31732o4016j29779
13688C95790R6083J50458o171q2412N94109m25276k98096A68265J37810K05799
13678E11874o1958l1594M17627k65300N7649j14168K48476C41559r6849M65085
13668G09795Q2532l77907A63871M17915k7834p5220m9955j18057O62954B93556
13657D10503J06412j35021K1947J80061k21617L2238A63044J13247K82883Q5134
13647F44308j47265n293P2160A30860O51271r9131j74539F2631J48106M19049
13637F29786j56057k23619M30009j3908k25778j07798j1330K09179J15728B12894
13626C64949J4330R6796P0674k35099K18020P8902k96360A24216K88270o96M8077
$$ y = [628754, 457532, 395045, 600515, 663519, 722211, 471796, 457853, 589585, 525569, 395790, 491873, 642331, 636160, 553748, 1147857, 722581, 424485, 168265, 306075, 511874, 449916, 418322, 835949, 570649, 628298, 514130, 762606, 341559, 244710, 709795, 792327, 414420, 163871, 581786, 553952, 478732, 428777, 310720, 973674, 293556, 410503, 516915, 381894, 403841, 583902, 362285, 394523, 163044, 276291, 559174, 644308, 497043, 491750, 563910, 130860, 782131, 683000, 508461, 62631, 210737, 629786, 473729, 250110, 680119, 666211, 440433, 332635, 321305, 530484, 646212, 212894, 364949, 379279, 476075, 546749, 311650, 529670, 608572, 312212, 124216, 412486, 411790, 459867]
13615D59867B02576J08374K34775k8562B38521l6069L039J19397M4732C2083P23352
13604G55435F6553C1515M40252j81904J50855m2155N5216K803j92776K81818B49755
13592G64354A26672p901L23189A45104K06098N8799A82348K37793k02385K85015
13582E02771l0185J72386l11805M4921L22636A57119L94026A51576o3236M22887
13572E11227j55935j31105K27948O9027L694A43241J04054K68745j74737k5991
13562C15312K64899k48391q8176J91078j79425K19742m0057j06312j60864L9854
13552B07660J32021D4226P5046R3511K11678j44481J15119j56675O0153P265L761
13541C09603J56210j27914K52021l8338o1262j45432A72359L60755j77631m2368
$$ y = [459867, 202576, 310950, 545725, 517163, 238521, 202452, 205491, 324888, 369620, 32083, 755435, 66553, 31515, 471767, 289863, 440718, 398563, 453779, 456582, 263806, 545624, 249755, 764354, 126672, 118771, 441960, 145104, 351202, 410001, 182348, 420141, 217756, 502771, 472586, 644972, 333167, 378088, 700724, 157119, 551145, 151576, 88340, 511227, 355292, 224187, 452135, 521162, 524856, 143241, 247295, 516040, 341303, 315312, 580211, 331820, 243644, 434722, 255297, 475039, 434982, 328670, 167806, 207660, 339681, 44226, 119272, 212783, 424461, 279980, 395099, 238424, 298577, 305842, 309603, 465813, 337899, 589920, 551582, 490320, 344888, 172359, 533114, 355483, 313115]
13531C13115J76447H9404K97356Q9698j41584J46630l156j31493j35644q669O7966
13520B70508I6835L58843j31249J57134A17484M09667j28757A13498P1625J08177
13510B93300L6347A60283L83918j31012A86186m9684R2221D3986J27365K48626
13500D19977C8429O5215J33117P0548K0947A45855K17605j154q9640a4961B18551
13488C41630N1058B3305K69100L7863j1435k6034J62982B26944Q4992I3853M21152
13477E15005k19783a04707E13077j81847l2055o2950L6235h0163D49531b2038
13466B87607J03021N3721m2913B00613K43556r3561A72289J23869j08703A5503
13455D63701J67849B12106l3754J42371P3584A7275J63088J43265B2254J19570
$$ y = [313115, 489562, 89404, 386760, 476458, 334874, 481504, 478348, 346855, 211211, 202542, 270508, 96835, 455678, 324429, 481563, 117484, 527151, 398394, 113498, 185123, 293300, 329647, 160283, 544201, 413189, 186186, 136502, 228723, 43986, 171351, 419977, 38429, 103644, 236761, 307309, 328256, 145855, 363460, 362306, 272666, -14961, 218551, 341630, 392688, 23305, 292405, 330268, 318833, 292799, 455781, 226944, 311936, 93853, 515005, 295222, -104707, 513077, 331230, 299175, 236225, 272460, -80163, 449531, -22038, 287607, 390628, 444349, 401436, 200613, 444169, 350608, 172289, 296158, 187455, 15503, 463701, 631550, 212106, 178352, 320723, 394307, 17275, 180363, 323628, 22254, 141824]
13445A41824K38809F7316L90161A18040J54627A32058K02917I9297J28884b5691
13434C11993A33213J40403J21449A20903J26245L40917j80758A97117C158L44650
13424C47808J7547e9773A54355J10394K19605B19822N8964i8460D46244B4990
13413E4163L9710M44218A25087n7366q000L52092a77975A56236J47653O17E0468
13401B71441q197J25133j80729N071K5686L52677F9149f2548A77475J07069o3607
13390B20937o1153m5971K62280A16779a14123d3071B06175q7533K87386j41553
13380B64475j06371C8056M9745J33609I374J72540D4899J84389p1837k2352N8818
13369A93917d0190A31401K54944F4262L34240A53248J09624A22279K10189Q2745
$$ y = [141824, 380633, 67316, 457477, 118040, 272667, 132058, 334975, 99297, 228181, -25691, 311993, 133213, 273616, 395065, 120903, 247148, 588065, 407307, 197117, 3158, 347808, 365355, -59773, 154355, 264749, 484354, 219822, 278786, -98460, 446244, 24990, 54163, 93873, 538091, 125087, 67721, 59721, 411813, -177975, 156236, 303889, 304506, 50468, 271441, 263244, 388377, 207648, 212719, 238405, 591082, 69149, -62548, 177475, 284544, 220937, 159784, 113813, 376093, 116779, -114123, -43071, 206175, 118642, 406028, 264475, 158104, 38056, 87801, 221410, 9374, 181914, 44899, 229288, 157451, 135099, 193917, -40190, 131401, 386345, 64262, 398502, 153248, 262872, 122279, 332468, 415213]
13359D15213A35731D5483a549B05505L8074p6702J73136e3047C45662E6674M46124
13348E02798A59257M15504A32499M35725p2689j96249R2005j06702n8398N28L03244
13337E29963l2859B30997J34205A24978N4159K3514O3258K39456j40828n8196
13327C06341a98712E2766L14416j63523P6277K873K06381k02482A11233Q0240
13317A91473R3329o7611N6725J45913B5178O9537J58523J55464b6027B26149H5910
13305A18205K59317a55554L0105D83110b8530A117J60293J4372K78791r0240j2015
13294C52318A64579J44583a83833f8679E2828O370L38140A00056b7915r921C79799
13282b7635A54161C7413R7881a84487B84597h4146B16504a04546F6827M05528
$$ y = [415213, 135731, 45483, -1549, 205505, 243579, 166877, 340013, -53047, 345662, 56674, 502798, 159257, 574761, 132499, 568224, 495535, 299286, 391291, 284589, 226191, 226719, 529963, 497104, 230997, 365202, 124978, 179137, 202651, 265909, 505365, 364537, 306341, -198712, 52766, 367182, 203659, 279936, 282809, 489190, 286708, 111233, 191473, 284802, 217191, 273916, 419829, 25178, 94715, 253238, 408702, -26027, 226149, 85910, 118205, 377522, -155554, -125449, 483110, -28530, 1117, 161410, 175782, 454573, 364333, 352318, 164579, 309162, -183833, -68679, 52828, 59198, 397338, 100056, -27915, -37836, 379799, -27635, 154161, 37413, 135294, -184487, 284597, -84146, 216504, -104546, 66827, 472355]
13272D72355B18458l905A7521J16879J62369A38822M5102K32604A8862a20526
13261a632A61136a68089A27122K92659A26902L92545A58301J82129j65391J25970
13251C01009j03099a91121F0758R9423f0353A89846G6750k4517J64961A00541
13240A28755h4293B19668c73146A41729Q1120K37240c3196A79060M5907l6627
13230A88340J81970D9414a902C97425A94821D1281J07435a46731j0634B48886
13219A24445F232Q9742Q8809c0979C87911I4088A1137g1006m1354B08410b23923
13207C34278a68B16612K27764A33980C8092R0065D716J04807J6284P052b03332
13195H9692B1350J83665J19769D4238K08746c33897f093C36419I1365P5227e0561
$$ y = [472355, 218458, 214553, 17521, 134400, 296769, 138822, 183924, 416528, 18862, -120526, -1632, 161136, -168089, 127122, 419781, 126902, 519447, 158301, 340430, 175039, 301009, 197910, -191121, 60758, 160181, -60353, 189846, 76750, 52233, 217194, 100541, 128755, -84293, 219668, -373146, 141729, 222849, 460089, -33196, 179060, 224967, 188340, 370310, 49414, -1902, 397425, 194821, 41281, 148716, -146731, -157365, 248886, 124445, 6232, 95974, 184783, -30979, 387911, 94088, 11137, -71006, -112360, 208410, -223923, 334278, -168, 216612, 444376, 133980, 38092, 128157, 4716, 109523, 125807, 132859, -203332, 89692, 21350, 205015, 324784, 44238, 252984, -333897, -6093, 336419, 91365, 166592, -50561]
13183A97726K15655A8725K85064A30136a89092F661N0749N13017A00730K19768
13173C20498A08125P0647i0524A49115e1777b2946I6194L30248A04595d4109A44719
13161D21971b3983C10052F0134K01299d7314G4820K6075i9274A15396J38244P7094
13150C30734r7241g6384D09936C4359L12295b22581a8759B6283C075K54417A14214
13138B46609F7719J452a96149C76521a09661a9421B94586h0646B99986a32175
13127C35743o3723I5131L1384a85954P1576A85256n1209J32806j27453c9449B81151
13115a83120A29932H642d1719q940I1535l6134a3094j72396C97619A21744i3747
13103C26070a78357C13995a913j02668b9078A55421c4136l45747B19373K6193
$$ y = [197726, 413381, 18725, 303789, 130136, -189092, 6661, 57410, 570427, 100730, 320498, 108125, 178772, -90524, 149115, -51777, -22946, 96194, 426442, 104595, -44109, 144719, 421971, -23983, 310052, 60134, 261433, -47314, 74820, 100895, -99274, 115396, 253640, 330734, 233493, -76384, 409936, 34359, 346654, -222581, -18759, 26283, 3075, 257492, 114214, 246609, 67719, 69171, -196149, 376521, -109661, -19421, 294586, -80646, 299986, -132175, 335743, 272020, 95131, 126515, -185954, -114378, 185256, 134047, 266853, 139400, -39449, 281151, -183120, 129932, 8642, -41719, -50659, 91535, 55401, -13094, -185490, 397619, 121744, -93747, 326070, -178357, 313995, -1913, -104581, -29078, 155421, -34136, -379883, 219373, 245566]
13093B45566h8305A70811K92936k01556E7067J31781r0688b56480g7154F425K19114
13082B25539J07833B7415J16992J02699K1019i669E5739d5279B65958B6111L55526
13071C81637A25339K01107A53735b97985J27615A85106d8780B57113a8457f080
13060B32225f5406D51100b3338k76636D5170h1459B3830c32099D86806A3988M1920
13049E5908L09592a35127M9815j19208B37177L1737I165a03556d6362G7156a25717
13037b5220D4713N9203h4629K6811m5628C49062O9976A91241q6609J45792q5489
13026A64935R3219D957L17586j11133l2223i3946j06534F7259a65273G5736L22540
13015C98276I6880J066J65078K5320A17402b4414F6104F610J57492J30059a05713
$$ y = [245566, -88305, 170811, 463747, 262191, 57067, 188848, 98160, -256480, -77154, 6425, 225539, 333372, 27415, 144407, 247106, 268125, -9669, 55739, -45279, 265958, 26111, 381637, 125339, 326446, 153735, -297985, -170370, 185106, -48780, 257113, -18457, -6080, 232225, -65406, 451100, -23338, -299974, 45170, -81459, 23830, -332099, 486806, 13988, 55908, 365500, -135127, -85312, -204520, 237177, 268914, 9165, -103556, -46362, 77156, -125717, -25220, 44713, 103916, -84629, -57818, -103446, 349062, 419038, 191241, 104632, 250424, 164935, 258154, 4957, 322543, 211410, 179187, -93946, -200480, 67259, -165273, 75736, 398276, 96880, 97946, 263024, 288344, 117402, -24414, 66104, 6610, 164102, 294161, -105713]
13003A33783E0779M44428g5562F3702O3050a4660A85179b26835H6267i6260B24656
12991E0199f2343b7639k05351A52322G0081a6273A29030a4539A74470b7965A84756
12979c52832A33291B4748J28664O929n3545K09807f9127A2656M24349d624k2789
12968b7413j34524A11293P1466O0046g5836k6788A71766Q7405F7658a18687A38986
12956h1370A40438i5891C54249A06511C4Q4405O9235K6406g6568A59857J32036
12945B91893b30755C21360a34219I6829L1974j2263l9120f4238K9908C30442a18775
12933D75585e1449B14938C3045Q83a17421f714j38009H2614d74089C49252A7925
12921E1778c09658K7474A34386a34575c2696O56B36480I5688d17444E4693N0554
$$ y = [133783, 50779, 495207, -75562, 63702, 126752, -14660, 185179, -226835, 86267, -96260, 224656, 50199, -62343, -27639, -232990, 152322, 70081, -16273, 129030, -14539, 174470, -27965, 184756, -352832, 133291, 24748, 153412, 160341, 106796, 316603, -69127, 12656, 437005, -4624, -27413, -161937, 111293, 182759, 242805, -75836, -102624, 171766, 259171, 67658, -118687, 138986, -81370, 140438, -95891, 354249, 106511, 34, 84439, 153674, 180080, -76568, 159857, 291893, -230755, 321360, -134219, 96829, 128803, 116540, 77420, -64238, -34330, 330442, -118775, 475585, -51449, 214938, 33045, 33928, -117421, -6714, -144723, 82614, -474089, 349252, 17925, 51778, -309658, -282184, 134386, -134575, -32696, -32040, 236480, 95688, -417444, 54693, 105247]
12910A05247A0809O2084F081a51766j1843N9717A33968L34328b49485M8376B63040
12898A00242J01717P5724D2484P9528a90434A71768N2685F9090B6819f480B6022
12886c37037B70232E9440N7103P0603d3193o3513F4868b37279E0244K3537c9750
12874A11684B8413g2069A11357K8568a35955C7626a80309j06694A57592a18327
12863B25640J25766f6064m9631N2137f852C13818b19189H7760a79471e7307I4921
12851b41140i8872j7975H4659a26503d5844A4208K84490A10893j1063J37539k3300
12840B14069I5803g7119J812A40851c7721A83371h5125H2900J07093R4165a08178
12828b87031I6777c5901R894j37084O6541l27689B59654a60412B9640b03005A02183
$$ y = [105247, 10809, 72893, 6081, -151766, -163609, -103892, 133968, 468296, -249485, -201109, 263040, 100242, 201959, 277683, 42484, 122012, -190434, 171768, 224453, 69090, 26819, -6480, 26022, -337037, 270232, 59440, 116543, 187146, -43193, -106706, 64868, -237279, 50244, 73781, -39750, 111684, 28413, -72069, 111357, 139925, -135955, 37626, -180309, -287003, 157592, -118327, 225640, 351406, -66064, -115695, -63558, -6852, 313818, -219189, 87760, -179471, -57307, 94921, -241140, -98872, -116847, 84659, -126503, -45844, 14208, 298698, 110893, 99830, 237369, 214069, 95803, -77119, -75307, 140851, -37721, 183371, -85125, 82900, 189993, 284158, -108178, -287031, 96777, -35901, -26007, -163091, -96550, -424239, 259654, -160412, 29640, -203005, 102183]
12816D20985I1671J51994a16901o6481b4433j35589l0573F5585a00002k850M606
12805i8246A2367f6912l16335d641G9240k9492b09363A04228J49430o1647J88400
12794C80411E1327c15871B34545P9745A15722f60273A34447b17493A62056J92214
12784C54270a02360A72235j0769J7166n1476a16533K0984A77392J91849A04946
12773A4698J45874L4946E7867b75433J00583B98858i6808j13493n6520J20594
12763a46227A50362k0458a15644A29043K5640a454q651B06668l3082l7703b9360
12751H005K3874F742K2363K54134A13328k0336c7479A17627B248K14566A01860
12739A43887l4735K48442E6038K30602E5918B2540O9501M905b74732A88199a31496
$$ y = [420985, 91671, 243665, -116901, -183382, -24433, -160022, -190595, 65585, -100002, -102852, -98246, 12367, -66912, -383247, -4641, 79240, 49748, -209363, 104228, 253658, 192011, 380411, 51327, -315871, 234545, 314290, 115722, -660273, 134447, -217493, 162056, 354270, -102360, 172235, 161466, 178632, 127156, -116533, -95549, 177392, 369241, 104946, 14698, 160572, 195518, 57867, -275433, -174850, 298858, -96808, -210301, -266821, -146227, 150362, 129904, -115644, 129043, 154683, -1454, -10105, 206668, 173586, 135883, -29360, 8005, 31879, 6742, 29105, 283239, 113328, 92992, -37479, 117627, 2248, 216814, 101860, 143887, 109152, 357594, 56038, 286640, 55918, 22540, 92041, 96946, -274732, 188199, -131496]
12727a34050A82282k0674n108a09995M2386O34D08314E7851N4355R4287L0488
12716B36981j12889C5464Q8818J10584b13117C66597E1721A7333j089L15885A7324
12704A017L84763A15483n2912b9940A59179b01495B27564a04547I786b2166B73012
12692a10346o3321A5641a852H8687e1587A28553B5905a73844A08184J9648g286
12680E1848L15593p5467m2023p9554a64281g0063l3360C14459j33416j6638p582
12669A56823J12738A07401M53364d4933A48662f7827B13755H7628M3913l2230
12659I9311K54088A21185J5578e6501k00815A42902O7198C1009N5742k7351b515
12647H3639a62946g2330j2276A78604B7302K22093k1088a22578B13723L8750L528
$$ y = [-134050, 182282, 161608, 156500, -109995, -67609, -66975, 408314, 57851, 112206, 206493, 236981, 124092, 35464, 124282, 234866, -213117, 366597, 51721, 17333, 16244, 332129, 17324, 1017, 385780, 115483, 62571, -29940, 159179, -201495, 227564, -104547, 9786, -22166, 273012, -110346, -173667, 15641, -1852, 88687, -51587, 128553, 25905, -173844, 108184, 127832, -7286, 51848, 367441, 291974, 249951, 170397, -164281, -70063, -103423, 314459, 181043, 164405, 156823, 269561, 107401, 560765, -44933, 148662, -67827, 213755, 87628, 131541, 99311, 353399, 121185, 136763, -56501, -257316, 142902, 210100, 31009, 86751, 59400, -2515, 83639, -162946, -72330, -84606, 178604, 27302, 249395, 228307, -122578, 213723, 252473, 256001]
12636B56001H5748B153J65643c4407r7466B15128l3516K46991b39370C35831J10502
12625D46333A49162P6224F7181J16840B2511J64872O4802J53526F5364h0j9846
12614a9926B58518e6548A28290C9843M3789D1358N7222J0842j7360J3482i5993
12602B39216I8654J44898a59619B40194A05206j187a52173c3558A16940J07920
12592B24860J27351A22904J66231n3974l9176d2203G6888a83408B55109j24570
12582A30539E8746b5215k2447A03107c0455l46751a29317A89395K2190K394a39128
12570e1386C4513b2566j22518C5250b22055q9721A38947j0705D9801f8093j9916
12559h8009H6148M8293J43607a69161j7472d406j02707B22303E1414J91238a39204
$$ y = [256001, 85748, 2153, 167796, -34407, -131873, 215128, 181612, 428603, -239370, 335831, 446333, 149162, 225386, 67181, 184021, 22511, 187383, 252185, 405711, 65364, -80, -19926, 258518, -56548, 128290, 39843, 83632, 41358, 98580, 109422, 92062, 105544, -95993, 239216, 98654, 243552, -159619, 240194, 105206, 104019, -152173, -33558, 116940, 224860, 352211, 122904, 289135, 235161, 195985, -42203, 76888, -183408, 255109, 130539, 58746, -25215, -47662, 103107, -30455, -377206, -129317, 189395, 211585, 213979, -139128, -51386, 34513, -22566, -145084, 35250, -222055, -311776, 138947, 128242, 49801, -68093, -88009, 86148, 134441, 278048, -169161, -186633, -4406, -107113, 222303, 51414, 242652, -139204]
12547b40108a08842b0015G0527K300j0300a59106K8356A79538E9641k6980c27222
12535A5995a58994K2556N3783Q2q7325E0876K21021j07568a69956D37745j71909
12524B65836P9858b78475K0116C43495j50426b22486J00113C32735B7296K9465
12514E6761q395c32523f3964A157J14014E2916J84570i6384J7612A14675b73375
12502a29730D08189A83145g9273C47975j15583j0153F7388J77815f8458C6669
12491b65204e0605c597F993a90796c763D31586A61075i0943G2693j1499M2299
12480A03493c07845C62829C8644Q0460J1783L28025F0625d7318A16056B0267f7348
12468b31530i2707J3129G8879a0172j62166f8056D4995J17795M2907J80755d2651
$$ y = [-240108, -108842, -20015, 70527, 72827, 62527, -159106, -130750, 179538, 59641, 32661, -327222, 15995, -158994, -136438, -82655, -82573, -169898, 50876, 271897, 164329, -169956, 437745, 265836, 345694, -278475, -258359, 343495, 193069, -222486, -122373, 332735, 27296, 56761, 48366, -332523, -63964, 1157, 115171, 52916, 237486, -96384, -78772, 114675, -273375, -129730, 408189, 183145, -79273, 347975, 232392, 222239, 67388, 245203, -68458, 36669, -265204, -50605, -3597, 6993, -190796, -3763, 431586, 161075, -90943, 72693, 61194, 103493, -307845, 362829, 38644, 119104, 130887, 458912, 60625, -47318, 116056, 20267, -67348, -231530, -92707, -79578, 78879, -10172, -172338, -68056, 44995, 162790, 205697, 386452, -42651]
12456c9154p8114D7118a16419A56148J78093a11784C3555L20h5003k03912g8056
12444a61035A38786F4693B3635Q4753K32517a08648E6692C186a0369A25766K2010
12433A47776c19288A31950g6864j50784N5414k4058a0555j22625H4217a13830
12422b4867o096q2167P258c2443k07566a13525J1455C3452J44900c4473G212K02894
12410B10106I5309a37413B6303K4108a26502F2603a61838I0274a44299M8113n3202
12399a49388A11251J3673a49208k18309J64433f0116k38818C24064F9712g2917
12388b26300F1340B0164J68420f0276j5565B01166J2155B4296a46268L1906B39122
12376A87184a07680i653l41316h8447A01056l5443J42223G8069f4051H522M01638
$$ y = [-39154, -117268, 47118, -116419, 156148, 334241, -111784, 33555, 33875, -85003, -288915, -78056, -161035, 138786, 64693, 23635, 108388, 340905, -108648, 56692, 3186, -10369, 125766, 147776, -319288, 131950, -76864, -227648, -172234, -196292, -10555, -133180, 84217, -113830, -24867, -30963, -113130, -105872, -32443, -240009, -113525, -102070, 33452, 178352, -34473, 7212, 210106, 95309, -137413, 26303, 50411, -126502, 62603, -161838, 90274, -144299, -96186, -149388, 111251, 124924, -149208, -367517, -203084, -60116, -298934, 324064, 69712, -72917, -226300, 61340, 20164, 188584, -60276, -75841, 201166, 213321, 24296, -146268, -114362, 239122, 187184, -107680, -9653, -350969, -88447, 101056, 65613, 207836, 78069, -64051, 8522, 410160]
12365D10160A09489O7322a07194j56655A74234a27366C37169o3181C3216J06261
12355A39477k6448P2118b811C47902j48432K22650A29681C4489c5999k62830H8154
12343A69649F4956J48972i8010j23061A08587j490o930O0202d047n1827B70886
12331A20639i9105C3864M8164K65797b64047C21938d9175k69622c948j66807A88604
12319i8850A42148b27072g4721A0460J50088A0063a8876p8702I2664d21400A74290
12307C46657h9012C63245H198a27870A57504a82973A52812A7870c35037A9443
12296A66287c84269B30599j03102B1P8652K16983J00613D6528J14123b81092c5021
12284b90181J29314A27908a5716A91768b38834C80562E2346a14536A9327L30632
$$ y = [410160, 109489, 176811, -107194, -263849, 174234, -127366, 337169, 273988, 33216, 139477, 113029, 185147, -2811, 347902, 199470, 422120, 129681, 34489, -35999, -298829, 88154, 169649, 64956, 213928, -98010, -221071, 108587, 107097, 100167, 160369, -4047, -55874, 270886, 120639, -99105, 33864, 82028, 347825, -264047, 321938, -49175, -318797, -3948, -170755, 188604, -98850, 142148, -227072, -74721, 10460, 160548, 10063, -18876, -97578, 92664, -421400, 174290, 346657, -89012, 363245, 8198, -127870, 157504, -182973, 152812, 17870, -335037, 19443, 166287, -384269, 230599, 127497, 21, 78673, 295656, 396269, 46528, 160651, -281092, -35021, -290181, -160867, 127908, -15716, 191768, -238834, 380562, 52346, -114536, 19327, 349959]
12274C49959n2518l5234A29925L4579M2832a44708j26208D8619J74290J01409
12264C24318A61786a92425h3165e886j30614A07265l1173c11596h8087B32772
12253F8729f0167A26386a44426A51226K70177l742A87816C5640g7196B52311e1457
12241C35746d6357A05420G46K38130b52496B57250g1237l9543c5165E9624J82250
12230B41874J29481j61880b38820B88220F0968K9661a5313j17707B22530a76560
12219A05376L28401A69197D5831O0173O3278O2546a56357o100C3527P8453c22308
12207A95526J02215q9925K57176j66290K35746A84538j3703J1445D0832K19639
12197B60471j06535N9870l6324O4034J06913A01194Q7727a31917A45828E5518
$$ y = [349959, 297441, 262207, 129925, 164504, 207336, -144708, -270916, 48619, 222909, 324318, 161786, -192425, -83165, -5886, -136500, 107265, 76092, -311596, -88087, 232772, 68729, -60167, 126386, -144426, 151226, 421403, 417661, 187816, 35640, -77196, 252311, -51457, 335746, -46357, 105420, 746, 238876, -252496, 257250, -71237, -110780, -35165, 59624, 241874, 371355, 209475, -238820, 288220, 60968, 90629, -15313, -133020, 222530, -176560, 105376, 433777, 169197, 45831, 106004, 169282, 231828, -156357, -162457, 33527, 111980, -322308, 195526, 297741, 207816, 464992, 298702, 534448, 184538, 170835, 182280, 40832, 260471, 153936, 213806, 177482, 241516, 348429, 101194, 188921, -131917, 145828, 55518]
12186G1947J14276f5605C21505j00693a3485C00497c92085H9607J18616A4653
12175I2262O6851J18570i1183A35095J23850j942k6294J59355P933a35845I4840
12163a96045B59225a94635D9132d9112a9168A17960a11677C16569a49190B763
12152c6035D78927A73325D8015J36599D6760a074E6986A2240K79924A43863R9872
12141B43735a76182Q3787c4587l33190a76675e0644I1773L7128n4481A7562b6640
12129F1447A5009i3934G6560K68298A09722L8201B1387J85951a93521e2744j29342
12118a82086f4343B48691g4479B62526I8197Q5686a50713A56142b42833Q4875
12108a57958P4552L4091A65064D7094a83210A85274a73331D1539e8675G5738k4931
$$ y = [71947, 186223, -65605, 321505, 220812, -13485, 300497, -392085, 89607, 208223, 14653, 92262, 159113, 277683, -91183, 135095, 258945, 257003, 230709, 390064, 397997, -135845, 94840, -196045, 259225, -194635, 49132, -49112, -19168, 117960, -111677, 316569, -149190, 2763, -36035, 478927, 173325, 48015, 184614, 46760, -1074, 56986, 12240, 292164, 143863, 243735, -176182, -92395, -34587, -367777, -176675, -50644, 91773, 128901, 74420, 17562, -26640, 61447, 15009, -93934, 76560, 344858, 109722, 147923, 21387, 207338, -193521, -52744, -182086, -64343, 248691, -74479, 262526, 98197, 183883, -150713, 156142, -242833, -157958, -83406, -49315, 165064, 47094, -183210, 185274, -173331, 41539, -58675, 75738, 50807]
12097E0807a55353j68298H1039j5403K56880b76868a37776C6745a58092j12648
12087b70740J35157F3006g971C2975d8337B41502a91312B17780G7633c985A33246
12075A64144K85925Q0385J776018r28328B91606N0871A0293J37683K8431F3469
12064a41605A63958F9895a36013C8187K55805b4425A156b05835A92038G9294c04020
12052E3555b33963A46601d1064j05273B9819a22503j72751E3755k1103N0141j8254
12041F4539c6933j04265c0077j62311e1556B83738a61829J5301C12994b42916
12030B94420p5662h043G2738j8820b8880j06306L2390B5572M9236P746a16453
12018f6989K4468q8204G8280g6798m760B45005r5394b66814g0735j45514B09393
$$ y = [50807, -155353, -323651, 81039, 65636, 322516, -276868, -137776, 36745, -158092, -270740, -135583, 63006, -7971, 32975, -48337, 241502, -191312, 217780, 77633, -3985, 133246, 164144, 450069, 530454, 2306472, 1378144, 291606, 342477, 10293, 147976, 176407, 63469, -141605, 163958, 69895, -136013, 38187, 293992, -24425, 1156, -205835, 192038, 79294, -304020, 53555, -233963, 146601, -41064, -146337, 29819, -122503, -295254, 53755, 32652, 82793, 64539, -36933, -141198, -30077, -192388, -51556, 283738, -161829, -146528, 312994, -242916, 294420, 218758, -8043, 72738, 53918, -28880, -135186, -102796, 25572, 74808, 82554, -116453, -66989, -42521, -130725, 78280, -76798, -81558, 245005, 149611, -266814, -70735, -216249, 209393]
12006g2247B57356F9672j6002P871K0505q368c38046J35210A21409g9658I0651
11994b69274B37840a76967e6538K6750C7590N1548i1822A67628F9747a2470D4532
11982a98162A78500J07398p6663k8794C6961a42000A89475a21629F3340b10819
11971F1006J8178J9453m4416N6711a31471A06306e2073k25901A05242E1439p526
11960D3913J01946J46497c31579i1273b6718q9129C56090I1013g9283H616J5307
11949B3923J61363d5081B84298d00598A08324f9705A94464J35502A08166b22610
11938C37450A41398b0332G6495j2540J16620a19088d9801C9783i2736A04664d34259
11926b71111F1251J63284a7217A5682J61336n8472e8399D7273a79805a1593A11232
$$ y = [-72247, 257356, 69672, 53670, 61541, 82046, 73678, -338046, -202836, 121409, -79658, 90651, -269274, 237840, -176967, -56538, -29788, 37590, 89138, -91822, 167628, 69747, -12470, 44532, -198162, 178500, 285898, 209235, 180441, 36961, -142000, 189475, -121629, 63340, -210819, 61006, 79184, 98637, 54221, 110932, -131471, 106306, -52073, -277974, 105242, 51439, 43913, 145859, 292356, -331579, -91273, -26718, -115847, 356090, 91013, -79283, 8616, 23923, 185286, -45081, 284298, -400598, 108324, -69705, 194464, 329966, 108166, -222610, 337450, 141398, -20332, 76495, 63955, 180575, -119088, -49801, 39783, -92736, 104664, -434259, -271111, 61251, 224535, -17217, 15682, 177018, 118546, -58399, 47273, -179805, -11593, 111232]
11914D13598b46596A44232b4924j2884j1083q3699j76879e1789A13220J85219
11904B98439a05797C2885O5964e2459F8947a02874j41808J2456d5500A47880b75698
11892a17247d5999q6304e3361B22656F3350A252J73591d38923B059a03187B5470
11880B65500a86323p2326R5258f3798B07538A3609J14553b65113k6455A25941
11869a37193a877I4465D2190j1530a84840N0040B4321f4756c69l2392k17609J2658
11857b37712B43134i616C7096d2905C7728a19374j41846O5409I4947J4390a8395
11845G1740C1849L05623A00825D3983c44123B29503L3519f8410I5649a48650b7070
11833B54190b85012A93364a76509a3028A1430b25828M864E2039d6087B7249g5318
$$ y = [413598, -246596, 144232, -24924, -37808, -48891, -132590, -309469, -51789, 113220, 298439, -105797, 32885, 98849, -52459, 68947, -102874, -244682, -232226, -45500, 147880, -275698, -117247, -45999, -132303, -53361, 222656, 63350, 1252, 174843, -438923, 2059, -103187, 25470, 265500, -186323, -258649, -163391, -63798, 207538, 13609, 128162, -265113, -291568, 125941, -137193, -1877, 94465, 42190, 30660, -184840, -134800, 24321, -64756, -369, -32761, -250370, -237712, 243134, -9616, 37096, -42905, 37728, -119374, -261220, -195811, 94947, 109337, -18395, 71740, 31849, 337472, 100825, 43983, -344123, 229503, 263022, -68410, 95649, -148650, -27070, 254190, -285012, 193364, -176509, -13028, 11430, -225828, -220964, 52039, -46087, 27249, -75318]
11821C3765b52188i9227A73023e0180r6665A09175J2482c08632B7366Q4261K2813
11810A34440c57431D4745a98248l4729C94661D0111B827a29884c4769A41149a17474
11798d05466M9665a50760j29002i7226B5728b8528l0021A30815N5354a01552B36798
11786g0865K0203q4592C1046a25553N3851C452a28838k39288A71661c9496B19707
11774H397J36323A2916a27323A22176b35329E8275a32513j19252J24030B6261
11763A44322a65758j9582C023J72946p755a22434D4902a02139j18804e1873H2065
11751C91470a0529l4302j34009A12629b69348b3094j22653n9295C1738K30235
11741B61973h7783H1520J06535I2662K22686G1214b1881A29124g9637A65034F1545
$$ y = [33765, -252188, -99227, 173023, -50180, -146845, 109175, 121657, -308632, 27366, 111627, 134440, -357431, 44745, -198248, -232977, 394661, 40111, 2827, -129884, -34769, 141149, -117474, -405466, -355801, -150760, -279762, -97226, 25728, -28528, -58549, 130815, 186169, -101552, 236798, -70865, -50662, -135254, 31046, -125553, -71702, 3452, -128838, -368126, 171661, -39496, 219707, 8397, 144720, 12916, -127323, 122176, -235329, 58275, -132513, -251765, -127735, 26261, 144322, -165758, -185340, 3023, 175969, 168214, -122434, 44902, -102139, -220943, -51873, 82065, 391470, -10529, -44831, -178840, 112629, -269348, -23094, -145747, -205042, 31738, 261973, -87783, 81520, 188055, 92662, 315348, 71214, -21881, 129124, -79637, 165034, 61545]
11729F0493c57164a7541A25346b28494P9940Q18d9281j11319I358b2916A15236
11717a33065B46798G7784d5364B96853r3396o2388J47420a15757J855J9135j03341
11706a98108b6794j06156A26390a54321E5768K07455b3876c030p0029J3875n515
11695f4699C1228J16575i1897j40632G6486a91881D824a26652A87077C571K20766
11684B24337a7996j12406B5612J06294J29446f2263A39980B5460J52062c9831
11673B49938A7416L8108R2701f2348J852A1168J43599a96191B28015J2540I8286
11661g2786p902j90976A96703a31613n3453A11011N9413i1371B2958L32451a36978
11649B11338g6458I4190b2988j34041I4440J31944a47636f0033f524A28803e4250
$$ y = [60493, -357164, -17541, 125346, -228494, -148554, -147736, -49281, -160600, 9358, -22916, 115236, -133065, 246798, 77784, -45364, 296853, 203457, 141069, 288489, -115757, -113902, -94767, -198108, -26794, -132950, 126390, -154321, 55768, 263223, -23876, -3030, -73059, -59184, -64699, 31228, 147803, -91897, -232529, 76486, -191881, 4824, -126652, 187077, 3571, 224337, -17996, -130402, 25612, 131906, 261352, -62263, 139980, 25460, 177522, -39831, 249938, 17416, 55524, 148225, -62348, -60496, 11168, 154767, -196191, 228015, 240555, 98286, -72786, -80688, -271664, 196703, -131613, -185066, 111011, 170424, -91371, 22958, 355409, -136978, 211338, -76458, 94190, -22988, -157029, 94440, 226384, -147636, -60033, -6524, 128803, -54250]
11637f501K284k04949B20807E2144J7618J17094P1748J27066g8032j0603r182
11626i7817d6178D50170c69134A75785E18M63479B12533k3580d4286H872a08691
11614A31070k8605b38356c7839A57631o0622e1294k47037e0660a0249A87545C8837
11602A0982a66171B85069D0978b32102A57726a2736A72725J49274f1703F8766
11591B5240f6841a0218q5373A76229G7143h7987c5036A89362m9696b16571g8480
11579c3295j12187D29238A90932p2552b6851A54462M817I988b58688A37741I34
11567d51n9149H2241M6558J3665J66867f5645g895D68193j23635k266A07841a35497
11554a56266B30981p4576G828a9567E8814b4173C54445a22603C50174A13320J05651
$$ y = [-6501, -4217, -209166, 220807, 52144, 69762, 186856, 258604, 385670, -78032, -88635, -97817, -46178, 450170, -369134, 175785, 518, 463997, 212533, 188953, -44286, 8872, -108691, 131070, 102465, -238356, -37839, 157631, 97009, -51294, -298331, -50660, -10249, 187545, 38837, 10982, -166171, 285069, 40978, -232102, 157726, -12736, 172725, 321999, -61703, 68766, 25240, -66841, -10218, -95591, 176229, 77143, -87987, -35036, 189362, 139666, -216571, -78480, -33295, -145482, 429238, 190932, 118380, -26851, 154462, 159279, 9988, -258688, 137741, 934, -451, -59600, 82241, 128799, 142464, 309331, -65645, -7895, 468193, 344558, 342292, 107841, -135497, -156266, 230981, 156405, 7828, -19567, 58814, -24173, 354445, -122603, 350174, 113320, 218971]
11543B18971M2683A05849j786a84300A33654m3435M19139B6388b30510A00170
11532c201B17647F2301L30036A02103N4841A04J36633d6615I1509c73012a00012
11520a05501l12897C30986j4692C3261J46625J65333r8489A11844B0069K95965
11510C16034H1579J30170a83727D05175A20347P0610q6862L09148A6663J96962
11500B13625M142H8523K01840k3616f6936B42066j1299l5988c01163d6207B0659
11488a82229B63731C7642f2549K2432G7953b01960A74535C8795L3596g262A59688
11476c01605A48261A0633J44984Q631l1434C2810e2144D43507G3006L22975A24993
11464F6239k5841L8127J51912C2778g6980r639a9960B12622a28926M2487F8114
$$ y = [218971, 261654, 105849, 104063, -184300, 133654, 90219, 509358, 26388, -230510, 100170, -3201, 217647, 62301, 392337, 102103, 156944, 104, 136737, -46615, 91509, -373012, -100012, -105501, -418398, 330986, 316294, 33261, 179886, 345219, 246730, 111844, 20069, 316034, 81579, 211749, -183727, 405175, 120347, 190957, 104095, 413243, 16663, 213625, 217767, 88523, 290363, 266747, -66936, 242066, 230767, 194779, -301163, -46207, 20659, -182229, 263731, 37642, -62549, -40117, 77953, -201960, 174535, 38795, 72391, -7262, 159688, -301605, 148261, 10633, 155617, 164248, 132814, 32810, -52144, 443507, 73006, 395981, 124993, 66239, 40398, 78525, 230437, 32778, -76980, -86619, -19960, 212622, -128926, -86439, 68114]
11452B81623j7412j03342K8763l790E4372h1650B88557I2772a53521D9462L44520
11441C93982d1617G4897f1290A8481J10533J6995a3083H0783d70764C20647a23769
11429C8243P5225p233l1165a33676f6312j27348Q9008N1381j21871j74829H5548
11417B2945i8759l5912K9395n2510O2501J5170F2341b9767q0817D77944e8972
11405B3446R1776r96m4794b07424e5778k24272H5519B17K83324i1474k6260J8208
11393i9526K398n0469B26620b26261i784j03905a2376H8132m0309c276I6031J8140
11381A14171K8j0629a07576A71282j057A1419N0681a10628l9165d7811J5690J5709
11369a6412k06888A82573H473a96553b6642j24595B8692L1265L00935d1182H0054
$$ y = [281623, 264211, 160869, 189632, 185842, 54372, -81650, 288557, 92772, -153521, 49462, 393982, -41617, 74897, -61290, 18481, 129014, 146009, -13083, 80783, -470764, 320647, -123769, 38243, 113468, 106235, 75070, -133676, -66312, -193660, -104652, -53271, -175142, -349971, 85548, 22945, -98759, -134671, -105276, -157786, -95285, -80115, 62341, -29767, -110584, 477944, -58972, 23446, 115222, 114226, 69432, -207424, -55778, -280050, 85519, 217, 283541, -91474, -117734, -99526, -97128, -147597, 226620, -226261, -9784, -113689, -12376, 88132, 47823, -3276, 96031, 114171, 114199, 103570, -107576, 171282, 170225, 11419, 62100, -110628, -149793, -47811, -32121, -16412, -223300, 182573, 8473, -196553, -26642, -151237, 28692, 59957, 360892, -41182, 80054]
11357a24090n9430q223K2084K2855J1913A92249b39502N1625J039A43154j2134
11346A31020f4268l9893A81283o7231L962i8371L6493A32304f7369J6966A53433
11334H466b25402M3479j54489I7083a7412j19602M7033E3868J00112P5099C9171
11322B73571h4614B25034b50726j3603A47783C8408a81393O1196d312A49980l5884
11311A14096C3768a5787K378m3880l1581C9025C009L706e8023l6161A02370m0798
11299F1572c5411A0071L62799h9321j00352C9326a99284E3686k3584h6210L3331
11288e2879A00680J21075H0118a20472B11991a50427C09384c37165B08916b35757
11277d03805J61937G9054B9465a0764B54327n1938c78213M0182a21126j96872
$$ y = [-124090, -183520, -191743, -169659, -146804, -134891, 192249, -239502, -187877, -186838, 143154, 131020, -64268, -104161, 181283, 114052, 118014, -98371, -61878, 132304, -67369, -50403, 153433, 8466, -225402, -181923, -336412, 97083, -17412, -137014, -89981, 53868, 153980, 229079, 39171, 273571, -84614, 225034, -250726, -264329, 147783, 38408, -181393, -120197, -4312, 149980, 114096, 33768, -15787, -13409, -57289, -88870, 39025, 3009, 6715, -58023, -94184, 102370, 61572, -35411, 10071, 372870, -89321, -189673, 39326, -199284, 53686, 30102, -86210, -52879, 100680, 221755, 80118, -120472, 211991, -150427, 309384, -337165, 208916, -235757, -403805, -241868, 79054, 29465, -10764, 254327, 202389, -378213, -338031, -121126, -317998]
11267c17998R4193A74740b02094f5875K1636k63349K8263O0955E4880K24607G0520
11255G7902a16973j10366g6530k4111c198j02180n8670F6114e6795A15046K52509
11244C67555c01884f7670G7998d62177e0000C2979P4593c51347D542i406B67245
11232c369F81a15048A27067B7693a97181M0439I2519K056J20553l6301e6604B37270
11219H814N9876R803a84144M5938c3847j7530A62091P3771h9677A29083e0469
11207E8678f5773F0186a65657I6056a4134C0203b76670A14934a9833l55894i1664
11195a64173A86146c17173E6672c95729A26591c5898j69233E9390a08998I6196
11184c60765A23127p34C7764d1612A91190q4072c0385J0601l17022L5891B43734
$$ y = [-317998, -223805, 174740, -202094, -65875, -44239, -307588, -279325, -218370, 54880, 279487, 70520, 77902, -116973, -227339, -76530, -100641, -3198, -105378, -164048, 66114, -56795, 115046, 367555, -301884, -67670, 77998, -462177, -50000, 32979, 107572, -351347, 4542, -9406, 267245, -3369, 681, -115048, 127067, 27693, -197181, -156742, 92519, 94575, 215128, 178827, -56604, 237270, 8814, 68690, 78493, -184144, -138206, -33847, -51377, 162091, 235862, -89677, 129083, -50469, 58678, -65773, 60186, -165657, 96056, -14134, 30203, -276670, 114934, -19833, -375727, -91664, -164173, 186146, -317173, 56672, -395729, 126591, -35898, -205131, 59390, -108998, 96196, -360765, 123127, 122393, 37764, -41612, 191190, 107118, -30385, -19784, -336806, -300915, 243734]
11172C01780A39619k639a07032J5887J9503o2578j32192g6774L4474J6226I5383
11160B86766a42864j08677f5831k38442A73443a43109a609j15600B25053e9657
11149c23726A00315B1784J79110L1873i3617B5176b99048A36232a18814C5799
11138I8448N7459l9221a93523H2310B4262L37892a9091p1951B45572a25561r9922
11127b25483B47511e1796N362o2537a5010B5425a90223C23336b91138H4603a12744
11115G2905f0192A71549R3900o567r7928A8770J16951C566K11166E2841a49952
11103A66102L1597J26397m8257j35682L2894p8012O6819l282B3462J3808K34761
11092B72031e4087C09570M6170j67545m4033M6160K0143j1453e3876A10978J00755
$$ y = [301780, 139619, 136980, -107032, -91145, -71642, -134220, -266412, -76774, -42300, -26074, 95383, 286766, -142864, -251541, -65831, -304273, 173443, -143109, -1609, -117209, 225053, -59657, -323726, 100315, 21784, 200894, 232767, -93617, 25176, -299048, 136232, -118814, 35799, 98448, 155907, 116686, -193523, 82310, 24262, 362154, -19091, -91042, 245572, -125561, -225483, 247511, -51796, -46434, -108971, -15010, 25425, -190223, 323336, -291138, 84603, -112744, 72905, -60192, 171549, 265449, 258882, 160954, 18770, 135721, 3566, 214732, 52841, -149952, 166102, 197699, 324096, 275839, 140157, 173051, 95039, 161858, 158576, 23462, 37270, 272031, -54087, 309570, 355740, 188195, 144162, 190322, 210465, 199012, -53876, 110978, 211733]
11081B11733p8076J77063j49737b839l3743H2437O1531O4217A1054J87902k926
11070A96030M9338a3120C83768K7494j28399K6953o1831K08261j07382p827J26372
11059D67409A75985J01730J22171J48054L7986j45652J43784J27030j70873L4614
11049E74829k19545J96616J53847l21815J55028j57402K20556j68909M69331j74565
11039G27971j77716n2696N8807J1217R382K5952B19730L11484k17871r156M64589
11028G68776k90102J69707j38310M09167m01658L18134K84861D81553K22958p7384
11018F27127Q8013j03926J31141L8592l43155K94068p1861k16800K1815o19j53858
11007C10537M48459k88157j17087L03964J41382l33764J70928K63115j79285M6377
$$ y = [211733, 133657, 310720, 160983, -2839, -36582, 82437, 143968, 208185, 11054, 198956, 196030, 245368, -13120, 383768, 411262, 282863, 309816, 247985, 456246, 348864, 341037, 467409, 175985, 277715, 399886, 547940, 585926, 440274, 584058, 711088, 540215, 574829, 355284, 551900, 705747, 383932, 538960, 381558, 602114, 433205, 902536, 727971, 550255, 497559, 556366, 567583, 576965, 602917, 219730, 531214, 313343, 304187, 768776, 478674, 648381, 510071, 919238, 517580, 835714, 1120575, 481553, 704511, 627127, 715140, 611214, 742355, 780947, 437792, 731860, 659999, 443199, 465014, 464395, 310537, 758996, 470839, 353752, 657716, 799098, 465334, 636262, 899377, 720092, 766469]
10997G66469K09677l27198k35381K97380m879l10691L75330k5980J54489j96106
10987G03110K03915m13739K13891L95815j12403O8697Q3141j58570J11334L82012
10977A477203j70915L78864J70903O21875l93295L87958K17193l0458k04440j38062
10967B316826l16217O3859n71510J573Q2894j84693q8339M41428l92297K17122
10957A570646K44594o1878k56354o2191j84402n09716K88966j43809k18657j17991
10947E49208N9402j98561P2788q1426l2058n9705l7329j25827N5005I5365K67737
10936C63102c8939B52614A1770J63126i8839A92150a70271C38309b49474i5817
10925e26j14502M9788p239A15828b13803B24539J7526c66579a19214C16362i2229
$$ y = [766469, 976146, 648948, 413567, 710947, 706068, 395377, 770707, 744727, 899216, 703110, 907025, 493286, 707177, 1102992, 990589, 1059286, 1142427, 983857, 1095191, 1477203, 1306288, 1685152, 1856055, 2477930, 2084635, 2472593, 2689786, 2659328, 2454888, 2316826, 2000609, 2064468, 1492958, 1494531, 1577425, 1392732, 1304393, 1745821, 1353524, 1570646, 1815240, 1753362, 1497008, 1434817, 1250415, 740699, 1029665, 885856, 667199, 549208, 608610, 410049, 482837, 401411, 369353, 309648, 272319, 146492, 201497, 95365, 363102, -38939, 252614, 11770, 174896, -98839, 192150, -170271, 338309, -249474, -95817, -526, -115028, -65240, -72479, 115828, -213803, 224539, 242065, -366579, -119214, 316362, -92229]
10913a71956H5087J32868i2821l060L0039j91134B13594n5991a22798A99728F0705
10901c87060J36097J06662A57293C3594c4510j58210B3741H02a46748D7010b03186
10889g9595j55501P2090D9465a72990c825j03119A52938a04360G7133j8620b25697
10877D0370J95390a51110c8986o3040C9151d5182j50998A45127a80311A7820N511
10866B3331h9808a0916A783c17388C07143a88580A12557c07822C06141a86939
10855b07229h563j5092B48738a44924I5765g4592L2444A7936J56809a54945N6547
10844i8398H2598a69512b0055C8896a52348F0748J07756E9476F963b2999j8013
10833d1012C17663j5242l4219p064b66056E8927h0460l3312A33427b42410E0174
$$ y = [-171956, 85087, 217955, -92821, -95881, -65842, -256976, 213594, 157603, -122798, 199728, 60705, -387060, -250963, -144301, 157293, 33594, -34510, -192720, 23741, 802, -146748, 47010, -203186, -79595, -235096, -163006, 49465, -172990, -3825, -106944, 152938, -104360, 77133, 58513, -225697, 40370, 235760, -151110, -38986, -102026, 39151, -45182, -196180, 145127, -180311, 17820, 23331, -89808, -10916, 1783, -317388, 307143, -188580, 112557, -307822, 306141, -186939, -207229, -8563, -23655, 248738, -144924, 95765, -74592, -42148, 17936, 174745, -154945, -98398, 82598, -169512, -20055, 38896, -152348, 60748, 168504, 59476, 6963, -22999, -41012, 317663, 302421, 268202, 261138, -266056, 58927, -80460, -113772, 133427, -242410, 50174]
10821a91336K3183J4203F4831b265k77718J33719N710j45872A82840E9788N8106
10810A17894D3324r161P4714P1270a26244m9943A09039C4471a18310A06767c0350
10798B4231k512Q569d0883I1179K6913a29293d4287r2841j87669c4018A7672a46582
10785b10036i5962L8382j48810j12439A12933O443h1944a8780o041l44022K7164
10774c41679a21693A50548K07357i5489C646c2165n2437E999n20a1912A24673
10762c4635m5495l15399a00266b8998m2047l4495A23023n5584a16930B1992i6371
10750C502J70432a11652a4859A29260g0105A85364e5168B11090f5204j69491G0991
10738c92176A58607a66217G2230h4892j58434b0611j42667D0219i5058d0274I1645
$$ y = [-191336, -168153, -153950, 64831, -2265, -279983, -146264, -140554, -286426, 182840, 59788, 117894, 43324, 34163, 108877, 180147, -126244, -176187, 109039, 34471, -118310, 106767, -30350, 24231, 21719, 30288, -40883, 91179, 118092, -129293, -44287, -137128, -324797, -34018, 17672, -146582, -210036, -95962, -57580, -206390, -318829, 112933, 119376, -81944, -18780, -24821, -368843, -341679, -121693, 150548, 357905, -95489, 3646, -32165, -84602, 5999, 5479, -11912, 124673, -34635, -80130, -395529, -100266, -28998, -71045, -105540, 123023, 67439, -116930, 21992, -96371, 3502, 173934, -111652, -14859, 129260, -70105, 185364, -55168, 211090, -65204, -234695, 70991, -392176, 158607, -166217, 72230, -84892, -243326, -20611, -163278, 40219, -95058, -40274, 91645]
10726h6143j97782A97467M2724f4349k5445B44373a17618j4364A4730b77124J05051
10715a72073B18739b66104g7894b4797A92294a68353B50328H2459e290n6842A35084
10703a72418H2910b47736M1829M4167j38888J23406B0193H948J39432E8884a59746
10691A716c1633G08K83901Q63a26410l2652l3412I8577k4759b90455B8578i4745
10678B8774j1654a18594k2432F7572N0936N9609c5440l31270A8162a22794g674
10666b84919A24134k1557i1221p7003a3086k46537H4343d6787G5821i8772C1763
10654C67748A72918o880a3820A6546J36439a41835C84885h6172j99795d01m29833
10643d30234A25239b2192A05748a88013P0553b8814k74578h8754A56070d70591
$$ y = [-86143, -283925, 197467, 240191, -64349, -89794, 244373, -117618, -131982, 14730, -277124, -172073, 218739, -266104, -77894, -24797, 192294, -168353, 250328, 82459, -5290, -62132, 135084, -172418, 82910, -247736, -205907, -161740, -300628, -177222, 20193, 8948, 148380, 58884, -159746, 1716, -31633, 708, 284609, 285472, -126410, -159062, -192474, 98577, 73818, -290455, 28578, -94745, 28774, 17120, -118594, -141026, 67572, 118508, 178117, -35440, -366710, 18162, -122794, -7674, -284919, 124134, 102577, -91221, -168224, -13086, -259623, 84343, -46787, 75821, -98772, 31763, 367748, 172918, 166038, -13820, 16546, 152985, -141835, 384885, -86172, -285967, -401, -430234, 125239, -22192, 105748, -188013, -117460, -28814, -303392, -88754, 156070, -470591]
10632h5624B22875G5187a99755j88118D657J75485j145a87827D6074f330r7933
10621a04263L8816A70643b96012f2056H848O6070a01272A04618c04974Q6094k9554
10610b48434h5054n5972k9711A90307I1724a4201A80745k3523b28130m168P263
10599b25035A10574P4673a71547a2153B52308b3295B17078c31401a8216D4876
10588H6067M5574i4628k79904H342c36901I0027e6256g156j06695j43430A2492
10576A45140J18907a16790p9611l8901R5586A05996M055g7279A246a21787r8316
10565b20103f4849m0777F9996b51607A7780a73320B2574a69635k13786J76736
10555b06685k8091B9684N9166d77492B7522a07794b4877A92007K4005d6933k6308
$$ y = [-85624, 222875, 75187, -199755, -387873, 4657, 180142, 178997, -187827, 46074, -6330, -104263, -65447, 170643, -296012, -62056, 8848, 74918, -101272, 104618, -304974, -218880, -248434, -85054, -141026, -170737, 190307, 91724, -14201, 180745, 157222, -228130, -232298, -225035, 110574, 185247, -171547, -12153, 252308, -23295, 217078, -331401, -18216, 44876, 86067, 131641, -94628, -374532, 8342, -336901, 90027, -56256, -7156, -113851, -257281, 12492, 145140, 264047, -116790, -196401, -235302, -139716, 105996, 110051, -77279, 1246, -121787, -220103, -64849, -105626, 69996, -251607, 17780, -173320, 22574, -169635, -383421, -206685, -234776, 29684, 88850, -477492, 27522, -107794, -24877, 192007, 216012, -46933, -73241]
10544g3241C25096a37067A42194b2580j18832k0162A29981N4141j3489b24093
10533D2099g7591j91862B6409a66162J3272A69495f06A70591a52335B11115h3641
10521d8384j65103B48020a92823C07500c85407a53834J7451A00653C4988Q4330
10511A19318E7538N9790a74360p7636J09447G702b87809J42613D6223j6674K37785
10500B67334j06796i810E8475B1996J1182K8638J33341D6211N5625J3558K07376
10489C22770b7608F1599h0403A54553B2046a54216B13279g5771C88284K46902
10479F35186j50892l5402A02668Q6147a90088B55017a7098j18234H0413d52581
10468F1056a16086j68650c3689j84531I1975a55950E8332b06984p4423A04823
$$ y = [-73241, 325096, -137067, 142194, -22580, -141412, -161574, 129981, 184122, 170633, -224093, 42099, -77591, -269453, 26409, -166162, -152890, 169495, -606, 170591, -152335, 211115, -83641, -48384, -213487, 248020, -192823, 307500, -385407, -153834, -136383, 100653, 34988, 119318, 57538, 117328, -174360, -251996, -142549, 7702, -287809, -145196, 46223, 29549, 267334, 160538, -9810, 58475, 21996, 33178, 61816, 195157, 46211, 101836, 115394, 322770, -27608, 61599, -80403, 154553, 22046, -154216, 213279, -75771, 388284, 635186, 484294, 448892, 102668, 188815, -190088, 255017, -17098, -135332, 80413, -452581, 61056, -116086, -284736, -33689, -218220, 91975, -155950, 58332, -206984, -281407, 104823]
10457a3622E0783a5039B27755a20203M23k05440J59311g8591K6032k54520d2867
10445H5720f4477F8071N6325b0637B01404e7214k2831c1637B00223b6849m13649
10434d40498d8344I0265j357f069q7434B09387q5925a04346a5238j3340A75676
10422a76931B91554A308b12337D7718K4812c28113b1220r8012j66005N4302f9003
10410a31146C7993b38363n0445P1764p3085C27004L0457C3331g1651o3549K8658
10399a06542K3923A13557c9964B10566b38992B23144L10254F1526P3365j0762
10389A24129R4428J39422O030A33668f8005K5397B38191a50428C65685a10294
10378A93493g494k06304A85952C7499j6780K1517K14821B1353L68580A52650J82411
$$ y = [-13622, 50783, -15039, 227755, -120203, -119780, -325220, -165909, -78591, -52559, -307079, -42867, 85720, -64477, 68071, 124396, -20637, 201404, -57214, -80045, -31637, 200223, -26849, -440498, -48344, 90265, 88908, -6069, -93503, 209387, 123462, -104346, -15238, -28578, 175676, -176931, 291554, 1308, -212337, 47718, 72530, -328113, -21220, -119232, -285237, -230935, -69003, -131146, 37993, -238363, -288808, -217044, -290129, 327004, 357461, 33331, -71651, -135200, -106542, -82619, 113557, -39964, 210566, -238992, 223144, 533398, 61526, 134891, 124129, 218557, 357979, 364009, 133668, -68005, -42608, 238191, -150428, 365685, -110294, 193493, -7494, -213798, 185952, 37499, 20719, 42236, 257057, 21353, 389933, 152650, 335061]
10367C35061J40057H9791N40784B73419r3382g6973A26079C184K20332J95917
10357D19433j51351K11695a69961B76542K66683A93736M65352j40188j50657J54023
10347E22266B54010A19057m2390M07636j62116q3891o378Q6566g5317o4908B42193
10335B29435r0516A6622L02914G4043J59113a68746B32785b15190C35392a9515
10324C31166a04345C22951Q6873k1351p1147A31005k3212h6337j56915B0059N2547
10313G2606K20675F173a21298J417A43016a33777D0563K85949a14615B52868a5115
10301A28729k7796m8192P9246b35513C33508b77540K6198R6315d3600n0460H561
10289i9353n1835j84892a2137B86197A39135e2699A33726b5377j1735k24785G3939
$$ y = [335061, 475118, 89791, 630575, 273419, 180037, -76973, 126079, 3184, 223516, 419433, 268082, 479777, -169961, 276542, 543225, 193736, 659088, 518900, 368243, 522266, 254010, 119057, 76667, 484303, 322187, 238296, 231918, 318484, -75317, -140225, 242193, 229435, 138919, 16622, 319536, 74043, 233156, -168746, 232785, -215190, 335392, -19515, 331166, -104345, 322951, 409824, 388473, 317326, 131005, 107793, -86337, -243252, 20059, 72606, 293281, 6173, -121298, -119881, 143016, -133777, 40563, 326512, -114615, 252868, -15115, 128729, 100933, 52741, 131987, -235513, 333508, -277540, -251342, -155027, -43600, -94060, 8561, -99353, -151188, -336080, -12137, 286197, 139135, -52699, 133726, -25377, -37112, -261897, 73939]
10277I8351h6009j49326A0193a96763A42479K28283f6021A79423C1271L67460
10267C98731j90587q8172C781J55799a03849A66176n3439E5249O32558A18427
10256H8826n590k1511J28803J02151a54732C3436b65082f8411H6727a57383q7912
10245b45295M5248A55209j6702a57379j3757g4927B00926q9071c58453C23707
10234b45085a05728r3748N5463B24301g5644F1928J5885K34c10450Q7555l68568
10223e91463b67968A96751G0318k353f3016j6513A18857b7743A43060o4650J58551
10212B36961J51051A80637a54866I7828e6830k35199c1997E4131a41388j41698
10202b83086j51424b03403q8651Q8415o3374P848K2965C58744a62641O1410j48481
$$ y = [98351, -86009, -235335, 10193, -196763, 142479, 370762, -66021, 179423, 31271, 398731, 208144, 119972, 3781, 159580, -103849, 166176, 112737, 55249, 687807, 118427, 88826, 83236, 61725, 190528, 292679, -154732, 33436, -265082, -68411, 86727, -157383, -245295, -200047, 155209, 138507, -157379, -171136, -74927, 200926, 111855, -358453, 323707, -245085, -105728, -199476, -144013, 224301, -75644, 61928, 77813, 78047, -310450, -222895, -591463, -267968, 196751, 70318, 67965, -63016, -79529, 118857, -27743, 143060, 78410, 236961, 388012, 180637, -154866, 97828, -56830, -292029, -31997, 54131, -141388, -283086, -434510, -203403, -292054, -203639, -267013, -259165, -236200, 358744, -162641, -101231, -249712]
10191b49712j51514f0037H7635L8490F358a3601n3348l7365A85116J55264a81564
10179A797c50423k3911J20500h7692b1217k05644m1190A53585b03155D20989a46091
10167d7949E6312k4844d19276A15166C8864h1662A7268i6987j65974Q0869A2709
10155a16349j5906q6103a9778r4468m3169P1276H7598N4197c19297g1248j29953
10144b01201N9341O9219i554p4886M386j38685d3866j12594O8189n3835N496I9925
10131a51886m1380A17338a41671c3589l97942B30742a27569a6237F8231g361F2017
10119b25927I024K74323b23293f7947r3910B12574I0129c4124H4583N524a28544
10107b25896A39441A6671a86304j32127B4666b71547E7615a62617O484K4387d173
$$ y = [-249712, -401226, -60037, 87635, 126125, 6358, -13601, -66949, -104314, 185116, 340380, -181564, 1797, -350423, -374334, -253834, -87692, -21217, -226861, -268051, 153585, -203155, 420989, -146091, -47949, 56312, 31468, -419276, 115166, 38864, -81662, 17268, -96987, -262961, -182092, 12709, -116349, -132255, -218358, -19778, -114246, -157415, -86139, 87598, 141795, -319297, -71248, -201201, -141860, -72641, -9554, -84440, -80054, -218739, -43866, -156460, -88271, -142106, -136610, 99925, -151886, -193266, 117338, -141671, -33589, -431531, 230742, -127569, -16237, 68231, -7361, 62017, -225927, 9024, 283347, -223293, -67947, -161857, 212574, 90129, -34124, 84583, 90107, -128544, -225896, 139441, 16671, -186304, -318431, 24666, -271547, 57615, -162617, -156133, -131746, -4173]
10095e04966P5042a85398a5463B7917b59203b9878p5640A84115a46791D8140L0681
10084G8821c9927A02124E690b30173C22986n9189b61697d0647F5002d19677a89259
10072i4747C46312a95510B09233i2340D6066N689e8638j26296j9167L2104a0111
10060b07522b9373A41923m498a04671C24503E0014K04170a22261H1590B6371i6650
10048d2086j20914j4108B61286l7535b23540g4520l132D9723M3081l679a60636
10036d7636k54685A28006l1395i1535C029a17410J7265k01692O5959C12471a36767
10024e7876k86676A09619e4451B07432q2671e2422C10448G1310a95555P2976J6743
10013a05836B08863r3228a72623B0370i2721F7778h8666A8784a77678E5858g5722
$$ y = [-504966, -429924, -185398, -15463, 27917, -259203, -29878, -105518, 184115, -146791, 48140, 78821, -39927, 102124, 5690, -230173, 322986, 263797, -261697, -40647, 65002, -419677, -189259, -94747, 346312, -195510, 209233, -92340, 46066, 51755, -58638, -184934, -204101, -171997, -10111, -207522, -29373, 141923, 137425, -104671, 324503, 50014, 254184, -122261, 81590, 26371, -96650, -42086, -163000, -177108, 261286, 223751, -223540, -74520, -77652, 49723, 92804, 89125, -160636, -47636, -302321, 128006, 96611, -91535, 3029, -117410, -100145, -301837, -235878, 312471, -136767, -57876, -344552, 109619, -54451, 207432, 124761, -52422, 310448, 71310, -195555, -122579, -105836, 208863, 115635, -172623, 20370, -92721, 67778, -88666, 18784, -177678, 55858, -75722]
10001b50922k2887L7010N6527A41096o9528L3364f0422B06336a48188L5796F9364
9989c7578j7738j4198j36735G3810c94456i0330q7115P0450A92442Q5490a17052
9977b4413m01139h0606m8828A52991a07061g863j46544A23083D2756j9679J16424
9966A39501a24136A07007m1252c2326A4534c52452a41261L7025K8447d803l1993
9955c6796k10335e3831A13451O8843q7149d03132a74056g9855D0113d72347A00991
9943b18094p136e0816l09114f0163I7476K3295a67067b7674n9552r322l5545j18292
9931b50385J21393C1971K85655b55006C6709J20568b62317A16346b34658F990
9920c10255A24872a06176j16225A54202a4502j24351A33826B2401L39226d0064
$$ y = [-250922, -273809, -236799, -180272, 141096, 71568, 104932, -60422, 206336, -148188, -112392, 69364, -37578, -55316, -69514, -206249, 73810, -394456, -90330, -177445, -106995, 192442, 277932, -117052, -24413, -425552, -80606, -129434, 152991, -107061, -7863, -154407, 123083, 42756, 23077, 139501, -124136, 107007, 65755, -32326, 14534, -352452, -141261, -104236, -75789, -4803, -36796, -247131, -53831, 113451, 182294, 95145, -403132, -174056, -79855, 40113, -472347, 100991, -218094, -225230, -50816, -359930, -60163, 97476, 120771, -167067, -27674, -87226, -96548, -132093, -250385, -128992, 31971, 317626, -255006, 36709, 157277, -262317, 116346, -234658, 6990, -310255, 124872, -106176, -222401, 154202, -14502, -138853, 133826, 22401, 361627, -40064]
9909I7248K90350c3580o4074A58873F6217c7003A43185G0570a23980K1054A2d51349
9896f3109j82827e2718l85132J60908R2204B14650G7128a95981A8252i9646l27305
9885d26951a92516d9014j65153M7234A60088a49022c5204D58545c8449p5317j15156
9874b28922M8075P0275B13811a64548q9526G2526b63118C13207A31770a21191
9863F8995L59763a61277B78521j36044a77585c88k59045R9677c0640A08821O5963
9852A74784H1531i899A18835E3868b36092A72368b40306P3084A66576f9995k01563
9841b71558B77514a72526j62624i1493n8157A11858d5776A49208a05045A53071
9830A12581d90134a02495d0935E0011a37304D24772a45189q7084a05573o5458
$$ y = [97248, 387598, -33580, -97654, 158873, 66217, -37003, 143185, 70570, -123980, -102926, 12, -451349, -63109, -245936, -52718, -437850, -276942, -184738, 214650, 77128, -195981, 18252, -99646, -426951, -192516, -49014, -214167, -166933, 160088, -149022, -35204, 458545, -38449, -113766, -228922, -180847, -110572, 213811, -164548, -254074, 72526, -263118, 313207, 131770, -121191, 68995, 428758, -161277, 278521, 142477, -177585, -388, -259433, -159756, -30640, 108821, 174784, 81531, -9899, 118835, 53868, -236092, 172368, -240306, -167222, 166576, -69995, -271558, 277514, -172526, -335150, -91493, -149650, 111858, -45776, 149208, -105045, 153071, 112581, -490134, -102495, -40935, 50011, -137304, 424772, -145189, -232273, -105573, -171031]
9820a71031D3808b04929b4743J651H5762g2617C42524D1494A7497a44267M8355
9809i5912c0658A50710b45089I5294a88005A4263b68000a32389m6593M4869L2880
9798a01233M4306j19970Q7744q1105k98070E0114a07099C0727o251d0822m4581
9787h5403k36356p883C43232c95272a34248M0283j09525b7210j2238a8459A43910
9775A43654J27472h3184G61b07754B66981h9259r5222B12335a9164A01415b80445
9763a33620L8784F4947a2384m45624i4074j61q286p9323C3631J59668a30853B06210
9750c5683E7892b09666C1835J82841e6682G838a72179h2787k37866c8680A08924
9738c9819m63839A4768b84528J21691B07657a56782P3997B2483J0029c19512R9066
$$ y = [-171031, 43808, -204929, -24743, -23092, 85762, -72617, 342524, 41494, 17497, -144267, -95912, -30658, 150710, -245089, 95294, -188005, 14263, -268000, -132389, -178982, -134113, -101233, -56927, -176897, -89153, -170258, -468328, 50114, -107099, 30727, 24476, -40822, -85403, -321759, -329642, 343232, -395272, -134248, -93965, -203490, -27210, -39448, -18459, 143910, 143654, 271126, -83184, 761, -207754, 266981, -89259, -184481, 212335, -19164, 101415, -280445, -133620, -94836, 64947, -12384, -458008, -94074, -94235, -102521, -181844, 33631, 193299, -130853, 206210, -35683, 57892, -209666, 31835, 214676, -56682, 7838, -172179, -82787, -320653, -38680, 108924, -39819, -503658, 14768, -284528, -162837, 207657, -156782, -82785, 22483, 32512, -319512, -220446]
9727b20446F0655c12362a06376m7537c5960k4452D0531a92367b1380m6841j75024
9716b43245R1986B4586e0271k29039J35517A17761a63799G8539B8221a41973k40662
9705c82635F1820g4268k57022A69226c51454L1411a44509L3584k54256J72278
9695a92903C87g0009q6454g2574L2871j9443j70241A63947B0243a51554K4436
9684a27118D6215f7372A33439a10739L2559j91706P4623D3607a54137B2006a47814
9672B01018a72992B6721J29088J46985j04700J30844b95589A66380p6031a42568
9661i0786F3582b3734j69869N9863D3721N2782i0675B6236b82487l4185a13578
9649g0306L0561A74016J9395e4286l90887A87110A8773J00033m8714J61031a64316
$$ y = [-220446, 60655, -312362, -106376, -153913, -35960, -60412, 40531, -192367, -21380, -68221, -243245, -151259, 24586, -50271, -279310, -143793, 117761, -163799, 78539, 28221, -141973, -382635, 61820, -74268, -331290, 169226, -351454, -320043, -144509, -110925, -365181, -192903, 387, -70009, -156463, -72574, -39703, -59146, -229387, 163947, 20243, -151554, -127118, 46215, -67372, 133439, -110739, -78180, -269886, -195263, 43607, -154137, 22006, -147814, 201018, -172992, 26721, 155809, 302794, 198094, 328938, -295589, 166380, 90349, -142568, -90786, 63582, -23734, -193603, -133740, 43721, 96503, -90675, 26236, -282487, -316672, -113578, -70306, -39745, 174016, 193411, -54286, -445173, 187110, 18773, 118806, 70092, 231123, -164316]
9637a37196I9823a91509A42784c71790a22581a7244C87437C1623b15150k07248
9627d22398i6972j80444B15720j1129a33941C9273J47828o3787B4716b64363A98991
9615I5178J2592d36254J14472i7032L0158J0044G4058b89257C2006A5721K57078
9604B72799c80780C548K37537H4705P3860L0281i3441l5437A47997b46786d9738
9592b7215j3680j6920q0495A23931J2618e968m64321E3653a63759A46734f0980
9580i8322E2603O954A8014J2809a04261q391C7381h3599A47409a80468h7311k11854
9568b99165A89417A9692K6594h9182F1943a34168k265C6133K6518J78021q8479
9557A52193p3283b72766K6959e1327l38085a06633H3296a30757o5086N7897F3532
$$ y = [-137196, 99823, -191509, 142784, -371790, -122581, -17244, 387437, 31623, -215150, -422398, -96972, -277416, 215720, 204591, -133941, 39273, 187101, 123314, 24716, -264363, 198991, 95178, 107770, -436254, -321782, -97032, -66874, -56830, 74058, -289257, 32006, 15721, 272799, -380780, 3548, 241085, 84705, 158565, 188846, -93441, -128878, 147997, -246786, -49738, -27215, -40895, -57815, -138310, 123931, 136549, -5968, -470289, 53653, -163759, 146734, -60980, -98322, 52603, 59557, 18014, 30823, -104261, -112652, 37381, -83599, 147409, -180468, -87311, -299165, 189417, 19692, 46286, -89182, 61943, -134168, -136433, 36133, 62651, 240672, 152193, 78910, -272766, -245807, -51327, -389412, -106633, 83296, -130757, -195843, -137946, 63532]
9545D1558L5300a12159E8811b74194C87622B9461N8825J40858b16804l74147A1433
9533b25540g1625j3763A01107A9797J8253J67351c02359B18538F001d015A62168
9521H7239m0648i9037l1810E3886b19049E5323d17754a21352o8740g3236A42470
9509B29753O4230E3830A7862d08010L0679P8712B490d4093A73574b68051D8990
9497d2504k83784A86516d44044K7571F2103J29051f5021j61090B31995b37775
9486E5649C291e13768J21745h7000n1469r8959A44746E0365f6490D12606c58344
9474a57114g249j23089D4623a33175r1245r3371J14418c802k8757l45827a76238
9462B56503f4110r8048M0074n2836j5071C1404K68781d213n55p7741j3398l8292
$$ y = [41558, 76858, -112159, 58811, -274194, 387622, 29461, 88286, 229144, -216804, -590951, 11433, -225540, -71625, -85388, 101107, 19797, 38050, 205401, -302359, 218538, 6001, -4015, 162168, 87239, 46591, -99037, -130847, 53886, -219049, 55323, -417754, -121352, -190092, -73236, 142470, 229753, 293983, 53830, 17862, -408010, -377331, -298619, 2490, -44093, 173574, -268051, 48990, -42504, -326288, 186516, -444044, -416473, 62103, 191154, -65021, -226111, 231995, -237775, 55649, 3291, -513768, -392023, -87000, -138469, -237428, 144746, 50365, -66490, 412606, -358344, -157114, -7249, -130338, 44623, -133175, -224420, -317791, -203373, -3802, -32559, -378386, -176238, 256503, -64110, -162158, -122084, -174920, -189991, 31404, 300185, -4213, -4768, -82509, -95907, -134199]
9450a34199M0454a8099A0835a6897H6549d46910f9594B6794b74965A87946A8586
9438a24436H279J01724C6382d2678k70358A7808c51238D1474N4589a60572J6090
9427a44482L3399l5646A62781a41044j02561B4795J2641f4040k7486m2480e6966
9415B5865a93373A43700A1927a12798B6253a10444B0274J55458H5288C014O3207
9404F6221i7560F5891e7756B7136A3244J65489n5575g4156A01896a83239e2772
9392a61059m8624A37891a49653I4921a64621j07819E7181c43360J48409o2280
9382b57231I2294C2146J37965b67260A95141a55019A49723O1299E6942a72533
9371a03611c3756m76433J89436A03058c52713f0875n5730k05451C9620C831a7370
$$ y = [-134199, -93745, -18099, 10835, -16897, 86549, -446910, -69594, 26794, -274965, 187946, 18586, -124436, 8279, 110003, 36382, -42678, -313036, 17808, -351238, 41474, 96063, -160572, -144482, -111083, -146729, 162781, -141044, -243605, 24795, 37436, -64040, -91526, -134006, -56966, 25865, -193373, 143700, 11927, -112798, 26253, -110444, 20274, 175732, 85288, 3014, 66221, -97560, 65891, -57756, 27136, 13244, 178733, 123158, -74156, 101896, -183239, -52772, -161059, -209683, 137891, -149653, 94921, -164621, -272440, 57181, -343360, -194951, -257231, 92294, 32146, 170111, -267260, 195141, -155019, 149723, 211022, 56942, -172533, -103611, -33756, -510189, -320753, 103058, -352713, -60875, -116605, -322056, 39620, 3831, -17370]
9359A46176c207n6264F8366O8256A1393i1985B89162c34722b7613k5236a3285
9347B1869b03375A27793b29534L7449k00649e7879I4663J57340j02487n5790N9637
9336A53363b13644k77262a11358r165c540B35934e6158a2609j71117O178j02569
9325b80117N8047c2504k81984a03552j72786B98061a78016n597c5323r8042A6419
9313a52052H4948b12963a00720A43733J43661b70046D8781a50145r1314B13953
9302i2877D4151L1816J50871a35582f7777j69329a01944B00700a81479B82258
9291B14166P5110e0659r5582E2812b55795F2608c0698r759k24389i953n255E523
9278e1234j13517J5270H7476a70388A00346j2971c0512A60902o5603a10145E3702
$$ y = [146176, -3207, -59471, 68366, 136622, 11393, -91985, 289162, -334722, -27613, -52849, -13285, 21869, -203375, 127793, -229534, -192085, -392734, -57879, 94663, 252003, 149516, 93726, 153363, -213644, -490906, -111358, -120523, -3540, 235934, -56158, -12609, -183726, -177548, -280117, -222070, -32504, -314488, -103552, -276338, 298061, -178016, -183613, -35323, -133365, 16419, -152052, 84948, -212963, -100720, 143733, 287394, -270046, 48781, -150145, -241459, 213953, -92877, 44151, 75967, 226838, -135582, -67777, -237106, -101944, 200700, -181479, 282258, 214166, 289276, -50659, -146241, 52812, -255795, 62608, -30698, -40457, -264846, -9953, -15208, 5523, -51234, -164751, -149481, 87476, -170388, 100346, 87375, -30512, 160902, 95299, -110145, 53702]
9266I9711c1876n1628j25860Q3382l0203H4553b57312c2990F5943J39062p8789
9255A26216c199k14115A16341J12693i1514l64A34604b50352A26114a85594A9926
9243H9476P3649c3637p3091k5108k7411q6936j50225g3175E1387b54732q468A6976
9230e7313F2336a09349e4188B27790a2726k41365H8153a41623C15100P9140c9962
9218b75913G972K66486c09188F3394J9906J14911f2389n2620a5668r812E7731
9206A56473E0657c75560A73792d03848F8240f0942l45195A07162i9189B40146
9195C5658a30909k70028I7259a70230A77635a39897G8885b14806E5467a19332
9184g653j70683A2406l730a5059k17855h1842l782H3020b36206H0253a35713r9557
$$ y = [99711, -31876, -83504, -209364, -125982, -156185, 84553, -257312, -32990, 65943, 205005, 126216, -3199, -217314, 116341, 229034, -91514, -91878, 134604, -250352, 126114, -185594, 19926, 89476, 163125, -33637, -106728, -131836, -159247, -246183, -396408, -73175, 51387, -254732, -263200, 16976, -57313, 62336, -109349, -54188, 227790, -12726, -254091, 88153, -141623, 315100, 394240, -39962, -275913, 7972, 274458, -309188, 63394, 83300, 198211, -62389, -115009, -15668, -25480, 57731, 156473, 50657, -375560, 173792, -403848, 68240, -60942, -406137, 107162, -99189, 240146, 35658, -130909, -400937, 97259, -170230, 177635, -139897, 78885, -214806, 55467, -119332, -7653, -178336, 12406, 8676, -15059, -232914, -81842, -85624, 83020, -236206, 80253, -135713, -235270]
9172b35270e3147l94211B3864g9977k3650A79027K66012a43651k2893G0223c58355
9160A75236G824a84842A145O8976a99817K2977j50937a36121j18901a05041A61767
9148e1491k78570a01941n6803c9110n9642C30269b00826d2832J8915j52828k92475
9137d69220b5670j03428H5941h1983o7590f7493B31400q8875c5450k79014A72759
9125A0976J16358A1769b14977c3922j39115g6798A91396b07352L0063n9782A33427
9113b13052j26872a16234d9662q8543H8988a78587f9826A61391c00699C768a26067
9101F974K2175a04054E12443b51408L0037A43056J22735e13493a92580k0999k11420
9090d24999i6109l03097C0812a43320l7689e5939I8315m1089g0854A5063c57491
$$ y = [-235270, -53147, -447358, 23864, -79977, -103627, 179027, 445039, -143651, -166544, 70223, -358355, 175236, 7824, -184842, 1145, 70121, -199817, -176840, -327777, -136121, -255022, -105041, 161767, -51491, -330061, -101941, -158744, -39110, -98752, 330269, -200826, -42832, -23917, -176745, -469220, -25670, -129098, 85941, -81983, -149573, -67493, 231400, 142525, -35450, -314464, 172759, 10976, 127334, 11769, -214977, -33922, -173037, -76798, 191396, -207352, -177289, -237071, 133427, -213052, -339924, -116234, -49662, -138205, 88988, -178587, -69826, 161391, -300699, 3768, -126067, 6974, 29149, -104054, 512443, -251408, -221371, 143056, 265791, -513493, -192580, -213579, -424999, -96109, -399206, 30812, -143320, -181009, -55939, 98315, 57226, -70854, 15063, -357491]
9078a38645A65889b51613A7189a45052l56788d5129C8345b44153J15664A00018
9067A93712d551o4649q8432c5113B61880F6691b2059k12392O8655I6759a37406
9055a99235b0344I8689h777k14087N5183l3067j21968A33383k8150c55265R7138
9044b58127P2361p319a1319A3995b5012C3983J38057b71917A70685c56486f7003
9032C48082r7175a8200B0896K5423j0761a08115m2544K8329C1419J11087f0404
9020a60360E0395e0507a1676B19159a11218N4816G3491g9532F5180a41652I1839
9008a58514P0662J4498l62763a96207j45083B6591e6898A60115p125c7402A51950
8996a421l8829j86703B16592F1089b9434A2236K70835B5217b86370A82370I0498
$$ y = [-138645, 165889, -251613, 17189, -145052, -501840, -45129, 38345, -244153, -128489, 100018, 193712, -4551, -69200, -157632, -35113, 261880, 66691, -22059, -234451, -165796, 96759, -137406, -199235, -20344, 98689, -8777, -222864, -167681, -200748, -322716, 133383, 105233, -355265, -258127, -185766, -193085, -11319, 13995, -25012, 33983, 172040, -271917, 170685, -356486, -67003, 348082, 250907, -18200, 20896, 46319, 35558, -108115, -150659, -122330, 31419, 142506, -60404, -160360, 50395, -50507, -11676, 219159, -111218, -56402, 73491, -79532, 65180, -141652, 91839, -158514, -87852, -73354, -436117, -196207, -341290, 26591, -56898, 160115, 152990, -37402, 151950, -1421, -40250, -226953, 216592, 61089, -29434, 12236, 283071, 25217, -286370, 182370, 90498]
8984a40434F6820b03483d8576j07720A67434j4234b67419q2500I0968A1095K01139
8973B12234b42805J13690a0269D1903c09684A77028a38313B21905b68225M3703
8963b24522H7228d2398A73519c28710B4749h0541j20427j42636H2631l5640J20660
8952A67651k7679a61114a6153A091a98777G1978L664a66548A40432b42734A76825
8940A74386c7962E3499P87a68202A01887b54640M5310G851J47849n6275g6695
8928C5423b89337b3797H5498a6300E8011N7509J064086j84256C49483J14614A13374
8916b32900A31206l3309e4075q8496A69389a90668A3899J3843a73972J266m4016
8905b16722j05017A0345K2862J33193G070a55042e7907j67606G5837a73878A54
$$ y = [-140434, 66820, -203483, -48576, -156296, 167434, 153200, -267419, -349919, 90968, 11095, 212234, -242805, -129115, -10269, 41903, -309684, 177028, -138313, 221905, -268225, -224522, 87228, -42398, 173519, -328710, 24749, -80541, -200968, -343604, 82631, 46991, 167651, 139972, -161114, -16153, 1091, -198777, 71978, 75642, -166548, 140432, -242734, 176825, 174386, -37962, 53499, 54286, -168202, 101887, -254640, -209330, 7851, 155700, 99425, -76695, 35423, -289337, -23797, 85498, -16300, 58011, 115520, 1179606, 995350, 349483, 464097, 113374, -232900, 131206, 97897, -54075, -142571, 169389, -190668, 13899, 27742, -173972, -172706, -216722, -321739, 10345, 33207, 166400, 7070, -155042, -57907, -225513, 75837, -173878, 154]
8893a52585B19834f2847j64178A2339h9016j36510N8909C34092h697j61419J4913
8882a55203o151q8112J11817D7173d3146j39619l4720C13529b9399I4092a25516
8870A1191D023e5426M178j27378F3134M1804a87105b7112A29575i9805q795G1491
8857A2971J9248a01328r9325R7920o0200F5539k2970P0259b87993h0204a1388
$$ y = [-152585, 219834, -62847, -227025, 12339, -89016, -225526, -166617, 334092, -8697, -170116, -155203, -161354, -249466, -137649, 47173, -43146, -182765, -217485, 313529, -29399, 94092, -125516, 11191, 4023, -55426, -51248, -178626, 63134, 104938, -187105, -27112, 129575, -99805, -108600, 71491, 12971, 32219, -101328, -200653, -102733, -162933, 65539, 42569, 112828, -287993, -80204, -11388]
$$ [...]
##END NTUPLES=NMR SPECTRUM
##END=
