##TITLE=AC1446_MARAH13255_8011360_fo3Y4vQq3J
##JCAMPDX= 6.0         $$ Bruker NMR JCAMP-DX V2.0
##DATA TYPE= NMR SPECTRUM
##DATA CLASS= NTUPLES
##ORIGIN= BRUKER
##OWNER= Administrator
$$ 1.72 TOPSPIN		Version 2.1
$$ 2013-07-05 19:39:33.897 -0700  Administrator@X
$$ Compression mode = diff/dup
##.OBSERVE FREQUENCY= 400.02188249412
##.OBSERVE NUCLEUS= ^1H
##.ACQUISITION MODE= SIMULTANEOUS (DQD)
##.ACQUISITION SCHEME= undefined
##.AVERAGES= 64
##.DIGITISER RES= 22
##SPECTROMETER/DATA SYSTEM= spect
##.PULSE SEQUENCE= noesygpps1d.comp
##.SOLVENT NAME= COFFEE_meoh
##.SHIFT REFERENCE= INTERNAL, COFFEE_meoh, 1, 14.96084
##AUDIT TRAIL= $$ (NUMBER, WHEN, WHO, WHERE, PROCESS, VERSION, WHAT)
$$ ##TITLE= Audit trail, TOPSPIN		Version 2.1
$$ ##JCAMPDX= 5.01
$$ ##ORIGIN= Bruker BioSpin GmbH
$$ ##OWNER= Administrator
$$ $$ E:\/data/COFFEE/nmr/AC1446_MARAH13255_8011360_fo3Y4vQq3J/12/pdata/1/auditp.txt
$$ ##AUDIT TRAIL=  $$ (NUMBER, WHEN, WHO, WHERE, PROCESS, VERSION, WHAT)
(   1,<2013-07-05 19:39:28.694 -0700>,<Administrator>,<X>,<go>,<TOPSPIN 2.1>,
      <created by zg
	started at 2013-07-05 19:27:58.741 -0700,
	POWCHK enabled, PULCHK disabled,
       configuration hash MD5:
       C8 4E 4E 5D D3 5C D8 9E 9F 52 82 E0 59 8A DE 15
       data hash MD5: 64K
       59 CC F7 D0 52 BF 65 49 FD 13 A4 91 59 5F D5 36>)
(   2,<2013-07-05 19:39:31.694 -0700>,<Administrator>,<X>,<proc1d>,<TOPSPIN 2.1>,
      <Start of raw data processing
       efp LB = 0.3 FT_mod = 6 PKNL = 1 PHC0 = 0 PHC1 = 0 SI = 128K 
       data hash MD5: 128K
       F2 64 2A F0 43 8C 6F 33 4D E3 C2 4D EA E5 CA B5>)
(   3,<2013-07-05 19:39:32.788 -0700>,<Administrator>,<X>,<proc1d>,<TOPSPIN 2.1>,
      <pk PHC0 = -82.07886 PHC1 = 0 
       data hash MD5: 128K
       53 A0 5B E9 41 59 4C 73 A0 00 48 45 70 63 50 6A>)
(   4,<2013-07-05 19:39:33.225 -0700>,<Administrator>,<X>,<proc1d>,<TOPSPIN 2.1>,
      <abs ABSG = 1 
       data hash MD5: 128K
       99 99 27 62 C2 F4 80 F5 64 D4 ED 80 F0 FA 0D D1>)
(   5,<2013-07-05 19:39:33.382 -0700>,<Administrator>,<X>,<proc1d>,<TOPSPIN 2.1>,
      <abs ABSG = 2 
       data hash MD5: 128K
       14 26 82 33 DB 6C 82 1E AF 79 56 D3 81 14 E0 81>)
(   6,<2013-07-05 19:39:33.491 -0700>,<Administrator>,<X>,<proc1d>,<TOPSPIN 2.1>,
      <abs ABSG = 3 
       data hash MD5: 128K
       25 B0 F7 01 35 7D 56 FE 5E 5B 3F 3B 1B 94 C9 AE>)
(   7,<2013-07-05 19:39:33.600 -0700>,<Administrator>,<X>,<proc1d>,<TOPSPIN 2.1>,
      <abs ABSG = 4 
       data hash MD5: 128K
       D0 34 B3 6C AC 09 A9 27 F1 1D B7 AD 42 89 DE CD>)
(   8,<2013-07-05 19:39:33.694 -0700>,<Administrator>,<X>,<proc1d>,<TOPSPIN 2.1>,
      <abs ABSG = 5 
       data hash MD5: 128K
       69 64 C8 22 15 3B 3B C8 32 35 C3 3C 68 AF BD 04>)
$$ ##END=
$$ 
$$ $$ hash MD5
$$ $$ DD F7 DF AD 83 92 EE A1 1D CB 9A 83 FF FC 3F 98
##$RELAX= 
##$RELAX= 
##$RELAX= 
##$RELAX= 
##$RELAX= 
##$RELAX= 
##$RELAX= 
##$RELAX= 
$$ Bruker specific parameters
$$ --------------------------
##$DU= <E:\>
##$EXPNO= 12
$$ [...]
##$TP07= 0
##$TPNAME0= <>
##$TPNAME1= <>
##$TPNAME2= <>
##$TPNAME3= <>
##$TPNAME4= <>
##$TPNAME5= <>
##$TPNAME6= <>
##$TPNAME7= <>
##$TPOAL= (0..7)
0.5 0.5 0.5 0.5 0.5 0.5 0.5 0.5
##$TPOFFS= (0..7)
0 0 0 0 0 0 0 0
##$TUNHIN= 0
##$TUNHOUT= 0
##$TUNXOUT= 0
##$USERA1= <user>
##$USERA2= <user>
##$USERA3= <user>
##$USERA4= <user>
##$USERA5= <user>
##$V9= 5
##$VALIST= <valist>
##$VCLIST= <CCCCCCCCCCCCCCC>
##$VD= 0
##$VDLIST= <DDDDDDDDDDDDDDD>
##$VPLIST= <PPPPPPPPPPPPPPP>
##$VTLIST= <TTTTTTTTTTTTTTT>
##$WBST= 1024
##$WBSW= 4
##$XGAIN= (0..3)
0 0 0 0
##$XL= 0
##$YL= 0
##$YMAX_a= 6099497
##$YMIN_a= -12134959
##$ZGOPTNS= <>
##$ZL1= 120
##$ZL2= 120
##$ZL3= 120
##$ZL4= 120
##$ABSF1= 14.96084
##$ABSF2= -5.597342
##$ABSG= 5
##$ABSL= 3
##$ALPHA= 0
##$AQORDER= 0
##$ASSFAC= 0
##$ASSFACI= 0
##$ASSFACX= 0
##$ASSWID= 0
##$AUNMP= <proc_prof1d_extract.lims>
##$AXLEFT= 0
##$AXNAME= <>
##$AXNUC= <1H>
##$AXRIGHT= 0
##$AXTYPE= 0
##$AXUNIT= <>
##$AZFE= 0.1
##$AZFW= 0.1
##$BCFW= 0
##$BC_mod= 0
##$BYTORDP= 0
##$COROFFS= 0
##$CY= 15
##$DATMOD= 1
##$DC= 0
##$DFILT= <>
##$DTYPP= 0
##$F1P= 0
##$F2P= 0
##$FCOR= 0.5
##$FTSIZE= 131072
##$FT_mod= 6
##$GAMMA= 0
##$GB= 0
##$INTBC= 1
##$INTSCL= 1
##$ISEN= 128
##$LB= 0.3
##$LEV0= 0
##$LPBIN= 0
##$MAXI= 10000
##$MC2= 0
##$MEAN= 0
##$ME_mod= 0
##$MI= 0
##$NCOEF= 0
##$NC_proc= -2
##$NLEV= 6
##$NOISF1= 0
##$NOISF2= 0
##$NSP= 0
##$NTH_PI= 0
##$NZP= 0
##$OFFSET= 14.96084
##$PC= 1
##$PHC0= -82.07886
##$PHC1= 0
##$PH_mod= 1
##$PKNL= yes
##$PPARMOD= 0
##$PPDIAG= 0
##$PPIPTYP= 0
##$PPMPNUM= 2147483647
##$PPRESOL= 1
##$PSCAL= 4
##$PSIGN= 0
##$PYNMP= <proc.py>
##$REVERSE= no
##$SF= 400.020009699476
##$SI= 131072
##$SIGF1= 0
##$SIGF2= 0
##$SINO= 400
##$SIOLD= 131072
##$SPECTYP= <>
##$SREGLST= <1H.CDCl3>
##$SSB= 0
##$STSI= 131072
##$STSR= 0
##$SW_p= 8223.68421052631
##$SYMM= 0
##$S_DEV= 0
##$TDeff= 65536
##$TDoff= 0
##$TI= <>
##$TILT= no
##$TM1= 0
##$TM2= 0
##$TOPLEV= 0
##$USERP1= <user>
##$USERP2= <user>
##$USERP3= <user>
##$USERP4= <user>
##$USERP5= <user>
##$WDW= 1
##$XDIM= 131072
##$YMAX_p= 433799343
##$YMIN_p= -11905
##$CURPLOT= <Network HP LaserJet P1505>
##$CURPRIN= <$Network HP LaserJet P1505>
##$DFORMAT= <normdp>
##$LAYOUT= <+/1D_H.xwp>
##$LFORMAT= <normlp>
##$PFORMAT= <normpl>
##$SURQMSG= 1
$$ End of Bruker specific parameters
$$ ---------------------------------
##NTUPLES= NMR SPECTRUM
##VAR_NAME=  FREQUENCY,     SPECTRUM/REAL,   SPECTRUM/IMAG
##SYMBOL=    X,             R,               I
##VAR_TYPE=  INDEPENDENT,   DEPENDENT,       DEPENDENT
##VAR_FORM=  AFFN,          ASDF,            ASDF
##VAR_DIM=   131072,        131072,          131072
##UNITS=     HZ,            ARBITRARY UNITS, ARBITRARY UNITS
##FACTOR=    0.0627417313425164, 1,          1
##FIRST=     8223.62146879497, -1990,        -53869
##LAST=      0,             454,             -55194
##MIN=       0,             -11905,          0
##MAX=       8223.62146879497, 433799343,    0
$$ Real data points
##PAGE= N=1
##DATA TABLE= (X++(R..R)), XYDATA
$$ [...]
$$ plain form
63926 4499501 4467612 4403198 4307389 4182154 4030372 3856361 3666009 3465703 3260802 3055041
63916 3055041 2851075 2651193 2457638 2272593 2097885 1934580 1782958 1643085 1515266
63907 1515266 1399830 1296666 1205222 1124820 1054702 993921 941384 895910 856183 820954 789634
63896 789634 762355 739067 718756 699980 681968 664759 648419 632730 617659 603548 590718
63885 590718 579201 569011 560301 553222 547938 544824 544221 545979 549631 555153 563102 573867 587141
63872 587141 602359 619281 637957 658513 681184 706222 733382 761781 790527 819283 847927
63861 847927 875918 902369 926651 948675 968625 986553 1002075 1014356 1022627 1026886 1027742 1025359
63849 1025359 1018978 1007910 992648 974447 953962 930945 905323 877882 849530 820268 789335
$$ packed form
63926D499501l1889o4414r5809j25235j51782j74011j90352k00306k04901k05761
63916C055041k03966j99882j93555j85045j74708j63305j51622j39873j27819
63907A515266j15436j03164r1444q0402p0118o0781n2537m5474l9727l5229l1320
63896G89634k7279k3288k0311j8776j8012j7209j6340j5689j5071j4111j2830
63885E90718j1517j0190q710p079n284l114o03J758L652N522P949J0765J3274
63872E87141J5218J6922J8676K0556K2671K5038K7160K8399K8746K8756K8644
63861H47927K7991K6451K4282K2024J9950J7928J5522J2281Q271M259Q56k383
63849A025359o381j1068j5262j8201k0485k3017k5622k7441k8352k9262l0933
$$ plain form
63838 789335 756364 722154 688235 655746 624850 595214 566850 540176 515341 492013 470033
63827 470033 449780 431507 414733 398843 384043 370991 359622 349088 338980 329868 322329 315992
63815 315992 309947 303659 297174 290845 285263 281023 278077 275558 272755 270005 268081 266914 265556 263416
63801 263416 260824 258217 255423 252158 248785 246003 243968 242194 240276 238258 236251 234121 231774 229454
63787 229454 227463 225726 223950 222167 220813 220158 219873 219334 218264 216951 215916 215476 215547 215746 215741 215605 215765
63770 215765 216495 217501 218196 218306 218051 217745 217420 216929 216273 215697 215467 215546 215539 215099 214445 214269 214937 216011 216817
63751 216817 217271 217727 218190 218317 218280 218935 220798 223349 225763 227891 229967 231693 232393 232108 231915 232857 234915
63734 234915 237289 239446 241631 244392 247799 251207 253858 255722 257633 260458 264270 268510 272796 277251
$$ packed form
63838G89335l2971l4210l3919l2489l0896k9636k8364k6674k4835k3328k1980
63827D70033k0253j8273j6774j5890j4800j3052j1369j0534j0108r112p539o337
63815C15992o045o288o485o329n582m240k946k519k803k750j924j167j358k140
63801B63416k592k607k794l265l373k782k035j774j918k018k007k130k347k320
63787B29454j991j737j776j783j354o55k85n39j070j313j035m40P1J99nj36J60
63770B15765P30J006O95J10k55l06l25m91o56n76k30P9pm40o54j76O68J074Q06
63751B16817M54M56M63J27l7O55J863K551K414K128K076J726P00k85j93R42K058
63734B34915K374K157K185K761L407L408K651J864J911K825L812M240M286M455
$$ plain form
63720 277251 282018 286821 291133 294621 297219 298888 299451 298698 296614 293492 289809 286012 282471 279620 277835
63705 277835 277082 276878 276833 277051 277743 278691 279481 280179 281349 283364 286117 289450 293424 297953 302502 306442
63689 306442 309547 311994 314081 316046 317918 319367 319941 319598 318774 317773 316440 314721 313160 312378 312238
63674 312238 312092 311830 312118 313375 314977 315884 315884 315799 316446 317694 318686 318737 317737 315757 312666 308378 303342
63657 303342 298444 294332 291000 287990 284831 281300 277554 274119 271561 269986 268998 268212 267632 267418 267587
63642 267587 268173 269482 271850 275166 278874 282480 285907 289379 293103 297076 301142 305287 309859 315300
63628 315300 321577 328164 334776 341884 350228 360055 371184 383631 397673 413376 430544 449172 469473
63615 469473 491394 514606 539156 565564 593949 623483 653137 682570 711660 739371 763746
$$ packed form
63720B77251M767M803M312L488K598J669N63p53k084l122l683l797l541k851j785
63705B77835p53k04m5K18O92R48P90O98J170K015K753L333L974M529M549L940
63689C06442L105K447K087J965J872J449N74l43q24j001j333j719j561p82j40
63674C12238j46k62K88J257J602R07%q5O47J248R92N1j000j980l091m288n036
63657C03342m898m112l332l010l159l531l746l435k558j575r88p86n80k14J69
63642B67587N86J309K368L316L708L606L427L472L724L973M066M145M572N441
63628C15300O277O587O612P108Q344R827J1129J2447J4042J5703J7168J8628K0301
63615D69473K1921K3212K4550K6408K8385K9534K9654K9433K9090K7711K4375
$$ plain form
63604 763746 783112 796874 805178 808495 807806 804597 800050 794453 787743 780341 772807 764784 754992 742525
63590 742525 727686 711186 693056 672947 651207 628976 607177 586012 565610 546533 529276
63579 529276 513718 499568 487105 476993 469510 464441 461622 461003 462133 464135 466522 469672 474223
63566 474223 480221 487146 494595 502624 511447 521056 531157 541413 551834 563066 576184 592020 610702
63553 610702 631962 655817 682818 713702 748886 788026 829503 870113 905614 932245 948215
63542 948215 954079 951916 944174 933014 920199 907182 895113 884761 876404 869652 863388 856088 846517
63529 846517 834238 819373 801878 781196 756796 728995 699104 668712 638872 609962 582148
63518 582148 555713 530918 507758 486152 466335 448792 433658 420376 408088 396278 384903
$$ packed form
63604G63746J9366J3762Q304L317o89l209m547n597o710p402p534q023r792j2467
63590G42525j4839j6500j8130k0109k1740k2231k1799k1165k0402j9077j7257
63579E29276j5558j4150j2463j0112p483n069k819o19J130K002K387L150M551
63566D74223N998O925P449Q029Q823R609J0101J0256J0421J1232J3118J5836J8682
63553F10702K1260K3855K7001L0884L5184L9140M1477M0610L5501K6631J5970
63542I48215N864k163p742j1160j2815j3017j2069j0352q357o752o264p300r571
63529H46517j2279j4865j7495k0682k4400k7801k9891l0392k9840k8910k7814
63518E82148k6435k4795k3160k1606j9817j7543j5134j3282j2288j1810j1375
$$ plain form
63507 384903 374120 364187 355538 348526 342953 338178 333861 330353 328102 326896 326018 325039 324069 323205 322099
63492 322099 320348 318155 316282 315348 315357 315992 317165 319067 321765 324987 328352 331614 334622 337315 339958
63477 339958 343099 346978 351077 354617 357418 359792 361616 362068 360546 357370 353200 348248 342594 336968
63463 336968 332493 329622 327882 326752 326249 326457 326973 327234 327182 327363 328493 331137 335551 341589 348847 357005
63447 357005 365879 375112 384209 393198 403041 415025 429890 447803 468952 493637 521735 552416
63435 552416 584321 615631 643981 666945 683163 693038 698362 701342 703881 707276 712295 719667 730474
63422 730474 745801 765936 790378 818705 850833 885924 921525 954504 982750 1005500 1022281
63411 1022281 1032432 1035875 1033735 1027821 1019774 1010788 1001615 992378 982627 971854 959763 945850 929124
$$ packed form
63507C84903j0783r933q649p012n573m775m317l508k251j206q78r79r70q64j106
63492C22099j751k193j873r34RO35J173J902K698L222L365L262L008K693K643
63477C39958L141L879M099L540K801K374J824M52j522l176m170m952n654n626
63463C36968m475k871j740j130n03K08N16K61n2J81J130K644M414O038P258Q158
63447C57005Q874R233R097Q989R843J1984J4865J7913K1149K4685K8098L0681
63435E52416L1905L1310K8350K2964J6218R875N324K980K539L395N019P372J0807
63422G30474J5327K0135K4442K8327L2128L5091L5601L2979K8246K2750J6781
63411A022281J0151L443k140n914q047q986r173r237r751j0773j2091j3913j6726
$$ plain form
63398 929124 908637 884156 856097 825128 792227 758831 726343 695398 665957 638022 611879
63387 611879 587690 565315 544734 526307 510469 497358 486868 478846 473219 470052 469518 471513 475361
63374 475361 480204 485766 492449 500619 510207 521167 533893 548830 565914 584773 605328 627913
63362 627913 652936 680697 711409 745015 780866 817752 854283 889138 921027 948666 970870
63351 970870 986715 995835 998753 996875 991914 985237 977648 969490 960739 951140 940407 928170 913682
63338 913682 895965 874604 850161 823468 794825 764447 733470 703764 676604 652062 629817
63327 629817 610015 593221 580116 571491 567805 568119 569795 569785 566133 558091 545467 528687 509209
63314 509209 489018 469522 451273 434577 419662 406270 393857 382467 372814 365236 359142 353867
$$ packed form
63398I29124k0487k4481k8059l0969l2901l3396l2488l0945k9441k7935k6143
63387F11879k4189k2375k0581j8427j5838j3111j0490q022n627l167n34J995L848
63374D75361M843N562O683Q170R588J0960J2726J4937J7084J8859K0555K2585
63362F27913K5023K7761L0712L3606L5851L6886L6531L4855L1889K7639K2204
63351I70870J5845R120K918j878m961o677p589q158q751r599j0733j2237j4488
63338I13682j7717k1361k4443k6693k8643l0378l0977k9706k7160k4542k2245
63327F29817j9802j6794j3105q625l686L14J676j0l652q042j2624j6780j9478
63314E09209k0191j9496j8249j6696j4915j3392j2413j1390r653p578o094n275
$$ plain form
63302 353867 349517 346436 344198 341796 338680 335142 331743 328776 326268 324055 321796 319229 316469 313829
63288 313829 311384 309022 306914 305543 305173 305456 305679 305216 303791 301640 299471 297926 296983 296108 295117 294528
63272 294528 294860 295901 296927 297498 297765 298172 299130 300864 303277 305961 308489 310684 312543 314117 315654
63257 315654 317635 320294 323222 325827 328228 331318 335756 341186 346599 351368 355713 360278 365491 371441
63243 371441 378184 385903 394649 404145 414205 425328 438502 454205 471863 490528 509765 529606
63231 529606 549976 570688 591842 613626 635736 657542 678896 700218 721678 742927 763958
63220 763958 785611 808665 832800 856989 880669 903917 926517 947435 965334 979216 988475 992669
63208 992669 991519 984977 973196 956493 935374 910537 882883 853512 823585 793974 765204 737865
$$ packed form
63302C53867m350l081k238k402l116l538l399k967k508k213k259k567k760k640
63288C13829k445k362k108j371l70K83K23m63j425k151k169j545r43q75r91n89
63272B94528L32J041J026N71K67M07R58J734K413K684K528K195J859J574J537
63257C15654J981K659K928K605K401L090M438N430N413M769M345M565N213N950
63243C71441O743P719Q746R496J0060J1123J3174J5703J7658J8665J9237J9841
63231E29606K0370K0712K1154K1784K2110K1806K1354K1322K1460K1249K1031
63220G63958K1653K3054K4135K4189K3680K3248K2600K0918J7899J3882R259M194
63208I92669j150o542j1781j6703k1119k4837k7654k9371k9927k9611k8770k7339
$$ plain form
63196 737865 712875 691022 672409 656716 643892 634127 627161 622247 619074 618302 620752 626250 633701
63183 633701 642237 651908 663202 676244 690704 706286 722913 740291 757576 773834 788881 803416
63171 803416 818228 833470 848712 863339 876571 887431 895172 899685 901071 898879 892218 880739
63159 880739 865023 845894 823780 799026 772394 744899 717343 690280 664225 639653 616951
63148 616951 596519 578592 562741 547957 533701 520621 509711 500968 493438 486415 479916 473966
63136 473966 468222 462686 458117 455157 453422 452049 450885 450527 451226 452423 453543 454758 456604 459171 462047
63121 462047 464938 467946 471277 475004 479143 483658 488232 492335 495725 498713 501728 504792 507681 510396
63107 510396 513040 515361 516993 518276 520171 522960 525562 526700 526447 525934 525717 525254 524040 522444 521009
$$ packed form
63196G37865k4990k1853j8613j5693j2824r765o966m914l173p72K450N498P451
63183F33701Q536R671J1294J3042J4460J5582J6627J7378J7285J6258J5047J4535
63171H03416J4812J5242J5242J4627J3232J0860P741M513J386k192o661j1479
63159H80739j5716j9129k2114k4754k6632k7495k7556k7063k6055k4572k2702
63148F16951k0432j7927j5851j4784j4256j3080j0910q743p530p023o499n950
63136D73966n744n536m569k960j735j373j164l58O99J197J120J215J846K567K876
63121D62047K891L008L331L727M139M515M574M103L390K988L015L064K889K715
63107E10396K644K321J632J283J895K789K602J138k53n13k17m63j214j596j435
$$ plain form
63092 521009 519611 517887 516025 514502 513317 512184 511387 511732 513505 516083 518774 521524 524450 527215 529443
63077 529443 531553 534607 539222 544987 551085 557197 563669 570976 579180 587858 596488 605010 614060 624617
63063 624617 637411 652747 670723 691311 714115 738393 763702 790553 820281 854187 892703
63052 892703 935183 980349 1027101 1075145 1124841 1176358 1229068 1281918 1334261 1386095 1437629
63041 1437629 1488977 1540280 1591768 1643565 1695635 1747975 1800588 1853148 1904937 1955186 2003076
63030 2003076 2047161 2085139 2114639 2134129 2142861 2140164 2125324 2098165 2059437 2010599 1953418 1889788
63018 1889788 1821607 1750746 1679197 1609083 1542198 1479603 1421936 1370024 1324766 1286420 1254507
63007 1254507 1228596 1208797 1195307 1187862 1185985 1189493 1198345 1212074 1229622 1249758 1271559 1294592
$$ packed form
63092E21009j398j724j862j523j185j133p97L45J773K578K691K750K926K765K228
63077E29443K110L054M615N765O098O112O472P307Q204Q678Q630Q522R050J0557
63063F24617J2794J5336J7976K0588K2804K4278K5309K6851K9728L3906L8516
63052H92703M2480M5166M6752M8044M9696N1517N2710N2850N2343N1834N1534
63041A437629N1348N1303N1488N1797N2070N2340N2613N2560N1789N0249M7890
63030B003076M4085L7978K9500J9490Q732k697j4840k7159l8728m8838n7181o3630
63018A889788o8181p0861p1549p0114o6885o2595n7667n1912m5258l8346l1913
63007A254507k5911j9799j3490p445j877L508Q852J3729J7548K0136K1801K3033
$$ plain form
62995 1294592 1318814 1344290 1370992 1398889 1428063 1458396 1489163 1519365 1548586 1577024 1604405
62984 1604405 1629241 1649610 1664350 1673041 1675100 1669551 1655769 1633972 1604881 1569264 1527977 1482145
62972 1482145 1433070 1381993 1329937 1277715 1226122 1176234 1129277 1085921 1045812 1008163 972751
62961 972751 939976 909982 882190 855909 831011 807731 786005 765367 745438 726286 708227
62950 708227 691386 675578 660571 646283 632562 618969 605177 591637 579363 568738 558950 549035
62938 549035 539152 530330 523165 517334 512297 507837 503837 500132 496716 493680 490901 488196 485841 484385
62924 484385 483853 483691 483531 483404 483057 481867 479854 478050 477315 477253 476861 475764 474227 472355 469983 467118
62908 467118 463909 460339 456498 452970 450380 448705 447577 446985 447091 447496 447496 447067 446851 447086 447169 446557 445485
$$ packed form
62995A294592K4222K5476K6702K7897K9174L0333L0767L0202K9221K8438K7381
62984A604405K4836K0369J4740Q691K059n549j3782k1797k9091l5617m1287m5832
62972A482145m9075n1077n2056n2222n1593m9888m6957m3356m0109l7649l5412
62961I72751l2775k9994k7792k6281k4898k3280k1726k0638j9929j9152j8059
62950G08227j6841j5808j5007j4288j3721j3593j3792j3540j2274j0625r788r915
62938E49035r883q822p165n831n037m460m000l705l416l036k779k705k355j456
62924D84385n32j62j60j27l47j190k013j804p35o2l92j097j537j872k372k865
62908D67118l209l570l841l528k590j675j128n92J06M05%m29k16K35Q3o12j072
$$ plain form
62891 445485 444568 444168 444387 445173 446080 446359 445696 444652 444046 444128 444609 445257 446068 446906 447368 447168 446538 446060 445988
62872 445988 445794 444656 442461 440066 438315 437191 436291 435765 436069 436938 437482 437435 437520 438220 439004 439347 439771 441006
62854 441006 442502 442834 441643 440240 440006 440875 441892 442679 443577 444536 444705 443447 441299 439445 438417 437736
62838 437736 436742 435326 433687 431870 429906 428194 427289 427333 427974 428793 429555 430100 430358 430563 431196 432559 434563
62821 434563 436930 439438 441967 444526 447323 450601 454396 458473 462522 466292 469749 473278 477531 482729
62807 482729 488274 493445 498400 503961 510465 517389 524294 531573 539864 549108 558568 567657 576523 586031
62793 586031 597402 611658 629140 649531 672465 698031 726742 759215 795984 837451 883963
62782 883963 935988 994038 1058189 1127867 1202461 1281888 1365934 1453142 1541052 1627647 1711822
$$ packed form
62891D45485r17m00K19P86R07K79o63j044o06Q2M81O48Q11Q38M62k00o30m78p2
62872D45988j94j138k195k395j751j124r00n26L04Q69N44m7Q5P00P84L43M24J235
62854D41006J496L32j191j403k34Q69J017P87Q98R59J69j258k148j854j028o81
62838D37736r94j416j639j817j964j712r05M4O41Q19P62N45K58K05O33J363K004
62821D34563K367K508K529K559K797L278L795M077M049L770L457L529M253N198
62807D82729N545N171M955N561O504O924O905P279Q291R244R460R089Q866R508
62793E86031J1371J4256J7482K0391K2934K5566K8711L2473L6769M1467M6512
62782H83963N2025N8050O4151O9678P4594P9427Q4046Q7208Q7910Q6595Q4175
$$ plain form
62771 1711822 1792246 1866559 1932162 1987166 2030098 2059335 2073576 2072540 2056682 2026635 1983542
62760 1983542 1929569 1867268 1798489 1724398 1646398 1566360 1485986 1406498 1329021 1254734 1184507
62749 1184507 1118573 1056643 998214 943007 891353 843985 801223 762649 727819 696892 670118
62738 670118 647124 627227 610102 595470 582478 570187 558538 548064 538763 530136 522374 516506
62726 516506 512953 510727 508579 506435 505110 505051 505961 507507 509865 513506 518791 525884 534860 545693 558068
62711 558068 571360 585099 599627 616037 635295 657604 682802 710970 742256 776447 813341
62700 813341 853402 897471 945860 998271 1054556 1114851 1178781 1244977 1311555 1376621 1438193
62689 1438193 1494142 1542510 1581747 1610645 1628427 1634923 1630269 1614403 1587328 1549962 1504280 1452464
$$ packed form
62771A711822Q0424P4313O5603N5004M2932K9237J4241j036j5858l0047m3093
62760A983542n3973o2301o8779p4091p8000q0038q0374p9488p7477p4287p0227
62749A184507o5934o1930n8429n5207n1654m7368m2762l8574l4830l0927k6774
62738F70118k2994j9897j7125j4632j2992j2291j1649j0474r301q627p762n868
62726E16506l553k226k148k144j325n9R10J546K358L641N285P093Q976J0833J2375
62711E58068J3292J3739J4528J6410J9258K2309K5198K8168L1286L4191L6894
62700H13341M0061M4069M8389N2411N6285O0295O3930O6196O6578O5066O1572
62689A438193N5949M8368L9237K8898J7782O496m654j5866k7075l7366m5682n1816
$$ plain form
62677 1452464 1396198 1336740 1275145 1212327 1149353 1087759 1029055 973847 921876 872981 827474
62666 827474 785572 747196 712502 681879 655090 631109 609210 589583 572463 557258 543061
62655 543061 529486 516525 504154 492647 482706 474528 467155 459487 451652 444676 439011 434215 430029
62642 430029 426950 425533 425635 426582 427779 428984 430114 430837 430388 428148 424606 421302 419376 418427 417303
62627 417303 415683 414235 413396 412788 412022 411464 411845 413380 415564 417719 419611 421625 424317 427750 431429
62612 431429 435007 438808 443367 448658 454179 459743 465829 473154 482230 493273 506241 520900 537163
62599 537163 555501 576834 601840 630416 661873 695672 731954 771204 813226 856603 899460
62588 899460 940594 979356 1014564 1044400 1067700 1084514 1094892 1097877 1092554 1079498 1060279 1035815
$$ packed form
62677A452464n6266n9458o1595o2818o2974o1594n8704n5208n1971m8895m5507
62666H27474m1902l8376l4694l0623k6789k3981k1899j9627j7120j5205j4197
62655E43061j3575j2961j2371j1507r941q178p373p668p835o976n665m796m186
62642D30029l079j417J02R47J197J205J130P23m49k240l542l304j926r49j124
62627D17303j620j448q39o08p66n58L81J535K184K155J892K014K692L433L679
62612D31429L578L801M559N291N521N564O086P325R076J1043J2968J4659J6263
62599E37163J8338K1333K5006K8576L1457L3799L6282L9250M2022M3377M2857
62588H99460M1134L8762L5208K9836K3300J6814J0378K985n323j3056j9219k4464
$$ plain form
62576 1035815 1006267 972397 935945 898426 860430 822418 785442 750600 718243 688068 659613
62565 659613 632475 606553 582431 561141 543185 528018 514707 502793 492241 482847 474147 465867
62553 465867 458183 451520 446197 442246 439516 437871 437149 436881 436326 435094 433582 432504 432086 432000 431888 431585
62537 431585 430926 429787 428315 426788 425368 424388 424606 426584 429882 433543 437418 442337 448933 457014 466298
62522 466298 477012 489455 503620 519627 537855 558254 580190 603579 629577 659452 693168
62511 693168 729691 768196 808073 848067 886448 922194 955255 985414 1011517 1032149 1046663
62500 1046663 1055243 1058322 1056337 1049962 1040334 1028968 1017404 1006767 997688 990699 986602 986247 990053
62487 990053 998013 1010187 1026903 1048388 1074358 1103923 1135602 1167337 1196778 1221893 1241487 1255194
$$ packed form
62576A035815k9548l3870l6452l7519l7996l8012l6976l4842l2357l0175k8455
62565F59613k7138k5922k4122k1290j7956j5167j3311j1914j0552r394q700q280
62553D65867p684o663n323l951k730j645p22k68n55j232j512j078m18q6j12l03
62537D31585o59j139j472j527j420r80K18J978L298L661L875M919O596Q081R284
62522D66298J0714J2443J4165J6007J8228K0399K1936K3389K5998K9875L3716
62511F93168L6523L8505L9877L9994L8381L5746L3061L0159K6103K0632J4514
62500A046663Q580L079j985o375r628j1366j1564j0637r079o989m097l55L806
62487I90053P960J2174J6716K1485K5970K9565L1679L1735K9441K5115J9594J3707
$$ plain form
62475 1255194 1263080 1265152 1260952 1249457 1229477 1200460 1163131 1119449 1071849 1022286 971808 920951
62463 920951 870449 821464 775116 732057 692576 657001 625727 598916 576277 557148 540754
62452 540754 526462 513958 503179 494130 486847 481537 478502 477720 478677 480807 483979 488369 493932 500283
62438 500283 507007 513811 520313 525991 530449 533502 534848 533906 530246 524170 516668 508746 500803 492592
62424 492592 483709 474190 464741 456314 449302 443185 437137 430974 425255 420408 416061 411500 406578 401789
62410 401789 397523 393646 389892 386288 383053 380361 378410 377401 377169 377119 376841 376598 376905 377873 379332 381358
62394 381358 384090 387089 389468 390779 391362 391738 392213 393149 395016 397846 401159 404836 409578 415953 423298
62379 423298 430300 436523 442756 449787 457486 465289 473128 481472 490731 500964 512109 524276 537823
$$ packed form
62475A255194P886K072m200j1495j9980k9017l7329m3682m7600m9563n0478n0857
62463I20951n0502m8985m6348m3059l9481l5575l1274k6811k2639j9129j6394
62452E40754j4292j2504j0779r049p283n310l035p82R57K130L172M390N563O351
62438E00283O724O804O502N678M458L053J346r42l660o076p502p922p943q211
62424D92592q883r519r449q427p012o117o048o163n719m847m347m561m922m789
62410D01789m266l877l754l604l235k692j951j009k32n0k78k43L07R68J459K026
62394C81358K732K999K379J311N83L76M75R36J867K830L313L677M742O375P345
62379D23298P002O223O233P031P699P803P839Q344R259J0233J1145J2167J3547
$$ plain form
62366 537823 553305 571370 592582 617336 645871 678344 714896 755791 801396 851783 906221
62355 906221 963198 1021002 1078041 1132472 1181915 1224132 1258080 1283936 1302099 1312593 1315601 1311958
62343 1311958 1302543 1287422 1266139 1238806 1206377 1169940 1130407 1089035 1047579 1007460 969216
62332 969216 933093 899709 869583 842377 817299 794158 773411 755179 738736 723088 707571
62321 707571 691749 675167 657541 639058 620284 601845 584215 567640 552211 538050 525372
62310 525372 514315 504876 497054 490752 485384 480077 474667 470060 466993 464776 462009 458384 454929 452466
62296 452466 450710 449144 447980 447780 448647 450153 451689 452632 452763 452805 454084 457181 461294 465223 468543 471534
62280 471534 474475 477548 481023 485009 489236 493498 498040 503168 508782 514716 521248 528867 537838 548447
$$ packed form
62366E37823J5482J8065K1212K4754K8535L2473L6552M0895M5605N0387N4438
62355I06221N6977N7804N7039N4431M9443M2217L3948K5856J8163J0494L008l643
62343A311958r415j5121k1283k7333l2429l6437l9533m1372m1456m0119l8244
62332I69216l6123l3384l0126k7206k5078k3141k0747j8232j6443j5648j5517
62321G07571j5822j6582j7626j8483j8774j8439j7630j6575j5429j4161j2678
62310E25372j1057r439p822o302n368n307n410m607l067k217k767l625l455k463
62296D52466j756j566j164k00Q67J506J536R43J31M2J279L097M113L929L320K991
62280D71534K941L073L475L986M227M262M542N128N614N934O532P619Q971J0609
$$ plain form
62266 548447 561437 577715 597767 621727 649788 682141 718762 759712 805446 856327 911953
62255 911953 971315 1033370 1096964 1160292 1220939 1276542 1325221 1365698 1397512 1421118 1437387
62244 1437387 1446903 1449778 1445806 1434468 1415158 1387833 1353284 1312542 1266457 1216312 1164324 1112774
62232 1112774 1062827 1014721 968724 925174 883956 844905 808672 776263 747658 721703 697414
62221 697414 674586 653042 632385 612904 595795 581768 569941 558721 547369 536287 526185
62210 526185 517566 510731 505649 501796 498519 495625 493464 492433 492495 493152 493903 494775 496274 498654 501515
62195 501515 504493 508055 513016 519387 526359 533438 540871 548842 557039 565314 574114 583773 593904 603890
62181 603890 613551 622953 632036 640764 649208 657130 664044 670280 677544 687844 702040 719892 741116
$$ packed form
62266E48447J2990J6278K0052K3960K8061L2353L6621M0950M5734N0881N5626
62255I11953N9362O2055O3594O3328O0647N5603M8679M0477L1814K3606J6269
62244A437387R516K875l972j1338j9310k7325l4549m0742m6085n0145n1988n1550
62232A112774m9947m8106m5997m3550m1218l9051l6233l2409k8605k5955k4289
62221F97414k2828k1544k0657j9481j7109j4027j1827j1220j1352j1082j0102
62210E26185q619o835n082l853l277k894k161j031O2O57P51Q72J499K380K861
62195E01515K978L562M961O371O972P079P433P971Q197Q275Q800R659J0131R986
62181F03890R661R402R083Q728Q444P922O914O236P264J0300J4196J7852K1224
$$ plain form
62168 741116 765874 794470 827139 863920 904149 946224 988325 1029189 1067711 1102144 1130489
62157 1130489 1151786 1166394 1174974 1177774 1175022 1167385 1155570 1139739 1119587 1094919 1066055 1033866
62145 1033866 999557 964259 928850 894242 861699 832520 807331 785907 767688 752251 739289
62134 739289 728485 719579 712363 706480 701401 696805 692899 690148 688694 688216 688547 690319 694712 702369
62120 702369 712793 724980 738236 751877 764403 773970 779987 783595 786155 787927 788747 789190 790029 790803
62106 790803 789985 786653 781185 774253 766022 756714 747250 738778 731966 727116 724577 724514 726479 729685 733660
62091 733660 738424 744050 750337 756879 763342 769667 775992 782311 788358 794040 799895 806757 814980 824424
62077 824424 835240 848111 863456 880826 899400 918717 938583 958726 979088 1000278 1023218
$$ packed form
62168G41116K4758K8596L2669L6781M0229M2075M2101M0864L8522L4433K8345
62157A130489K1297J4608Q580K800k752p637j1815j5831k0152k4668k8864l2189
62145A033866l4309l5298l5409l4608l2543k9179k5189k1424j8219j5437j2962
62134G39289j0804q906p216n883n079m596l906k751j454m78L31J772M393P657
62120G02369J0424J2187J3256J3641J2526R567O017L608K560J772Q20M43Q39P74
62106G90803q18l332n468o932q231r308r464q472o812m850k539o3J965L206L975
62091G33660M764N626O287O542O463O325O325O319O047N682N855O862Q223R444
62077H24424J0816J2871J5345J7370J8574J9317J9866K0143K0362K1190K2940
$$ plain form
62066 1023218 1048315 1075250 1103349 1131749 1159330 1184926 1207636 1226671 1241188 1250783 1255967 1257489
62054 1257489 1255203 1248236 1236407 1220785 1202485 1181468 1156953 1128599 1096773 1062044 1025023 986586
62042 986586 947762 909295 871583 835022 800158 767586 737824 711133 687209 665277 644800
62031 644800 625911 608910 593583 579520 566837 556041 547245 540065 534192 529388 524952 519976 514421
62018 514421 509269 505307 502349 500035 498633 498464 499044 499588 500044 500940 502407 504102 505997 508564 512070
62003 512070 516266 520891 525955 531400 536820 541674 545429 547529 547686 546280 544084 541489 538307 534321
61989 534321 529537 523805 516767 508424 499365 490199 481115 472183 463643 455573 447672 439777 432355 426141
61975 426141 421400 417757 414499 410904 406606 402008 398066 395360 393623 392442 392067 393026 395110 397332 398910
$$ packed form
62066A023218K5097K6935K8099K8400K7581K5596K2710J9035J4517R595N184J522
62054A257489k286o967j1829j5622j8300k1017k4515k8354l1826l4729l7021l8437
62042I86586l8824l8467l7712l6561l4864l2572k9762k6691k3924k1932k0477
62031F44800j8889j7001j5327j4063j2683j0796q796p180n873m804m436m976n555
62018E14421n152l962k958k314j402j69N80N44M56Q96J467J695J895K567L506
62003E12070M196M625N064N445N420M854L755K100J57j406k196k595l182l986
61989E34321m784n732p038q343r059r166r084q932q540q070p901p895p422o214
61975D26141m741l643l258l595m298m598l942k706j737j181l75R59K084K222J578
$$ plain form
61960 398910 399885 400799 402150 404217 406988 410061 412864 415221 417586 420599 424517 429166 434346 440141 446807
61945 446807 454443 462866 471890 481650 492490 504553 517667 531684 546657 562561 579063 595744
61933 595744 612342 628569 643877 657698 669851 680472 689597 696946 702074 704610 704524 702317 698787
61920 698787 694393 688950 682179 674482 666982 660929 657228 656347 658358 663108 670559 680823 693690 708262
61906 708262 723425 738452 752865 765891 776649 784782 790338 792934 791706 786338 777663 766811 754248
61893 754248 740116 725224 710929 697979 685989 674249 662664 651606 641158 630966 620846
61882 620846 611178 602486 594763 587414 579848 572008 564371 557576 552043 547763 544334 541325 538685 536732
61868 536732 535663 535217 534964 534914 535665 537948 542037 547661 554424 562247 571396 582141 594603 609042 626039
$$ packed form
61960C98910R75R14J351K067K771L073K803K357K365L013L918M649N180N795O666
61945D46807P636Q423R024R760J0840J2063J3114J4017J4973J5904J6502J6681
61933E95744J6598J6227J5308J3821J2153J0621R125P349N128K536q6k207l530
61920F98787m394n443o771p697p500o053l701q81K011M750P451J0264J2867J4572
61906G08262J5163J5027J4413J3026J0758Q133N556K596j228n368q675j0852j2563
61893G54248j4132j4892j4295j2950j1990j1740j1585j1058j0448j0192j0120
61882F20846r668q692p723p349p566p840p637o795n533m280l429l009k640j953
61868E36732j069m46k53n0P51K283M089N624O763P823R149J0745J2462J4439J6997
$$ plain form
61853 626039 646026 668631 692826 717853 743694 770533 798094 825703 852764 878774 903023
61842 903023 924529 942299 955518 963676 966739 965195 959813 951344 940478 927895 914347 901029
61830 901029 889881 883036 881504 884599 890929 899575 910030 921430 932548 942347 949962 954245 954009
61817 954009 948768 938710 923960 904545 881265 855908 830144 804500 778651 752348 725809 699673
61805 699673 674952 652765 633698 617478 603441 591168 580508 571278 563228 556139 549714 543580
61793 543580 537633 532255 527985 525049 523308 522394 521679 520434 518413 516170 514506 513652 513251 512941 512602 512135
61777 512135 511377 510320 509021 507283 504744 501431 497939 494881 492397 490359 488804 487873 487498 487477 487752 488336
61761 488336 488960 489229 489194 489387 490017 490543 490474 490296 490964 492484 493693 493722 493040 492581 492357 491620 490137 488525
$$ packed form
61853F26039J9987K2605K4195K5027K5841K6839K7561K7609K7061K6010K4249
61842I03023K1506J7770J3219Q158L063j544n382q469j0866j2583j3548j3318
61830I01029j1148o845j532L095O330Q646J0455J1400J1118R799P615M283k36
61817I54009n241j0058j4750j9415k3280k5357k5764k5644k5849k6303k6539k6136
61805F99673k4721k2187j9067j6220j4037j2273j0660r230q050p089o425o134
61793E43580n947n378m270k936j741r14p15j245k021k243j664q54m01l10l39m67
61777E12135p58j057j299j738k539l313l492l058k484k038j555r31l75k1K75N84
61761D88336O24K69l5J93O30N26o9j78O68J520J209K9o82m59k24p37j483j612
$$ plain form
61743 488525 487255 486012 484262 481998 479690 477858 476880 476852 477354 477681 477577 477485 477860 478481 478799 478719 478737 479465
61725 479465 481288 484283 488019 491523 493954 495453 497064 499695 503306 507155 510541 513182 515076 516224
61711 516224 516506 515787 514224 512403 510966 509946 508638 506291 502931 499357 496350 494008 491851 489425 486664
61696 486664 483766 480914 478143 475363 472443 469311 466044 462794 459569 456127 452091 447198 441514 435622
61682 435622 430560 427220 425513 424265 422202 419029 415400 412046 409234 407007 405406 404255 403036 401297
61668 401297 399081 396765 394592 392567 390796 389685 389623 390459 391431 391802 391609 391572 392129 392861 393211 393551 394947
61651 394947 397776 401099 403676 405246 406510 408225 410800 414482 419283 424575 429265 432678 435023 436761
61637 436761 437772 437515 435898 433525 430902 427769 423593 418520 413377 408733 404430 400202 396308 393224
$$ packed form
61743D88525j270j243j750k264k308j832r78k8N02L27j04r2L75O21L18q0J8P28
61725D79465J823K995L736L504K431J499J611K631L611L849L386K641J894J148
61711E16224K82p19j563j821j437j020j308k347l360l574l007k342k157k426k761
61696D86664k898k852k771k780k920l132l267l250l225l442m036m893n684n892
61682D35622n062l340j707j248k063l173l629l354k812k227j601j151j219j739
61668D01297k216k316k173k025j771j111o2Q36R72L71j93l7N57P32L50L40J396
61651C94947K829L323K577J570J264J715K575L682M801N292M690L413K345J738
61637D36761J011k57j617k373k623l133m176n073n143m644m303m228l894l084
$$ plain form
61623 393224 391048 389570 388604 387804 386506 384460 382585 382138 382980 383377 381900 378921 375809 373184 370548
61608 370548 367287 363319 358802 353798 348402 342914 337725 333119 329151 325618 322220 318887 315812 313113
61594 313113 310706 308656 307304 306687 306104 304678 302277 299540 297067 294988 293218 291678 290134 288198 285723
61579 285723 283060 280857 279678 279705 280564 281494 281933 281919 281719 281210 280050 278403 276982 276216 275819 275423 275254
61562 275254 275763 276841 277834 278297 278469 278997 280390 282669 285286 287484 288962 290199 291907 294157 296306
61547 296306 297780 298653 299376 300253 301392 302861 304538 305949 306624 306650 306579 306796 307239 307794 308584 309730 311113
61530 311113 312550 313949 315095 315598 315331 314591 313509 311630 308636 305260 302831 301896 301850 301947 302036 302176 302168 301880
61512 301880 301583 301596 301925 302521 303425 304308 304338 303121 301461 300544 300472 300241 299145 297604 296465 295960 295647 295114
$$ packed form
61623C93224k176j478r66q00j298k046j875m47Q42L97j477k979l112k625k636
61608C70548l261l968m517n004n396n488n189m606l968l533l398l333l075k699
61594C13113k407k050j352o17n83j426k401k737k473k079j770j540j544j936k475
61579B85723k663k203j179K7Q59R30M39j4k00n09j160j647j421p66l97l96j69
61562B75254N09J078R93M63J72N28J393K279K617K198J478J237J708K250K149
61547B96306J474Q73P23Q77J139J469J677J411O75K6p1K17M43N55P90J146J383
61530C11113J437J399J146N03k67p40j082j879k994l376k429r35m6R7Q9J40qk88
61512C01880k97J3L29N96R04Q83L0j217j660r17p2k31j096j541j139n05l13n33
$$ plain form
61494 295114 294427 293944 293842 293912 293853 293733 293951 294718 295846 297180 298863 300876 302619 303491 303721 304198 305495
61477 305495 307401 309357 310927 311849 312031 311655 311085 310651 310609 311104 311899 312422 312461 312570 313241 313961 313819 312945
61459 312945 312476 312967 313701 313892 313817 314207 315199 316499 318073 319991 321910 323367 324444 325553 326700 327533
61443 327533 328036 328698 330002 332106 334935 338200 341421 344429 347758 351981 356615 360308 362331 363413 364855
61428 364855 367170 369860 372182 373728 374467 374649 374759 375344 376712 378696 380723 382237 383218 384179 385405 386339
61412 386339 386107 384664 382981 381892 381179 380086 378392 376542 374874 373205 371167 368643 365778 362805 359981
61397 359981 357556 355702 354453 353634 352818 351554 349841 348239 347274 346884 346672 346615 347109 348346 349993 351605
61381 351605 353013 354172 354969 355436 355962 356975 358516 360259 361865 363134 363982 364520 365158 366436 368699 371931
$$ packed form
61494B95114o87m83j02P0n9j20K18P67J128J334J683K013J743Q72K30M77J297
61477C05495J906J956J570R22J82l76n70m34m2M95P95N23L9J09O71P20j42q74
61459C12945m69M91P34J91p5L90R92J300J574J918J919J457J077J109J147Q33
61443C27533N03O62J304K104K829L265L221L008L329M223M634L693K023J082J442
61428C64855K315K690K322J546P39J82J10N85J368J984K027J514R81R61J226R34
61412C86339k32j443j683j089p13j093j694j850j668j669k038k524k865k973k824
61397C59981k425j854j249q19q16j264j713j602r65l90k12n7M94J237J647J612
61381C51605J408J159P97M67N26J013J541J743J606J269Q48N38O38J278K263L232
$$ plain form
61365 371931 375722 379260 381544 381997 381057 380122 380751 383699 388498 393898 398950 403710 408835 414559 420511
61350 420511 426597 433491 441772 450886 459533 466972 473460 479499 485209 490528 495474 499973 503802 506904
61336 506904 509498 511690 513275 514069 514143 513556 512174 509975 507266 504315 501051 497457 494072 491729 490745
61321 490745 490616 490499 489872 488712 487248 485624 483895 482371 481842 483146 486431 491042 496289 502196 509401
61306 509401 518502 529526 541832 554387 566263 576983 586330 593962 599524 603085 605048 605560 604414
61293 604414 601677 597854 593131 586969 578978 569826 560765 552422 544579 536983 529812 523330 517587 512616
61279 512616 508616 505812 504308 504121 505214 507485 510762 514651 518433 521439 523770 526279 529509 533017
61265 533017 536155 539131 542731 547297 552759 559491 568227 578902 590315 601297 611606 621293 629783
$$ packed form
61365C71931L791L538K284M53r40r35O29K948M799N400N052M760N125N724N952
61350D20511O086O894Q281R114Q647P439O488O039N710N319M946M499L829L102
61336E06904K594K192J585P94P4n87j382k199k709k951l264l594l385k343r84
61321D90745j29j17o27j160j464j624j729j524n29J304L285M611N247N907P205
61306E09401R101J1024J2306J2555J1876J0720R347P632N562L561J963N12j146
61293F04414k737l823m723o162p991r152r061q343p843p596p171o482n743m971
61279E12616m000k804j504j87J093K271L277L889L782L006K331K509L230L508
61265E33017L138K976L600M566N462O732Q736J0675J1413J0982J0309R687Q490
$$ plain form
61252 629783 636228 640475 643115 644594 644728 643143 639915 635628 630922 626016 620657 614556 607916 601475
61238 601475 595936 591373 587246 583051 578932 575611 573641 572835 572621 572885 574033 576150 578649 581137 584237
61223 584237 588954 595400 602665 609893 616993 624286 631889 639554 646779 653080 658501 663756 669421 675035
61209 675035 679433 681965 682945 683035 682867 683284 685178 688777 693701 699973 708303 719007 731373 744666 759183
61194 759183 775557 793425 811526 828911 845294 860331 873378 884187 893279 901255 908046 912996
61182 912996 915497 915455 913369 910036 905923 900753 893907 885331 875788 866159 856667 846927 836504 825204
61168 825204 812969 799758 785612 770699 755271 739599 723913 708309 692752 677334 662551
61157 662551 649119 637418 627313 618735 612181 608230 606606 606281 606623 607902 610269 612734 613730 612455
$$ packed form
61252F29783O445M247K640J479J34j585l228m287m706m906n359o101o640o441
61238F01475n539m563m127m195m119l321j970q06k14K64J148K117K499K488L100
61223E84237M717O446P265P228P100P293P603P665P225O301N421N255N665N614
61209F75035M398K532R80R0j68M17J894L599M924O272Q330J0704J2366J3293J4517
61194G59183J6374J7868J8101J7385J6383J5037J3047J0809R092P976O791M950
61182I12996K501m2k086l333m113n170o846q576r543r629r492r740j0423j1300
61168H25204j2235j3211j4146j4913j5428j5672j5686j5604j5557j5418j4783
61157F62551j3432j1701j0105q578o554l951j624l25L42J279K367K465R96j275
$$ plain form
61143 612455 609103 603950 596974 588466 579484 571364 565105 561216 559699 559961 561184 563091 566143 570808
61129 570808 576976 584284 592688 602390 613469 625934 640036 656225 674813 695788 718914 743852
61117 743852 770258 797870 826464 855701 885099 914124 942151 968360 992010 1013033 1032204
61106 1032204 1050538 1068401 1085101 1099227 1109418 1115036 1116257 1113611 1107541 1098352 1086139 1070572
61094 1070572 1051174 1028250 1003288 977948 952785 927300 900997 873900 846406 819310 793781
61083 793781 770501 748904 727978 707748 689211 672937 658693 646424 636418 628186 620319 612109
61071 612109 604441 598519 594490 591871 590490 590304 591008 592571 595485 599816 604686 609471 614879 621935 630526
61056 630526 639825 649595 660059 670979 682081 694088 708203 724604 742460 761383 781857 804213
$$ packed form
61143F12455l352n153o976q508q982q120o259l889j517K62J223J907L052M665
61129E70808O168P308Q404R702J1079J2465J4102J6189J8588K0975K3126K4938
61117G43852K6406K7612K8594K9237K9398K9025K8027K6209K3650K1023J9171
61106A032204J8334J7863J6700J4126J0191N618J221k646o070r189j2213j5567
61094A070572j9398k2924k4962k5340k5163k5485k6303k7097k7494k7096k5529
61083G93781k3280k1597k0926k0230j8537j6274j4244j2269j0006q232p867q210
61071F12109p668n922m029k619j381j86P04J563K914M331M870M785N408P056Q591
61056F30526R299R770J0464J0920J1102J2007J4115J6401J7856J8923K0474K2356
$$ plain form
61044 804213 828223 853871 881558 911196 941824 972493 1003097 1034201 1066534 1100727 1136957
61033 1136957 1174745 1213583 1253726 1295724 1339080 1382083 1423271 1462710 1501761 1542017 1584554
61022 1584554 1629832 1678241 1730978 1790150 1857479 1933019 2015646 2104884 2202071 2310479 2435274
61011 2435274 2583384 2762830 2982489 3253356 3590011 4010726 4537563 5198102 6026343
61002 6026343 7059376 8331523 9868319 11673448 13699658 15815641 17806184 19432748
60994 19432748 20531428 21084504 21218585 21140896 21062966 21144625 21455026 21942632 22432448 22677720
60984 22677720 22457752 21668857 20354435 18666284 16794084 14905619 13116714 11488327
60976 11488327 10040454 8771096 7670097 6724489 5919586 5240230 4671780 4199535 3808330
$$ packed form
61044H04213K4010K5648K7687K9638L0628L0669L0604L1104L2333L4193L6230
61033A136957L7788L8838M0143M1998M3356M3003M1188L9439L9051M0256M2537
61022A584554M5278M8409N2737N9172O7329P5540Q2627Q9238R7187J08408J24795
61011B435274J48110J79446K19659K70867L36655M20715N26837O60539Q28241
61002F026343J033033J272147J536796J805129K026210K115983J990543J626564
60994A9432748J098680N53076J34081p7689p7930Q1659L10401M87606M89816K45272
60984B2677720k19968p88895j314422j688151j872200j888465j788905j628387
60976A1488327j447873j269358j100999r45608q04903o79356n68450m72245l91205
$$ plain form
60967 3808330 3483983 3214639 2990160 2801359 2641064 2505186 2391300 2296419 2217089 2151106
60957 2151106 2097802 2056640 2026395 2005536 1992302 1984235 1978315 1971724 1962176 1948035 1928903 1905772
60945 1905772 1879673 1850249 1816445 1778269 1736845 1692810 1645874 1596148 1544791 1492831 1440261
60934 1440261 1386947 1333767 1282141 1232744 1185251 1139183 1094595 1052053 1012234 975495 941690
60923 941690 910415 881440 854736 830169 807465 786533 767525 750494 735188 721258 708513
60912 708513 697065 687370 679980 674936 671513 668826 666541 664671 662961 661063 659222 658074 657632 657029
60898 657029 655502 653144 650475 647715 644826 641920 639244 636919 634882 632883 630394 626806 622022 616684
60884 616684 611599 606973 602304 596892 590369 582927 575202 567856 561140 554902 548923 543013 536860 530088
$$ packed form
60967C808330l24347k69344k24479j88801j60295j35878j13886r4881p9330o5983
60957B151106n3304m1162l0245k0859j3234q067n920o591r548j4141j9132k3131
60945A905772k6099k9424l3804l8176m1424m4035m6936m9726n1357n1960n2570
60934A440261n3314n3180n1626m9397m7493m6068m4588m2542l9819l6739l3805
60923I41690l1275k8975k6704k4567k2704k0932j9008j7031j5306j3930j2745
60912G08513j1448r695p390n044l423k687k285j870j710j898j841j148m42o03
60898F57029j527k358k669k760k889k906k676k325k037j999k489l588m784n338
60884F16684n085m626m669n412o523p442p725p346o716o238n979n910o153o772
$$ plain form
60870 530088 522667 515016 507604 500665 494404 489159 485126 482116 479793 477991 476548 475026 472914 470166
60856 470166 467294 464862 463051 461763 460946 460587 460444 460100 459443 458890 458820 458866 458150 456366 454235 452672 451789
60839 451789 451038 449997 448565 446625 444175 441789 440326 440016 440278 440682 441562 443369 445820 448195 450291
60824 450291 452623 455662 459179 462430 464808 466230 466971 467198 466716 465307 463268 461351 459999 458826 457129
60809 457129 454811 452542 450985 450128 449482 448714 447830 446760 445046 442130 437946 433078 428314 424135 420592
60794 420592 417464 414418 411074 407158 402628 397663 392584 387799 383624 380063 376796 373511 370195 367050
60780 367050 364249 361886 360022 358613 357475 356454 355567 354915 354651 355058 356430 358668 361269 363957 367017
60765 367017 370691 374620 378375 382238 386766 391699 396077 399558 402912 406886 411189 414982 417903 420148
$$ packed form
60870E30088p421p651p412o939o261n245m033l010k323j802j443j522k112k748
60856D70166k872k432j811j288q17l59j43l44o57n53p0M6p16j784k131j563q83
60839D51789p51j041j432j940k450k386j463l10K62M04Q80J807K451K375K096
60824D50291K332L039L517L251K378J422P41K27m82j409k039j917j352j173j697
60809D57129k318k269j557q57o46p68q84j070j714k916m184m868m764m179l543
60794D20592l128l046l344l916m530m965n079m785m175l561l267l285l316l145
60780C67050k801k363j864j409j138j021q87o52k64M07J372K238K601K688L060
60765C67017L674L929L755L863M528M933M378L481L354L974M303L793K921K245
$$ plain form
60751 420148 421866 422985 423489 423539 423441 423719 424890 426762 428117 427499 424333 419057 412383 404810 396806 388953
60735 388953 381657 374855 368182 361365 354510 348051 342426 337702 333578 329773 326300 323308 320870 319090
60721 319090 318198 318278 318980 319707 320033 319821 319112 318129 317279 316802 316501 316022 315334 314676 314086 313377 312609 312262 312789
60702 312789 314152 315923 317675 319249 320856 322979 325954 329528 332974 335773 338035 340252 342826 345908
60688 345908 349481 353408 357564 362007 366906 372225 377720 383322 389194 395183 400534 404579 407539 410249
60674 410249 413209 416286 419242 421928 423859 424209 422643 419735 416183 411932 406527 400096 393416 387114
60660 387114 381333 376149 371773 368149 364821 361475 358241 355309 352662 350553 349824 351190 354349 358161
60646 358161 361634 364337 366018 366382 365358 363151 359906 355692 350980 346722 343580 341322 339247 337032
$$ packed form
60751D20148J718J119N04N0r8K78J171J872J355o18l166n276o674p573q004p853
60735C88953p296o802o673o817o855o459n625m724m124l805l473k992k438j780
60721C19090q92Q0P02P27L26k12p09r83q50m77l01m79o88o58n90p09p68l47N27
60702C12789J363J771J752J574J607K123K975L574L446K799K262K217K574L082
60688C45908L573L927M156M443M899N319N495N602N872N989N351M045K960K710
60674D10249K960L077K956K686J931L50j566k908l552m251n405o431o680o302
60660C87114n781n184m376l624l328l346l234k932k647k109p29J366L159L812
60646C58161L473K703J681L64j024k207l245m214m712m258l142k258k075k215
$$ plain form
60632 337032 334866 333008 331595 330817 330835 331392 331836 331739 331341 331261 331905 333257 335007 336650 337569 337381 336349
60615 336349 335321 335110 335914 337311 338690 339670 340284 340896 341866 343176 344403 345158 345425 345369 344934 343968 342698
60598 342698 341836 342031 343342 345318 347414 349249 350700 351888 352979 353910 354445 354571 354570 354594 354489 354246 354304 355010
60580 355010 356060 356901 357501 358182 358835 359028 359028 360095 363332 368658 375243 382630 391013 400654 411443 422980
60564 422980 434746 446186 456826 466245 473847 478892 481028 480671 478529 474941 470002 464193 458401 453297
60550 453297 449157 446388 445672 447227 450313 453898 457675 462048 467274 473246 480244 489371 501689 516938
60536 516938 533441 549351 563781 576691 587976 597046 603264 606487 607014 605213 601535 596819 592149
60523 592149 588058 584036 579167 573370 567730 563412 560472 558013 555398 552901 551073 549857 548698 547381
$$ packed form
60632C37032k166j858j413p78J8N57M44r7l98q0O44J352J750J643R19j88j032
60615C36349j028k11Q04J397J379R80O14O12R70J310J227P55K67n6m35r66j270
60598C42698q62J95J311J976K096J835J451J188J091R31N35J26jK4j05k43N8P06
60580C55010J050Q41O00O81O53J93%J067L237N326O585P387Q383R641J0789J1537
60564D22980J1766J1440J0640R419P602N045K136l57k142l588m939n809n792n104
60550D53297m140k769p16J555L086L585L777M373N226N972O998R127J2318J5249
60536E16938J6503J5910J4430J2910J1285R070O218L223N27j801l678m716m670
60523E92149m091m022m869n797n640m318k940k459k615k497j828j216j159j317
$$ plain form
60509 547381 546391 546459 548015 551198 556150 563103 572322 584178 599273 618325 641823 669765 701720
60496 701720 737144 775602 816678 859636 903206 945685 985227 1020002 1048243 1068378 1079217
60485 1079217 1080059 1070706 1051544 1023638 988574 948159 904278 858891 813843 770456 729396 691018
60473 691018 655758 624060 596046 571417 549711 530559 513699 498837 485564 473470 462376
60462 462376 452398 443654 435942 428897 422440 416822 412099 407888 403887 400371 397713 395550 392931 389480
60448 389480 386007 383662 382747 382573 382296 381542 380349 378922 377510 376242 374968 373418 371591 369794 368242
60433 368242 366857 365581 364689 364467 364696 364767 364335 363681 363304 363319 363385 363162 362681 362206 361809 361216 360154 358841
60415 358841 358023 358495 360574 363907 367571 370402 371652 371644 371571 372221 372963 372387 370013 366981 364929 364563 365569
$$ packed form
60509E47381r90O8J556L183M952O953R219J1856J5095J9052K3498K7942L1955
60496G01720L5424L8458M1076M2958M3570M2479L9542L4775K8241K0135J0839
60485A079217Q42r353j9162k7906l5064m0415m3881m5387m5048m3387m1060l8378
60473F91018l5260l1698k8014k4629k1706j9152j6860j4862j3273j2094j1094
60462D62376r978q744p712p045o457n618m723m211m001l516k658k163k619l451
60448C89480l473k345r15j74k77p54j193j427j412j268j274j550j827j797j552
60433C68242j385j276q92k22K29P1m32o54l77J5O6k23m81m75l97n93j062j313
60415C58841q18M72K079L333L664K831J250qp3O50P42n76k374l032k052l66J006
$$ plain form
60398 365569 367497 370232 373684 377490 381198 384494 387183 389138 390462 391537 392773 394368 396371 398875
60384 398875 401948 405387 408729 411570 413754 415182 415685 415358 414927 415358 416968 419168 421257 423130 424921
60369 424921 426264 426493 425603 424532 424330 425274 426891 428611 430272 432177 434658 437462 439710 440870 441663
60354 441663 443502 446982 451483 456281 461355 466759 471952 476372 480184 483767 486764 488395 488570 488030 487416
60339 487416 486761 485874 484602 482621 479596 475867 472514 470406 469362 468444 466898 464631 461943 459069 456045
60324 456045 452963 450157 447959 446321 444991 444096 444075 444825 445430 445235 444814 445311 447210 450391 455077 461802
60308 461802 470457 480241 490785 502658 516450 531881 547971 563523 577231 587913 595019 598550
60296 598550 598301 593735 584911 573092 560085 547274 535401 524748 515215 506655 499385 493925 490049
$$ packed form
60398C65569J928K735L452L806L708L296K689J955J324J075J236J595K003K504
60384C98875L073L439L342K841K184J428N03l27m31M31J610K200K089J873J791
60369D24921J343K29q90j071k02R44J617J720J661J905K481K804K248J160P93
60354D41663J839L480M501M798N074N404N193M420L812L583K997J631J75n40o14
60339D87416o55q87j272j981l025l729l353k108j044r18j546k267k688k874l024
60324D56045l082k806k198j638j330q95k1P50O05j95m21M97J899L181M686O725
60308D61802Q655R784J0544J1873J3792J5431J6090J5552J3708J0682P106L531
60296E98550k49m566q824j1819j3007j2811j1873j0653r533q560p270n460l876
$$ plain form
60283 490049 486693 483166 479837 477185 474755 471679 467732 463212 458217 452795 447558 443347 440355 438163
60269 438163 436502 435279 433931 431558 427983 424148 421221 419572 418688 417744 416193 414157 412360 411405 411089
60254 411089 410760 410291 410298 411292 412994 414720 416072 417002 417355 416746 415011 412717 411012 410759 411742 412938 413643
60237 413643 414109 414953 416323 417997 419956 422306 424742 426696 428102 429544 431538 434071 436968 440239 443745
60222 443745 446922 449325 451371 454137 458293 463444 468654 473537 478614 484629 491702 499309 506879 514128
60208 514128 520920 527239 533439 540063 547205 554306 560837 566781 572189 576684 579943 582375 584748 587215
60194 587215 589174 590005 589438 587319 583694 579211 574872 571073 567290 562872 557774 552279 546443 540211 533866
60179 533866 527959 522827 518405 514479 510976 507978 505571 503760 502569 502185 502791 504132 505454 506099 506047
$$ packed form
60283D90049l356l527l329k652k430l076l947m520m995n422n237m211k992k192
60269D38163j661j223j348k373l575l835k927j649q84r44j551k036j797r55l16
60254D11089l29m69PR94J702J726J352R30L53o09j735k294j705k53R83J196P05
60237D13643M66Q44J370J674J959K350K436J954J406J442J994K533K897L271L506
60222D43745L177K403K046K766M156N151N210M883N077O015P073P607P570P249
60208E14128O792O319O200O624P142P101O531N944N408M495L259K432K373K467
60194E87215J959Q31n67k119l625m483m339l799l783m418n098n495n836o232o345
60179E33866n907n132m422l926l503k998k407j811j191l84O06J341J322O45n2
$$ plain form
60164 506047 505683 505198 504594 504106 504234 505275 507072 509168 510916 511666 511353 510907 511524 513435 515786 517744
60148 517744 519163 520154 520770 521488 523278 526573 530590 534318 537853 542150 547709 554220 561388 569275 577644
60133 577644 585700 592948 599791 606680 613007 617518 619865 621123 622527 624196 625509 626395 627510 629136
60119 629136 630595 631124 630874 630640 630886 631541 632463 633491 634055 633323 630913 627074 622123 616236 609964 604343
60103 604343 599969 596190 591704 585923 579503 573623 569047 565898 564043 563444 563987 565140 566142 566827 567993
60088 567993 570487 574043 577609 580825 584478 589195 594364 598845 602259 604931 606929 607863 607536 606123 603665
60073 603665 599885 594608 587961 580156 571521 562711 554340 546279 537843 528874 520171 512552 505989 500025
60059 500025 494637 490133 486504 483412 480718 478471 476482 474509 472952 472762 474374 477165 480304 483797
$$ packed form
60164E06047l64m85o04m88J28J041J797K096J748P50l13m46O17J911K351J958
60148E17744J419R91O16P18J790L295M017L728L535M297N559O511P168P887Q369
60133E77644Q056P248O843O889O327M511K347J258J404J669J313Q86J115J626
60119F29136J459N29k50k34K46O55R22J028N64p32k410l839m951n887o272n621
60103F04343m374l779m486n781o420n880m576l149j855n99N43J153J002O85J166
60088E67993K494L556L566L216L653M717N169M481L414K672J998R34l27j413k458
60073F03665l780n277o647p805q635q810q371q061q436q969q703p619o563n964
60059E00025n388m504l629l092k694k247j989j973j557j90J612K791L139L493
$$ plain form
60045 483797 488239 493822 500111 506723 513706 521077 528382 534918 540222 544237 547133 549082 550015 549555 547386
60030 547386 543779 539563 535422 531395 527079 522088 516167 509219 501517 493752 486531 479907 473601 467542
60016 467542 461984 457179 453134 449584 446002 441881 437249 432795 429163 426302 423809 421630 419957 418639
60002 418639 417304 416057 415412 415428 415545 415540 416044 417703 420268 422974 425502 428084 430925 434033 437554 441726
59986 441726 446389 450833 454290 456429 457412 457677 457674 457563 457047 455579 452858 449130 445051 441240 437945 435076
59970 435076 432549 430523 429188 428439 427976 427735 427930 428634 429652 430990 433120 436384 440252 443562 445615
59955 445615 446778 447904 449322 450557 450964 450442 449444 448459 447750 447526 447955 448665 448640 447185 444937 443236 442355
59938 442355 441006 437973 433679 429585 426514 424330 423040 423227 425146 428119 431266 434425 437877 441526
$$ packed form
60045D83797M442N583O289O612O983P371P305O536N304M015K896J949R33m60k169
60030E47386l607m216m141m027m316m991n921o948p702p765p221o624o306o059
60016D67542n558m805m045l550l582m121m632m454l632k861k493k179j673j318
60002D18639j335j247o45J6J17nN04J659K565K706K528K582K841L108L521M172
59986D41726M663M444L457K139R83K65lj11n16j468k721l728m079l811l295k869
59970D35076k527k026j335p49m63k41J95P04J018J338K130L264L868L310K053
59955D45615J163J126J418J235M07n22r98r85p09k24M29P10k5j455k248j701q81
59938D42355j349l033m294m094l071k184j290J87J919K973L147L159L452L649
$$ plain form
59924 441526 444891 447901 451202 455643 461735 469588 478900 488811 498171 506352 513617 520356 526166 530193
59910 530193 532386 533863 535749 538015 539781 540483 540383 540116 540096 540322 540419 539916 538690 537090 535430 533598
59894 533598 531561 529973 529754 531031 533015 534984 536922 539104 541593 544378 547545 551041 554690 558727
59880 558727 563825 570212 577097 583373 588620 593000 596503 598826 599865 599794 598713 596610 593742 590646 587732
59865 587732 585094 582699 580449 578086 575396 572630 570414 569140 568653 568656 569215 570644 572990 575875 578990
59850 578990 582704 587921 595108 603409 610926 615955 617888 617113 614512 611279 608741 607790 608402 609863 611268
59835 611268 611640 609958 605699 599402 592369 585711 579897 575084 571334 568338 565320 561549 556856 551509
59821 551509 545851 540317 535670 532783 531935 532460 533277 533744 533859 533690 532893 531019 528114 524765 521608 519056
$$ packed form
59924D41526L365L010L301M441O092P853R312R911R360Q181P265O739N810M027
59910E30193K193J477J886K266J766P02j00k67k0K26R7n03j226j600j660j832
59894E33598k037j588k19J277J984J969J938K182K489K785L167L496L649M037
59880E58727N098O387O885O276N247M380L503K323J039p1j081k103k868l096k914
59865E87732k638k395k250k363k690k766k216j274m87LN59J429K346K885L115
59850E78990L714N217P187Q301P517N029J933p75k601l233k538r51O12J461J405
59835F11268L72j682m259o297p033o658n814m813l750k996l018l771m693n347
59821E51509n658n534m647k887q48N25Q17M67J15j69p97j874k905l349l157k552
$$ plain form
59805 519056 517376 516603 516284 515711 514569 513070 511391 509399 507100 504822 502567 499661 495658 491306 487931
59790 487931 485944 484519 482799 480742 478666 476637 474709 473283 472656 472362 471501 469758 467724 466073 464755
59775 464755 463328 461926 461448 462617 465110 467900 470285 472237 473922 475449 477199 479831 483537 487597
59761 487597 491139 494171 497475 501585 506275 511028 515685 520507 525812 531617 537539 543104 548240 553316
59747 553316 558619 563992 569188 574301 579507 584559 588894 592174 594395 595563 595618 594689 593152 591428 589893
59732 589893 588845 588272 587780 587070 586352 585929 585479 584247 582017 579465 577458 576299 575665 574919 573386 570726
59716 570726 567283 563924 561386 559835 558998 558484 558073 557926 558537 560144 562248 564020 565143 565935 566714 567530
59700 567530 568501 569893 571703 573608 575526 577825 580768 584015 586920 588995 589976 589791 588747 587441 586266
$$ packed form
59805E19056j680p73l19n73j142j499j679j992k299k278k255k906m003m352l375
59790D87931j987j425j720k057k076k029j928j426o27k94q61j743k034j651j318
59775D64755j427j402m78J169K493K790K385J952J685J527J750K632L706M060
59761D87597L542L032L304M110M690M753M657M822N305N805N922N565N136N076
59747E53316N303N373N196N113N206N052M335L280K221J168N5r29j537j724j535
59732E89893j048n73m92p10p18m23m50j232k230k552k007j159o34p46j533k660
59716E70726l443l359k538j551q37n14m11j47O11J607K104J772J123P92P79Q16
59700E67530R71J392J810J905J918K299K943L247K905K075R81j85j044j306j175
$$ plain form
59685 586266 585239 584440 584267 584938 586002 586680 586485 585283 582983 579491 574889 569446 563564 557781 552536
59670 552536 547678 542517 536706 530858 525968 522337 519443 516734 514172 512067 510748 510469 511323 513094 515389
59655 515389 518004 521006 524401 527925 531301 534610 538175 542008 545427 547346 547058 544721 541043 536638
59641 536638 531816 526873 522221 518109 514500 511379 509033 507825 507804 508643 509853 510950 511555 511505 510788 509305
59625 509305 506877 503591 499915 496305 492863 489565 486559 483872 480996 477241 472564 467740 463628 460551
59611 460551 458525 457732 458460 460684 463950 467636 471197 474269 476816 479167 481659 484170 486220 487596 488607
59596 488607 489549 490219 490311 490069 490092 490516 490850 490682 490076 489154 487809 486102 484524 483407 482377 480858 478848
59579 478848 476759 474711 472492 470081 467655 465203 462680 460499 459211 458642 457945 456728 455561 455095 455129
$$ packed form
59685E86266j027p99j73O71J064O78j95j202k300l492m602n443n882n783n245
59670E52536m858n161n811n848m890l631k894k709k562k105j319k79Q54J771K295
59655E15389K615L002L395L524L376L309L565L833L419J919k88k337l678m405
59641E36638m822m943m652m112l609l121k346j208k1Q39J210J097O05n0p17j483
59625E09305k428l286l676l610l442l298l006k687k876l755m677m824m112l077
59611D60551k026p93P28K224L266L686L561L072K547K351K492K511K050J376J011
59596D88607R42O70R2k42K3M24L34j68o06r22j345j707j578j117j030j519k010
59579D78848k089k048k219k411k426k452k523k181j288n69o97j217j167m66L4
$$ plain form
59564 455129 454891 453908 452323 450652 449471 449051 449125 449238 449465 450394 452251 454477 456420 458089 459907 462076
59548 462076 464536 467262 470307 473869 478579 485338 494537 505862 519293 535741 555831 578119 599149
59535 599149 615390 624878 627370 623925 616672 608272 600854 595338 591757 589963 589841 591143 593497 596593
59521 596593 600194 603896 606949 608492 608129 606208 603329 599617 594772 588833 582351 575523 567731 558534
59507 558534 548804 540169 533340 527607 522005 516367 511129 506717 503448 501516 500632 499967 498867 497426 496139
59492 496139 495237 494671 494452 494517 494426 493750 492892 493086 495215 498858 502843 506651 510929 516482 523108 529785 535905
59475 535905 541844 548127 554405 559616 562961 564373 564160 562646 560280 557737 555678 554538 554511 555567 557483
59460 557483 560264 564539 571084 579745 589257 598456 607349 616633 626531 636555 646187 655179 663244 670028
$$ packed form
59564D55129k38r83j585j671j181m20P4J13K27R29J857K226J943J669J818K169
59548D62076K460K726L045L562M710O759R199J1325J3431J6448K0090K2288K1030
59535E99149J6241R488K492l445p253q400p418n516l581j794j22J302K354L096
59521E96593L601L702L053J543l63j921k879l712m845n939o482o828p792r197
59507E58534r730q635o829n733n602n638n238m412l269j932q84o65j100j441j287
59492D96139r02n66k19O5r1o76q58J94K129L643L985L808M278N553O626O677O120
59475E35905N939O283O278N211L345J412k13j514k366k543k059j140k7J056J916
59460E57483K781M275O545Q661R512R199Q893R284R898J0024R632Q992Q065O784
$$ plain form
59446 670028 675417 679313 681045 679596 674707 667305 658559 648984 638822 628800 619880 612419 606029 600151
59432 600151 594376 588424 582348 576829 572826 570835 570766 572475 576121 582055 590749 602663 617762 635280
59418 635280 654522 675793 699957 727154 756641 787586 818684 846586 866110 873309 868186 854046
59406 854046 835063 815125 797887 786058 780455 780614 786055 795797 806706 813785 812809 802290 783212
59393 783212 758216 731265 706462 685789 668370 652617 638485 627037 618527 612109 607120 603594
59381 603594 601455 600118 599188 598960 599837 601598 603501 604956 605957 606971 608490 610613 613008 615288 617330
59366 617330 619218 621021 622777 624570 626504 628613 630881 633263 635733 638444 641879 646648 653072 661108
59352 661108 670637 681621 694066 708152 724306 742696 762613 782818 802554 821717 839947 856224
$$ packed form
59446F70028N389L896J732j449m889p402q746r575j0162j0022q920p461o390n878
59432F00151n775n952o076n519m003j991o9J709L646N934Q694J1914J5099J7518
59418F35280J9242K1271K4164K7197K9487L0945L1098K7902J9524P199n123j4140
59406H54046j8983j9938j7238j1829n603J59N441R742J0909P079r76j0519j9078
59393G83212k4996k6951k4803k0673j7419j5753j4132j1448q510o418m989l526
59381F03594k139j337r30k28Q77J761J903J455J001J014J519K123K395K280K042
59366F17330J888J803J756J793J934K109K268K382K470K711L435M769O424Q036
59352F61108R529J0984J2445J4086J6154J8390J9917K0205J9736J9163J8230J6277
$$ plain form
59340 856224 869740 880589 889110 895016 897711 897104 893550 887203 877993 866123 852098 836384 819502
59327 819502 802360 785925 770481 755642 741230 727766 715931 705778 696758 688387 680661 673723
59315 673723 667309 660844 654190 647976 642819 638513 634537 631226 629717 630616 633466 637849 644233 653179
59301 653179 664155 675658 686041 693649 696670 693751 684844 671097 654145 635859 618307 603087
59289 603087 590548 580023 570774 562474 555133 549114 545028 543138 542968 543923 546024 549548 554294 559870
59275 559870 566504 574885 585215 597000 609630 622558 635071 646569 657052 666635 674697 680304
59263 680304 683506 685311 686228 685668 683078 678858 673675 667598 660522 652973 645853 639610 634107 629137 624660
59248 624660 620720 617434 615041 613754 613614 614551 616494 619428 623570 629425 637261 646506 656018 665057 673597
$$ packed form
59340H56224J3516J0849Q521N906K695o07l554o347r210j1870j4025j5714j6882
59327H19502j7142j6435j5444j4839j4412j3464j1835j0153r020q371p726o938
59315F73723o414o465o654o214n157m306l976l311j509Q99K850M383O384Q946
59301F53179J0976J1503J0383P608L021k919q907j3747j6952j8286j7552j5220
59289F03087j2539j0525r249q300p341o019m086j890j70R55K101L524M746N576
59275E59870O634Q381J0330J1785J2630J2928J2513J1498J0483R583Q062N607
59263F80304L202J805R17n60k590m220n183o077p076p549p120o243n503m970m477
59248F24660l940l286k393j287j40R37J943K934M142N855P836R245R512R039Q540
$$ plain form
59233 673597 681604 688573 694100 698442 702061 704835 706143 705557 703126 699102 693813 687781 681597 675487
59219 675487 669131 662017 653997 645409 636705 628096 619670 611698 604498 597956 591523 584902 578467 572784
59205 572784 567980 563824 560085 556471 552546 548209 544058 540850 538739 537465 536967 537232 537745 537824 537512 537547
59189 537547 538457 540255 542938 546542 550585 554220 557231 560357 564418 569565 575454 581592 587418 592708
59175 592708 598122 604696 612561 620783 628705 636744 645489 654765 664150 673786 683911 693954 702740 709442
59161 709442 713846 715943 715778 713592 709665 704034 696596 687391 676662 664896 652887 641373 630383
59148 630383 619347 608052 597007 586607 576548 566557 557095 548675 540958 533267 525706 518937 512986
59135 512986 507173 501296 496114 492341 489737 487628 485974 485445 486529 488806 491233 493087 494522 496136
$$ packed form
59233F73597Q007O969N527M342L619K774J308n86k431m024n289o032o184o110
59219F75487o356p114q020q588q704q609q426p972p200o542o433o621o435n683
59205E72784m804m156l739l614l925m337m151l208k111j274m98K65N13P9l12L5
59189E37547R10J798K683L604M043L635L011L126M061N147N889O138N826N290
59175E92708N414O574P865Q222P922Q039Q745R276R385R636J0125J0043Q786O702
59161G09442M404K097j65k186l927n631p438r205j0729j1766j2009j1514j0990
59148F30383j1036j1295j1045j0400j0059r991r462q420p717p691p561o769n951
59135E12986n813n877n182l773k604k109j654n29J084K277K427J854J435J614
$$ plain form
59121 496136 498136 500304 502812 506503 512018 518978 526553 534569 543496 553445 563768 573816 583596 593440
59107 593440 603323 612771 621258 628560 634799 640277 645159 649272 652270 654007 654615 654252 653018 651244 649651
59092 649651 648910 649024 649359 649381 649184 649110 649023 648262 646364 643475 639924 635682 630497 624328 617339 609725 601903
59075 601903 594682 588741 583952 579539 574847 569609 563698 557236 550990 546040 542812 540820 539424 538369
59061 538369 537467 536291 534501 532100 529194 525849 522365 519271 516764 514552 512420 510532 508881 506941
59047 506941 504322 501455 499201 497902 497202 496671 496309 496442 497296 498707 500319 502099 504428 507358 510124
59032 510124 512039 513711 516602 521302 527094 533397 540709 549684 560125 571603 584333 598651 613960
59019 613960 628910 642363 653608 662026 667266 669656 669893 668444 665624 661958 658026 654129 650481 647443
$$ packed form
59121D96136K000K168K508L691N515O960P575Q016Q927R949J0323J0048R780R844
59107E93440R883R448Q487P302O239N478M882M113K998J737O08l63j234j774j593
59092F49651p41J14L35K2j97p4q7p61j898k889l551m242n185o169o989p614p822
59075F01903p221n941m789m413m692n238n911o462o246m950l228j992j396j055
59061E38369r02j176j790k401k906l345l484l094k507k212k132j888j651j940
59047E06941k619k867k254j299p00n31l62J33Q54J411J612J780K329K930K766
59032E10124J915J672K891M700N792O303P312Q975J0441J1478J2730J4318J5309
59019F13960J4950J3453J1245Q418N240K390K37j449k820l666l932l897l648l038
$$ plain form
59005 647443 645243 643819 643380 644713 648398 654050 660791 668101 675667 682898 689331 695173 700738 705616
58991 705616 709194 711695 713811 715377 715393 713479 710501 707496 704688 701845 699047 696676 694944 693772 693050
58976 693050 692993 694326 697939 704034 711692 719618 727253 734926 743179 752300 762234 772479 782257 791266
58962 791266 800105 809461 819033 827795 835051 840610 844081 844771 842312 836736 827896 815535 800129 783050
58948 783050 765620 748414 731630 715592 700589 686645 673814 662525 653433 646911 642642 639568
58936 639568 636433 632712 628942 625917 623846 622592 622293 623036 624133 624484 623746 622546 621525 620705 619804 618561
58920 618561 616746 614478 612591 611974 612373 612478 611408 609562 607848 606742 606456 607364 609736 613367 617917
58905 617917 623393 630100 638417 648738 661245 675401 690007 704085 717550 730900 744545 758668
$$ packed form
59005F47443k200j424m39J333L685N652O741P310P566P231O433N842N565M878
58991G05616L578K501K116J566J6j914k978l005k808k843k798k371j732j172p22
58976F93050n7J333L613O095P658P926P635P673Q253R121R934J0245R778R009
58962G91266Q839R356R572Q762P256N559L471O90k459n576q840j2361j5406j7079
58948G83050j7430j7206j6784j6038j5003j3944j2831j1289r092o522m269l074
58936F39568l135l721l770l025k071j254k99P43J097L51p38j200j021q20r01j243
58920F18561j815k268j887o17L99J05j070j846j714j106k86R08K372L631M550
58905F17917N476O707Q317J0321J2507J4156J4606J4078J3465J3350J3645J4123
$$ plain form
58893 758668 773461 789183 806106 824539 844797 867070 891405 917634 944986 971804 996084
58882 996084 1016502 1032757 1045051 1053585 1058445 1059424 1055899 1047335 1034078 1017255 997976 977106 955847
58869 955847 935758 917822 901915 887547 874699 863629 854231 845982 838290 830585 822299 813092 803033
58856 803033 792427 781598 770887 760615 750893 741681 733133 725671 719525 714323 709180 703173 695888
58843 695888 687731 679555 671695 663497 654122 643613 632758 622179 612232 603595 597049 592472 588782
58830 588782 585197 581951 579521 577833 576692 576425 577474 579670 582427 585461 588861 592580 596330 600027
58816 600027 604055 608924 614662 620527 625461 628926 631215 632798 633681 633699 633068 632052 630314 627336 623455
58801 623455 619656 616214 612249 606913 600380 593399 586522 580117 574563 569938 565933 562382 559478 557284
$$ packed form
58893G58668J4793J5722J6923J8433K0258K2273K4335K6229K7352K6818K4280
58882I96084K0418J6255J2294Q534M860R79l525q564j3257j6823j9279k0870k1259
58869I55847k0089j7936j5907j4368j2848j1070r398q249p692p705q286r207j0059
58856H03033j0606j0829j0711j0272r722r212q548p462o146n202n143o007p285
58843F95888q157q176p860q198r375j0509j0855j0579r947q637o546m577l690
58830E88782l585l246k430j688j141k67J049K196K757L034L400L719L750L697
58816F00027M028M869N738N865M934L465K289J583Q83J8o31j016j738k978l881
58801F23455l799l442l965n336o533o981o877o405n554m625m005l551k904k194
$$ plain form
58787 557284 555623 554774 555597 558407 562215 565709 568664 571850 575857 580559 585539 590449 594964 598789 601702
58772 601702 603327 603022 600298 595323 588807 581483 573911 566626 560197 555036 551204 548348 545940 543742
58758 543742 542002 541004 540619 540634 541284 542950 545388 547804 549676 550962 551571 551381 550867 550991 552216 554261
58742 554261 556930 560422 564587 568720 572464 576204 580143 583839 587185 591073 596347 602701 609313 615985
58728 615985 622906 629794 636141 642036 648036 654440 661264 668604 676395 684109 691389 698753 706996 716135
58714 716135 725629 735385 745711 756236 765629 772607 776819 778612 778351 776042 771335 763809 753391 740398
58700 740398 725125 707713 688604 668700 648763 629092 610116 592740 577553 564139 551848
58689 551848 540824 531548 523732 516597 510101 504953 501285 498089 494254 489594 484653 480025 476139 473339
$$ packed form
58787E57284j661q49Q23K810L808L494K955L186M007M702M980M910M515L825K913
58772F01702J625l05k724m975o516p324p572p285o429n161l832k856k408k198
58758E43742j740r98l85J5O50J666K438K416J872J286O09j90n14J24J225K045
58742E54261K669L492M165M133L744L740L939L696L346L888N274O354O612O672
58728F15985O921O888O347N895O000O404O824P340P791P714P280P364Q243R139
58714G16135R494R756J0326J0525R393O978M212J793k61k309m707p526j0418j2993
58700G40398j5273j7412j9109j9904j9937j9671j8976j7376j5187j3414j2291
58689E51848j1024r276p816p135o496n148l668l196l835m660m941m628l886k800
$$ plain form
58675 473339 471853 471761 473048 475523 478765 482414 486514 491450 497679 505747 516319 529721 545378 561823
58661 561823 577131 589323 596909 599640 598629 595308 590338 583764 575914 567585 559435 551645 544141 536848
58647 536848 529810 523448 518513 515342 513312 511485 509730 508772 509169 510704 512799 515133 517732 520697 523946
58632 523946 527140 529897 532147 534035 535378 535617 534599 533074 532001 531610 531546 531652 532176 533467 535934 540112
58616 540112 546195 553575 561315 569019 576848 584751 592072 597872 601365 602267 601127 599206 597542 596190
58602 596190 594589 592466 589935 586991 583464 579434 575260 571245 567586 564524 562169 560352 559089 558985
58588 558985 560723 564240 568960 574723 581991 591075 601635 612958 624362 635293 645413 654701 663241
58575 663241 670915 677506 683027 687868 692842 699300 708795 722150 738942 758246 779709 803586 829987
$$ packed form
58675D73339j486r2J287K475L242L649M100M936O229Q068J0572J3402J5657J6445
58661E61823J5308J2192P586K731j011l321m970o574p850q329q150p790p504p293
58647E36848p038o362m935l171k030j827j755r58L97J535K095K334K599K965L249
58632E23946L194K757K250J888J343K39j018j525j073l91o4J06N24J291K467M178
58616E40112O083P380P740P704P829P903P321N800L493R02j140j921j664j352
58602E96190j601k123k531k944l527m030m174m015l659l062k355j817j263j04
58588E58985J738L517M720N763P268R084J0560J1323J1404J0931J0120R288Q540
58575F63241P674O591N521M841M974O458R495J3355J6792J9304K1463K3877K6401
$$ plain form
58562 829987 858554 888715 919768 950692 980083 1006279 1027566 1042727 1051734 1055629 1055448 1051653
58550 1051653 1044857 1036559 1028570 1021910 1016568 1011849 1006586 999553 990266 978999 965624 949130 928983
58537 928983 906348 883155 860436 838428 817778 799497 783950 770899 760388 752597 746943 742362
58525 742362 738558 736075 735087 734976 735173 735555 735915 735905 735670 735698 735804 734983 732548 728802 724414 719778 715176
58508 715176 710969 707269 703812 700303 696559 692393 687888 683701 680477 677965 675294 672120 668883 665974
58494 665974 663406 661383 660380 660366 660620 660700 661181 663138 667237 673468 681459 690890 701812 714566 729238
58479 729238 745372 762463 780319 798464 815556 829996 840910 847991 850827 849184 843710 835521
58467 835521 825214 813088 800173 788123 778060 770220 764666 761507 760548 761612 765310 772617 783538
$$ packed form
58562H29987K8567L0161L1053L0924K9391K6196K1287J5161R007L895j81l795
58550A051653o796q298p989o660n342m719n263p033r287j1267j3375j6494k0147
58537I28983k2635k3193k2719k2008k0650j8281j5547j3051j0511p791n654m581
58525G42362l804k483r88j11J97L82L60j0k35K8J06q21k435l746m388m636m602
58508G15176m207l700l457l509l744m166m505m187l224k512k671l174l237k909
58494F65974k568k023j003j4K54Q0M81J957M099O231P991R431J0922J2754J4672
58479G29238J6134J7091J7856J8145J7092J4440J0914P081K836j643n474q189
58467H35521j0307j2126j2915j2050j0063p840n554l159r59J064L698P307J0921
$$ plain form
58454 783538 796835 811150 825655 839532 851573 860508 865303 865261 860506 852224 841802 829894 817010
58441 817010 804592 794390 786881 781264 776905 773703 771164 768487 765897 764793 766180 769875 775567 783600
58427 783600 794227 806866 820578 834631 848268 860512 870553 877901 882097 882902 880797 876645 870783
58414 870783 863067 853741 843513 832815 821748 810706 800248 790400 780897 772091 764743 758983 754293
58401 754293 750469 747704 745902 744850 744945 746751 749934 753618 757546 761811 765768 768540 770468 772658 775165
58386 775165 777072 778342 780056 782701 785696 788818 792618 797165 801851 806630 812036 817731 822644 826824
58372 826824 831530 837105 842416 846960 851876 858227 865782 874188 883881 895099 907266 919993 933411
58359 933411 947037 959614 970559 980224 988429 994316 998047 1000881 1003090 1003585 1002237 1000662 999901 999239
$$ packed form
58454G83538J3297J4315J4505J3877J2041Q935M795m2m755q282j0422j1908j2884
58441H17010j2418j0202p509n617m359l202k539k677k590j104J387L695N692Q033
58427G83600J0627J2639J3712J4053J3637J2244J0041P348M196Q05k105m152n862
58414H70783p716r326j0228j0698j1067j1042j0458r848r503q806p348n760m690
58401G54293l824k765j802j052R5J806L183L684L928M265L957K772J928K190K507
58386G75165J907J270J714K645K995L122L800M547M686M779N406N695M913M180
58372H26824M706N575N311M544M916O351P555Q406R693J1218J2167J2727J3418
58359I33411J3626J2577J0945R665Q205N887L731K834K209M95j348j575p61o62
$$ plain form
58345 999239 998288 998421 1001022 1005980 1012938 1022286 1033795 1046009 1058263 1071722 1087233 1103749 1120093
58332 1120093 1136566 1153468 1169627 1183901 1196662 1208301 1217707 1223794 1227347 1229880 1231751 1232704 1233176
58319 1233176 1233853 1235013 1237206 1241262 1246760 1252101 1257075 1263578 1272650 1282759 1292395 1302353 1313802 1326018
58305 1326018 1337971 1350475 1364776 1380457 1396538 1413265 1430968 1448544 1464894 1480611 1496617
58294 1496617 1512597 1528398 1545369 1564468 1584617 1604748 1625934 1649557 1674906 1700480 1726146
58283 1726146 1752124 1777484 1801706 1826164 1852143 1879020 1906302 1935511 1967866 2001956 2036057
58272 2036057 2070906 2107826 2146000 2184213 2223484 2265360 2309339 2354576 2402294 2453782 2507809
58261 2507809 2562835 2619820 2679952 2741528 2802268 2862847 2924989 2988041 3050863 3115176 3183386
$$ packed form
58345I99239r51J33K601M958O958R348J1509J2214J2254J3459J5511J6516J6344
58332A120093J6473J6902J6159J4274J2761J1639R406O087L553K533J871R53M72
58319A233176O77J160K193M056N498N341M974O503R072J0109R636R958J1449J2216
58305A326018J1953J2504J4301J5681J6081J6727J7703J7576J6350J5717J6006
58294A496617J5980J5801J6971J9099K0149K0131K1186K3623K5349K5574K5666
58283A726146K5978K5360K4222K4458K5979K6877K7282K9209L2355L4090L4101
58272B036057L4849L6920L8174L8213L9271M1876M3979M5237M7718N1488N4027
58261B507809N5026N6985O0132O1576O0740O0579O2142O3052O2822O4313O8210
$$ plain form
58250 3183386 3254732 3327225 3401741 3480553 3563500 3649410 3739661 3836411 3938849 4045092 4156244
58239 4156244 4274665 4399897 4530408 4667690 4814480 4970545 5134477 5307880 5493616
58230 5493616 5691852 5902287 6128128 6373170 6637162 6918899 7221363 7548715 7901035
58221 7901035 8277853 8684038 9126167 9606048 10124531 10688688 11308214 11988069 12732593
58212 12732593 13553903 14468204 15487381 16623293 17896876 19333470 20953410 22778903
58204 22778903 24847936 27212637 29932232 33085133 36787954 41194307 46489284 52912625
58196 52912625 60792239 70548292 82687312 97826307 116705038 140111917 168750635
58189 168750635 203102362 243154483 287795853 334077547 377063921 410866422 430547923
$$ packed form
58250C183386P1346P2493P4516P8812Q2947Q5910R0251R6750J02438J06243J11152
58239D156244J18421J25232J30511J37282J46790J56065J63932J73403J85736
58230E493616J98236K10435K25841K45042K63992K81737L02464L27352L52320
58221G901035L76818M06185M42129M79881N18483N64157O19526O79855P44524
58212A2732593Q21310R14301J019177J135912J273583J436594J619940J825493
58204B2778903K069033K364701K719595L152901L702821M406353N294977O423341
58196E2912625P879614R756053J2139020J5138995J8878731K3406879K8638718
58189A68750635L4351727M0052121M4641370M6281694M2986374L3802501J9681501
$$ plain form
58182 430547923 433799343 421451501 396756227 364061210 327565700 290541711 255103089
58175 255103089 222388659 192900996 166779132 143948368 124205342 107278888 92862643
58168 92862643 80629762 70257095 61455134 53977287 47610193 42170394 37509522 33508962
58160 33508962 30065161 27085330 24493949 22232170 20248772 18498019 16945100 15565122
58152 15565122 14335393 13234225 12246298 11362014 10570698 9859648 9219362 8643880 8125924
58143 8125924 7656818 7230848 6844381 6490751 6161096 5850426 5558336 5283978 5024958
58134 5024958 4781002 4553828 4342894 4145324 3960133 3788397 3629118 3479011 3336763
58125 3336763 3203692 3079828 2962973 2852038 2747850 2650269 2557744 2470146 2388876 2313825
$$ packed form
58182D30547923L251420j2347842k4695274l2695017l6495510l7023989l5438622
58175B55103089l2714430k9487663k6121864k2830764j9743026j6926454j4416245
58168I2862643j2232881j0372667q801961p477847o367094n439799m660872m000560
58160C3508962l443801k979831k591381k261779j983398j750753j552919j379978
58152A5565122j229729j101168r87927q84284p91316p11050o40286n75482n17956
58143H125924m69106m25970l86467l53630l29655l10670k92090k74358k59020
58134E024958k43956k27174k10934j97570j85191j71736j59279j50107j42248
58125C336763j33071j23864j16855j10935j04188r7581r2525q7598q1270p5051
$$ plain form
58115 2313825 2243172 2176410 2114585 2057269 2002214 1948334 1896304 1846016 1796228 1746979 1699610
58104 1699610 1654102 1608969 1564090 1521107 1480778 1442358 1405766 1371819 1340117 1309183 1279027
58093 1279027 1251162 1225840 1201638 1177944 1155451 1133967 1112280 1090553 1070392 1052008 1033678
58082 1033678 1014542 995639 977575 959422 940670 922178 904424 886704 868752 851414 835124
58071 835124 819409 804393 791023 779281 767899 756352 745491 735774 726548 717525 709284 701896
58059 701896 694633 687342 680409 673096 663849 652772 641970 632796 624442 615831 607138 598762 590537 582815
58045 582815 576726 572400 568190 562479 555173 546900 538072 529329 521591 515023 508985 503359 498642 494463
58031 494463 489449 483098 476390 470071 463778 457274 451029 444946 438023 430012 422075 415172 409138 403872
$$ packed form
58115B313825p0653o6762o1825n7316n5055n3880n2030n0288m9788m9249m7369
58104A699610m5508m5133m4879m2983m0329l8420l6592l3947l1702l0934l0156
58093A279027k7865k5322k4202k3694k2493k1484k1687k1727k0161j8384j8330
58082A033678j9136j8903j8064j8153j8752j8492j7754j7720j7952j7338j6290
58071H35124j5715j5016j3370j1742j1382j1547j0861r717r226r023q241p388
58059G01896p263p291o933p313r247j1077j0802r174q354q611q693q376q225p722
58045E82815o089m326m210n711p306q273q828q743p738o568o038n626m717m179
58031D94463n014o351o708o319o293o504o245o083o923q011p937o903o034n266
$$ plain form
58017 403872 399856 396725 392944 387892 382897 379249 376565 374178 372667 372658 373225 372952 371836 370874 370424 370101
58001 370101 369801 369710 369688 369492 369344 369678 370727 372761 376016 379860 382740 383663 383166 382349 381631 380995 380624 380504
57983 380504 379926 378149 375213 371640 367748 363630 359350 354894 350455 346881 345062 344631 344124 342738 341119
57968 341119 340109 339719 339743 340370 341593 342875 343917 344936 345761 345710 344918 344644 345413 345865 344425 341292 337801
57951 337801 334557 331287 327994 325158 323039 321587 320849 320823 321207 321855 323172 325638 329293 334020 339789
57936 339789 346325 353218 360753 369788 380193 390238 398276 404289 408957 411926 412117 409411 405022 400259
57922 400259 395584 390707 385103 378609 371932 366271 362083 358672 355334 352370 350525 350024 350732 352662 355634
57907 355634 358966 362098 365077 367838 369623 369834 368933 367709 366098 363504 359944 356074 352360 348914 345881
$$ packed form
58017D03872m016l131l781n052m995l648k684k387j511rN67k73j116r62m50l23
58001C70101l00r1k2j96j48L34J049K034L255L844K880R23m97q17p18o36l71j20
57983C80504n78j777k936l573l892m118m280m456m439l574j819m31n07j386j619
57968C41119j010l90K4O27J223J282J042J019Q25n1p92k74P69M52j440l133l491
57951C37801l244l270l293k836k119j452p38k6L84O48J317K466L655M727N769
57936C39789O536O893P535R035J0405J0045Q038O013M668K969J91k706m389m763
57922D00259m675m877n604o494o677n661m188l411l338k964j845n01P08J930K972
57907C55634L332L132K979K761J785K11r01j224j611k594l560l870l714l446l033
$$ plain form
57892 345881 343262 340585 337480 334380 332078 330750 329903 329042 327860 326061 323634 321068 318794 316658 314327
57877 314327 311838 309221 306079 302225 298354 295374 293325 291677 290366 289756 289804 290084 290610 291933 294365
57862 294365 297656 301473 305744 310533 315991 322332 329474 336878 343958 350414 355876 359799 362202 363978
57848 363978 365734 366725 365755 362834 359050 355000 350336 344912 339426 334548 330085 325360 320067 314501 309245
57833 309245 304796 301226 298108 294966 291747 288713 286051 283890 282461 281779 281276 280336 279267 279303 281365
57818 281365 284931 288225 289514 288302 285346 281532 276934 271252 264908 258977 253903 249007 243643 238174
57804 238174 233294 228993 224901 221239 218670 217352 216749 216371 216205 216506 217491 219176 221265 223436 225844
57789 225844 229051 233232 237932 242798 247936 253247 258160 262601 267518 273731 280776 287639 294143 300790
$$ packed form
57892C45881k619k677l105l100k302j328q47q61j182j799k427k566k274k136k331
57877C14327k489k617l142l854l871k980k049j648j311o10M8K80N26J323K432
57862B94365L291L817M271M789N458O341P142P404P080O456N462L923K403J776
57848C63978J756R91r70k921l784m050m664n424n486m878m463m725n293n566n256
57833C09245m449l570l118l142l219l034k662k161j429o82n03r40j069L6K062
57818B81365L566L294J289j212k956l814m598n682o344n931n074m896n364n469
57804B38174m880m301m092l662k569j318o03l78j66L01R85J685K089K171K408
57789B25844L207M181M700M866N138N311M913M441M917O213P045O863O504O647
$$ plain form
57775 300790 307667 314273 320102 324643 327241 327747 326985 325708 323463 319403 313858 308065 302648 297453 292672
57760 292672 288845 285625 281791 276872 271842 267844 264969 262604 260254 257731 255164 253101 252055 251772
57746 251772 251549 251365 252010 253869 256265 258300 259827 261344 263368 266096 269219 272010 274079 276043 278875
57731 278875 282547 286008 288536 290401 292033 293332 294137 294649 294976 294779 293764 292049 289777 286860 283340
57716 283340 279499 275318 270378 264655 258886 253756 249141 244531 239795 235126 230534 225843 220999 216134
57702 216134 211518 207594 204772 202957 201536 199981 198238 196441 194660 193073 191917 190987 189533 186978
57688 186978 183576 180121 177259 175218 173978 173406 173375 173868 174926 176577 179049 182950 188915 197159 207775
57673 207775 221339 238758 260490 286519 317067 352636 392832 435349 476108 510068 532165
$$ packed form
57775C00790O877O606N829M541K598N06p62j277k245m060n545n793n417n195m781
57760B92672l827l220l834m919n030l998k875k365k350k523k567k063j046k83
57746B51772k23j84O45J859K396K035J527J517K024K728L123K791K069J964K832
57731B78875L672L461K528J865J632J299Q05N12L27j97j015j715k272k917l520
57716B83340l841m181m940n723n769n130m615m610m736m669m592m691m844m865
57702B16134m616l924k822j815j421j555j743j797j781j587j156r30j454k555
57688A86978l402l455k862k041j240n72l1M93J058J651K472L901N965Q244J0616
57673B07775J3564J7419K1732K6029L0548L5569M0196M2517M0759L3960K2097
$$ plain form
57662 532165 538724 529177 506566 476030 442446 408997 377140 347437 320498 297220 278054 262320
57650 262320 248739 236714 226567 218470 211774 205684 200118 195503 192038 189464 187359 185379 183344
57637 183344 181306 179485 178112 177400 177494 178232 179096 179688 180126 180638 181033 180962 180412 179389 177454 174338 170862
57620 170862 168281 166718 165152 163099 161360 160760 161059 161584 162214 163112 164072 164689 164884 164800 164507 164063 163530
57603 163530 162727 161405 159789 158408 157236 155611 153304 150990 149250 147684 145448 142208 138205 133887
57589 133887 129858 126688 124366 122306 120199 118368 117032 115819 114401 113016 111969 111178 110608 110554 110947
57574 110947 110922 109685 107425 104926 102697 100849 99333 97859 96056 94177 93091 93142 93564 93474 92841 91982
57558 91982 90814 89342 88246 88146 88708 89201 89553 90209 91387 93147 95685 98822 101664 103476 104514 105323
$$ packed form
57662E32165O559r547k2611l0536l3584l3449l1857k9703k6939k3278j9166j5734
57650B62320j3581j2025j0147q097o696o090n566m615l465k574k105j980k035
57637A83344k038j821j373p12R4P38Q64N92M38N12L95p1n50j023j935l116l476
57620A70862k581j563j566k053j739o00K99N25O30Q98R60O17J95q4k93m44n33
57603A63530q03j322j616j381j172j625k307k314j740j566k236l240m003m318
57589A33887m029l170k322k060k107j831j336j213j418j385j047p91n70n4L93
57574A10947k5j237k260k499k229j848j516j474j803j879j086N1M22r0o33q59
57558I1982j168j472j096j00N62M93L52O56J178J760K538L137K842J812J038Q09
$$ plain form
57542 105323 105827 105956 106581 108692 111958 115106 117446 119075 119987 120155 120281 121153 122215 121990 120118 117894
57526 117894 116519 115819 115052 114021 112874 111527 109893 108227 106826 105700 104752 103953 103269 102774 102795 103469
57510 103469 104202 104228 103686 103535 104335 105761 107336 108882 110087 110411 109830 109093 108856 108936 108642 107448 105235
57493 105235 102387 99817 98347 97846 97418 96572 95718 95368 95458 95636 95678 95308 94244 92747 91664 91564 92188
57476 92188 92961 93546 93661 92994 91784 91000 91303 92141 92402 91746 90749 89892 88978 87569 85524 82957 80065
57459 80065 77242 75216 74699 75727 77400 78456 78180 76745 74768 72805 71373 71034 71975 73613 74959
57444 74959 75463 75406 75593 76763 78981 81350 82572 82246 81348 81089 81521 81792 81450 80814 80194 79550 79020 79069
57426 79069 79814 80725 81329 81804 82551 83405 83639 82741 81142 80068 80390 81582 82169 81466 80398 80196 80828 81354
$$ packed form
57542A05323N04J29O25K111L266L148K340J629R12J68J26Q72J062k25j872k224
57526A17894j375p00p67j031j147j347j634j666j401j126r48p99o84m95K1O74
57510A03469P33K6n42j51Q00J426J575J546J205L24n81p37k37Q0k94j194k213
57493A05235k848k570j470n01m28q46q54l50R0J78M2l70j064j497j083j00O24
57476I2188P73N85J15o67j210p84L03Q38K61o56r97q57r14j409k045k567k892
57459H0065k823k026n17J028J673J056k76j435j977j963j432l39R41J638J346
57444G4959N04n7J87J170K218K369J222l26q98k59M32K71l42o36o20o44n30M9
57426G9069P45R11O04M75P47Q54K34q98j599j074L22J192N87p03j068k02O32N26
$$ plain form
57408 81354 81378 81284 81267 81121 80961 81252 81932 82247 81636 80224 78450 76863 76223 76890 78073 78561 78421 79063 81325
57389 81325 84360 86761 88026 88496 88683 89195 90609 92829 95051 96783 98360 100083 101571 102439 102934 103249
57373 103249 102794 100931 98017 95029 92491 90395 88901 88355 88689 89337 89817 90085 90397 91090 92323 93793
57357 93793 94853 95134 94927 94793 95007 95435 95772 95796 95625 95681 96113 96491 96529 96872 98312 100339 101447 101049 100130
57338 100130 99684 99547 99225 98877 98738 98439 97714 97068 96941 96842 96186 95419 95352 95824 95966 95487 94781 94009 93015
57319 93015 92087 91903 92643 93805 94964 96103 97154 97777 97795 97519 97507 98181 99550 101102 102172 102664 103231
57302 103231 104537 106569 108851 110983 112725 113938 114715 115242 115417 115071 114714 115344 117194 119379 121198 123019
57286 123019 125337 127831 130115 132721 136393 140877 145258 148993 151862 153413 153481 152827 152339 151842 150549
$$ packed form
57408H1354K4r4j7j46j60K91O80L15o11j412j774j587o40O67J183M88j40O42K262
57389H1325L035K401J265M70J87N12J414K220K222J732J577J723J488Q68M95L15
57373A03249m55j863k914k988k538k096j494n46L34O48M80K68L12O93J233J470
57357I3793J060K81k07j34K14M28L37K4j71N6M32L78L8L43J440K027J108l98r19
57338A00130m46j37l22l48j39k99p25o46j27r9o56p67o7M72J42m79p06p72r94
57319I3015r28j84P40J162J159J139J051O23J8k76j2O74J369J552J070M92N67
57302A03231J306K032K282K132J742J213P77N27J75l46l57O30J850K185J819J821
57286A23019K318K494K284K606L672M484M381L735K869J551O8o54m88m97j293
$$ plain form
57271 150549 148355 145793 143065 140063 137083 134498 131963 128935 125793 123429 121854 120338 118789 117869
57257 117869 117656 117385 116767 116507 117179 118538 120281 122598 125440 128019 129597 130307 130765 131299 131932 132763 133967
57240 133967 135534 137181 138524 139502 140741 143093 146423 149313 150607 150897 151771 153875 156585 159356 162351
57225 162351 165630 168727 171411 174206 177785 182192 186806 190769 193566 195583 197929 201294 205248 209122
57211 209122 213136 217917 223323 228669 233840 239239 244868 250532 256827 264807 274553 284975 295068 304521
57197 304521 313218 321252 329489 339013 349811 360935 371998 383475 395497 407627 420082 433908
57185 433908 449382 465304 480501 495195 510346 526425 543318 560697 577940 594328 609877
57174 609877 625556 642323 660253 678632 696363 712347 726190 738658 750950 763703 777237
$$ packed form
57271A50549k194k562k728l002k980k585k535l028l142k364j575j516j549r20
57257A17869k13k71o18k60O72J359J743K317K842K579J578P10M58N34O33Q31J204
57240A33967J567J647J343R78J239K352L330K890J294K90Q74K104K710K771K995
57225A62351L279L097K684K795L579M407M614L963K797K017K346L365L954L874
57211B09122M014M781N406N346N171N399N629N664O295P980R746J0422J0093R453
57197C04521Q697Q034Q237R524J0798J1124J1063J1477J2022J2130J2455J3826
57185D33908J5474J5922J5197J4694J5151J6079J6893J7379J7243J6388J5549
57174F09877J5679J6767J7930J8379J7731J5984J3843J2468J2292J2753J3534
$$ plain form
57163 777237 792263 809238 827341 845372 863584 883394 905338 928579 952398 976734 1001220
57152 1001220 1025191 1048934 1073546 1099306 1125538 1152158 1179807 1208260 1236429 1264329 1293292
57141 1293292 1323750 1354523 1384959 1415991 1448300 1481125 1513817 1547055 1581620 1617370 1654255
57130 1654255 1692906 1733498 1775534 1819415 1866631 1917764 1972048 2029587 2092079 2160607 2234803
57119 2234803 2315112 2403611 2501458 2607792 2722483 2847806 2986182 3138571 3306561 3493664
57109 3493664 3703020 3936291 4196523 4489768 4822601 5201137 5634621 6137336 6725687
57100 6725687 7417645 8238163 9222292 10411096 11848965 13587815 15688402 18211798 21211112
57091 21211112 24731497 28808200 33455229 38657986 44379080 50561558 57120132 63942389
$$ packed form
57163G77237J5026J6975J8103J8031J8212J9810K1944K3241K3819K4336K4486
57152A001220K3971K3743K4612K5760K6232K6620K7649K8453K8169K7900K8963
57141A293292L0458L0773L0436L1032L2309L2825L2692L3238L4565L5750L6885
57130A654255L8651M0592M2036M3881M7216N1133N4284N7539O2492O8528P4196
57119B234803Q0309Q8499R7847J06334J14691J25323J38376J52389J67990J87103
57109C493664K09356K33271K60232K93245L32833L78536M33484N02715N88351
57100F725687O91958Q20518R84129J188804J437869J738850K100587K523396K999314
57091B1211112L520385M076703M647029N202757N721094O182478O558574O822257
$$ plain form
57083 63942389 70907218 77870941 84584269 90614859 95407648 98493784 99685719 99098476
57075 99098476 97016382 93752243 89590077 84782901 79551010 74075718 68503655 62954820
57067 62954820 57523312 52278921 47277651 42570114 38197309 34182997 30534839 27249901
57059 27249901 24315598 21709381 19403535 17370797 15584276 14015404 12636102 11422300
57051 11422300 10353277 9409332 8572713 7829724 7169641 6582365 6058800 5592210 5177127
57042 5177127 4807524 4477483 4182692 3919778 3685014 3474969 3287717 3122205 2977222
57033 2977222 2851970 2746722 2661965 2597749 2554401 2531927 2526605 2528637 2524587 2502390 2454589
57022 2454589 2379451 2281348 2169311 2052952 1938779 1830010 1728266 1634110 1547005 1466460
$$ packed form
57083F3942389O964829O963723O713328O030590M792789L086136J191935n87243
57075I9098476k082094l264139m162166m807176n231891n475292n572063n548835
57067F2954820n431508n244391n001270m707537m372805m014312l648158l284938
57059B7249901k934303k606217k305846k032738j786521j568872j379302j213802
57051A1422300j069023r43945q36619p42989o60083n87276n23565m66590m15083
57042E177127l69603l30041k94791k62914k34764k10045j87252j65512j44983
57033B977222j25252j05248q4757o4216m3348k2474n322K032m050k2197m7801
57022B454589p5138r8103j12037j16359j14173j08769j01744r4156q7105q0545
$$ plain form
57012 1466460 1393046 1327385 1268783 1215859 1167865 1124358 1084276 1046595 1011360 978899 948494
57001 948494 918984 890316 863401 838719 816108 795488 776808 759640 743897 730568 720691 713970
56989 713970 709476 707323 708469 713183 720930 731468 744500 758102 768787 773553 771177 761668 745760
56976 745760 725176 702280 678896 656027 634590 615423 598443 582902 568815 557189 548596 542590
56964 542590 539029 538902 543157 551580 563669 579911 601131 626657 653634 677911 695291 702625 698866
56951 698866 685422 665176 640951 614830 588424 563142 540090 519944 502957 489050 477989
56940 477989 469714 464511 462934 465635 473239 486231 504971 529881 561211 597987 636890 672509
56928 672509 699061 712359 710937 696223 671696 641243 607760 573102 538871 506506 476603 448915
$$ packed form
57012A466460p3414o5661n8602n2924m7994m3507m0082l7681l5235l2461l0405
57001I48494k9510k8668k6915k4682k2611k0620j8680j7168j5743j3329r877o721
56989G13970m494k153J146M714P747J0538J3032J3602J0685M766k376r509j5908
56976G45760k0584k2896k3384k2869k1437j9167j6980j5541j4087j1626q593o006
56964E42590l561j27M255Q423J2089J6242K1220K5526K6977K4277J7380P334l759
56951F98866j3444k0246k4225k6121k6406k5282k3052k0146j6987j3907j1061
56940D77989q275n203j577K701P604J2992J8740K4910L1330L6776L8903L5619
56928F72509K6552J3298j422j4714k4527l0453l3483l4658l4231l2365k9903k7688
$$ plain form
56916 448915 423332 400369 380433 363129 347701 333826 321608 311086 302113 294505 288070 282673
56904 282673 278441 275640 274169 273492 273248 273589 274707 276519 279165 283382 289849 298526 309180 322376
56890 322376 339281 360551 385913 414769 446465 479533 511010 536960 553937 560284 556571 545118
56878 545118 528989 510945 492847 475621 459664 445429 433690 425260 420554 419762 423476 432798 448708
56865 448708 471696 502207 541097 589288 647001 713110 784356 854523 915018 957633 977700
56854 977700 975086 952951 916267 870985 823007 776739 734416 696918 664929 639312 620830 610032
56842 610032 607500 614151 631338 660659 703582 761292 834847 924859 1030051 1145438 1261652
56831 1261652 1366009 1444916 1487278 1488271 1451341 1386365 1304943 1216493 1127410 1042019 963237
$$ packed form
56916D48915k5583k2963j9936j7304j5428j3875j2218j0522q973p608o435n397
56904B82673m232k801j471o77k44L41J118J812K646M217O467Q677J0654J3196
56890C22376J6905K1270K5362K8856L1696L3068L1477K5950J6977O347l713j1453
56878E45118j6129j8044j8098j7226j5957j4235j1739q430m706p92L714R322J5910
56865D48708K2988L0511L8890M8191N7713O6109P1246P0167O0495M2615K0067
56854I77700k614k2135l6684m5282m7978m6268m2323l7498l1989k5617j8482j0798
56842F10032k532O651J7187K9321M2923N7710P3555R0012J05192J15387J16214
56831A261652J04357P8907M2362R93l6930o4976q1422q8450q9083q5391p8782
$$ plain form
56820 963237 892801 831751 780810 740102 709051 687354 676071 677189 692086 720927 763501 819864
56808 819864 889402 969012 1052025 1128616 1187732 1220117 1221369 1193205 1142035 1075987 1002533 927601
56796 927601 855480 788795 728724 675724 630125 592033 561115 537134 520659 512666 513330 521892
56784 521892 538115 563050 597403 639177 683462 724302 756184 774371 775619 759647 729494 689848
56772 689848 645174 599205 554917 513844 475779 440040 406979 377753 352940 332138 314714
56761 314714 300141 287548 275797 264328 253539 244092 236267 230009 225081 220902 216717 212286 208098
56748 208098 204657 201849 199255 196783 194666 193044 191836 190917 190170 189469 188829 188433 188319 188149 187480 186256
56732 186256 184874 183838 183428 183570 183855 183809 183325 182778 182581 182754 183111 183713 184817 186413 188119 189639 191042
$$ packed form
56820I63237p0436o1050n0941m0708l1051k1697j1283J118J4897K8841M2574N6363
56808H19864O9538P9610Q3013P6591N9116L2385J252k8164n1170o6048p3454p4932
56796I27601p2121o6685o0071n3000m5599l8092l0918k3981j6475p993O64Q562
56784E21892J6223K4935L4353M1774M4285M0840L1882J8187J248j5972l0153l9646
56772F89848m4674m5969m4288m1073l8065l5739l3061k9226k4813k0802j7424
56761C14714j4573j2593j1751j1469j0789r447p825o258m928m179m185m431m188
56748B08098l441k808k594k472k117j622j208r19p47p01o40l96j14j70o69j224
56732A86256j382j036m10J42K85m6m84n47j97J73L57O02J104J596J706J520J403
$$ plain form
56715 191042 192451 193633 194147 193818 192935 191988 191341 191112 191221 191498 191832 192239 192770 193382 193978 194496 194830 194700
56697 194700 193844 192401 190904 189773 188988 188378 187968 187794 187605 187167 186723 186721 187063 187141 186793 186713 187560 188991 190041
56678 190041 190325 190442 191174 192640 194336 195733 196701 197462 198326 199488 201066 203285 206509 210919 216125 221203
56662 221203 225322 228473 231506 235220 239369 242862 245121 246892 249313 252435 255216 256869 257545 257620 257090
56647 257090 256005 254896 254173 253413 251802 249080 245652 242034 238588 235580 232977 230312 227156 223690 220434
56632 220434 217559 214865 212328 210219 208631 207242 205625 203543 200955 197962 194841 192018 189995 189198
56618 189198 189571 190277 190259 189295 188172 187585 187436 187454 187833 188595 188998 188409 187364 186863 186903 186670 185991 185521 185509
56599 185509 185445 185133 185084 185529 185947 186031 186302 187194 188247 188834 189164 189912 191185 192473 193413 194107 194827 195759 196941
$$ packed form
56715A91042J409J182N14l29q83r47o47k29J09K77L34M07N31O12N96N18L34j30
56697A94700q56j443j497j131p85o10m10j74j89m38m44kL42P8l48q0Q47J431J050
56678A90041K84J17P32J466J696J397R68P61Q64J162J578K219L224M410N206N078
56662B21203M119L151L033L714M149L493K259J771K421L122K781J653O76P5n30
56647B57090j085j109p23p60j611k722l428l618l446l008k603k665l156l466l256
56632B20434k875k694k537k109j588j389j617k082k588k993l121k823k023p97
56618A89198L73P06j8r64j123n87j49J8L79P62M03n89j045n01M0k33o79m70j2
56599A85509o4l12m9M45M18Q4K71Q92J053N87L30P48J273J288R40O94P20R32J182
$$ plain form
56580 196941 198165 199029 199319 199273 199388 200080 201485 203364 205220 206772 208296 210214 212502 214934 217772 221635
56564 221635 226710 232709 239622 247794 257142 266941 276531 285549 293303 298791 301809 303426 304900 306645
56550 306645 308525 310456 312211 313246 313294 312659 311533 309594 306776 303793 301304 299068 296541 293768 290999
56535 290999 287896 283938 279340 274894 271110 268102 265976 264582 263105 260690 257468 254432 252377 251408
56521 251408 251251 251402 251062 249592 247154 244551 242463 241064 240114 239055 237343 235268 234188 235274 238078
56506 238078 240893 242445 242758 242472 241988 241395 240732 240065 239450 238815 237880 236417 234710 233322 232146 230308
56490 230308 227476 224721 223336 223228 223265 222871 222393 222127 221894 221623 221491 221435 221232 221101 221492 222236 222643 222592 222744
56471 222744 223494 224408 224968 225215 225315 225127 224623 224238 224320 224590 224542 224156 223884 224049 224510 224863 224866 224694 224755 225156
$$ packed form
56580A96941J224Q64K90m6J15O92J405J879J856J552J524J918K288K432K838L863
56564B21635N075N999O913Q172R348R799R590R018P754N488L018J617J474J745
56550C06645J880J931J755J035M8o35j126j939k818k983k489k236k527k773k769
56535B90999l103l958m598m446l784l008k126j394j477k415l222l036k055r69
56521B51408j57J51l40j470k438k603k088j399r50j059j712k075j080J086K804
56506B38078K815J552L13k86m84n93o63o67o15o35r35j463j707j388j176j838
56490B30308k832k755j385j08L7l94m78k66k33k71j32n6k03j31L91P44M07n1J52
56471B22744P50R14N60K47J00j88n04l85Q2K70m8l86k72J65M61L53Lj72O1M01
$$ plain form
56451 225156 225569 225799 226181 226971 227685 227707 227391 227785 229125 230397 230679 230281 230143 230624 231363 231988 232481 232965
56433 232965 233523 234192 234962 235755 236507 237215 237927 238792 240049 241751 243530 244852 245475 245497 245049 244287 243603 243434
56415 243434 243810 244368 244869 245399 246029 246537 246598 246120 245340 244748 244822 245675 246931 248067 248788 249034 248888 248628 248540
56396 248540 248456 247838 246649 245775 246153 247695 249510 250908 251736 252037 251980 251905 251941 251772 251299 251238 252338 254203
56378 254203 255577 255779 255212 254562 254152 254096 254407 254821 255030 255121 255375 255804 256398 257596 259805 262603 265182 267438
56360 267438 269745 271796 272726 272549 272447 273262 274577 275718 276840 278466 280542 282543 284083 285048 285464 285599
56344 285599 285836 286235 286606 287145 288444 290640 293093 295281 297505 300323 303591 306521 308527 309786 311043
56329 311043 312943 315449 318010 320412 323159 326596 330108 332841 334895 336967 338967 340030 339962 339663 339853
$$ packed form
56451B25156M13K30L82P90P14K2l16L94J340J272K82l98j38M81P39O25M93M84
56433B32965N58O69P70P93P52P08P12Q65J257J702J779J322O23K2m48p62o84j69
56415B43434L76N58N01N30O30N08O1m78p80n92P4Q53J256J136P21K46j46k60q8
56396B48540q4o18j189q74L78J542J815J398Q28L01n7p5L6j69m73o1J100J865
56378B54203J374K02n67o50m10n6L11M14K09R1K54M29N94J198K209K798K579K256
56360B67438K307K051R30j77j02Q15J315J141J122J626K076K001J540R65M16J35
56344B85599K37L99L71N39J299K196K453K188K224K818L268K930K006J259J257
56329C11043J900K506K561K402K747L437L512K733K054K072K000J063o8k99J90
$$ plain form
56314 339853 340336 340884 341946 343922 346375 348521 350023 350980 351662 352642 354660 357933 361971 366304 370880
56299 370880 375575 379921 383714 387331 391070 394617 397512 399771 401818 404239 407742 412784 418997 425452
56285 425452 431703 438034 444600 451006 456990 462846 468856 474985 481513 489273 498746 509389 520329 531331
56271 531331 542772 555106 568686 583697 599951 617062 635060 654521 676100 700391 728163
56260 728163 760079 796086 835818 879694 928897 984220 1045869 1114532 1191687 1278436 1374885
56249 1374885 1480983 1597061 1723002 1857633 1999341 2146558 2297208 2448365 2596820
56240 2596820 2739282 2871821 2990105 3090726 3171554 3230571 3265481 3275108 3260217 3222370 3162948
56229 3162948 3083985 2988964 2881853 2765870 2643651 2517669 2389739 2260990 2133149 2009057
$$ packed form
56314C39853M83N48J062J976K453K146J502R57O82R80K018L273M038M333M576
56299C70880M695M346L793L617L739L547K895K259K047K421L503N042O213O455
56285D25452O251O331O566O406N984N856O010O129O528P760R473J0643J0940J1002
56271E31331J1441J2334J3580J5011J6254J7111J7998J9461K1579K4291K7772
56260G28163L1916L6007L9732M3876M9203N5323O1649O8663P7155Q6749R6449
56249A374885J06098J16078J25941J34631J41708J47217J50650J51157J48455
56240B596820J42462J32539J18284J00621Q0828N9017L4910R627j4891l7847n9422
56229C162948p8963r5021j07111j15983j22219j25982j27930j28749j27841j24092
$$ plain form
56219 2009057 1891106 1779891 1675093 1576849 1485441 1400570 1321956 1249946 1184495 1124263 1067830
56208 1067830 1015325 967855 925756 888326 854771 824457 796578 770639 747100 726750 709577
56197 709577 694809 681713 669768 658457 647532 637184 627557 618563 610476 603959 598991 594560 590038
56184 590038 586002 583000 580411 577461 574570 572671 571757 571136 570616 570513 570883 571568 572621 574024 575432 576757
56168 576757 578453 580675 582876 584850 587288 590660 594409 598069 602280 607808 614435 621702 629896 639354
56154 639354 649684 660628 672810 686614 701307 716352 732717 751758 773820 799175 829387
56143 829387 866411 911092 963823 1025708 1097499 1178009 1264731 1355196 1446345 1533648 1612735
56132 1612735 1681715 1740921 1791483 1835565 1876608 1916852 1954837 1987046 2011516 2028263 2037065
$$ packed form
56219B009057j17951j11215j04798r8244r1408q4871p8614p2010o5451o0232n6433
56208A067830n2505m7470m2099l7430l3555l0314k7879k5939k3539k0350j7173
56197G09577j4768j3096j1945j1311j0925j0348r627q994q087o517m968m431m522
56184E90038m036l002k589k950k891j899r14o21n20j03L70O85J053J403J408J325
56168E76757J696K222K201J974K438L372L749L660M211N528O627P267Q194R458
56154F39354J0330J0944J2182J3804J4693J5045J6365J9041K2062K5355L0212
56143H29387L7024M4681N2731O1885P1791Q0510Q6722R0465R1149Q7303P9087
56132A612735O8980N9206N0562M4082M1043M0244L7985L2209K4470J6747Q802
$$ plain form
56121 2037065 2037308 2030013 2017868 2002705 1984102 1960191 1928406 1885826 1830702 1764076 1688992 1608518
56109 1608518 1525716 1444630 1369228 1301295 1240717 1187461 1141738 1102685 1068807 1039713 1015881
56098 1015881 996960 981845 970184 962149 956975 953400 951382 951678 953900 956651 959453 962960 967415
56085 967415 972457 978246 985161 992612 999785 1007258 1016165 1026052 1035368 1043859 1052684 1062340 1072278 1082470
56071 1082470 1093550 1105423 1117325 1129155 1141253 1153272 1164904 1177276 1191800 1208010 1224253
56060 1224253 1239993 1255685 1271113 1285848 1300731 1316705 1332842 1347685 1361818 1376858 1392786
56049 1392786 1408835 1426086 1446163 1468013 1489135 1509634 1531799 1555876 1579558 1601761 1623721
56038 1623721 1646223 1668968 1692912 1719986 1750058 1781192 1813227 1847904 1885182 1922742 1959774
$$ packed form
56121B037065K43p295j2145j5163j8603k3911l1785m2580n5124o6626p5084q0474
56109A608518q2802q1086p5402o7933o0578n3256m5723l9053l3878k9094k3832
56098A015881j8921j5115j1661q035n174l575k018K96K222K751K802L507M455
56085I67415N042N789O915P451P173P473Q907R887R316Q491Q825R656R938J0192
56071A082470J1080J1873J1902J1830J2098J2019J1632J2372J4524J6210J6243
56060A224253J5740J5692J5428J4735J4883J5974J6137J4843J4133J5040J5928
56049A392786J6049J7251K0077K1850K1122K0499K2165K4077K3682K2203K1960
56038A623721K2502K2745K3944K7074L0072L1134L2035L4677L7278L7560L7032
$$ plain form
56027 1959774 1998010 2038309 2079372 2120528 2162763 2206260 2249907 2293966 2340390 2389953 2441895
56016 2441895 2496613 2555584 2618433 2683395 2750926 2823324 2900545 2980016 3060953 3145046 3232602
56005 3232602 3322136 3414358 3512366 3617080 3726457 3839914 3959384 4085417 4216524 4353126
55995 4353126 4497777 4650859 4810537 4977527 5155227 5344753 5544905 5757359 5986392
55986 5986392 6232960 6495007 6774217 7076315 7404044 7756492 8136077 8549075 8998337
55977 8998337 9483166 10007692 10581511 11210971 11898618 12652892 13489279 14420467 15455669
55968 15455669 16611833 17914996 19388983 21055661 22950251 25125144 27638508 30557397
55960 30557397 33979957 38043873 42917187 48810254 56012950 64910400 75970869 89757678
$$ packed form
56027A959774L8236M0299M1063M1156M2235M3497M3647M4059M6424M9563N1942
56016B441895N4718N8971O2849O4962O7531P2398P7221P9471Q0937Q4093Q7556
56005C232602Q9534R2222R8008J04714J09377J13457J19470J26033J31107J36602
55995D353126J44651J53082J59678J66990J77700J89526K00152K12454K29033
55986E986392K46568K62047K79210L02098L27729L52448L79585M12998M49262
55977H998337M84829N24526N73819O29460O87647P54274Q36387R31188J035202
55968A5455669J156164J303163J473987J666678J894590K174893K513364K918889
55960C0557397L422560M063916M873314N893067P202696Q897450J1060469J3786809
$$ plain form
55952 89757678 106960319 128358264 154696638 186546400 224094159 266630245 311755892
55945 311755892 354945253 390261296 412236125 417872412 407538959 384391511 352923878
55938 352923878 317527492 281593652 247256787 215607856 187088060 161805488 139689285
55931 139689285 120551794 104134958 90145546 78270815 68196632 59637676 52354334
55924 52354334 46144117 40831408 36270851 32347805 28965788 26037889 23491770 21272416
55916 21272416 19333481 17631467 16130718 14805704 13633555 12590028 11655610 10818702
55908 10818702 10068954 9393029 8779876 8224206 7721267 7263191 6843422 6459655 6109384
55899 6109384 5787068 5488291 5212218 4957461 4719943 4497232 4290596 4100315 3923171
$$ packed form
55952H9757678J7202641K1397945K6338374L1849762L7547759M2536086M5125647
55945C11755892M3189361L5316043K1974829N636287j0333453k3147448l1467633
55938C52923878l5396386l5933840l4336865l1648931k8519796k5282572k2116203
55931A39689285j9137491j6416836j3989412j1874731j0074183q558956p283342
55924E2354334o210217n312709m560557l923046l382017k927899k546119k219354
55916B1272416j938935j702014j500749j325014j172149j043527r34418q36908
55908A0818702p49748o75925o13153n55670n02939m58076m19769l83767l50271
55899F109384l22316k98777k76073k54757k37518k22711k06636j90281j77144
$$ plain form
55890 3923171 3756906 3602921 3462033 3331581 3209326 3096293 2992952 2895992 2801502 2708337
55880 2708337 2616209 2523918 2432075 2344466 2263918 2189107 2117465 2048569 1982679 1918783 1856549
55869 1856549 1797880 1744271 1694573 1647164 1602176 1559871 1518936 1478226 1438237 1399383 1360877
55858 1360877 1322745 1286846 1254368 1224343 1195890 1169724 1145980 1122802 1098657 1074045 1049497
55847 1049497 1024040 997177 970324 944670 919552 894479 870773 849539 829862 810671 792664
55836 792664 776745 762230 748228 735297 724190 714394 705272 697213 690298 683364 675695 668216 661722
55823 661722 655389 648283 640758 633037 624016 613024 601346 590514 580344 570058 560104 551400 543902
55810 543902 537314 532201 529155 527744 527377 528238 530489 533659 537753 543796 552239 561880 571130 579144 584980
$$ packed form
55890C923171j66265j53985j40888j30452j22255j13033j03341r6960r4490r3165
55880B708337r2128r2291r1843q7609q0548p4811p1642o8896o5890o3896o2234
55869A856549n8669n3609m9698m7409m4988m2305m0935m0710l9989l8854l8506
55858A360877l8132l5899l2478l0025k8453k6166k3744k3178k4145k4612k4548
55847A049497k5457k6863k6853k5654k5118k5073k3706k1234j9677j9191j8007
55836G92664j5919j4515j4002j2931j1107r796r122q059o915o934p669p479o494
55823F61722o333p106p525p721r021j0992j1678j0832j0170j0286r954q704p498
55810E43902o588n113l046j411l67Q61K251L170M094O043Q443R641R250Q014N836
$$ plain form
55795 584980 587217 585541 581432 576245 569792 561721 552863 544153 535605 527381 520404 514662 508234 499342
55781 499342 488323 476589 464990 454375 446450 442660 443214 448158 458129 472767 489485 504921 516557
55768 516557 522205 519794 509421 494353 478339 462667 446924 431290 416519 402735 389899 378677
55756 378677 369501 361573 354040 347203 341358 335577 329039 322532 317118 312297 307081 301945 298053 295313
55742 295313 292886 290942 290185 290126 289443 287693 285274 282112 277857 273075 268877 265612 263004 261117 259960
55727 259960 258587 255920 252167 248299 244543 240579 236734 233706 231407 229330 227809 227795 229605 232944 237823
55712 237823 244370 251986 259590 266338 271327 273349 272148 269402 267139 265555 263477 260449 256972 253033
55698 253033 247908 241462 234479 227668 221280 215579 210803 206774 203364 200971 199715 198649 196855 194939
$$ packed form
55795E84980K237j676m109n187o453q071q858q710q548q224o977n742o428q892
55781D99342j1019j1734j1599j0615p925l790N54M944R971J4638J6718J5436J1636
55768E16557N648k411j0373j5068j6014j5672j5743j5634j4771j3784j2836j1222
55756C78677r176p928p533o837n845n781o538o507n414m821n216n136l892k740
55742B95313k427j944p57n9o83j750k419l162m255m782m198l265k608j887j157
55727B59960j373k667l753l868l756l964l845l028k299k077j521j4J810L339M879
55712B37823O547P616P604O748M989K022j201k746k263j584k078l028l477l939
55698B53033n125o446o983o811o388n701m776m029l410k393j256j066j794j916
$$ plain form
55684 194939 194300 195314 197308 199955 203398 207223 210582 213326 215919 218288 219818 220393 220422 219895 218398
55669 218398 216018 213298 210402 207249 204298 202250 201071 200238 199779 200078 200865 201429 201807 202782 204829 207976
55653 207976 212454 218322 224511 229435 232691 235164 237403 238945 239276 238369 236072 231961 226200 219723 213249
55638 213249 206805 200418 194489 189207 184163 178933 173619 168718 164768 162080 160468 159310 158236 157485
55624 157485 157278 157275 157177 157289 157797 158021 157210 155618 153916 152011 149469 146649 144344 142580 140844 139148 137700
55607 137700 135945 133316 130725 129756 130331 130665 129797 128727 128598 129073 129179 128698 127984 127176 126238 125260 124325
55590 124325 123525 123239 123747 124538 124770 124527 124705 125447 125704 124713 123084 121960 121844 122659 124231 126279 128502
55573 128502 131068 134473 138614 142621 145909 148737 151383 153449 154410 154290 153363 151665 149242 146497 143873
$$ packed form
55684A94939o39J014J994K647L443L825L359K744K593K369J530N75K9n27j497
55669B18398k380k720k896l153k951k048j179q33m59K99P87N64L78R75K047L147
55653B07976M478N868O189M924L256K473K239J542L31r07k297m111n761o477o474
55638B13249o444o387n929n282n044n230n314m901l950k688j612j158j074p51
55624A57485k07lr8J12N08K24q11j592j702j905k542k820k305j764j736j696j448
55607A37700j755k629k591r69N75L34q68j070j29M75J06m81p14q08r38r78r35
55590A24325q00k86N08P91K32k43J78P42K57r91j629j124j16Q15J572K048K223
55573A28502K566L405M141M007L288K828K646K066R61j20r27j698k423k745k624
$$ plain form
55558 143873 141481 139267 137211 135147 132809 130298 128191 126988 126711 127106 127819 128255 127790 126401 124845
55543 124845 123971 123980 124444 124824 125004 125381 126317 127410 127719 126917 125765 125041 124611 124096 123795 124034 124220 123616 122680
55524 122680 122467 122914 122980 122384 121921 121964 121964 121725 121835 122391 122470 121537 120344 119754 119499 118817 117600 116219 114814
55505 114814 113431 112345 111621 110770 109403 107866 106772 106229 105950 105820 106004 106692 107922 109389 110455 110758
55489 110758 110803 111373 112331 112717 112171 111453 111271 111349 111053 110262 109221 108136 107346 107302 107910 108389 108186 107563 107002
55470 107002 106574 106197 105911 105520 104565 103072 101748 101012 100470 99777 99373 99701 100294 100339 99791 99303 99378 100123 101386
55451 101386 102598 102881 102082 101342 101870 103313 104140 103599 102575 102351 103186 104430 105525 106456 107372 108192 108731
55434 108731 108990 109142 109269 109377 109735 110792 112440 113640 113295 111429 109077 107154 105988 105815 106926 109056
$$ packed form
55558A43873k392k214k056k064k338k511k107j203k77L95P13M36m65j389j556
55543A24845q74RM64L80J80L77R36J093L09q02j152p24m30n15l01K39J86o04r36
55524A22680k13M47O6n96m63M3%k39J10N56P9r33j193n90k55o82j217j381j405
55505A14814j383j086p24q51j367j537j094n43k79j30J84O88J230J467J066L03
55489A10758M5N70R58L86n46p18j82P8k96p91j041j085p90m4O08M79k03o23n61
55470A07002m28l77k86l91r55j493j324p36n42o93m04L28N93M5n48m88P5P45J263
55451A01386J212K83p99p40N28J443Q27n41j024k24Q35J244J095R31R16Q20N39
55434A08731K59J52J27J08L58J057J648J200l45j866k352j923j166j73J111K130
$$ plain form
55418 109056 111306 113043 114484 116086 117785 119140 119871 119948 119466 118685 117916 117095 115693 113298 110161 107067
55402 107067 104787 103611 103159 102635 101592 100384 99647 99450 99338 99069 98780 98549 98356 98372 98763 99253 99471 99650
55384 99650 100311 101355 102180 102616 102976 103223 103010 102634 102909 103856 104453 104013 102993 102120 101596 101533 102225 103435
55366 103435 104271 104317 104191 104454 104716 104368 103504 102542 101600 100812 100582 100911 101091 100631 99891 99324 98826 98371 98480
55347 98480 99315 100082 100104 99777 99653 99311 98162 96783 96345 97057 98188 99315 100560 101764 102474 102708 102942
55330 102942 103321 103581 103628 103568 103290 102738 102432 102962 103993 104511 104091 103292 102721 102267 101418 99986 98328 97081
55312 97081 96645 96820 97129 97522 98379 99698 100847 101406 101612 101645 101189 100206 99396 99221 99221 98990 99065 99902 100782 100863
55292 100863 100713 101500 103095 104348 104947 105508 105923 105221 103352 101660 101040 100849 100271 99685 99848 100531 100843
$$ packed form
55418A09056K250J737J441J602J699J355P31P7m82p81p69q21j402k395l137l094
55402A07067k280j176m52n24j043j208p37j97j12k69k89k31j93J6L91M90K18J79
55384I9650O61J044Q25M36L60K47k13l76K75R47N97m40j020q73n24o3O92J210
55366A03435Q36M6j26K63K62l48q64r62r42p88k30L29J80m60p40n67m98m55J09
55347I8480Q35P67K2l27j24l42j149j379m38P12J131J127J245J204P10K34K34
55330A02942L79K60M7o0k78n52l06N30J031N18m20p99n71m54q49j432j658j247
55312I7081m36J75L09L93Q57J319J149N59K06L3m56r83q10j75%k31P5Q37Q80Q1
55292A00863j50P87J595J253N99N61M15p02j869j692o20j91n78n86J63O83L12
$$ plain form
55275 100843 100519 100162 100413 101291 102199 102372 101525 100151 98941 98016 97179 96711 97163 98333 99290 99712 100422 102212
55257 102212 104736 106990 108382 108939 108979 109047 109735 111054 112267 112675 112318 111616 110690 109456 108057 106777 105722
55240 105722 104959 104762 105325 106320 107122 107456 107591 107934 108652 109608 110388 110409 109267 107170 104990 103692 103585 104115
55222 104115 104437 104270 104088 104458 105317 106038 106117 105660 105265 105470 106288 107200 107708 107854 108005 108185 108072 107690 107571
55203 107571 107947 108242 107844 106960 106259 105987 105933 106007 106277 106630 106881 107078 107224 107014 106349 105802 105884 106090 105527 104342
55183 104342 103678 104144 105171 106006 106438 106286 105114 103095 101483 101533 103155 105189 106732 107796 108812 109978
55167 109978 111157 112165 113008 113760 114200 113812 112478 110984 110317 110435 110328 109453 108569 108768 110055 111312 111476
55150 111476 110429 108875 107663 107176 107165 107110 106829 106684 107179 108419 109996 111272 111837 111792 111583 111499 111395 111016
$$ packed form
55275A00843l24l57K51Q78R08J73q47j374j210r25q37m68M52J170R57M22P10J790
55257A02212K524K254J392N57M0O8O88J319J213M08l57p02r26j234j399j280j055
55240A05722p63j97N63R95Q02L34J35L43P18R56P80K1j142k097k180j298j07N30
55222A04115L22j67j82L70Q59P21P9m57l95K05Q18R12N08J46J51J80j13l82j19
55203A07571L76K95l98q84p01k72n4P4K70L53K51J97J46k10o65n47Q2K06n63j185
55183A04342o64M66J027Q35M32j52j172k019j612N0J622K034J543J064J016J166
55167A09978J179J008Q43P52M40l88j334j494o67J18j07q75q84J99J287J257J64
55150A11476j047j554j212m87j1n5k81j45M95J240J577J276N65m5k09q4j04l79
$$ plain form
55132 111016 110401 109762 109218 108919 109210 110247 111549 112403 112730 113118 113979 115047 115775 115934 115711 115471 115481 115657
55114 115657 115609 115126 114484 114029 113704 113427 113701 115190 117668 120034 121515 122348 123107 123906 124567 125084 125491 125544
55096 125544 124963 123946 123164 123202 124048 125101 125695 125688 125421 125079 124400 123261 122175 121730 121771 121677 121305 121091 121306
55077 121306 121842 122667 123805 124803 124961 124273 123506 123053 122405 121126 119747 119134 119365 119793 119975 120033 120179 120318
55059 120318 120175 119600 118747 117982 117562 117396 117274 117233 117415 117606 117247 115982 114007 111921 110484 110355 111557
55042 111557 113207 114271 114630 114976 115658 116235 116309 116196 116491 117381 118637 119855 120539 120384 119757 119495 120006 120922
55024 120922 121774 122532 123266 123770 123851 123578 122977 121909 120507 119301 118567 118014 117441 117238 117773 118720 119514 120174
55006 120174 121168 122638 124203 125349 125637 124767 122983 121321 120996 122351 124554 126330 126931 126578 126087 126007
$$ packed form
55132A11016o15o39n44k99K91J037J302Q54L27L88Q61J068P28J59k23k40J0J76
55114A15657m8m83o42m55l25k77K74J489K478K366J481Q33P59P99O61N17M07N3
55096A25544n81j017p82L8Q46J053N94pk67l42o79j139j086m45M1r4l72k14K15
55077A21306N36Q25J138R98J58o88p67m53o48j279j379o13K31M28J82N8J46J39
55059A20318j43n75q53p65m20j66j22m1J82J91l59j265j975k086j437j29J202
55042A11557J650J064L59L46O82N77P4j13K95Q90J256J218O84j55o27k62N11R16
55024A20922Q52P58P34N04Q1k73o01j068j402j206p34n53n73k03N35R47P94O60
55006A20174R94J470J565J146K88q70j784j662l25J355K203J776O01l53m91q0
$$ plain form
54990 126007 126126 125958 125566 125441 125618 125521 124906 124335 124349 124629 124464 123658 122554 121518 120890 121139 122485 124449
54972 124449 126230 127516 128639 129995 131554 132857 133310 132654 131316 130110 129492 129335 129524 130309 131808 133573
54956 133573 134955 135614 135433 134416 133073 132387 132805 133530 133381 132193 130849 130073 129730 129264 128431 127582 127405
54939 127405 128238 129441 129816 129012 128144 128556 130266 132212 133763 135266 137149 139222 141013 142367 143530
54924 143530 144992 147326 150880 155444 160363 164909 168465 170624 171451 171483 171142 170308 168810 166974 165120
54909 165120 162703 158745 153234 147509 142981 139955 137836 136055 134409 132867 131501 130591 130496 131276 132483
54894 132483 133389 133582 133384 133556 134474 135755 136839 137716 138787 140218 141824 143534 145584 148202 151348 154807
54878 154807 158340 161730 164936 168190 171666 174955 177145 177514 176089 173469 170253 166702 162820 158626
$$ packed form
54990A26007J19j68l92j25J77r7o15n71J4K80j65q06j104j036o28K49J346J964
54972A24449J781J286J123J356J559J303M53o56j338j206o18j57J89P85J499J765
54956A33573J382O59j81j017j343o86M18P25j49j188j344p76l43m66q33q49j77
54939A27405Q33J203L75q04q68M12J710J946J551J503J883K073J791J354J163
54924A43530J462K334L554M564M919M546L556K159Q27L2l41q34j498j836j854
54909A65120k417l958n511n725m528l026k119j781j646j542j366r10r5P80J207
54894A32483R06J93j98J72R18J281J084Q77J071J431J606J710K050K618L146L459
54878A54807L533L390L206L254L476L289K190L69j425k620l216l551l882m194
$$ plain form
54864 158626 154294 150086 146273 143197 141240 140391 139940 139002 137472 136114 135510 135318 134811 133820 132752 131912
54848 131912 131178 130235 128827 126902 124763 122966 121868 121430 121542 122200 123146 123725 123511 122799 122168 121821 121694
54831 121694 121864 122363 122849 122986 122956 123151 123545 123803 123786 123479 122708 121507 120569 120635 121540 122525 123392 124654 126490
54812 126490 128263 129283 129501 129267 128889 128642 128761 129216 129767 130242 130461 129983 128518 126617 125341 125111 125363
54795 125363 125448 125272 124907 124275 123568 123415 124138 125286 126310 127331 128806 130734 132695 134464 136132 137675
54779 137675 138777 139129 138756 138134 138037 139036 141004 143322 145713 148646 152721 157930 163728 169544 174951 179578
54763 179578 183241 186059 188173 189413 189477 188361 186319 183451 179620 174856 169669 164894 161170 158515 156303
54748 156303 153752 150584 147256 144553 142994 142589 142979 143708 144474 145214 145940 146460 146366 145368 143599 141624 140235
$$ packed form
54864A58626m332m208l813l076j957q49m51r38j530j358o04j92n07r91j068q40
54848A31912p34r43j408j925k139j797j098m38J12O58R46N79k14p12o31l47j27
54831A21694J70M99M86J37l0J95L94K58j7l07p71j201r38O6R05R85Q67J262J836
54812A26490J773J020K18k34l78k47J19M55N51M75K19m78j465j901j276k30K52
54795A25363Q5j76l65o32p07j53P23J148J024J021J475J928J961J769J668J543
54779A37675J102L52l73o22r7R99J968K318K391K933M075N209N798N816N407M627
54763A79578L663K818K114J240O4j116k042k868l831m764n187m775l724k655k212
54748A56303k551l168l328k703j559m05L90P29P66P40P26N20r4r98j769j975j389
$$ plain form
54731 140235 140211 141981 145287 149218 152761 155493 157797 160427 163816 167747 171621 174901 177204 178202 177792
54716 177792 176420 174831 173303 171396 168635 165182 161594 158238 155288 152956 151300 149972 148643 147511
54702 147511 146982 146993 147118 147170 147155 146775 145720 144437 143883 144294 144845 144720 143916 142782 141498 140423 140232 140987
54684 140987 141569 140835 139114 137888 138034 138991 139641 139430 138551 137550 136965 136910 136812 135945 134397 133173 133009 133420
54666 133420 133378 132732 132312 132633 133126 133096 132893 133437 134771 135842 135889 135369 135172 135422 135578 135334 134855 134327 133838
54647 133838 133648 134067 135026 136129 137070 137673 137697 137109 136472 136506 137202 137880 138077 137844 137142 135688 133668 132002
54629 132002 131467 131935 132759 133486 133911 133961 133917 134351 135370 136241 136211 135434 134683 134477 134929 136077 137720 139092
54611 139092 139414 138834 138294 138392 138817 139001 138839 138585 138464 138599 139036 139590 139923 139912 139736 139406 138515 136805 134803
$$ packed form
54731A40235k4J770L306L931L543K732K304K630L389L931L874L280K303R98m10
54716A77792j372j589j528j907k761l453l588l356k950k332j656j328j329j132
54702A47511n29J1J25N2j5l80j055j283n54M11N51j25q04j134j284j075j91P55
54684A40987N82p34j721j226J46R57O50k11q79j001n85n5r8q67j548j224j64M11
54666A33420m2o46m20L21M93l0k03N44J334J071M7n20j97K50J56k44m79n28m89
54647A33838j90M19R59J103R41O03K4n88o37L4O96O78J97k33p02j454k020j666
54629A32002n35M68Q24P27M25N0m4M34J019Q71l0p77p51k06M52J148J643J372
54611A39092L22n80n40R8M25J84j62k54j21J35M37N54L33j1j76l30q91j710k002
$$ plain form
54592 134803 133479 133316 134025 135196 136739 138513 139910 140292 139720 138863 138198 137753 137622 138182 139435 140577
54576 140577 140719 139885 138880 138232 137661 136635 135101 133607 132850 133128 134067 134973 135584 136309 137503 138793 139497
54559 139497 139477 139109 138609 138002 137640 138034 139034 139949 140629 141742 143589 145375 146239 146466 146982 147997 148906
54542 148906 149380 149827 150704 151937 153202 154341 155334 156159 156863 157499 157848 157423 155989 153949 151996 150492
54526 150492 149417 148874 149229 150455 151620 151520 149944 147879 146326 145332 144435 143574 142988 142594 142196 142200 143282
54509 143282 145181 146531 146220 144482 142403 140888 140324 140648 141262 141315 140590 139834 139803 140307 140597 140385 139964 139563
54491 139563 139193 139040 139462 140474 141624 142505 143157 143896 144944 146237 147478 148368 148948 149624 150732 152131
54475 152131 153378 154193 154628 154859 154985 155047 155152 155549 156445 157667 158696 159296 159915 160962 161833 161350 159334
$$ packed form
54592A34803j324j63P09J171J543J774J397L82n72q57o65m45j31N60J253J142
54576A40577J42q34j005o48n71j026j534j494p57K78R39R06O11P25J194J290P04
54559A39497k0l68n00o07l62L94J000R15O80J113J847J786Q64K27N16J015R09
54542A48906M74M47Q77J233J265J139R93Q25P04O36L49m25j434k040j953j504
54526A50492j075n43L55J226J165j00j576k065j553r94q97q61n86l94l98MJ082
54509A43282J899J350l11j738k079j515n64L24O14N3p25p56l1N04K90k12m21m01
54491A39563l70j53M22J012J150Q81O52P39J048J293J241Q90N80O76J108J399
54475A52131J247Q15M35K31J26O2J05L97Q96J222J029O00O19J047Q71m83k016
$$ plain form
54458 159334 157093 155976 155987 156237 156212 156020 155783 155492 155270 155223 155157 154916 154808 155130 155403 154739 153054 151380 150746
54439 150746 151110 151571 151384 150594 149817 149512 149496 149311 149029 149335 150643 152496 154194 155615 156944 157931 158099
54422 158099 157564 157000 156723 156396 155729 154974 154572 154766 155666 157244 159045 160331 160808 160942 161283 161741 161823 161434
54404 161434 161115 161483 162561 163733 164385 164604 165140 166552 168493 170064 170758 170797 170618 170383 170099 169887 169911 170164
54386 170164 170468 170592 170338 169686 168913 168454 168555 169091 169732 170224 170525 170790 171219 171790 172205 172223 172043 172176 172898
54367 172898 173969 174961 175803 176883 178599 180890 183336 185740 188373 191472 194749 197794 200770 204110 207502
54352 207502 209858 210578 210209 209413 207903 205121 201549 198441 196281 194258 191430 187807 184075 180758 177971
54337 177971 175649 173670 171819 169872 167792 165860 164591 164300 164662 164961 164983 165341 166578 168324 169823 171015
$$ packed form
54458A59334k241j117J1K50k5j92k37k91k22m7o6k41j08L22K73o64j685j674o34
54439A50746L64M61j87p90p77l05j6j85k82L06J308J853J698J421J329R87J68
54422A58099n35n64k77l27o67p55m02J94R00J578J801J286M77J34L41M58Q2l89
54404A61434l19L68J078J172O52K19N36J412J941J571O94L9j79k35k84k12K4K53
54386A70164L04J24k54o52p73m59J01N36O41M92L01K65M29N71M15J8j80J33P22
54367A72898J071R92Q42J080J716K291K446K404K633L099L277L045K976L340L392
54352B07502K356P20l69p96j510k782l572l108k160k023k828l623l732l317k787
54337A77971k322j979j851j947k080j932j269k91L62K99K2L58J237J746J499J192
$$ plain form
54321 171015 172378 173825 174547 174133 173149 172265 171452 170426 169448 169030 169047 168705 167429 165470 163522 162070 161206
54304 161206 160831 160741 160517 159708 158332 157101 156820 157533 158500 159032 159073 158899 158641 158340 158144 158172 158372 158739 159403
54285 159403 160287 161027 161525 162201 163283 164224 164297 163544 162601 161859 161375 161373 162095 163206 163979 164186 164292 164765 165645
54266 165645 166798 168072 169164 169841 170338 171137 172346 173740 175245 176799 177870 177870 177123 176658 176851 176954 176231
54249 176231 174875 173505 172382 171508 170994 170875 170955 171104 171365 171584 171474 171261 171632 172700 173575 173458 172629 171890
54231 171890 171513 171332 171440 172075 173006 173685 173986 174321 174997 175873 176645 177222 177761 178481 179300 179631 178810 176897
54213 176897 174793 173361 172753 172746 173237 174020 174493 174182 173384 172816 172732 172816 172818 172851 173068 173423 173775 173954 173725 172974
54193 172974 171931 170958 170140 169270 168278 167421 166982 166887 166744 166318 165979 166464 168010 169879 171117 171686 172321 173246
$$ packed form
54321A71015J363J447P22m14r84q84q13j026r78m18J7l42j276j959j948j452q64
54304A61206l75r0k24q09j376j231k81P13R67N32M1j74k58l01j96K8K00L67O64
54285A59403Q84P40M98O76J082R41P3p53r43p42m84kP22J111P73K07J06M73Q80
54266A65645J153J274J092O77M97P99J209J394J505J554J071%p47m65J93J03p23
54249A76231j356j370j123q74n14j19Q0J49K61K19j10k13L71J068Q75j17q29p39
54231A71890l77j81J08O35R31O79L01L35O76Q76P72N77N39P20Q19L31q21j913
54213A76897k104j432o08pM91P83M73l11p98n68q4Q4KL3K17L55L52J79k29p51
54193A72974j043r73q18q70r92q57m39r5j43m26l39M85J546J869J238N69O35R25
$$ plain form
54175 173246 173724 173207 172304 172014 172354 172346 171217 169066 166442 163777 161354 159453 158335 158146 158813 159956 161037
54158 161037 161765 162305 162980 163933 165101 166284 167096 167119 166347 165261 164324 163632 163165 163016 163151 163328 163612 164598
54140 164598 166684 169337 171518 172706 173185 173436 173635 173679 173443 173002 172724 172988 173703 174383 174790 175149 175593 175899
54122 175899 176104 176810 178385 180270 181623 182330 182785 183000 182648 181847 181254 181329 181983 182867 183622 183987 184104 184539
54104 184539 185522 186407 186452 185884 185511 185503 185401 185204 185455 186170 186625 186570 186738 187663 188779 189383 189862 191229 193743
54085 193743 196823 200212 204522 210455 217939 226227 234471 241866 247341 249645 248187 243883 238805 234628
54071 234628 231529 228699 225625 222408 219100 215489 211746 208707 207116 206858 207167 207347 207097 206430 205584 204898
54055 204898 204520 204264 203885 203453 203377 204111 205762 207873 209724 211056 212438 214640 217734 221148 224518 228035
$$ packed form
54175A73246M78n17r03k90L40qj129k151k624k665k423j901j118j89O67J143J081
54158A61037P28N40O75R53J168J183Q12K3p72j086r37o92m67j49J35J77K84R86
54140A64598K086K653K181J188M79K51J99M4k36m41k78K64P15O80M07L59M44L06
54122A75899K05P06J575J885J353P07M55K15l52q01n93P5O54Q84P55L65J17M35
54104A84539R83Q85M5n68l73qj02j97K51P15M55n5J68R25J116O04M79J367K514
54085A93743L080L389M310N933P484Q288Q244P395N475K304j458m304n078m177
54071B34628l099k830l074l217l308l611l743l039j591k58L09J80k50o67q46o86
54055B04898l78k56l79m32p6P34J651K111J851J332J382K202L094L414L370L517
$$ plain form
54039 228035 231956 236315 241233 247017 253678 260829 268316 276488 285446 294406 302324 308935 314738 320120
54025 320120 324909 328735 331342 332527 332194 330614 328368 325775 322586 318427 313450 308266 303226 298007
54011 298007 292205 286150 280722 276219 271850 266801 261462 256998 253737 250686 246883 242677 239232 237136
53997 237136 235966 234961 233595 231587 228912 226042 223851 222940 223081 223392 223091 221972 220173 217660 214225
53982 214225 210096 206301 204086 203912 205215 207057 208726 209738 209714 208561 206664 204722 203451 203380 204530
53967 204530 206172 207239 207311 207035 207396 208744 210716 212797 214597 215820 216440 216925 217909 219533 221330 222759
53951 222759 223706 224516 225859 228511 232857 238388 243954 248756 253004 257523 262993 269839 278585 289780
53937 289780 303438 318910 335498 352748 369705 384155 393414 396277 393855 388297 381065 372850 364627
$$ packed form
54039B28035L921M359M918N784O661P151P487Q172Q958Q960P918O611N803N382
54025C20120M789L826K607J185l33j580k246k593l189m159m977n184n040n219
54011B98007n802o055n428m503m369n049n339m464l261l051l803m206l445k096
53997B37136j170j005j366k008k675k870k191r11J41L11l01j119j799k513l435
53982B14225m129l795k215j74J303J842J669J012k4j153j897j942j271p1J150
53967B04530J642J067P2k76L61J348J972K081J800J223O20M85R84J624J797J429
53951B22759R47Q10J343K652M346N531N566M802M248M519N470O846Q746J1195
53937B89780J3658J5472J6588J7250J6957J4450R259K863k422n558p232q215q223
$$ plain form
53924 364627 357829 353327 350853 349717 349615 350399 351625 352917 354566 357218 360977 365257 369546 373888 378480
53909 378480 383130 387354 390839 393622 395879 397632 398596 398294 396477 393474 390016 386612 383196 379398 374973
53894 374973 369915 364418 358893 353781 349009 343774 337263 329605 321846 314879 308738 302983 297473 292482
53880 292482 288314 285010 282228 279237 275301 270454 265690 262000 259306 256725 253762 250794 248402 246734
53866 246734 245519 244268 242374 239569 236414 233869 232175 230671 228838 226877 224929 222526 219425 216373
53852 216373 214292 213115 212171 211378 211172 211546 212119 213049 214806 216873 217695 216408 213891 211656 210338 209768
53836 209768 209820 210396 210953 210902 210518 210867 212632 215306 217662 218840 218920 218582 218405 218539 218960 219727 220822 221948
53818 221948 222843 223671 224749 226005 227091 228023 229217 230896 232938 235396 238607 242598 246866 250976 254935
$$ packed form
53924C64627o798m502k474j136j02P84J226J292J649K652L759M280M289M342M592
53909C78480M650M224L485K783K257J753R64l02j817l003l458l404l416l798m425
53894C74973n058n497n525n112m772n235o511p658p759o967o141n755n510m991
53880B92482m168l304k782k991l936m847m764l690k694k581k963k968k392j668
53866B46734j215j251j894k805l155k545j694j504j833j961j948k403l101l052
53852B16373k081j177r44p93k06L74N73R30J757K067Q22j287k517k235j318n70
53836B09768N2N76N57n1l84L49J765K674K356J178Q0l38j77J34M21P67J095J126
53818B21948Q95Q28J078J256J086R32J194J679K042K458L211L991M268M110L959
$$ plain form
53803 254935 258808 262524 266293 270641 275599 280399 284464 288197 292236 296356 299796 302402 304744 307220
53789 307220 309693 311986 314095 315836 316774 316612 315247 312515 308411 303605 299136 295344 291552 287101 282299
53774 282299 277953 274251 270630 266683 262713 259256 256394 253825 251435 249383 247567 245406 242443 238921
53760 238921 235451 232296 229427 227172 226129 226252 226557 226097 224858 223361 221841 220237 218725 217692 217279
53745 217279 217358 217816 218524 219160 219481 219672 220075 220712 221424 222309 223477 224564 225101 225397 226340 228103 229653 229953
53727 229953 229262 228785 229275 230467 231826 233349 235365 237766 239822 240925 241343 241941 243165 244599 245632
53712 245632 246179 246511 246810 247324 248694 251503 255537 260024 264537 269120 273540 277133 279679 281844 284341
53697 284341 287023 289274 291044 293058 296115 300373 305163 309236 311477 311786 311233 310983 311105 310694 309099
$$ packed form
53803B54935L873L716L769M348M958M800M065L733M039M120L440K606K342K476
53789C07220K473K293K109J741R38j62j365k732m104m806m469l792l792m451m802
53774B82299m346l702l621l947l970l457k862k569k390k052j816k161k963l522
53760B38921l470l155k869k255j043J23L05m60j239j497j520j604j512j033m13
53745B17279P9M58P08O36L21J91M03O37P12Q85J168J087N37K96R43J763J550L00
53727B29953o91m77M90J192J359J523K016K401K056J103M18N98J224J434J033
53712B45632N47L32K99N14J370K809M034M487M513M583M420L593K546K165K497
53697B84341K682K251J770K014L057M258M790M073K241L09n53k50J22m11j595
$$ plain form
53682 309099 306665 304226 302234 300613 299195 297991 297085 296511 296308 296526 297021 297307 296798 295259 292973 290426
53666 290426 287960 285756 284037 283031 282723 282772 282774 282602 282505 282874 283834 285023 285915 286387 286836 287569 288293 288407
53648 288407 287720 286590 285445 284515 284053 284397 285548 286988 288202 289276 290700 292632 294620 296191 297534
53633 297534 299387 302181 305448 308204 309910 310944 312122 313905 316158 318505 320751 323010 325583 328695
53619 328695 332286 336125 340132 344430 349039 353792 358709 364161 370411 377218 384219 391426 398874 406028
53605 406028 412130 417109 421514 425478 428427 430079 431039 431955 432553 432118 430575 428473 426085 423243 420141
53590 420141 417625 416288 415640 414581 412633 410345 408474 407019 405305 402915 400247 398001 396321 394768
53576 394768 393087 391565 390472 389448 387804 385354 382676 380571 379412 378952 378588 377838 376751 375919 376008 377211
$$ packed form
53682C09099k434k439j992j621j418j204r06n74k03K18M95K86n09j539k286k547
53666B90426k466k204j719j006l08M9Kj72r7L69R60J189Q92M72M49P33P24J14
53648B88407o87j130j145r30m62L44J151J440J214J074J424J932J988J571J343
53633B97534J853K794L267K756J706J034J178J783K253K347K246K259K573L112
53619C28695L591L839M007M298M609M753M917N452O250O807P001P207P448P154
53605D06028O102M979M405L964K949J652R60R16N98m35j543k102k388k842l102
53590D20141k516j337o48j059j948k288j871j455j714k390k668k246j680j553
53576C94768j681j522j093j024j644k450k678k105j159m60l64p50j087q32Q9J203
$$ plain form
53560 377211 379158 381235 382927 383974 384411 384493 384500 384621 385017 385879 387292 389102 391041 392933 394706 396327
53544 396327 397839 399408 401157 403028 404972 407219 410127 413777 417881 422121 426420 430926 435914 441688
53530 441688 448335 455574 463080 470989 479757 489410 499324 508991 518675 528931 539734 550645 561756
53517 561756 573914 587829 603427 620248 638054 656758 676162 696224 717338 739852 763413
53506 763413 787202 810789 834277 857618 880247 901619 921700 940743 958899 976278 993130
53495 993130 1009685 1026006 1042187 1058465 1074961 1091533 1108109 1124867 1141803 1158384 1174126
53484 1174126 1189371 1205038 1221579 1238556 1255265 1271354 1286782 1301521 1315525 1328593 1340056
53473 1340056 1348891 1354515 1357468 1358996 1359871 1359691 1357332 1351954 1343540 1332647 1319934 1306060 1291749
$$ packed form
53560C77211J947K077J692J047M37Q2PJ21L96Q62J413J810J939J892J773J621
53544C96327J512J569J749J871J944K247K908L650M104M240M299M506M988N774
53530D41688O647P239P506P909Q768R653R914R667R684J0256J0803J0911J1111
53517E61756J2158J3915J5598J6821J7806J8704J9404K0062K1114K2514K3561
53506G63413K3789K3587K3488K3341K2629K1372K0081J9043J8156J7379J6852
53495I93130J6555J6321J6181J6278J6496J6572J6576J6758J6936J6581J5742
53484A174126J5245J5667J6541J6977J6709J6089J5428J4739J4004J3068J1463
53473A340056Q835N624K953J528Q75j80k359n378q414j0893j2713j3874j4311
$$ plain form
53460 1291749 1277557 1263478 1249092 1234237 1219183 1203933 1187708 1169585 1149542 1128451 1107185
53449 1107185 1086142 1065627 1046182 1028219 1011585 995711 980134 964860 950368 937324 926112
53438 926112 916636 908645 902154 897382 894355 892844 892595 893325 894610 896189 898398 901898 906867 912781 919102
53423 919102 925847 933409 942155 952380 964321 977987 993148 1009633 1027488 1046799 1067542 1089591
53411 1089591 1112605 1136059 1159807 1184643 1211737 1241354 1272565 1304425 1336953 1370778 1406397
53400 1406397 1444132 1484308 1526914 1571360 1616995 1663648 1711382 1760090 1809721 1860554 1912734
53389 1912734 1965748 2018711 2070944 2121911 2171006 2217971 2263216 2307103 2349036 2387902 2423279
53378 2423279 2455633 2485322 2512074 2535510 2555606 2572412 2585689 2594975 2599708 2599173 2592665 2579803
$$ packed form
53460A291749j4192j4079j4386j4855j5054j5250j6225j8123k0043k1091k1266
53449A107185k1043k0515j9445j7963j6634j5874j5577j5274j4492j3044j1212
53438I26112r476p991o491m772l027j511k49P30J285J579K209L500M969N914O321
53423I19102O745P562Q746J0225J1941J3666J5161J6485J7855J9311K0743K2049
53411A089591K3014K3454K3748K4836K7094K9617L1211L1860L2528L3825L5619
53400A406397L7735M0176M2606M4446M5635M6653M7734M8708M9631N0833N2180
53389A912734N3014N2963N2233N0967M9095M6965M5245M3887M1933L8866L5377
53378B423279L2354K9689K6752K3436K0096J6806J3277R286M733n35o508j2862
$$ plain form
53366 2579803 2560576 2535164 2504008 2467887 2427535 2383266 2335390 2284850 2232946 2180504 2127769
53355 2127769 2075090 2023107 1972286 1922893 1875502 1830853 1788940 1748807 1709477 1670613 1632070
53344 1632070 1593435 1554491 1515707 1477906 1441715 1407545 1375622 1345805 1317841 1292193 1269994
53333 1269994 1251684 1236123 1221709 1207996 1195591 1184775 1175038 1165841 1157000 1148186 1138674 1127962
53321 1127962 1116265 1104281 1092762 1082370 1073524 1066137 1059761 1054204 1049803 1047004 1045835 1045933 1046918 1048587
53307 1048587 1050885 1053870 1057697 1062589 1068791 1076471 1085645 1096280 1108533 1122685 1138721 1156173 1174623
53294 1174623 1194206 1215363 1238210 1262450 1287749 1313777 1339907 1365318 1389541 1412629 1434669
53283 1434669 1455459 1474757 1492508 1508586 1522497 1533601 1541511 1546135 1547504 1545805 1541500 1535204
$$ packed form
53366B579803j9227k5412l1156l6121m0352m4269m7876n0540n1904n2442n2735
53355B127769n2679n1983n0821m9393m7391m4649m1913m0133l9330l8864l8543
53344A632070l8635l8944l8784l7801l6191l4170l1923k9817k7964k5648k2199
53333A269994j8310j5561j4414j3713j2405j0816r737r197q841q814r512j0712
53321A127962j1697j1984j1519j0392q846p387o376n557m401k799j169R8R85J669
53307A048587K298K985L827M892O202P680R174J0635J2253J4152J6036J7452J8450
53294A174623J9583K1157K2847K4240K5299K6028K6130K5411K4223K3088K2040
53283A434669K0790J9298J7751J6078J3911J1104P910M624J369j699m305o296
$$ plain form
53271 1535204 1527354 1518021 1506927 1493601 1477632 1458905 1437635 1414207 1389102 1362912 1336162 1308983
53259 1308983 1281128 1252467 1223332 1194229 1165358 1136618 1108025 1079934 1052782 1026766 1001737
53248 1001737 977302 953004 928579 904130 880077 856872 834737 813610 793288 773580 754431
53237 754431 735984 718533 702317 687290 673170 659843 647671 637141 628177 620007 611888 603848
53225 603848 596510 590302 584944 579536 573064 565083 556174 547418 538999 529644 518078 504916 492315
53212 492315 481621 472165 462723 453299 444728 437169 430012 423105 417018 411910 406916 401087 394427 387599
53198 387599 380998 374542 368152 361988 356198 350742 345548 340726 336525 333045 329925 326479 322336 317967
53184 317967 314280 311623 309438 307005 304256 301634 299363 297155 294578 291472 288037 284720 282055 280367
$$ packed form
53271A535204p850r333j1094j3326j5969j8727k1270k3428k5105k6190k6750k7179
53259A308983k7855k8661k9135k9103k8871k8740k8593k8091k7152k6016k5029
53248A001737k4435k4298k4425k4449k4053k3205k2135k1127k0322j9708j9149
53237G54431j8447j7451j6216j5027j4120j3327j2172j0530q964q170q119q040
53225F03848p338o208n358n408o472p981q909q756q419r355j1566j3162j2601
53212D92315j0694r456r442r424q571p559p157o907o087n108m994n829o660o828
53198C87599o601o456o390o164n790n456n194m822m201l480l120l446m143m369
53184C17967l687k657k185k433k749k622k271k208k577l106l435l317k665j688
$$ plain form
53170 280367 279529 279056 278540 277939 277412 276884 275932 274215 272015 270082 268806 267752 266332 264743 263765 263553
53154 263553 263221 261979 260236 259054 258737 258582 258010 257341 257178 257493 257690 257385 256778 256339 256429 257207 258628 260443
53136 260443 262279 263809 264854 265402 265636 265822 266018 265923 265272 264393 264044 264527 265204 265188 264417 263730 263902 264944
53118 264944 266425 268073 269802 271420 272674 273500 273949 273983 273619 273167 272875 272363 270840 268128 265079 262730
53102 262730 261326 260480 260031 260205 260894 261331 260800 259497 258385 258189 258729 259314 259551 259528 259287 258532 257058 255296
53084 255296 254104 254017 254905 256234 257391 257811 257216 255916 254608 253725 253142 252627 252248 252147 252133 251755 250732
53067 250732 249190 247658 246833 247078 247989 248640 248406 247380 246012 244723 243957 244023 244670 245358 246258 248242 251331
53050 251331 253871 254267 253074 252231 252407 252389 251244 249764 249119 249162 248994 248548 248557 249187 249596 248926 247174 245085
$$ packed form
53170B80367q38m73n16o01n27n28r52j717k200j933j276j054j420j589r78k12
53154B63553l32j242j743j182l17j55n72o69j63L15J97l05o07m39R0P78J421J815
53136B60443J836J530J045N48K34J86J96r5o51q79l49M83O77j6p71o87J72J042
53118B64944J481J648J729J618J254Q26M49L4l64m52k92n12j523k712l049k349
53102B62730j404q46m49J74O89M37n31j303j112j96N40N85K37k3k41p55j474j762
53084B55296j192q7Q88J329J157M20n95j300j308q83n83n15l79j01j4l78j023
53067B50732j542j532q25K45R11O51k34j026j368j289p66O6O47O88R00J984L089
53050B51331K540L96j193q43J76j8j145j480o45M3j68m46RO30M09o70j752k089
$$ plain form
53032 245085 243559 243140 243700 244581 245230 245580 245688 245398 244809 244759 246156 248794 251378 252895 253491 253884 254314
53015 254314 254456 254104 253598 253539 254245 255455 256496 256771 256210 255269 254518 254199 254177 254239 254385 254761 255349 255832 255906
52996 255906 255632 255330 255164 255062 255017 255200 255719 256551 257744 259350 260998 261976 262047 261884 262361 263601 265110 266591
52978 266591 268189 269985 271788 273466 275065 276503 277452 277734 277601 277483 277625 278017 278500 278840 278855 278606 278364
52961 278364 278340 278475 278431 277797 276410 274608 272930 271413 269429 266582 263530 261381 260387 259791 259058 258635 259188
52944 259188 260605 262187 263492 264494 265082 264935 263987 262673 261589 261011 260782 260543 260130 259771 259814 260164 260185
52927 260185 259354 257941 256818 256639 257336 258352 259157 259617 260080 261137 263046 265345 267121 267725 267160 265889
52911 265889 264474 263410 263013 263237 263652 263758 263362 262691 262191 262175 262519 262685 262158 260929 259473 258314 257744
$$ packed form
53032B45085j526m19N60Q81O49L50J08k90n89n0J397K638K584J517N96L93M30
53015B54314J42l52n06n9P06J210J041K75n61r41p51l19k2O2J46L76N88M83P4
52996B55906k74l02j66j02m5J83N19Q32J193J606J648R78P1j63M77J240J509J481
52978B66591J598J796J803J678J599J438R49K82j33j18J42L92M83L40J5k49k42
52961B78364k4J35m4o34j387j802j678j517j984k847l052k149r94n96p33m23N53
52944B59188J417J582J305J002N88j47r48j314j084n78k29k39m13l59M3L50K1
52927B60185q31j413j123j79O97J016Q05M60M63J057J909K299J776O04n65j271
52911B65889j415j064l97K24M15J06l96o71n00j6L44J66n27j229j456j159n70
$$ plain form
52894 257744 257849 258455 258925 258463 256962 255332 254578 254705 254974 255100 255556 256622 257787 258488 258943 259728 260869
52877 260869 261951 262902 264006 265151 265723 265474 264967 264977 265835 267538 269975 272720 275082 276867 278759 281419
52861 281419 284438 286713 287739 287907 287585 286557 284621 282214 279957 277845 275272 271839 267911 264311 261579
52846 261579 259568 257780 256086 254935 254664 254737 254038 252009 249207 246591 244534 242782 241159 239966 239660
52831 239660 240390 241866 243560 244979 245843 246055 245573 244434 242990 241912 241693 242106 242378 242017 241353 241180 241956
52814 241956 243459 245168 246820 248576 250651 252811 254289 254331 252963 251082 249585 248464 246986 244740 242187
52799 242187 240016 238365 236934 235656 234821 234606 234844 235269 235699 235978 236024 236006 236212 236769 237651 238834 240062
52782 240062 240654 240140 239098 238692 239245 239904 239949 239632 239339 238800 237880 237433 238363 240228 241718 242264 242222 241694
$$ packed form
52894B57744J05O06M70m62j501j630p54J27K69J26M56J066J165P01M55P85J141
52877B60869J082R51J104J145N72k49n07J0Q58J703K437K745K362J785J892K660
52861B81419L019K275J026J68l22j028j936k407k257k112k573l433l928l600k732
52846B61579k011j788j694j151k71P3o99k029k802k616k057j752j623j193l06
52831B39660P30J476J694J419Q64K12m82j139j444j078k19M13K72l61o64j73P76
52814B41956J503J709J652J756K075K160J478M2j368j881j497j121j478k246k553
52799B42187k171j651j431j278q35k15K38M25M30K79M6j8K06N57Q82J183J228
52782B40062N92n14j042m06N53O59M5l17k93n39r20m47R30J865J490N46m2n28
$$ plain form
52764 241694 240360 238502 237020 236157 235308 234530 235087 237711 241188 243631 244514 244589 244338 243680 243005 243289 244900
52747 244900 247092 249017 250681 252555 254712 256688 257942 258197 257575 256610 255944 255849 256167 256764 257742 259052
52731 259052 260246 260916 261227 261650 262195 262300 261570 260350 259318 258731 258377 258173 258336 258792 258802 257588 255260
52714 255260 252785 251078 250383 250486 251126 252052 252993 253764 254288 254449 254189 253812 253815 254225 254405 253827 252800 252126
52696 252126 252224 252891 253798 254805 255810 256622 257083 257170 257002 256836 256962 257380 257709 257625 257329 257307 257648 258001 258153
52677 258153 258304 258646 259042 259374 259907 260923 262129 262826 262667 261948 261046 259954 258646 257662 257850 259424 261660
52660 261660 263703 265437 267328 269691 272473 275566 278865 281963 284236 285327 285286 284266 282491 280543 279081
52645 279081 277982 276307 273528 270413 268195 267241 267040 267194 267665 268189 268223 267709 267341 267744 268812 270055 271255
$$ packed form
52764B41694j334j858j482q63q49p78N57K624L477K443Q83P5k51o58o75K84J611
52747B44900K192J925J664J874K157J976J254K55o22r65o66r5L18N97R78J310
52731B59052J194O70L11M23N45J05p30j220j032n87l54k04J63M56J0j214k328
52714B55260k475j707o95J03O40R26R41P71N24J61k60l77LM10J80n78j027o74
52696B52126R8O67R07J007J005Q12M61Q7j68j66J26M18L29q4k96k2L41L53J52
52677B58153J51L42L96L32N33J016J206O97j59p19r02j092j308r84J88J574K236
52660B61660K043J734J891K363K782L093L299L098K273J091m1j020j775j948j462
52645B79081j099j675k779l115k218r54k01J54M71N24L4n14l68M03J068J243J200
$$ plain form
52628 271255 272409 273321 273589 273035 271956 270940 270431 270371 270316 270019 269743 269738 269626 268827 267618 267133 268028 269636
52610 269636 270802 271116 270877 270322 269571 269092 269425 270349 270979 270927 270870 271682 273390 275327 276980 278322 279488
52593 279488 280491 281205 281412 280974 280178 279720 280045 280838 281537 282238 283606 285799 287941 288941 288569 287463 286366
52576 286366 285649 285388 285515 285843 286153 286330 286357 286321 286458 287019 287856 288372 288143 287423 286692 285882 284526 282635 280862
52557 280862 279643 278671 277518 276313 275422 274734 273817 272682 271938 272101 273091 274476 275889 277046 277632 277489
52541 277489 276900 276398 276216 276107 275832 275678 276234 277620 279273 280639 281787 283086 284487 285540 286058 286339
52525 286339 286716 287257 288000 289097 290497 291817 292765 293471 294216 295097 296149 297550 299475 301936 304989 308842
52509 308842 313469 318286 322455 325321 326453 325617 323074 319648 316018 312188 308040 304154 301395 299725
$$ packed form
52628B71255J154R12K68n54j079j016n09o0n5k97k76nj12p99j209m85Q95J608
52610B69636J166L14k39n55p51m79L33R24O30n2n7Q12J708J937J653J342J166
52593B79488J003P14K07m38p96m58L25P93O99P01J368K193K142J000l72j106j097
52576B86366p17k61J27L28L10J77K7l6J37N61Q37N16k29p20p31q10j356j891j773
52557B80862j219r72j153j205q91o88r17j135p44J63R90J385J413J157N86j43
52541B77489n89n02j82j09k75j54N56J386J653J366J148J299J401J053N18K81
52525B86339L77N41P43J097J400J320R48P06P45Q81J052J401J925K461L053L853
52509C08842M627M817M169K866J132q36k543l426l630l830m148l886k759j670
$$ plain form
52495 299725 298159 296101 294131 293121 292969 292734 291793 290497 289664 289723 290393 291036 291263 291188 291124 291130 291011 290684 290310
52476 290310 290033 289855 289880 290384 291430 292661 293761 295053 297189 300241 303483 306274 308852 311912 315560
52461 315560 319112 321934 324010 325438 325830 324607 321681 317482 312457 307002 301758 297420 294109 291359
52447 291359 288815 286546 284579 282699 280913 279650 279133 278971 278694 278277 277790 276999 275867 275058 275289 276348
52431 276348 277308 277598 277355 276899 276417 276037 275665 274833 273321 271876 271621 272732 274369 276007 278022 280738
52415 280738 283661 286235 288838 292462 297680 304458 312767 322842 334745 347921 361147 372832 381553
52402 381553 386523 387548 384617 377918 368395 357870 348158 340050 333283 327318 321983 317482 314099 311894
52388 311894 310622 309910 309540 309446 309562 309866 310497 311558 312900 314435 316571 319791 323715 327196 329636 331792
$$ packed form
52495B99725j566k058j970j010j52k35r41j296q33N9O70O43K27p5o4Oj19l27l74
52476B90310k77j78K5N04J046J231J100J292K136L052L242K791K578L060L648
52461C15560L552K822K076J428L92j223k926m199n025n455n244m338l311k750
52447B91359k544k269j967j880j786j263n17j62k77m17m87p91j132q09K31J059
52431B76348R60K90k43m56m82l80l72q32j512j445k55J111J637J638K015K716
52415B80738K923K574K603L624N218O778Q309J0075J1903J3176J3226J1685Q721
52402C81553M970J025k931o699r523j0525r712q108o767n965n335m501l383k205
52388C11894j272p12l70r4J16L04O31J061J342J535K136L220L924L481K440K156
$$ plain form
52372 331792 334857 339119 343913 348493 352395 355165 356395 356162 355110 353954 353090 352635 352560 352741 353042 353418
52356 353418 353808 354024 353918 353665 353778 354730 356499 358398 359465 359285 358453 358007 358440 359605 361532 364709 369278
52339 369278 374522 379699 384968 390881 397266 403307 408720 414124 420189 427054 434805 443938 454867 467337
52325 467337 480728 494731 509363 524468 539637 554624 569544 584588 599791 615168 630834
52314 630834 646818 662908 678830 694530 710166 725929 741956 758306 774821 791135 807107
52303 807107 823165 839824 856799 873046 887825 901249 913471 923885 931680 936803 939689 940269
52291 940269 938078 933340 927088 920054 912196 903645 895330 888130 881964 876274 871016 866595 863152 860496
52277 860496 858558 857447 857212 857988 860224 864305 870084 877114 885159 894018 903018 911284 918558 925418 932681
$$ packed form
52372C31792L065M262M794M580L902K770J230k33j052j156q64m55p5J81L01L76
52356C53418L90K16j06k53J13R52J769J899J067j80q32m46M33J165J927L177M569
52339C69278N244N177N269N913O385O041N413N404O065O865P751R133J0929J2470
52325D67337J3391J4003J4632J5105J5169J4987J4920J5044J5203J5377J5666
52314F30834J5984J6090J5922J5700J5636J5763J6027J6350J6515J6314J5972
52303H07107J6058J6659J6975J6247J4779J3424J2222J0414P795N123K886N80
52291I40269k191m738o252p034p858q551q315p200o166n690n258m421l443k656
52277H60496j938j111k35P76K236M081N779P030Q045Q859R000Q266P274O860P263
$$ plain form
52262 932681 940957 950689 962162 975339 989926 1005584 1021869 1038139 1053935 1069393 1084796 1099714
52250 1099714 1112986 1123631 1131412 1136451 1138730 1138172 1134962 1129544 1122464 1114259 1105349 1095903 1085929 1075436
52236 1075436 1064393 1052660 1040242 1027589 1015346 1003775 992637 981629 970701 960017 949837
52225 949837 940412 931765 923724 916425 910593 906849 904845 903562 902425 901607 901252 901128 901282 902414 905144
52210 905144 909272 914060 918879 923238 926595 928702 929997 931279 933087 935611 938992 943333 948548 954525
52196 954525 961296 968668 975868 981982 986860 991265 996028 1001197 1005920 1008962 1009417 1007295 1003467 998762
52182 998762 993111 985866 976980 967469 958466 950238 942475 935270 929177 924294 919825 914982 910076 906321
52168 906321 904572 904563 905418 906600 908165 910332 913108 916334 919817 923301 926437 928910 930610 931586 931873 931454
$$ packed form
52262I32681Q276R732J1473J3177J4587J5658J6285J6270J5796J5458J5403J4918
52250A099714J3272J0645P781N039K279n58l210n418p080q205q910r446r974j0493
52236A075436j1043j1733j2418j2653j2243j1571j1138j1008j0928j0684j0180
52225I49837r425q647q041p299n832l744k004j283j137q18l55j24J54J132K730
52210I05144M128M788M819M359L357K107J295J282J808K524L381M341N215N977
52196I54525O771P372P200O114M878M405M763N169M723L042M55k122l828m705
52182I98762n651p245q886r511r003q228p763p205o093m883m469m843m906l755
52168I06321j749rQ55J182J565K167K776L226L483L484L136K473J700R76K87m19
$$ plain form
52152 931454 930509 929644 929680 931045 933492 936535 939953 943564 946649 948250 948248 947661 947460 947452 946834 945578 944609 944657
52134 944657 945588 947135 949742 954250 961020 969793 980371 993110 1008594 1027029 1048061 1071140 1095855
52121 1095855 1121782 1148173 1174162 1199449 1224481 1249608 1274285 1297490 1318880 1339101 1358822
52110 1358822 1377865 1395462 1411122 1425004 1437650 1449597 1461171 1472403 1483053 1492719 1500948 1507370
52098 1507370 1511797 1514124 1513941 1510335 1502383 1489983 1474105 1456185 1437412 1418530 1399952 1381849
52086 1381849 1364260 1347323 1331446 1317163 1304775 1294069 1284360 1275038 1266250 1258938 1254015 1251564
52074 1251564 1251051 1252142 1254976 1259732 1266345 1274713 1284790 1296317 1308671 1321187 1333515 1345678 1357982
52061 1357982 1370837 1384466 1398732 1413361 1428108 1442417 1455246 1465826 1474499 1482102 1488463 1492248
$$ packed form
52152I31454r45q65L6J365K447L043L418L611L085J601kn87k01qo18j256r69M8
52134I44657R31J547K607M508O770Q773J0578J2739J5484J8435K1032K3079K4715
52121A095855K5927K6391K5989K5287K5032K5127K4677K3205K1390K0221J9721
52110A358822J9043J7597J5660J3882J2646J1947J1574J1232J0650R666Q229O422
52098A507370M427K327j83l606p952j2400j5878j7920j8773j8882j8578j8103
52086A381849j7589j6937j5877j4283j2388j0706r709r322q788p312m923k451
52074A251564n13J091K834M756O613Q368J0077J1527J2354J2516J2328J2163J2304
52061A357982J2855J3629J4266J4629J4747J4309J2829J0580Q673P603O361L785
$$ plain form
52049 1492248 1492482 1489471 1483876 1475704 1464854 1451987 1438045 1423280 1407591 1391544 1376198 1361978
$$ packed form
52049A492248K34l011n595q172j0850j2867j3942j4765j5689j6047j5346j4220
$$ [...]
##END NTUPLES=NMR SPECTRUM
##END=
