##TITLE=AC1447_MCIAH13256_8011536_DcQFeePQzV
##JCAMPDX= 6.0         $$ Bruker NMR JCAMP-DX V2.0
##DATA TYPE= NMR SPECTRUM
##DATA CLASS= NTUPLES
##ORIGIN= BRUKER
##OWNER= Administrator
$$ 1.72 TOPSPIN		Version 2.1
$$ 2013-07-05 18:22:15.550 -0700  Administrator@X
$$ Compression mode = diff/dup
##.OBSERVE FREQUENCY= 400.02188249412
##.OBSERVE NUCLEUS= ^1H
##.ACQUISITION MODE= SIMULTANEOUS (DQD)
##.ACQUISITION SCHEME= undefined
##.AVERAGES= 8
##.DIGITISER RES= 22
##SPECTROMETER/DATA SYSTEM= spect
##.PULSE SEQUENCE= zg30
##.SOLVENT NAME= COFFEE_meoh
##.SHIFT REFERENCE= INTERNAL, COFFEE_meoh, 1, 14.98509
##AUDIT TRAIL= $$ (NUMBER, WHEN, WHO, WHERE, PROCESS, VERSION, WHAT)
$$ ##TITLE= Audit trail, TOPSPIN		Version 2.1
$$ ##JCAMPDX= 5.01
$$ ##ORIGIN= Bruker BioSpin GmbH
$$ ##OWNER= Administrator
$$ $$ E:\/data/COFFEE/nmr/AC1447_MCIAH13256_8011536_DcQFeePQzV/10/pdata/1/auditp.txt
$$ ##AUDIT TRAIL=  $$ (NUMBER, WHEN, WHO, WHERE, PROCESS, VERSION, WHAT)
(   1,<2013-07-05 18:22:08.081 -0700>,<Administrator>,<X>,<go>,<TOPSPIN 2.1>,
      <created by zg
	started at 2013-07-05 18:21:01.941 -0700,
	POWCHK enabled, PULCHK disabled,
       configuration hash MD5:
       C8 4E 4E 5D D3 5C D8 9E 9F 52 82 E0 59 8A DE 15
       data hash MD5: 64K
       AA A5 EC 08 B5 3F D1 8C B2 F6 2C C4 4B EB 8D EE>)
(   2,<2013-07-05 18:22:11.160 -0700>,<Administrator>,<X>,<proc1d>,<TOPSPIN 2.1>,
      <Start of raw data processing
       efp LB = 0 FT_mod = 6 PKNL = 1 PHC0 = 0 PHC1 = 0 SI = 32K 
       data hash MD5: 32K
       25 ED 5C AE D7 AB 39 44 E5 10 80 27 2B 23 83 7C>)
(   3,<2013-07-05 18:22:11.488 -0700>,<Administrator>,<X>,<proc1d>,<TOPSPIN 2.1>,
      <pk PHC0 = 97.43774 PHC1 = 0 
       data hash MD5: 32K
       8C 12 B2 6B 9E CA DE B8 A8 AB 75 2B 0E 59 5B 1C>)
(   4,<2013-07-05 18:22:11.644 -0700>,<Administrator>,<X>,<proc1d>,<TOPSPIN 2.1>,
      <abs ABSG = 1 
       data hash MD5: 32K
       8E 6F FD 3B A5 76 2C D9 97 78 C5 8B CD 67 00 B9>)
(   5,<2013-07-05 18:22:11.722 -0700>,<Administrator>,<X>,<proc1d>,<TOPSPIN 2.1>,
      <abs ABSG = 2 
       data hash MD5: 32K
       35 BA 3B 27 89 5C EC 18 64 C8 1E F4 02 32 8E FC>)
(   6,<2013-07-05 18:22:11.894 -0700>,<Administrator>,<X>,<proc1d>,<TOPSPIN 2.1>,
      <abs ABSG = 3 
       data hash MD5: 32K
       DA 29 9D 49 9E DF 0D 9B F6 50 FA 5A 60 5E 18 7F>)
(   7,<2013-07-05 18:22:11.956 -0700>,<Administrator>,<X>,<proc1d>,<TOPSPIN 2.1>,
      <abs ABSG = 4 
       data hash MD5: 32K
       17 F6 15 4C F2 54 A1 71 69 23 A2 87 E8 EC 7C 19>)
(   8,<2013-07-05 18:22:12.066 -0700>,<Administrator>,<X>,<proc1d>,<TOPSPIN 2.1>,
      <abs ABSG = 5 
       data hash MD5: 32K
       5C 35 EA F4 11 1D 61 0C CF 94 EA A5 AF A3 94 3E>)
$$ ##END=
$$ 
$$ $$ hash MD5
$$ $$ B0 2C 4A 4B 05 9E A0 E7 AF 81 25 A5 E8 C4 99 D0
##$RELAX= 
##$RELAX= 
##$RELAX= 
##$RELAX= 
##$RELAX= 
##$RELAX= 
##$RELAX= 
$$ Bruker specific parameters
$$ --------------------------
##$DU= <E:\>
##$EXPNO= 10
##$NAME= <AC1447_MCIAH13256_8011536_DcQFeePQzV>
$$ [...]
##$TP= (0..7)
150 150 150 150 150 150 150 150
##$TP07= 0
##$TPNAME0= <>
##$TPNAME1= <>
##$TPNAME2= <>
##$TPNAME3= <>
##$TPNAME4= <>
##$TPNAME5= <>
##$TPNAME6= <>
##$TPNAME7= <>
##$TPOAL= (0..7)
0.5 0.5 0.5 0.5 0.5 0.5 0.5 0.5
##$TPOFFS= (0..7)
0 0 0 0 0 0 0 0
##$TUNHIN= 0
##$TUNHOUT= 0
##$TUNXOUT= 0
##$USERA1= <user>
##$USERA2= <user>
##$USERA3= <user>
##$USERA4= <user>
##$USERA5= <user>
##$V9= 5
##$VALIST= <valist>
##$VCLIST= <CCCCCCCCCCCCCCC>
##$VD= 0
##$VDLIST= <DDDDDDDDDDDDDDD>
##$VPLIST= <PPPPPPPPPPPPPPP>
##$VTLIST= <TTTTTTTTTTTTTTT>
##$WBST= 1024
##$WBSW= 4
##$XGAIN= (0..3)
0 0 0 0
##$XL= 0
##$YL= 0
##$YMAX_a= 642630
##$YMIN_a= -546314
##$ZGOPTNS= <>
##$ZL1= 120
##$ZL2= 120
##$ZL3= 120
##$ZL4= 120
##$ABSF1= 14.98509
##$ABSF2= -5.573092
##$ABSG= 5
##$ABSL= 3
##$ALPHA= 0
##$AQORDER= 0
##$ASSFAC= 0
##$ASSFACI= 0
##$ASSFACX= 0
##$ASSWID= 0
##$AUNMP= <proc_prof1d_extract_pilot.lims>
##$AXLEFT= 0
##$AXNAME= <>
##$AXNUC= <1H>
##$AXRIGHT= 0
##$AXTYPE= 0
##$AXUNIT= <>
##$AZFE= 0.1
##$AZFW= 0.1
##$BCFW= 0
##$BC_mod= 0
##$BYTORDP= 0
##$COROFFS= 0
##$CY= 15
##$DATMOD= 1
##$DC= 0
##$DFILT= <>
##$DTYPP= 0
##$F1P= 0
##$F2P= 0
##$FCOR= 0.5
##$FTSIZE= 32768
##$FT_mod= 6
##$GAMMA= 0
##$GB= 0
##$INTBC= 1
##$INTSCL= 1
##$ISEN= 128
##$LB= 0
##$LEV0= 0
##$LPBIN= 0
##$MAXI= 10000
##$MC2= 0
##$MEAN= 0
##$ME_mod= 0
##$MI= 0
##$NCOEF= 0
##$NC_proc= -8
##$NLEV= 6
##$NOISF1= 0
##$NOISF2= 0
##$NSP= 0
##$NTH_PI= 0
##$NZP= 0
##$OFFSET= 14.98509
##$PC= 1
##$PHC0= 97.43774
##$PHC1= 0
##$PH_mod= 1
##$PKNL= yes
##$PPARMOD= 0
##$PPDIAG= 0
##$PPIPTYP= 0
##$PPMPNUM= 2147483647
##$PPRESOL= 1
##$PSCAL= 4
##$PSIGN= 0
##$PYNMP= <proc.py>
##$REVERSE= no
##$SF= 400.02
##$SI= 32768
##$SIGF1= 0
##$SIGF2= 0
##$SINO= 400
##$SIOLD= 32768
##$SPECTYP= <>
##$SREGLST= <1H.CDCl3>
##$SSB= 0
##$STSI= 32768
##$STSR= 0
##$SW_p= 8223.68421052631
##$SYMM= 0
##$S_DEV= 0
##$TDeff= 65536
##$TDoff= 0
##$TI= <>
##$TILT= no
##$TM1= 0
##$TM2= 0
##$TOPLEV= 0
##$USERP1= <user>
##$USERP2= <user>
##$USERP3= <user>
##$USERP4= <user>
##$USERP5= <user>
##$WDW= 1
##$XDIM= 32768
##$YMAX_p= 462116461
##$YMIN_p= -730849
##$CURPLOT= <Network HP LaserJet P1505>
##$CURPRIN= <$Network HP LaserJet P1505>
##$DFORMAT= <normdp>
##$LAYOUT= <+/1D_H.xwp>
##$LFORMAT= <normlp>
##$PFORMAT= <normpl>
##$SURQMSG= 1
$$ End of Bruker specific parameters
$$ ---------------------------------
##NTUPLES= NMR SPECTRUM
##VAR_NAME=  FREQUENCY,     SPECTRUM/REAL,   SPECTRUM/IMAG
##SYMBOL=    X,             R,               I
##VAR_TYPE=  INDEPENDENT,   DEPENDENT,       DEPENDENT
##VAR_FORM=  AFFN,          ASDF,            ASDF
##VAR_DIM=   32768,         32768,           32768
##UNITS=     HZ,            ARBITRARY UNITS, ARBITRARY UNITS
##FACTOR=    0.250966925370066, 1,           1
##FIRST=     8223.43324360094, 145102,       156611
##LAST=      0,             66945,           26165
##MIN=       0,             -730849,         0
##MAX=       8223.43324360094, 462116461,    0
$$ Real data points
##PAGE= N=1
##DATA TABLE= (X++(R..R)), XYDATA
$$ [...]
19514a10001D6780h936j8419A09154b00255K1648e6831K0362C6117j0751a37931
19502A11753o814c54791Q1404J28981j7862A48906a12599b5742A41702a98394
19491g6695J8397r187o1524B8387J5699f6202B43758a84285N2871j23801j01902
19480c57117J72257C4113b74495A43538E164L50124A21249n5292a64541j18048
19470b82589a6016j07911I9393h5657c8994k6596l6879m9524A5968b60907J06325
19459a54582A73208a2789D2122e337k2135N005r0026k88493h4805D0482a22332
19447a73415d1263i232j18826j56705A57019B6172g405B15433D5849c37409i5163
19435A9609r671Q8456B5591J744a05957A2852a80933M6820L1081j01527A24108
$$ y = [-110001, 46780, -8936, -27355, 109154, -200255, -178607, -56831, -36469, 36117, 25366, -137931, 111753, 104939, -354791, -273387, -144406, -162268, 148906, -112599, -25742, 141702, -198394, -76695, -58298, -67485, -129009, 28387, 44086, -66202, 243758, -184285, -131414, -255215, -357117, -184860, 34113, -274495, 143538, 5164, 355288, 121249, 65957, -164541, -282589, -16016, -123927, 99393, -85657, -38994, -65590, -102469, -151993, 15968, -260907, -154582, 173208, -12789, 42122, -5337, -27472, -22467, -112493, -400986, -84805, 40482, -122332, -173415, -41263, -9232, -128058, -284763, 157019, 26172, -7405, 215433, 45849, -337409, -95163, 19609, 9938, 98394, 25591, 27335, -105957, 12852, -180933, -134113, -103032, -204559, 124108]
19423A98482a44278j70430q252h9587A27952R6573J61979c87545a65922g6316
19412a40766r7634E9421a6625l0542k04859J16467E608a46548A920b95634J39827
19401a55807b6387H7048B5032a31449B40284B1357J99382A6042a05057C20595
19390a40468n5845l11169c9510p9518n6829h4428D5969a46741a1695n33824H1516
19378a52527A91181a52891G7832K06658i5386A72178c83879A0501b94765C3963
19367F8828L4568J34456i5A2449J62800a49645a25A31076a89338K2893b0082A3261
19354A30600b62104B41388J6907a34246M2736A69937P7436i7638C0469d37019
19343a84570J7244j59118F7861a51379B56968a7234j215B84258b74329N7059A42292
$$ y = [198482, -144278, -314708, -322960, -89587, 127952, 224525, 386504, -387545, -165922, -76316, -140766, -238400, 59421, -16625, -47167, -252026, -135559, 5608, -146548, 1920, -295634, -155807, -26387, 87048, 25032, -131449, 240284, 21357, 220739, 16042, -105057, 320595, -140468, -196313, -507482, -39510, -119028, -175857, -84428, 45969, -146741, -11695, -545519, 81516, -152527, 191181, -152891, 77832, 284490, -95386, 172178, -383879, 10501, -294765, 33963, 68828, 103396, 237852, -95, 12449, 175249, -149645, -125, 131076, -189338, -166445, -20082, 13261, 130600, -262104, 241388, 258295, -134246, -91510, 169937, 247373, -97638, 30469, -437019, -184570, -167326, -326444, 67861, -151379, 256968, -17234, -18449, 284258, -274329, -217270, 142292]
19331b50762i2999A45409m6419N1742b5285o9495R716B92071B9073a7456j08221
19320a25677A6949K30880A5554b87881F2721c63150a35252C7530a25288C30838
19309c91838A20116d2780A02283a14851J3494B66915b59886C06451f9864l900
19299g3764j20161O8551A5128K692a26996e0293A1502b65533A38127b17401A32897
19287a5434B08528b42073h6215J4062l8124k23388E1007P912a72789J4123H4681
19275a84850I8148b76776j86675b2709f473l2832q1681C869O8414e9741A8599
19263g2319j34940j45907A13364m4228a69619k61944G5933c49252A77675n7580
19253A20095c68067B5249e61237a59504g980A09926B8986J28143J59146p6202
$$ y = [-250762, -92999, 145409, 98990, 150732, -25285, -94780, -85064, 292071, 29073, -17456, -125677, 16949, 247829, 15554, -287881, 62721, -363150, -135252, 37530, -125288, 330838, -391838, 120116, -42780, 102283, -114851, -101357, 266915, -259886, 306451, -69864, -73764, -193925, -125374, 15128, 17820, -126996, -50293, 11502, -265533, 138127, -217401, 132897, -15434, 208528, -242073, -86215, -72153, -110277, -333665, 51007, 58919, -172789, -158666, 84681, -184850, 98148, -276776, -463451, -22709, -6473, -39305, -120986, 3869, 72283, -59741, 18599, -72319, -207259, -353166, 113364, 69136, -169619, -431563, 75933, -349252, 177675, 120095, -368067, 25249, -561237, -159504, -7980, 109926, 28986, 157129, 316275, 240073]
19243B40073l9272K41141A53737c89902H3955L2391L3266F6508E359a80251f8053
19231D0552i8642j58506A00568b90914a3842p6431I8699A2927a47068f9919j00495
19220a70414H5622a04871B217L5530h0590a4203A6473d1096J730a8976A02170
19208a64239o1258f698j59061J6845D1027h7691A90402e6574J4532A27531c01791
19196b04261j99669a92974o4809B04806a33877A1610c897l2041A23367a30397
19185h4443F875h170r9831K3229A58726e1383I4976h6759F08586b94151a13734
19173b56958n9907K5833A6272b33710b4456q1065B64884b9758k86802e1702A78152
19161H1136a00428B95312m1653a58730M5949k80018a76034O2020B4111J26198
$$ y = [240073, 200801, 441942, 153737, -389902, 83955, 116346, 149612, 66508, 5359, -180251, -68053, 40552, -98642, -257148, 100568, -290914, -13842, -90273, 98699, 12927, -147068, -69919, -170414, 85622, -104871, 2217, 37747, -80590, -14203, 16473, -41096, -39366, -18976, 102170, -164239, -225497, -6698, -165759, -148914, 41027, -87691, 190402, -56574, -42042, 127531, -301791, -204261, -403930, -192974, -257783, 204806, -133877, 11610, -3897, -35938, 123367, -130397, -84443, 6875, -8170, -108001, -84772, 158726, -51383, 94976, -86759, 608586, -294151, -113734, -256958, -316865, -291032, 16272, -233710, -24456, -105521, 264884, -29758, -316560, -51702, 178152, 81136, -100428, 295312, 253659, -158730, -112781, -392799, -176034, -114014, 24111, 150309]
19151A50309a39E4379d0107k46650k05067a12102g16D1232a2920j83881J2074
19140a84727N5201j80671a36123M3000j64521A03866N6562c33671J29047P0683
19130a33941C16511K349a43919f4349n2133j78279a338k10240B60846a2723H0724
19118b62951A72195b29544A06841b7608A95742b9063k77408O2265K2677A89873
19107b42791A61390f3907k54539A33109c56945A73136h2666D07255j68850d1920
19096f05535e2626k9216B900a36574a5703j64429B03643b99234d0780m58310a15081
19084C95641b14843A03793b8951j52509q1006C78772c31151e7287m5547N080j499
19073i9253b2540A52525a33017A11366B3990j522j289a31662O3315g099j77156
$$ y = [150309, -139, 54379, -40107, -286757, -491824, -112102, -716, 41232, -12920, -196801, -184727, -129526, -310197, -136123, -93123, -257644, 103866, 160428, -333671, -204624, -133941, 316511, 318860, -143919, -64349, -116482, -294761, -1338, -211578, 260846, -12723, 80724, -262951, 172195, -229544, 106841, -27608, 195742, -29063, -306471, -244206, -221529, 189873, -242791, 161390, -63907, -318446, 133109, -356945, 173136, -82666, 407255, 238405, -41920, -605535, -52626, -81842, 2900, -136574, -15703, -180132, 203643, -299234, -40780, -499090, -115081, 395641, -214843, 103793, -28951, -181460, -262466, 378772, -331151, -57287, -102834, -97754, -99253, -22540, 152525, -133017, 111366, 23990, 22468, 21179, -131662, -68347, -7099, -184255]
19062a84255r0278m9774d5108O500k11578a6218m75979J27089J65892e2940h228
19050a59013j43261A30743i5362a0482I6364g8953A2102J7684J18849b38917A13393
19038A00875K89714D2884c66497B42172a86603e8475J4627a403j15220j58931
19028b75554A08823O6084f1800A29651K2439J86608q8253a334n4952m2420k7663
19017a26369A63022e7427D2971b86606g1471j53925a00346M3782H0857J47552
19007B28409a23233k16414l2869a73177A57568k4264F5558J4651a5909l60017
18997c75926h3430C79945b54507N7903C2514J1744a89955j2213O9002A30208J84133
18986C14341j17185H2813h1371l5406J7152K3884h222j89896d0669j27681B19632
$$ y = [-184255, -274533, -324307, -45108, -38608, -250186, -16218, -492197, -365108, -199216, -52940, -8228, -159013, -302274, 130743, -95362, -10482, 96364, -78953, 12102, 29786, 148635, -238917, 113393, 100875, 390589, 42884, -366497, 242172, -186603, -58475, -43848, -1403, -116623, -275554, 108823, 174907, -61800, 129651, 152090, 338698, 250445, -1334, -56286, -98706, -126369, 163022, -57427, 42971, -286606, -71471, -225396, -100346, -56564, 80857, 228409, -123233, -339647, -372516, -173177, 157568, 133304, 65558, 80209, -15909, -375926, -83430, 379945, -254507, -196604, 32514, 44258, -189955, -202168, -133166, 130208, 314341, 197156, 82813, -81371, -116777, -99625, -75741, -8222, -198118, -40669, -168350, 219632]
18974g8919j3343A31590P9923b58054O4978k16498J34439e5101B59647A3473P6863
18963I0336Q9100m9145l6216c33783J3529J27252i4765J2847B7686c70908B8042
18951a33518K5594I6323e7j38005f8427A83606h7095D3981K01276b17651h8974
18939G7327h6919H8689L5525J5834E5233a76412B17735b20270K2591h6937G6467
18927A86036c65808A92946h164l11873J49366e2718Q513j90288B0691J3514J9203
18916E3408a38837j88246B04062L54209a45171q328J8343D0512b55758D7890c5562
18904h284c313B3709b40348J05128h910j37790j31786J12472N7308b6529j18787
18893a45316B38479b29991e2050k19553A60197p7595f6633j07129q9995L7627
$$ y = [-78919, -92262, 131590, 211513, -258054, -193076, -409574, -275135, -55101, 259647, 13473, 90336, 179436, 130291, 94075, -333783, -320254, -193002, -94765, -81918, 27686, -370908, 28042, -133518, -107924, 96323, -57, -138062, -68427, 183606, -87095, 43981, 245257, -217651, -88974, 77327, -86919, 88689, 124214, 140048, 55233, -176412, 217735, -220270, -197679, -86937, 76467, 186036, -365808, 192946, -8164, -320037, -170671, -52718, -44205, -234493, 20691, 34205, 53408, -138837, -327083, 204062, 558271, -145171, -153499, -135156, 40512, -255758, 47890, -35562, -8284, -3313, 23709, -240348, -135220, -8910, -146700, -278486, -166014, -108706, -26529, -145316, 238479, -229991, -52050, -271603, 160197, 82602, -66633, -173762, -263757, -226130]
18883b26130O1534N5064A6619M09857A89397G1748j6542a79856C6413b42251q4298
18872c26549A12531K0871a52897k0699l8430H152b84618j83583a65221m7391G5052
18860A94786B1842b60515n0367d5766B3048L8555J2680K2891H733b26117c936
18848c38523B87655A18493d8971b1505j49874I5687g2659I1303l9929j2171b35851
18836e4021A82409l8153A6513h1558K163E3610K8934c9943j90479a08531j61289
18825b69820J07628C81461I4791b88969A54463b1153A14901a80102B16575G6571
18814d42751A44523K70264f779B41016j17631j9567L41052g870I0784b04232n7488
18803b61720A70609Q0196b4465q7911A12447c08196J52918c5348I0626q840i3256
$$ y = [-226130, -164596, -109532, 16619, 426476, 189397, 71748, 55206, -179856, 36413, -242251, -326549, 112531, 133402, -152897, -173596, -212026, 8152, -284618, -468201, -165221, -212612, 75052, 194786, 21842, -260515, -310882, -45766, 23048, 61603, 74283, 97174, 8733, -226117, -3936, -338523, 287655, 118493, -48971, -21505, -171379, 95687, -72659, 91303, 51374, 39203, -235851, -54021, 182409, 144256, 16513, -81558, -79395, 53610, 82544, -39943, -230422, -108531, -269820, -162192, 381461, 94791, -288969, 154463, -21153, 114901, -180102, 216575, 76571, -442751, 144523, 414787, -6779, 241016, 123385, 103818, 444870, -7870, 90784, -204232, -261720, 170609, 250805, -24465, -112376, 112447, -308196, -155278, -35348, 90626, 81786, -93256]
18791B8444K95025a97354J1751B89851A24215d23531R2753A68617i1953k5984
18781a17937N8674B69814d0206j65414g9007A41647d6247j51265N8458b4474j66730
18770a91204k33188J89468i3513j81200H7520f2228E7821J02448b3016p4559j71052
18759b68627L7361h9787A53185B3258K12764e1132J2723l61000b0414j25974E9532
18747B25858e2256p3853r1678E8044a3439A86738B2972n903g7177B2873N0956
18736G3829a84280d1831j07286f0868l7562n317c2636r5437A4154K6296a10625
18724D1911L8627B3669J44069c2524J742C42137g9751A7754a81732c4676E4726
18712c0712A71818a6418j78181m963f4655C0124A0626M9784b13041D5269a02970
$$ y = [28444, 323469, -197354, -185603, 289851, 124215, -423531, -330778, 168617, -91953, -117937, -59263, 269814, -40206, -205620, -79007, 141647, -46247, -197512, -139054, -24474, -191204, -424392, -234924, -93513, -274713, 87520, -62228, 57821, 160269, -23016, -97575, -268627, -231266, -89787, 153185, 23258, 236022, -51132, -38409, -399409, -20414, -146388, 59532, 225858, -52256, -126109, -217787, 58044, -13439, 186738, 22972, 17069, -77177, 22873, 73829, -184280, -41831, -149117, -60868, -98430, -103747, -32636, -128073, 14154, 40450, -110625, 41911, 80538, 23669, 167738, -32524, -30782, 342137, -79751, 17754, -181732, -34676, 54726, -30712, 171818, -16418, -194599, -199562, -64655, 30124, 10626, 60410, -213041, 45269, -102970]
18700B66883G866b11319b9760A47172b14899r2759j24257K10566J0649g1014J5315
18689e5699A67827a85282p9210g2683n5530l156b3775k42193D6543a12335A45098
18677h3112E3077b42108E2267a9644D1806b59832e5947o0191I7520K6103a2347
18665i381l00311G1509c5270A43649b30873a09720j53538B44767j11891b60516
18654A19608a56231D0777b33302b4818a1506j30010B2567e6985J0094j52608j10813
18643c10312A8634b99718h0824P844H6898a66983C01538D2133N8490N860l594
18632A02889a30109H4833a74470H0237R3020b23734i405A3902c9648j53861h1091
18620D748a74541j3351d9529j02275i248r4200A52835F5675c56031A2517a09183
$$ y = [266883, 7866, -211319, -29760, 147172, -214899, -307658, -431915, -221349, -210700, -71014, -55699, 167827, -185282, -264492, -72683, -128213, -131369, -23775, -265968, 46543, -112335, 145098, -83112, 53077, -242108, 52267, -19644, 41806, -259832, -55947, -116138, 97520, 123623, -12347, -9381, -309692, 71509, -35270, 143649, -230873, -109720, -263258, 244767, 132876, -260516, 119608, -156231, 40777, -233302, -24818, -11506, -141516, 22567, -56985, -46891, -199499, -310312, 18634, -299718, -80824, -72980, 86898, -166983, 301538, 42133, 100623, 106483, 102889, -130109, 84833, -174470, 80237, 173257, -223734, -9405, 13902, -39648, -193509, -81091, 4748, -174541, -187892, -49529, -151804, -9248, -103448, 152835, 65675, -356031, 12517, -109183]
18608e9345j2186j0491K3255A56336b079m50991g2481j62696C9094J1360e8531
18596a73773M2483O3263B00842c1546k14854A08065a58667j67831C9289c23714
18585a77951A5585J15027J33128M491a42715o8092i0644j11404B2959a7989D9280
18573C29577a1713A64101a29293A56K78029e98G9685P4652C1548b28602N0377
18562a78225N6864A57585J53894B5750K46663c7213j38992A80859A6995f8581
18551c21728L0641K8527j66055J86891e506B86129b71072J07300l26934F3116
18540b1310k36448k09542f6562o729B66466Q6129D725a22746j26311K0558J05995
18529a22504D8002c04870R1141A40552b7319q7489m12778A70969h4975L0813q763
$$ y = [-59345, -71531, -82022, -58767, 156336, -2079, -453070, -72481, -235177, 39094, 50454, -58531, -173773, -131290, -68027, 200842, -31546, -246400, 108065, -158667, -326498, 39289, -323714, -177951, 15585, 130612, 263740, 268231, -142715, -210807, -90644, -202048, 22959, -17989, 49280, 329577, -11713, 164101, -129293, 156, 278185, -598, 79685, 154337, 31548, -228602, -178225, -121361, 157585, 311479, 25750, 272413, -37213, -176205, 180859, 16995, -68581, -321728, -291087, -262560, -428615, -241724, -5506, 286129, -271072, -163772, -490706, 63116, -21310, -257758, -467300, -66562, -73291, 266466, 352595, 4725, -122746, -249057, -228499, -122504, 48002, -304870, -213729, 140552, -27319, -114808, -527586, 170969, -84975, -54162, -62925]
18518f2925j81979i5088B44275d0715q3134C5944f4246b0651j31732A20377J31462
18507B51839c0276l4849C5069d5693E3634d4372A95779B3492d2276m49455b44477
18495A12261b93749A78455E9932b49790k42628i256q6647B65885b17695K8640
18485a89055d7384j05689c2631l98220I5590b76824c2378r6216L3417G6913J83144
18474B60057h0218n5629B43954c12447a25733C2649K85179j44803e6607k55784
18464c12391E189e2905k0079A17681O5069G897J27557J4882I841O6417a12344
18452H6655f5219A45521A3186k031c20166J15375l85712a96197i7249B85922a19652
18440d06246B02537j00689a11410B47329b71302k9558J04151Q6615D3827b25196
$$ y = [-62925, -244904, -95088, 244275, -40715, -123849, 35944, -64246, -20651, -152383, 120377, 251839, -30276, -65125, 35069, -45693, 53634, -44372, 195779, 23492, -42276, -491731, -244477, 112261, -293749, 178455, 59932, -249790, -492418, -9256, -95903, 265885, -217695, -189055, -47384, -153073, -32631, -430851, 95590, -276824, -32378, -128594, -95177, 76913, 260057, -80218, -135847, 243954, -312447, -125733, 32649, 317828, 173025, -56607, -312391, 5189, -52905, -72984, 117681, 182750, 7897, 135454, 150336, 9841, 76258, -112344, 86655, -65219, 145521, 13186, 11155, -320166, -204791, -590503, -196197, -97249, 285922, -119652, -406246, 202537, 101848, -111410, 247329, -271302, -300860, -196709, -110094, 43827, -225196]
18429B20809a82222B85301F6391O5586a19418o2508A9634c85345a17066C10524
18418a95544k9503B8704f4845N176p8459A03273K56522A50245a39618r9335a12534
18406C3617R2319a00192K4676j93708A72935a57964C7197h3293c944l69162J68249
18395b04857e5666A13445a47087b0978k54354a04668D36799H517b5184r0909D7813
18383e8146j1769p0472A1944b12295M9310F3237b28134N8546K1740M7714d9253
18371g3641j30967A07006a74550I4687D3348a34809A60991D1089i947k03103A05713
18359a21708k6494F9684r152N2053a64010D7966a15088c8366C0885P8173b50109
18347c67962J39200I5677a09802j44747H5933e9485K3320l80378b7611l2866F3145
$$ y = [220809, -182222, 285301, 66391, 131977, -119418, -181926, 19634, -385345, -117066, 310524, -195544, -225047, 28704, -64845, -59669, -138128, 103273, 359795, 150245, -139618, -238953, -112534, 33617, 125936, -100192, -75516, -269224, 172935, -157964, 37197, -83293, -3944, -373106, -204857, -55666, 113445, -147087, -20978, -275332, -104668, 436799, 8517, -25184, -116093, 47813, -58146, -69915, -140387, 11944, -212295, -162985, 63237, -228134, -169588, -147848, -100134, -49253, -73641, -204608, 107006, -174550, 94687, 43348, -134809, 160991, 41089, -9947, -213050, 105713, -121708, -148202, 69684, 60532, 112585, -164010, 47966, -115088, -38366, 30885, 109058, -250109, -367962, -228762, 95677, -109802, -254549, 85933, -59485, -36165, -416543, -27611, -60477, 63145]
18335F6345N9591a10548R450A00469D7550J32306d42510m1851C20825e5140q1937
18324a37077R038F6851d18520a09761G6245c06769O989G1666a6120n9268o3138
18313a38526p9957D03014A72642K49195A23190l9878J7378c86680I2642l0605
18303F2037c1606q1738D7834a6701l31741J49122D13951b99056A02791B6292b6696
18291d3252b0788j411j3341r559k6561B75419n9585b37656N0304L8460H836J44692
18279A53528c69755I191J16653d89967A31348m27a88862l6637P8266k41327a01530
18267i0883a9446k16226D0684K34254c0075A58170a66439C15141i1683o5880O4037
18256i3526d6687j8787F9466P7460F72K15939a52811j87379E4141b20521h3214
$$ y = [66345, 125936, -110548, -101098, 100469, 47550, 179856, -442510, -484361, 320825, -55140, -137077, -128039, 66851, -418520, -109761, 76245, -306769, -299780, 71666, -16120, -75388, -138526, -218483, 403014, 172642, 421837, 123190, 83312, 100690, -386680, 92642, 62037, -31606, -113344, 47834, -16701, -348442, -199320, 413951, -299056, 102791, 26292, -26696, -43252, -20788, -22199, -35540, -45099, -71660, 275419, 215834, -237656, -187352, -148892, 8836, 153528, -369755, 9191, 125844, -489967, 131348, 130921, -188862, -225499, -147233, -388560, -101530, -90883, -19446, -235672, 40684, 274938, -30075, 158170, -166439, 315141, -91683, -157563, -93526, -46687, -65474, 69466, 146926, 672, 216611, -152811, -340190, 54141, -220521, -83214]
18244b00205K8306F3130N1587J4898A7243b12144h7204b3825j32394C04941m959
18233B99982G3381b77029g2438j05578A27378k500K5754b09699Q5626P293G7714
18221a83376D11273D7984b40523j0094b4994l12307a08553l19323a24080q2655
18211b06735A42896a97956R1156k51679B1856a91942D4496L9471f0281r7626B09521
18199A91377J29200G6880b6139m1742A82533b26338E5917a53680j53434N1781
18189b55333J22845A93828I3705a25399N3075B9047c45696c4787E4861a35330
18178e7215j51056L6510O3728B1378Q1649D8224K33951N9359A49179K1213j4871
18167A55521a25908e7838A80660a70074k9452D7937d01107A06086c31984A30682
$$ y = [-200205, -171899, 63130, 114717, 129615, 17243, -212144, -87204, -23825, -156219, 304941, 299982, 73381, -277029, -72438, -178016, 127378, 124878, 150632, -209699, -124073, -116780, 77714, -183376, 411273, 47984, -240523, -250617, -24994, -337301, -108553, -427876, -124080, -206735, 142896, -197956, -106800, -358479, 21856, -191942, 44496, 83967, -60281, -157907, 209521, 191377, 320577, 76880, -26139, -67881, 182533, -226338, 55917, -153680, -307114, -255333, -132488, 193828, 93705, -125399, -72324, 29047, -345696, -34787, 54861, -135330, -57215, -208271, -171761, -108033, 21378, 103027, 48224, 282175, 341534, 149179, 170392, 155521, -125908, -57838, 180660, -170074, -199526, 47937, -401107, 106086, -331984, 130682]
18156B5520M7971b9445M406A64331a79374l1504C98447a16390B0906a02677n9283
18145a61960j67195P8271C4287P8068b48498O7863O5388J2736A25742L3456n3598
18134A05600c63860A36682b07451I4686k9567c09429c3225j81913A4301a7254
18123B56198H2442f3598J875a8414n6220k3219A18974i8238J3510k39474a60941
18111I7521e8204G3102i2364B9689K09126G7148D952c1620j03483g141p3436b0127
18098A64398H742e9735A73444E4247J18477C5359L67172A45423c32738J0288I8891
18086c24777C76203E8351a40288E3890K50530A30809h1551l4781D8738a94021
18075G11K81835e2274b5167j87239h5904A04646a4030k04428F6342K08573h4701
$$ y = [25520, 73491, -29445, -25039, 164331, -179374, -210878, 398447, -116390, 20906, -102677, -161960, -329155, -250884, 34287, 112355, -248498, -180635, -115247, -102511, 125742, 159198, 105600, -363860, 136682, -207451, 94686, 65119, -309429, -33225, -215138, 14301, -17254, 256198, 82442, -63598, -61723, -18414, -74634, -97853, 118974, -98238, -84728, -324202, -160941, 97521, -58204, 73102, -92364, 29689, 238815, 77148, 4952, -31620, -135103, -7141, -80577, -20127, 164398, 8742, -59735, 173444, 54247, 172724, 35359, 402531, 145423, -332738, -322450, 98891, -324777, 376203, 58351, -140288, 53890, 304420, 130809, -81551, -116332, 48738, -194021, 711, 282546, -52274, -25167, -212406, -85904, 104646, -14030, -218458, 66342, 274915, -84701]
18063a5057A83711l4903c81035d1774E9577a22127j79667G3306J99678b31719
18052f0881A40800a03799c4292j55817M3987A32359J02708E63P8055J33918H1010
18040H5769M7637C2432a0236B6348a25703p4856j17691R7305B3853c90086a02104
18028G3561c07382B27170F5929i6562B52679I9336K5623O7479b8567n8812M1413
18017d5966j51332P5598n7259e8433D6242b15405a2710A31270a94864E995c3615
18005c88920a16987o171F3180J16568f5666A68411a21363p8276q4547i4290C03639
17993a12042A03203a51994H548J79982J95666b99407a08495j39622A51123a58718
17982c1446j67255B1829b04658i3671A01547c86328A60117D7908a84077B40297
$$ y = [-15057, 183711, 148808, -381035, -41774, 59577, -122127, -301794, 73306, 272984, -231719, -60881, 140800, -103799, -34292, -190109, -146122, 132359, 235067, 563, 78618, 212536, 81010, 85769, 133406, 32432, -10236, 26348, -125703, -200559, -318250, -220945, 23853, -390086, -102104, 73561, -307382, 227170, 65929, -96562, 252679, 99336, 124959, 192438, -28567, -87379, -45966, -197298, -121700, -178959, -58433, 46242, -215405, -12710, 131270, -194864, 5995, -33615, -388920, -116987, -123158, 63180, 179748, -65666, 168411, -121363, -199639, -284186, -94290, 303639, -112042, 103203, -151994, 8548, 188530, 384196, -299407, -108495, -248117, 151123, -158718, -31446, -198701, 21829, -204658, -93671, 101547, -386328, 160117, 47908, -184077, 240297]
17971B8038R6106P7796B6841a83957J402i963k57272A88152d3627l88847J97002
17960b35472h8111A60143c6823n6726C85770c24724b5622k39705G804a57842K0508
17949a37334C34303c79345F2899b46969F9386K01658J29208A82406a03422r1706
17939a95128c2363l00579k0799f3339r9736L2670J827B33663j15800b00919A47278
17927F0263b67555a25159b8229k53727A57838P2542c12990E7594C705c1605g948
17915a32415B13761a11156j49722a17934o8974p4899A17411h99n8355A15694A4086
17903a58182O3666H0664a56776C0345b11173P6404I1035l6301O0957A2453a67956
17891B12120p5412b64824L5914A4475a09823j20687a01465k1224N4601A49474
$$ y = [28038, 124144, 201940, 26841, -183957, -182555, -9963, -267235, 188152, -43627, -432474, -235472, -88111, 160143, -36823, -93549, 385770, -324724, -25622, -265327, 7804, -157842, -137334, 334303, -379345, 62899, -246969, 69386, 271044, 400252, 182406, -103422, -195128, -32363, -332942, -353741, -63339, -163075, -130405, -128578, 233663, 117863, -200919, 147278, 60263, -267555, -125159, -28229, -281956, 157838, 230380, -312990, 57594, 3705, -31605, -7948, -132415, 213761, -111156, -260878, -117934, -186908, -261807, 117411, -899, -59254, 115694, 14086, -158182, -94516, 80664, -156776, 30345, -211173, -134769, 91035, 54734, 115691, 12453, -167956, 212120, 136708, -264824, -228910, 14475, -109823, -230510, -101465, -122689, -68088, 149474]
17880D4636b18519A33773D3310g6612J3800o2568B2403O2837M8537n3640a85995
17868a22659A21313c78686B65497e3122p0395l04243J68826A01248h0851F9621
17857D1415J99289G2486g3435A88054a21323F0971b5647j22620B59058a25262
17846d6186l0924j24635h8891k7578o6121A80309P5145j9717o4145a43994A60640
17834b5007k22988D6898A401N3189i0548A83734i8452c2645k29262A76231j01
17823A76130P9473j18733a31640C08270F115J1595i520r3702r3865A22295c5392
17811A62733C7596g9903D23609A4164a73753g1354j55227M1164r168o8262f5606
17799a76057A84902j5208G0085b30087G6122l7897a30073j10197P3265D6648c4938
$$ y = [44636, -218519, 133773, 43310, -76612, -62812, -125380, 22403, 85240, 133777, 80137, -185995, -122659, 121313, -378686, 265497, -53122, -123517, -427760, -258934, 101248, -80851, 69621, 41415, 240704, 72486, -73435, 188054, -121323, 60971, -25647, -148267, 259058, -125262, -46186, -77110, -201745, -88891, -116469, -182590, 180309, 255454, 235737, 171592, -143994, 160640, -25007, -247995, 46898, 1401, 54590, -90548, 183734, -98452, -32645, -261907, 176231, 176130, 255603, 136870, -131640, 308270, 6115, 17710, -9520, -103222, -197087, 122295, -35392, 162733, 37596, -79903, 423609, 14164, -173753, -71354, -226581, -185417, -194585, -262847, -65606, -176057, 184902, 169694, 70085, -230087, 76122, 38225, -130073, -240270, -167005, 46648, -34938]
17787B70340A11726E4137P6401l968K20862B1622f8038n6568m6458a7745A13608
17775b40835h8877K3364l23215e4129k22404B10131H2211b06946A31255f2110
17764H9036K90332b73138h8092k35265M9559K3946C08223r1111H624R7545c6593
17752i8091m95968b5443j64511G0578a72993O836F2489a05012A94250G5158P5399
17741A50557a07574G5454R1602J9665a30483d4634I0552I558O8582c6464G0204
17729c09891B52277F8385J70949I734a5728q4149d0727j61063e5185a343n4339
17718e5682B40198c7920j72698d7347j28736f6730H4282i194C95982A87004A1874
17706I1133N01186c8381k5624b25p8756j71024R8552E1982a68205C7661b78571
$$ y = [270340, 111726, 54137, 130538, 126570, 347432, 21622, -68038, -124606, -171064, -17745, 113608, -240835, -88877, -65513, -388728, -54129, -276533, 210131, 82211, -206946, 131255, -62110, 89036, 379368, -273138, -88092, -323357, -273798, -249852, 308223, 217112, 8624, 106169, -36593, -98091, -594059, -25443, -189954, 70578, -172993, -166157, 62489, -105012, 194250, 75158, 150557, -107574, 75454, 167056, 186721, -130483, -44634, 90552, 9558, 78140, -36464, 70204, -309891, 252277, 68385, 239334, 9734, -15728, -99877, -40727, -201790, -55185, -1343, -55682, 240198, -37920, -210618, -47347, -176083, -66730, 84282, -9194, 395982, 187004, 11874, 91133, 592319, -38381, -64005, -225, -78981, -250005, -151453, 51982, -168205, 37661, -278571]
17694G3713K51819e7915j59316E2479P6132e0725o1125A84671n6469l8487C4084
17682F6825a754H2558a85773j17349J9278A46776p3268Q8461m7360a57675I5799
17670c3866j18844A14671J76882p5231d9261G3437P078g3269j30277A03035b09857
17658a53055B22404h2944A44633b80076h9152C51158e71891J99269J74900O028
17648a91694I8069C7127P0875b1974k1482A95958a73738j33448C61043b97374
17637a58068A11101J19807E6237d2712C0773K40607A26008P007a02929L9402m3000
17626a06527j69579B60832A15745b36201B12910p7952r656c17553A04240M0052
17616A44292a84922D58631c4495A29094J63787b05173B06339a13957m1586n5677
$$ y = [73713, 325532, -57915, -217231, 52479, 128611, -50725, -111850, 184671, 128202, 89715, 34084, 66825, -1754, 82558, -185773, -303122, -283844, 146776, 73508, 161969, 114609, -157675, 95799, -33866, -152710, 114671, 291553, 216322, -49261, 73437, 80515, -73269, -203546, 103035, -209857, -153055, 222404, -82944, 144633, -280076, -89152, 351158, -571891, -372622, -197722, -191694, 98069, 37127, 108002, -21974, -43456, 195958, -173738, -307186, 361043, -297374, -158068, 111101, 230908, 56237, -42712, 30773, 271380, 126008, 133015, -102929, -63527, -106527, -276106, 260832, 115745, -236201, 212910, 134958, 125302, -317553, 104240, 144292, -184922, 458631, -34495, 129094, 292881, -205173, 206339, -113957, -155543, -211220]
17606b11220A38454b79832J0451M0794A48462J2075C705h5672k9859e3891G2887
17594d1700A50671N7739a35773J8852J1122k596B22715m6559e9051H0199b2800
17582E0612R048N4412n3479j7272J5854J99058A20197J6210P8673f2442j24152
17571a86594B69963A15260K4876E3660a12632A54338b28063J04921b6104j08010
17561a34114B35708o4960J83108f3523H6543a03140b9269L131I9779i7104k0020
17550a17124B72770j23539J05054j20037H330a06060I5635l724f8278C89719H4178
17538D4776J10461P8276J7297q8901h5424B17907o7023K00693b949j35887A72567
17526A16915f7117D6733K8684P3526k7676N1744a06995A21132P9249o7893K1816
$$ y = [-211220, 138454, -279832, -269381, -228587, 148462, 160537, 3705, -85672, -115531, -53891, 72887, -41700, 150671, 208410, -135773, -116921, -105799, -108395, 222715, 176156, -59051, 80199, -22800, 50612, 59660, 114072, 60593, 43321, 59175, 258233, 120197, 136407, 215080, -62442, -186594, 269963, 115260, 140136, 53660, -112632, 154338, -228063, -123142, -26104, -134114, 235708, 170748, 353856, -63523, 86543, -103140, -29269, -26138, 99779, -97104, -117124, 272770, 149231, 254285, 134248, 8330, -106060, 95635, 91911, -68278, 389719, 84178, 44776, 155237, 233513, 250810, 161909, -85424, 217907, 150884, 351577, -2949, -138836, 172567, 116915, -67117, 46733, 75417, 148943, 121267, 173011, -106995, 121132, 200381, 132488, 154304]
17515A54304L5425H1145J51216N0460B2267J2922Q5383a21808a5963A3432J24421
17504A37853b46394C33486J45162A3346M6360n34g4829a320k34554A31837J16111
17493B47948a18357K4111D3188M0487c1051A99217P8646A20475L1285c48757a17252
17481A37893K2067J84518b2424j54322a4646B60079J382e5362p9206B29246H9978
17469a57891P0886F5267c1266r2909N6138B65395j16001b57455B34300p5922l0006
17458A28372M9801l2978D3703P1550k4176M2867g0608B51340k3144R3884J79709
17447E01789a5672B52904M19835B25470L0377K10229a05427L1941G8783J57170
17437B35953F9769e8399A74740M6407J00237O1599j64607J04192F2040K63465
$$ y = [154304, 189729, 81145, 232361, 282821, 22267, 35189, 120572, -121808, -15963, 13432, 137853, -246394, 333486, 478648, 13346, 59706, 59172, -74829, -1320, -235874, 131837, 247948, -118357, -94246, 43188, 83675, -31051, 199217, 277863, 120475, 151760, -348757, -117252, 137893, 159960, 344478, -22424, -176746, -14646, 260079, 261461, -55362, -134568, 229246, 89978, -157891, -87005, 65267, -31266, -124175, -68037, 265395, 149394, -257455, 234300, 158378, 128372, 178173, 145195, 43703, 115253, 91077, 133944, -70608, 251340, 228196, 322080, 501789, -15672, 252904, 672739, 225470, 255847, 466076, -105427, -73486, 78783, 235953, 69769, -58399, 174740, 221147, 321384, 382983, 218376, 322568, 62040, 325505]
17427C25505N5004j37431K35288k33080J21742E7679b17156B9252K02240J52144
17417C83636j34278M4264o1024K57926N3354k37402Q9375J00200f8917C67929
17406D47547A23806J27385a15442C38327j29207K36013j65497K17111m5077k19498
17396B32172D3165Q0383j273a97886I5021K62394N2074C2161L16924I6022K50426
17385C46448A60069k6813a36081C50297K1865r3023E4954M01007A65199J27443
17375B92642A4354K64034B1456g2155A99755N3913A0375M3489b44158a19913c3380
17363B40482K9180f1258l9715l8274O5931A79173R5467a36400L7178B69862a01677
17351b91698C82665G1741a28857C58884K40980i0872D4568N3124K48201r1359
$$ y = [325505, 380509, 243078, 478366, 245286, 367028, 57679, -217156, 29252, 231492, 383636, 249358, 293622, 232598, 490524, 543878, 306476, 395851, 496051, -68917, 367929, 447547, 123806, 251191, -115442, 338327, 209120, 445133, 279636, 496747, 451670, 232172, 43165, 123548, 122275, -197886, 95021, 357415, 409489, 32161, 349085, 96022, 346448, 160069, 133256, -136081, 350297, 372162, 279139, 54954, 455961, 165199, 292642, 14354, 278388, 21456, -72155, 199755, 253668, 10375, 53864, -244158, -119913, -33380, 240482, 269662, -61258, -100973, -139247, -73316, 179173, 274640, -136400, -99222, 269862, -101677, -291698, 382665, 71741, -128857, 358884, 599864, -90872, 44568, 97692, 345893, 254534]
17341B54534A06622l6676L41811A71553K17806a40545K6967D6584J51889D510
17330A09428K45935i614A25168a08961B09332D7498a79100A32166J04176J94717
17320D31059f7721B07741R9722a06400B59200B1230J02036A0506J70895n6919
17310A24482J00325a31621C31159j18596h9580A40180L11451B04610r3353J61337
17300B72594a28664B08801p8504B7476M9429f8225C05311m1609k2791l2300G5137
17288A35562K01064A56742i2441A04238C080J9018b2322m5007I4253Q0932R1291
17277B66476J24280j73884M914K51825a58035A10404K73878C0833J61712l5920
17267A56625R2722q3110c3254C42128N7175A77172R272H535K45859H5084J691
$$ y = [254534, 106622, 69946, 411757, 171553, 389359, -140545, -113578, 46584, 198473, 4510, 109428, 355363, -9614, 125168, -108961, 209332, 47498, -179100, 132166, 236342, 431059, -67721, 207741, 307463, -106400, 259200, 21230, 123266, 10506, 181401, 124482, 224807, -131621, 331159, 212563, -89580, 140180, 451631, 204610, 111257, 272594, -128664, 208801, 130297, 27476, 76905, -68225, 305311, 263702, 240911, 208611, 75137, 135562, 336626, 156742, -92441, 104238, 3080, 22098, -22322, -67329, 94253, 175185, 266476, 390756, 216872, 221786, 473611, -158035, 110404, 384282, 30833, 192545, 156625, 249347, 166237, -33254, 342128, 399303, 177172, 186444, 8535, 254394, 85084, 86775]
17256H6775K64145a39261B85221o0461c9228A28968b4599C4049K22753M4887C3759
17244A28061J95089j39853J27699a88127B16070o7085K2534o4032a75399b5754
17233c3528A10997J254D3056R1598K27469A15175E602O2315L45981n6535A70065
17221B84027J23576E3639d709E67110k81600G8174K32310q0811r9474J50455e1355
17209C0086L51658Q8229o1624c2119B53867L4010I3675J25565L2667J47690A04184
17197B01479R4484p1562J03783H4501K20330J209p0903M06023k23280K4941a7735
17185E75966Q7888B98086j23037J40421l1295K75069A58648C1230K09775O7637
17175C08642j43951P4950J6262N9718K9237K05375P2094D1453K1091K99167L47701
$$ y = [86775, 350920, -139261, 285221, 224760, -39228, 128968, -24599, 34049, 256802, 301689, 33759, 128061, 323150, 183297, 310996, -188127, 216070, 148985, 171519, 107487, -175399, -25754, -33528, 110997, 112251, 43056, 134654, 362123, 115175, 5602, 67917, 413898, 357363, 170065, 284027, 407603, 53639, -4709, 567110, 285510, 78174, 310484, 229673, 130199, 280654, -51355, 30086, 381744, 469973, 408349, -32119, 253867, 287877, 93675, 219240, 251907, 399597, 104184, 201479, 295963, 224401, 328184, 84501, 304831, 306040, 235137, 641160, 417880, 442821, -17735, 575966, 663854, 298086, 175049, 315470, 284175, 559244, 158648, 31230, 241005, 308642, 164691, 239641, 255903, 315621, 344858, 550233, 622327, 41453, 62544, 361711, 709412]
17164G09412C17470G3037J75442b2228C40006N1898I7477b28579C27712A57334
17153E1302M78270k12361O1504m7280j37084O7431j5594e770G1504N24791M5823
17142F42118A39109M05339Q942B52891K90777B44816Q4324J17926N8671j31510
17132C74227J64022A99267L5704K25394j21219l3853J41958k19751N1488q1685
17122A97303J58774J23696p5438J31131A54210O9958J13475K38832q5741j05035
17112C85699K3380d7421C54455j26785L10760j41554K55399k17169J14523k45456
17102C04173j12713K04645l2995L93893l21280A38127N24463k63738o5502L13848
17092F47198B72495J75163k21133q5541K01860K69159l1161j65717j90649J27654
$$ y = [709412, 317470, 73037, 248479, -22228, 340006, 391904, 97477, -228579, 327712, 157334, 51302, 529572, 317211, 378715, 331435, 194351, 261782, 246188, -5770, 71504, 596295, 642118, 139109, 544448, 553390, 252891, 543668, 244816, 329140, 447066, 505737, 374227, 538249, 199267, 234971, 460365, 339146, 305293, 447251, 227500, 278988, 197303, 356077, 479773, 404335, 535466, 154210, 224168, 337643, 576475, 490734, 385699, 409079, -47421, 354455, 227670, 538430, 396876, 652275, 435106, 549629, 304173, 191460, 396105, 363110, 757003, 435723, 138127, 662590, 398852, 333350, 647198, 272495, 447658, 226525, 140984, 342844, 612003, 580842, 415125, 224476, 352130]
17082C52130A51401K18144N5994j20071l7123R5288L48176k68455J33877j91826
17072C85405m382j53268L86879k37284L08355k36638K19640j52874k1438P3366
17062E67761o8369J52744k17275L4203J22018J18624B10088M36677j83965R3730
17052E56530j92848L45208l38805K51900j40939L4907J71911j00771B52420L97160
17042F49580J18098k35040J18728J12459l64587J65845K5480k8378J46238j85435
17032E22988m7535m9347J42158J40237l02087j7166J84180J44146k02295O8611
17022E83890o3338N4695R5817l31294K65605l0490N7091j11927J24675J3193L13705
17011I71622l27279j80592R5674R208L26175j56249l15267M61946l31583K51473
$$ y = [352130, 151401, 369545, 425539, 305468, 268345, 363633, 711809, 443354, 577231, 385405, 381023, 227755, 614634, 377350, 685705, 449067, 668707, 515833, 494395, 567761, 499392, 652136, 434861, 469064, 591082, 709706, 210088, 646765, 462800, 556530, 363682, 708890, 370085, 621985, 481046, 515953, 687864, 587093, 252420, 649580, 767678, 532638, 651366, 763825, 399238, 565083, 590563, 562185, 708423, 522988, 475453, 426106, 568264, 708501, 406414, 389248, 573428, 717574, 515279, 583890, 520552, 575247, 671064, 339770, 605375, 574885, 631976, 520049, 644724, 657917, 971622, 644343, 463751, 559425, 568633, 894808, 738559, 423292, 885238, 553655, 805128]
17001H05128R8183J50474l42506L27250l10029k06546K27986K72885m85012L85450
16991I23263O079j41149r9888M1342k43532M8754K27941J90063k53177n918L29557
16980A023335k78104K60550C99611O15892j88937R8559n4316J20297J22114M059
16970A117279r7633n8063j92929J26054J36269M9392j31808J01573j27355j16719
16960H06060M81018k48720j77355K57319j74192j25166L96714j82392K2585J80468
16950A236339j50805L6631j1024K59224J13444o30094k4047P0371N18263R6405
16940A514707l05247J19865q1915l366j58551j09507K23389l4218Q1799O2059
16930A309015J39674j87652l0838Q7203k5116R4824K67319l21047m7561K50483
$$ y = [805128, 903311, 1053785, 711279, 1038529, 728500, 521954, 749940, 1022825, 537813, 923263, 929342, 788193, 688305, 729647, 486115, 534869, 762810, 952873, 699696, 693778, 1023335, 745231, 1005781, 399611, 1015503, 826566, 925125, 870809, 991106, 1113220, 1117279, 1019646, 961583, 768654, 894708, 1030977, 1080369, 948561, 1050134, 922779, 806060, 1287078, 1038358, 861003, 1118322, 944130, 818964, 1215678, 1033286, 1055871, 1236339, 1085534, 1122165, 1111141, 1370365, 1483809, 853715, 829668, 900039, 1418302, 1514707, 1209460, 1329325, 1247410, 1244044, 1085493, 975986, 1199375, 1165157, 1246956, 1309015, 1448689, 1261037, 1230199, 1317402, 1292286, 1387110, 1654429, 1333382, 1285821, 1536304]
16920A536304j78678J31410L396m8186q1318J29337J52074L43623k57537o0593
16910A669832l67906N58015k76414R8772M7318J49073l6870n0373k62748K06138
16900A734837k17418J08468L19170Q6208q5487l38513K78339J76132o3298q1761
16890A916677M4968l8945M5773M1534k4477j07445N55783K8361k38278J6413J68916
16879B409280m27338M12924P7070J32727j26273M1530j55690J35799j29145q6166
16869B284718M86759l29174N33159k23876L52168m23029K41407q956o0837J36855
16859B989194J13322j90924N3582Q9708J00865l4219j48309M43888n5785J92904
16849C554226m99449Q08282k13587P3850O8924o450L11820k71804J16388M26036
$$ y = [1536304, 1357626, 1489036, 1492432, 1444246, 1362928, 1492265, 1644339, 1987962, 1730425, 1669832, 1301926, 1859941, 1583527, 1682299, 1729617, 1878690, 1841820, 1791447, 1528699, 1734837, 1517419, 1625887, 1945057, 2031265, 1945778, 1607265, 1885604, 2061736, 1998438, 1916677, 1961645, 1922700, 1968473, 2010007, 1985530, 1878085, 2433868, 2462229, 2223951, 2240364, 2409280, 1981942, 2394866, 2471936, 2604663, 2478390, 2519920, 2364230, 2500029, 2370884, 2284718, 2771477, 2442303, 2975462, 2751586, 3103754, 2680725, 2922132, 2913176, 2852339, 2989194, 3102516, 2911592, 2965174, 3054882, 3155747, 3121528, 2973219, 3417107, 3361322, 3554226, 3054777, 3863059, 3649472, 3723322, 3792246, 3785796, 4097616, 3825812, 3942200, 4368236]
16839D368236o7783k18958K39689K59119o17401L14687M14639l29928L5024O83025
16829E080349l10398k8186n4572N05521J49646r4535J48811q1587J88828L44149
16819E848026k22353L01000J08173J28928j5506J95160p0659l8632L43649M07271
16809F985057j05173M79733M31783m35992P6515Q58271k64462M00425q450R4562
16799H512269L35110n2739J32413L39557j82249O39520J59570M22917K07456K52144
16789A0765968K69353N22390r1365P56472J04856M84484N05950J94725L74151
16780A3886984O84637M9748N74730K70366O97488M55455N48993L07318P78008
16771A8253727O37892N68784M17687J328024L03963Q02142M53331J284563O75540
$$ y = [4368236, 4300453, 4081495, 4321184, 4580303, 3962902, 4277589, 4692228, 4362300, 4397324, 5080349, 4769951, 4741765, 4687193, 5192714, 5342360, 5247825, 5396636, 5315049, 5503877, 5848026, 5625673, 5926673, 6034846, 6163774, 6148268, 6343428, 6272769, 6234137, 6577786, 6985057, 6879884, 7359617, 7791400, 7355408, 7431923, 8290194, 8025732, 8426157, 8417707, 8512269, 8847379, 8794640, 8927053, 9266610, 9084361, 9723881, 9883451, 10306368, 10513824, 10765968, 11035321, 11557711, 11466346, 12222818, 12327674, 12812158, 13318108, 13512833, 13886984, 14571621, 14621369, 15196099, 15466465, 16163953, 16619408, 17168401, 17475719, 18253727, 18891619, 19460403, 19878090, 21206114, 21510077, 22312219, 22765550, 24050113, 24725653]
16762B4725653J086607J152878P31068J405607J299431J324025J461543R41389
16754C4128201J618789J605586J708401J670716K216085J930896J835186K127953
16746D8841813K485081K649891K951150K642158L391573K919728L874592L757733
16738G3513719M090316L863038M570148M542763N344919M704818N634030N598895
16730A11862646N589718O251323N830461O002769O175439N686782N541206N426672
16722A58367016M891972L914853L317486K513988J899541P10029J02046j358799
16714A74358132k014593l158437l698662m800163m785227n078573n989578o416862
16706A38416037n763020o206896o673317n448373o134885n251693n583869n114296
$$ y = [24725653, 25812260, 26965138, 27696206, 29101813, 30401244, 31725269, 33186812, 34128201, 35746990, 37352576, 39060977, 40731693, 42947778, 44878674, 46713860, 48841813, 51326894, 53976785, 56927935, 59570093, 62961666, 65881394, 69755986, 73513719, 77604035, 81467073, 86037221, 90579984, 95924903, 100629721, 106263751, 111862646, 117452364, 123703687, 129534148, 135536917, 141712356, 147399138, 152940344, 158367016, 163258988, 167173841, 170491327, 173005315, 174904856, 175614885, 175716931, 174358132, 172343539, 169185102, 165486440, 160686277, 155901050, 150822477, 144832899, 138416037, 132653017, 126446121, 119772804, 114324431, 108189546, 102937853, 97353984, 92239688]
16698I2239688n147751m415631m600144m116030l713913l791336l336841l321993
16690E9796049l087550k891129k533888k473619k617787j847699k343953j777722
16682D0222702j976657j529222j564660j533566j190042j578830j301085j188697
16674B8359943j467651p39795q59160j215577r50010p87158r59894n07206r18462
16665A9955030N8499j258344o86271j021888j73975o17227n37237m71332k04488
16656A5042767p98150l24944k80930n41778m54503N5408m05424o62180J83772
16647A1814038p07664o0866n17033J41944o82549k45660j88822k49253k15559
16638I088576m31340j33939l37293K61967n02494j78714j75031j94424k26165
$$ y = [92239688, 87091937, 82676306, 78076162, 73960132, 70246219, 66454883, 63118042, 59796049, 56708499, 53817370, 51283482, 48809863, 46192076, 44344377, 42000424, 40222702, 38246045, 36716823, 35152163, 33618597, 32428555, 30849725, 29548640, 28359943, 26892292, 26152497, 25293337, 24077760, 23127750, 22340592, 21380698, 20873492, 19955030, 20013529, 18755185, 18068914, 17047026, 16873051, 16255824, 15718587, 15247255, 15042767, 14244617, 13919673, 13638743, 13096965, 12642462, 12697870, 12292446, 11630266, 11814038, 11106374, 11045508, 10528475, 10670419, 9987870, 9742210, 9553388, 9304135, 9088576, 8657236, 8523297, 8186004, 8447971, 7945477, 7766763, 7591732, 7397308, 7171143]
16629G171143J11585m86705K17355n24637J16793l20911l40042J95635j13023
16620F027193J99413m01926O9507l49513j84001k89563J67549k51208J4517m32264
16610D569704N3505R898j61596J09697l14504J48599J73358l92713j37823l08455
16600C749670K74712o9676m2211l42647N8769R2709p322l48774j61428J47660
16590C351462j26789k59296J97006K16676l21941J42339n1543k27698J74334j81448
16580B913102K7924J65168J45815l04379o3781k59606k54908N28192j53443l94784
16570B349300j09805K75792o743k11840k59443M24206M0265m71744K28549p5889
16560B182648J29095m94721L30402J54832q3715k33599n2443K16287k53354N2704
$$ y = [7171143, 7282728, 6796023, 7013378, 6488741, 6605534, 6284623, 5944581, 6140216, 6027193, 6226606, 5824680, 5894187, 5544674, 5360673, 5071110, 5238659, 4987451, 5001968, 4569704, 4623209, 4633107, 4471511, 4581208, 4266704, 4415303, 4588661, 4195948, 4058125, 3749670, 4024382, 3954706, 3912495, 3569848, 3628617, 3721326, 3714004, 3365230, 3203802, 3351462, 3224673, 2965377, 3162383, 3379059, 3057118, 3199457, 3147914, 2920216, 3094550, 2913102, 2941026, 3106194, 3252009, 2947630, 2883849, 2624243, 2369335, 2897527, 2744084, 2349300, 2239495, 2515287, 2508544, 2296704, 2037261, 2461467, 2501732, 2029988, 2258537, 2182648, 2311743, 1817022, 2147424, 2302256, 2218541, 1984942, 1932499, 2148786, 1895432, 1948136]
16550A948136j91433K43182j8119n7858j81063j63347K02832r6414J45186m79014
16540A352088M60980l30724K84020l79558M02872m49953M43395l33521k49985
16531A199614K46542K13905J20611k20006k81788j981K70345j11109J38691l63580
16521A211244J60727K95688k38725l34637J27165R6895n50541L67427J29925n45201
16511G19967Q35497j78969k29833p9727j06649L81182n1121M4425k33482J72223
16501A273513j83233P3527j06153J097N5686M3598k6036l22489J08363R9797l1971
16490I85699k17618Q9015J9128K5998p293j56956L59634k69843K55209k34200
16480H48773K42376k35362K12863o1449j53493J78371k75277J27451m6981l29371
$$ y = [1948136, 1756703, 1999885, 1981766, 1923908, 1742845, 1579498, 1782330, 1685916, 1831102, 1352088, 1813068, 1482344, 1766364, 1386806, 1789678, 1339725, 1783120, 1449599, 1199614, 1446156, 1660061, 1780672, 1560666, 1278878, 1276897, 1547242, 1436133, 1574824, 1211244, 1371971, 1667659, 1428934, 1094297, 1221462, 1318357, 767816, 1135243, 1265168, 719967, 1555464, 1376495, 1146662, 1066935, 960286, 1341468, 1290347, 1334772, 1101290, 1273513, 1090280, 1163807, 1057654, 1058751, 1114437, 1158035, 1131999, 809510, 917873, 1017670, 985699, 768081, 857096, 876224, 902222, 894929, 737973, 1097607, 827764, 1082973, 848773, 1091149, 855787, 1068650, 1007201, 853708, 1032079, 756802, 884253, 837272, 507901]
16470E07901J54681K85229j96080K9578K96710j30265J00967K356l36406r9875
16460F14796N5217K85643j91783J18037j97146n7838J6854k7346k68859K08953
16450E56528L90506l05877k1881j05476k43561O67281k73977j35194N882J44845
16440F79076l11361L62070j58490k76525O53772m31101L29205l98913J79704j07173
16430E20264j20393p91J91821k88563K16961m8802K27258j39928j1323l2546M8475
16419E62433B68414J78676B18133L09434M6139K9454J56969k41845M01723B91857
16408D07662j8363P9051R7304B80245J47993J12765L02138k31443j11327j19851
16398C80520j58155L74788O1493A31063L03354H0660M60345k25806M08236N9813
$$ y = [507901, 662582, 947811, 751731, 781309, 1078019, 947754, 1048721, 1051077, 714671, 614796, 670013, 955656, 763873, 881910, 684764, 626926, 643780, 616434, 347575, 556528, 947034, 641157, 619276, 513800, 270239, 937520, 663543, 528349, 534231, 679076, 367715, 729785, 571295, 294770, 948542, 517441, 846646, 447733, 627437, 520264, 399871, 399080, 590901, 302338, 519299, 470497, 697755, 557827, 546504, 513958, 562433, 268414, 447090, 218133, 527567, 573706, 603160, 760129, 518284, 920007, 291857, 407662, 389299, 468350, 565654, 280245, 428238, 541003, 843141, 611698, 500371, 380520, 222365, 597153, 658646, 131063, 434417, 80660, 541005, 315199, 723435, 783248]
16388G83248C52092J76946f8067A64722K94599N2938r205k08044A32371K39292
16378C71663M3748k4702j33995K6255A02178N27901k6679A27032K04260L45684
16368F76976C6476M29731A11343J3876J72611K85813k00891j89022e2635C28162
16357E45786A63596F1848J43285K8299M5271L1914R3289n7910K65023j89693j90999
16346B30327O6859K07193m9551j79250R7847J7252j47949B9576K47363j8183J17741
16335C76497j66991J68468P9065q9701A40089l8048b34985a2275B94862r8428
16325A96434B5492J42338j8249J37758P3482M9976j79743j2510I0449B0170L27444
16314C47614L2721K54457k44226A65023J77207A62043K61709F0809L95717E2273
$$ y = [783248, 352092, 529038, -68067, 164722, 459321, 512259, 503054, 295010, 132371, 371663, 415411, 390709, 256714, 282969, 102178, 630079, 603400, 127032, 331292, 676976, 36476, 466207, 111343, 125219, 297830, 583643, 382752, 193730, -52635, 328162, 545786, 163596, 61848, 205133, 233432, 278703, 310617, 403906, 345996, 611019, 421326, 230327, 297186, 504379, 454828, 275578, 373425, 390677, 242728, 29576, 276939, 258756, 376497, 209506, 377974, 457039, 367338, 140089, 102041, -234985, -12275, 294862, 196434, 25492, 167830, 149581, 287339, 360821, 410797, 231054, 218544, 90449, 20170, 347614, 380335, 634792, 390566, 165023, 342230, 162043, 423752, 60809, 456526, 52273]
16303C44255n5462m6717l2686o5958K96523j50966M1584k3806K2167o7049q7103
16292A74782A3318L65741j47728K40636i484B62074m3602E379J96323H5579L64917
16281D50496l3559J6591A88240M6706I8474K54475A01153J71251B9548M90315
16271E19863a02069H8272J91548j20781J8347K80491A09143J68828J06650A9542
16260B31561R5133L9683A62779L512k6656K167j4923K2780R5617K3246n3033J93432
16248D08921D3635L11773j48320c0045A69817N8266g9012E9292J55784K15077
16238D30153A47540a1482D16131C5702N0781J15756J34462J62666F0349J23572
16228A83921j0286n6050O2194o8558h1147A7942b36376A49506f5687b5500C6024
$$ y = [344255, 288793, 242076, 209390, 143432, 439955, 288989, 330573, 306767, 328934, 261885, 174782, 13318, 379059, 231331, 471967, -9484, 262074, 218472, 5379, 201702, 85579, 450496, 416937, 433528, 188240, 234946, 98474, 352949, 101153, 272404, 29548, 519863, -102069, 88272, 279820, 159039, 177386, 457877, 109143, 277971, 384621, 19542, 231561, 326694, 366377, 162779, 166291, 139635, 141802, 126879, 149659, 245276, 268522, 215489, 408921, 43635, 355408, 207088, -30045, 169817, 228083, -79012, 59292, 215076, 430153, 147540, -11482, 416131, 35702, 86483, 202239, 336701, 499367, 60349, 183921, 173635, 117585, 179779, 111221, -81147, 17942, -236376, 149506, -65687, -25500, 36024]
16216A16679L58636C1995J32318Q6148i2239I4674O505J60774Q6898j31210J43771
16205C61412n3417a4501k6644B41797F1507b2891B75950N2357j02663A04856i1827
16193A37920J4586O888j17a61105d773B13218F9122C4347J3368j6431J20224J30615
16181B82123e4269G868b80443A5420e8540D84443A79083C6278b43253E3630L9758
16170I3388K00693a73294H3232k9066b88286E5201b06305A02416A2230a16296
16159d5019l0506j95045C0608L5840J12516p5237e2317C57067K3942r959A18517
16147c7889B88589b4354R970j4333B92426a01632E8198a70307P6138j62038B05746
16135b17369A97817a90983d4794m8427d4567A07619J83462j35083e3401C20155
$$ y = [116679, 475315, 31995, 164313, 250461, -92239, 94674, 101179, 261953, 348851, 217641, 361412, 307995, -14501, -41145, 241797, 61507, -22891, 275950, 328307, 225644, 104856, -91827, 137920, 152506, 159394, 159277, -161105, -4773, 213218, 69122, 34347, 47715, 31284, 151508, 282123, -54269, 7868, -280443, 15420, -58540, 484443, 179083, 36278, -243253, 53630, 93388, 294081, -173294, 83232, 54166, -288286, 55201, -206305, 102416, 12230, -116296, -45019, -75525, -270570, 30608, 66448, 178964, 103727, -52317, 357067, 381009, 371050, 118517, -37889, 288589, -24354, -14384, -28717, 292426, -101632, 58198, -170307, -94169, -256207, 205746, -217369, 197817, -190983, -44794, -93221, -44567, 107619, 291081, 155998, -53401, 320155]
16124D2896i095A87847H7548a75701A67829d0539C28077a54972B5762f9128e74
16112e7716B07278a43461b7562q9239B14927J9080H4755b41885I3496A1517K01160
16101B12677J39248A3547M6896N2693J4440C9239a83489O1736B073e4610A76133
16089c4842k49589f3529K6663e506j28099c7829r3131j06689M6167G2804N4416
16078A27220O7254a37272O3685j2436c8834C57937c29032a9491j61763R0282A13258
16066E9193K848q588b28539g0288C69095a3031B31999a38517k26940Q3874Q2118
16055a99465j57507A93987G1679g5594C0793d23983a15960H6524f14G1679l5013
16044C6666L06001F6197j3000J04758e3841j07594j36325E5127B7485a1813A19043
$$ y = [42896, -9095, 187847, 87548, -175701, 167829, -40539, 328077, -154972, 25762, -69128, -574, -57716, 207278, -143461, -27562, -116801, 214927, 234007, 84755, -241885, 93496, 11517, 212677, 351925, 13547, 60443, 113136, 127576, 39239, -183489, -121753, 2073, -54610, 176133, -34842, -284431, -63529, -36866, -5506, -133605, -37829, -130960, -237649, -191482, 72804, 127220, 194474, -137272, -73587, -86023, -38834, 357937, -329032, -19491, -181254, -90972, 113258, 59193, 62041, 53453, -228539, -70288, 369095, -13031, 231999, -138517, -365457, -281583, -199465, -356972, 193987, 71679, -75594, 30793, -423983, -115960, 86524, -614, 71679, 36666, 342667, 66197, 53197, 157955, -53841, -161435, -297760, 55127, 27485, -11813, 119043]
16032b12334D080a85687c6727l7929k87287G4129P210b17581k2773Q077g8473
16020A52024E3428L9091h3782C87082B7839J51105a53203j57740a4260l6872F33510
16008f6865j02680F9822M9368L0851f3779j5319I4935a57997I5120J4439c15464
15996c7810C46610i145o9576A6755b69537A14006Q9699a44537k6148A72427D2545
15984B93519q9101J35109r1230K93958A18214K1265J93581j32744a92390A21868
15973G7675b49037B44880E4246J33773m4359a67887n3989c9277C57110a16074
15962A22740h0150j27735d7018l3189E0115e5929B45253b91444p3835A44240j7217
15951A27023C8907a8670B26577o5674E4076g1885j12697j20129A05835D2663a98096
$$ y = [-212334, 4080, -185687, -36727, -74656, -361943, 74129, 81339, -217581, -240354, -232277, -78473, 152024, 53428, 92519, -83782, 387082, 27839, 178944, -153203, -310943, -14260, -51132, 633510, -66865, -169545, 69822, 119190, 150041, -63779, -79098, 94935, -157997, 95120, 109559, -315464, -37810, 346610, -9145, -78721, 16755, -269537, 114006, 203705, -144537, -170685, 172427, 42545, 293519, 204418, 339527, 248297, 542255, 118214, 139479, 333060, 200316, -192390, 121868, 77675, -249037, 244880, 54246, 188019, 143660, -167887, -221876, -39277, 357110, -116074, 122740, -80150, -207885, -47018, -80207, 50115, -55929, 245253, -291444, -365279, 144240, 127023, 38907, -18670, 226577, 160903, 54076, -71885, -184582, -304711, 105835, 42663, -198096]
15939b5360m3680h216j28656I5335d1579I0164J6272l3056a34180O7083j65494
15928b32591R0488c3735m0127A70212J62921b7090Q642j05468j52323D3310R0403
15917A33713b35981M9169r3605C9444b28788f5332k79853A21289C8290b0306k2125
15906d2431B00337a33456b4591l66709J88662e3248A43124m0634e3065n02458
15896e55523F4094a28904H6093c5147r3828G3860f4293k34547C4110O6587a50880
15884b21525c9812g780B12904D4060b36810M7464A91685a44114j37939F8151b35214
15872A23711b93037R9272B72080c09899a31727J9859j62664F3169i4148L9208
15862e4940j26372l4619n6679H8430P1712F5659c0491j09638C32633F4834k0863
$$ y = [-25360, -69040, -8216, -136872, 95335, -41579, 90164, 106436, 73380, -134180, -67097, -232591, -142103, -33735, -73862, 170212, 333133, -27090, -18448, -123916, -276239, 43310, 133713, -235981, -186812, -280417, 39444, -228788, -65332, -345185, 121289, 38290, -20306, -42431, 200337, -133456, -24591, -391300, -202638, -53248, 143124, 102490, -53065, -555523, 64094, -128904, 86093, -35147, -128975, 73860, -64293, -298840, 34110, 100697, -150880, -221525, -39812, -7780, 212904, 44060, -236810, -189346, 191685, -144114, -282053, 68151, -235214, 123711, -293037, -193765, 272080, -309899, -131727, -111868, -274532, 63169, -94148, -54940, -181312, -215931, -272610, 88430, 160142, 65659, -30491, -140129, 332633, 64834, 43971]
15851D3971J02996N2963D1963G976N1267b236B38691a94632p3290B12582a72036
15839B29566a46046k0865A75866j1204M048e6110j8272A92806I268i997j3859
15828b3856k79100a07199j58335l809A03684i6135q825L9076E0146b89369Q8152
15817b01217h7655k0121A7971g8591C48466e5317A2544J90682C0049J40585a70532
15805G890K54103b368D1683J07937b43036A40543j4041a8480j13894C8088f4507
15793G8199c4636j0076B2749a7973C40047i8175B52229a99382g5532A35736n4427
15782H1309E245a168l03162b6562o2312l01616A10818J54966c94990G5307b42487
15770C40385b48172A83255q5220m3828b61845b8254j23417P787F4446b18971A40037
$$ y = [43971, 146967, 199930, 41963, 7976, 59243, -2236, 238691, -194632, -267922, 212582, -172036, 229566, -146046, -166911, 175866, 164662, 168710, -56110, -74382, 192806, 9268, -9997, -23856, -302956, -107199, -265534, -269343, 103684, -96135, -104960, -65884, 50146, -289369, -201217, -87655, -107776, 17971, -78591, 348466, -55317, 12544, 203226, 30049, 170634, -170532, 7890, 261993, -2368, 41683, 149620, -243036, 140543, 126502, -18480, -132374, 38088, -64507, 78199, -34636, -44712, 22749, -17973, 340047, -98175, 252229, -199382, -75532, 135736, 81309, 5245, -1168, -304330, -26562, -88874, -390490, 110818, 265784, -394990, 75307, -242487, 340385, -248172, 183255, 98035, 54207, -261845, -28254, -151671, -143884, 64446, -218971, 140037]
15758g9768B59272m3156m3786D2970b21247B88896h9160A30509h1470A40636O9974
15747B10610I1412c2918G6896b35429e9621a8099k15671G482a54258D637J95012
15736A99649i701l2345k13010H2003a12713n4773J7986C62547g4743k14147F1779
15724E1871d7299H4534a35073A42019N2507c51641a73488j21782J03621C37729
15713a59379K224d93H5901b51428G5524b88139g1365j57114e1707j69174f8330
15701a94712J8261D3163O4577J01717q2416o2985a6848p8993A33010a18735c291
15689A17047M5200G8647k0704a76428b2952A61247J0110n0937D8537b3729j28151
15678a51880N0435k11354B81619a07979m4628B23331a4129B30637f6944j51322
$$ y = [-79768, 259272, 216116, 172330, 42970, -221247, 288896, -89160, 130509, -81470, 140636, 210610, 91412, -32918, 76896, -235429, -59621, -18099, -233770, 7482, -154258, 4637, 199649, -9701, -42046, -255056, 82003, -112713, -167486, -149500, 362547, -74743, -288890, 61779, 51871, -47299, 84534, -135073, 142019, 194526, -351641, -173488, -295270, -191649, 337729, -159379, -157155, -493, 85901, -251428, 75524, -288139, -71365, -228479, -51707, -220881, -68330, -194712, -176451, 43163, 107740, 209457, 127041, 64056, -16848, -95841, 133010, -118735, -3291, 117047, 162247, 78647, 57943, -176428, -22952, 161247, 171357, 120420, 48537, -23729, -151880, -101445, -312799, 281619, -107979, -152607, 223331, -14129, 230637, -66944, -218266]
15668b18266H8621e9865A82254i9585j00085K1346A61102a42719b7205a1431q8503
15657i9934k54419A92231a71106A46419a89727E8695a11040n3664c7998j39454
15647a77452A62043I553g0407B5126A0045h1688A71825H0046L4750a36982j24323
15636b61305G9796C2787L34742j18274a58660B29625a36278j5749j07276A08876
15625G1149C39N0385P4555b47464B82425b73900A62019o6420a00191I3077m0254
15614E2823f4783A16357b38987A76316C1800a05650A23548b1743k41307o4078
15604c27128H2864M1314l4449b7004B0602J36377f0994a7457G3467a94678F7502
15592C29433E9344a17077c8264d47C6550M9355L1100j359K02849d88657B67283
$$ y = [-218266, 88621, -59865, 182254, -99585, -199670, -178324, 161102, -142719, -27205, -11431, -99934, -354353, 192231, -171106, 146419, -189727, 58695, -111040, -164704, -37998, -177452, 162043, 9553, -70407, 25126, 10045, -81688, 171825, 80046, 114796, -136982, -261305, 79796, 32787, 367529, 249255, -158660, 229625, -136278, -152027, -259303, 108876, 71149, 339, 50724, 125279, -247464, 282425, -273900, 162019, 95599, -100191, 93077, 52823, -64783, 116357, -238987, 176316, 31800, -105650, 123548, -21743, -263050, -327128, 82864, 124178, 89729, -27004, 20602, 156979, -60994, -17457, 73467, -194678, 67502, 329433, 59344, -117077, -38264, -447, 36550, 85905, 117005, 115646, 318495, -488657, 267283]
15580f2900C30646b0118j50288A42895b11405N6992B24967a11318B97870c7871
15569B20902n1452k79A2659h4626E2352a43275C21232a36945n1148A6605L06604
15558C23209c7253l15715H6725M8322a59300P5040C8979a32982j46246J22439
15548a56789C26324A3640P3123J98267e3811d895C78589a06560A07064a76638
15537I2661K66452a11469B00496K6395F1725P0237L4409a10600d391k57216c3204
15525d5705n6301A45021b36706A6431c6921A44021a13673H0997J39588d05868
15514I3037a78831d4814l32258H8561D2656K9265j7687a31125l19414c686r7347
15503a01033j9804B55981i165E9752b5172j25909A8214c16421B1789a83720a2782
$$ y = [-62900, 330646, -20118, -170406, 142895, -211405, -154413, 224967, -111318, 297870, -37871, 220902, 169450, 169171, 12659, -84626, 52352, -143275, 321232, -136945, -188093, 16605, 323209, -37253, -352968, 86725, 135047, -159300, -84260, 38979, -132982, -279228, -156789, 326324, 13640, 86763, 285030, -53811, -4895, 378589, -106560, 107064, -176638, 92661, 359113, -111469, 200496, 226891, 61725, 131962, 166371, -110600, -4391, -261607, -33204, -45705, -102006, 145021, -236706, 16431, -36921, 144021, -113673, 80997, 220585, -405868, 93037, -178831, -44814, -377072, 88561, 42656, 71921, 54234, -131125, -450539, -3686, -101033, -120837, 255981, -9165, 59752, -25172, -151081, 18214, -316421, 21789, -183720, -12782]
15491c74527B93189j46538b076C05265A17486e7921b1505A64399k3422d690A10225
15479d2899A42146k6595j9943L17016i4457l5805N068B35871c9635k49802K6647
15468b62790M6511l993A69368F4835L413K42176A01255a2992B17261c1171A70158
15456F1526b30476C87606j40217B3011p436J02039h8500D10111a54877O381o8588
15445b17084m2922B42735F737h1386j93693R8305c4254j36722k00652B8212a98165
15433A55006a82336m8029j51500A61076m4010a34556c7688B30478c4299l34643
15423c68942B8072P8048J27406r4482J65838f552B8678K17391a70099A1135b04678
15411F1476d56689E9081e0861q3285f4548k65237a30857M5123E0619a57887l2425
$$ y = [-374527, 293189, 146651, -2076, 305265, 117486, -57921, -21505, 164399, 140977, -4690, 110225, -42899, 142146, 115551, 95608, 412624, -94457, -130262, -125194, 235871, -39635, -289437, -262790, -216279, -220272, 169368, 64835, 68248, 310424, 101255, -12992, 217261, -31171, 170158, 61526, -230476, 387606, 247389, 23011, 15575, 117614, -88500, 410111, -154877, -148496, -217084, -260006, 242735, 6737, -81386, -275079, -176774, -34254, -170976, -371628, 28212, -198165, 155006, -182336, -230365, -381865, 161076, 117066, -134556, -37688, 230478, -34299, -368942, 28072, 106120, 233526, 139044, 304882, -6552, 28678, 246069, -170099, 11135, -204678, 61476, -456689, 59081, -50861, -134146, -64548, -329785, -130857, -85734, 50619, -157887, -190312]
15400a90312A49217E6291H765K6680J7859a11012a6573p7710A29618g6241k01283
15389b77524A39536F6991b0290A07119Q5010a49520F2113P2719g0529j75200A63739
15377a84565A63049a49934M8113A0614a55239J7532e9053I7113M2588b04277H6566
15365b8019C0655K20119i3544m9760e6802B10623a5441A94796a10808a3321j74296
15354a87617b9701C53187H5954H194J46851D2047a34647B25592c189B2699L5226
15343E7925b06972G9532J35442L1149c91442C12707a37286e0107l17130A54188
15332C8152g9243A34958b03837G7121d3789G6092a62687B8283b0630C72362A32839
15320a71740B8161C270a04262M1899p466K3410j20283C8274K70538b39167A20115
$$ y = [-190312, 149217, 56291, 8765, 35445, 53304, -111012, -16573, -94283, 129618, -76241, -277524, 139536, 66991, -20290, 107119, 192129, -149520, 62113, 134832, -70529, -245729, 163739, -184565, 163049, -149934, -101821, 10614, -155239, -137707, -59053, 97113, 139701, -204277, 86566, -28019, 30655, 250774, -93544, -143304, -56802, 210623, -15441, 194796, -110808, -13321, -187617, -29701, 353187, 85954, 8194, 155045, 42047, -134647, 225592, -3189, 22699, 57925, -206972, 79532, 214974, 246123, -391442, 312707, -137286, -50107, -367237, 154188, 38152, -79243, 134958, -203837, 77121, -43789, 76092, -162687, 28283, -20630, 372362, 132839, -171740, 28161, 3270, -104262, -62363, -69829, -46419, -166702, 38274, 308812, -239167, 120115]
15308h6364A19216l3388Q5239h9326A04358a94570E1462K29487i9718A40908d5967
15296A18862P6093j1142q5576i1698c0983A72262i5590b6003B92012A02845Q3030
15285A85875a10989A25831n1215K4072j6482O7259a9449p7333j42909B05474b67973
15273i6624b4759B60058a0135B98560r1369C2338f2130B63462n4065o5259b5383
15261C6267P0236K52280A28967K57010j21899J08425j08623J68547j99863p6966
15251A55598J65938K04252M46424K72023o3730J12383n45591k00295A16932M4025
15241A60957E5249J43702a0962j19228A58871g6644B33061d04982a39671D3933
15230A81926l3831E4131d1002D1585J32918J89455A38781b47164C41688a3659
$$ y = [-86364, 119216, 85828, 171067, -89326, 104358, -194570, 51462, 280949, -99718, 140908, -45967, 118862, 194955, 183813, 98237, -91698, -30983, 172262, -95590, -26003, 292012, 102845, 185875, -110989, 125831, 74616, 98688, 82206, 149465, -19449, -96782, -239691, 205474, -267973, -96624, -24759, 260058, -10135, 298560, 207191, 32338, -62130, 263462, 209397, 144138, -25383, 36267, 106503, 358783, 128967, 385977, 264078, 372503, 263880, 432427, 232564, 155598, 321536, 525788, 972212, 1244235, 1180505, 1292888, 747297, 547002, 116932, 160957, 55249, 198951, -10962, -130190, 158871, -76644, 233061, -404982, -139671, 43933, 181926, 148095, 54131, -41002, 41585, 174503, 363958, 138781, -247164, 341688, -13659]
15219A1557K21094l8951a59171l1510k0126A71853a21037d5372E3714h47B00062
15207A65925d54328P2095A23088O085a33166D17241b77170A11122k3718b9867
15196A93962b17135A7034b16122A66728a75275A46976K48243A87971F895c5929
15185B16463d41104A64141N6455A03003k1386k4692a2979A18426d6734A11569
15174C44573a35881D4861b81332A18239g17C8327J0268J42822F8751B2776L47281
15163C70057a13342B56838o1850n1079M581a08023D49673b6794A42528J5108J02855
15152B60491A14410e3015A99732l5088d064A49289F5967K2466b78232D8995i4548
15140b8553l4713A55277E6076g0240D1851K8820i2185A39128b0031j01078C3435
$$ y = [11557, 232651, 193700, -159171, -190681, -210807, 171853, -121037, -45372, 53714, -847, 200062, 165925, -454328, -382233, 123088, 129173, -133166, 417241, -277170, 111122, 87404, -29867, 193962, -217135, 17034, -216122, 166728, -175275, 146976, 395219, 187971, 6895, -35929, 216463, -441104, 164141, 220596, 103003, 81617, 56925, -12979, 118426, -46734, 111569, 344573, -135881, 44861, -281332, 118239, -717, 38327, 48595, 191417, 68751, 22776, 370057, -113342, 256838, 194988, 143909, 148490, -108023, 449673, -26794, 142528, 157636, 260491, 114410, -53015, 199732, 164644, -4064, 149289, 65967, 88433, -278232, 48995, -94548, -28553, -63266, 155277, 56076, -70240, 41851, 70671, -92185, 139128, -20031, -121109, 33435]
15128B7345h021F7068J38396Q483A05339K18728g1346j5433C07410b31114C26000
15116B34655d6494C26457j16770J09245G1410c0064A4469N09123A11862g1872
15105A90758J7453a94896e4636B61478J64114I9175R2253q0142M7719C1633K07408
15094B39041B9038j3162h9395I8881J17771b10365G9211P4388G4888A1669M9284
15083F0953J94522o9775a18944M7210k4443A28537R4116d4520D9020H647J33103
15072A41750b9877B66764j19452l5183O3423n9288Q5923o0814K31439a10582B22062
15060F9318J93619q4295K64472j84613j16746A6180b54104B40747P7815f3687
15049C9840M23342j31595n2840B2165L00849o8061L0273j27690D7504L43688I2678
$$ y = [27345, -8021, 67068, 205464, 213947, 105339, 324067, -71346, -86779, 307410, -231114, 326000, 234655, -46494, 326457, 209687, 318932, 71410, -30064, 14469, 523592, 111862, -71872, 190758, 208211, -194896, -54636, 261478, 425592, 99175, 191428, 111286, 159005, 31633, 239041, 29038, 15876, -89395, 98881, 216652, -210365, 79211, 153599, 74888, 11669, 60953, 255475, 185700, -118944, -71734, -96177, 128537, 222653, -44520, 49020, 8647, 141750, -29877, 266764, 147312, 112129, 175552, 116264, 202187, 141373, 372812, -110582, 222062, 69318, 262937, 178642, 443114, 258501, 141755, 16180, -254104, 240747, 318562, -63687, 39840, 463182, 331587, 278747, 22165, 323014, 254953, 285226, 157536, 47504, 391192, 92678]
15037C93651j26617j2500a53163B34837a59740B57469e525D1004M5547J34819
15027B21370C0146M00857f8994D16830j21884j19218n8175E2265J04505k4274
15017A32496q338D1596a27884D41741j78684F3734b7893A04307O0439k1650P5787
15006B18883a0023D96169d8976B32979a44237C10054q3056c7616A40965J30453
14996B71418F3063K96221o3493A01295m779K76657A55166J3222a31210a184G6505
14984C13576O9154a04988B77485f7526A95340h9567A60930J73180a46532D75866
14973A76439J90295A15909b4870A8417J33943O0737B1842N4652K64537k6686m6210
14962B68135P6294A1469L98301J74592A58206L24164k39872Q5208B3959N4600
$$ y = [393651, 267034, 254534, -153163, 234837, -159740, 257469, -5525, 41004, 86551, 221370, 30146, 431003, -68994, 416830, 294946, 175728, 117553, 52265, 156770, 132496, 124158, 41596, -127884, 441741, 263057, 63734, -27893, 104307, 164746, 143096, 218883, -10023, 496169, -48976, 232979, -144237, 310054, 226998, -37616, 140965, 271418, 63063, 359284, 295791, 101295, 96516, 373173, 155166, 168388, -131210, -1184, 76505, 313576, 382730, -104988, 277485, -67526, 195340, -89567, 160930, 334110, -146532, 475866, 176439, 366734, 115909, -24870, 18417, 152360, 213097, 21842, 76494, 341031, 314345, 268135, 344429, 11469, 409770, 584362, 158206, 482370, 242498, 327706, 23959, 78559]
14952G8559l3333J1055k2637L90183A31068j9212P2322K2824k8293N8966K96500
14941E34175k63679o7572K83744B05793K55051A15118P3506N15268A05495b65668
14930A89649O1564j20686L86131q1507j91320C1957M42898j00426j3528p3268
14920B87633J00722P4207k30752k7913L3499K33602j77364K9057F4381K17309
14910B81690K82129k66232j29841J53606A58748h0041E93073A68902L3810K82895
14900D85607b3319A69687N4769A5180P6433K81928B5898K35252N3461o2843A19216
14888a98728C51650J26426A54880R0437J97233o6721m4050J50677o1320A93868
14877B77229N3368M8896L63135B08616K02889A96714Q9553K27480n7442A52322
$$ y = [78559, 45226, 56281, 33644, 423827, 131068, 111856, 184178, 207002, 178709, 237675, 534175, 270496, 202924, 486668, 205793, 460844, 115118, 188624, 703892, 105495, -265668, 189649, 251213, 130527, 516658, 435151, 243831, 31957, 474855, 374429, 360901, 287633, 388355, 462562, 231810, 203897, 237396, 470998, 293634, 322691, 64381, 281690, 563819, 297587, 167746, 321352, 158748, -80041, 593073, 168902, 202712, 485607, -23319, 169687, 224456, 15180, 91613, 373541, 25898, 261150, 314611, 251768, 119216, -198728, 351650, 478076, 154880, 245317, 442550, 375829, 331779, 482456, 421136, 193868, 277229, 330597, 379493, 742628, 208616, 411505, 196714, 286267, 513747, 456305, 152322]
14866B48674K6160M83928k64655h3483D11888R3223A75866N6843n2046M74761
14856F55424B66959k1185J51996L5722j61538E6733K63348K43049k54212j33811
14846A75107L02555P1134j67920R474J30886K2117k56408m6825J22669j37983
14836B24806K53413A10751O12672k71837O6964H0585K49988L30707n5373K3304
14826F29211j83243J54152P6020k72642J742j9630J48854n2421K76052r9335B98575
14814F0688M04851m2945J46434j16247P8010O6377j99227M83450k56145l04427
14804C20819N02797C62122P1075J21978m4115k5946o2942J23447p0626k26617
14794B48376L33582j31515j92428Q9867K444J83876j76127L75863B81229M50946
$$ y = [248674, 274834, 758762, 494107, -83483, 411888, 505111, 175866, 232709, 180663, 655424, 266959, 245774, 397770, 433492, 271954, 56733, 320081, 563130, 308918, 175107, 477662, 548796, 380876, 390350, 521236, 543353, 286945, 240120, 362789, 224806, 478219, 110751, 723423, 451586, 518550, 80585, 330573, 661280, 605907, 629211, 445968, 600120, 676140, 403498, 405240, 385610, 534464, 482043, 758095, 658760, 298575, 60688, 465539, 422594, 569028, 452781, 530791, 597168, 397941, 881391, 625246, 320819, 823616, 362122, 433197, 555175, 511060, 485114, 422172, 545619, 474993, 248376, 581958, 450443, 258015, 347882, 350326, 534202, 358075, 733938, 281229, 732175]
14784G32175j24021j66153r8262k5730P2348L54077k11317k8540J3415J1286J2463
14773E41741l2511L06325B69228N31096K4232l94242J53006n470J50167q2449
14763F45568m0823M2475j65708K69964j57592O190B77694K87143k1572k3653j90705
14752C28907M70556L17489k14874k27982N7429K9674j15261L12838C98192K74029
14742F72221k2519k10122K46647J42206j29211C31526K92201K47222D33879K60319
14732F94198j57650O99570m00182k24699l7818J75466J95845l18933N3354J80605
14722H59756j99661K41006j98165J08042l03197N31540D74081K74586l05139J71762
14712F15290J97051M0226K17526k14490j14635m8409J39692j83805M36258l13378
$$ y = [732175, 608154, 442001, 343739, 318009, 390357, 744434, 533117, 504577, 517992, 529278, 541741, 509230, 815555, 269228, 800324, 824556, 430314, 583320, 577850, 728017, 645568, 604745, 647220, 481512, 751476, 593884, 600074, 277694, 564837, 543265, 519612, 328907, 799463, 1116952, 902078, 674096, 731525, 761199, 645938, 958776, 398192, 672221, 649702, 439580, 686227, 828433, 699222, 331526, 623727, 870949, 433879, 694198, 536548, 1236118, 835936, 611237, 573419, 748885, 944730, 625797, 679151, 859756, 660095, 901101, 702936, 810978, 507781, 1039321, 474081, 748667, 443528, 615290, 812341, 852567, 1070093, 855603, 740968, 692559, 832251, 648446, 1084704, 771326]
14702G71326L07230k81873q098J68661M422l60878N57778n10381J35012q1400
14692G01799K36546J0922D40767N15243r5328n5281J78437j29447J95645m57244
14682E92792J49386J55235K26702l57567L06704M1169k67899L10565k61140J72455
14672A068402l07902M35072l03134N2168p3384l42593M44456J76884k7738L9816
14662A162047j12297K9524l27592K12821O5988O4153r6560r8769K69408l08389
14652H60334M37802l39545K65384j424k29131M34003k11808k44250J30978j2019
14642A090324n4817K17153K5576k69607K79193j27713L04012k60430M4439p0423
14632A177707k2786L65534l49187J33216J49485l25320k6902R4649m8683P8327
$$ y = [771326, 1078556, 796683, 788585, 957246, 961668, 600790, 1158568, 648187, 783199, 701799, 938345, 949267, 440767, 956010, 860682, 805401, 983838, 854391, 1050036, 592792, 742178, 897413, 1124115, 766548, 1073252, 1114421, 846522, 1157087, 895947, 1068402, 760500, 1195572, 892438, 944606, 871222, 528629, 973085, 1149969, 1122231, 1162047, 1049750, 1079274, 751682, 964503, 1030491, 1094644, 998084, 899315, 1168723, 860334, 1298136, 958591, 1223975, 1222551, 993420, 1427423, 1215615, 971365, 1102343, 1090324, 1035507, 1252660, 1278236, 1008629, 1287822, 1160109, 1464121, 1203691, 1248130, 1177707, 1154921, 1520455, 1171268, 1304484, 1453969, 1128649, 1101747, 1196396, 1147713, 1226040]
14622A226040J34841N5392j14432K91061m86936L65566q3800q7235K42595p4571
14612A468521j90484K1399j5117K37494O6676O7610k34031K14435l40486K69141
14602A565158Q7989j63770M00539n54516K2992l17613P20521m05025J49610L66562
14592A872447l51267L67825j70744M5640K58224j39935j93479J06360J996k41238
14582A555829L20624j21862K75745l03542K10996J82618k53186J21543N3181j19937
14572A922009k20956N03864m05980O55766l41337j07361K66607O9897K03987l63307
14562B183189J97272M04622j36965p3394J59501J02573P3710K97476P5497M73438
14552C756919N46648M68203Q80508K337244M278983J0600569J8589644k362082
$$ y = [1226040, 1360881, 1416273, 1301841, 1592902, 1105966, 1471532, 1387732, 1300497, 1543092, 1468521, 1278037, 1299436, 1284319, 1521813, 1588489, 1656099, 1422068, 1636503, 1296017, 1565158, 1653147, 1489377, 1889916, 1335400, 1358392, 1040779, 1761300, 1356275, 1505885, 1872447, 1521180, 1889005, 1718261, 1763901, 2022125, 1882190, 1688711, 1795071, 1797067, 1555829, 1876453, 1754591, 2030336, 1726794, 1937790, 2120408, 1867222, 1988765, 2041946, 1922009, 1701053, 2204917, 1798937, 2454703, 2113366, 2006005, 2272612, 2342509, 2546496, 2183189, 2380461, 2785083, 2648118, 2574724, 2734225, 2836798, 2910508, 3207984, 3283481, 3756919, 4303567, 4771770, 5652278, 7989522, 12268505, 22869074, 41458718, 39096636]
14544C9096636j7288687I068381m523494j582686q32827l50179j33723J21255
14536A766727j44216M70320j69351L90555O7469m61659r3425O39690k13798k01088
14526B051224o9682N96532n8863l97147N0926L80229l64567J00480m3107M12014
14516B658039j97038n1170j12238N14988l98157Q4067n54L68795R5963k43457
14506B719238N1402K37607j16163J48493j47185M7599J61088j31407l06763M28623
14496C092532j38597J22593J80321N5682L10634m02706O75L13689j45407m3865
14486C345551K73523k64273K04444k5927K333J60386k54208L12860n6545K46760
14476C944904J89493j60941m97P6763R8471l7314q7066r5714L04704K80084l68127
$$ y = [39096636, 21807949, 9068381, 4544887, 2962201, 2129374, 1779195, 1645472, 1766727, 1622511, 2092831, 1923480, 2314035, 2381504, 1919845, 1826420, 2466110, 2252312, 2051224, 1981542, 2578074, 2519211, 2122064, 2172990, 2553219, 2188652, 2289132, 2246025, 2658039, 2461001, 2409831, 2297593, 2812581, 2414424, 2498491, 2497937, 2866732, 2962695, 2719238, 2770640, 3008247, 2892084, 3040577, 2893392, 2940991, 3102079, 2970672, 2663909, 3092532, 2953935, 3076528, 3256849, 3312531, 3623165, 3220459, 3221134, 3534823, 3389416, 3345551, 3619074, 3354801, 3559245, 3533318, 3535651, 3696037, 3441829, 3754689, 3698144, 3944904, 4134397, 3973456, 3972959, 4049722, 4148193, 4110879, 4023813, 3928099, 4232803, 4512887, 4144760]
14465D144760L60415l6817l44089J70821J30738p207K80495J16921M1280R8904
14455D956221l02713R5249J50555M85546l0084j75951J88082j00197j31634L86946
14445E522020J2582n1880M69509l56425J35720J67487m1938K29870k38307L25464
14435F174102N44822l63630l8632p5271K62851N7915L83618J92318j56023J43357
14425G125427J64752M5917J12371j88943K11657L46404R4906M1788k04270J97792
14415G947801L16679L77302r8000r6101P9378L78318j29209L80541k22580K70087
14405I204216K53618K57081J91638J7551K88165K23867K05042q9924K69344J39960
14395A0960558k75870P77425K92791k4108J79700K63849k2919K99170M29718J03122
$$ y = [4144760, 4505175, 4468358, 4124269, 4295090, 4425828, 4418621, 4699116, 4816037, 4857317, 4956221, 4653508, 4748757, 4899312, 5384858, 5354774, 5178823, 5366905, 5266708, 5135074, 5522020, 5534602, 5482722, 5952231, 5595806, 5731526, 5899013, 5857075, 6086945, 5848638, 6174102, 6718924, 6355294, 6316662, 6241391, 6504242, 6562157, 6945775, 7138093, 6982070, 7125427, 7290179, 7336096, 7448467, 7259524, 7471181, 7817585, 7912491, 7954279, 7750009, 7947801, 8264480, 8641782, 8543782, 8447681, 8527059, 8905377, 8776168, 9156709, 8934129, 9204216, 9457834, 9714915, 9906553, 9924104, 10212269, 10436136, 10641178, 10551254, 10820598, 10960558, 10684688, 11462113, 11754904, 11730796, 11910496, 12174345, 12151426, 12450596, 12880314, 12983436]
14385A2983436M98543K26024o289K22252N35034j50215N55630J73904K99807K58519
14375A5596645J48948N03164J41870O10192L14762J96054k31780P47686P03942
14366A8731483l8356N83697m9486J023754J56996M10982M57376N96984M62849
14357B2336279O39636M70840N95948L7933R39472N87123O32161P41270L94158
14348B7374820O24285P49173J070187Q36210O63470P96609J064185M06702R24219
14339C4509860R83700J077931J028786J059949Q87071J616160J146032J208912
14331D3518401J493905J169386J330226J962836J414320J534734J795875J991995
14323E6211678J759384K406766J662602K338756K288501K752206K640788K822907
$$ y = [12983436, 13481979, 13708003, 13701714, 13923966, 14459000, 14308785, 14864415, 15038319, 15338126, 15596645, 15745593, 16248757, 16390627, 17000819, 17315581, 17511635, 17279855, 18027541, 18731483, 18693127, 19276824, 19227338, 20251092, 20408088, 20819070, 21276446, 21873430, 22336279, 22975915, 23446755, 24042703, 24080636, 25020108, 25607231, 26239392, 26980662, 27374820, 27999105, 28748278, 29818465, 30654675, 31318145, 32114754, 33178939, 33585641, 34509860, 35493560, 36571491, 37600277, 38660226, 39547297, 41163457, 42309489, 43518401, 45012306, 46181692, 47511918, 49474754, 50889074, 52423808, 54219683, 56211678, 57971062, 60377828, 62040430, 64379186, 66667687, 69419893, 72060681, 74883588]
14315G4883588K596195L162037L031060L499840L565444L986897L698904M490769
14307A02914734M234410N066374M662213N107541N635875N678499O481719O852992
14299A46634357O861104P630378Q125112Q236835R081353R562444R941358J0458869
14291B16531810J1410247J1420984J2336030J3101914J3415141J4072636J4516298
14284C06805060J4529946J5149337J5180507J5073011J5164268J4648996J3941052
14277D10492177J3475563J2124318J0679492Q776936N173250J394725k96492k289033
14269D59530936j493957k206626k518991o321346q591805j0793910j2680298j3880399
14261D01043604j4799895j5458602j6024170j5759880j6086286j5295251j4528432
$$ y = [74883588, 77479783, 80641820, 83672880, 87172720, 90738164, 94725061, 98423965, 102914734, 107149144, 112215518, 116877731, 121985272, 127621147, 133299646, 139781365, 146634357, 153495461, 161125839, 169250951, 177487786, 186569139, 196131583, 206072941, 216531810, 227942057, 239363041, 251699071, 264800985, 278216126, 292288762, 306805060, 321335006, 336484343, 351664850, 366737861, 381902129, 396551125, 410492177, 423967740, 436092058, 446771550, 455548486, 460721736, 462116461, 461819969, 459530936, 458036979, 455830353, 453311362, 446990016, 438398211, 427604301, 414924003, 401043604, 386243709, 370785107, 354760937, 339001057, 322914771, 307619520, 293091088]
14254B93091088j4095532j4057010j3473692j2637618j2224244j1267543j0904607
14247B04430842r844686r591599q863853q457204q144782p687551p186634o891018
14239A37763515n778356n569261n531681n747557m928067m645265m421983l878357
14231I7262988l784054l694849l496073l591992l076501l118385l035614k490078
14223G0975442k560442j933656k845136k130297j797202k142363j753658k105865
14215E3706823j754185j152465j502234j452996j660450j671163j314133r04035
14207D2295162p86768j038257j322972j242184j266924p31743r72601n80363r13525
14198C3439825j281205q72875o71445q11724m83853p88901o88174p50366o07778
$$ y = [293091088, 278995556, 264938546, 251464854, 238827236, 226602992, 215335449, 204430842, 194586156, 184994557, 176130704, 167673500, 159528718, 151841167, 144654533, 137763515, 131985159, 126415898, 120884217, 115136660, 110208593, 105563328, 101141345, 97262988, 93478934, 89784085, 86288012, 82696020, 79619519, 76501134, 73465520, 70975442, 68415000, 66481344, 63636208, 61505911, 59708709, 57566346, 55812688, 53706823, 51952638, 50800173, 49297939, 47844943, 46184493, 44513330, 43199197, 42295162, 41508394, 40470137, 39147165, 37904981, 36638057, 35906314, 34933713, 34353350, 33439825, 32158620, 31285745, 30614300, 29802576, 29318723, 28529822, 27841648, 27091282, 26483504]
14189B6483504p67775j000916m1641p81732l89244p96930n25647p7374q13574
14180B1288671m60106l63864l69174p73005K9836n19135m48375l69706j13873
14171A7901269n70200m28839m28942J15730p93070j19296r4535k23921n35483
14162A4822713j49978m70955o0531j56305l91755M1265l62815m19423j09736k02377
14152A2540103k86608P4488o02832J02571m28146M624l57895l17518J26090j11537
14142A0743340j17904k82753J9282l02624l05869K7329j07702k06966J23868q01905
14132H788096L63115J90931q43185K84235l58099J88874j49470l65888m1203l1804
14122H025602o3461r6642p4249m35053L67761l38355k27587J30497J06163m56736
$$ y = [26483504, 25715729, 24714813, 24673172, 23891440, 23502196, 22705266, 22179619, 22102245, 21288671, 20828565, 20464701, 20095527, 19322522, 19352358, 18833223, 18384848, 18015142, 17901269, 17331069, 16902230, 16473288, 16589018, 15795948, 15676652, 15582117, 15358196, 14822713, 14672735, 14201780, 14141249, 13984944, 13593189, 13634454, 13271639, 12852216, 12742480, 12540103, 12253495, 12327983, 11725151, 11827722, 11399576, 11404200, 11046305, 10728787, 10854877, 10743340, 10625436, 10342683, 10361965, 10059341, 9753472, 9780801, 9673099, 9466133, 9590001, 8788096, 9151211, 9342142, 8498957, 8783192, 8425093, 8613967, 8464497, 8098609, 8057406, 8025602, 7962141, 7865499, 7791250, 7356197, 7723958, 7385603, 7158016, 7288513, 7394676, 6937940]
14112F937940j25812K39924l66033L73901k80716m98906K85692j75728K43932
14103F634194m18079N2413k52529k5775J82934l07349j88371K49621l2572k12450
14093E682037k57948M9248L223R2008m16491K10655M9542j60076k50996J04339
14083E105541L169j06864j20242J51079m62483L28271P8577j08781k50658j5270
14073D602339k15313J6221J10751j65523j53134k23251K04586P186j06762J23541
14063D200641J67251k20505Q2456j52404p878j35351j23619K91864l26646O2320
14053C838129j44531j59l12235N18780m44035K98070J24314m69668L53206k63204
14043C498667j54693k48348L67460l15098J97915o2045j15883l11905O0389L36911
$$ y = [6937940, 6812128, 7052052, 6686019, 7059920, 6779204, 6280298, 6565990, 6390262, 6634194, 6216115, 6268528, 6015999, 5990224, 6173158, 5865809, 5677438, 5927059, 5894487, 5682037, 5424089, 5473337, 5476560, 5568568, 5152077, 5362732, 5412274, 5252198, 5001202, 5105541, 5108710, 5001846, 4881604, 5032683, 4570200, 4898471, 4977048, 4868267, 4617609, 4602339, 4387026, 4403247, 4513998, 4348475, 4195341, 3972090, 4176676, 4183862, 4077100, 4200641, 4367892, 4147387, 4229843, 4077439, 4069561, 3934210, 3810591, 4102455, 3775809, 3838129, 3693598, 3693439, 3381204, 3899984, 3455949, 3754019, 3878333, 3408665, 3761871, 3498667, 3343974, 3095626, 3463086, 3147988, 3345903, 3283858, 3167975, 2856070, 2916459, 3253370]
14033C253370j59812K87029j58519L2154j76628j56031O1729m42888K95191j83673
14023B651922L04294m6192j94456L67015l54043j20181Q7667k67527q1991M08174
14013B754682L7261k42252j11833K16312r5951l63127J05253L1131k26642K15347
14003B320181M3900j46460J78654l18142M9441j9487J5928L9960o5138P7723M4609
13992B221169n9155r1543O31448J016742L036310Q871908J9763862L840357j2530133
13983B6700965A3294022n043522k384514j334658n06056m15034n43523J27143
13975C193858K17288n06290l28412J75474R5243l30389r3830p7027n9436N7855
13965B344334m4264j01797K1228K7639P1195L9270m50006K96982k81648J67107
$$ y = [3253370, 3093558, 3380587, 3222068, 3254222, 3077594, 2921563, 2983292, 2540404, 2835595, 2651922, 2956216, 2910024, 2715568, 3082583, 2728540, 2608359, 2696026, 2428499, 2346508, 2754682, 2791943, 2549691, 2437858, 2654170, 2558219, 2195092, 2300345, 2331476, 2104834, 2320181, 2364081, 2217621, 2396275, 2078133, 2127574, 2108087, 2124015, 2163975, 2098837, 2176560, 2221169, 2162014, 2070471, 2701919, 3718661, 6754971, 15626879, 35390741, 39231098, 26700965, 13294022, 8250500, 5865986, 4531328, 4025272, 3610238, 3066715, 3193858, 3411146, 2904856, 2576444, 2751918, 2847161, 2516772, 2422942, 2345915, 2286479, 2344334, 2300070, 2198273, 2219501, 2247140, 2318335, 2357605, 1907599, 2204581, 1922933, 2090040]
13955B090040l32439L30122j31101J01530j25336j1553l33216O7522J25640j74689
13945A606520o8799L38976N5897K18257m52950k52652N56779k08806Q1316k42828
13935A631710J90419k92329L86005l12293r7424K43856k33965j3858N418M1608
13925A549147l973L12713j05476n09948J96741J12837j73502J99871j15641N45
13915A463314J90722N3317m0636q9593j65640L02103l09024l8057l64741K73315
13905A275080k13056K55399j48133M48451m13857K48078Q0113p7623k36771J26693
13895A344374l46479K74337R0100j45937M20352k45251J7784l3028l2156l3901
13885A310195l48575K34199J93431k36795L54084j52085j38788j51002o0060L82702
$$ y = [2090040, 1757601, 2087723, 1956622, 2058152, 1932816, 1921263, 1588047, 1655569, 1781209, 1606520, 1537721, 1876697, 1932594, 2150851, 1697901, 1445249, 2002028, 1793222, 1874538, 1631710, 1822129, 1529800, 1915805, 1603512, 1506088, 1749944, 1515979, 1502121, 1507539, 1549147, 1545174, 1857887, 1752411, 1242463, 1439204, 1552041, 1378539, 1578410, 1462769, 1463314, 1654036, 1707353, 1666717, 1577124, 1411484, 1713587, 1404563, 1366506, 1001765, 1275080, 1062024, 1317423, 1169290, 1617741, 1203884, 1451962, 1532075, 1454452, 1217681, 1344374, 997895, 1272232, 1362332, 1216395, 1636747, 1391496, 1409280, 1376252, 1344096, 1310195, 961620, 1195819, 1389250, 1152455, 1506539, 1354454, 1215666, 1064664, 1004604, 1387306]
13875A387306l70500K11974J08581o35379N37377k94034K15713J0253p7314j60543
13865I33434K3879K20652Q4392L2465k02649L07670k69645R9080n54118N86779
13855A261939l33984J8122K12916j474k11891J15397L131J55104k91348K43208
13845A171120q4428O165l00331K96407m96076N59639p3764J61548l63249k3476
13835H53555m0744J0664K45025j49339l90246L11185J63826D89632O13020K17928
13825A320580k79061j52198P0167k24649L8656n2123K26986J54644j47049j6975
13815I38978k27198N9153K07450j31819L0565o1525k84278M45956k11573J28761
13805H94470O2478p8127p9881j20717n5840J15638K65505k7259k48481K30207
$$ y = [1387306, 1016806, 1228780, 1337361, 701982, 1239359, 945325, 1161038, 1171291, 1093977, 933434, 957313, 1177965, 1262357, 1294822, 1092173, 1399843, 1130198, 1229278, 675160, 1261939, 927955, 946077, 1158993, 1157519, 945628, 1061025, 1064156, 1219260, 927912, 1171120, 1086692, 1092857, 792526, 1088933, 592857, 1152496, 1078732, 1240280, 877031, 853555, 812811, 823475, 1068500, 919161, 528915, 840100, 1003926, 489632, 1102652, 1320580, 1041519, 889321, 959488, 734839, 773495, 721372, 948358, 1103002, 955953, 938978, 711780, 770933, 978383, 846564, 877129, 815604, 531326, 977282, 765709, 894470, 956948, 878821, 798940, 678223, 622383, 738021, 1003526, 976267, 727786, 957993]
13795I57993l53285m2202K65219r3490J09627L205m007j34808l7577j24657M04803
13784I50821l91724Q9520Q5483J41374k29722J25961j84665K48046J8202K08831
13774A062127C37166L54729o3827K184K43311k44974L6268J62898q2218Q6549
13764H32086n8145k45415J92838j56781J1097L05265k33082n9144j67308L66974
13754G88385m2562J26465L002k87822k46901M16690n7843r2168l6869K50438C18682
13742B88391r7917Q3675M50892r7597j55372M60347l85687J13253j58974J96104
13732F97115m1744r0464j99588M18299C02530N46715l46764l8729L22119B68105
13721F92289k7469L0186k71978K5523K02574k309o1096K4696m2904J76484B80755
$$ y = [957993, 604708, 562506, 827725, 734235, 843862, 847067, 843060, 708252, 670675, 546018, 950821, 559097, 648617, 734100, 875474, 645752, 771713, 587048, 835094, 853296, 1062127, 337166, 691895, 628068, 630252, 873563, 628589, 664857, 827755, 745537, 832086, 773941, 528526, 721364, 564583, 575680, 880945, 647863, 588719, 421411, 788385, 745823, 872288, 875290, 587468, 340567, 757257, 699414, 607246, 570377, 820815, 318682, 288391, 190474, 274149, 725041, 627444, 472072, 932419, 546732, 659985, 501011, 697115, 655371, 564907, 365319, 783618, 302530, 849245, 502481, 463752, 785871, 268105, 692289, 664820, 695006, 423028, 448551, 651125, 648816, 587720, 612416, 569512, 745996, 280755]
13709C92170R9872p6703j67086L62824j49010M954K26314q4921J97270j57091
13699F48593m5130J97187C76268A82054J27068K50912k62179L01455j30755R5285
13689E63840k36712J84180Q6675B64225K77298J47439k14581A07441K16405N99853
13679I23699l31468j7959K0368j90773l1861P9101o8087J93225j34376J45803
13669E87672A11097L73065n4032J14625J1027k29041N3313j53173D9418N91544
13659F40962K12642m23539p9947K84524n0450l4464q3553k3865Q9341j00244R3016
13648E24423A78673J85004J5337m0897A08947J19082K71247J5254j74015o9674
13638B70841J35938j40252L72176m1116k71061L42683N4489m0784j24006K73701
$$ y = [392170, 492042, 415339, 248253, 611077, 462067, 467021, 693335, 608414, 805684, 648593, 603463, 800650, 376268, 182054, 309122, 560034, 297855, 599310, 468555, 563840, 327128, 511308, 597983, 264225, 541523, 688962, 474381, 107441, 323846, 923699, 592231, 574272, 594640, 403867, 372006, 451107, 383020, 576245, 441869, 587672, 111097, 484162, 430130, 544755, 555782, 326741, 380054, 226881, 49418, 640962, 853604, 430065, 350118, 634642, 584192, 549728, 466175, 442310, 531651, 431407, 524423, 178673, 363677, 379014, 338117, 108947, 228029, 499276, 514530, 340515, 270841, 406779, 266527, 638703, 597587, 326526, 669209, 723698, 682914, 558908, 832609]
13628H32609B42485L46717j00469J17169R7935B51805a17512C94806j77405P9818
13618B97219P4509j31075A08897k929J70497p1081J28616L21409q3803j20799
13608D50807A59100M48701B4741K90823n0968J67638K0476J03133I971K64304
13598B74275R0323N2715j7260O2148A95200K77248j66083J63041R3860k76376
13588B86890J55894J94032k85104K5631j9271A01139L87249C5015M97973k59293
13578B73695K37306A54729K50213m1676j15138C0062N85006A87390J64632r2897
13568B59125J76862B16432I2316A3349L28234L1047m8825q3121n5659J17273M3119
13557C45417F4305M48169B16513R9370j246q1569J63361E6648N96963C22308A41075
$$ y = [832609, 242485, 589202, 488733, 605902, 703837, 251805, -117512, 394806, 217401, 297219, 371728, 240653, 108897, 105968, 276465, 205384, 334000, 655409, 571606, 450807, 159100, 607801, 24741, 315564, 264596, 432234, 452710, 555843, 9971, 274275, 364598, 417313, 400053, 462201, 195200, 472448, 306365, 469406, 563266, 286890, 442784, 636816, 351712, 377343, 358072, 101139, 488388, 35015, 532988, 273695, 511001, 154729, 404942, 363266, 248128, 30062, 615068, 187390, 352022, 259125, 435987, 216432, 92316, 13349, 341583, 372630, 323805, 240684, 185025, 302298, 345417, 64305, 512474, 216513, 315883, 314637, 233068, 396429, 56648, 653611, 322308, 141075]
13545a8888A62355A2742L89765L0749A35752K34681M0533g026B48953K70209j17033
13534D02129A84572J3999M31937k51066e9125B76287Q43p7458J31952r6086p9605
13523A55933h9217D67036j21016k9248K3761A1782K08173a84007D81417j11665
13513C69752F2361K6118J68425j20415N9397J70284A23385L27557k16596J72644
13503D06990l4734j06332I1270P5677K25903r9536M9158K09682A77234K61285
13493D38519j42512q7322K15821j1916j49193p6214n4417M11099B06039J15603
13483C21642A34777o3855J01935k7884m4382K16963C6375J84714L0051p4249G687
13471A91908m494I606J62693n5899K68391A41671M06156D6048J3418M18268j35673
$$ y = [-18888, 162355, 12742, 402507, 433256, 135752, 370433, 410966, -7026, 248953, 519162, 402129, 184572, 198571, 630508, 379442, -59125, 276287, 277130, 199672, 331624, 235538, 155933, -89217, 467036, 346020, 316772, 340533, 11782, 219955, -184007, 481417, 369752, 62361, 88479, 256904, 136489, 195886, 366170, 123385, 450942, 234346, 406990, 372256, 265924, 91270, 166947, 392850, 293314, 342472, 552154, 177234, 438519, 296007, 208685, 424506, 412590, 263397, 187183, 132766, 543865, 206039, 321642, 134777, 70922, 172857, 144973, 100591, 317554, 36375, 221089, 251140, 176891, 7687, 191908, 187414, 9606, 172299, 116400, 384791, 141671, 547827, 46048, 59466, 477734, 342061]
13460C42061P038j55658E4427P8353L60816j0993M2495B17506J28941A32830M891
13449A37721Q7410J53953J25306k30670K9264j17796K2019J50619a03035L7502
13439f5533A26067R9234G6165J52324j01874D0919K26585K7518J7360j11921K84665
13428D85126B05664o4446k1956O315a10153k6290A75565R9769Q0858n0170j7626
13417B88396A43744L65273k38166J95462j49603j01577Q7828E8966L3484K46886
13407C39336a74964A78226q0231J02569J83465P2690a29871A82367J56030c4951
13396E44382E8567K06464P2494A44426J79438A01107L12024j20354j11606F7342
13385C42873J39536I3917M04265k12520F394a443D62386a07451M6788D01759D8656
$$ y = [342061, 349099, 193441, 54427, 132780, 493596, 482603, 525098, 217506, 346447, 132830, 137721, 225131, 379084, 504390, 273720, 302984, 185188, 207207, 357826, -103035, -65533, 126067, 225301, 76165, 228489, 126615, 40919, 267504, 295022, 312382, 200461, 485126, 205664, 141218, 119262, 125577, -110153, -136443, 175565, 275334, 356192, 306022, 288396, 143744, 509017, 270851, 466313, 316710, 215133, 302961, 58966, 92450, 339336, -174964, 178226, 97995, 200564, 384029, 456719, -129871, 182367, 338397, -34951, 544382, 58567, 265031, 337525, 144426, 323864, 101107, 413131, 292777, 181171, 67342, 342873, 482409, 93917, 498182, 285662, 6394, -1443, 462386, -107451, -60663, 401759, 48656]
13373B51091J37949m31a0617B82271J56468A91019J03393J76416A22977K84662
13363D07639A31912J52746q8864A1575M50957k30941g5083A01519J31572I9336
13352C48132A38320Q432J67338A2105f1241A28417J26677G278J26394N1717o0041
13341A25348k996l1783L46718K52588B99473d329A13166M07074A44882A5474a35171
13329b14336C53438j8029k2050H6072a40719B73284J42658f9317B99453j42566
13319A56887F0468N81395f9072C68119J34984q0253j9477P2869A26500J3278k3128
13308A16650l8413b3115C85062a28299B37368I6821L8109P4580e8486K5702B89116
13296A86820J35244p1313H2332J17873a46190B53778J3290B9147I114a81494a4782
$$ y = [251091, 389040, 388609, -10617, 282271, 438739, 191019, 294412, 470828, 122977, 407639, 131912, 284658, 195794, 11575, 462532, 231591, -75083, 101519, 233091, 99336, 348132, 138320, 146752, 314090, 12105, -61241, 128417, 255094, 7278, 133672, 185389, 125348, 122352, 90569, 437287, 689875, 299473, -4329, 113166, 520240, 144882, 15474, -135171, -214336, 353438, 335409, 313359, 86072, -140719, 273284, 415942, -69317, 299453, 156887, 60468, 641863, -69072, 368119, 503103, 422850, 403373, 476242, 126500, 139778, 116650, 78237, -23115, 385062, -128299, 237368, 96821, 134930, 209510, -58486, -32784, 289116, 186820, 322064, 250751, 82332, 200205, -146190, 253778, 267068, 29147, 9114, -181494, -14782]
13284F4036b3566I8795J51840J78604D5556J05840E9562M99945b6048f327A0863
13272A20575c25802i321C13925A56305o8783O2589a2737C89250H8481P6417J84478
13261C49376C3587J12946J42367h1638A42246n9218C5291O0114M7455J45389d6283
13249A30068J04597L02953k43313A01580l0805M8528R3517I9141e5657b1132A82323
13237A31394j2955P9389E3075c8961o5629H2717K54251r4734F5765J09730J30430
13226C05925a03490B26423a51366P1294H561K61210F9932J57827b47951B74466
13215F2937i6640C69737j66467r1558g4804B79257K38585A96652K10944h6942
13204G4705J00302a59936B72194R389C0341R3856C0562Q5783g0331G4333l032
$$ y = [64036, -23566, 98795, 250635, 429239, 45556, 151396, 59562, 559507, -26048, -6327, 10863, 120575, -325802, -9321, 313925, 156305, 87522, 150111, -12737, 389250, 88481, 164898, 349376, 33587, 146533, 288900, -81638, 142246, 83028, 35291, 95405, 142860, 288249, -46283, 130068, 234665, 537618, 294305, 101580, 70775, 119303, 212820, 99141, -55657, -21132, 182323, 131394, 118439, 197828, 53075, -38961, -104590, 82717, 336968, 242234, 65765, 175495, 305925, -103490, 226423, -151366, -80072, 8561, 269771, 69932, 227759, -247951, 274466, 62937, -96640, 369737, 203270, 111712, -74804, 279257, 517842, 196652, 407596, -86942, 74705, 175007, -159936, 272194, 281583, 30341, 124197, 30562, 116345, -70331, 74333, 71301]
13193G1301c00371A23015Q3153c58644A58443b81549F9033Q6873n4221L9961j4899
13182A26747D4988a0232j92015A30494C2908J55625I0606l2967b63449B07374
13171B26841E5707K88182A12715K53278c6263l8482b8339k12149c1774B26564
13160g8441A37988J10604R5555F8043a57726j55556E1374J23006f3743B545L072
13149E617b932A99920M5634e5511D26880E4717f889k3740l5155A02380e8966B89901
13136H595b59448C66771j42640I3510K14064b33555A29357J61878a53911A30121
13125I3448a16751B78612j26932F9715A7492i16B72414C5043K33306K5066b40864
13113c7741p6158A46376K73929G7983K88175a31106B16632K29G124d1287I9097
$$ y = [71301, -300371, 123015, 206168, -358644, 158443, -281549, 69033, 155906, 101685, 141646, 126747, 44988, -10232, -202247, 130494, 32908, 188533, 90606, 57639, -263449, 207374, 226841, 55707, 343889, 112715, 365993, -36263, -74745, -28339, -240488, -31774, 226564, -78441, 137988, 248592, 344147, 68043, -157726, -313282, 51374, 174380, -63743, 2545, 5617, -2932, 199920, 245554, -55511, 426880, 54717, -6889, -30629, -65784, 102380, -58966, 289901, 8595, -259448, 366771, 224131, 93510, 307574, -233555, 129357, 291235, -153911, 130121, 93448, -116751, 278612, 151680, 69715, 17492, -916, 272414, 35043, 268349, 293415, -240864, -37741, -113899, 146376, 420305, 77983, 366158, -131106, 216632, 216861, 7124, -41287, 99097]
13101A70155O5992F3693P2748J23254L0121h739C4771P0737i7812A60793a15554
13089C53474J67638a85266A35243d3855J2656H1926l7215j8480J00956a30090
13078c06808A7850J43403B5260K69611J88920I4969b0867j39268A98793h4640
13067B26529J1566a00670A25723L19805c3222D4400K54154e7578a9462C76334
13056A11877M6519M6499a37776O7594A23267L7173D0968N9241R4326J01531C5632
13044c98j1405A67857a91064A94550O5477K914d4822A93263G0890L10693f1528
13032I975K30475A09611J54495P6186j17111J9675a17571A08659J68647K1301
13022B98607A07615Q4486D9790L358K56052A28932L3406J62039H5123c3103I6487
$$ y = [170155, 236147, 63693, 136441, 259695, 289816, -8739, 34771, 105508, -97812, 160793, -115554, 353474, 521112, -185266, 135243, -43855, -31199, 81926, 44711, 26231, 127187, -130090, -306808, 17850, 161253, 25260, 294871, 483791, 94969, -20867, -160135, 198793, -84640, 226529, 238095, -100670, 125723, 445528, -33222, 44400, 298554, -57578, -19462, 376334, 111877, 158396, 204895, -137776, -70182, 123267, 160440, 40968, 100209, 194535, 296066, 35632, -398, -11803, 167857, -191064, 194550, 260027, 262941, -44822, 193263, 70890, 381583, -61528, 9975, 240450, 109611, 264106, 340292, 223181, 242856, -117571, 108659, 277306, 298607, 107615, 192101, 49790, 53148, 309200, 128932, 162338, 324377, 85123, -33103, 96487]
13010H309i0580r781a0012j44431B1175K76920j46461j9423K1613k3315J62933
12999B93442l5272H3559f1117r8226D5482K0668N9678f240E08426d25779D29519
12987E75K21736J53691j53944j08705i398B27157a48499E116K71577B7173b0681
12975D26266a11264B68696p3431c6425B7076c3196B10120p2359B4911b24112C11987
12963A26018i8995C18483A12731m0780L97195b95851J24334B39585B3576i6655
12952b21948D7468b45306h2251A72758J2061j6462k14d8727A37267b8275I1265
12940B32553A01741C1646L9140B7801a07039k5349B69491E1027J67138o0355L076
12929A60886f8607n9438b2957A36426J07140a46930A57795b3822B26909j09614
$$ y = [8309, -90580, -100361, -10012, -154443, 21175, 298095, 151634, 132211, 153824, 130509, 293442, 258170, 83559, -61117, -159343, 45482, 66150, 125828, -6240, 508426, -425779, 429519, 575, 222311, 376002, 222058, 113353, -9398, 227157, -148499, 5116, 276693, 27173, -20681, 426266, -111264, 268696, 195265, -36425, 27076, -33196, 210120, 137761, 24911, -224112, 311987, 126018, -98995, 318483, 112731, 71951, 469146, -295851, -171517, 239585, 23576, -96655, -221948, 47468, -245306, -82251, 172758, 184819, 168357, 168143, -48727, 137267, -28275, 91265, 232553, 101741, 31646, 70786, 27801, -107039, -132388, 269491, 51027, 218165, 157810, 160886, -68607, -128045, -22957, 136426, 243566, -146930, 157795, -23822, 226909, 117295]
12919A17295J61141G3955a6870A4163i1728C008c5263I5590R6898h0087E4117
12907I5024l9131J39968R239i3713n1434g1911B59187B2467K27623A01037J5349
12896A16386J2972a71636c4141B00772a04541A836d2157A92411b43632B66083
12885a33198j15367I8247m3069a51254E0834L4440k6242J15428b75576f1308l5102
12874i6410J1128k6992j82822C0471L00243j49244D7159J28603k8036m5365a29130
12862B09214p111m1954E5723J1178L5512O2350G2143O2176E3764a33625B53826
12850B27875K49433b9333n7713B17110I1966m3392O57926I4060b99989a27216
12839A79173J36024n9225f2493A25726a65656B46945j0364g5743I4790J43060
$$ y = [117295, 278436, 73955, -16870, 14163, -91728, 3008, -35263, 95590, 192488, -80087, 54117, 95024, 55893, 195861, 205100, -93713, -145147, -71911, 259187, 22467, 250090, 101037, 116386, 129358, -171636, -34141, 200772, -104541, 1836, -42157, 192411, -243632, 266083, -133198, -248565, 98247, 55178, -151254, 50834, 85274, 59032, 174460, -275576, -61308, -96410, -85282, -112274, -295096, 30471, 330714, 181470, 47159, 175762, 147726, 102361, -129130, 209214, 202103, 160149, 55723, 66901, 102413, 164763, 72143, 134319, 53764, -133625, 253826, 227875, 477308, -29333, -87046, 217110, 91966, 48574, 706500, 94060, -299989, -127216, 179173, 315197, 255972, -62493, 125726, -165656, 246945, 236581, -75743, 94790, 237850]
12829B37850C8129b23426H2261H147K97345b00710a8751r0810q9689H3262f8648
12817E1670J1631a16743B11885A2177J25235E5431L9130b26640A61017D3467K5210
12806F8677L08609a05967A90292h6012K0772G9883a29772F2a75507p7286A34415
12794C4889M5728l4836a47714a3076A54927n1b37282A92257c16294A48246a1331
12782C7008d9145A22770e1159G1528N620b88290r1847A75664q0427E381d4723
12770A00845L11369b41438B7768i367j388j71392A92908A6082g5566A81256c9001
12758C23569A7837J12877d44353a00568E7934R8024G4329d7285A97083D0766j3001
12747B7765K58699n0476j1209j03776a23946a9466l6889n3094B22361E1346E073
$$ y = [237850, 38129, -223426, 82261, 8147, 305492, -200710, -18751, -109561, -199250, 83262, -68648, 51670, 63301, -116743, 211885, 12177, 137412, 55431, 94561, -226640, 161017, 43467, 68677, 377286, -105967, 190292, -86012, -65240, 79883, -129772, 62, -175507, -252793, 134415, 34889, 80617, 45781, -147714, -13076, 154927, 154876, -237282, 192257, -316294, 148246, -11331, 37008, -49145, 122770, -51159, 71528, 77148, -288290, -380137, 175664, 95237, 5381, -44723, 100845, 412214, -241438, 27768, -9367, -10755, -182147, 192908, 16082, -75566, 181256, -39001, 323569, 17837, 130714, -444353, -100568, 57934, 155958, 74329, -47285, 197083, 40766, 27765, 286464, 235988, 224779, 121003, -123946, -19466, -56355, -109449, 222361, 51346, 5073]
12735A51597B9746K27149E1008e4068J93D15126I9291a7462A50402N370N8237
12724B14009d3006k10767I8698b08819A47078D1506a99013A90820c44163R3942
12714b50221G0337e2761A97237b10036A64685M24782A36825o5024J59615J22265
12704C53681j25091k9098J80202A01359g0970I4043B0374a95843E49194C8066
12693B03327J12722g429k61933J0543O0953G8871B9618a03636n4410A95689G0236
12681C88805A65170p0187Q9131j9278k8007a60024B39385N8311e5075b1367A36992
12669E41720A03439J57796A695a52061c6063A20788K75286A85832B0814J94665
12659B15479K37805B494K00764J39139c3086A79375a950E6480a38871B38356b53700
$$ y = [151597, 29746, 256895, 51008, -54068, -53875, 415126, 99291, -17462, 150402, 155772, 214009, -43006, -253773, 98698, -208819, 147078, 41506, -199013, 190820, -344163, -250221, 70337, -52761, 197237, -210036, 164685, 589467, 136825, 71801, 231416, 353681, 228590, 199492, 379694, 101359, -70970, 94043, 20374, -195843, 549194, 38066, 203327, 316049, -7429, -269362, -258819, -197866, 78871, 29618, -103636, -158046, 195689, 70236, 388805, 165170, 94983, 184114, 164836, 136829, -160024, 239385, 297696, -55075, -21367, 136992, 541720, 103439, 261235, 1695, -152061, -36063, 120788, 396074, 185832, 20814, 215479, 453284, 2494, 203258, 342397, -33086, 179375, -1950, 56480, -138871, 238356, -253700]
12647A73275g6143c7661A4266J40182A2026b5302j00094G6694O5850c64434B65515
12635A39247E8514d0269H5435J91905j075i3942B10267l2103D9141J7457a75902
12623A44215n8022L55167G9702a43228C7090P8845J0943e0606B18816a94662c3292
12611A23094a80711B72772a41574B47193D2957K6344K69857a38329j24401A74561
12600G1814j3437R1554m7020J69108J8225i0701a4691H8676L1847l701J42842
12589B59664a84226C29396c23453A67647d51289a25596M5259A89521O3228C3930
12578B2181J85759c5837n9388j94762l4082g754j40766A86093G8973J7583B9360
12566B64487a55799A74980J44267P8268j61624J91854F3782M54648a4681q9469
$$ y = [173275, -76143, -37661, 14266, 154448, 12026, -25302, -125396, 76694, 142544, -364434, 265515, 139247, 58514, -40269, 85435, 277340, 276265, -93942, 210267, 178164, 49141, 66598, -175902, 144215, 86193, 441360, 79702, -143228, 37090, 115935, 126878, -50606, 218816, -194662, -33292, 123094, -180711, 272772, -141574, 247193, 42957, 69301, 339158, -138329, -262730, 174561, 71814, 58377, 149931, 102911, 272019, 290244, -90701, -14691, 88676, 120523, 116822, 259664, -184226, 329396, -323453, 167647, -451289, -125596, -80337, 189521, 252749, 33930, 22181, 207940, -35837, -95225, -289987, -324069, -7754, -148520, 186093, 78973, 96556, 29360, 264487, -155799, 174980, 319247, 397515, 235891, 427745, 63782, 518430, -14681, -104150]
12556a04150j71931A16994J81601n0889b99851a22221j68408d7129B26513F5452
12545a50020O5590J1062l8931k95973a85415b9749C82035A39938l7308D6657R6521
12534A43178M765l6194a0243k4120q2632D1419J34192b0286j35094e4827j99882
12523b54709c7810A21766a89233j82795i2558M0656A65163e5359r2190A61771
12512B381Q8894h0352b7347j06114B71522A8508P8729d05604A00357A0673M275
12501A4948L2530A9190Q4784l1216J29343K35202j74542f0022D0491K08215q3402
12490A65304K3055l6289b6058l1861B04736a07584e832A9638J29923b6897C58218
12478B32930b43691F7368J86279h8928B66782I6431D7361f4597k44061P9988o6549
$$ y = [-104150, -276081, 116994, 298595, 247706, -299851, -122221, -290629, -47129, 226513, 65452, -150020, -84430, -73368, -112299, -408272, -185415, -29749, 382035, 139938, 102630, 46657, 143178, 147943, 111749, -10243, -34363, -116995, 41419, 175611, -20286, -155380, -54827, -254709, -37810, 121766, -189233, -372028, -92558, -51902, 165163, -55359, -147549, 161771, 2381, 91275, -80352, -27347, -133461, 271522, 18508, 97237, -405604, 100357, 10673, 14948, 47478, 19190, 103974, 72758, 202101, 437303, 262761, -60022, 40491, 248706, 165304, 188359, 152070, -26058, -57919, 204736, -107584, -5832, 19638, 149561, -26897, 358218, 232930, -243691, 67368, 253647, -88928, 266782, 96431, 47361, -64597, -308658, -228670, -295219]
12467b95219E4830J7887b22947g4236j33248A80394e03643d0061F8563N4539D3923
12455g5641A90409a75011E6870j8675p869a68328P7132j05461A21481J58893N8188
12444C38562C8957L10603i7373K7631G359J83439a94001N3394G3466a75888f5841
12432a93627c6595a1219l5042A01775c04891f1133B50077m9942q1471O22c11052
12420d50690a83003f590B24230B0082J77564b49881b6688j33212A3979a54430
12409H6413A9284f2021A31181i2614p075A08589b03376C03362a22562B10029a73018
12397c68525a64555B71841A8848a61330q3489J22041l4965B260K47363A580K55375
12386B56955a16621A22321B7971a35830G0845c0940D6125b0072A7121A034c7418
$$ y = [-295219, 54830, 72717, -222947, -74236, -207484, 180394, -503643, -40061, 68563, 123102, 43923, -75641, 190409, -175011, 56870, 38195, 30326, -168328, -91196, -196657, 121481, 280374, 338562, 38957, 349560, -97373, -69742, 7359, 190798, -194001, -140607, 73466, -175888, -65841, -193627, -36595, -11219, -46261, 101775, -304891, -61133, 250077, 200135, 118664, 119286, -311052, -450690, -183003, -6590, 224230, 20082, 197646, -249881, -26688, -159900, 13979, -154430, 86413, 19284, -62021, 131181, -92614, -99689, 108589, -203376, 303362, -122562, 210029, -173018, -368525, -164555, 271841, 18848, -161330, -244819, -122778, -157743, 2260, 249623, 1580, 256955, -116621, 122321, 27971, -135830, 70845, -30940, 46125, -20072, 17121, 1034, -37418]
12374D8222a71443A42939D1772f6721K3889r7735C93147g7465B944K72805i6252
12362C47326E1018P7228F4039i9925r3594j13508R8134I7152R796a02249E8082
12350A97444a04645D4954J03880d0298D4201J34091e8865B38435a50436j1741
12340a62177P6878c4056A99552I6914K70172b65625c6911j23054m1130B10336
12329A13462b48062f6314j05789b1015A07112b2645q0764A2086K14327a33373
12318a03702D2808K73042a55832A58972O1361h5426b3316B62807e5279D0190c1837
12306b45503N6620I25P5690L427a34668A27539M7761l9883N7193J52869a22727
12294A6785a94956E8921b23016I1383J01837f8886K8964F9250a34097A51117Q542
$$ y = [48222, -171443, 142939, 41772, -66721, -42832, -140567, 393147, -77465, 2944, 275749, -96252, 347326, 51018, 128246, 64039, -99925, -193519, -307027, -208893, 97152, 106948, -102249, 58082, 197444, -104645, 44954, 148834, -40298, 44201, 178292, -58865, 238435, -150436, -162177, -85299, -34056, 199552, 96914, 367086, -265625, -36911, -159965, -201095, 210336, 113462, -248062, -66314, -172103, -21015, 107112, -22645, -103409, 12086, 226413, -133373, -103702, 42808, 315850, -155832, 158972, 220333, -85426, -23316, 262807, -55279, 40190, -31837, -245503, -188883, 925, 76615, 80042, -134668, 127539, 175300, 135417, 192610, 345479, -122727, 16785, -194956, 58921, -223016, 91383, 193220, -68886, -39922, 69250, -134097, 151117, 159659]
12283A59659D2080G68a23070C26515q2349b92925G1655J74101n3691I2758K68589
12272C61347j34395m4655d609B6205b4613A90996D9404L07067H793J02246R5923
12261B06962h651A9535a50470N085K499G9792J92502q1996F5764J1855e0542A14620
12248h5056D49997k11550b9121O09A37268a21246B69835A31195m7023Q5000o4979
12237A04193i2068C5351J04516M3892H0083L1156b5834A11371a11762B8302J94789
12226B23091P686L5195q1587b2732D8062M14336f5346E54746j95343A18642Q8521
12215B07163I5503J73723M6539e106B53132D1428O1656J39019q7865m6035j783
12204A06420l2479Q2740D6949L64364K3481A5776N10791B35040K6143b82811B55150
$$ y = [159659, 42080, 768, -123070, 326515, 244166, -292925, 71655, 245756, 192065, 92758, 361347, 226952, 182297, -4609, 26205, -24613, 190996, 49404, 356471, 8793, 111039, 206962, -8651, 19535, -150470, -145385, -142886, 79792, 272294, 190298, 65764, 77619, -50542, 114620, -85056, 449997, 238447, -29121, -28512, 137268, -121246, 269835, 131195, 84172, 169172, 104193, -92068, 35351, 139867, 183759, 80083, 111239, -25834, 111371, -111762, 28302, 223091, 230777, 265972, 184385, -22732, 48062, 462398, -65346, 554746, 359403, 118642, 207163, 95503, 269226, 315765, -5106, 253132, 41428, 103084, 242103, 154238, 108203, 106420, 73941, 156681, 46949, 411313, 434794, 15776, 526567, 235040, 261183, -282811, 255150]
12192B54840P8625j18096J33052m4255a00555B14923J35698F2905K02865i1061
12181B06336m167j1891r1311a47083F29865A35852P7357d439J850D0079L22830
12170C62909n457H8111J67818F4858J70981J38039n1219A988M9956h2865M0210
12159d2655E33878j26964F4045K2206a12365C3338N4019L04048A28707E7671a81830
12147a11425B55780n9982c21829A42539n8225a18168N4435B02139J12645n1717
12137B63067b19485B69455J9970c6492j44059B45142o7582O0208H3872J67384
12127B51256D2034f9766A08624k422R3321a21911j89126A76902m500h1782A02079
12115C70886C5781f0382A29389K80298F4721a11584k12135A48270a81839N9472
$$ y = [254840, 333465, 215369, 348421, 304166, -100555, 214923, 350621, 62905, 265770, -91061, 206336, 202169, 190278, 98967, -147083, 629865, 135852, 213209, -4439, -2589, 40079, 362909, 357452, 88111, 255929, 64858, 235839, 373878, 322659, 1988, 51944, -82865, -42655, 533878, 406914, 64045, 86251, -112365, 33338, 87357, 391405, 128707, 57671, -181830, -111425, 255780, 195798, -321829, 142539, 84314, -118168, -63733, 202139, 314784, 263067, -219485, 269455, 289425, -36492, -180551, 245142, 177560, 237768, 83872, 251256, 42034, -69766, 108624, 106202, 199523, -121911, -311037, 176902, 172402, -81782, 102079, 370886, 35781, -60382, 129389, 409687, 64721, -111584, -323719, 148270, -181839, -122367]
12105a22367J1291m5125b3868j24378m8364n8651d8591k07433A25043l8380J12830
12094A99493f1480k36445e9098j4257A28693g551k04732I8883l6549i1071I6016
12082b5016G6165K04407A09747d511B74970J47822O60379O82159q37364B91835
12071a77825Q4927A50648P5045F304O1296J63885b13241H2679J19689A00824O9861
12060A70685b29734D5841c1619B07083E8862a17953A3539a37613f1466C6971R3168
12049A30139a33259A856a28063k178k31752a0000C2394K65259H0358c73082j03619
12038d76701D0759a50478j97167a48035K7505q4255h6546d1032J753h406q4468
12027i2874A97172a65401F0008a58178c3342p7257A21292F0009P8530b2015k70358
$$ y = [-122367, -111076, -156201, -23868, -148246, -196610, -255261, -48591, -256024, 125043, 86663, 199493, -61480, -297925, -59098, -73355, 128693, -7551, -212283, 98883, 62334, -91071, 96016, -25016, 76165, 280572, 109747, -4511, 274970, 422792, 1083171, 1765330, 927966, 291835, -177825, -92898, 150648, 225693, 6304, 67600, 231485, -213241, 82679, 202368, 100824, 170685, -229734, 45841, -31619, 207083, 58862, -117953, 13539, -137613, -61466, 36971, 130139, -133259, 1856, -128063, -130241, -361993, -10000, 32394, 297653, 80358, -373082, -476701, 40759, -150478, -347645, -148035, -120530, -204785, -86546, -41032, -39279, -8406, -92874, 197172, -165401, 60008, -158178, -33342, -110599, 121292, 60009, 138539, -22015, -292373]
12016b92373A87593c0840A11159l5194K40012F8737c88636B53375k3609D1946
12005D32091I6607k7108J10821c0834j09140f4310j51679d373j67013B02282b3200
11993i2552G5495h8642c9069N596j29632B3931J12911b44103A52173n2334Q7771
11982A87610i6625C77402G3520f5551r7161a1783A76364a44554A45920a03976
11971b69236F3588J01689b38480e1436j10162f9081m1409q2940e3567H916h3484
11959I872a8775j50795A9442m987F907d1476n8065b082A84785n2318n1854a6866
11946f1715C6890J85476j1308k3010g9168j10797M6420j4086B39744n2438b5761
11934C53530a35406k81890G6003e191E0780a4775o56j32050c8228B32594I0658
$$ y = [-292373, 187593, -30840, 111159, 75965, 315977, 68737, -388636, 253375, 229766, 41946, 432091, 96607, 69499, 180320, -30834, -139974, -64310, -215989, -4373, -171386, 202282, -23200, -92552, 75495, -88642, -39069, -33473, -163105, 23931, 136842, -244103, 152173, 99839, 187610, -96625, 377402, 73520, -65551, -162712, -11783, 176364, -144554, 145920, -103976, -269236, 63588, 165277, -238480, -51436, -161598, -69081, -110490, -193430, -53567, 8916, -83484, 9872, -18775, -169570, 19442, 14455, 6907, -41476, -99541, -2082, 184785, 132467, 80613, -16866, -61715, 36890, 222366, 211058, 188048, -79168, -189965, -143545, -157631, 239744, 187306, -25761, 353530, -135406, -417296, 76003, -5191, 50780, -14775, -15431, -147481, -38228, 232594, 90658]
11922c07808d8426n6749l07902C77359j40425j12157l6297b59841N6390l1719
11912b35170A04542b3218j07692m0444A35052C7410h6388A45799E9288b2137A0148
11900H9280a08388A34836b09093C8534a3088k39611b3460B7024a40364k2931A37297
11888b33668j3144B7660a19663k7664r4006K2802E92c89583J38850A07971a30714
11876B55918D9237a77687M2708A65825n1542J38347q7364I667d1301j15696j08802
11865b65799f8522j00293p3620A68901m5523a27954F0457M417g2245B15335a5159
11853A39247C9117d58810b25491G4527a93624a138E2012a00877F5794N5332A8240
11841a45589H7816b10355B73462I2712O0126J5823o0356K9823b60532L1826d1351
$$ y = [-307808, -48426, -105175, -413077, 377359, 236934, 124777, 88480, -259841, -203451, -235170, 104542, -23218, -130910, -171354, 135052, 37410, -86388, 145799, 59288, -22137, 10148, 89280, -108388, 134836, -209093, 38534, -13088, -252699, -23460, 27024, -140364, -163295, 137297, -233668, -246812, 27660, -119663, -147327, -241333, -218531, 592, -389583, -250733, 107971, -130714, 255918, 49237, -177687, -134979, 165825, 114283, 252630, 165266, 9667, -41301, -156997, -265799, -68522, -168815, -242435, 168901, 123378, -127954, 60457, 64874, -72245, 215335, -15159, 139247, 39117, -458810, -225491, 74527, -193624, -1138, 52012, -100877, 65794, 121126, 18240, -145589, 87816, -210355, 273462, 92712, 152838, 168661, 108305, 138128, -260532, -228706, -41351]
11829h0458q3303B8057A0168c0880A49367b59932n6225B8126J31337e9991B72558
11817B57892d0802A0154J43166b06535J0949R6165M8026m3565F1663A184K98531
11806B99715h4137A1543P2972a91757E0697a10266C39492b32516g8483I7649B0520
11794c7447A86327a05209j5658e5080A71381a57367j17675B56769A26964a37918
11783B5431f4870j73517C00700r8150h475B15501F7450b27827f2705k12474B22698
11771a40541J4864C9911K6921J74240j1271a39079B64598b07604L0810b7528I638
11759B78290D614K4845f9890A33368D6909b44583C12803B2393J30443n978J7649
11748A64507J04103o4389e974k20297h628k1652A9631c1259A57461R8821b20625
$$ y = [-80458, -163761, 28057, 10168, -30880, 149367, -259932, -316157, 28126, 159463, -59991, 272558, 257892, -40802, 10154, 153320, -206535, -195586, -99421, -51395, -94960, 61663, 1184, 299715, -84137, 11543, 84515, -191757, 50697, -110266, 339492, -232516, -78483, 97649, 20520, -37447, 186327, -105209, -120867, -55080, 171381, -157367, -275042, 256769, 126964, -137918, 25431, -64870, -238387, 300700, 202550, -8475, 215501, 67450, -227827, -62705, -275179, 222698, -140541, -125677, 39911, 66832, 241072, 229801, -139079, 264598, -207604, -176794, -27528, 9638, 278290, 4614, 29459, -69890, 133368, 46909, -244583, 312803, 22393, 152836, 146858, 164507, 268610, 204221, -5974, -226271, -8628, -30280, 19631, -31259, 157461, 256282, -220625]
11736A07756d00712B45011Q9105j48939I0401J81137b97063a45820j7586K1422
11726a41984D989e9596A04836c1453F0884b06106e5140k52097d4236m5708C12136
11714B24472a03018D5882L79283E3121J7928a65116G7175K70818f495j49087l5052
11703a90634M7862A0610R4405L163E317b65992E1320g8962D37664B3406b2462
11691A73354Q0477H6149P7405N0238P6730a08376A47531F8271f2111B1887b27751
11679a1269A0577c7305F2464J88951I8950b61182C08395E8256i3513A62447p2702
11668H9745J0849C030b6578C6237f0465M668D4272M54158E9735c77152B40804
11656d0875D42073I6594R0994l8728P9863b3304k1058A64741h9123h892B04246
$$ y = [107756, -400712, 245011, 334116, 185177, 90401, 271538, -297063, -145820, -163406, -141984, 4989, -59596, 104836, -31453, 60884, -206106, -55140, -307237, -44236, -89944, 312136, 224472, -103018, 45882, 425165, 53121, 71049, -165116, 77175, 347993, -6495, -155582, -190634, -142772, 10610, 105015, 108178, 5317, -265992, 51320, -78962, 437664, 23406, -22462, 173354, 253831, 86149, 163554, 213792, 290522, -108376, 147531, 68271, -62111, 21887, -227751, -11269, 10577, -37305, 62464, 251415, 98950, -261182, 308395, 58256, -93513, 162447, 89745, 100594, 3030, -26578, 36237, -60465, -55797, 44272, 498430, 59735, -377152, 240804, -40875, 442073, 96594, 187588, 148860, 228723, -23304, -44362, 164741, -89123, -8892, 204246]
11644h6126B34834a99001K3864f9363J8766C18038H1214J48087l1804L9649H0511
11632A79693A4965J77839H9152a68504A69477b53067B13920n5166j2799Q5704
11622B31659E6518a8529A34050o1907d892A34518D7732c0260j34520F1763b6547
11610A84564o3758g5554A28578g543B6531J586R1477b99607C9991a48789A04153
11598C5171J32897K4048E1343a25519K6999A88029b17253j45113A42105c11341
11587D71408j93346a5903A00909j9893b23986A54796b8900G2090A7151a36015
11576B41657E6205J12446e6718j1025G0461P1511J04813F6564b06796f4460C28784
11564H8408l7391K0899l4542c11214B82128l3520g7427B1210K41907j22089F8151
$$ y = [-86126, 234834, -199001, -175137, -69363, -50597, 318038, 81214, 229301, 197497, 237146, 80511, 179693, 14965, 192804, 89152, -168504, 169477, -253067, 213920, 158754, 145955, 231659, 56518, -18529, 134050, 72143, -4892, 134518, 47732, -30260, -164780, 61763, -26547, 184564, 120806, -75554, 128578, -7543, 26531, 28117, 119594, -299607, 39991, -148789, 104153, 35171, 168068, 192116, 51343, -125519, -98520, 188029, -217253, -362366, 142105, -311341, 471408, 278062, -15903, 100909, 81016, -223986, 154796, -28900, 72090, 17151, -136015, 241657, 56205, 168651, -56718, -67743, 70461, 141972, 246785, 66564, -206796, -64460, 328784, 88408, 51017, 71916, 37374, -311214, 282128, 248608, -77427, 21210, 263117, 141028, 68151]
11552D146J88546h0159B04206c539A34283a42395l5664K8648A41929A3072P6418
11541H9490j4348N18463B5290J58095K8183D8249K1685a28308A73769m6213J86371
11530C13927a4212j1132G7997b99907B3084K19167b62679B41026p8390K59672
11520D22308a24564I0854j8764J0283d08187B40954C9252J58789P3499d1807B51600
11508A7737J09618L14525j38750i9723I3888N611J42290o8516M6668p9441b37447
11496A73773J5949c33283A64182E8174e116D5866b08014n0901D47101j21975q4106
11485B41020p3306j1509K15766a23041H483J28050k2617a37062F6100K36878H2830
11473b14556A78063J28021e4647B10613a01266A97189o7611b30343B2183a91144
$$ y = [4146, 192692, -80159, 204206, -3539, 134283, -142395, -178059, -149411, 141929, 13072, 89490, 75142, 593605, 25290, 183385, 211568, 48249, 69934, -128308, 173769, 127556, 313927, -14212, -25344, 77997, -299907, 23084, 242251, -262679, 241026, 162636, 422308, -124564, 90854, 72090, 82373, -408187, 240954, 39252, 198041, 271540, -41807, 251600, 17737, 127355, 441880, 303130, -99723, 93888, 99499, 241789, 173273, 219941, 140500, -237447, 173773, 189722, -333283, 164182, 58174, -5116, 45866, -208014, -258915, 447101, 325126, 241020, 167714, 156205, 371971, -123041, 8483, 136533, 113916, -137062, 66100, 302978, 82830, -214556, 178063, 306084, -54647, 210613, -101266, 197189, 129578, -230343, 22183, -191144]
11462B03793a38151D5709K4626e1416J5308A75179M3727o8723n3590P5326a59274
11450B8725L285J50930o1777n47P4157Q1615a12518e3314A73979L571a11311A39306
11437A56653a25017B51545a82666f170C25073f4762j4336L6896A6327L57309j07520
11426B66116K988g3146l2883B16326b6731j34389A40322l1711J42037C4168K64349
11415B98517d669C19235b8404B42284E3050K89565I7104b88049A0803a08252J0368
11404i7884B14068I7994l148a29267P268B20628b1151l1651A34501D375c2554
11392B2692J92102g9107K0183B92729b49607a2118D5634b35021A10169c947A63398
11380E6776a21867A10353a52732C3503J04111K41316a7387m2589B65946e2775
$$ y = [203793, -138151, 45709, 70335, -51416, -36108, 175179, 218906, 150183, 96593, 171919, -159274, 28725, 32010, 182940, 121163, 120616, 194773, 276388, -112518, -53314, 173979, 177550, -111311, 139306, 156653, -125017, 251545, -182666, -6170, 325073, -64762, -79098, -42202, 16327, 373636, 266116, 269104, -73146, -106029, 216326, -26731, -161120, 140322, 108611, 250648, 34168, 298517, -4669, 319235, -28404, 242284, 53050, 342615, 97104, -288049, 10803, -108252, -97884, 214068, 97994, 94846, -129267, -121999, 220628, -21151, -52802, 134501, 4375, -32554, 22692, 214794, -79107, -58924, 292729, -249607, -12118, 45634, -235021, 110169, -3947, 163398, 56776, -121867, 110353, -152732, 33503, 137614, 378930, -17387, -59976, 265946, -52775]
11369G2573M6291P7401R6082C1723K25988i7699F3075J96364A26823a25966A26302
11357A32224h6718C8397g3116p5021A80574o3377m9652a79199B59255a17605L5441
11346h2164A8645g1833A67890J82595C9106a48850E699J97657D859a5520m7614
11335f3134o3350c419m937A1857O2411a28291c7837A74610a63402I2815b67387
11323e0134q5627j11142e8300H1675k1137Q0049h2144c5307k86401i9928L6582
11312f3346H1775J13054f7349n119j46062C8664b54471B18231b8552B5010b4449
11300b04025d1569j26897A16050b09220A87130b0802k53817A56405P6671a43213
11289a40681e6098b1129k0138q9376A43668g1032c4727j81467d6728N235J9213
$$ y = [72573, 118864, 196265, 292347, 31723, 257711, -97699, 63075, 259439, 126823, -125966, 126302, 132224, -86718, 38397, -73116, -148137, 180574, 117197, 67545, -179199, 259255, -117605, -82164, 18645, -71833, 167890, 350485, 39106, -148850, 5699, 203356, 4859, -15520, -63134, -126484, -3419, -8356, 11857, 74268, -128291, -37837, 174610, -163402, 92815, -267387, -50134, -135761, -246903, -58300, 81675, 60538, 140587, -82144, -35307, -321708, -99928, -63346, 81775, 194829, -67349, -72468, -218530, 38664, -254471, 218231, -28552, 25010, -24449, -204025, -41569, -168466, 116050, -209220, 187130, -20802, -274619, 156405, 233076, -143213, -140681, -56098, -21129, -41267, -130643, 143668, -71032, -34727, -216194, -46728, -41493, -22280]
11278b2280B7848J7132a45524C15050A25147e85622B3368c66813b6134j54045
11268a80179Q3087k4403D245K16755a78795o888G9983c5964B70612b09296f9079
11256d6725K996H1996J60117A03010a73128O0019B318K1510c16880B37180J52864
11245C90044a92277J0695m2103f962j36567k8705A48464c2616D0683A3560e260
11233b18419c4709A34130A2101J11592i207C62341a31460L1401A09312b90146
11222b60296J00329H880a46007A97435a17065p0496P6057A15843g0093C5143K7270
11211F2413h9176j21250q4030A21680m3070g6271m0165I3521a22362o1917C55600
11199h0269A52799m2930m6358a36646j83273i1981k6285G6218L10873j37903g8419
$$ y = [-22280, 27848, 44980, -145524, 315050, 125147, -585622, 23368, -366813, -26134, -180179, -97092, -121495, 4245, 221000, -178795, -185683, 79983, -35964, 270612, -209296, -69079, -46725, -43729, 81996, 242113, 103010, -173128, -113109, 2318, 23828, -316880, 237180, 390044, -192277, -181582, -223685, -6962, -143529, -172234, 148464, -32616, 40683, 13560, -5260, -218419, -34709, 134130, 12101, 123693, -9207, 362341, -131460, -100059, 109312, -290146, -260296, -159967, 8880, -146007, 197435, -117065, -187561, -111504, 115843, -70093, 35143, 62413, -89176, -210426, -294456, 121680, 78610, -76271, -116436, 93521, -122362, -184279, 355600, -80269, 152799, 109869, 63511, -136646, -319919, -91981, -118266, 76218, 387091, 249188, -78419]
11187c59013a22525A12125a55854b3934k52144a29065l9154F9113h1226c2793
11176A39375a0698l37313M2257N7083h6743B00081o0771b25991I2327a39992L8408
11165a01584C87244a87592B1083c12336a8385A2881Q5271b52727h4417B84410
11154b79929b2804j66756k17040A73952M5522i6530H724f4066B06457d6715o5631
11143a12346J0445G4850C071a2594A28686L48670a73888O7607o804K8546A02494
11131c43747a17391c3830o8606J2159C59749D8845N8503h3629B22016C3516i4715
11119C54208a88315E8924B4697h5164J005A2230h763B15497l5929K78534A90970
11107G7625K0839K54934A29356h8670A18855K69352g9427A48819K09305b06528
$$ y = [-359013, -122525, 112125, -155854, -23934, -276078, -129065, -168219, 69113, -81226, -32793, 139375, -10698, -348011, -305754, -248671, -86743, 200081, 139310, -225991, 92327, -139992, -101584, 387244, -187592, 21083, -312336, -18385, 12881, 98152, -252727, -84417, 284410, -279929, -22804, -189560, -406600, 173952, 219474, -96530, 8724, -64066, 206457, -46715, -112346, -101901, 74850, 3071, -12594, 128686, 477356, -173888, -106281, -113085, -84539, 102494, -343747, -117391, -33830, -102436, -90277, 359749, 48845, 107348, -83629, 222016, 33516, -94715, 354208, -188315, 58924, 24697, -85164, -84159, 12230, -8763, 215497, 179568, 458102, 190970, 77625, 98464, 353398, 129356, -88670, 118855, 388207, -79427, 148819, 358124, -206528]
11096c4846l02149D53647A27195J21788b09679D22130H5713c38780C07845j28566
11086A79279O5224j19878J12007F1053K35099A2295K22794K52760G1871N0021
11076A21892J70544c9496D72151j48031J61447j67873J05880A89011L01111A35086
11065C43646K7851L24758A15134K17262L19598B84331K87267J53188j01581K04862
11055H28067l06283l5961K60785j78247R1811K04264l22444j5949J06882K150
11045F35075j0106j56022K49595L06419m63182R1025K27249l71483K32950k57877
11035D83643J07327N6717C12075M77833l09811J48463L66594l76795K93640l24168
11025E87831J84395M250l34950K34759j34457K60406C52871K45171L8432J86304
$$ y = [-34846, -336995, 453647, 127195, 248983, -209679, 422130, 85713, -338780, 307845, 179279, 244503, 124625, 236632, 61053, 296152, 12295, 235089, 487849, 71871, 121892, 292436, -39496, 472151, 324120, 485567, 317694, 423574, 189011, 490122, 135086, 343646, 371497, 696255, 115134, 332396, 651994, 284331, 571598, 724786, 623205, 828067, 521784, 485823, 746608, 568361, 660172, 864436, 541992, 526043, 632925, 635075, 624969, 468947, 718542, 1024961, 561779, 652804, 880053, 508570, 741520, 483643, 590970, 647687, 312075, 789908, 480097, 628560, 995154, 618359, 911999, 587831, 772226, 776476, 441526, 676285, 541828, 802234, 352871, 598042, 636474, 822778]
11015H22778l28266K06474J94722k92176J11741j70608J26260L91318E12577J04596
11005F17173j6210q335R399o2680L39889k98005J7608L14357B16087P68122l53426
10994F30783B60406N16994k05995M20914l48882K10410J66077C92607N77374K60896
10984A230877q5041P1831m88217K54011J74752j97816M77505j8915N7338P94403
10974B270728K4201K9416K39121N7658K14117k67312k30478j6953l64156J48880
10964B105222j20487l03134n1455l3396L5780K26729k16592j11323P4799j86273
10954A419870J96656o8567j83276l27794J76292n82614L8137K74252B92297K9177
10944C21474F5409Q7449K89329j26131a14237B17584a38980E209K08247f3604
$$ y = [822778, 494512, 700986, 895708, 603532, 715273, 544665, 670925, 1062243, 512577, 617173, 600963, 592628, 602027, 539347, 879236, 581231, 598839, 913196, 216087, 984209, 630783, 260406, 777400, 571405, 992319, 643437, 853847, 1019924, 392607, 969981, 1230877, 1145836, 1217667, 729450, 983461, 1158213, 960397, 1437902, 1418987, 1476325, 2270728, 2294929, 2324345, 2563466, 2621124, 2835241, 2567929, 2337451, 2320498, 1956342, 2105222, 1984735, 1681601, 1630146, 1596750, 1632530, 1859259, 1642667, 1531344, 1606143, 1419870, 1616526, 1547959, 1364683, 1036889, 1213181, 630567, 668704, 942956, 292297, 321474, 65409, 152858, 442187, 316056, -114237, 217584, -138980, 5209, 213456, -63604]
10933A90535n288J0822a16208B20411c20031i8942J9003E5963L05923e0650k4451
10922g5101n9594M7895C052M21856a74600c2184j24620G4817a49034d8155k2277
10911g0432Q486J1297j2136A92100a52082A66747b41874J12659n6624e0318A01594
10899d1498p0317q7394P2981H2806P1618A7130D667a73244N9278A13031e15821
10887A4882a40230A03949N9415J8394G9360J7922R7844E9785h0147m2190c5359
10875B43576b82277a3092A38423J7515c16517f4334c0805B72227o5184C4864J04120
10864A38984a4512A90612F6573g2469A71874L3131I6953A7367K4565Q2142b88490
10852g6451L4367j62951C4891d371C7361j1887b29665F3091B2950J17487J4209
$$ y = [190535, 185247, 196069, -116208, 220411, -320031, -98942, -79939, 55963, 361886, -50650, -75101, -134695, -86800, 3052, 424908, -174600, -32184, -156804, 74817, -149034, -48155, -70432, -61946, -50649, -62785, 192100, -152082, 166747, -241874, -129215, -185839, -50318, 101594, -41498, -111815, -199209, -126228, 82806, 154424, 17130, 4667, -173244, -113966, 113031, -515821, 14882, -140230, 103949, 163364, 181758, 79360, 97282, 195126, 59785, -80147, -122337, -35359, 243576, -282277, -13092, 138423, 155938, -316517, -64334, -30805, 272227, 207043, 34864, 138984, -14512, 190612, 66573, -72469, 171874, 205005, 96953, 17367, 41932, 124074, -288490, -76451, -42084, -205035, 34891, -4371, 37361, 25474, -229665, 63091, 22950, 140437, 154646]
10841A54646C4241a54932N3800c8319j26755b2187p5840j91119J22268B87360
10830G0063a63162K5684j62156A68384j2467a21156A677h5023c9573A5923M8408
10819F4331b76927f530m6334j23940n9599k7596B60427J40250b12794e7394q5108
10808a42502j11660D9514J32392h0016o5884B11803E9042J95159b77696f4837
10797a64860j34161A4220e6894F0278c7407A01836J12579c6975q3625j43014B274
10785D8702a32158b1650A96555J9847i1119o0858L6589k38948h7476A76308a04277
10773C12998b0253j33497K8667B12714b4554C23085J25199f8771J992A08432h0699
10761a34604j14143e72E1456J3369c18361P5292A4225f9173q3119d0819D155J871
$$ y = [154646, 34241, -154932, -101132, -38319, -165074, -22187, -98027, -289146, -166878, 287360, 70063, -163162, -137478, -299634, 168384, 155917, -121156, 1677, -85023, -39573, 15923, 64331, -276927, -6530, -52864, -176804, -236403, -263999, 260427, 400677, -212794, -57394, -142502, -254162, 49514, 181906, -80016, -145900, 211803, 59042, 254201, -277696, -64837, -164860, -299021, 14220, -56894, 60278, -37407, 101836, 214415, -36975, -120600, -263614, 2274, 48702, -132158, -21650, 196555, 216402, -91119, -151977, -115388, -354336, -87476, 176308, -104277, 312998, -20253, -153750, -125083, 212714, -24554, 323085, 448284, -68771, -66779, 108432, -80699, -134604, -248747, -572, 51456, 64825, -318361, -243069, 14225, -69173, -152292, -40819, 4155, 6026]
10749F026d8689C5750g3376A1679a06722A93605f0271D8718H755e4340j46128
10738b00468A80473F3544c34703b8788k90148e7593n1123A24580b54504J8202
10728b36302k47531f2987j24182j44383B363J63723h5694A65100m4867a33589
10717a12703F2445a09569j81568I7584b71928R4047c8638k06225B31726b67388
10706b1399k86937J47007f0761G4490a52586e496m7841A98019L8518H5844C2710
10694A24681A6755M50479c33356g0852j75093M6617A82478J26055a4427D9396
10683a54991A35724b62773R6347C3923c65507a03215L7450i801r0229p2381j45037
10672c17448i3627I2581a05596l432M3394D7399N9812Q3702a85735j4171g6138
$$ y = [6026, -48689, 35750, -73376, 11679, -106722, 193605, -60271, 48718, 8755, -54340, -200468, 180473, 63544, -334703, -28788, -318936, -57593, -108716, 124580, -254504, -236302, -483833, -62987, -187169, -331552, 2363, 166086, -85694, 165100, 120233, -133589, -112703, 62445, -109569, -291137, 97584, -271928, -177881, -38638, -244863, 231726, -267388, -21399, -308336, -161329, -60761, 74490, -152586, -5496, -53337, 198019, 236537, 85844, 32710, 124681, 16755, 467234, -333356, -70852, -245945, -199328, 182478, 308533, -14427, 49396, -154991, 135724, -262773, -166426, 33923, -365507, -103215, -65765, -9801, -100030, -172411, -317448, -93627, 92581, -105596, -109028, -65634, 47399, 107211, 190913, -185735, -199906, -76138]
10660b96464c6515a7447j99242B1233h4867m3308B28135c97909I7264A7999a17251
10648A43655c34822j2445a14767A23781b23352b2703k19943d9218j39495A12104
10637a44614E8304a70838C20508j47117p9927R935L4217o3506a34672I1549a08652
10625a49453B68693K3141H440g6363A6874g8496H7646C5660J35559c79095C6690
10613a09179A16112r787J3415a58635q2032o5877A67508a83864m333Q6588B11514
10601A7027O9864Q1445c04878b1036n0681q3148B08705a26661e2499a8359A30308
10589F5792k0099a81707B20784f4673B3409K6597a07470B7239a75898n1148J01293
10578a25753C82033b37418A84816d08935B44142b03394F1349J94233b14261j86800
$$ y = [-296464, -36515, -17447, -216689, 21233, -84867, -128175, 228135, -397909, 97264, 17999, -117251, 143655, -334822, -347267, -114767, 123781, -223352, -22703, -242646, -49218, -188713, 112104, -144614, 58304, -170838, 320508, 173391, 93464, 103399, 137616, 74110, -134672, 91549, -108652, -149453, 268693, 291834, 8440, -76363, 16874, -78496, 87646, 35660, 171219, -379095, 36690, -109179, 116112, 106325, 119740, -158635, -240667, -306544, 167508, -183864, -188197, -101609, 211514, 17027, 86891, 168336, -304878, -21036, -71717, -154865, 208705, -126661, -52499, -18359, 130308, 65792, 45693, -181707, 220784, -64673, 23409, 50006, -107470, 27239, -175898, -227046, -125753, 382033, -237418, 184816, -408935, 244142, -203394, 61349, 255582, -214261, -401061]
10568d01061B65839h5442K8015E97225i0974H4073e5294Q987A86295H2688d1442
10556B54068f5379E1527a67239A01261a04925A3415J07116Q95a4943j54505N7004
10545a12444M4967A52576G5097c44069h795A85317b11526l6947H3278B6979e0312
10533A98532i5904J1503B98166c13570L6921P577a31948M5468E732P9058A5457
10521c12211h6477j40193e7330r1962H5717i5276p6855H2000B3153G687a21659
10509e9678A38598h3869B0783J70450a60390j22349h4897k11260A20663m8127
10499G2536J38790d31406O3670E8753J58599d1642o1628k83985b4794A34411l478
10488A30933b02087A32381c84411a54910A79480a33159G44624k63912B03337M09811
$$ y = [-401061, 265839, -85442, -57427, 597225, -90974, 84073, -55294, -46307, 186295, 82688, -41442, 254068, -65379, 51527, -167239, 101261, -104925, 13415, 120531, 121426, -14943, -169448, -112444, -67477, 152576, 75097, -344069, -8795, 185317, -211526, -248473, 83278, 26979, -50312, 198532, -95904, -84401, 298166, -313570, -276649, -269072, -131948, -86480, 5732, 84790, 15457, -312211, -86477, -226670, -57330, -149292, 85717, -95276, -172131, 82000, 23153, 7687, -121659, -59678, 138598, -83869, 20783, 191233, -160390, -282739, -84897, -296157, 120663, 72536, 211326, -431406, -367736, 58753, 217352, -41642, -103270, -387255, -24794, 134411, 130933, -202087, 132381, -384411, -154910, 179480, -133159, 744624, 480712, 203337, 613148]
10478F13148A78645J29974J2676m8406L2950o0645b2284l8824J5625l45931D03236
10466b01619A75770b90667F090e8895A80097B0428a12578H758g9853I4487g3247
10454B45827c02291J09696H2909a39820c884E8961M7528a52343B11208e4397j27962
10443a82359O655B10974J2742Q5369i8687r0111h1119l1995b4276j52831l334
10432a80441j8964B0653b25192B64816i9122A94955A0858a8073B6170g0241A20916
10420A44548c09166M9700h9695A57956a61866j03509N6937G6897e02861A77972
10409I7889a24798F6263a76640C60221j30912c9447d096I7794b20032h8658p1958
10398a60616G660b59509J14444e4929j8568B08125J25494C6825J77672a81552
$$ y = [613148, 178645, 308619, 321295, 272889, 305839, 245194, -22284, -61108, -45483, -391414, 403236, -201619, 175770, -290667, 6090, -58895, 180097, 20428, -112578, 8758, -79853, 94487, -73247, 245827, -302291, -192595, 82909, -139820, -3884, 58961, 106489, -152343, 211208, -54397, -182359, -175704, 210974, 223716, 309085, -98687, -188798, -81119, -113114, -24276, -177107, -180441, -199405, 20653, -225192, 264816, -99122, 194955, 10858, -18073, 26170, -70241, 120916, 144548, -309166, -259466, -89695, 157956, -161866, -265375, -208438, 76897, -502861, 177972, 97889, -124798, 66263, -176640, 360221, 229309, -39447, -4096, 97794, -220032, -88658, -160616, 7660, -259509, -145065, -54929, -73497, 208125, 333619, 36825, 214497, -181552]
10387B08942a6970A79721a65166J0458B03842b94393E0149b09738A08706L9629
10377A48335a31367B62951J4412J06111i1981M0417A68171L22693B07660K3802
10367B31462a53622D52477B09482K35540j48988A00325J93134j4485m2398r0866
10357A45710k2039J86121J38976j11277l5278K31492K09153j72877o3999G8393
10346A90320J94011A03518L06931N8412p3947B223O35168A17942c7975C38304
10335A4947P4184d11341a44663G249N3627c91654A91751J7342h4537j6235A67569
10323d0654A37245O4242Q9556F1986A0954J23486q015j343A576L58543a35124
10311a8701A21831C5971L43584j42107H4506a49153j49822b9754B7973a16165
$$ y = [208942, -16970, 179721, -165166, -154708, 203842, -294393, 50149, -209738, 108706, 148335, -131367, 262951, 277363, 383474, -91981, -51564, 168171, 490864, 207660, 231462, -153622, 452477, 209482, 445022, 296034, 100325, 293459, 278974, 236576, 145710, 123671, 309792, 448768, 337491, 302213, 533705, 742858, 569981, 505982, 78393, 190320, 384331, 103518, 410449, 468861, 394914, 2223, 637391, 117942, -37975, 338304, 14947, 89131, -411341, -144663, 7249, 60876, -391654, 191751, 209093, -84537, -100772, 167569, -40654, 137245, 201487, 291043, 61986, 10954, 134440, 126425, 125082, 1576, 360119, -135124, -18701, 121831, 35971, 379555, 237448, 84506, -149153, -298975, -29754, 27973, -116165]
10300B84780b01969A6648a1294j48818A7028c0378a4198A75636d02857M3122b3989
10288B07777c50924a66776J811j35600P7613j64349b7574r1083A33397o558d71506
10276A09402b320D8944J27196a11079g195j169A51194n3471J8116l3225J26880
10265B09494g385j12626q1975B28044L13750B28061K86259E3166L43173A34497
10254B99057A29573L3531D334K51325f0424n4718b1577K483j29766e9904p8903
10243a38807c9015B21805g3858I2711a53281c9414r4864e2821j1446a7623k02002
10232b19625a00217A35792a864j22071E0489b582k1880l3766A81504l2318J76519
10221C25705i0793J0418c2194A4663M9786b39015D0314a90293b3503j50784b9840
$$ y = [284780, -201969, 16648, -11294, -160112, 17028, -30378, -14198, 175636, -402857, -359735, -23989, 207777, -350924, -166776, -164965, -300565, -222952, -387301, -27574, -118657, 133397, 126839, -471506, 109402, -2320, 48944, 176140, -111079, -7195, -8364, 151194, 97723, 115839, 82614, 209494, -7385, -120011, -201986, 228044, 541794, 228061, 514320, 53166, 396339, 134497, 299057, 129573, 163104, 4334, 255659, -60424, -115142, -21577, -19094, -148860, -59904, -138807, -39015, 221805, -73858, 92711, -153281, -39414, -134278, -52821, -64267, -17623, -219625, -100217, 135792, -1864, -123935, 50489, -2582, -24462, -58228, 181504, 149186, 325705, -90793, -80375, -32194, 14663, 64449, -239015, 40314, -190293, -23503, -174287, -29840]
10209a33731n7710D2829L3766r813g0876K9405p0171A32550a85483Q2108A02548
10197c9149B8578N6538b66189D336c67075c7596F4058O2572b14093A49111c9112
10185B40760B1811a36405d177j54644A62508b52639E4853E951a39679M6813A81726
10173b19262A65042c2729A29655a45874o0415J00933n5332j5159P3153j60493
10163b63187E0732K3367a0500l4525j29578I1688e7162k20956j55602A07891b97809
10151b02418A84161p8139M9703f6139O599j19996O6915H5935R347a00102j48442
10140b48544A85720f6832j32574j37203J64576M4984m6026K5997G0338c87181
10129b67794G0931j8634O708a92281n5414J15337F7809C426i051A85666b66199
$$ y = [-133731, -191441, 42829, 76595, 66782, -70876, -41471, -111642, 132550, -185483, -103375, 102548, -39149, 28578, 85116, -266189, 4336, -367075, -37596, 64058, 126630, -214093, 149111, -39112, 240760, 21811, -136405, -4177, -158821, 162508, -252639, 54853, 5951, -139679, -92866, 181726, -219262, 165042, -32729, 129655, -145874, -206289, -105356, -160688, -175847, -102694, -263187, 50732, 74099, -10500, -45025, -174603, 91688, -57162, -278118, -433720, 107891, -297809, -202418, 184161, 106022, 155725, -66139, -59540, -179536, -112621, 85935, 95282, -100102, -248544, 185720, -66832, -199406, -336609, -172033, -127049, -173075, -147078, 70338, -387181, -267794, 70931, 52297, 59005, -192281, -247695, -132358, 67809, 3426, -9051, 185666, -266199]
10117d4860B43071a67920A03894a6247B2878O1992P1044A5467a94861e3641o5272
10106a18913G3535J0958d1239p2530I8530C8307c10896a46769p8422A93835J12225
10095C06060a79009e9875K623A75655d48148a54220A00936a71705A91510c60629
10084H7002L6823b78192E2106f6426A64149g3904p3329O4399c4451C33781c4724
10072h4448p7490a6056F2003c29663b6809I1086a76060k39008H1989J30786G6321
10060b73438J20552a3717m3368E3483f0571A2748J18699c6763j16025j60586Q9146
10049b24228g7304m1458b2942j78955q6199H9289d98335K36504B24423r7416I853
10037c13072p43K8910A24833D0315b30206O7480A65007l3773f4987j97671j57287
$$ y = [-44860, 243071, -167920, 103894, -16247, 22878, 84870, 155914, 15467, -194861, -53641, -118913, 73535, 84493, -41239, -113769, 98530, 38307, -310896, -146769, -225191, 193835, 306060, -179009, -59875, -57252, 175655, -448148, -154220, 100936, -171705, 191510, -360629, 87002, 123825, -278192, 52106, -66426, 164149, -73904, -147233, -82834, -34451, 333781, -34724, -84448, -161938, -16056, 62003, -329663, -26809, 91086, -176060, -415068, 81989, 212775, 76321, -273438, -152886, -13717, -57085, 53483, -60571, 12748, 131447, -36763, -152788, -313374, -224228, -77304, -118762, -22942, -201897, -288096, 89289, -498335, -261831, 224423, 127007, 9853, -313072, -313815, -284905, 124833, 40315, -230206, -162726, 165007, 131234, -64987, -262658, -419945]
10026d19945b3249m04777A6949g9461a2240A74129d98081A85186H8641g2949k52857
10015c25806A06281m0435a22217A74297h6541B74022a62385A20805a10232I9281
10004G3214P3154J35533a22105e8841A52655J0221b40461l3847A75264i2114J5327
9993g6787A0701a26187B41598p6593c1285k27165L5158N4318B53877C546K59498
9982B63044a52376f943F484a90434a1193k12230m9581i4445n4106O0322j68742
9971b56971L5529d6877k7324I535b3058k04673I297c73349E4846c388k24262d8622
9958C3460J92081B6589a44372H2912b9502k12385n7514A69952h3857N860L3157
9947d4840j19788A29397l4481b20215a7189B57722H8191i0269A83940E0278c18511
$$ y = [-419945, -23249, -428026, 16949, -79461, -12240, 174129, -498081, 185186, 88641, -72949, -325806, 106281, 65846, -122217, 174297, -86541, 274022, -162385, 120805, -110232, 99281, 73214, 146368, 281901, -122105, -58841, 152655, 162876, -240461, -274308, 175264, -92114, -76787, 10701, -126187, 241598, 165005, -31285, -258450, -223292, -168974, 253877, 3546, 263044, -152376, -6943, 6484, -190434, -11193, -223423, -273004, -94445, -148551, -88229, -256971, -221442, -46877, -74201, 9535, -23058, -227731, 9297, -373349, 54846, -3388, -227650, -48622, 33460, 225541, 26589, -144372, 82912, -29502, -241887, -299401, 169952, -83857, -77997, -44840, -164628, 129397, 94916, -220215, -17189, 257722, 88191, -90269, 183940, 50278, -318511]
9935H1430a30268A50932c52245a3725o5818k04621b5692l07200A76938c25732
9924h1103B15077b86771a13150d4835m1402m3935J1560N11G89c40080E4070a62129
9911a54318c9417j2676j33910L1668P2695c9679B09951b15536j31579O4e0799
9899C030a25617N1814l53322A4394L17357c24190g2564N841J5590A31485b34634
9887c62928c0404o3945B19199A01751a21639k0334j23676I5755a58775k1449n2349
9876b32573J15630A52624e9527k39410M4928A83798B1668g5172B5714M3280e1040
9864a61300H004b41316A78398a487C5166a43061A79884a24557o9777E235h3287
9852A4663L9a64189j45903b6826C96304A75757a96214E996c65509F3304c51256
$$ y = [81430, -130268, 150932, -352245, -13725, -79543, -284164, -25692, -332892, 176938, -325732, -81103, 215077, -286771, -113150, -44835, -86237, -130172, -118612, -118101, 789, -340080, 54070, -162129, -154318, -39417, -52093, -186003, -154335, -81640, -39679, 209951, -215536, -347115, -347051, -50799, 3030, -125617, -73803, -427125, 14394, 331751, -324190, -72564, -66723, -51133, 131485, -234634, -362928, -30404, -94349, 219199, 101751, -121639, -141973, -265649, 95755, -158775, -180224, -232573, -116943, 152624, -59527, -298937, -254009, 183798, 21668, -75172, 25714, 68994, -51040, -161300, 8004, -241316, 178398, -1487, 35166, -143061, 179884, -124557, -194334, 5235, -83287, 14663, 14702, -164189, -310092, -26826, 396304, 175757, -196214, 5996, -365509, 63304, -351256]
9840e68650a7512j6661l516r7152k71186a39909k58379A7329k280i9756k30911
9829c30667J63531D5378a334I954a76604C2752O1151g8898j27839A955b486j41307
9817a43793k585d6911k7223B02788O2538G8718M9223a6519D1317a89298q2016
9806b71314A58721a68445j6065D4482M27289a18803I300a26609p7189e0112k1628
9795g1740i133k13509J5037j390l9183j8319A25456a67029k16719A0803P3217
9784H4020d4853D8547h8931B57875q6182b8006m813j48489e4360A14508a61734
9772A948C08b13928F9593C3378f0635j63939b6690C57072a70931A81760E3034
9760b12847h8337l12912I7958a61316M177j4587d5546n3967l52600F6012b17055
$$ y = [-568650, -17512, -34173, -37689, -134841, -406027, -139909, -398288, 17329, 15049, -99756, -330667, -167136, 45378, -1334, 9954, -176604, 32752, 93903, -78898, -206737, 1955, -2486, -143793, -146378, -46911, -74134, 202788, 265326, 78718, 127941, -16519, 41317, -189298, -271314, 158721, -168445, -184510, 44482, 471771, -118803, 9300, -126609, -203798, -50112, -71740, -9133, -222642, -207605, -208995, -248178, -266497, 125456, -167029, -383748, 10803, 84020, -44853, 48547, -88931, 257875, 171693, -28006, -32819, -181308, -54360, 114508, -161734, 1948, 308, -213928, 69593, 33378, -60635, -224574, -26690, 357072, -170931, 181760, 53034, -212847, -88337, -401249, 97958, -161316, -157139, -171726, -45546, -99513, -452113, 66012, -217055]
9748a85732n2920B03289a18075K867k9849j0929o1038a3746l19824c1899j69132
9737b01031H1085a32789G6252b50528A77673c23460b5289r0923M249G0964c4743
9725B79530a43646k00784A32220d2703o6240c5609j54437C037c46604a66047j5690
9714a81737D8011d36859h5849a4201p5523A77818F9189k4734K29981I9781c97102
9702B32739D657d4793B34033b5402k11798N8543A27556e71015b12634d1740H4675
9690B07392c98278g6373j81992h7702A94568a7269p2733B654K49786c58k25704
9679b26062D4982d8629A74373E9785d23634G2965M7520h2830l70118K25702A64777
9667A31215g5704j29345I4745j8422J22555b13758A10556l2938K39319a91853
$$ y = [-185732, -238652, 203289, -118075, -115208, -145057, -155986, -217024, -13746, -333570, -31899, -201031, 81085, -132789, 76252, -250528, 177673, -323460, -25289, -116212, -111963, 70964, -34743, 279530, -143646, -344430, 132220, -42703, -108943, -35609, -190046, 3037, -346604, -166047, -181737, 48011, -436859, -85849, -14201, -89724, 177818, 69189, 44455, 274436, 99781, -397102, 232739, 4657, -44793, 234033, -25402, -237200, -178657, 127556, -571015, -212634, -41740, 84675, 207392, -398278, -76373, -258365, -87702, 194568, -17269, -90002, 2654, 252440, -358, -226062, 44982, -48629, 174373, 59785, -423634, 72965, 120485, -82830, -452948, -227246, 164777, 131215, -75704, -205049, 94745, 76323, 198878, -213758, 110556, 77618, 316937, -191853]
9656c14091J41487A17092C5798h8243B41363c1035n6419b0505l08442a6505j75188
9645a91693b1694j0601p7790A03771n130b52762A79442O0008e3499i53B41732
9633b31581i1503l2905A97475q0046a12279D4157J201a3998l46521J28334e1338
9621a46767c8300p8978l3353M3508E948c34315n991J02117N3782f7528q3961M4239
9609a07250p3834m3788O3144A52190a71250O0218B61147C0816c23788h0103J0920
9598f9183j8679k68025C1298M1524R838A5891b19384B7644b02776Q7783I4858
9586b08695j39528J3218f072F7134O7921a73096h1968J6301k76386f8380A30148
9574E7508i4081B56220a4784k6243I569b66245m3898j50098A9431N0437b1552
$$ y = [-314091, -172604, 117092, 35798, -88243, 241363, -31035, -87454, -20505, -328947, -16505, -191693, -21694, -32295, -110085, 103771, 98641, -252762, 179442, 239450, -53499, -953, 241732, -231581, -91503, -124408, 197475, 117429, -112279, 44157, 45358, -13998, -360519, -232185, -51338, -146767, -38300, -117278, -150631, -107123, 5948, -334315, -340306, -238189, -184407, -67528, -151489, -107250, -181084, -224872, -161728, 152190, -171250, -111032, 261147, 30816, -323788, -80103, -69183, -87862, -355887, 31298, 72822, 82660, 15891, -219384, 27644, -202776, -114993, 94858, -208695, -348223, -335005, -6072, 67134, 135055, -173096, -81968, -65667, -342053, -68380, 130148, 57508, -94081, 256220, -14784, -41027, 9569, -266245, -310143, -460241, 19431, 69868, -21552]
9562F5148K61583i2895B22338L1952a26121H3113g8547C07278c9863B64665a06269
9550I1905c02170K8079h7861b2521k83852J24191H5340a31816a7907j1062A6212
9538I7690a3137A39816b61825f3720J1639j66553A63217A7416c7995h821k70901
9527b79722R4502b4349r3422A6370a60380o4636k40822B13470a49162B5506d6606
9515a52616A16562a10694c3111k46904D864J75051c77037c4461h110c210C67035
9503a70765d4124B62919a30488H887c09919A38098g0584A07732P5669a81482a1540
9491b0378j33017H3088a05062c2633A7264a9089A24161Q7731a34212F4814O7449
9480A32263b45565A3808b51471a10057n5487k593f9085g203j72801g2859H6816
$$ y = [65148, 326731, -92895, 222338, 254290, -126121, 83113, -78547, 307278, -39863, 264665, -106269, 91905, -302170, -274091, -87861, -22521, -306373, -182182, 85340, -131816, -17907, -28969, 16212, 97690, -13137, 139816, -261825, -63720, -52081, -218634, 163217, 17416, -37995, -8821, -279722, -185220, -24349, -117771, 16370, -160380, -225016, -465838, 213470, -149162, 25506, -46606, -152616, 116562, -110694, -33111, -280015, 4864, 179915, -377037, -34461, -8110, -3210, 367035, -170765, -44124, 262919, -130488, 8887, -309919, 138098, -70584, 107732, 183401, -181482, -11540, -20378, -153395, 83088, -105062, -32633, 17264, -19089, 124161, 211892, -134212, 64814, 132263, -245565, 13808, -251471, -110057, -165544, -168137, -69085, -7203, -180004, -72859, 86816]
9468b92189e1146j326J7191q8765A41892h5819j38241l9637b8156l88605C6400
9456i2179c4857J5447K021l55749f2253j54466D1491d2335k63438K6471a0080
9444b66896a20018H8020b51451m9117a20322k00066A7095e6378q9555G6956b5809
9432e2714A97525a48678E2569a86934O6719M1285n8787f8460j60886K5708A8704
9420D3633b20766R7447a3725E1160a38052A7540K69174A19834P285Q3296b20851
9408c1352B79818E9580b85285o1318J39228A25991n0746R389g9134r6488B96606
9396a48299a1707A27075k6082g3997A40506n2938l1825A3688J0923b28336H7417
9384g717n58995b15068a01646d857A00596M389a0005j30014A41186h9826A57720
$$ y = [-292189, -51146, -52472, -35281, -124046, 141892, -85819, -224060, -263697, -28156, -416761, 36400, -92179, -34857, -19410, -17389, -373138, -62253, -216719, 41491, -42335, -305773, -279302, -10080, -266896, -120018, 88020, -251451, -300568, -120322, -320388, 17095, -56378, -145933, 76956, -25809, -52714, 197525, -148678, 52569, -186934, -120215, -78930, -137717, -68460, -229346, -203638, 18704, 43633, -220766, -123319, -13725, 51160, -138052, 17540, 286714, 119834, 127119, 210415, -220851, -31352, 279818, 59580, -285285, -346603, -207375, 125991, 75245, 84634, -79134, -175622, 296606, -148299, -11707, 127075, 100993, -73997, 140506, 87568, 55743, 13688, 24611, -228336, 87417, -7717, -566712, -215068, -101646, -4857, 100596, 104985, -10005, -140019, 141186, -89826, 157720]
9372g3833j5847Q863j66743M6536c6221k81630p966h3125k60699a30394j10102
9361b40496J19631a4440r7576J7094G5860a73427a579B70679D3919d4635K1099
9350b3536j93296k3316F1752b86399R0549B9474K698J9924f2904j22323Q4365
9339a00862L5822m81962E440J26790e4191B09680g008j38010k7300j91621a76136
9327B82486j29369b81769A1633a38077B60944a31871L2963A42774c3464m9461
9317h2925E938c0591n7879k3916N1817m11413d3617l15285d6231C35780a79052
9305b31773f448j51028K0386H4412b99438N6094A1360J3024c4679A19019h0320
9293d0995J1518p4430H439K980c17654a42968a3387B3180a62308q9819J17829
$$ y = [-73833, -89680, -80817, -247560, -201024, -36221, -317851, -325817, -83125, -343824, -130394, -240496, -120865, -14440, -112016, -94922, 75860, -173427, -1579, 270679, 43919, -44635, -23536, -216832, -240148, 61752, -286399, -195850, 29474, 32172, 52096, -62904, -185227, -100862, -65040, -547002, 5440, 132230, -54191, 209680, -7008, -145018, -172318, -363939, -176136, 282486, 153117, -281769, 11633, -138077, 260944, -131871, -98908, 142774, -33464, -82925, 5938, -30591, -88470, -112386, -60569, -471982, -43617, -358902, -46231, 335780, -179052, -231773, -6448, -157476, -137090, 84412, -299438, -243344, 11360, 24384, -34679, 119019, -80320, -40995, -29477, -103907, 8439, 11419, -317654, -142968, -13387, 23180, -162308, -252127, -134298]
9282a34298O0539r2962Q0300j33497N1141H1351B889b17058N5471G1521g3077
9270A10607K9403i6841A30575a06359A48472B0439i7733j07699i8233C8164M02461
9259D40625B1409g9183e774o4999B43473a81395e7894q3342N1235q8116e7843
9247a06032m2345H0754d4215B50075H9474K75745j49144d8899H7138R4298b51012
9235e0757k89922E9329a11279l1527A4319b40823A67532g5972o7005N4398j47961
9224b36540o7145D2893Q453J33793I2432a14104B63470a15783k684k92906A84624
9212a21662k03096J60341H2218b64074I0893a74268A20458a74615l8253J5497
9202a97371m50070c09287a29153L4743D1836d05443e1481m7912B42278c975j40908
$$ y = [-134298, -73759, -166721, -86421, -219918, -168777, 81351, 2889, -217058, -161587, 71521, -73077, 110607, 140010, -96841, 130575, -106359, 148472, 20439, -97733, -205432, -98233, 38164, 440625, 21409, -79183, -5774, -70773, 243473, -181395, -57894, -141236, -90001, -178117, -57843, -106032, -148377, 80754, -44215, 250075, 89474, 365219, 216075, -48899, 87138, 181436, -251012, -50757, -340679, 59329, -111279, -142806, 14319, -240823, 167532, -75972, -142977, -88579, -236540, -303685, 42893, 51346, 185139, 92432, -114104, 263470, -115783, -118467, -411373, 184624, -121662, -324758, -164417, 82218, -264074, 90893, -174268, 120458, -174615, -212868, -197371, -647441, -309287, -129153, -94410, 41836, -405443, -51481, -99393, 242278, -3975, -144883]
9191a44883o8966j26714a64625c4106k8538j2341b5318q4726n758A54500b52282
9179c37280a16895J6237I5552B1914f2541F4006L53999c75651a18552B3515A281
9167a42754l9045g6441o7801K7104r3487B4565J8866J2239b77396n5851c0091
9155b509j79071e3957G2461b3851k83837a30406m7655N3032d1750k39089a18883
9143a10562q2102A73037a82658B22988b37648a4995j55575D3335a52353A27101
9132G1087l925f555k4093j68134Q5658k07861J06014G5501K80382b56404o699
9121b63103c2026B4878I837a3881j14359l676r8848F1422M6858D2222Q8555f5314
9108a67404q8074L5524e3264k07279D3575h9006j9769N2331l96238D25340a29269
$$ y = [-144883, -213849, -340563, -164625, -34106, -62644, -74985, -25318, -110044, -115802, 154500, -252282, -337280, -116895, -100658, 95552, 21914, -62541, 64006, 418005, -375651, -118552, 23515, 1281, -142754, -181799, -76441, -144242, -117138, -210625, 24565, 43431, 55670, -277396, -333247, -30091, -2509, -181580, -53957, 72461, -23851, -307688, -130406, -178061, -125029, -41750, -280839, -118883, -110562, -192664, 173037, -182658, 222988, -237648, -14995, -170570, 43335, -152353, 127101, 71087, 67162, -6555, -30648, -198782, -113124, -320985, -214971, 75501, 355883, -256404, -263103, -32026, 24878, 9837, -13881, -128240, -131916, -230764, 61422, 108280, 42222, 130777, -65314, -167404, -255478, -219954, -53264, -260543, 43575, -89006, -108775, -56444, -452682, 425340, -129269]
9096g5818j56890A2411b64816L2157M3753j29945A31317c765Q62j286j63921j03900
9084b72010B10407Q9853f2285k07982k1485L3429h9127a3752o4623n4780j56977
9073b90132A77386a55636b5286j20996l4325j27024a23657A41230o2133L0023
9063A09120m2164g8034A78366j9613a96204n8416a21272B2353b3045k35331F661
9051A86114F470L00111b08648B02564d12396a08998H7954J79616b9994C09901
9040E7887B7216i1590k55094i9890e662k36259D5370J3905K2635d27176a99881
9028a82578h693A724M55355e1849j48786P4315A2105a2134l56246C40b70748C6260
9015g0552b1607C3075d13010G6904j9163c72317B62422g9359D3218L62605c28215
$$ y = [-75818, -232708, 12411, -264816, -232659, -188906, -318851, 131317, -3765, -2903, -4189, -168110, -272010, 210407, 300260, -62285, -270267, -291752, -258323, -89127, -13752, -78375, -133155, -290132, 177386, -155636, -25286, -146282, -180607, -307631, -123657, 141230, 79097, 109120, 66956, -78034, 178366, 158753, -196204, -254620, -121272, 22353, -23045, -258376, 6661, 186114, 6470, 306581, -208648, 202564, -412396, -108998, 87954, 267570, -29994, 309901, 57887, 27216, -91590, -346684, -99890, -5662, -241921, 45370, 59275, 81910, -427176, -199881, -182578, -8693, 1724, 457079, -51849, -200635, -126320, 12105, -12134, -368380, 340, -270748, 36260, -70552, -21607, 33075, -413010, 76904, 57741, -372317, 262422, -79359, 43218, 405823, -328215]
9003b05860D6004A2550c31514N5594H3964K04654a13993B50900i716j46290R050
8992a46956j32917N7971n7643B50869F9809J63095b59155h5586A08910M1878p504
8981A43284e3378j22773f7784k49979J9999c1264o2166C2902c14152g7665j3089
8970i0754B17912b58818B6967j0446J18448i7904B18447a32564B33485a66328
8959A74877b6822A19177a52162e805A57334a15198k61543C5470K15625j21186
8949A29909i895B23437i7157D5942d27842a24312F9167a55910J9581G2500b23857
8937c6089j9423B62194a79198F7670c28857G3746a16046j33447J570G1847a29899
8925A25780K10125A46369N73600P70846k82288E62772k08408a74763A78643b28349
$$ y = [-205860, 46004, 12550, -331514, -275920, 83964, 288618, -113993, 250900, -9716, -156006, -146956, -279873, -221902, -279545, 250869, 69809, 232904, -259155, -85586, 108910, 150788, 143284, -53378, -176151, -67784, -317763, -297764, -31264, -93430, 32902, -314152, -77665, -90754, 217912, -258818, 26967, 16521, 134969, -97904, 218447, -132564, 233485, -166328, 174877, -26822, 119177, -152162, -5805, 157334, -115198, -376741, 35470, 251095, 129909, -9895, 223437, -97157, 45942, -427842, -124312, 69167, -155910, -136329, 72500, -223857, -36089, -55512, 262194, -179198, 67670, -328857, 73746, -116046, -249493, -247923, 71847, -129899, 125780, 335905, 146369, 719969, 1490815, 1208527, 562772, 354364, -174763, 178643, -228349]
8914H6400d6574a860q6831A11535c28845N9202A26779o3039B7179i0101j39790
8903b29891m5701a16019p0963F3963a9560A87506H599J39385a30461n5775E275
8891a77043m1608l7717i5191E7413O6197c34333G5280c57594A80230J07092A03739
8879a0246G6617b44758Q436O2143N972H5856a35041A08418h2381o3984r7441j97311
8867d41117F1021a37074g671r8311D2218a93796A05500l7389K01113A8614O331
8856B4945a64429A47739D7913b29937a07113J9512c6824j07484n670f3596q6064
$$ y = [86400, -46574, -1860, -88691, 111535, -328845, -269643, 126779, 63740, 27179, -90101, -229891, -275592, -116019, -186982, 63963, -19560, 187506, 8599, 147984, -130461, -186236, 5275, -177043, -218651, -256368, -95191, 57413, 123610, -334333, 75280, -357594, 180230, 287322, 103739, -10246, 76617, -244758, -236322, -174179, -168207, 85856, -135041, 108418, -82381, -146365, -243806, -441117, 61021, -137074, -7671, -105982, 42218, -193796, 105500, 68111, 269224, 18614, 24945, -164429, 147739, 47913, -229937, -107113, -87601, -36824, -144308, -149978, -63596, -149660]
$$ [...]
##END NTUPLES=NMR SPECTRUM
##END=
