##TITLE=AC1447_MCIAH13256_8011536_DcQFeePQzV
##JCAMPDX= 6.0         $$ Bruker NMR JCAMP-DX V2.0
##DATA TYPE= NMR SPECTRUM
##DATA CLASS= NTUPLES
##ORIGIN= BRUKER
##OWNER= Administrator
$$ 1.72 TOPSPIN		Version 2.1
$$ 2013-07-05 18:35:15.628 -0700  Administrator@X
$$ Compression mode = diff/dup
##.OBSERVE FREQUENCY= 400.02188249412
##.OBSERVE NUCLEUS= ^1H
##.ACQUISITION MODE= SIMULTANEOUS (DQD)
##.ACQUISITION SCHEME= undefined
##.AVERAGES= 64
##.DIGITISER RES= 22
##SPECTROMETER/DATA SYSTEM= spect
##.PULSE SEQUENCE= noesygpps1d.comp
##.SOLVENT NAME= COFFEE_meoh
##.SHIFT REFERENCE= INTERNAL, COFFEE_meoh, 1, 14.96089
##AUDIT TRAIL= $$ (NUMBER, WHEN, WHO, WHERE, PROCESS, VERSION, WHAT)
$$ ##TITLE= Audit trail, TOPSPIN		Version 2.1
$$ ##JCAMPDX= 5.01
$$ ##ORIGIN= Bruker BioSpin GmbH
$$ ##OWNER= Administrator
$$ $$ E:\/data/COFFEE/nmr/AC1447_MCIAH13256_8011536_DcQFeePQzV/12/pdata/1/auditp.txt
$$ ##AUDIT TRAIL=  $$ (NUMBER, WHEN, WHO, WHERE, PROCESS, VERSION, WHAT)
(   1,<2013-07-05 18:35:10.269 -0700>,<Administrator>,<X>,<go>,<TOPSPIN 2.1>,
      <created by zg
	started at 2013-07-05 18:23:40.503 -0700,
	POWCHK enabled, PULCHK disabled,
       configuration hash MD5:
       C8 4E 4E 5D D3 5C D8 9E 9F 52 82 E0 59 8A DE 15
       data hash MD5: 64K
       64 5E 19 0D E8 F9 CE 20 C5 B9 FF C8 2C FC 1C 03>)
(   2,<2013-07-05 18:35:13.378 -0700>,<Administrator>,<X>,<proc1d>,<TOPSPIN 2.1>,
      <Start of raw data processing
       efp LB = 0.3 FT_mod = 6 PKNL = 1 PHC0 = 0 PHC1 = 0 SI = 128K 
       data hash MD5: 128K
       DC 03 DF A5 45 DE 04 1E 20 3E EA 23 D3 A6 5D 73>)
(   3,<2013-07-05 18:35:14.488 -0700>,<Administrator>,<X>,<proc1d>,<TOPSPIN 2.1>,
      <pk PHC0 = -80.22766 PHC1 = 0 
       data hash MD5: 128K
       52 81 C3 A6 DB F3 B0 12 62 68 0E 85 19 5F 3E 88>)
(   4,<2013-07-05 18:35:14.972 -0700>,<Administrator>,<X>,<proc1d>,<TOPSPIN 2.1>,
      <abs ABSG = 1 
       data hash MD5: 128K
       8D DD A8 C4 A7 CB FE 14 82 F0 DE ED FF 00 E6 D9>)
(   5,<2013-07-05 18:35:15.081 -0700>,<Administrator>,<X>,<proc1d>,<TOPSPIN 2.1>,
      <abs ABSG = 2 
       data hash MD5: 128K
       44 1F 5D 91 3D 5E 77 FB 61 2D A4 B4 0F E1 3C B2>)
(   6,<2013-07-05 18:35:15.222 -0700>,<Administrator>,<X>,<proc1d>,<TOPSPIN 2.1>,
      <abs ABSG = 3 
       data hash MD5: 128K
       C7 79 8A 8A 90 08 75 7B 73 AE 55 5F 2F E7 24 A4>)
(   7,<2013-07-05 18:35:15.300 -0700>,<Administrator>,<X>,<proc1d>,<TOPSPIN 2.1>,
      <abs ABSG = 4 
       data hash MD5: 128K
       11 D3 E0 58 04 82 AF BE 34 CC 0F B4 4E 65 25 C4>)
(   8,<2013-07-05 18:35:15.410 -0700>,<Administrator>,<X>,<proc1d>,<TOPSPIN 2.1>,
      <abs ABSG = 5 
       data hash MD5: 128K
       16 F0 DC A4 E8 97 BC 3C 2A 06 63 C3 B1 E7 38 47>)
$$ ##END=
$$ 
$$ $$ hash MD5
$$ $$ 9E 89 9C B6 B9 0D FA BD 35 D0 5A 08 B9 07 D2 08
##$RELAX= 
##$RELAX= 
##$RELAX= 
##$RELAX= 
##$RELAX= 
##$RELAX= 
##$RELAX= 
##$RELAX= 
$$ Bruker specific parameters
$$ --------------------------
##$DU= <E:\>
##$EXPNO= 12
$$ [...]
##$TP07= 0
##$TPNAME0= <>
##$TPNAME1= <>
##$TPNAME2= <>
##$TPNAME3= <>
##$TPNAME4= <>
##$TPNAME5= <>
##$TPNAME6= <>
##$TPNAME7= <>
##$TPOAL= (0..7)
0.5 0.5 0.5 0.5 0.5 0.5 0.5 0.5
##$TPOFFS= (0..7)
0 0 0 0 0 0 0 0
##$TUNHIN= 0
##$TUNHOUT= 0
##$TUNXOUT= 0
##$USERA1= <user>
##$USERA2= <user>
##$USERA3= <user>
##$USERA4= <user>
##$USERA5= <user>
##$V9= 5
##$VALIST= <valist>
##$VCLIST= <CCCCCCCCCCCCCCC>
##$VD= 0
##$VDLIST= <DDDDDDDDDDDDDDD>
##$VPLIST= <PPPPPPPPPPPPPPP>
##$VTLIST= <TTTTTTTTTTTTTTT>
##$WBST= 1024
##$WBSW= 4
##$XGAIN= (0..3)
0 0 0 0
##$XL= 0
##$YL= 0
##$YMAX_a= 6135971
##$YMIN_a= -12601825
##$ZGOPTNS= <>
##$ZL1= 120
##$ZL2= 120
##$ZL3= 120
##$ZL4= 120
##$ABSF1= 14.96089
##$ABSF2= -5.597292
##$ABSG= 5
##$ABSL= 3
##$ALPHA= 0
##$AQORDER= 0
##$ASSFAC= 0
##$ASSFACI= 0
##$ASSFACX= 0
##$ASSWID= 0
##$AUNMP= <proc_prof1d_extract.lims>
##$AXLEFT= 0
##$AXNAME= <>
##$AXNUC= <1H>
##$AXRIGHT= 0
##$AXTYPE= 0
##$AXUNIT= <>
##$AZFE= 0.1
##$AZFW= 0.1
##$BCFW= 0
##$BC_mod= 0
##$BYTORDP= 0
##$COROFFS= 0
##$CY= 15
##$DATMOD= 1
##$DC= 0
##$DFILT= <>
##$DTYPP= 0
##$F1P= 0
##$F2P= 0
##$FCOR= 0.5
##$FTSIZE= 131072
##$FT_mod= 6
##$GAMMA= 0
##$GB= 0
##$INTBC= 1
##$INTSCL= 1
##$ISEN= 128
##$LB= 0.3
##$LEV0= 0
##$LPBIN= 0
##$MAXI= 10000
##$MC2= 0
##$MEAN= 0
##$ME_mod= 0
##$MI= 0
##$NCOEF= 0
##$NC_proc= -2
##$NLEV= 6
##$NOISF1= 0
##$NOISF2= 0
##$NSP= 0
##$NTH_PI= 0
##$NZP= 0
##$OFFSET= 14.96089
##$PC= 1
##$PHC0= -80.22766
##$PHC1= 0
##$PH_mod= 1
##$PKNL= yes
##$PPARMOD= 0
##$PPDIAG= 0
##$PPIPTYP= 0
##$PPMPNUM= 2147483647
##$PPRESOL= 1
##$PSCAL= 4
##$PSIGN= 0
##$PYNMP= <proc.py>
##$REVERSE= no
##$SF= 400.020009679869
##$SI= 131072
##$SIGF1= 0
##$SIGF2= 0
##$SINO= 400
##$SIOLD= 131072
##$SPECTYP= <>
##$SREGLST= <1H.CDCl3>
##$SSB= 0
##$STSI= 131072
##$STSR= 0
##$SW_p= 8223.68421052631
##$SYMM= 0
##$S_DEV= 0
##$TDeff= 65536
##$TDoff= 0
##$TI= <>
##$TILT= no
##$TM1= 0
##$TM2= 0
##$TOPLEV= 0
##$USERP1= <user>
##$USERP2= <user>
##$USERP3= <user>
##$USERP4= <user>
##$USERP5= <user>
##$WDW= 1
##$XDIM= 131072
##$YMAX_p= 364925615
##$YMIN_p= -12066
##$CURPLOT= <Network HP LaserJet P1505>
##$CURPRIN= <$Network HP LaserJet P1505>
##$DFORMAT= <normdp>
##$LAYOUT= <+/1D_H.xwp>
##$LFORMAT= <normlp>
##$PFORMAT= <normpl>
##$SURQMSG= 1
$$ End of Bruker specific parameters
$$ ---------------------------------
##NTUPLES= NMR SPECTRUM
##VAR_NAME=  FREQUENCY,     SPECTRUM/REAL,   SPECTRUM/IMAG
##SYMBOL=    X,             R,               I
##VAR_TYPE=  INDEPENDENT,   DEPENDENT,       DEPENDENT
##VAR_FORM=  AFFN,          ASDF,            ASDF
##VAR_DIM=   131072,        131072,          131072
##UNITS=     HZ,            ARBITRARY UNITS, ARBITRARY UNITS
##FACTOR=    0.0627417313425164, 1,          1
##FIRST=     8223.62146879497, -2671,        -55124
##LAST=      0,             -1272,           -56894
##MIN=       0,             -12066,          0
##MAX=       8223.62146879497, 364925615,    0
$$ Real data points
##PAGE= N=1
##DATA TABLE= (X++(R..R)), XYDATA
$$ [...]
63922D161942j70032j84601j95681k02953k06242k05781k02175j96042j87756
$$ 4161942 3991910 3807309 3611628 3408675 3202433 2996652 2794477 2598435 2410679
63913B410679j77589j66040j53787j41250j28541j15876j03774r2562q2044p2024
$$ 2410679 2233090 2067050 1913263 1772013 1643472 1527596 1423822 1331260 1249216 1177192
63903A177192o2879n5197m8891m3244l7818l2894k8827k5537k2895k1086k0128
$$ 1177192 1114313 1059116 1010225 966981 929163 896269 867442 841905 819010 797924 777796
63892G77796j9434j8362j6977j5759j4668j3210j1363r715q425o800m328j608
$$ 777796 758362 740000 723023 707264 692596 679386 668023 658308 649883 643083 638755 637147
63880F37147L92J711L271N601Q302J0854J3188J5326J7075J8421J9717K1121K2269
$$ 637147 637539 639250 642521 648122 656424 667278 680466 695792 712867 731288 751005 772126 794395
63867G94395K2891K3279K3670K3563K2380K0493J8820J7439J5405J2162Q413N186
$$ 794395 817286 840565 864235 887798 910178 930671 949491 966930 982335 994497 1002910 1008096
63855A008096K579p4l141o348r340j2069j4617j6990j9206k1340k3341k4901k5744
$$ 1008096 1010675 1010601 1007460 1001112 991772 979703 965086 948096 928890 907550 884209 859308 833564
63842H33564k6040k6400k7296k8470k9147k8896k8089k7309k6626k5732k4528
$$ 833564 807524 781124 753828 725358 696211 667315 639226 611917 585291 559559 535031
63831E35031k3075k1249j9020j6988j5930j5713j5334j4275j3040j2090j1023
$$ 535031 511956 490707 471687 454699 438769 423056 407722 393447 380407 368317 357294
63820C57294r411p750o805o439n933n144m579m447m413m259m026l573k733j975
$$ 357294 347883 340133 333328 326889 320956 315812 311233 306786 302373 298114 294088 290515 287782 285807
63806B85807k115l099l812l416k372j683j712k120k553k846k803k378j918j814
$$ 285807 283692 280593 276781 273365 270993 269310 267598 265478 262925 260079 257276 254898 252980 251166
63792B51166j938j838j463j283j549j816j482o40n9k31p30q19m71m27j075j846
$$ 251166 249228 247390 245927 244644 243095 241279 239797 239157 239098 238867 238137 237318 236847 236420 235345 233499
63776B33499j949j375p12k81L6K56J89j44m57o18o50l90L16J047J092M57n9RK34
$$ 233499 231550 230175 229463 229182 229218 229474 229663 229519 229062 228444 227794 227404 227720 228767 229859 230316 230257 230266 230500
63757B30500J39j51m15q29j340j219n0J315J639Q94J06j23p1P5O23J574K280K289
$$ 230500 230639 230488 230073 229244 227904 226685 226635 227950 229589 230483 230589 230466 230395 230470 231093 232667 234947 237236
63739B37236J984J879J935J924K039K533L075L062K505K124K515L534M506M826
$$ 237236 239220 241099 243034 244958 246997 249530 252605 255667 258172 260296 262811 266345 270851 275677
63725B75677M418L772L563L956M358M038K937J707R66P63P83P71O31L35j07o62
$$ 275677 280095 283867 287430 291386 295744 299782 302719 304426 305392 306155 306938 307709 308340 308675 308568 307906
63709C07906j332k093k660k542j530j12Q98J093P54L54J12P4L95J212K276K977
$$ 307906 306574 304481 301821 299279 297749 297637 298535 299628 300382 300736 300848 300922 301317 302529 304805 307782
63693C07782K868K129J501J710K824M086M513L781K445J249M00l15r34j240j207
$$ 307782 310650 312779 314280 315990 318814 322900 327413 331194 333639 334888 335288 334973 334039 332799 331592
63678C31592j070r05m66L48J164J451J066L53j80k70j20k41q53j487j562j268
$$ 331592 330522 329617 329151 329499 330663 332114 333180 333533 333353 333083 332963 332722 331869 330382 328820 327552
63662C27552j423k293l113l135k706k697l215l481l031k352k171k453k475j786
$$ 327552 326129 323836 320723 317588 314882 312185 308970 305489 302458 300106 297935 295482 293007 291221
63648B91221q00l26m93m67N17K011K794K452J850J763J878J701J750K808M419
$$ 291221 290421 290095 289602 289135 289652 291663 294457 296909 298759 300522 302400 304101 305851 308659 313078
63633C13078N283N103N008N883P211Q032Q222Q349Q863R918J1533J3344J4624
$$ 313078 318361 323464 328472 334355 341566 349598 357820 366169 375032 384950 396483 409827 424451
63620D24451J5066J5260J6022J7488J9201K0768K2042K3042K4050K5381K6676
$$ 424451 439517 454777 470799 488287 507488 528256 550298 573340 597390 622771 649447
63609F49447K6890K5514K3345K1375J9429J6703J3242R906O985L966P33k055m078
$$ 649447 676337 701851 725196 746571 766000 782703 795945 805851 812836 816802 817535 815480 811402
63596H11402n871p766r200r739j0098j1298j3251j4990j6094j7131j8584k0032
$$ 811402 805531 797765 788565 778826 768728 757430 744179 729189 713095 695964 677380 657348
63584F57348k0641k0149j9167j8493j8191j7428j5394j2392r600p669o050l969
$$ 657348 636707 616558 597391 578898 560707 543279 527885 515493 505893 498224 492174 488205
63572D88205j611K81J561K802M389O073P370P975P823P248P082Q034R912J1913
$$ 488205 486594 486875 488436 491238 495627 501700 509070 517045 524868 532116 539198 547232 557144 569057
63558E69057J3624J5308J7160J8923K0414K1940K3838K6005K8036K9495K9888
$$ 569057 582681 597989 615149 634072 654486 676426 700264 726269 754305 783800 813688
63547H13688K8836K6560K3775K0825J7289J2761P568K396k357o426r329j0791
$$ 813688 842524 869084 892859 913684 930973 943734 951302 953698 951341 944915 935586 924795
63535I24795j1245j1430j1637j1887j2534j3994j6038j8013j9747k1584k3498
$$ 924795 913550 902120 890483 878596 866062 852068 836030 818017 798270 776686 753188
63524G53188k4930k5740k6501k7509k8042k7188k5100k2913k1567k1086k0805
$$ 753188 728258 702518 676017 648508 620466 593278 568178 545265 523698 502612 481807
63513D81807j9983j8319j6159j4199j2745j1448r887q215o909o120n569n006m323
$$ 481807 461824 443505 427346 413147 400402 388954 379067 370852 363943 357823 352254 347248 342925
63500C42925l402k203j106o53q72j115q46l00j99q82j879k287j508J80J701K076
$$ 342925 339523 337320 336214 335561 334689 333574 332728 332428 332229 331347 329468 327181 325673 325853 327554 329630
63484C29630J446J001J647K932L711L642L474L779M080L577K277Q05m59j499k106
$$ 329630 331076 332077 333724 336656 340367 344009 347483 351262 355342 358919 361196 362001 361542 360043 357937
63469C57937k014j566j484j835j937j574j488k222l139l267k591j707p06O45J920
$$ 357937 355923 354357 352873 351038 349101 347527 346039 343817 340678 337411 334820 333113 332407 333052 334972
63454C34972K383K333K979M653O214O730O845P696R165J0230J0704J1605J3713
$$ 334972 337355 339688 342667 347320 353534 360264 367109 374805 383970 394200 404904 416509 430222
63441D30222J6548J9083K0885K2178K3056K3158K2213K0662J9395J8836J8470
$$ 430222 446770 465853 486738 508916 531972 555130 577343 598005 617400 636236 654706
63430F54706J7515J5867J4135J2884J2340J2716J4218J6452J8495J9932K1382
$$ 654706 672221 688088 702223 715107 727447 740163 754381 770833 789328 809260 830642
63419H30642K3528K5988K7661K7916K6891K4804K1653J7645J3403R492N915K204
$$ 830642 854170 880158 907819 935735 962626 987430 1009083 1026728 1040131 1049623 1055538 1057742
63407A057742k032o531j0297j2429j3219j4079j6034j8636k0796k2246k3555k5001
$$ 1057742 1055710 1049179 1038882 1026453 1013234 999155 983121 964485 943689 921443 897888 872887
63395H72887k6337k7552k8957l0300l0641k9552k7765k6169k4703k2770k0285
$$ 872887 846550 818998 790041 759741 729100 699548 671783 645614 620911 598141 577856
63384E77856j7650j5005j2215r552p580o233m605k078P79K947M316N747P765R819
$$ 577856 560206 545201 532986 523434 515854 509621 505016 502938 503717 506664 510980 516727 524492 534311
63370E34311J1177J2075J3386J5396J7592J9655K1937K4645K7159K8740K9496
$$ 534311 545488 557563 570949 586345 603937 623592 645529 670174 697333 726073 755569
63359G55569L0098L0744L0990L0436K9027K6737K3513J9618J5545J1500P382L285
$$ 755569 785667 816411 847401 877837 906864 933601 957114 976732 992277 1003777 1011159 1014444
63347A014444m83l898p198j0222j2353j3399j4040j5036j6391j7727j9083k0798
$$ 1014444 1013961 1010063 1002865 992643 980290 966891 952851 937815 921424 903697 884614 863816
63335H63816k2802k4576k5788k6524k6819k6429k5200k3381k1252j8720j5669
$$ 863816 841014 816438 790650 764126 737307 710878 685678 662297 641045 622325 606656
63324F06656j2693j0926j0852j1603j1870j1431j1149j1501j1913j1874j1924
$$ 606656 593963 583037 572185 560582 548712 537281 526132 514631 502718 490844 478920
63313D78920j2788j4037j4478j3666j2169j0515q786p251o395o071n553m706m286
$$ 478920 466132 452095 437617 423951 411782 401267 392481 385230 378835 372764 367211 362505 358219
63300C58219m632m942m439l480k818k377j700j055j152j948k654k871k928l055
$$ 358219 353587 348645 344206 340726 337908 335531 333831 332776 331624 329676 327022 324151 321223 318168
63286C18168k933k279j359o53l88m79o60n97j90K38L20J57J60M72Q69J204J569
$$ 318168 315235 312956 311597 310944 310556 310077 309417 308820 308630 308868 309188 309345 309505 309977 310846 312050 313619
63269C13619J938K039J633Q54J48M4Q04K143L421M254M750N043M982M566M275
$$ 313619 315557 317596 319229 320083 320231 320275 321079 323222 326643 330897 335647 340690 345672 350238 354513
63254C54513M439M676M534M381M955O204P339Q002Q607R523J0593J1614J2653
$$ 354513 358952 363628 368162 372543 377498 383702 391041 399043 407650 417173 427766 439380 452033
63241D52033J3714J4682J5684J6868J7898J8426J9108K1100K4246K6809K7621
$$ 452033 465747 480429 496113 512981 530879 549305 568413 589513 613759 640568 668189
63230F68189K7479K7685K8226K8346K8118K8107K7981K6913K5259K4421K4806
$$ 668189 695668 723353 751579 779925 808043 836150 864131 891044 916303 940724 965530
63219I65530K5187K4511K3274K2400K1678K0187J7698J4710J1400P375K449k976
$$ 965530 990717 1015228 1038502 1060902 1082580 1102767 1120465 1135175 1146575 1153950 1156399 1153423
63207A153423q374j3445j7906k1457k4160k6497k8795l0782l1898l1880l0856
$$ 1153423 1145049 1131604 1113698 1092241 1068081 1041584 1012789 982007 950109 918229 887373
63196H87373k8997k6357k3067j9517j6123j2944r663o074k466O24L093N490Q403
$$ 887373 858376 832019 808952 789435 773312 760368 750705 744631 742165 742789 745882 751372 759775
63183G59775J1683J4495J6138J6696J6809J6997J7279J7378J7152J6779J6553
$$ 759775 771458 785953 802091 818787 835596 852593 869872 887250 904402 921181 937734
63172I37734J6568J6553J6095J5008J3374J1230Q426M920J109k473n762r171j2955
$$ 937734 954302 970855 986950 1001958 1015332 1026562 1034988 1039908 1041017 1038544 1032782 1023611 1010656
63159A010656j6822k0364k3507k6299k8517k9889l0528l0723l0377k9143k7173
$$ 1010656 993834 973470 949963 923664 895147 865258 834730 804007 773630 744487 717314
63148G17314k5214k3710k2238k0191j7718j5580j4196j3245j2153j0667q924p239
$$ 717314 692100 668390 646152 625961 608243 592663 578467 565222 553069 542402 533478 526239
63136E26239n892m908m059l147k287j702j413j223r30l56O07J712K322K131J794
$$ 526239 520347 515439 511380 508233 505946 504244 502831 501608 500678 500322 500929 502641 504963 507094 508888
63121E08888K270L554M633M808M444M131L809L267K865K995L167K532J232M09
$$ 508888 511158 514712 519345 524153 528597 532728 536537 539804 542669 545664 548831 551363 552595 553004
63107E53004P03J522K019K060J850J252J47r66j424j292j185j315j303r57n90
$$ 553004 553707 555229 557248 559308 561158 562410 562557 561591 560167 558875 557690 556375 555072 554115 553525
63092E53525m15j94K30N38M92N30J281K616L650L747L208K896L367M515N791O730
$$ 553525 553110 552916 553146 553684 554176 554706 555987 558603 562253 566000 569208 572104 575471 579986 585777 592507
63076E92507P303P837Q496R000R106R183R923J1388J2840J3779J4666J6204J8284
$$ 592507 599810 607647 616143 625143 634249 643432 653355 664743 677583 691362 706028 722232 740516
63063G40516K0259K2061K4240K6942K9609L1958L4486L7578M0763M3521M6222
$$ 740516 760775 782836 807076 834018 863627 895585 930071 967649 1008412 1051933 1098155
63052A098155M9512N3098N6039N8110N9965O1896O3342O3913O4037O4187O4123
$$ 1098155 1147667 1200765 1256804 1314914 1374879 1436775 1500117 1564030 1628067 1692254 1756377
63041A756377O3463O2429O1467O0553N9475N8344N7203N5393N2068M7214M1554
$$ 1756377 1819840 1882269 1943736 2004289 2063764 2122108 2179311 2234704 2286772 2333986 2375540
63030B375540L5433K8529K0610J1973K923o652j6935k7690l8382m8451n7351o4554
$$ 2375540 2410973 2439502 2460112 2472085 2475008 2468356 2451421 2423731 2385349 2336898 2279547 2214993
63018B214993o9694p2605p3312p2123o9730o6748o3118n8248n1824m4301l6533
$$ 2214993 2145299 2072694 1999382 1927259 1857529 1790781 1727663 1669415 1617591 1573290 1536757
63007A536757k9123k2166j5448q842k605K959Q103J3506J9120K3729K6297K7471
$$ 1536757 1507634 1485468 1470020 1461178 1458573 1461532 1469635 1483141 1502261 1525990 1552287 1579758
62995A579758K8802L0700L2143L2439L2159L1895L1167K9303K6622K3894K1069
$$ 1579758 1608560 1639260 1671403 1703842 1736001 1767896 1799063 1828366 1854988 1878882 1899951
62984A899951J7383J2510O882R71n186j1718j8572k5505l2201l8490m4494n0233
$$ 1899951 1917334 1929844 1936726 1937697 1932511 1920793 1902221 1876716 1844515 1806025 1761531 1711298
62972A711298n5094n8140n9209n9148n8630n7408n5152n2378m9808m7359m4505
$$ 1711298 1656204 1598064 1538855 1479707 1421077 1363669 1308517 1256139 1206331 1158972 1114467
62961A114467m1352l8431l5811l3150l0542k8480k7027k5792k4618k3643k2747
$$ 1114467 1073115 1034684 998873 965723 935181 906701 879674 853882 829264 805621 782874
62950G82874k1653k0550j9772j8904j7110j4496j2305j1363j1162j0761j0008
$$ 782874 761221 740671 720899 701995 684885 670389 658084 646721 635559 624798 614790
62939F14790r379r129r103r019q626p817o817n965n231m340l427k945k824k373
$$ 614790 605411 596282 587179 578160 569534 561717 554900 548935 543704 539364 535937 532992 530168 527795
62925E27795j284j22M34K67n03j831l276l979l686l240l422l774l338k141j158
$$ 527795 526511 526389 526823 527090 526587 524756 521480 517501 513815 510575 507153 503379 500041 497900 496742
62910D96742r98j362j766k092k343k428k348k205j980j595j160q71p38o68o93
$$ 496742 495744 494382 492616 490524 488181 485753 483405 481200 479220 477625 476465 475594 474856 474188 473495
62895D73495p96o84j52M31M54k15j098j628j460n13Q08J629J414O98M76Q67J072
$$ 473495 472699 472015 471863 472294 472748 472533 471435 469807 468347 467834 468642 470271 471685 472383 472859 473726 474798
62878D74798O45J08N3K40R9l86p91r68j157j522j985k377k457j893o56O33J172
$$ 474798 475443 475551 475604 475844 475943 475557 474766 473798 472641 471119 469134 466757 464300 462407 461751 462384 463556
62861D63556Q87N15O45R80Q67L10N9O65J787K615K747K402J884J240M54k52n92
$$ 463556 464443 464958 465603 466583 467450 467760 467819 468484 470271 472886 475633 478035 479919 481159 481613 481361 480769
62844D80769n52m56o67j245j818j869j279n38k22l51n19o02q28j048o38N40J612
$$ 480769 480217 479761 479094 477849 476031 474162 472883 472345 472123 471772 471253 470651 469823 468775 468137 468677 470289
62827D70289J735J260J128J465J663J736K474M004N146M895L844L341L724M275
$$ 470289 472024 473284 474412 475877 477540 479276 481750 485754 490900 495795 499639 502980 506704 510979
62813E10979M607N134O039O683O470N802N602O216P220Q144Q982R947J1059J2061
$$ 510979 515586 520720 526759 533442 539912 545714 551316 557532 564752 572896 581878 591825 602884 614945
62799F14945J2652J2830J3034J3897J5675J8049K0596K3285K6325K9671L3090
$$ 614945 627597 640427 653461 667358 683033 701082 721678 744963 771288 800959 834049
62788H34049L6681M0893M5887N1273N6634O1981O7402P2625P7383Q1918Q6604
$$ 834049 870730 911623 957510 1008783 1065417 1127398 1194800 1267425 1344808 1426726 1513330
62777A513330R1076R4309R5609R5103R3048Q9155Q2981P4656O4812N3914M1959
$$ 1513330 1604406 1698715 1794324 1889427 1982475 2071630 2154611 2229267 2294079 2347993 2389952
62766B389952K8791J4417q79j6455l1346m4695n6238o6225p4857q1981q7349r0859
$$ 2389952 2418743 2433160 2432281 2415826 2384480 2339785 2283547 2217322 2142465 2060484 1973135 1882276
62754A882276r2474r2213r0426q7804q4799q1205p6649p1412o6268o1503n6628
$$ 1882276 1789802 1697589 1607163 1519359 1434560 1353355 1276706 1205294 1139026 1077523 1020895
62743A020895n1300m6031m1511l7636l3804k9996k6808k4415k2250j9891j7620
$$ 1020895 969595 923564 882053 844417 810613 780617 753809 729394 707144 687253 669633
62732F69633j5730j3880j1622r154o992n325m115l465l298k990j958m00J168K733
$$ 669633 653903 640023 628401 619247 612255 606930 602815 599350 596052 593062 591104 590704 591872 594605
62718E94605M531O248P431Q474J0247J2763J5182J7237J9575K2464K5256K7634
$$ 594605 599136 605384 612815 621289 631536 644299 659481 676718 696293 718757 744013 771647
62706G71647L0303L3818L7627M1121M4711M8948N3236N6573N9108O1847O4945
$$ 771647 801950 835768 873395 914516 959227 1008175 1061411 1117984 1177092 1238939 1303884
62695A303884O7353O8223O7706O6211O3615N9492N3593M5896L6594K6187J5255
$$ 1303884 1371237 1439460 1507166 1573377 1636992 1696484 1750077 1795973 1832567 1858754 1874009
62684A874009M063p308j8507k8943l8264m6482n3684n9902o5129o9128p1411p1773
$$ 1874009 1878072 1870764 1852257 1823314 1785050 1738568 1684884 1624982 1559853 1490725 1419314 1347541
62672A347541p0613o8411o5212o1109n6824n3110m9742m5948m1670l7629l4167
$$ 1347541 1276928 1208517 1143305 1082196 1025372 972262 922520 876572 834902 797273 763106
62661G63106l0903k7655k4804k2486k0215j7744j5612j4388j3865j3446j2850
$$ 763106 732203 704548 679744 657258 637043 619299 603687 589299 575434 561988 549138
62650E49138j2066j1025r832q929q541q182p191n610m198l571l610l699l362k687
$$ 549138 537072 526047 516215 507286 498745 490563 483372 477762 473564 469993 466383 462684 459322 456635
62636D56635k120j855j577j018m87m68q50j059q83o20m09n2M24O31M87M07P00
$$ 456635 454515 452660 451083 450065 449578 449110 448260 447201 446318 445698 445289 445237 445661 446292 446779 447186 447886
62619D47886J254K015L079M132M579M575N100O500P777Q046P946Q723J0507J2486
$$ 447886 449140 451155 454234 458366 462945 467520 472620 479120 486897 494943 502889 511612 522119 534605
62605E34605J4361J6499J8793K0560K1704K3038K5167K7842L0695L3840L7297
$$ 534605 548966 565465 584258 604818 626522 649560 674727 702569 733264 767104 804401
62594H04401M0457M2704M4136M5134M5527M4692M2390L8973L4800K9768K3626
$$ 804401 844858 887562 931698 976832 1022359 1067051 1109441 1148414 1183214 1212982 1236608
62583A236608J6507Q970J556n568j2532j9422k6087l2133l6993m0155m1625m2091
$$ 1236608 1253115 1262085 1263641 1258073 1245541 1226119 1200032 1167899 1130906 1090751 1049126 1007035
62571A007035m2310m2323m1615m0064l8145l6081l3470l0212k7083k4773k2863
$$ 1007035 964725 922402 880787 840723 802578 766497 733027 702815 675732 650959 628096
62560F28096k0600j8282j6775j5911j4498j2202j0195r440r249q369o737n304
$$ 628096 607496 589214 572439 556528 542030 529828 519633 510193 500944 492575 485838 480534
62548D80534m467l715k693j700j020m30L10R40R98L84n07j068q67n5O49P22O05
$$ 480534 476067 472352 469659 467959 466939 466509 466819 467759 468757 469141 468634 467566 466699 466644 467293 468015 468620
62531D68620J326L185N304O714P492Q437R992J1947J4001J6060J7995J9690K1380
$$ 468620 469946 473131 478435 485149 492641 501078 511070 523017 537018 553078 571073 590763 612143
62518F12143K3517K6153K8808L1192L3547L6082L8370L9699L9869L9319L8560
$$ 612143 635660 661813 690621 721813 755360 791442 829812 869511 909380 948699 987259
62507I87259L7657L6194L3588K9607K4727J9717J4725R198K978k931p272r899
$$ 987259 1024916 1061110 1094698 1124305 1149032 1168749 1183474 1192672 1195650 1192719 1185447 1175548
62495A175548j1670j3078j3648j2814j0738q125n554l148n36K916P413J2124J5692
$$ 1175548 1163878 1150800 1137152 1124338 1113600 1105475 1099921 1096773 1096237 1099153 1106566 1118690 1134382
62482A134382J7434J7716J7131J5881J4077J1967R489O044J250m425j0136j5524
$$ 1134382 1151816 1169532 1186663 1202544 1216621 1228588 1238077 1244121 1245371 1240946 1230810 1215286
62470A215286k0661k5533k9966l3944l7570m0737m3137m4457m4399m2784l9981
$$ 1215286 1194625 1169092 1139126 1105182 1067612 1026875 983738 939281 894882 852098 812117
62459H12117l7003l4729l2993l0814k7510k3433j9576j6681j4668j2824j0516
$$ 812117 775114 740385 707392 676578 649068 625635 606059 589378 574710 561886 551370
62448E51370p761n111l067j798j178p83L5J515K949L369K813K267K233K113J360
$$ 551370 543609 538498 535431 533633 532455 531672 531707 533222 536171 539540 542353 544620 546853 548966 550326
62433E50326L44m63j349k730m249n331o111p007p825q191q427r015r465q857p394
$$ 550326 550670 550207 548858 546128 541879 536548 530437 523430 515605 507414 498987 489972 480507 471650 464256
62418D64256o309o174o243n688m617l586k937k780k976k938k185j249j229k204
$$ 464256 457947 451773 445530 439842 435225 431639 428702 425922 422946 420008 417823 416574 415345 413141
62404D13141k953k550j433m66J82O78Q68P06P42J432K318K583K128J543J294J463
$$ 413141 410188 407638 406205 405739 405921 406599 407467 408173 408915 410347 412665 415248 417376 418919 420213 421676
62388D21676K018K786L343L385L142L075L400M131N277O608P573P880P957Q424
$$ 421676 423694 426480 429823 433208 436350 439425 442825 446956 452233 458841 466414 474294 482251 490675
62374D90675R431J0796J2378J3920J4926J5334J5955J7651K0240K2847K5119K7400
$$ 490675 500106 510902 523280 537200 552126 567460 583415 601066 621306 644153 669272 696672
62362F96672K9925L2616L5628L9278M3247M6510M8336M8850M8435M7124M4846
$$ 696672 726597 759213 794841 834119 877366 923876 972212 1021062 1069497 1116621 1161467
62351A161467M1728L7837L2905K6757J9754J2532N475j365p942j4065j9491k4044
$$ 1161467 1203195 1241032 1273937 1300694 1320448 1332980 1338455 1337090 1329148 1315083 1295592 1271548
62339A271548k7767l0951l3834l6190l7463l7400l6328l4729l2770l0492k8134
$$ 1271548 1243781 1212830 1178996 1142806 1105343 1067943 1031615 996886 964116 933624 905490
62328I05490k5982k4030k2105k0355j9266j9091j9464j9725j9557j9139j8699
$$ 905490 879508 855478 833373 813018 793752 774661 755197 735472 715915 696776 678077
62317F78077j8167j7432j6757j6558j6677j6299j4851j2738j0890r692q806p895
$$ 678077 659910 642478 625721 609163 592486 576187 561336 548598 537708 528016 519210 511315
62305E11315p048o387n709m797l723k629j472l15L80K85j47p0O57J250J136P80
$$ 511315 504267 497880 492171 487374 483651 481022 479550 479235 479615 479900 479753 479683 480340 481590 482726 483506
62289D83506R87J751K403K723L164L970M755N308O073P232P975P530O640O978
$$ 483506 484493 486244 488647 491370 494534 498504 503259 508567 514640 521872 529847 537377 544017 550995
62275E50995R039J1547J3205J4149J5198J6541J7949J9687K2215K5239K7970L0278
$$ 550995 560034 571581 584786 598935 614133 630674 648623 668310 690525 715764 743734 774012
62263G74012L2791L5788L8720M1113M3312M5902M8753N1077N2195N1941N0450
$$ 774012 806803 842591 881311 922424 965736 1011638 1060391 1111468 1163663 1215604 1266054
62252A266054M7823M4030L9007L2855K5878J8376J0508K504n181j2213j8743k5113
$$ 1266054 1313877 1357907 1396914 1429769 1455647 1474023 1484531 1487035 1481854 1469641 1450898 1425785
62240A425785l1256l6824m1732m6062m9496n1458n1975n1704n0878m8973m5839
$$ 1425785 1394529 1357705 1315973 1269911 1220415 1168957 1116982 1065278 1014400 965427 919588
62229I19588m2424l9615l6983l3480k9126k5032k1858j9241j6860j5100j4174
$$ 919588 877164 837549 800566 767086 737960 712928 691070 671829 654969 639869 625695
62218F25695j3410j2042j0281q916q162p599p004o554o159n299l809k331j575
$$ 625695 612285 600243 589962 581046 572884 565285 558281 551727 545568 540269 536460 534129 532554
62205E32554j435j233o51L9O30J356K434L560M272M614N108O020O969P434P458
$$ 532554 531119 529886 529235 529274 529904 531260 533694 537254 541526 546140 551248 557268 564237 571671 579129
62190E79129P582Q207R170R952J0104R561Q677Q085Q283R195J0192J0645J0448
$$ 579129 586711 594918 604088 614040 624144 633705 642382 650467 658750 667945 678137 688782 699230
62177F99230R983R741J0018J0948J2586J4878J7558K0165K2329K4158K6220K8850
$$ 699230 709213 718954 728972 739920 752506 767384 784942 805107 827436 851594 877814 906664
62165I06664L1572L3466L4162L4059L3453L1900K8889K4666J9926J4861R323L671
$$ 906664 938236 971702 1005864 1039923 1073376 1105276 1134165 1158831 1178757 1193618 1202941 1206612
62153A206612j313n541r787j4393j8593k1621k3818k5890k7646k8395k8234k7912
$$ 1206612 1205299 1199758 1189971 1175578 1156985 1135364 1111546 1085656 1058010 1029615 1001381 973469
62141I73469k7433k5915k3061j9847j7236j4985j2369r557p426o246n283l808
$$ 973469 946036 920121 897060 877213 859977 844992 832623 823066 815640 809394 804111 800303
62129H00303k071r85j050j679j616j19K305M454N710O380O838O875O181M989L790
$$ 800303 798232 797247 796197 794518 792902 792783 795088 799542 805252 811632 818470 825345 831526 836515 840305
62114H40305K703J586N05m36j491l006m801o288p162p585p786p949q387r220r871
$$ 840305 843008 844594 845099 844663 843172 840166 835365 829077 821915 814330 806544 798595 790208 780988 771117
62099G71117r490q066o530n480m424k624k28J942L456M559N584O627P707Q810
$$ 771117 761627 753561 747031 741551 737127 734503 734275 736217 739673 744232 749816 756443 764150 772960
62085G72960R649R803R288Q743Q867R814J1233J2747J4223J5696J7202J8722K0150
$$ 772960 782609 792412 801700 810443 819310 829124 840357 853104 867327 883023 900225 918947 939097
62072I39097K1292K1976K2266K2511K3066K3975K4945K5665K5958K5654K4561
$$ 939097 960389 982365 1004631 1027142 1050208 1074183 1099128 1124793 1150751 1176405 1200966
62061A200966K2695K0388J7849J4821J0996O711K785m94l835q053j2927j7320
$$ 1200966 1223661 1244049 1261898 1276719 1287715 1294426 1297211 1296717 1292882 1284829 1271902 1254582
62049A254582k0451k2719k5101k7948l0663l2570l3751l4798l5873l6441l6033
$$ 1254582 1234131 1211412 1186311 1158363 1127700 1095130 1061379 1026581 990708 954267 918234
62038I18234l4856l3423l1923l0317k8781k7513k6261k4576k2529k0585j8819
$$ 918234 883378 849955 818032 787715 758934 731421 705160 680584 658055 637470 618651
62027F18651j6819j4553j2652j1525j0729r729q738q312q448q633q528q036p052
$$ 618651 601832 587279 574627 563102 552373 542644 533906 525594 517146 508513 499985 491949 484897
62014D84897n707m630m290m191l455k111j023m92J79J475K887L780M335M991N513
$$ 484897 479190 474560 470270 466079 462624 460513 459490 458998 459177 460652 463539 467319 471654 476645 482158
61999D82158N368M707M235M205M111L391J983K20j414k515l104l657m443n036
$$ 482158 487526 492233 496468 500673 504784 508175 510158 510378 508964 506449 503345 499688 495245 490209
61985D90209m980m744n287o649p682p480o399n343m640m092l672l476l340l009
$$ 490209 485229 480485 475198 468549 460867 453387 446988 441645 437005 432913 429241 425765 422425 419416
61971D19416k620k471k451k200j793j715k063k284j909j130m50l9K97P29J209
$$ 419416 416796 414325 411874 409674 407881 406166 404103 401819 399910 398780 398330 398291 398588 399317 400526
61956D00526J535J483J045O57R51K087L494M482N014N623O722Q174R517J0453
$$ 400526 402061 403544 404589 405246 406197 408284 411778 416260 421274 426897 433619 441793 451310 461763
61942D61763J1072J1728J2668J3726J4455J4622J4435J4171J3771J3024J2073
$$ 461763 472835 484563 497231 510957 525412 540034 554469 568640 582411 595435 607508
61931F07508J1378J1099J0778R801Q095O206M692L491K065J69j610k361j872r39
$$ 607508 618886 629985 640763 650564 658659 664865 669557 673048 675113 675282 673672 671311 669439 668500
61917F68500m50l97n1J095K877M838O546P621P901P800Q099Q988R667R243P850
$$ 668500 668050 667653 667602 668697 671574 676412 682958 690579 698480 706280 714379 723367 733034 742277 750127
61902G50127O349N088L473R36k130m800o673q183r808j1404j2389j2537j2316
$$ 750127 756476 761564 765037 765973 763843 759043 752370 744187 734379 722975 710586 698049 685733
61889F85733j2425j2995j3443j3130j2130j1117j0516j0113r609r187r161r219
$$ 685733 673308 660313 646870 633740 621610 610493 599977 589864 580255 571068 561907 552688
61877E52688q624p216n772n069m992m830m216l299k190p75Q60K264L137L726M536
$$ 552688 544064 536848 531076 526007 521015 516185 511969 508670 506480 505705 506565 508829 511966 515692 520228
61862E20228N816P488R343J1098J2426J3213J3781J4594J5823J7291J8830K0459
$$ 520228 526044 533532 542875 553973 566399 579612 593393 607987 623810 641101 659931 680390
61850F80390K2120K3440K3930K3436K2310K1077J9934J8566J6494J3552J0045
$$ 680390 702510 725950 749880 773316 795626 816703 836637 855203 871697 885249 895294
61839H95294O466L184L51j974l725m843n385n529n353m582k849l75J908L252L965
$$ 895294 901760 904944 905295 903321 899596 894753 889368 883839 878486 873904 871055 870680 872588 875840 879805
61824H79805M876N969O172M648J820j212l848o191q480j0854j3382j5891j7851
$$ 879805 884681 890650 896822 901470 903290 902078 898230 892039 883559 872705 859323 843432 825581
61811H25581j8941j9643k0711k2077k2822k2333k0997j9494j7905j5936j3738
$$ 825581 806640 786997 766286 744209 721387 699054 678057 658563 640658 624722 610984
61800F10984j2026j1305j1225j0914r841q230o637n294m116l173k778k979l351
$$ 610984 598958 587653 576428 565514 555673 547443 540806 535512 531396 528223 525445 522466 519115
61787E19115l524l560l560l308k764k458k761l086k602j614j286j944k636k607
$$ 519115 515591 512031 508471 505163 502399 499941 497180 494094 491492 489878 488592 486648 484012 481405
61773D81405k267k121j674l50J199J714J058K83O0p0o61j359j405n74O92J822
$$ 481405 479138 477017 475343 474993 476192 477906 478964 479247 479307 479237 478576 477217 475812 475238 475930 477752
61757D77752K387K170J324L99j10k20l56q57j717k677l380l436k605j156P9K55
$$ 477752 480139 482309 483633 484032 483922 483702 483346 482489 480772 478095 474715 471279 468674 467518 467597 467852
61741D67852o34j598j623p40J00K54L5Q9N07R43J229J477J680J704J582J446J246
$$ 467852 467218 465620 463997 463257 463357 463611 463646 463735 464242 465185 466414 467891 469571 471275 472857 474303 475549
61724D75549R24P96J266K078K430K001J451J554K170K456J875O93m31j022r96
$$ 475549 476473 477269 478535 480613 483043 485044 486495 488049 490219 492675 494550 495243 494812 493790 492794
61709D92794o15l41o21j605l015m274m846m643m160m024m355m625m283l371k444
$$ 492794 492179 491838 491217 489612 486597 482323 477477 472834 468674 464650 460295 455670 451387 448016 445572
61694D45572j993k074k438k850l301l846m315m294l548k469j806j909k419k785
$$ 445572 443579 441505 439067 436217 432916 429070 424755 420461 416913 414444 412638 410729 408310 405525
61680D05525k886k958l075k935k189r00L15O74j8j001j235n68J21M5n33q21n94
$$ 405525 402639 399681 396606 393671 391482 390582 390897 391571 391553 390552 389317 388749 388870 388915 388382 387561 386967
61663C86967l00k55l20l38l72m01k10K79Q81J429J865K007J640J031Q12J156J471
$$ 386967 386667 386412 386092 385754 385382 384981 384771 385050 385931 387360 389225 391232 392872 393903 394715 395871 397342
61646C97342J301J034J280J856K095J908J863K149K141J283r3j171j585j665j906
$$ 397342 398643 399677 400957 402813 404908 406816 408679 410828 412969 414252 414159 412988 411403 409738 407832
61631D07832k473l172l662l706l324k684j903j074m30k68o12j153j569j759j703
$$ 407832 405359 402187 398525 394819 391495 388811 386908 385834 385404 385136 384524 383371 381802 380043 378340
61616C78340j374r15o94r41j444j811j981k240k762l285l350k852k278k260k838
$$ 378340 376966 376051 375357 374416 372972 371161 369180 366940 364178 360893 357543 354691 352413 350153 347315
61601C47315l347l217k730k595k940l188k974k623k527k505k180j584j049p11
$$ 347315 343968 340751 338021 335426 332486 329298 326324 323701 321174 318669 316489 314905 313856 313145
61587C13145n24m87n03l58j16k51q83j347j051n48q78j992k630j935m86N69Q06
$$ 313145 312621 312134 311631 311273 311157 310906 310023 308676 307625 307077 306199 304207 301577 299642 299156 299725 300531
61570C00531N62K20j16l90m49j19O28J479J868J523Q21K54k32q39j107l58J000
$$ 300531 301093 301313 301197 300807 300358 300239 300867 302346 304214 305737 306558 306812 306580 305741 304634 304276 305276
61553C05276J614R46M3O1Q39J545J930K156K025J352O62N56P27N43L09Q49J885
$$ 305276 306890 307836 307879 307940 308779 310324 312254 314410 316435 317787 318449 319005 319732 320275 320584 321433 323318
61536C23318K167J385P99J332K098J671K13p39l76M29M27m41j202j281j155j475
$$ 323318 325485 326870 327669 329001 331099 332770 332983 332244 331868 332297 332724 332283 331081 329800 328645 327170
61520C27170j988j850r27j27j48n16m00P9J52k69n04k74pJ74P69J772K109R54
$$ 327170 325182 323332 322405 322278 322130 321614 321214 321293 321445 321176 320672 320398 320391 320565 321334 323106 325215 326169
61502C26169r82k247k297j713j061m07J64L20j2m14m46j02L22N67O01O21Q64J296
$$ 326169 325187 322940 320643 318930 317869 317462 317626 317946 317934 317520 317074 316972 317294 317861 318462 319083 319947 321243
61484C21243J550J336Q05L89M12R29J697K081J461J6j179j267n88k0K43O62J227
$$ 321243 322793 324129 324934 325323 325735 326664 328361 330442 331903 331919 330740 329473 328885 328865 329108 329770 330997
61467C30997J297O94J45L04Q21Q57K01o24j088j137r65o58j51N32J133J363J338
$$ 330997 332294 332988 333133 333437 334258 335115 335316 334692 333604 332467 331502 330844 330693 331225 332358 333721 335059
61450C35059J528K051K255J511K94j97M78J487J914J781J604J524J445J546J991
$$ 335059 336587 338638 340893 342404 342698 342501 342979 344466 346380 348161 349765 351289 352734 354280 356271
61435C56271K409K320J887J686J800J782J506J443J855K244J975J145M70M13P01
$$ 356271 358680 361000 362887 364573 366373 368155 369661 371104 372959 375203 377178 378323 378793 379206 379907
61420C79907P15K37k87k84K77Q82J103R55N47j72j049j504j177n66m73r38j268
$$ 379907 380622 380859 380572 380288 380565 381447 382550 383505 384052 383880 382831 381327 380150 379584 379111 378173 376905
61403C76905j114r08j135j706k210k392k164j577r43o02m19P4R02J488J494J264
$$ 376905 375791 374883 373748 372042 369832 367440 365276 363699 362756 362154 361735 361809 362711 364199 365693 366957
61387C66957J145Q94K64l21k61L52Q81J074J233J577J913J985J744J274P81O00
$$ 366957 368102 368996 369260 368939 368678 369030 369911 370985 372218 373795 375708 377693 379437 380711 381492 382092
61371C82092Q72J303J559J761K144K373J822O12j50M79K231L974M868M970M858
$$ 382092 382964 384267 385826 387587 389731 392104 393926 394538 394388 394867 397098 401072 405940 410910 415768
61356D15768M944N194N356N405N587O063O614O884O763O394N928N416M837M104
$$ 415768 420712 425906 431262 436667 442254 448317 454931 461815 468578 474972 480900 486316 491153 495257
61342D95257L216K479K271K444K321J619R10P15O17o8j056j390q60l31n00j113
$$ 495257 498473 500952 503223 505667 507988 509607 510517 511232 511849 511781 510725 509335 508475 508144 507644 506531
61326E06531j592j828k006k168k155j690n05J191K419K285J201N80J195K549L966
$$ 506531 504939 503111 501105 498937 496782 495092 494587 495778 498197 500482 501683 502263 503458 506007 509973
61311E09973N423O930Q000Q365Q508Q926R373R413R197R036Q736P920O686N318
$$ 509973 515396 522326 530326 538691 547199 556125 565498 574911 584108 593144 601880 609800 616486 621804
61297F21804L796K111N94n74j774l263m545n076n130n304n651n997o530p258p356
$$ 621804 625600 627711 628305 627731 625957 622694 618149 613073 607943 602639 596988 590991 584461 577203 569847
61282E69847o140m320l180k779k099q66R4L54N44J139J742J920J910J966J864
$$ 569847 563707 559387 556207 553428 551329 550463 550557 550911 551455 552594 554336 556256 558166 560132 561996
61267E61996J476J190J344J864K785M370O333P651P640O684N570M719M327M524
$$ 561996 563472 564662 566006 567870 570655 575025 581358 589009 596649 603333 608903 613622 617949 622473
61253F22473M870M383K716Q15j91l01m01j103k313l564m294m197l664l463l701
$$ 622473 627343 631726 634442 635257 635066 634765 634364 633261 630948 627384 623090 618893 615229 611766 608065
61238F08065l614k798j885j507j321p84j92n1N6Q61K048K515K009J500J898L127
$$ 608065 604451 601653 599768 598261 596940 596156 595964 595913 595969 596830 598878 601393 603402 604902 606800 609927
61222F09927M610N917O794P171P274P346P211O607N843N554N828O128O095N812
$$ 609927 614537 620454 627248 634419 641693 649039 656250 662857 668700 674254 680082 686210 692305 698117
61208F98117N344M684M224M563N706O984P893Q460Q724Q655Q718R734J1730J3663
$$ 698117 703461 708145 712369 716932 722638 729622 737515 745975 754699 763354 772072 781806 793536 807199
61194H07199J4628J4775J4569J3838J2258J0190Q295O592M714K867J739J401J018
$$ 807199 821827 836602 851171 865009 877267 887457 895752 902344 907058 909925 911664 913065 914083
61181I14083r4j682l042l919m602n456o602p962r331j0436j1133j1561j2051j2818
$$ 914083 913989 912307 909265 905346 900744 895288 888686 880724 871393 860957 849824 838263 826212 813394
61167H13394j3730j4371j4381j3814j3133j2786j2761j2622j1993j0968j0015
$$ 813394 799664 785293 770912 757098 743965 731179 718418 705796 693803 682835 672820
61156F72820r458r120q498p275n593l830k294j164o33p70j345j957k401k802l361
$$ 672820 663362 654242 645744 638469 632876 629046 626752 625588 624955 624185 622840 620883 618482 615680 612319
61141F12319m102m844n245m932l812k336j170m77K83J701L704N725P390Q842J0385
$$ 612319 608217 603373 598128 593196 589384 587048 585878 585401 585684 587385 591089 596814 604204 613046 623431
61126F23431J2110J3900J5616J7121J8224J8845J9297K0163K1699K3385K4438
$$ 623431 635541 649441 665057 682178 700402 719247 738544 758707 780406 803791 828229
61115H28229K4771K5060K5670K5997K5296K3868K2669K1830K0352J7571J4223
$$ 828229 853000 878060 903730 929727 955023 978891 1001560 1023390 1043742 1061313 1075536
61104A075536J1500R547P515M833J701j632n293r234j2786j5223j6592j7623j8909
$$ 1075536 1087036 1096583 1104098 1108931 1110632 1109000 1103707 1094473 1081687 1066464 1049872 1032249 1013340
61091A013340k0383k1585k2201k2303k2130k1746k1010j9893j8632j7464j6312
$$ 1013340 992957 971372 949171 926868 904738 882992 861982 842089 823457 805993 789681
61080G89681j4974j3562j2357j1256r740p631n541m224l633k987j729j35J161
$$ 789681 774707 761145 748788 737532 727792 720161 714620 710396 706763 703776 702047 701912 703073
61067G03073J959K674L766N127O173O621P008Q153J0040J1688J2393J2716J3765
$$ 703073 705032 707706 711472 716599 722772 729393 736401 744554 754594 766282 778675 791391 805156
61054H05156J5739J7798J9268K0317K1352K2428K3488K4720K6212K7724K9117
$$ 805156 820895 838693 857961 878278 899630 922058 945546 970266 996478 1024202 1053319
61043A053319L0649L2484L4343L6051L7934M0111M1801M2177M1735M2000M3787
$$ 1053319 1083968 1116452 1150795 1186846 1224780 1264891 1306692 1348869 1390604 1432604 1476391
61032A476391M6426M8838N0693N2276N3842N5543N7631O0328O3706O7877P3065
$$ 1476391 1522817 1571655 1622348 1674624 1728466 1784009 1841640 1901968 1965674 2033551 2106616
61021B106616P9402Q6864R5598J06040J18739J34343J53706J77687K06937K42345
$$ 2106616 2186018 2272882 2368480 2474520 2593259 2727602 2881308 3058995 3265932 3508277
61011C508277K85519L37937L99613M69566N47813O35735P34136Q42515R61322
$$ 3508277 3793796 4131733 4531346 5000912 5548725 6184460 6918596 7761111 8722433
61002H722433J092113J230723J358439J443687J458473J397288J280583J138693
$$ 8722433 9814546 11045269 12403708 13847395 15305868 16703156 17983739 19122432
60994A9122432R91036Q39028O76056N00868L20302J41789l2595k03468l68069
$$ 19122432 20113468 20952496 21628552 22129420 22449722 22591511 22558916 22355448 21987379
60985B1987379n20117o56722p84690r18329j068233j228506j373170j467492j487799
$$ 21987379 21467262 20810540 20025850 19107521 18039288 16810782 15437612 13970120 12482321
60976A2482321j434391j327651j193158j050072r09572p78381o60708n58234m70693
$$ 12482321 11047930 9720279 8527121 7477049 6567477 5789096 5128388 4570154 4099461
60967D099461l97084l36052k85787k44485k10767j83289j60511j41343j25510
$$ 4099461 3702377 3366325 3080538 2836053 2625286 2441997 2281486 2140143 2014633
60958B014633j12640j01483r0783q0545p1616o4265n7995n2604m8394m5231m2289
$$ 2014633 1901993 1800510 1709727 1629182 1557566 1493301 1435306 1382702 1334308 1289077 1246788
60947A246788l9132l6418l4941l4429l3823l2524l0858k9334k7964k6537k5113
$$ 1246788 1207656 1171238 1136297 1101868 1068045 1035521 1004663 975329 947365 920828 895715
60936H95715k3966k3144k2440k1690k0849j9742j8238j6722j5904j5816j5425
$$ 895715 871749 848605 826165 804475 783626 763884 745646 728924 713020 697204 681779
60925F81779j3781j1274r118p845o985o147n598n506n382m671l461k187j106l69
$$ 681779 667998 656724 647606 639761 632776 626629 621031 615525 610143 605472 602011 599824 598718 598349
60911E98349j91m67n74j8Q86J409J286Q63O00O96J068J360J136K72r36k146l205
$$ 598349 598158 597691 597117 597099 597985 599394 600680 601543 602143 602839 603907 605267 606403 606675 605739 603593 600388
60894F00388l938m138m013m131m695n233n401n470n674n686n318n135n646o328
$$ 600388 596450 592312 588299 584168 579473 574240 568839 563369 557695 552009 546691 541556 535910 529582
60880E29582o391o099o328p041p245o489n359m375l383k315j650j688k032k161
$$ 529582 523191 517092 510764 503723 496478 489989 484630 480255 476872 474557 472907 471219 469187 467026
60866D67026j914j208K7J310J749J172M59M02Q91J566K466L457L824L240K461
$$ 467026 465112 463904 463931 465241 466990 468162 468621 469023 469914 471480 473946 477403 481227 484467 486928
60851D86928K225K080J264K26O9P61J101N30k09n02q30j803k989l457l043k444
$$ 486928 489153 491233 492497 492723 492792 493553 494654 495184 494975 494473 493643 491840 488851 485394 482351 479907
60835D79907k260k401k445k243k132k503l221l659l468l004k673k213j281m36
$$ 479907 477647 475246 472801 470558 468426 465923 462702 459043 455575 452571 449898 447685 446404 445968
60821D45968o32j746k550k403k057k319k851k877k422k073k048k280k942m056
$$ 445968 445336 443590 441040 438637 436580 434261 431410 428533 426111 424038 421990 419710 416768 412712
60807D12712m910m729l772k974k663k442k250k538l254l575l030k153j625j435
$$ 412712 407802 403073 399301 396327 393664 391222 388972 386434 383180 379605 376575 374422 372797 371362
60793C71362j277j198j242j028l05L77K27o31j211r01q1N64Q87J129J313J218
$$ 371362 370085 368887 367645 366617 366312 366689 366916 366285 365074 364173 364092 364656 365543 366672 367985 369203
60777C69203Q92P57J045J423J509J495J876K548K782K262J641J636K067K322K351
$$ 369203 370095 370852 371897 373320 374829 376324 378200 380748 383530 385792 387433 389069 391136 393458 395809
60762C95809K495K626K300J598J000M94k72r25o31L29M50r17k402k385j129j67
$$ 395809 398304 400930 403230 404828 405828 406322 406050 405125 404494 404823 405273 404356 401954 399569 398440 398273
60746C98273k04p36j274j830k295k321j932j587j606k069l079m431n320n107m278
$$ 398273 398069 397333 396059 394229 391934 389613 387681 386094 384488 382419 379340 374909 369589 364482 360204
60731C60204l846l907l671k862k091j781j635j404j286j265q41J21R81J119O47
$$ 360204 356358 352451 348780 345918 343827 342046 340411 339007 337721 336456 335615 335736 336717 337836 338483
60716C38483rn99q43m59K63N66K76J59P71J613J926J741J581J643J842K180K488
$$ 338483 338474 337875 337032 336573 336836 337402 337678 337837 338608 340221 342147 343888 345469 347112 348954 351134 353622
60699C53622K287J509R61J379K432L230L479L427L061K213J232P58Q71J103J238
$$ 353622 355909 357418 358379 359758 362190 365420 368899 372326 375387 377600 378832 379590 380461 381564 382802
60684C82802J448J700J753J675J765J908J653R87M16J63o8m52p44q47j038j370
$$ 382802 384250 385950 387703 389378 391143 393051 394704 395691 396107 396270 396202 395750 395006 394159 393121 391751
60668C91751j437j060p79j188k144k988l325l192k755k170j665j389j233r47m04
$$ 391751 390314 389254 388475 387287 385143 382155 378830 375638 372883 370713 369048 367659 366426 365479 365075
60653C65075L80J344K300K862K730K016J187O25L58J59j54n59r41j289j656j935
$$ 365075 365455 366799 369099 371961 374691 376707 377894 378519 378877 379036 378882 378323 377382 376093 374437 372502
60637C72502j839j293o92n42q53j135j045p99q12j074j098n12L80Q17L98l61n55
$$ 372502 370663 369370 368678 368136 367283 366148 365103 364304 363492 362418 361320 360808 361188 362005 362403 362042 361487
60620C61487N0P44P62J56m15m96j10N32J182J521J363R43P12P63P85N73L33L69
$$ 361487 361537 362281 363043 363199 362784 362288 362178 362710 363892 365413 366776 367719 368431 369194 369979 370552 370885 371254
60602C71254P18J144J357J221Q71O20O05O44O30P90J232J466R86K31K37J142J753
$$ 371254 371972 373116 374473 375694 376565 377185 377790 378434 379064 379854 381086 382552 383538 383769 384006 385148 386901
60585C86901J054l75j080n52L66P69P38Q75J326J745J954K285L135M392N500O058
$$ 386901 387955 387580 386500 385948 386314 387083 387821 388696 390022 391767 393721 396006 399141 403533 409033 415091
60569D15091O268O684P505Q262Q292P471O310N338M586L781K831J910J095K59
$$ 415091 421359 428043 435548 443810 452102 459573 465883 471221 475807 479588 482419 484329 485424 485683
60555D85683n82j047q57l57l00r95j901k144j328K03J800L123M367N880P510Q585
$$ 485683 485101 484054 483197 482840 482540 481545 479644 477500 476172 476375 478175 481298 485665 491545 499055 507640
60539E07640Q744Q623R266J0871J2478J3000J2199J0594Q821P277N944M403K319
$$ 507640 516384 525007 534273 545144 557622 570622 582821 593415 602236 609513 615457 619860 622179
60526F22179J15j329j816k174l103m275n008n232n193m695l531k332k007k390
$$ 622179 622294 620965 619149 616975 613872 609597 604589 599357 594164 589469 585938 583606 581599 579209
60512E79209k317j174M36J710K595L436M412N725P704J0343J3074J5497J7918
$$ 579209 576892 575718 576154 577864 580459 583895 588307 594032 601736 612079 625153 640650 658568
60499F58568K0734K3678K6144K8043K9786L1457L2502L2292L0753K8302K5349
$$ 658568 679302 702980 729124 757167 786953 818410 850912 883204 913957 942259 967608
60488I67608K1864J7432J1766N186j453p395j2498j7102k1541k5776k9423l2035
$$ 967608 989472 1006904 1018670 1023856 1022403 1015008 1002510 985408 963867 938091 908668 876633
60476H76633l3485l4026l3957l3309l2013l0233k8310k6398k4423k2343k0240
$$ 876633 843148 809122 775165 741856 709843 679610 651300 624902 600479 578136 557896
60465E57896j8117j5903j3696j1754j0198q919p761o614n384m139l238k980l092
$$ 557896 539779 523876 510180 498426 488228 479309 471548 464934 459550 455411 452173 449193 446101
60452D46101k860j963r11n50j239k583l831m421m262l588k691j878j582k043k777
$$ 446101 443241 441278 440367 439817 438578 435995 432164 427743 423481 419893 417202 415324 413742 411699 408922
60437D08922k852k028j154r59r88m03O01J101R31Q10J007R60M69K11N80Q94M30
$$ 408922 406070 404042 402888 401929 400941 400538 401139 402240 403171 403981 404988 405948 406417 406628 407208 408102 408532
60420D08532l90n69J80J299K172K511K216J438O39J85N6J84P67J840K896L331
$$ 408532 408142 407573 407753 409052 411224 413735 415951 417389 418028 418213 418269 418453 419220 421060 423956 427287
60404D27287L072K449J670Q27J94M9L81R61J600K085K211K089K160K648L266L707
$$ 427287 430359 432808 434478 435305 435499 435548 435929 436890 438490 440575 442786 444875 447035 449683 452949 456656
60388D56656M039M302M241L782L382L375L400L039K645K787L202L063K236J537
$$ 456656 460695 464997 469238 473020 476402 479777 483177 486216 488861 491648 494850 497913 500149 501686
60374E01686J586K070K336K245K131K271K642L025L196L049K627K069J708K096
$$ 501686 503272 505342 507678 509923 512054 514325 516967 519992 523188 526237 528864 530933 532641 534737
60360E34737L553N508O758O804O589P399R227J0797J1111J0428R663R262Q867
$$ 534737 538290 543798 550556 557360 563949 571348 580575 591372 602483 612911 622574 631836 640703
60347F40703P799N765L174P74j096k746m560o472q168r433j0017r572q269p084
$$ 640703 648502 654267 657441 658215 657119 654373 649813 643341 635173 625740 615723 606151 597882 590798
60333E90798o877p311p255o202m796l873l581l518l374l166l076l141l032k259
$$ 590798 583921 576610 569355 563153 558357 554484 550903 547385 544011 540845 537769 534628 531596 529337
60319E29337p70Q15J874K486L200M314N743P373R104J0664J1774J2488J3023J3379
$$ 529337 528567 529382 531256 533742 536942 541256 546999 554372 563476 574140 585914 598402 611425 624804
60305F24804J3385J2935J1795R578O346K983L46j713l888o256q245r627j0719
$$ 624804 638189 651124 662919 672497 678843 681826 682172 680459 676571 670315 662070 652443 641724
60292F41724j1651j2185j2325j2343j2148j1322r936q621p677o809n928n417n372
$$ 641724 630073 617888 605563 593220 581072 569750 559814 551193 543516 536707 530779 525362 519990
60279E19990n276m821m351m118l736k900k045j750j988k482l297m407n106m609
$$ 519990 514714 509893 505542 501424 497688 494788 492743 490993 489005 486523 483226 478819 473713 469104
60265D69104l146j816j333j350j094l33M18M87j83q63p67J27J151J811K144K225
$$ 469104 465958 464142 462809 461459 460365 460032 460450 460937 460754 459891 459124 459251 460402 462213 464357 466582
60249D66582J862J051K66n8lJ48L66O78Q66P25M15K21K13L19N24O91N57J49o2
$$ 466582 468444 469495 469761 469703 469700 469848 470214 470892 471758 472483 472898 473119 473332 473651 474175 474866 475423 475572 475510
60230D75510K73R02J405J772K215K677L009L328L842M430M719M510L892L214L112
$$ 475510 475783 476685 478090 479862 482077 484754 487763 491091 494933 499363 504082 508592 512484 515698 518810
60215E18810M115N891P250P411O860O478O295N805N120M927N377N881O102O230
$$ 518810 522925 528816 536066 543477 550337 556815 563110 568915 574035 578962 584339 590220 596322 602552
60201F02552O178N381L788K349J898K127K180J846J507J205M55r04k316l142l386
$$ 602552 608730 614111 617899 620248 622146 624273 626453 628299 629806 631011 631466 630562 628246 625104 621718
60186F21718l592m104m632m592l823k890k581l064l712l875l570l234l003k569
$$ 621718 618126 614022 609390 604798 600975 598085 595504 592440 588728 584853 581283 578049 575046 572477
60172E72477j807j103r22j234j632j846j889j786j491j085q04p09n74k48R2K69
$$ 572477 570670 569567 568645 567411 565779 563933 562044 560258 558767 557682 556878 556169 555595 555347 555439 555708
60156E55708M33Q06J219J293J055R58J222J495J311O95J50J72R06K091L221L863
$$ 555708 556141 556947 558166 559459 560514 561472 562694 564189 565500 566195 566345 566517 567423 569514 572735 576598
60140E76598M002L972M075M304M436M233L623K857K463K788L575M198M269L807
$$ 576598 580600 584572 588647 592951 597387 601620 605243 608100 610563 613351 616926 621124 625393 629200
60126F29200K925J759O82J63K68O63J159J806K392K439J919J448J393J337Q54
$$ 629200 632125 633884 634566 634729 634997 635660 636819 638625 641017 643456 645375 646823 648216 649553 650407
60111F50407K69O6l5o61j691k341k303k117k303k714k974l038l020k793k108r91
$$ 650407 650676 650742 650707 650046 648355 646014 643711 641594 639291 636577 633603 630565 627545 624752 622644 621653
60095F21653K14J139J660J923K158K445K679K703K413J723O96k64o36l91q1j96
$$ 621653 621867 623006 624666 626589 628747 631192 633871 636574 638987 640710 641406 641142 640506 640115 640034 639838
60079F39838p11j459k501l760m759n214n601o521p735q458q435q076p625o864
$$ 639838 639127 637668 635167 631407 626648 621434 615833 609312 601577 593119 584684 576608 568983 562119
60065E62119n778m832m362m185m019l841l657l348k923k574k342k039j585j071
$$ 562119 556341 551509 547147 542962 538943 535102 531445 528097 525174 522600 520258 518219 516634 515563
60051E15563m26M83J425J908J889J900K297K894L424L822L955L631L130L008L139
$$ 515563 515137 515620 517045 518953 520842 522742 525039 527933 531357 535179 539134 542765 545895 548903 552042
60036E52042K697J532O64P47Q64k12k142l473l673l581l941m553n024n411n774
$$ 552042 554739 556271 556935 557682 558546 558334 556192 552719 549046 545465 541524 536971 531947 526536 520762
60021E20762n942n991o350p058p490p205o466n673m817l901l343l412l627l266
$$ 520762 514820 508829 502479 495421 487931 480726 474260 468587 463770 459869 456526 453114 449487 446221
60007D46221k332j497j261j467j592j253n36K5K1k35J7R07J633J534R99Q17J094
$$ 446221 443889 442392 441131 439664 438072 436819 436283 436308 436329 436094 436111 437018 438651 440185 441184 442001 443095
59990D43095J403J649K086K620K844K738K617K362J425k20j790k560k565k157
$$ 443095 444498 446147 448233 450853 453697 456435 459052 461414 462839 462619 460829 458269 455704 453547
59976D53547j540j031j151j882k331j731n13J92n9o95j068j125j125j143j038
$$ 453547 452007 450976 449825 447943 445612 443881 443368 443560 443501 442806 441738 440613 439488 438345 437307
59961D37307o80n9O20J028J007P77O27N54M08K82M13P46R77R38O90K70k91p28
$$ 437307 436627 436568 437188 438216 439223 440000 440627 441181 441589 441871 442284 443030 444007 444945 445635 445905 445614 444886
59943D44886p46m95m24o08o34l17m4j13j97J33O50P22K43j80M8R40K105L168L876
$$ 444886 444140 443645 443221 442613 441979 441662 441618 441505 441308 441441 442091 442813 443056 442876 442924 443864 445969 449137 453013
59924D53013M117M018L858L750L538L111K650K352K039J337K36p41j100q50l46
$$ 453013 457130 461148 465006 468756 472294 475405 478055 480407 482446 483783 484019 483278 482178 481328 480982
59909D80982J98Q19J548K241K674K694K311J828J730K193K787K993K941L260M163
$$ 480982 481180 481999 483547 485788 488462 491156 493467 495295 497025 499218 502005 504998 507939 511199 515362
59894E15362N105N499N322M834M161L541L479M210N175N598N362M948M678M519
$$ 515362 520467 525966 531288 536122 540283 543824 547303 551513 556688 562286 567648 572596 577274 581793
59880E81793M524M814N069M630L282J578J96p07j362j940k457k951l486m046m450
$$ 581793 586317 591131 596200 600830 604112 605690 605886 605179 603817 601877 599420 596469 592983 588937 584487
59865E84487m413l828l029k533k369j983j084j48L51Q31K035L760M984N224N083
$$ 584487 580074 576246 573217 570684 568315 566332 565248 565100 565451 566282 568317 572077 577061 582285 587368
59850E87368N319O047P015P899Q159P271N481L814K932K503J925J154M28k96j139
$$ 587368 592687 598734 605749 613648 621807 629078 634559 638373 641305 643808 645733 646887 647315 647019 645880
59835F45880j919k399k658k939l377m068m978n657n612n108m987n382n436m723
$$ 645880 643961 641562 638904 635965 632588 628520 623542 617885 612273 607165 602178 596796 591360 586637
59821E86637m061m251m791m832m705n274o161n959m343k697k289k771l008k630
$$ 586637 582576 578325 573534 568702 563997 558723 552562 546603 542260 539563 537274 534503 531495 528865
59807E28865k149j948j907j851j868k042k163j905j269p48q25j396j828j683j168
$$ 528865 526716 524768 522861 521010 519142 517100 514937 513032 511763 511015 510190 508794 506966 505283 504115
59792E04115p66o77q03r62r49o30j60J58K91L94K43o05j853k369j586l59J91J48
$$ 504115 503349 502672 501869 500907 499958 499328 499168 499326 499617 500011 500254 499649 497796 495427 493841 493482 493673 493821
59774D93821L46R44J367J398J413J586J640J437J199J139J413K244L502M367M153
$$ 493821 494167 495111 496478 497876 499289 500875 502515 503952 505151 506290 507703 509947 513449 517816 521969
59759E21969L300K873L179L687M120M656N103M945M376M297M981N610N492M917
$$ 521969 525269 528142 531321 535008 539128 543784 548887 553832 558208 562505 567486 573096 578588 583505
59745E83505M487M345M440M783N055M664L645K810K644K700K499K255K194J921
$$ 583505 587992 592337 596777 601560 606615 611279 614924 617734 620378 623078 625577 627832 630026 631947
59731F31947J140L71K35N21O95Q01J132J363Q88j89j142j601j852k166k431k457
$$ 631947 633087 633458 633693 634214 634909 635710 636842 638205 639093 638904 637762 636161 634309 632143 629712 627255
59715F27255k188j711j290j267j555j556r69m15o41j376j593q68J87Q20Q96O85
$$ 627255 625067 623356 622066 620799 619244 617688 616719 616304 615663 614287 612694 611826 612013 612833 613729 614414
59699F14414M22L08N09R50J293J217O25l55j336j723j193j25P18R10N05l63j571
$$ 614414 614836 615144 615653 616603 617896 619113 619738 619383 618047 616324 615131 615006 615724 616634 617139 616776 615205
59682F15205k678l067k662k139k217k968l997m964n657n814n348m663m356m505
$$ 615205 612527 609460 606798 604659 602442 599474 595477 590513 584856 579042 573694 569031 564675 560170
59668E60170m586m155l350k544j857j294j069j276j419q52K77J121J294J351J777
$$ 560170 555584 551429 548079 545535 543678 542384 541315 540039 538620 537768 538045 539166 540460 541811 543588
59653E43588K167J982J529J465J730J766J521J425J456J093K08q43j932l159m050
$$ 543588 545755 547737 549266 550731 552461 554227 555748 557173 558629 559722 559930 559087 557155 553996 549946
59638E49946l837k726j963k242k905l123k968k792k447j808j303j191j035o00
$$ 549946 546109 543383 541420 539178 536273 533150 530182 527390 524943 523135 521832 520641 519606 519006
59624E19006n77j521k762l294l255l475m013m169l676k873j903p47J56L12J02
$$ 519006 518429 516908 514146 510852 507597 504122 500109 495940 492264 489391 487488 486741 486897 487209 487311
59609D87311L32R32J184J084J362K027K167J535J082J404J724J169J53l21m7N08
$$ 487311 487643 488575 489759 490843 492205 494232 496399 497934 499016 500420 502144 503313 503466 503145 503098 503606
59593E03606J112J745K034J535M48n69j147j306j058m34K02L98Q0n24j234j821
$$ 503606 504718 506463 508497 510032 510480 509911 508764 507458 506400 505966 506168 506566 506646 506122 504888 503067
59577E03067j847j125k32mn79j287j550j366r64m01L09R60J244J055N77J84J04
$$ 503067 501220 500095 499863 499859 499280 497993 496443 495077 494113 493712 494021 494981 496225 497280 497857 498041 498145
59560D98145J21j79p66j025n94L0J52o5J96J211K360L057L418L757M042M295N025
$$ 498145 498266 498087 497321 496296 495702 495732 495884 495819 496015 497226 499586 502643 506061 509818 513860 518155 523180
59543E23180O719R087J1324J2922J3781J3691J2330R963P537N767M395K609P5
$$ 523180 529899 538986 550310 563232 577013 590704 603034 612997 620534 626301 630696 633305 633380
59530F33380k670m651n155m151k322o76M0k67j088j616j231m5R52O55j003k964
$$ 633380 630710 626059 620904 616753 614431 613755 613795 613528 612440 610824 609593 609548 610500 611155 610152 607188
59514F07188m186m624m857n209n613o067o597o982o975o777o762o786o293n168
$$ 607188 603002 598378 593521 588312 582699 576632 570035 563053 556078 549301 542539 535753 529460 524292
59500E24292l965l130k485j744j053p26p64q95q40m00M13J138J231Q35P90J569
$$ 524292 520327 517197 514712 512968 511915 511189 510425 509530 508690 508290 508703 509841 511072 511907 512697 514266
59484E14266K611L123L110L132L400L703L958M263M522M545M491M605M648M152
$$ 514266 516877 520000 523110 526242 529642 533345 537303 541566 546088 550633 555124 559729 564377 568529
59470E68529L246K566K289J933J349J216K035L170L541L034K575K964M086N368
$$ 568529 571775 574341 576630 578563 579912 581128 583163 586333 589874 592908 595483 598447 602533 607901
59456F07901O413P021P052O623O230O295O653O750O268N312M002K299K90j604
$$ 607901 614314 621335 628387 635010 641240 647535 654188 660938 667206 672518 676520 678819 679109 677505
59442F77505k977l819m447n148n978o717o941o397n395m511l750k483n66J070
$$ 677505 674528 670709 666262 661114 655136 648419 641478 635081 629686 625175 621425 618942 618376 619446
59428F19446J573J537K318M227O261P707R013J0808J2967J5045J6967J8763K0177
$$ 619446 621019 622556 624874 629101 635362 643069 652082 662890 675857 690902 707869 726632 746809
59415G46809K1074K1611K1533J9925J6362J1864P924M904K035j199m411o865q022
$$ 746809 767883 789494 811027 830952 847314 859178 867102 872006 874041 872842 868431 861566 853544
59402H53544p708o333m953m507m961n647o346p467r228j1265j3139j4685j5751
$$ 853544 845836 839503 834550 830043 825082 819435 813089 805622 796394 785129 771990 757305 741554
59389G41554j6061j5512j4295j2630j0638q484o346m324k640j747j817k216k048
$$ 741554 725493 709981 695686 683056 672418 663934 657588 653264 650624 648877 647060 644844 642796
59376F42796j265p08r29j496j637j154m22K37Q20J454K108K613K894L192L813
$$ 642796 641531 640823 639894 638398 636761 635607 635185 635422 636242 637696 639804 642417 645311 648503 652316
59361F52316M680N393N920O792Q234R524R813R381R369J0353J1833J3159J4279
$$ 652316 656996 662389 668309 675101 683335 692859 702672 712053 721422 731775 743608 756767 771046
59348G71046J5346J6121J6193J5485J4285J2907J1497J0027Q407O634M755K642
$$ 771046 786392 802513 818706 834191 848476 861383 872880 882907 891314 897948 902703 905345
59336I05345O3k826n392p270q860j0684j2544j3934j4905j5864j6660j6699j5961
$$ 905345 905408 902582 897190 889920 881060 870376 857832 843898 828993 813129 796469 779770 763809
59323G63809j5125j4580j4039j3235j2319j1381j0255r027q128p664p191o340
$$ 763809 748684 734104 720065 706830 694511 683130 672875 663848 655720 648056 640865 634525
59311F34525n201l898k402q94K69J185K368L883N192O083O948P802P820O423M140
$$ 634525 629324 625426 623024 622130 622399 623584 625952 629835 635027 641110 648058 655860 663680 670103 674243
59296F74243J806n22l166n870q025r467j0341j0475r605q044o421m865l098j234
$$ 674243 676049 675527 672361 666491 658466 648999 638658 628183 618578 610534 604113 599248 596150 594916
59282E94916J34Q07J373K564M452O463P976Q853R442J0083J0669J0899J0907J1128
$$ 594916 595050 595857 597230 599794 604246 610709 618685 627538 636980 647063 657732 668631 679538 690666
59268F90666J1495J1324J0260Q749P222N445L279J447O61M04n31k379m199n278
$$ 690666 702161 713485 723745 732494 739716 745161 748440 749887 750548 750952 750421 748042 743843 738565
59254G38565n841o179o061n326m418l790l328k783k318k070j638n51R56K271L312
$$ 738565 732724 726545 720484 715158 710740 706950 703622 700839 698521 696451 694813 694262 695218 697489 700801
59239G00801M478N726O401O168N535N064M591L649K327J039k91k139m404o240
$$ 700801 705279 711005 717406 723574 729109 734173 738764 742413 744740 745779 745488 743349 738945 732705
59225G32705p108p480q107r085j0012j0666j1013j0837r943q615p421o642o233
$$ 732705 725597 718117 710010 700925 690913 680247 669234 658397 648454 639839 632418 625776 619543
59212F19543o155o278o177n545m662l951l237k099p45J91O52J104J502J284N96
$$ 619543 613388 607110 600933 595388 590726 586775 583538 581439 580694 580885 581537 582641 584143 585427 586023
59197E86023N16J512K583K625J951J693K155K627K563K128J683J396J383J694
$$ 586023 586539 588051 590634 593259 595210 596903 599058 601685 604248 606376 608059 609455 610838 612532
59183F12532K088K236K208K400K989L698M094L925L238K386J912K137K873L662
$$ 612532 614620 616856 619064 621464 624453 628151 632245 636170 639408 641794 643706 645843 648716 652378
59169F52378M211M474M461M229L984L909L881L491K426Q30p97k087l203m508n860
$$ 652378 656589 661063 665524 669753 673737 677646 681527 685018 687444 688274 687477 685390 682187 677679 671819
59154F71819o604o523o426p202q582r434r190q384p771p542p477p266o623n646
$$ 671819 665215 658692 652266 645064 636482 627048 617858 609474 601703 594161 586684 579418 572795 567149
59140E67149m990n083n284m627l384k815l257l600l022k100j564j118l06M80Q23
$$ 567149 562159 557076 551792 547165 543781 540966 537709 534109 531087 528987 527423 526305 525999 526479 527302
59125E27302J238K298L427L765L663M194N529O912P941Q745R142Q752P983P851
$$ 527302 528540 530838 534265 538030 541693 545887 551416 558328 566269 575014 584156 592908 600891 608742
59111F08742Q650R636J0117J0082R658Q778P521O155M711L089J610Q11O77P05
$$ 608742 617392 627028 637145 647227 656885 665663 673184 679339 684050 687139 688749 689560 690237 690942
59097F90942P32R68J247J035L23k28k89l07o71j107j271j367j761k406l070l797
$$ 690942 691674 692642 693889 694924 695247 695019 694730 694423 693752 692645 691374 690007 688246 685840 682770 678973
59081F78973m719n634o095n883n222m643m651n327o151o396n833m949m459m640
$$ 678973 674254 668620 662525 656642 651420 646777 642126 636799 630648 624252 618419 613470 609011 604371
59067F04371n085n040m111k756j881j889k357k712k830k771k464j954j600j589
$$ 604371 599286 594246 590135 587379 585498 583609 581252 578540 575710 572939 570475 568521 566921 565332
59053E65332j624j450j235j093p53j99q1q34j844k251k038j673j125k26M82L34
$$ 565332 563708 562258 561023 559930 559177 558978 558897 558063 556219 553968 551930 550257 549132 548906 549388 549722
59037E49722k61k84L62Q97J151J777K936L900M260M499N048N666O137O738P637
$$ 549722 549461 549177 549539 550436 551587 553364 556300 560200 564460 568959 574007 579673 585810 592548 600185
59022F00185Q523R174R668R809R068P440N676M318L206K160J393R29L91k56n23
$$ 600185 608708 617882 627550 637359 646427 653867 659543 663861 667067 669227 670620 671549 671940 671684 671161
59007F71161l44l59q08q65K45K135L815M855N392N549N437N363N435N303M761
$$ 671161 670817 670458 669650 668785 669030 671165 674980 679835 685227 690776 696213 701576 707011 712314 717075
58992G17075M160L850L632L256K897K657K088Q86l60q41o57n68p65o01M41K070
$$ 717075 721235 725085 728717 731973 734870 737527 739615 740501 740141 739300 738643 738075 737310 736709 737150 739220
58976G39220L606M753N800P203R053J0871J2034J2271J1653J0357Q880Q184Q871
$$ 739220 742826 747579 753379 760582 769635 780506 792540 804811 816464 826821 835701 843885 852756
58963H52756J0058J0037Q281O031M451L080Q82j946m209n430o364p825r811j1889
$$ 852756 862814 872851 881132 887163 891614 894694 895576 893630 889421 883991 877627 869802 859991 848102
58949H48102j3760j5220j5965j5792j4865j3641j2508j1503j0419r270q450q082
$$ 848102 834342 819122 803157 787365 772500 758859 746351 734848 724429 715159 706709 698627
58937F98627p506n979l879k425k028j770r07j9m1q15j434j555j486j281o61K02
$$ 698627 691121 685142 681263 678838 676810 675040 674133 674114 674073 673258 671824 670269 668783 667502 666841 667043
58921F67043O59M68Q7q6k30o09r82q55j31P92J527K184L139M350N267N704O442
$$ 667043 667702 668170 668257 668171 667941 667332 666350 665495 665364 666156 667683 669867 673006 677356 682623 688327 694769
58904F94769Q343J1006J3060J3813J3876J3943J3947J3803J4052J4980J5868J5976
$$ 694769 703112 714118 727178 740991 754867 768810 782757 796560 810612 825592 841460 857436
58892H57436J5754J6174J7238J8136J8575J8982J9432J9321J8198J6232J3722
$$ 857436 873190 889364 906602 924738 943313 962295 981727 1001048 1019246 1035478 1049200
58881A049200J0853P943N303K681m97m205p670j0261j2049j3327j4184j4692j5016
$$ 1049200 1060053 1067996 1073299 1075980 1075483 1071278 1063608 1053347 1041298 1027971 1013787 999095 984079
58868I84079j5035j4380j3113j1917j1268j0818j0008r046q740r433j0490j0926
$$ 984079 969044 954664 941551 929634 918366 907548 897540 888494 879754 870321 859831 848905
58856H48905j0428r622r420j0094j0984j1186j0501r597r239r538j0007j0189
$$ 848905 838477 828855 819435 809341 798357 787171 776670 767073 757834 748296 738289 728100
58844G28100j0012r625r153q713q434q234p760o808n846n593n972n953m766k862
$$ 728100 718088 708463 699310 690597 682163 673929 666169 659361 653515 647922 641950 635997 631231 628369
58830F28369j253k51M94J034J059P37P48J333K072K718L477M164M049L057K264
$$ 628369 627116 626865 627359 628393 629452 630189 630937 632270 634342 637060 640537 644701 648750 651807 654071
58815F54071K485L090K966K148J525J343R67O7q24j139j042j205k126l718n315
$$ 654071 656556 659646 662612 664760 666285 667628 668595 668662 667838 666699 665657 664452 662326 658608 653293
58800F53293o112n871n154m695m746n146n621n720m985l590k437k032j797j023
$$ 653293 647181 641310 636156 631461 626715 621569 615948 610228 605243 601653 599216 597184 595387 594364
58786E94364k1M97P83J722L245M134L639K461J784J976K559K882K500J341j34
$$ 594364 594343 594840 595623 597345 600590 604724 608363 610824 612608 614584 617143 620025 622525 623866 623732
58771F23732j218j678k028k916m456o182p372p415o270m707l720l537l481k862
$$ 623732 622514 620836 618808 615892 611436 605254 597882 590467 584197 579490 575770 572233 568752 565890
58757E65890j728o17Q5L49L92N51J070J831K470K834L151L605M007M037L689L308
$$ 565890 564162 563545 563630 563979 564371 564922 565992 567823 570293 573127 576278 579883 583890 587927 591616 594924
58741E94924L265L694M438N201N789O256O711P038O973O483N947N812O183O785
$$ 594924 598189 601883 606321 611522 617311 623567 630278 637316 644289 650772 656719 662531 668714 675499
58727F75499P248P326P008O584O599P381Q460Q767P882O891P325R087J0235R326
$$ 675499 682747 690073 697081 703665 710264 717645 726105 734872 742754 749645 756970 766057 776292 785618
58713G85618P315O196O252N864L967J447l72j620l439o309r637j2612j4800j6060
$$ 785618 792933 799129 805381 811245 815212 816659 816287 814667 811228 804919 795282 782670 767870 751810
58699G51810j6521j6646j6871j7130j6977j6176j4923j3601j2468j1496j0493
$$ 751810 735289 718643 701772 684642 667665 651489 636566 622965 610497 599001 588508
58688E88508r404q454p807p251o566n962n706n472m713l578k736k345j966j437
$$ 588508 579104 570650 562843 555592 549026 543064 537358 531886 527173 523595 520859 518514 516548 515111
58674E15111r88l69J005K881M215M783N649P449R296J0084R878R273Q367P259
$$ 515111 514123 513754 514759 517640 521855 526638 532287 539736 549032 559116 568994 578267 586634 593893
58660E93893O532O272N415L169L29j845l300m609n511n431m878m934n597n909
$$ 593893 600425 606697 612112 615281 615610 613765 610465 605856 600345 594914 590036 585102 579505 573596
58646E73596n528n001m586l941k871j537o6J198J484O07k55J37J367K069J849
$$ 573596 568068 563067 558481 554540 551669 550132 550066 551264 552748 553355 553100 553237 554604 556673 558522
58631E58522J328P04j84p16o7J125J251Q7q41n16L80R22J198J662K419L596N322
$$ 558522 559850 560554 560370 559654 559587 560712 561963 562050 561209 560693 561073 561995 563193 564855 567274 570870 576192
58614E76192O886P077N811M393L706L177K087Q02R6L0J86K32j42j141k287k701
$$ 576192 583078 590155 595966 600359 604065 607242 609329 610131 610227 610257 610443 610675 610533 609392 607105 604404
58598F04404k340k169k683l078k361o18J289K677L326L398L451M047N208O620
$$ 604404 602064 599895 597212 594134 591773 591155 592444 595121 598447 601845 605296 609343 614551 621171
58584F21171Q215R819J0632J0121R255R506J0666J1153J0555J0258J1057J1924
$$ 621171 629386 639205 649837 659958 669213 678719 689385 700538 711093 721351 732408 744332
58572G44332J1953J1914J2712J3769J4213J4607J6012J8149J9821K0660K1204
$$ 744332 756285 768199 780911 794680 808893 823500 839512 857661 877482 898142 919346
58561I19346K1612K1432K0445J8867J6854J4445J1776Q840N464J912r75k829m332
$$ 919346 940958 962390 982835 1001702 1018556 1033001 1044777 1053617 1059081 1060993 1060018 1057189 1052857
58548A052857o167q055r453j0533j1720j2825j3444j3755j4217j4914j5768j6812
$$ 1052857 1046690 1038635 1029182 1018649 1006929 994104 980660 966905 952688 937774 922006 905194
58536I05194j7644j7323j5658j3952j3487j3766j3245j1408r100p105n499m291
$$ 905194 887550 870227 854569 840617 827130 813364 800119 788711 779611 772506 767007 762716
58524G62716l682l598l614l460l158k703k179j916k072k260k101j872k060k542
$$ 762716 759034 755436 751822 748362 745204 742501 740322 738406 736334 734074 731973 730101 728041 725499
58510G25499k875l048l320l511l214k621k350k506k533k119j637j489j484j102
$$ 725499 722624 719576 716256 712745 709531 706910 704560 702054 699521 697402 695765 694276 692792 691690
58496F91690j62R13J486J290P14M34P86J692L011M636O202P260P877Q575R557
$$ 691690 691528 692441 693927 695217 695931 696365 697151 698843 701854 706490 712692 719952 727829 736404 745961
58481G45961J0433J0918J1189J1410J1406J1057J0438R394P598N278L165J430
$$ 745961 756394 767312 778501 789911 801317 812374 822812 832206 839804 845082 848247 849677
58469H49677n19k870m806n621n575n081l966k288j106j256j859j129J469M750
$$ 849677 849158 846288 841482 835861 830286 825205 821239 818951 817845 816589 814730 813601 815070 819820
58455H19820P354Q880R481R178P967O181M426L108K052O30j533l944n631o122
$$ 819820 827174 836054 845535 854713 862680 868861 873287 876395 878447 879077 877544 873600 867969 861847
58441H61847n766n129m560m279m263l985k885j214K16J182K190L434M473N067
$$ 861847 856081 850952 846392 842113 837850 833865 830980 829766 829982 831164 833354 836788 841261 846328
58427H46328N506N880N908N701N806O174O024M992L566K113N42r46j947k930m825
$$ 846328 851834 857714 863622 869323 875129 881303 887327 892319 895885 897998 898540 897594 895647 892717 887892
58412H87892p159q172p463o876p795r081q956p534o066m792l255j809j214j221
$$ 887892 880733 872561 865098 858222 850427 841346 832390 824856 818790 813998 810743 808934 807720 806499
58398H06499r51l13K36Q45J973L249L874L882M002M414M602M246L613L150L240
$$ 806499 805548 805235 805471 806316 808289 811538 815412 819294 823296 827710 832312 836558 840171 843321 846561
58383H46561L947M665M576L878L737M565N279M925L993L420L351L682M772O548
$$ 846561 850508 855173 859749 863627 867364 871929 877208 882133 886126 889546 892897 896579 901351 907899
58369I07899P997Q543Q976J0026J1071J1279J0984J0853J0780J0702J1224J2278
$$ 907899 915896 924439 933415 943441 954512 965791 976775 987628 998408 1009110 1020334 1032612
58357A032612J2453J1079R570R145Q692O754M326L415L895M033L491L450M261
$$ 1032612 1045065 1056144 1065714 1074859 1083551 1090305 1094631 1098046 1101941 1105974 1109465 1112915 1117176
58344A117176N095N704O594P689Q553R627J1437J3101J3462J3198J3816J5008
$$ 1117176 1122271 1127975 1134569 1142258 1150811 1160438 1171875 1184976 1198438 1211636 1225452 1240460
58332A240460J5117J3986J3072J2841J2232J0893R802R361Q744P575O576O137
$$ 1240460 1255577 1269563 1282635 1295476 1307708 1318601 1328403 1337764 1346508 1354083 1360659 1366796
58320A366796N786N373N374N743N905O040O998Q743J0124J0435J0144J0044J0690
$$ 1366796 1372582 1377955 1383329 1389072 1394977 1401017 1408015 1416758 1426882 1437317 1447461 1457505 1468195
58307A468195J2388J4626J5922J5518J4758J5446J7337J8736J9035J9021J9171
$$ 1468195 1480583 1495209 1511131 1526649 1541407 1556853 1574190 1592926 1611961 1630982 1650153
58296A650153J9341J9819K0969K2175K2681K3054K4223K5701K6413K6638K7238
$$ 1650153 1669494 1689313 1710282 1732457 1755138 1778192 1802415 1828116 1854529 1881167 1908405
58285A908405K7719K7157K6454K7335K9544L1258L2052L3147L4929L6446L7395
$$ 1908405 1936124 1963281 1989735 2017070 2046614 2077872 2109924 2143071 2178000 2214446 2251841
58274B251841L8502L9971M1344M2788M4821M7176M9562N2719N6931O0541O2151
$$ 2251841 2290343 2330314 2371658 2414446 2459267 2506443 2556005 2608724 2665655 2726196 2788347
58263B788347O3177O5737O9124P1159P1943P3206P4890P5680P6182P8149Q1051
$$ 2788347 2851524 2917261 2986385 3057544 3129487 3202693 3277583 3353263 3429445 3507594 3588645
58252C588645Q2851Q3829Q6181R0149R3982R7492J02261J08465J14876J21669
$$ 3588645 3671496 3755325 3841506 3931655 4025637 4123129 4225390 4333855 4448731 4570400
58242D570400J29859J38478J45837J53001J62280J73017J82837J92255K03726
$$ 4570400 4700259 4838737 4984574 5137575 5299855 5472872 5655709 5847964 6051690
58233F051690K16931K29700K42975K59732K79487K99058L18540L41176L67616
$$ 6051690 6268621 6498321 6741296 7001028 7280515 7579573 7898113 8239289 8606905
58224H606905L95790M26289M62057N02976N46691N94577O50537P14313P82973
$$ 8606905 9002695 9428984 9891041 10394017 10940708 11535285 12185822 12900135 13683108
58215A3683108Q58779R48170J053100J171618J307156J468754J661870J888409
$$ 13683108 14541887 15490057 16543157 17714775 19021931 20490685 22152555 24040964
58207B4040964K156914K483500K882422L366033L954104M670901N531570O543151
$$ 24040964 26197878 28681378 31563800 34929833 38883937 43554838 49086408 55629559
58199E5629559P718281R072168J0604795J2302810J4158772J6167814J8306336
$$ 55629559 63347840 72420008 83024803 95327613 109486385 125654199 143960535
58192A43960535K0538518K2825351K5044024K6842102K7627678K6824105K4212848
$$ 143960535 164499053 187324404 212368428 239210530 266838208 293662313 317875161
58185C17875161K0047170J4847874R095190L060220l162577r491210j5665103
$$ 317875161 337922331 352770205 361865395 364925615 361763038 352271828 336606725
58178C36606725k1166404k5366291k7826603k8510138k7731402k5940877k3553112
$$ 336606725 315440321 290074030 262247427 233737289 206005887 180065010 156511898
58171A56511898k0897082j8218941j5680604j3369520j1327983r572257q092155
$$ 156511898 135614816 117395875 101715271 88345751 77017768 67445511 59353356
58164E9353356o856476n831202m987391m293854l716629l230293k820929k476331
$$ 59353356 52496880 46665678 41678287 37384433 33667804 30437511 27616582 25140251
58156B5140251k182186j929040j713567j530552j371151j230379j108596j003951
$$ 25140251 22958065 21029025 19315458 17784906 16413755 15183376 14074780 13070829
58148A3070829r10423q24661p48031o80443o18669n61961n13011m71845m34623
$$ 13070829 12160406 11335745 10587714 9907271 9288602 8726641 8213630 7741785 7307162
58139G307162l99795l69725l44922l22255l00241k80793k64352k48393k32061
$$ 7307162 6907367 6537642 6192720 5870465 5570224 5289431 5025079 4776686 4544625
58130D544625k17327k04194j89792j73708j59415j48791j39708j30560j22697
$$ 4544625 4327298 4123104 3933312 3759604 3600189 3451398 3311690 3181130 3058433
58121C058433j16644j10277j02660r5833r0973q6448q1276p6839p3576o9603o4334
$$ 3058433 2941789 2831512 2728852 2633019 2542046 2455598 2374322 2297483 2223907 2154304 2089970
58110B089970n9973n7619n5254n1406m7628m5481m4036m2198m0661l9812l8384
$$ 2089970 2029997 1972378 1917124 1865718 1818090 1772609 1728573 1686375 1645714 1605902 1567518
58099A567518l5901l3932l3413l3133l2233l1647l1691l0923k8930k7539k7661
$$ 1567518 1531617 1497685 1464272 1431139 1398906 1367259 1335568 1304645 1275715 1248176 1220515
58088A220515k7464k5481k3058k1932k1613k0969k0319k0096j9453j7952j6829
$$ 1220515 1193051 1167570 1144512 1122580 1100967 1079998 1059679 1039583 1020130 1002178 985349
58077I85349j6964j7315j6955j6803j7650j8282j7284j5240j3492j2194j1111
$$ 985349 968385 951070 934115 917312 899662 881380 864096 848856 835364 823170 812059
58066H12059j0866j1736j2545j2286j1648j1519j1242r899q184p442p766q314
$$ 812059 801193 789457 776912 764626 752978 741459 730217 720318 712134 704692 696926 688612
58054F88612q722r013q922q423q138q335q342p658o763o194n842n709o180p042
$$ 688612 679890 670877 661955 653532 645394 637059 628717 621059 614296 608102 602260 596551 590371 583329
58040E83329p423p276p488q063p799o485n656o255p206p354p186p465p733p503
$$ 583329 575906 568630 561142 553079 545280 538795 533139 526884 519678 512324 505138 497673 489940 482437
58026D82437p408p902q118p439o815p087p316o325m740l883l626l051k380k533
$$ 482437 475029 467127 459009 451570 444755 437668 430352 424027 419287 415404 411778 408727 406347 403814
58012D03814l288l476k727j718r08k15K89L58P5l13p65j085p86J01P09M64j53
$$ 403814 400526 397050 394323 392605 391697 391482 391771 392129 392204 391891 391126 390041 389255 389356 390065 390529 390376
57995C90376m80n77o59n68m13p84j662k090j656j271j648k102j857j441j655k151
$$ 390376 389896 389319 388660 388092 387679 386895 385233 383143 381487 380216 378568 376466 374609 373168 371513 369362
57979C69362k144j804j811k179k519k815l041k775k017j515j442q28P18J849J344
$$ 369362 367218 365414 363603 361424 358905 356090 353049 350274 348257 346742 345300 344472 345190 347039 348383
57964C48383M3m96k84l23n90l28J67j51j236j960j871j599j568j612j743k081
$$ 348383 348426 347930 347646 347323 346733 346405 346572 346421 345185 343225 341354 339755 338187 336575 334832 332751
57948C32751k123j239J46J017J293J722K406K751K902L898O005P999Q590P788
$$ 332751 330628 329389 329535 330552 331845 333567 335973 338724 341626 345524 351529 359528 368118 375906
57934C75906O503N496N024M895M512L341J513k96j701k902m222n716p186q284
$$ 375906 382409 387905 392929 397824 402336 405677 407190 406894 405193 402291 398069 392353 385167 376883
57920C76883q596q018o895n693m661m006l937m231m240l722l154k836k248q32
$$ 376883 368287 360269 353374 347681 343020 339014 335077 330846 326606 322884 319730 316894 314646 313814
57906C13814J038K512L225L316K957K442K249K419K358J793J341J489J670J168
$$ 313814 314852 317364 320589 323905 326862 329304 331553 333972 336330 338123 339464 340953 342623 343791
57892C43791L79K58R34J795K455K814K471J184l22r13m27K04J04r15k556m186
$$ 343791 344170 344428 345362 347157 349612 352426 354897 356081 355759 354846 354419 354623 354727 353812 351256 347070
57876C47070n009m791m201l936l860l595l346l337l004j738q5Q25Q00N57N46P79
$$ 347070 342061 337270 333069 329133 325273 321678 318332 314995 311991 310253 310168 310993 311793 312350 312896 313675
57860C13675J511K906M175M250L448L286M457N938O404N684M475L373K553J884
$$ 313675 315186 318092 322267 326517 329965 333251 337708 343646 350050 355734 360209 363582 366135 368019
57846C68019J055Kq18r24n12k49m77j093j903k622k808k478k418l126l856l570
$$ 368019 369074 369076 368258 367334 366822 366573 366096 365003 363100 360478 357670 355192 352774 349648 345792 342222
57830C42222k485j678j447j230r68j246k003k330j871j299j056p10l6K93k88j324
$$ 342222 339737 338059 336612 335382 334414 333168 331165 328835 326964 325665 324609 323899 323863 324156 323868 322544
57814C22544k099k696l612m787n684o050o160o399o880p348p366o806o095n668
$$ 322544 320445 317749 314137 309350 303666 297616 291456 285057 278177 270829 263463 256657 250562 244894
57800B44894n297m478l337k558k339k123j523p96k05N08J561K545K877K637K551
$$ 244894 239597 235119 231782 229224 226885 224762 223239 222443 222238 222746 224307 226852 229729 232366 234917
57785B34917L235M611N976O653O652O586O862P166P057O638O275N885N124M071
$$ 234917 238152 242763 248739 255392 262044 268630 275492 282658 289715 296353 302628 308513 313637 317708
57771C17708L168K552J991J394Q12R9q61j679j883j747k023k818l437l391k989
$$ 317708 320876 323428 325419 326813 327625 327724 326863 325184 323301 321554 319531 316713 313276 309885 306896
57756C06896k758k758k680k202j275l10J9m34r25p41j66K1k78n79p70j144j543
$$ 306896 304138 301380 298700 296498 295223 294913 294932 294498 293573 292832 292666 292687 292409 291830 291060 289916 288373
57739B88373j416p32q9J72K19J96R4J14M38P06N65M19P98J219Q64J28J62R22J199
$$ 288373 286957 286225 286136 286308 286527 286723 286817 286931 287369 288075 288640 289059 289857 291076 291940 292068 292230 293152 294351
57720B94351P23O05J265J545P24j67k4N44L19p01j775k739l597l668k525j247
$$ 294351 295074 295679 296944 298489 299213 299046 299022 299566 299885 299184 297409 294670 291073 287405 284880 283633
57704B83633j266k308k850k437k132k601l092k800k126k005k595l236l356l007
$$ 283633 282367 280059 277209 274772 272640 270039 266947 264147 262021 260016 257421 254185 250829 247822
57690B47822k624k494k398j831p61J45L73M82J559L705N727O575O700P575J0044
$$ 247822 245198 242704 240306 238475 237714 237859 238232 238714 240273 243978 249705 256280 262980 270555 280599
57675B80599J3542J6971J9956K2943K6236K9378L1618L2586L2151K9930K5551
$$ 280599 294141 311112 331068 354011 380247 409625 441243 473829 505980 535910 561461
57664E61461J9360J2358N251k059r913j8026k5368l0721l3473l4026l3313l1698
$$ 561461 580821 593179 598430 596371 586458 568432 543064 512343 478870 444844 411531 379833
57652C79833k8710k4221j9452j5996j4037j2385j0241q065o551n674n034m419
$$ 379833 351123 326902 307450 291454 277417 265032 254791 246726 240175 234501 229467 225048
57640B25048l693k789k084k101k613k708k019j134n22MM52K66o39j404j470j464
$$ 225048 221355 218566 216482 214381 211768 209060 207041 205907 205385 205389 205841 206107 205468 204064 202594 201130
57624B01130k029k600k326j535j222j467j534j187r65j138j344j281j004o00r9
$$ 201130 199101 196501 194175 192640 191418 189951 188417 187230 186265 185127 183783 182502 181498 180898 180799
57609A80799K46K31J60M70R71J002K66r15k041k676k474j546o34l74n12m07j26
$$ 180799 181045 181276 181436 181906 182877 183879 184145 183230 181189 178513 176039 174493 173859 173485 172973 172566 172440
57592A72440l63j384k691l708m165l874k799j450o38o15q82r09o92m88m49n79
$$ 172440 172077 170693 168002 164294 160129 156255 153456 152006 151368 150753 149871 148962 148270 147782 147333 146754
57576A46754p51q13q59j283k117k601j959n66L56J57o33j200j313j126p41k89
$$ 146754 146003 145190 144331 143048 140931 138330 136371 135805 136161 136318 135685 134485 133172 132046 131305 131016
57560A31016n6j59l17k21Q2L32M63O75J117J602J670J107M24M97J508K476K373
$$ 131016 130960 130801 130484 130263 130345 130677 131140 131815 132932 134534 136204 137311 137735 138232 139740 142216 144589
57543A44589J424Q11J092J541J204R0r38j165o33K1J27n10j485k179k307k030
$$ 144589 146013 146824 147916 149457 150661 150751 149813 148648 148015 148036 148163 147653 146168 143989 141682 139652
57527A39652j636j250q13k38M74J141J497J477J292J167J128J171J385J691J723
$$ 139652 138016 136766 135953 135715 136189 137330 138827 140304 141596 142763 143891 145062 146447 148138 149861
57512A49861J286P46P26J398K293K743K320J096l32j217j344j198j298j558j607
$$ 149861 151147 151893 152619 154017 156310 159053 161373 162469 162137 160920 159576 158378 157080 155522 153915
57497A53915j428j371j658k192k742l044k904k446k055j891j727j512j627k153
$$ 153915 152487 151116 149458 147266 144524 141480 138576 136130 134075 132184 130457 128945 127318 125165
57483A25165k361j565k18N71N36N23J188K055K173J256r6j109j504j514j345q65
$$ 125165 122804 121239 121021 121592 122128 122651 123839 125894 128067 129323 129227 128118 126614 125100 123755 122890
57467A22890QP46O00k81q24m46P4k15r66j100m21J81Q8l73n83k97L72J051J237
$$ 122890 122898 123644 124244 123963 123139 122693 122767 122552 121586 120486 120065 120246 120334 119961 119378 119081 119453 120504 121741
57448A21741Q88P45J359J995J440j66j311j134m42l34p36r32p71o32o14m51p5
$$ 121741 122629 123374 124733 126728 128168 128002 126691 125557 125115 124781 124045 123113 122342 121710 121096 120645 120570
57431A20570K64L41J63p9r9K49P37R61Q17N55L38J34k5o2j36m52p94p50m43l64
$$ 120570 120834 121175 121338 121259 121160 121409 122146 123107 123924 124479 124817 124951 124926 124864 124728 124276 123482 122732 122289 121925
57411A21925m30R5J439K762L150K701K194K035J924J335P2j414k217j870j006
$$ 121925 121495 121590 123029 125791 128941 131642 133836 135871 137795 139130 139202 137788 135571 133701 132695
57396A32695n71m86J67J486K337K011J357J528K298K566K019J430J472K074K805
$$ 132695 132124 131638 131805 133291 135628 137639 138996 140524 142822 145388 147407 148837 150309 152383 155188
57381A55188L315L370K933K224J380L32o75r15p9R92J174M13m08p69r09j017q38
$$ 155188 158503 161873 164806 167030 168410 168742 168067 167152 167073 168065 169239 169652 169244 168475 167566 166549 165711
57364A65711k09N81J188J521J531J198P79O58Q24R33R70J297J931K243J746P86
$$ 165711 165502 166083 167271 168792 170323 171521 172300 172958 173782 174715 175685 176982 178913 181156 182902 183688
57348A83688J45K07P69J382J610J134Mj223j856j613p83J32Q38J381J941K473
$$ 183688 183833 184040 184809 186191 187801 188935 188939 187716 185860 184247 183464 183596 184434 185815 187756 190229
57332A90229K609K071J199P83J189J870J945J189K29k51j61J54M83Q72J356J806
$$ 190229 192838 194909 196108 196891 198080 199950 201895 203084 203313 203062 202901 203055 203538 204410 205766 207572
57316B07572K115K324K463K438K188J845J605J522J566J753K097K499K838L073
$$ 207572 209687 212011 214474 216912 219100 220945 222550 224072 225638 227391 229488 231987 234825 237898
57302B37898L140K932K603K669L458M525N000M594L882L547L661L854L921L985
$$ 237898 241038 243970 246573 249242 252700 257225 262225 266819 270701 274248 277909 281763 285684 289669
57288B89669M222M637N095N521N993O605P158P198O577N747N283N229N273N421
$$ 289669 293891 298528 303623 309144 315137 321742 328900 336098 342675 348422 353705 358934 364207 369628
57274C69628N900O527O715O323N965O197O803P160O989O533O255O551P434Q337
$$ 369628 375528 382055 388770 395093 401058 407255 414058 421218 428207 434740 440995 447546 454980 463317
57260D63317Q573Q138P728P764P938P940Q143R024J0276J1085J1161J1079J1592
$$ 463317 471890 480028 487756 495520 503458 511398 519541 528565 538841 549926 561087 572166 583758
57247E83758J2940J4768J6410J7295J7286J6729J6065J5596J5554J6064J6879
$$ 583758 596698 611466 627876 645171 662457 679186 695251 710847 726401 742465 759344
57236G59344J7448J7555J7626J8154J9077J9927K0402K0482K0230J9805J9433
$$ 759344 776792 794347 811973 830127 849204 869131 889533 910015 930245 950050 969483
57225I69483J9169J8877J8632J8785J9361J9789J9627J9267J9441K0252K1177
$$ 969483 988652 1007529 1026161 1044946 1064307 1084096 1103723 1122990 1142431 1162683 1183860
57214A183860K1897K2582K3483K4583K5727K6744K7483K7973K8508K9280L0052
$$ 1183860 1205757 1228339 1251822 1276405 1302132 1328876 1356359 1384332 1412840 1442120 1472172
57203A472172L0479L0532L0367K9932K9160K8352K7956K8051K8415K8993K9874
$$ 1472172 1502651 1533183 1563550 1593482 1622642 1650994 1678950 1707001 1735416 1764409 1794283
57192A794283L0915L1801L2474L3084L3542L3584L3296L3158L3403L3691L3593
$$ 1794283 1825198 1856999 1889473 1922557 1956099 1989683 2022979 2056137 2089540 2123231 2156824
57181B156824L3231L3229L4134L5921L7986L9676M0813M1574M1886M1386M0221
$$ 2156824 2190055 2223284 2257418 2293339 2331325 2371001 2411814 2453388 2495274 2536660 2576881
57170B576881L9420L9895M1297M2437M2790M2937M3499M4235M4494M4164M3744
$$ 2576881 2616301 2656196 2697493 2739930 2782720 2825657 2869156 2913391 2957885 3002049 3045793
57159C045793M3666M3768M3481M2427M0866L9447L8402L7144L4886L1668K8525
$$ 3045793 3089459 3133227 3176708 3219135 3260001 3299448 3337850 3374994 3409880 3441548 3470073
57148C470073K6598K6191K6685K7267K7617K7925K8278K8268K7470K6130K4962
$$ 3470073 3496671 3522862 3549547 3576814 3604431 3632356 3660634 3688902 3716372 3742502 3767464
57137C767464K4252K3630K2781K1832K0834J9517J7896J6483J5425J4027J1850
$$ 3767464 3791716 3815346 3838127 3859959 3880793 3900310 3918206 3934689 3950114 3964141 3975991
57126C975991R786R187J0210J1818J3292J4920J7190K0103K3455K7247L1563L6415
$$ 3975991 3985777 3994964 4005174 4016992 4030284 4045204 4062394 4082497 4105952 4133199 4164762 4201177
57114D201177M1775M7600N3923O1282P0895Q3949J00907J21771J46832J76607
$$ 4201177 4242952 4290552 4344475 4405757 4476652 4560601 4661508 4783279 4930111 5106718
57104E106718K11338K51134K96251L46464M00070M54154N06054N54908O02774
$$ 5106718 5318056 5569190 5865441 6211905 6611975 7066129 7572183 8127091 8729865
57095H729865O55120P19403Q01300R01128J013482J129684J240163J335524J406911
$$ 8729865 9384985 10104388 10905688 11806816 12820298 13949982 15190145 16525669 17932580
57086A7932580J446327J448082J412904J351989J283307J217786J146946J046643
$$ 17932580 19378907 20826989 22239893 23591882 24875189 26092975 27239921 28286564
57078B8286564Q95594O90985M47992J87729p4064l31689n87631q44864j097178
$$ 28286564 29182158 29873143 30321135 30508864 30434800 30103111 29515480 28670616 27573438
57069B7573438j326439j511352j639617j711496j733806j713601j657200j571623
$$ 27573438 26246999 24735647 23096030 21384534 19650728 17937127 16279927 14708304
57061A4708304j464474j343114j214787j086668r64732q52737p52388o63894n86266
$$ 14708304 13243830 11900716 10685929 9599261 8634529 7781792 7029404 6365510 5779244
57052E779244n17829m57151m03453l56386l15809k81567k52954k28561k07171
$$ 5779244 5261415 4804264 4400811 4044425 3728616 3447049 3194095 2965534 2758363
57043B758363j88518j72484j58015j43791j29691j16578j04724r3560q2896p3206
$$ 2758363 2569845 2397361 2239346 2095555 1965864 1849286 1744562 1651002 1568106 1494900
57033A494900o4422n5660m6421l7163k8444k0573j4500j1830j3080j6868k1572
$$ 1494900 1430478 1374818 1328397 1291234 1262790 1242217 1227717 1215887 1202807 1185939 1164367
57022A164367k7149l4371m2953n1341n8036o2305o3901o2953o0198n6579n2538
$$ 1164367 1137218 1102847 1059894 1008553 950517 888212 824311 761358 701160 644581 592043
57011E92043m7971m2845l7503l2464k8184k4824k2058j9360j6701j4558j2972
$$ 592043 544072 501227 463724 431260 403076 378252 356194 336834 320133 305575 292603
57000B92603j1190q754o458n365n244m846l602k133r77J77J634K913L514L924
$$ 292603 281413 272659 266201 260836 255592 250746 247144 245011 244034 244211 245845 248758 252272 256196
56986B56196N063O946Q549Q960Q128O415M051J231j617m069o020p522q502q865
$$ 256196 261259 268205 276754 285714 293842 300257 304308 305539 303922 299853 293833 286311 277809 268944
56972B68944q770q455p851o698n010l096j104J123L558N731P200Q029Q597R137
$$ 268944 260174 251719 243868 237170 232160 229064 227960 229083 232641 238372 245572 253601 262198 271335
56958B71335R659J0045R901Q631O096L011K21k344n369q869j1779j3092j2886
$$ 271335 280994 291039 300940 309571 315667 318678 318899 316555 311186 302317 290538 277446 264560
56945B64560j1891j0510q684o458m118j806N91L115N621Q138J0966J4100J6733
$$ 264560 252669 242159 233475 227017 222899 221093 221684 224799 230420 238558 249524 263624 280357
56932B80357J7686J6588J4290J1885R468O248J812l247q076j2363j6041j8691
$$ 280357 298043 314631 328921 340806 350274 356522 358334 355087 347011 334648 318607 299916
56920B99916j9886j9854j9254j8309j6787j4686j2326r830p206n009m101m341
$$ 299916 280030 260176 240922 222613 205826 191140 178814 168984 161778 156769 152668 148327
56908A48327m369l259j731j000r56m10J073K600L336L589M145N182O360P537Q801
$$ 148327 143958 140699 138968 137968 137012 136602 137675 140275 143611 147200 151345 156527 162887 170424 179225
56893A79225J0019J0888J1473J2247J3497J4924J5926J6035J5051J3046J0449
$$ 179225 189244 200132 211605 223852 237349 252273 268199 284234 299285 312331 322780
56882C22780P877N549L026j83l746o656q235q673q387p298n103j985J498N198
$$ 322780 330657 336206 339232 339049 335303 328647 320412 311739 303352 296054 290951 288966 290464 295662
56868B95662R491J4472J9476K3722K7212L0543L3881L6340L6656L4324K9982K4602
$$ 295662 305153 319625 339101 362823 390035 420578 454459 490799 527455 561779 591761 616363
56856F16363J8592J1859M579k645r370j5533k0725k3742k3600k0677j6291j1163
$$ 616363 634955 646814 651393 648748 639378 623845 603120 579378 555778 535101 518810 507647
56844E07647n021K332J0379J8530K6679L4738M2265M8912N4634N8840N9982N6842
$$ 507647 502626 504958 515337 533867 560546 595284 637549 686461 741095 799935 859917 916759
56832I16759M9924M0887L0724J9274O334p618k1808l5321m6584n3596n5423n3085
$$ 916759 966683 1007570 1038294 1057568 1063902 1056284 1034476 999155 952571 898975 843552 790467
56820G90467m8443m2523l5320k6875j7817q864l28P827J5699K3325L0426L6172
$$ 790467 742024 699501 664181 637306 619489 610625 610297 618124 633823 657148 687574 723746
56808G23746L9427L9376L5870K9264K0251R816j077j1963k2810l3175m1735m7059
$$ 723746 763173 802549 838419 867683 887934 897750 896673 884710 861900 828725 786990 739931
56796G39931m8805m7835m5145m1073l5596k9080k2331j6016j0268m790P67O474
$$ 739931 691126 643291 598146 557073 521477 492397 470066 454050 443782 438992 439759 446233
56784D46233J1930J6309J8798J8999J7022J3283Q449L329j588o559j2247j8660
$$ 446233 458163 474472 493270 512269 529291 542574 551023 554352 552764 546205 533958 515298
56772E15298k4669k8916l1060l1841l1932l1122k8859k5325k1556j8537j6337
$$ 515298 490629 461713 430653 398812 366880 335758 306899 281574 260018 241481 225144
56761B25144j4307j1959r517p655o786o678o670o226n323m377l765l489l275k984
$$ 225144 210837 198878 189361 181706 174920 168242 161572 155346 150023 145646 141881 138392 135117 132133
56747A32133k783k822k872k489j588o84l63n92p68n01j61m10j337k265k449j770
$$ 132133 129350 126528 123656 121167 119579 118895 118532 117940 117172 116671 116510 116100 114763 112498 110049 108279
56731A08279o58L82R94R94M68j12k38J12N12O82P89J127J717K376K960L336L297
$$ 108279 107621 108003 108997 109991 110459 110347 110109 110221 110733 111415 112204 113331 115048 117424 120384 123720 127017
56714A27017K728J780P66n9n18m84k2N47Q88R32Q14O61N16L83J85j42m00j95N15
$$ 127017 129745 131525 132291 132232 131714 131230 131208 131755 132643 133575 134389 135050 135566 135949 136134 135992 135592 135397 135912
56695A35912J168J216Q38O47Q02P60P4r74j614j321k66P92J084N61K4K57J104
$$ 135912 137080 138296 139134 139781 140583 141343 141417 140443 138829 137508 137242 138034 139118 139679 139703 139960 141064
56678A41064J730J731J464J224P39j65r37r32l65o7l62p83q93q35q91r17o27r4
$$ 141064 142794 144525 145989 147213 147952 147787 146850 145918 145553 145486 145124 144341 143448 142613 141722 140805 140178 140084
56660A40084L36N07N06M33M08P13J520K415K624J854P02kjM45J112J872K396K269
$$ 140084 140420 140927 141433 141866 142274 142987 144507 146922 149546 151400 152102 152100 152099 152544 153656 155528 157924 160193
56642A60193J477M61l77q82r63o31l34o39j453j950j675j221j354j844j773q04
$$ 160193 161670 162131 161754 160872 159909 159278 158944 158305 156852 154902 153227 152006 150652 148808 147035 146231
56626A46231M79J399J820J826J347L48q71j826k248k279k319k566k671k079q40
$$ 146231 146710 148109 149929 151755 153102 153450 152579 150753 148505 146226 143907 141341 138670 136591 135751
56611A35751K12L82o3l38j12M13J057J640J657P98k14j75R97J957J649O13O9K73
$$ 135751 135963 136345 136282 135944 135832 136245 137302 138942 140599 141397 141183 141008 142005 143962 145611 146224 146293 146566
56593A46566M63J37l43m02M6O86J205J433J242N80l78j152j243n91L56J163J794
$$ 146566 147029 147166 146823 146421 146467 147153 148358 149791 151033 151613 151235 150083 148840 148249 148605 149768 151562
56576A51562K311K427J895J176J173K121L206L526L129K849L403M834O636Q235
$$ 151562 153873 156300 158195 159371 160544 162665 165871 169397 172526 175375 178778 183612 190248 198483
56562A98483R367J0079J0343R985R191Q691Q898R127Q388O812N448M661L725K196
$$ 198483 207850 217929 228272 238257 247448 256139 265037 274164 282552 289364 294812 299473 303198 305394
56548C05394P52J20Q4J02J49K15k53j564k963l556l647m223n404o363o646o656
$$ 305394 306146 306266 306350 306452 306601 306816 306563 304999 302036 298480 294833 290610 285206 278843 272197 265541
56532B65541o733o648o242n832n780n983o058n614m479k988k012k069k538k301
$$ 265541 258808 252160 245918 240086 234306 228323 222265 216651 212172 209184 207172 205103 202565 200264
56518B00264j218k59j43n54r50j302j675j706j156m43j10k5K12M59K59k22k40
$$ 200264 199046 198787 198644 198090 197140 195838 194163 192457 191301 190858 190748 190723 190935 191394 191653 191431 191191
56501A91191M32J123J223R56Q00O25J3q02j060n52O9K45J87K11J5p37j558j650
$$ 191191 191623 192746 193969 194925 195725 196350 196363 195561 194501 193949 194018 194263 194450 194661 194676 193939 192381 190731
56483A90731j125q93j285j589j176l94Q8J97K65L10J06k85m75k21L66R43J168
$$ 190731 189606 188713 187428 185839 184663 184269 184357 184554 184819 185129 185235 184950 184475 184254 184620 185563 186731
56466A86731J012Q84J132J414J064J73l39M4P43J038J011R92P33m5p93p33q3K09
$$ 186731 187743 188627 189759 191173 192237 192410 192071 192115 192858 193896 194907 195899 196632 196587 195794 195061 194978 195187
56448A95187j17k94K92J267J837J673J083O23O22Q28N90l31j279j382n81L82Q30
$$ 195187 195070 194776 195068 196335 198172 199845 200928 201551 202173 203001 203591 203260 201981 200599 200018 200400 201230
56431B01230O31jo74q61l10O11J253J313R22L51qK56J029J556J361R57J033J354
$$ 201230 201861 201860 201186 200325 200015 200626 201879 203192 204114 204465 204457 204713 205742 207298 208659 209616 210649 212003
56413B12003J148L94j94k82k38k90k17L1Q6k52p14r96r83o02Q3O05N46J57K8K45
$$ 212003 213151 213545 213351 213069 212831 212541 212324 212355 212441 212189 211475 210479 209496 208894 208977 209582 210128 210285 210313 210558
56393B10558M79P11J124J444J233Q28J017J828K480K641K687K650K051J062O41
$$ 210558 211037 211748 212872 214316 215549 216377 217394 219222 221702 224343 227030 229680 231731 232793 233434
56378B33434J013J120L05n41l52M87R11Q88J163J732J719Q05k36o17m59l20m09
$$ 233434 234447 235567 235872 235331 234979 235466 236377 237265 238428 240160 241879 242684 242448 241831 241372 241052 240643
56361B40643n16m75l05n8L18Q43J308J391J074Q07J012J572K033K175K083J810
$$ 240643 240127 239652 239347 239289 239607 240450 241758 243149 244223 245030 246042 247614 249647 251822 253905 255715
56345B55715J460J374J726J986J496N46K52J159K523L230K916K050J360J386K158
$$ 255715 257175 258549 260275 262261 263757 264303 264555 265714 268237 271467 274383 276433 277793 279179 281337
56330B81337L111L654L747L628L227K448J835K065K846L159K628J814J086K51
$$ 281337 284448 288102 291849 295477 298704 301152 302987 305052 307898 311057 313685 315499 316585 316836
56316C16836n65p69l43j3JL58J307K134K400K648L252L663L558L631M285M630
$$ 316836 316271 315502 315159 315146 315147 315505 316812 318946 321346 323994 327246 330909 334467 338098 342383 347013
56300C47013L909K996L233M419N259N263M988M810M695M881N581O178N899N171
$$ 347013 350922 353918 357151 361570 366829 372092 377080 381890 386585 391466 397047 403225 409124 414295
56286D14295N183O134P039P340P583Q306R217R849J0267J0719J1214J1783J2680
$$ 414295 419478 425612 432651 439991 447574 455880 465097 474946 485213 495932 507146 518929 531609
56273E31609J4068J5792J7596J9276K0633K1652K2706K4231K6241K8505L1104
$$ 531609 545677 561469 579065 598341 618974 640626 663332 687563 713804 742309 773413
56262G73413L4331L8201M2490M7175N2440N8340O4893P2299Q0572Q9086R7066
$$ 773413 807744 845945 888435 935610 988050 1046390 1111283 1183582 1264154 1353240 1450306
56251A450306J04431J11698J19022J25831J31393J35356J37658J38246J36889
$$ 1450306 1554737 1666435 1785457 1911288 2042681 2178037 2315695 2453941 2590830
56242B590830J33062J26124J15891J02897Q7874P1189N2941L3327J2651q698k9903
$$ 2590830 2723892 2850016 2965907 3068804 3156678 3227867 3280808 3314135 3326786 3318088 3288185
56231C288185m9756o7466q3104r6842j08173j16387j21477j24093j24819j24039
$$ 3288185 3238429 3170963 3087859 2991017 2882844 2766457 2644980 2520887 2396068 2272029
56221B272029j22141j19259j15134j09715j03688r7790r1942q5639p8997p2778
$$ 2272029 2149888 2030629 1915495 1805780 1702092 1604302 1512360 1426721 1347724 1274946
56211A274946o7404o2566n7751n2707m7525m2636l8543l5286l2332k9311k6433
$$ 1274946 1207542 1144976 1087225 1034518 986993 944357 905814 870528 838196 808885 782452
56200G82452k3960k1719j9569j7753j6261j4489j2164j0062q988q563p878o898
$$ 782452 758492 736773 717204 699451 683190 668701 656537 646475 637487 628924 621046 614148
56188F14148o285o138n890n303m693m234l717l032k198j177j39L12j16p68q20
$$ 614148 607863 601725 595835 590532 585839 581605 577888 574856 572658 571481 571342 571654 571538 570770 569950
56173E69950l28J60O46J458K412L088L693M664N672O008N830O053O978Q018Q761
$$ 569950 569622 569782 570428 571886 574298 577386 581079 585743 591415 597423 603253 609306 616284 624302 633063
56158F33063R483J0506J1801J3306J5015J6789J8652K1067K4339K8015L1596L5508
$$ 633063 642546 653052 664853 678159 693174 709963 728615 749682 774021 802036 833632 869140
56146H69140M0541M6591N2734N8371O3419O7654P0809P3140P4997P5933P5089
$$ 869140 909681 956272 1009006 1067377 1130796 1198450 1269259 1342399 1417396 1493329 1568418
56135A568418P2335O8276O3359N7723N1652M5323L8435L0961K3851J8029J3076
$$ 1568418 1640753 1709029 1772388 1830111 1881763 1927086 1965521 1996482 2020333 2038362 2051438
56124B051438P885K191l654r970j7432k5739l3819m1232m8203n4527n9742o4132
$$ 2051438 2059323 2061514 2057860 2047890 2030458 2004719 1970900 1929668 1881465 1826938 1767196 1703064
56112A703064o8241p1474p2539p1133o7996o3447n7268n0023m3070l7170l2145
$$ 1703064 1634823 1563349 1490810 1419677 1351681 1288234 1230966 1180943 1137873 1100703 1068558
56101A068558k7802k3998k0051j5458j0990p802n693l706k011j452j538q39P07
$$ 1068558 1040756 1016758 996707 981249 970259 962457 956764 953058 951047 949595 948057 947218 947925
56088I47925J790K131K928M648O322P326Q068Q602Q424P987Q594J0266J1533J1732
$$ 947925 949715 951846 954774 959422 965744 973070 981138 989740 998164 1006151 1014745 1025011 1036544 1048276
56074A048276J1731J1992J1926J1632J2229J3746J4649J4303J4031J4847J5944
$$ 1048276 1060007 1071999 1083925 1095557 1107786 1121532 1136181 1150484 1164515 1179362 1195306
56063A195306J6344J6365J6474J6347J5970J6106J6858J7234J6873J6629J6881
$$ 1195306 1211650 1228015 1244489 1260836 1276806 1292912 1309770 1327004 1343877 1360506 1377387
56052A377387J6935J6736J7273J8622J9499J9514J9868K1055K1932K2052K2708
$$ 1377387 1394322 1411058 1428331 1446953 1466452 1485966 1505834 1526889 1548821 1570873 1593581
56041A593581K4561K6318K7051K7793K9497L1352L2533L3714L5462L6938L7615
$$ 1593581 1618142 1644460 1671511 1699304 1728801 1760153 1792686 1826400 1861862 1898800 1936415
56030A936415L8533M0486M2628M4134M5580M7399M8831M9634N1039N3766N6829
$$ 1936415 1974948 2015434 2058062 2102196 2147776 2195175 2244006 2293640 2344679 2398445 2455274
56019B455274N9488O2377O5640O8071O9338P0913P3565P6178P8255Q1145Q5356
$$ 2455274 2514762 2577139 2642779 2710850 2780188 2851101 2924666 3000844 3079099 3160244 3245600
56008C245600Q9300R2231R5858J01369J07468J13094J19347J26916J34345J40814
$$ 3245600 3334900 3427131 3522989 3624358 3731826 3844920 3964267 4091183 4225528 4366342
55998D366342J47857J56383J64833J72380J80918J91788K03548K15216K28483
$$ 4366342 4514199 4670582 4835415 5007795 5188713 5380501 5584049 5799265 6027748
55989F027748K44374K61152K78089K97732L21760L48151L75368M05586M40783
$$ 6027748 6272122 6533274 6811363 7109095 7430855 7779006 8154374 8559960 9000743
55980I000743M79507N20788N67260O21042O80741P46068Q21083R09272J010313
$$ 9000743 9480250 10001038 10568298 11189340 11870081 12616149 13437232 14346504 15356817
55971A5356817J125604J261977J425900J619980J850069K129975K474485K894573
$$ 15356817 16482421 17744398 19170298 20790278 22640347 24770322 27244807 30139380
55963C0139380L404647M026076M776360N662334O689999P870490R207986J0693088
$$ 30139380 33544027 37570103 42346463 48008797 54698796 62569286 71777272 82470360
55955H2470360J2316786J4076072J5955600J7923599J9951207K1974362K3757081
$$ 82470360 94787146 108863218 124818818 142742417 162693624 184667986 208425067
55948B08425067K4801357K4501168K2492666J8890469J4184359Q911036L397726
$$ 208425067 233226424 257727592 280220258 299110727 313295086 322206122 325603848
55941C25603848k257806q020259j3703258j8855734k2861573k5228309k5852306
$$ 325603848 323346042 315325783 301622525 282766791 259905218 234676909 208824603
55934B08824603k5037517k3277270k1018399j8573339j6147487j3873897j1824908
$$ 208824603 183787086 160509816 139491417 120918078 104770591 90896694 79071786
55927G9071786j0028161q487899p192141o112796n216012m473960l862454l354385
$$ 79071786 69043625 60555726 53363585 47250789 42034777 37560817 33698363 30343978
55919C0343978k924680k558247k246514j979888j749216j550226j380287j233736
$$ 30343978 27419298 24861051 22614537 20634649 18885433 17335207 15954920 14721184
55911A4721184j105107r93258q97612q13845p37757o69781o11174n59262n10827
$$ 14721184 13616077 12622819 11725207 10911362 10173605 9503824 8892650 8333388 7822561
55902G822561m66863m29460l96900l66137l37367l12014k88826k66082k45123
$$ 7822561 7355698 6926238 6529338 6163201 5825834 5513820 5224994 4958912 4713789
55893D713789k27767k12414j96611j81225j68266j56800j44875j33558j25044
$$ 4713789 4486022 4273608 4076997 3895772 3727506 3570706 3425831 3292273 3167229
55884C167229j18427j11189j03620r7982r4382r1027q7677q5503q4165q2021p8766
$$ 3167229 3048802 2937613 2833993 2736011 2641629 2550602 2462925 2377422 2293257 2211236 2132470
55873B132470p5234p1259o6299o1393n8017n5646n2690m9154m6133m3653m1148
$$ 2132470 2057236 1985977 1919678 1858285 1800268 1744622 1691932 1642778 1596645 1552992 1511844
55862A511844l9155l8287l7389l5053l2182l0769l0831l0751l0025k9438k9084
$$ 1511844 1472689 1434402 1397013 1361960 1329778 1299009 1268178 1237427 1207402 1177964 1148880
55851A148880k8385k7621k7506k7590k6919k5716k4723k3562k1541j9448j8610
$$ 1148880 1120495 1092874 1065368 1037778 1010859 985143 960420 936858 915317 895869 877259
55840H77259j8748j8579j7919j7374j6633j5035j3319j2740j2833j1985j0024
$$ 877259 858511 839932 822013 804639 788006 772971 759652 746912 734079 722094 712070
55829G12070q367p788p805q055q671r340r557r665j0209j0588r794q234p313p467
$$ 712070 703703 695915 688110 680055 671384 662044 652487 642822 632613 622025 612231 603997 596684 589217
55815E89217p918q082p829o822n013l426k931k697j340Q32K369L016L712M618
$$ 589217 581299 573217 565388 558566 553553 550127 547196 544499 543159 543991 546360 549376 553088 557706
55801E57706M990M910N250N843N429L687J648n4j830l748n060n605o325p868r684
$$ 557706 562696 567606 572856 578699 584128 587815 589463 589409 587579 583831 578771 573166 566841 558973 549289
55786E49289j0914j1237j0666r441q268p715p343o319m799l619k784j436N89K431
$$ 549289 538375 527138 516472 507031 498763 491048 483705 477386 472587 468968 466184 464748 465337 467768
55772D67768L490L928L761K650P61j178l059n541q798j1934j3950j4605j4187
$$ 467768 471258 475186 478947 481597 482358 481180 478121 472580 463782 451848 437898 423293 409106
55759D09106j3178j2182j1514j0804r630q259p166o253n387n110n710o170n441
$$ 409106 395928 383746 372232 361428 351798 343539 336373 330120 324733 319623 313913 307743 302302
55746C02302m270m163m853m589k972j575j433j691j382q91q70j123j408k104l183
$$ 302302 298032 293869 289016 284427 281455 279880 278447 276756 275374 274483 273613 272490 271082 268978 265795
55731B65795l660k981k075k078k812l369l471l404l199k744k223j803j339q64
$$ 265795 262135 259154 257079 255001 252189 248820 245349 241945 238746 236002 233779 231976 230637 229773
55717B29773q09j150r42N57K660L882L566K395J438J172J248R73Q8q64j258j359
$$ 229773 228964 227814 226872 227429 230089 233971 237537 239932 241370 242542 243790 244763 244851 243987 242729 241370
55701B41370j991l199m028l921l516l571l793l460k721k474l077l804l694k566
$$ 241370 239379 236180 232152 228231 224715 221144 217351 213891 211170 208696 205619 201815 198121 195555
55687A95555j104j04L13O94J427K134K238J970K197L208M191M211L255K001R30
$$ 195555 194451 194347 194660 195354 196781 198915 201153 203123 205320 208528 212719 216930 220185 222186 223116
55672B23116M3p02j100r55m61j47l18o42n55m3L98O07R53J511J779J712K170L526
$$ 223116 223159 222457 221357 220402 219941 219794 219476 218834 218279 218236 218634 219241 220194 221705 223484 225196 227366 230892
55654B30892M602M046K301R58N07N1q71j624j910k413l503m457m624m472m726
$$ 230892 235494 239540 241841 242799 243306 243357 242486 240862 238952 236539 233036 228579 223955 219483 214757
55639B14757n250n470n350n298n497n787n861n335m069k672k046k196k154j404
$$ 214757 209507 204037 198687 193389 187892 182105 176244 170909 166840 164168 162122 159926 157772 156368
55625A56368o32n75q74p81l79l57q59j384j576j566j566j623j693j647j366j036
$$ 156368 155736 155161 154287 153506 153127 152770 151911 150527 148951 147385 145819 144196 142503 140856 139490 138454
55609A38454j183k027l053l512l180k343j326l63K42K24l57j120j679j842j653
$$ 138454 137271 135244 132191 128679 125499 123156 121830 121467 121709 121933 121576 120456 118777 116935 115282
55594A15282j287q75m28J7K51J50n2rK82N74P70Q54O24mn38k76P64J848K398K479
$$ 115282 113995 113120 112692 112709 112960 113110 113058 113049 113331 113905 114675 115529 116153 116149 115611 115335 116099 117947 120345 122824
55574A22824K396K317K360K553K636K401K097K061K044J572P94K32k38j209k489
$$ 122824 125220 127537 129897 132450 135086 137487 139584 141645 143689 145261 146055 146287 146049 144840 142351
55559A42351l105k765k362k511k637k090j321j167j608j994k053j914j574j021
$$ 142351 139246 136481 134119 131608 128971 126881 125560 124393 122785 120791 118738 116824 115250 114229
55545A14229n88n15m01K79J269J710J231M14J35O73J483J759J321Q04P99R82N98
$$ 114229 113641 113126 112725 113004 114273 115983 117214 117628 117763 118436 119919 121678 122999 123803 124602 125584 126182
55528A26182l83j254j682j967k120j651o36m9m50j184j512j713k296k837k545
$$ 126182 125799 124545 122863 120896 118776 117125 116489 116440 115990 114806 113294 111581 109285 106448 103903
55513A03903j574p71m53k47%ml46q05j314j958k463k287j358k88K93L66L57N62
$$ 103903 102329 101558 101105 100858 100858 100854 100508 99703 98389 96431 93968 91681 90323 90035 90328 90694 91051 91613
55495I1613P19K77q61j976k266j837j392j050k95P60J051R4j073j172l13M84P79
$$ 91613 92332 92609 91748 89772 87506 85669 84277 83227 82932 83692 84743 84837 83764 82592 82279 82763 83542
55478H3542Q97J071J181J094O35l75j483j547j60J411J701R85O21R01Q56J14m47
$$ 83542 84439 85510 86691 87785 88420 88045 86562 85015 84855 86266 87967 88952 89573 90474 91330 91444 90997
55461I0997k46M8l04r00q67j44N07M51k43r55j055n38j37n04j270j506j018n23
$$ 90997 90751 90799 90495 89595 88728 88584 89091 89542 89299 88344 87289 86751 86614 86110 84840 83334 82316 81793
55443H1793m74m42j8M47M37J17j9J06K14K45L56M57K92l3n7L89Q36P51K75O7L76
$$ 81793 81319 80877 80859 81306 81743 81860 81841 81947 82161 82406 82762 83219 83511 83478 83421 83810 84646 85397 85672 85739 86115
55422H6115O24K84j59K73J526K334J876R48P50J156J109M37Q4M84P86K03p26r61
$$ 86115 86739 87023 86864 87137 88663 90997 92873 93821 94571 95727 96836 97273 97357 97841 98627 98830 98104 97143
55404I7143n02l54j139k321k944k671j949j333r05l75L20P65N52j20o06n67k37
$$ 97143 96641 96287 95148 92827 89883 87212 85263 83930 83025 82650 82970 83735 84287 84167 83561 82994 82757
55387H2757j1Kp0r4K4K93M94L19k45p40o29J50J098J574J314N44l47j192j976
$$ 82757 82746 82748 82678 82584 82608 82901 83395 83714 83469 82729 82100 82250 83348 84922 86236 86780 86433 85241 83265
55368H3265k497k428j749q56n3O93J317J407P73p3m55l71l04m10m16k37n2J77
$$ 83265 80768 78340 76591 75735 75682 76375 77692 79099 79872 79799 79344 78973 78669 78259 77843 77606 77554 77731
55350G7731P13J407J681J356J021J172J447J126J70o61p93m99m35p42q97m61K85
$$ 77731 78444 79851 81532 82888 83909 85081 86528 87654 87824 87163 86370 85871 85436 84694 83797 83336 83621
55333H3621P56Q26P95P00K54m05n52J11Q34P23j04q20r99q22m80j29j62p36j133
$$ 83621 84377 85203 85998 86698 86952 86547 85995 86106 86940 87663 87559 86739 85740 84918 84438 84309 84147 83411 82278
55314H2278n26O68J140N67J04N74J160P21m42j063p51k77j98k06k3m8o33j269
$$ 82278 81752 82420 83560 84127 84231 84805 85965 86686 86244 85181 84430 84153 83955 83749 83726 83678 83045 81776
55296H1776j156l23L54K64k67n27k85J74O14J032J342J288Q28K82l6j27o6J89
$$ 81776 80620 80297 80651 80915 80648 80121 79836 80010 80624 81656 82998 84286 85114 85396 85360 85233 85167 85356
55278H5356N33N41k0p00p60j5R72J485J239M72k72n83n52n82p49o91l49k64o89
$$ 85356 85889 86430 86410 85710 84950 84935 85907 87392 88631 89103 88831 88248 87696 87114 86365 85674 85325 85061 84372
55259H4372r13j72J065J612J155M94J95p5n99r78q27m74l86m88n19o12r77j334
$$ 84372 83459 83287 84352 85964 87119 87613 87808 87733 87134 86156 85329 84855 84469 83981 83462 82850 81873 80539
55241H0539j210o50j55jK2K87R46J781K320K218J667J207J059R37O04K13j42p32
$$ 80539 79329 78679 78524 78523 78545 78832 79778 81559 83879 86097 87764 88971 90030 90967 91571 91784 91642 90910
55223I0910j679k408k176j051O0L63p3n46m51J83P50O51o6p09o94j49L46M96N03
$$ 90910 89231 86823 84647 83596 83656 84019 83946 83400 82949 83132 83882 84533 84467 83758 83064 82915 83261 83757 84260
55204H4260P06J142J558J697J527J206Q31L68j62n38n99n19n40m99l2P39J106
$$ 84260 84966 86108 87666 89363 90890 92096 92927 93295 93133 92595 91996 91477 90937 90438 90406 91145 92251
55187I2251O01l66r27o52J10O70O17J05l78n76o83r23j070p17Q7Q49J231J218
$$ 92251 92852 92486 91559 90907 91017 91687 92304 92409 92031 91455 90772 89849 88779 88062 88149 88998 90229 91447
55169I1447Q15N6o07n79N8N33M37K23L38N47M97M18O00O73J26p03r38l76K48K72
$$ 91447 92262 92318 91711 91132 91190 91723 92160 92383 92721 93268 93765 94183 94783 95456 95582 94879 93941 93565 93813 94085
55149I4085k36q34j246j312q96p7P82J334J459J182O48K08K22N99P82L08o86j582
$$ 94085 93849 93015 91769 90457 89561 89484 90266 91600 93059 94241 94889 95097 95319 95918 96700 97008 96322 94740
55131I4740j852j433o90k7N09J105J674J675P90m11r12m83ql25j092j226l61O66
$$ 94740 92888 91455 90765 90738 91247 92352 94026 95701 96491 96080 95168 94685 94677 94352 93260 92034 91673 92339
55113I2339R07N24M69J171J974J991J141M3p90j234j228o49L56J255J575J260
$$ 92339 93246 93770 94239 95410 97384 99375 100516 100559 99769 98535 97307 96658 97014 98269 99844 101104
55097A01104N78r0l34Q7R09J483J453J093Q03N42N5n67r41r33q16q13p74m02L30
$$ 101104 101682 101592 101258 101345 102254 103737 105190 106283 107086 107628 107683 107116 106175 105242 104426 103613 102839 102437 102767
55078A02767J075J407J190P11M13M31N04L23j76q85j629k076j801p65M23J015
$$ 102767 103842 105249 106439 107150 107563 107994 108498 108821 108645 107760 106131 104055 102254 101489 101912 102927
55062A02927R42Q18J074J399J138J74q33j065m23L52M61q1n36m17j31l86j155
$$ 102927 103869 104687 105761 107160 108298 108472 107639 106574 106151 106503 106964 106883 106347 105930 105799 105413 104258
55045A04258j634j315o94n68r21r43k02P16R58M84k2j28k0P5L14P71J013N73l42
$$ 104258 102624 101309 100615 100047 99126 98183 97981 98697 99655 100139 100117 99989 99969 100044 100358 101129 102142 102715 102373
55026A02373j037j127q42n98n19n02l41J44R83J886K399K230J439L68n02p91n13
$$ 102373 101336 100209 99367 98769 98250 97748 97407 97551 98534 100420 102819 105049 106488 106856 106354 105563 105050
55009A05050n4K12K04m5m87q36o16K23J040J224R17O19M25J62j15k94n81r88q47
$$ 105050 104996 105208 105412 105367 104880 104044 103428 103651 104691 105915 106832 107451 107876 108038 107923 107629 107048 106060 105213
54990A05213L08J609J712O98j8K72P58P01N55Q74J198Q96K97K5r5n10q92o38o4
$$ 105213 105521 107130 108842 109540 109522 109794 110552 111253 111808 112682 113880 114776 115073 115098 115003 114493 113601 112963 112899
54971A12899n5o55j006o02J83Q87J434J675J254L02l76j91M93Q67O47J51l76j061
$$ 112899 112844 112189 111183 110581 110764 111651 113085 114760 116014 116316 115940 115749 116242 117109 117756 117907 117531 116470
54953A16470j899k300j591j5J175J034L0n98l88K9Q3q0k27m61p04n24M8K83p7
$$ 116470 114571 112271 110680 110665 111840 112874 112904 112306 111918 111947 112030 111950 111723 111262 110558 110034 110082 110365 110288
54934A10288j40Q70K278K809K312J729J634J795K090K780L771M370M146L466K996
$$ 110288 110148 111018 113296 116105 118417 120146 121780 123575 125665 128445 132216 136586 140732 144198 147194
54919A47194L043L460L767L357K030L38r30j610k105k637l039l206l192k940k396
$$ 147194 150237 153697 157464 160821 162851 163189 162259 160649 158544 155907 152868 149662 146470 143530 141134
54904A41134j915j961k402k537j987j085l78j05k20n22p42q16r72j323j543j315
$$ 141134 139219 137258 134856 132319 130332 129247 128869 128764 128544 128022 127280 126464 125492 124169 122626 121311
54888A21311q37l69L88J792L325L933L369K496K231K694L459M006L891L138K410
$$ 121311 120474 120105 120493 122285 125610 129543 132912 135408 137639 140333 143792 147798 151689 154827 157237
54873A57237K212K015R44p45j792j692j331j541k025k234k415l039l760l796l065
$$ 157237 159449 161464 162408 161663 159871 158179 156848 155307 153282 151048 148633 145594 141834 138038 134973
54858A34973k289k105k477k908k885k249j336o75m98p04j198j793j933j210j94
$$ 134973 132684 130579 128102 125194 122309 120060 118724 118049 117551 116847 115649 113856 111923 110713 110519
54843A10519L5o16r92l40N63N47l32j024r20l05L00O34O45M40K58J58q3n11p48
$$ 110519 110554 109938 108946 108606 109169 109716 109384 108360 107440 107135 107435 108069 108714 109154 109412 109570 109487 108976 108228
54824A08228n26j69r6j85k6M32R12J249J436J378R84L44m04j144j480r10L85J352
$$ 108228 107702 107533 107437 107252 107226 107658 108570 109819 111255 112633 113617 113961 113557 112413 110933 110023 110408 111760
54806A11760J234N50L26P10R76O99K04j3K48R06J480J147m04k151k552j242O07
$$ 111760 112994 113544 113870 114580 115556 116255 116459 116446 116694 117600 119080 120227 119823 117672 115120 113878 114485
54789A14485J698J798J362P64K60J86O48J254J511J335R75O60N81R46J696K344
$$ 114485 116183 117981 119343 120107 120367 120553 121201 122455 123966 125301 126276 126936 127517 128463 130159 132503
54773A32503K428K108J991K371K937L313L589M092M754M990M330K986J632P06
$$ 132503 134931 137039 139030 141401 144338 147651 151240 155332 160086 165076 169406 172392 174024 174730
54759A74730J49k97q50j751l158m759n775n640m611l479k789k501k282j867j206
$$ 174730 174879 174582 173732 171981 168823 164064 158289 152649 148038 144559 141770 139269 136987 135120 133914
54744A33914n25k21m46p86o22J47R30J146Q82O66O96O31K27j10K52J294K292K754
$$ 133914 133389 133168 132722 131936 131314 131461 132391 133537 134419 135085 135781 136412 136639 136529 136781 138075 140367 143121
54726A43121K959L294L490L034K120J521J516J551J164O52N48P64O67j99j625
$$ 143121 146080 149374 152864 155898 158018 159539 161055 162606 163770 164422 164970 165734 166401 166202 164577
54711A64577k890l297k875k499k952l814l889k827j679j475j941k129j762j252
$$ 164577 161687 158390 155515 153016 150064 146250 142361 139534 137855 136380 134439 132310 130548 129296
54697A29296q31m95n29j211k019j964q57L71Q31N68P8m57j050j438j238m43N16
$$ 129296 128465 127970 127441 126230 124211 122247 121390 121761 122592 123160 123238 122781 121731 120293 119055 118612 119128
54680A19128J141J155O08o8k62K62R72J042K89n64o96j05N18O84N38L31m7p34
$$ 119128 120269 121424 122032 121964 121702 121964 122936 123978 124267 123703 123007 122902 123420 124104 124642 124973 124926 124192
54662A24192j430j736j735j732j606r53Q9Q38R82Q69P14K01p03j226o96M39J145
$$ 124192 122762 121026 119291 117559 115953 115000 115089 115927 116909 117778 118492 118693 117990 116764 116068 116507 117652
54645A17652J060O66L80Q9l48o53m40K48Q35P55Q9m32k76J82K10k08m23k24j09
$$ 117652 118712 119378 119758 119847 119499 118846 118406 118654 119489 120244 120333 119901 119625 119807 120017 119809 119386 119162 119053
54626A19053l57n79m99l98l37Q2P05N63n52j231k42J525K217J498N56M3m30r01
$$ 119053 118696 118117 117618 117220 116883 116965 117670 118233 117681 116450 116208 117733 119950 121448 122004 122047 121617 120716
54608A20716o99J87P59M93M9O1K01k9m45o73p58p68m61J49N27L28o9j52J06M98
$$ 120716 120017 120204 120963 121456 121505 121566 121767 121738 121293 120620 119862 119094 118633 118782 119309 119637 119568 119416 119522 120020
54588A20020Q91J015N21m03j038r97n62K6Q56J663J700P86k34n57l37q0J41L55
$$ 120020 120911 121926 122447 122044 121006 120009 119447 119473 120329 121992 123692 124478 124244 123687 123350 123270 123411 123766
54570A23766K65j88n14m45m15o66n67L78J478J698J059L95J10Q3L50J003J644
$$ 123766 124031 123843 123329 122884 122469 121803 121236 121614 123092 124790 125849 126244 126354 126437 126787 127790 129434
54553A29434J802J617J409R07j56j080q82J83Q73O88K56K2l21r01j130o14K25
$$ 129434 131236 132853 134262 135169 135013 133933 133051 133234 134107 134795 135051 135073 134752 133851 132721 132107 132332
54536A32332P64Q14M08k78o35n9R99J218J06j270j689j205o49m07m03o93j255
$$ 132332 133096 133910 134318 134040 133405 133346 134345 135563 135669 134399 132710 131505 130856 130449 130046 129353 128098
54519A28098j575j128j44P51J343J753J800J177J90m19m27l55o33j020j092q70
$$ 128098 126523 125395 125251 126002 127345 129098 130898 132075 132265 131846 131419 131064 130431 129411 128319 127449
54503A27449o72o57p00o32m12j33P1J31J14J54L49O93J061J254J213J160J358
$$ 127449 126777 126120 125420 124788 124376 124243 124314 124445 124559 124713 125062 125755 126816 128070 129283 130443 131801
54486A31801J637J454N93m98j229j486j467j190n50K92R84J420J752J996J930
$$ 131801 133438 134892 135485 134987 133758 132272 130805 129615 129065 129357 130341 131761 133513 135509 137439
54471A37439J473Q63L50k1k54k51Q2O42J145J252Q34J65k17j21N5j11m26m37k42
$$ 137439 138912 139775 140125 140104 139850 139599 139681 140323 141468 142720 143554 143719 143502 143381 143436 143325 142899 142462 142220
54452A42220l49p33p58k40R1l04q54p32k21l61j352k123j675k35J196J920J828
$$ 142220 141871 141138 140380 140140 140231 139927 139073 138341 138120 137759 136407 134284 132609 132374 133570 135490 137318
54435A37318J135K91j41J8K98J57k87m34l5N37Q34P98N59J87j88k45K38J020J555
$$ 137318 138453 138744 138603 138621 138919 139076 138789 138355 138320 138857 139691 140489 141048 141235 141047 140802 141040 142060 143615
54416A43615J514J037N18K79L98O93Q01M79j44n74m24K32R15J136P32j5n39l77
$$ 143615 145129 146166 146684 146963 147361 148054 148855 149334 149190 148616 148192 148424 149339 150475 151207 151192 150653 150276
54398A50276L56R44P27j52q79q51k29M21P56P68N35J94k7kJ21J77K40L85L82K2
$$ 150276 150632 151576 152303 152151 151272 150421 150192 150613 151369 152137 152672 152866 152839 152837 152958 153135 153375 153760 154142 154164
54378A54164l76l00J83M90M68O39J285J936K093J970J979J984J689J409J696K347
$$ 154164 153788 153488 153671 154161 154629 155268 156553 158489 160582 162552 164531 166515 168204 169613 171309 173656
54362A73656K525K018J553J699K029J795J035M58M40N45J22r02j930k353k229
$$ 173656 176181 178199 179752 181451 183480 185275 186310 186768 187208 187753 187875 186973 185043 182690 180461
54347A80461k175k575l091l118k566j903j550j495j465j191n44K53O49L07l76
$$ 180461 178286 175711 172620 169502 166936 165033 163483 161988 160523 159332 158788 159041 159690 159997 159621
54332A59621p34p22q53j210j251p56l71o82j300j392q54l16j90k23n3K87M90L60
$$ 159621 158887 158165 157312 156102 154851 154095 153724 153042 151742 150350 149496 149180 148990 148767 148714 149001 149491 149851
54314A49851k5l65l81j26M3j0L0M03P77O26Pm71m48j48R1K35L83M74L50km00n42
$$ 149851 149826 149461 149080 148954 148997 148987 149017 149420 150197 150823 150830 150359 149911 149763 149854 150089 150472 150946 151296 151294 150894 150352
54292A50352k29L43O53M43J11J73M75M20n2l40j17J85J42J1J84M36L14j8J1M68
$$ 150352 150123 150466 151119 151562 151673 151846 152321 152741 152689 152349 152232 152417 152559 152570 152754 153190 153504 153486 153497 153965
54272A53965Q12P24M85L68K51J7r8P2K16o1o47j045r42m13K74Q66J185J237J177
$$ 153965 154777 155501 155986 156354 156605 156622 156524 156596 156812 156751 156104 155059 154117 153704 153978 154844 156029 157266 158443
54253A58443J045O88J05m10o74q23q84n35K11N19k31j239j061L66J510J350O69
$$ 158443 159488 160176 160281 159871 159197 158374 157490 156955 157166 157685 157454 156215 155154 155520 157030 158380 159049
54236A59049N75P82L27o57j121p78m30n29m75K90J313J696J162J29q26j282j072
$$ 159049 159624 160406 160733 160076 158955 158177 157747 157218 156743 157033 158346 160042 161204 161333 160507 159225 158153
54219A58153m54M3J22r6m17q00j180j388j386j241q88k66K52J83k71l30K63Q39
$$ 158153 157699 157742 157864 157768 157351 156551 155371 153983 152597 151356 150468 150202 150454 150637 150366 150036 150299 151138
54201A51138Q24N11L84L28L5k29q7J44j44p93j019n47L9K13J33K18N27Q66J099
$$ 151138 151962 152473 152857 153185 153220 152991 152904 153048 152904 152111 151092 150545 150584 150797 150930 151148 151675 152541 153640
54182A53640J187J100Q31M25j3k81j98O2j1n89j088q21P3P65P47K46k42m33k21
$$ 153640 154827 155927 156758 157183 157170 156889 156691 156753 156742 156153 155065 154244 154317 155082 155829 156075 155833 155400 155179
54163A55179K91O94O64M29M19N11J85m60n74K04J058J057M32J96P10J323J375
$$ 155179 155470 156164 156828 157257 157676 158187 158372 157912 157338 157542 158600 159657 160089 160285 160995 162318 163693
54146A63693R81O89P17P84N04j89r67j401j345r87n35k1M89P18M85J01J28O73
$$ 163693 164674 165363 166080 166864 167368 167179 166212 164811 163466 162479 161944 161923 162412 163130 163615 163716 163844 164517
54128A64517J185J088M99M5J6K2l21o77l48O50J426J353R06R38J394J451Q53L43
$$ 164517 165702 166790 167289 167334 167350 167372 167051 166374 166026 166676 168102 169455 170361 171299 172693 174144 174997 175340
54110A75340N46J034J015N45M44J138K073K405J934J215Q80J075J472J799K158
$$ 175340 175886 176920 177935 178480 178924 180062 182135 184540 186474 187689 188569 189644 191116 192915 195073
54095A95073K746L335L433K963K482K437K507J978O80q74k145l039l679m101m296
$$ 195073 197819 201154 204587 207550 210032 212469 214976 216954 217634 216760 214615 211576 207897 203796 199500
54080A99500m222l730k675j379n87p25j263j224l20P32J156J087J318K180L062
$$ 199500 195278 191548 188873 187494 186907 186182 184919 183695 183375 184107 185263 186350 187668 189848 192910
54065A92910L201K602J931J594J426J236J256J677K093J915J176N05J81k21j014
$$ 192910 196111 198713 200644 202238 203664 204900 206156 207833 209926 211841 213017 213522 213703 213482 212468
54050B12468j673j413k74Q40J242J170J335K062L042L709L742L346L048L174L502
$$ 212468 210795 209382 209108 209948 211190 212360 213695 215757 218799 222508 226250 229596 232644 235818 239320
54035B39320L635L580L604L666L418K939K814L240L564L185K415J892J538Q34
$$ 239320 242955 246535 250139 253805 257223 260162 262976 266216 269780 272965 275380 277272 278810 279644
54021B79644j03n58l72k37o65j326j700j784j880k170k747l666m606n009m771
$$ 279644 279541 278983 278611 278374 277709 276383 274683 272899 271019 268849 266102 262436 257830 252821 248050
54006B48050m374m044l383k213j196j020j449j781j856j973k098j912j521j406
$$ 248050 243676 239632 236249 234036 232840 231820 230371 228590 226734 224761 222663 220751 219230 217824
53992B17824j657j857j681j268r36r88j621k555k996k486j640j346j447r65L02
$$ 217824 216167 214310 212629 211361 210425 209437 207816 205261 202265 199779 198139 196793 195346 194381 194683
53977A94683J374J456R32N95O39Q68J345K134K781K715K086J729K278L532M696
$$ 194683 196057 197513 198445 199040 199679 200547 201892 204026 206807 209522 211608 213337 215615 219147 223843
53962B23843N052M547L880L967N137O916Q456R065Q479P030N549M664M101L086
$$ 223843 228895 233442 237322 241289 246426 253342 261798 270863 279342 286372 291921 296585 300686 303772
53948C03772J452j94j432k556l768m540m322l429k595j991j322o87n91j046j328
$$ 303772 305224 305030 303598 301042 297274 292734 288412 284983 282388 280397 279075 278388 277797 276751 275423
53933B75423p98M63J910L012L310K557J220M91J208K842M005M114M004M638N628
$$ 275423 274625 275088 276998 280010 283320 285877 287097 287588 288796 291638 295643 299757 303761 308399 314027
53918C14027N706M575L541L939N466O599O380N211M063L507L535L729L474K405
$$ 314027 319733 324308 327849 331788 337254 343853 350233 355444 359507 363014 366549 370278 373752 376157
53904C76157Q78l33r29j326j988k830l463l680l531l300l474m372n621o358o124
$$ 376157 377035 376702 375773 374447 372459 369629 366166 362486 358955 355655 352181 347809 342188 335830 329706
53889C29706n321m683m593m962n372n319m704m178m425n109n197m472l891m059
$$ 329706 324385 319702 315109 310147 304775 299456 294752 290574 286149 281040 275843 271371 267480 263421
53875B63421m236l511k248j478j403j446j463j945k975l845l892l189k265j587
$$ 263421 259185 255674 253426 251948 250545 249099 247636 245691 242716 238871 234979 231790 229525 227938
53861B27938j357j442j455j250j188j603k156k242j855j543j507j370q82l86l36
$$ 227938 226581 225139 223684 222434 221246 219643 217487 215245 213390 211847 210340 208970 208088 207702 207366
53846B07366p35j186j232p30o6P5n12j131j013l77j06m79q11m97K40Q65J279J664
$$ 207366 206631 205445 204213 203483 203417 203492 202980 201849 200836 200459 200353 199874 199063 198566 198806 199671 200950 202614
53828B02614K017K126J858J232M28j72j87L00P41P39N39O99J413K260K553J952
$$ 202614 204631 206757 208615 209847 210275 210103 209916 210216 210957 211696 212235 212934 214347 216607 219160 221112
53812B21112P89j53l38J22P90J467K261L273M395N358N766N416M744M533M844
$$ 221112 221901 221748 221410 221532 222322 223789 226050 229323 233718 239076 244842 250258 255002 259535 264379
53797B64379M762L737K715K970M130M517L407J856J023P89N92N34P96P40l65k038
$$ 264379 269141 272878 275593 278563 282693 287210 290617 292473 293496 294285 294877 295411 296207 296947 296582 294544
53781B94544l059l056k842l102l635m022m375m956n525n538m884l991l269k687
$$ 294544 291485 288429 285587 282485 278850 274828 270453 265497 259972 254434 249550 245559 242290 239603
53767B39603k108j729j854k287k355j821j347j642k384k577j885j011o40o60o75
$$ 239603 237495 235766 233912 231625 229270 227449 226102 224460 222076 219499 217614 216603 215963 215303 214628
53752B14628o72p69p13k12N10R01P42K81j39k95o3M45P86N19k88j046j135m26
$$ 214628 213956 213187 212474 212262 212772 213673 214415 214696 214557 214262 214199 214644 215430 215949 215661 214615 213480 213054
53734B13054N25R10M80j06n9M73O79M15N11J420K267J910N00p46j009m82L61J303
$$ 213054 213579 214489 214969 214863 214804 215277 215956 216371 216882 218302 220569 222479 222979 222233 221224 220742 221103 222406
53716B22406K177K779L090L196K966K245J444J325K024K773K855K475K308K512
$$ 222406 224583 227362 230452 233648 236614 238859 240303 241628 243652 246425 249280 251755 254063 256575
53702B56575K628K369K052K128K527K740K501K113K030K265K469K423K225J944
$$ 256575 259203 261572 263624 265752 268279 271019 273520 275633 277663 279928 282397 284820 287045 288989
53688B88989J513J015P02N54K14l83p20m14J29K13k36p29j052j467k143k826l121
$$ 288989 290502 291517 292219 292773 292987 292604 291884 291470 291599 291812 291576 290847 289795 288328 286185 283359 280238
53671B80238k743j518M02K272L134K680J492L96k25n03p38j030j125o86L0J71
$$ 280238 277495 275977 276379 278651 281785 284465 285957 286353 286128 285625 284887 283857 282732 282046 282076 282247
53655B82247o96j751j818r01j48j86l46J41R95J455J449J515J801J865J400P12
$$ 282247 281551 279800 277982 277081 276933 276747 276401 276542 277537 278992 280441 281956 283757 285622 287022 287734
53639B87734L78O90J439K071K206K093K352L050L442K953K101J941K702L592L946
$$ 287734 288112 288802 290241 292312 294518 296611 298963 302013 305455 308408 310509 312450 315152 318744 322690
53624C22690L946M045M199M077L725L493L448L240K627J867J447J545J967K472
$$ 322690 326636 330681 334880 338957 342682 346175 349623 352863 355490 357357 358804 360349 362316 364788
53610C64788K944L282L273K774J952J256J128J679K526K968K568J717J339J760
$$ 364788 367732 371014 374287 377061 379013 380269 381397 383076 385602 388570 391138 392855 394194 395954
53596C95954K174J604K86n54k92L76N57L20K73L84N8q54j748k069j921j669j417
$$ 395954 398128 399732 400018 399464 399172 399548 400105 400425 400698 401082 401140 400286 398538 396469 394548 392879 391462
53579C91462j078p57o95j000j492j827j751j378j162j409j831j842j279n36N1
$$ 391462 390384 389627 388932 387932 386440 384613 382862 381484 380322 378913 377082 375240 373961 373425 373476
53564C73476N62J060J236Q01J9n79p98q22p14l40K64Q23J203J534J835J885J642
$$ 373476 374038 375098 376334 377135 377154 376575 375777 374955 374241 373901 374165 374988 376191 377725 379560 381445 383087
53547C83087J488J724K063J980J479J156J465K250L102L857M502M868M776M478
$$ 383087 384575 386299 388362 390342 391821 392977 394442 396692 399794 403651 408153 413021 417797 422275
53533D22275M599N485O797P896Q521Q896R306R789J0300J0902J1575J2047J2082
$$ 422275 426874 432359 439156 447052 455573 464469 473775 483564 493864 504766 516341 528388 540470
53520E40470J1906J2102J2969J4270J5669J7187J8913K0494K1302K1192K0768
$$ 540470 552376 564478 577447 591717 607386 624573 643486 663980 685282 706474 727242
53509G27242K0815K1584K2721K3657K3965K3545K2712K1960K1552K1350K1138
$$ 727242 748057 769641 792362 816019 839984 863529 886241 908201 929753 951103 972241
53498I72241K0970K1019K1253K1432K1347K0900K0080J9082J8351J8220J8441
$$ 972241 993211 1014230 1035483 1056915 1078262 1099162 1119242 1138324 1156675 1174895 1193336
53487A193336J8365J7649J6605J5835J5725J6318J7385J8401J8694J7872J6200
$$ 1193336 1211701 1229350 1245955 1261790 1277515 1293833 1311218 1329619 1348313 1366185 1382385
53476A382385J4337J2755J1409R963Q174O101L960J865k65k528m801o868q642
$$ 1382385 1396722 1409477 1420886 1430849 1439023 1445124 1449084 1450949 1450684 1448156 1443355 1436487 1427845
53463A427845j0177j1449j2348j2917j3437j4158j5063j5964j6632j6905j6870
$$ 1427845 1417668 1406219 1393871 1380954 1367517 1353359 1338296 1322332 1305700 1288795 1271925
53452A271925j6982j7673j8702j9238j8842j8031j7527j7264j6651j5567j4485
$$ 1271925 1254943 1237270 1218568 1199330 1180488 1162457 1144930 1127666 1111015 1095448 1080963
53441A080963j3588j2398j0561q450o726n517m412l066j591m13J36K12M49J360
$$ 1080963 1067375 1054977 1044416 1035966 1029240 1023723 1019311 1016245 1014654 1014241 1014377 1014589 1015038 1016398
53427A016398K717L929M996O548Q670J0402J1019J1221J2300J4391J6423J7730
$$ 1016398 1019115 1023044 1028040 1034588 1043258 1053660 1064679 1075900 1088200 1102591 1119014 1136744
53415A136744J8762K0031K1350K2529K4006K6089K8112K9135K9245K9487L0629
$$ 1136744 1155506 1175537 1196887 1219416 1243422 1269511 1297623 1326758 1356003 1385490 1416119
53404A416119L2581L4958L7501L9864M1575M2583M3437M4724M6505M8460N0289
$$ 1416119 1448700 1483658 1521159 1561023 1602598 1645181 1688618 1733342 1779847 1828307 1878596
53393A878596N1784N2799N3425N4043N4816N5226N4455N2376M9892M8053M6915
$$ 1878596 1930380 1983179 2036604 2090647 2145463 2200689 2255144 2307520 2357412 2405465 2452380
53382B452380M5528M3131M0043L7112L4529L1663K8020K3850J9589J5227J0637
$$ 2452380 2497908 2541039 2581082 2618194 2652723 2684386 2712406 2736256 2755845 2771072 2781709
53371B781709O008J440l543r379j5535k1004k5636l0193l4932l8984m1535m2923
$$ 2781709 2787717 2789157 2785614 2776235 2760700 2739696 2714060 2683867 2648935 2609951 2568416 2525493
53359B525493m4042m5256m6437m7565m8599m9132m8796m7809m6508m4730m2303
$$ 2525493 2481451 2436195 2389758 2342193 2293594 2244462 2195666 2147857 2101349 2056619 2014316
53348B014316l9959l8778l8788l8930l8511l7776l6901l5428l3278l1418l0672
$$ 2014316 1974357 1935579 1896791 1857861 1819350 1781574 1744673 1709245 1675967 1644549 1613877
53337A613877l0356k9076k6530k3725k1446j9463j7372j5434j4122j3420j3024
$$ 1613877 1583521 1554445 1527915 1504190 1482744 1463281 1445909 1430475 1416353 1402933 1389909
53326A389909j2895j3188j3807j4428j4791j4730j4050j2847j1793j1630j2184
$$ 1389909 1377014 1363826 1350019 1335591 1320800 1306070 1292020 1279173 1267380 1255750 1243566
53315A243566j2382j1452r800q281o953n126k677n81K50K65Q14K471M483N960
$$ 1243566 1231184 1219732 1209932 1201651 1194698 1189572 1186895 1186314 1186564 1186829 1187643 1190114 1194597 1200557
53301A200557P088Q645J0712J2555J3760J4860J6471J8334J9707K0476K1266K2398
$$ 1200557 1207645 1216290 1227002 1239557 1253317 1268177 1284648 1302982 1322689 1343165 1364431 1386829
53289A386829K3323K3378K2695K1899K1171K0110J8468J6567J4818J3245J1607
$$ 1386829 1410152 1433530 1456225 1478124 1499295 1519405 1537873 1554440 1569258 1582503 1594110
53278A594110R745P535M764J387k176n285p627r346j0806j2366j4285j6497j8528
$$ 1594110 1603855 1611390 1616154 1617541 1615365 1610080 1602453 1593107 1582301 1569935 1555650 1539153 1520625
53265A520625j9957k0995k2231k3756k4957k5402k5527k6021k6800k7165k6936
$$ 1520625 1500668 1479673 1457442 1433686 1408729 1383327 1357800 1331779 1304979 1277814 1250878
53254A250878k6774k7152k7516k6974k5562k4237k3662k3545k3324k3017k2928
$$ 1250878 1224104 1196952 1169436 1142462 1116900 1092663 1069001 1045456 1022132 999115 976187
53243I76187k2848k2112k0549j8988j8499j9227k0083j9673j7548j4654j2484
$$ 976187 953339 931227 910678 891690 873191 853964 833881 814208 796660 782006 769522
53232G69522j1703j1654j1278j0382r685r713j0065r996r428r052r450j0442j1292
$$ 769522 757819 746165 734887 724505 714820 705107 695042 685046 675618 666566 657116 646674 635382
53219F35382j1502j1347j1577j2574j3801j4352j4007j3440j3254j3133j2329
$$ 635382 623880 612533 600956 588382 574581 560229 546222 532782 519528 506395 494066
53208D94066j0820r479r064r338r426q839p934p400p436p558p223o499o002o194
$$ 494066 483246 473767 464703 455365 445939 437100 429166 421766 414330 406772 399549 393050 387048 380854
53194C80854o904p588p857p669p201o737o444o148n461m406l616l657m265m683
$$ 380854 373950 366362 358505 350836 343635 336898 330454 324306 318845 314439 310823 307166 302901 298218
53180B98218m576m201l754l094k232j610j492j490j064k92K09Q7l65o84q22j067
$$ 298218 293642 289441 285687 282593 280361 278751 277259 275769 274705 274413 274622 274709 274344 273660 272838 271771
53164B71771j537j917j800j229p05o14p81p33l90j97n92j486k312k442j662m15
$$ 271771 270234 268317 266517 265288 264583 263969 263188 262455 262065 261868 261276 259790 257478 255036 253374 252959
53148B52959L90J47p92j431j210n05L9L23O22R06P83J69m02l49K37P08O66M58
$$ 252959 253349 253496 252704 251273 250063 249558 249597 249920 250542 251448 252231 252400 251998 251649 251886 252594 253260 253718
53130B53718O86J314J593J027K17K80J436K590K555J393J91k28L5M74Q10Q65L45
$$ 253718 254404 255718 257311 258338 258555 258835 260271 262861 265416 266809 267000 266772 266807 267281 268091 268956 269301
53113B69301q15k034k495k059j451j370j664j652j057l18Lj92o49j094j314j125
$$ 269301 268486 266452 263957 261898 260447 259077 257413 255761 254704 254386 254389 254197 253548 252454 251140 250015
53097B50015n31J38M39K34k08m72l32L1K27J07pJ51K56k19j038j294p38k79o30
$$ 250015 249484 249622 250061 250295 250087 249615 249283 249314 249541 249648 249641 249792 250048 249829 248791 247497 246759 246480 245850
53078B45850j105o54M04P36l0p95o64l3L12L13K14j32q14j216o70N44J480J671
$$ 245850 244745 244091 244495 245231 245201 244406 243742 243709 244021 244334 244548 244416 243602 242386 241716 242260 243740 245411
53060B45411J388R94N77J78j41m57p98q56l00O02J114Q36J62k09NM75O51L35j76
$$ 245411 246799 247793 248370 248548 248407 247950 247152 246296 245996 246598 247712 248548 248710 248501 248506 248981 249632 249967 249791
53041B49791n53q83j316j464p79L79Q09J0j009j082l67K01M24Q15J388J469P33
$$ 249791 249238 248355 247039 245575 244796 245175 245984 245994 244985 243903 243536 243737 244161 244976 246364 247833 248566
53024B48566l65j231j520r58M01J712J984J291O35N50O65P00R12J229J037K60
$$ 248566 248201 246970 245450 244492 244893 246605 248589 249880 250515 251065 251730 252430 253342 254571 255608 255868
53008B55868k46M9N00L45k14o30r17j164r42k03J9j034k251j847Q3J580J460O56
$$ 255868 255622 255671 256171 256516 256302 255672 254755 253591 252649 252446 252465 251431 249180 247333 247416 248996 250456 251112
52990B51112N88J362K159K501K432K036J420Q34M38K74N59J437K311K217J174
$$ 251112 251700 253062 255221 257722 260154 262190 263610 264444 264882 265156 265715 267152 269463 271680 272854
52975B72854L95O58J205R96K48j18M0J89K98P52J247R70L7l78K39Q74M01q92j832
$$ 272854 273249 273907 275112 276108 276356 276238 276278 276467 276765 277517 278764 279734 279771 279393 279632 280506 280907 280015 278183
52956B78183j828j242p00o22j127j848k078j577r66r07j238j456j625k037k279
$$ 278183 276355 275113 274413 273791 272664 270816 268738 267161 266195 265288 264050 262594 260969 258932 256653
52941B56653j584r0J019R74K21l97o11n27j39M32P20N07K13J98M2q10j920k156
$$ 256653 255069 254979 255998 256972 257193 256796 256185 255658 255519 255951 256671 257178 257391 257589 257631 256821 254901 252745
52923B52745j163J40P16N66L97N25N87K68j60k20N5J41k14n57m15p4k07p86r89
$$ 252745 251582 251722 252438 253004 253401 253926 254513 254781 254621 254401 254456 254597 254383 253826 253411 253337 253130 252344 251355
52904B51355l62N77J116J192J060O77J2n40o66o76q86q51o0R84J296R00O96Q80
$$ 251355 250993 251570 252686 253878 254938 255615 255627 255087 254421 253745 252859 252008 251948 252932 254228 255128 255824 256704
52886B56704O68j81p74n40k07n49j060p99J26Q45J070J174J274J161R71J053J244
$$ 256704 257372 257191 256417 255877 255670 255121 254061 253262 253388 254233 255303 256477 257751 258912 259883 260936 262180
52869B62180J081O81O33R97J237J188J280J585J531Q12n7n69r61j644k422k816
$$ 262180 263261 263942 264575 265572 266809 267997 269277 270862 272393 273205 273148 272579 271618 269974 267552 264736
52853B64736k783k662k632k692k820k854k444j588q91q98j434j970k318k417j887
$$ 264736 261953 259291 256659 253967 251147 248293 245849 244261 243370 242472 241038 239068 236750 234333 232446
52838B32446n54P58Q93j41j079j087o14k99J09J017J868J766R28M71P64R61L99
$$ 232446 231892 232650 233543 233402 232323 231236 230622 230323 230432 231449 233317 235083 236011 236482 237246 238207 238606
52821B38606m01o63n47o84r94p72J55J164J746K091K479K658K209J170lq93j301
$$ 238606 238205 237542 236995 236311 235317 234545 234700 235864 237610 239701 242180 244838 247047 248217 248214 247321 246020
52804B46020j209q54p03j007j540j909k018j926j529p26J54N51L14j29l65m03
$$ 246020 244811 243957 243254 242247 240707 238798 236780 234854 233325 232599 232753 233304 233618 233489 233124 232721
52788B32721m63n80n95l85RL88M91K43j12k58j86j36j83j60O2M38R00J305J272
$$ 232721 232258 231678 231083 230698 230707 231095 231586 231829 231717 231459 231273 231137 230954 230794 230856 231294 232194 233499 234771
52769B34771N38m45p45j14N82M42l75j035j162r77n80J60J055J604J673J598J535
$$ 234771 235309 234864 234119 234005 234587 235029 234654 233619 232457 231480 230900 231060 232115 233719 235392 236990 238525
52752B38525J231P23N52R72J442J404J103J094J363J539J671K051K428K201J487
$$ 238525 239756 240479 241031 242003 243445 244849 245952 247046 248409 249948 251619 253670 256098 258299 259786
52737B59786J165J611K094J823J012L20j83q29j451j465q70l20j69p2J59J2r66
$$ 259786 260951 262562 264656 266479 267491 267811 267628 266799 265348 263883 263013 262693 262524 262452 262611 262623 261657
52720B61657k252k794k223j148l64j69l85o63o64l07O9N8k39k63K25P90R12O92
$$ 261657 259405 256611 254388 253240 252876 252707 252322 251659 250995 250688 250757 250815 250576 250313 250538 251328 252240 252932
52702B52932O04P52P93N22J61p5k70m81m40P8P64J009O42J25n5R0K55K72J41j48
$$ 252932 253536 254288 255081 255603 255764 255689 255419 254938 254498 254576 255340 256349 256991 257116 257061 257151 257406 257678 257819 257671
52682B57671n77r39j007q38o75n15j35M30P01L25l88p51n09q4K2j63k08J55P12
$$ 257671 257094 256155 255148 254310 253635 253120 252985 253415 254116 254441 254053 253302 252793 252709 252731 252568 252360 252515 253227
52663B53227J066J100J033J060J110J080J163J647K416K870K572J705P60l1o74
$$ 253227 254293 255393 256426 257486 258596 259676 260839 262486 264902 267772 270344 272049 272809 272778 272104
52648B72104j044r19l72J52L02R2l01p45j101j217j119r56o68K6J131K136K490
$$ 272104 271060 270141 269769 269921 270223 270315 270014 269269 268168 266951 265832 264876 264208 264234 265365 267501 269991
52631B69991K175J546Q55K15k09l42m68r29j541j723j284p24n79p79q58n72p6
$$ 269991 272166 273712 274567 274782 274573 274231 273763 272834 271293 269570 268286 267562 266983 266204 265346 264774 264698
52614B64698L80O73P77P39O34M73J56l70r78j434j585j383q58j34O09J246J731
$$ 264698 265078 265751 266528 267267 267901 268374 268530 268160 267182 265748 264163 262780 261922 261788 262397 263643 265374
52597B65374J949J733J138N66L99O12Q65R25Q09N84K42k30p14r86q00j40O30J017
$$ 265374 267323 269056 270194 270760 271159 271771 272636 273561 274370 274954 275196 274966 274252 273266 272466 272326 272956 273973
52579B73973R26P58P85P18K02m72o67l23n4k51n95o81o50p92r23o46m4L32J51
$$ 273973 274899 275657 276442 277160 277362 276890 276223 275900 275846 275595 275000 274319 273669 272877 271954 271308 271264 271596 271747
52560B71747l97r75j394j543j316q00k65J12L67N15M42J72l4j6J5k07n38n88l22
$$ 271747 271350 270375 268981 267438 266122 265322 265057 265169 265536 266051 266493 266665 266631 266615 266630 266423 265885 265297 264975
52541B64975j46k59k62L44J397K173K230J799J327R14M32p4l79l52j8N63J218
$$ 264975 264829 264570 264308 264652 266049 268222 270452 272251 273578 274492 274924 274850 274471 274119 274101 274664 275882
52524B75882J537J163K82m35l90M32J466J946J448L84j86L63J435J929J653J410
$$ 275882 277419 278582 278864 278429 278039 278471 279937 281883 283331 283715 283529 283892 285327 287256 288909 290319
52508B90319J642J778J282O05M91P32M65n58j687k330k537k584k525k356k199
$$ 290319 291961 293739 295021 295626 296117 296849 297314 296756 295069 292739 290202 287618 285093 282737 280538
52493B80538k075j807j294p04l11k34l59l95q2M87R27J050J085J108P04l13j167
$$ 280538 278463 276656 275362 274658 274347 274113 273754 273359 273277 273764 274691 275741 276826 277934 278638 278325 277158
52476B77158q27O19J992K433K182J847J621J423J237R80N55K02L34Q93J365J556
$$ 277158 276331 276950 278942 281375 283557 285404 287025 288448 289685 290665 291220 291422 291756 292649 294014 295570
52460B95570J629J320kk007l224k803j726j456k029k448k326k027j603p49K31
$$ 295570 297199 298519 298517 296510 293286 290483 288757 287301 285272 282824 280498 278471 276868 276119 276350
52445B76350N49Q6m76p14p99p59l72O1j74r70j283o44J21J91j03n6K52L06M7l11
$$ 276350 276899 276985 276509 275795 274996 274237 273865 273926 273752 272782 271499 270855 270976 271167 271064 271008 271260 271566 271613 271302
52425B71302q16j317j050L09J661J666P24O32K117L915M628M465M533N150N719
$$ 271302 270486 269169 268119 268428 270089 271755 272479 273111 275228 279143 283771 288236 292769 297919 303638
52410C03638N863N836N957O204O405O406N983M975L553K138R52j26j351k858m634
$$ 303638 309501 315337 321294 327498 333903 340309 346292 351267 354820 356958 357910 357784 356433 353575 348941
52395C48941o398p561p525o253m463l095k554k493k255j537o41r0m9j54R8Q91
$$ 348941 342543 334982 327457 321204 316741 313646 311092 308599 306344 304807 304166 304076 304027 303873 303971 304862
52379C04862K030L137L776L635K888K313K636L651M316L910K840K065J970K141
$$ 304862 306892 310029 313805 317440 320328 322641 325277 328928 333244 337154 339994 342059 344029 346170
52365C46170K112J903J762J701J558J271R14N57K54P1Mn8k18l59k05L77J178J840
$$ 346170 348282 350185 351947 353648 355206 356477 357391 357948 358202 358273 358277 358219 358001 357642 357437 357814 358992 360832
52347C60832K204K456K872L446L834L775L495L575M393N735O956P502P399P226
$$ 360832 363036 365492 368364 371810 375644 379419 382914 386489 390882 396617 403573 411075 418474 425700
52333D25700P621Q637R779J0632J1348J2308J3516J4614J5364J5826J6046J6014
$$ 425700 433321 441958 451737 462369 473717 486025 499541 514155 529519 545345 561391 577405
52321E77405J5956J6324J7265J8378J9125J9325J9193J9117J9508K0474K1499
$$ 577405 593361 609685 626950 645328 664453 683778 702971 722088 741596 762070 783569
52310G83569K1766K1036K0028J9660K0103K0739K0814J9988J8512J7046J6052
$$ 783569 805335 826371 846399 866059 886162 906901 927715 947703 966215 983261 999313
52299I99313J5217J3746J1450R064P206N549L494J255m69j598k719m097n356o158
$$ 999313 1014530 1028276 1039726 1048790 1055996 1061545 1065039 1066294 1065825 1064227 1061508 1057411 1052055 1045897
52285A045897o597o746o424n621m737m084l558k892j971p53P03K044K812L107
$$ 1045897 1039300 1032554 1026130 1020509 1015772 1011688 1008130 1005238 1003267 1002514 1003217 1005261 1008073 1011180
52271A011180L640M956O817Q611J0034J1192J2183J2909J3262J3397J3702J4378
$$ 1011180 1014820 1019776 1026593 1035204 1045238 1056430 1068613 1081522 1094784 1108181 1121883 1136261
52259A136261J5021J4955J4205J3680J3947J4266J3552J1976J0635R762Q442O299
$$ 1136261 1151282 1166237 1180442 1194122 1208069 1222335 1235887 1247863 1258498 1268260 1276702 1283001
52247A283001M235K912J581p27l639o015p518q656r668j0391j0939j1595j2148
$$ 1283001 1287236 1290148 1291729 1291002 1287363 1281348 1273830 1265174 1255506 1245115 1234176 1222581 1210433
52234A210433j2171j1917j2017j2368j2253j1630j1396j1974j2470j1742r800
$$ 1210433 1198262 1186345 1174328 1161960 1149707 1138077 1126681 1114707 1102237 1090495 1080695
52223A080695p662o241n739n784n692m857l273j609n41j01K18Q71J918K964L397
$$ 1080695 1073033 1066792 1061053 1055269 1049577 1044720 1041447 1039838 1039297 1039196 1039414 1040285 1042203 1045167 1048564
52208A048564K914K001J603K130L046L608L767M051M738N503N859N696N282M887
$$ 1048564 1051478 1053479 1055082 1057212 1060258 1063866 1067633 1071684 1076422 1081925 1087784 1093480 1098762 1103649
52194A103649M476L870L151K738K831K997K564J385j64j801l476m904n533n333
$$ 1103649 1108125 1111995 1115146 1117884 1120715 1123712 1126276 1127661 1127497 1125696 1122220 1117316 1111783 1106450
52180A106450n098n576o615p511p890p816p296o279n067m181l752l393k775j967
$$ 1106450 1101352 1095776 1089161 1081650 1073760 1065944 1058648 1052369 1047302 1043121 1039369 1035976 1033201 1031234
52166A031234j109j15J095K254K918K906K495K138K031J940J554J012Q29J134
$$ 1031234 1030125 1030010 1031105 1033359 1036277 1039183 1041678 1043816 1045847 1047787 1049341 1050353 1051182 1052316
52152A052316J311P77o3k42M44J162J226R73J033J309J262Q99P70J086J503J827
$$ 1052316 1053627 1054404 1054341 1054099 1054543 1055705 1056931 1057904 1058937 1060246 1061508 1062407 1063177 1064263 1065766 1067593
52136A067593K315L083L784M290N211P261J0210J2945J4615J5428J6331J8029
$$ 1067593 1069908 1072991 1076775 1081065 1086276 1093537 1103747 1116692 1131307 1146735 1163066 1181095
52124A181095K0356K2433K3495K3654K3773K4566K5975K7469K8605K9046K8467
$$ 1181095 1201451 1223884 1247379 1271033 1294806 1319372 1345347 1372816 1401421 1430467 1458934
52113A458934K6906K5108K3906K3312K2633K1478K0102J8717J7077J5019J2840
$$ 1458934 1485840 1510948 1534854 1558166 1580799 1602277 1622379 1641096 1658173 1673192 1686032
52102A686032J0798Q652O187L752J820K27j607l860o205q434j0743j3287j5871
$$ 1686032 1696830 1705482 1711669 1715421 1717241 1717468 1715861 1712001 1705796 1697362 1686619 1673332 1657461
52089A657461j8164j9838k0526j9939j8264j6134j4133j2481j1202j0250r324
$$ 1657461 1639297 1619459 1598933 1578994 1560730 1544596 1530463 1517982 1506780 1496530 1487206
52078A487206p875n637k996o75R55K135L362M895O681Q575J0524J2388J3721J4077
$$ 1487206 1479331 1473694 1470698 1470023 1470978 1473113 1476475 1481370 1488051 1496626 1507150 1519538 1533259 1547336
52064A547336J3682J3475J4135J5219J5708J5262J4465J3780J2893J1464R912
$$ 1547336 1561018 1574493 1588628 1603847 1619555 1634817 1649282 1663062 1675955 1687419 1697331
52053A697331Q854P947O061K756j021m033o127q053j0175j2099j3584j5089j6915
$$ 1697331 1706185 1714132 1720193 1722949 1721928 1717895 1711768 1703715 1693540 1681441 1667857 1652768 1635853
52040A635853j8353j8484j7633j7201j7872j8767j8780j8078j7597j7603j7534
$$ 1635853 1617500 1599016 1581383 1564182 1546310 1527543 1508763 1490685 1473088 1455485 1437951
$$ [...]
##END NTUPLES=NMR SPECTRUM
##END=
