##TITLE=AC1448_MCIAH13257_8011404_WFWI8kt7uq
##JCAMPDX= 6.0         $$ Bruker NMR JCAMP-DX V2.0
##DATA TYPE= NMR SPECTRUM
##DATA CLASS= NTUPLES
##ORIGIN= BRUKER
##OWNER= Administrator
$$ 1.72 TOPSPIN		Version 2.1
$$ 2013-07-05 21:03:35.949 -0700  Administrator@X
$$ Compression mode = diff/dup
##.OBSERVE FREQUENCY= 400.02188249412
##.OBSERVE NUCLEUS= ^1H
##.ACQUISITION MODE= SIMULTANEOUS (DQD)
##.ACQUISITION SCHEME= undefined
##.AVERAGES= 8
##.DIGITISER RES= 22
##SPECTROMETER/DATA SYSTEM= spect
##.PULSE SEQUENCE= zg30
##.SOLVENT NAME= COFFEE_meoh
##.SHIFT REFERENCE= INTERNAL, COFFEE_meoh, 1, 14.98509
##AUDIT TRAIL= $$ (NUMBER, WHEN, WHO, WHERE, PROCESS, VERSION, WHAT)
$$ ##TITLE= Audit trail, TOPSPIN		Version 2.1
$$ ##JCAMPDX= 5.01
$$ ##ORIGIN= Bruker BioSpin GmbH
$$ ##OWNER= Administrator
$$ $$ E:\/data/COFFEE/nmr/AC1448_MCIAH13257_8011404_WFWI8kt7uq/10/pdata/1/auditp.txt
$$ ##AUDIT TRAIL=  $$ (NUMBER, WHEN, WHO, WHERE, PROCESS, VERSION, WHAT)
(   1,<2013-07-05 21:03:28.746 -0700>,<Administrator>,<X>,<go>,<TOPSPIN 2.1>,
      <created by zg
	started at 2013-07-05 21:02:22.668 -0700,
	POWCHK enabled, PULCHK disabled,
       configuration hash MD5:
       C8 4E 4E 5D D3 5C D8 9E 9F 52 82 E0 59 8A DE 15
       data hash MD5: 64K
       76 95 99 7D 37 69 1A 99 7C E5 86 8C F9 9A 4C 74>)
(   2,<2013-07-05 21:03:31.809 -0700>,<Administrator>,<X>,<proc1d>,<TOPSPIN 2.1>,
      <Start of raw data processing
       efp LB = 0 FT_mod = 6 PKNL = 1 PHC0 = 0 PHC1 = 0 SI = 32K 
       data hash MD5: 32K
       76 EF 5C 04 0D B0 42 7B 26 B7 90 5F DF B5 BD A6>)
(   3,<2013-07-05 21:03:32.121 -0700>,<Administrator>,<X>,<proc1d>,<TOPSPIN 2.1>,
      <pk PHC0 = 95.4657 PHC1 = 0 
       data hash MD5: 32K
       6F C5 1D FD 17 CD D1 1D 3E A7 6D 6C D0 85 2A 71>)
(   4,<2013-07-05 21:03:32.293 -0700>,<Administrator>,<X>,<proc1d>,<TOPSPIN 2.1>,
      <abs ABSG = 1 
       data hash MD5: 32K
       6D 38 C0 9A 80 1E 96 EF 09 7E 14 29 F7 D0 05 0B>)
(   5,<2013-07-05 21:03:32.449 -0700>,<Administrator>,<X>,<proc1d>,<TOPSPIN 2.1>,
      <abs ABSG = 2 
       data hash MD5: 32K
       8D C0 94 13 CD 77 2F D5 85 B4 60 4E 9E B1 BC 49>)
(   6,<2013-07-05 21:03:32.684 -0700>,<Administrator>,<X>,<proc1d>,<TOPSPIN 2.1>,
      <abs ABSG = 3 
       data hash MD5: 32K
       9E 3C C5 D6 48 F6 B2 CA 0C 26 EA B3 0B 42 DD 00>)
(   7,<2013-07-05 21:03:32.762 -0700>,<Administrator>,<X>,<proc1d>,<TOPSPIN 2.1>,
      <abs ABSG = 4 
       data hash MD5: 32K
       74 1C 8B 4C 8F 4D 36 7C FB 86 5E 45 2E D0 4B C9>)
(   8,<2013-07-05 21:03:32.903 -0700>,<Administrator>,<X>,<proc1d>,<TOPSPIN 2.1>,
      <abs ABSG = 5 
       data hash MD5: 32K
       9D 86 E1 08 6E B2 1D D9 5A 97 8C B2 94 85 4A C2>)
$$ ##END=
$$ 
$$ $$ hash MD5
$$ $$ 0E CF 6B DF DF 53 D9 9F 05 36 92 C6 EE 45 E2 73
##$RELAX= 
##$RELAX= 
##$RELAX= 
##$RELAX= 
##$RELAX= 
##$RELAX= 
##$RELAX= 
$$ Bruker specific parameters
$$ --------------------------
##$DU= <E:\>
##$EXPNO= 10
##$NAME= <AC1448_MCIAH13257_8011404_WFWI8kt7uq>
$$ [...]
##$TP= (0..7)
150 150 150 150 150 150 150 150
##$TP07= 0
##$TPNAME0= <>
##$TPNAME1= <>
##$TPNAME2= <>
##$TPNAME3= <>
##$TPNAME4= <>
##$TPNAME5= <>
##$TPNAME6= <>
##$TPNAME7= <>
##$TPOAL= (0..7)
0.5 0.5 0.5 0.5 0.5 0.5 0.5 0.5
##$TPOFFS= (0..7)
0 0 0 0 0 0 0 0
##$TUNHIN= 0
##$TUNHOUT= 0
##$TUNXOUT= 0
##$USERA1= <user>
##$USERA2= <user>
##$USERA3= <user>
##$USERA4= <user>
##$USERA5= <user>
##$V9= 5
##$VALIST= <valist>
##$VCLIST= <CCCCCCCCCCCCCCC>
##$VD= 0
##$VDLIST= <DDDDDDDDDDDDDDD>
##$VPLIST= <PPPPPPPPPPPPPPP>
##$VTLIST= <TTTTTTTTTTTTTTT>
##$WBST= 1024
##$WBSW= 4
##$XGAIN= (0..3)
0 0 0 0
##$XL= 0
##$YL= 0
##$YMAX_a= 639382
##$YMIN_a= -542075
##$ZGOPTNS= <>
##$ZL1= 120
##$ZL2= 120
##$ZL3= 120
##$ZL4= 120
##$ABSF1= 14.98509
##$ABSF2= -5.573092
##$ABSG= 5
##$ABSL= 3
##$ALPHA= 0
##$AQORDER= 0
##$ASSFAC= 0
##$ASSFACI= 0
##$ASSFACX= 0
##$ASSWID= 0
##$AUNMP= <proc_prof1d_extract_pilot.lims>
##$AXLEFT= 0
##$AXNAME= <>
##$AXNUC= <1H>
##$AXRIGHT= 0
##$AXTYPE= 0
##$AXUNIT= <>
##$AZFE= 0.1
##$AZFW= 0.1
##$BCFW= 0
##$BC_mod= 0
##$BYTORDP= 0
##$COROFFS= 0
##$CY= 15
##$DATMOD= 1
##$DC= 0
##$DFILT= <>
##$DTYPP= 0
##$F1P= 0
##$F2P= 0
##$FCOR= 0.5
##$FTSIZE= 32768
##$FT_mod= 6
##$GAMMA= 0
##$GB= 0
##$INTBC= 1
##$INTSCL= 1
##$ISEN= 128
##$LB= 0
##$LEV0= 0
##$LPBIN= 0
##$MAXI= 10000
##$MC2= 0
##$MEAN= 0
##$ME_mod= 0
##$MI= 0
##$NCOEF= 0
##$NC_proc= -8
##$NLEV= 6
##$NOISF1= 0
##$NOISF2= 0
##$NSP= 0
##$NTH_PI= 0
##$NZP= 0
##$OFFSET= 14.98509
##$PC= 1
##$PHC0= 95.4657
##$PHC1= 0
##$PH_mod= 1
##$PKNL= yes
##$PPARMOD= 0
##$PPDIAG= 0
##$PPIPTYP= 0
##$PPMPNUM= 2147483647
##$PPRESOL= 1
##$PSCAL= 4
##$PSIGN= 0
##$PYNMP= <proc.py>
##$REVERSE= no
##$SF= 400.02
##$SI= 32768
##$SIGF1= 0
##$SIGF2= 0
##$SINO= 400
##$SIOLD= 32768
##$SPECTYP= <>
##$SREGLST= <1H.CDCl3>
##$SSB= 0
##$STSI= 32768
##$STSR= 0
##$SW_p= 8223.68421052631
##$SYMM= 0
##$S_DEV= 0
##$TDeff= 65536
##$TDoff= 0
##$TI= <>
##$TILT= no
##$TM1= 0
##$TM2= 0
##$TOPLEV= 0
##$USERP1= <user>
##$USERP2= <user>
##$USERP3= <user>
##$USERP4= <user>
##$USERP5= <user>
##$WDW= 1
##$XDIM= 32768
##$YMAX_p= 464894123
##$YMIN_p= -705148
##$CURPLOT= <Network HP LaserJet P1505>
##$CURPRIN= <$Network HP LaserJet P1505>
##$DFORMAT= <normdp>
##$LAYOUT= <+/1D_H.xwp>
##$LFORMAT= <normlp>
##$PFORMAT= <normpl>
##$SURQMSG= 1
$$ End of Bruker specific parameters
$$ ---------------------------------
##NTUPLES= NMR SPECTRUM
##VAR_NAME=  FREQUENCY,     SPECTRUM/REAL,   SPECTRUM/IMAG
##SYMBOL=    X,             R,               I
##VAR_TYPE=  INDEPENDENT,   DEPENDENT,       DEPENDENT
##VAR_FORM=  AFFN,          ASDF,            ASDF
##VAR_DIM=   32768,         32768,           32768
##UNITS=     HZ,            ARBITRARY UNITS, ARBITRARY UNITS
##FACTOR=    0.250966925370066, 1,           1
##FIRST=     8223.43324360094, -202526,      -4245
##LAST=      0,             -180502,         59430
##MIN=       0,             -705148,         0
##MAX=       8223.43324360094, 464894123,    0
$$ Real data points
##PAGE= N=1
##DATA TABLE= (X++(R..R)), XYDATA
$$ [...]
$$ plain form
19549 -328771 -106460 -68249 -250693 -47407 222386 -147859 -216896 -262216 81570 -333776
19538 243351 -81598 44666 -121787 157301 -205320 -206101 -240984 89165 -251573 -102831 -110296
19527 -110296 26864 -7855 -107439 184466 -31705 -458817 -134786 -96860 -6487 19157 -180498
19515 -228300 -343056 -63961 70284 -210679 72255 111918 251811 99740 -34151 222439 119210
19504 119210 257585 -229821 -54298 -23399 -74642 119925 142730 -115771 -123879 -177824 173514
19492 69397 -68407 525867 -88550 -144536 -6911 182802 -160784 -27269 -26379 256125 33500
19480 188730 -83684 177935 183838 -346893 -17438 -64461 154599 946 -301024 -98007 17402
19468 -343644 -32486 152753 -292301 151070 30364 -12898 -89524 63223 228757 -191559
$$ packed form
19549c28771a06460L8211j82444d7407B22386a47859o9037m5320H1570c33776
19538B43351h1598D4666a21787A57301b05320p81l4883H9165b51573a02831p465
19527a10296B6864g855r9584A84466c1705m27112a34786L7926f487A9157a80498
19515b28300j14756f3961G0284b10679G2255L9663J39893I9740c4151B22439j03229
19504A19210J38375b29821e4298b3399n1243A19925K2805a15771q108n3945A73514
19492F9397f8407E25867h8550n5986f911A82802a60784b7269Q90B56125C3500
19480A88730h3684A77935N903c46893a7438m7023A54599I46c01024i8007A7402
19468c43644c2486A52753b92301A51070C0364a2898p6626F3223J65534a91559
$$ plain form
19457 340971 -205269 -74481 10290 -167789 -248570 4505 -468994 -16974 -74788 -5533 -115555
19446 -115555 -103948 -134120 213949 -387984 -200496 -186061 74616 -80742 -66908 -184952 -282044
19435 -282044 -380605 -216209 102556 -245859 -69740 92149 139869 -321957 -46628 20256 -46619
19423 -414859 -84170 -104000 -172450 127560 237070 -51833 61792 -39246 -154252 -35407 -9674
19411 -124270 167988 -113772 -191578 103230 -109694 -57151 -195781 27177 -323074 -185852
19401 -185852 -12778 -28755 57995 36012 -177499 -290891 -193447 41165 198526 -291066 -196946
19390 -196946 227439 -201057 18747 -13347 -154736 -34894 -210155 107797 15007 -42843
19379 -294961 28108 64268 83213 -265713 -65258 169037 -372114 -145230 45925 -71658 99679
$$ packed form
19457C40971b05269g4481A0290a67789q0781D505d68994a6974n7814e533j10022
19446a15555J1607l0172B13949c87984J87488J4435G4616h0742J3834j18044r7092
19435b82044r8561J64396A02556b45859f9740I2149M7720c21957d6628B0256d6619
19423d14859h4170j9830o8450A27560J09510e1833F1792c9246j15006c5407i674
19411a24270A67988a13772p7806A03230a09694N2543j38630B7177c23074J37222
19401a85852a2778j5977E7995k1983a77499j13392R7444D1165J57361b91066R4120
19390a96946B27439b01057A8747a3347j41389c4894j75261A07797A5007d2843
19379b94961B8108L6160J8945b65713f5258A69037c72114a45230D5925g1658I9679
$$ plain form
19367 -183322 -104045 -458971 -154305 247754 -179021 -408629 -288734 -288851 -59970 -230578
19357 -230578 159956 -148086 -274519 -171955 -2998 -109660 234063 -9347 179095 -223631
19346 200286 3167 -152740 -441048 -309120 26867 -49860 -62927 -152638 -90420 147600 -1626
19334 321745 71968 -92031 -180135 -210534 -206174 -171130 -16986 -434197 -283623 -155167 315306
19322 -169838 -219511 5387 3649 -167576 -8604 89309 267977 45436 -68636 -164384 1505 14861
19310 14861 -52231 119959 -81603 -202721 26195 -281149 -64452 234966 168072 -58566 -292533
19299 -292533 -163404 -90064 -42684 10420 -290745 67466 -26422 -66649 -234592 -98720 21523
19287 142476 -178430 -32893 109531 74017 -174167 55840 1689 -93582 2478 -178254 235539
$$ packed form
19367a83322P9277l54926a54305B47754a79021k29608J19895j17e9970j70608
19357b30578A59956a48086j26433J02564b998j06662B34063i347A79095b23631
19346B00286C167a52740k88308J31928B6867d9860j3067q9711O2218A47600a626
19334C21745G1968i2031q8104l0399M360L5044a6986m17211J50574J28456C15306
19322a69838m9673E387j738a67576h604H9309J78668D5436f8636r5748A505J3356
19310A4861e2231A19959h1603j21118B6195b81149f4452B34966o6894e8566k33967
19299b92533J29129P3340d2684A0420b90745F7466b6422m0227j67943i8720B1523
19287A42476a78430c2893A09531l5514a74167E5840A689i3582B478a78254B35539
$$ plain form
19275 -65917 295934 550224 153757 -96849 -270330 -20022 -96336 -27094 -229248 -49012 -206960
19264 -206960 -534921 -23823 -89392 -168861 38036 -58929 81895 -286148 -161788 218132 -83908
19252 -24399 -100430 -389035 219382 -88525 -247643 -5612 -131576 136396 -203081 -214308 12073
19240 103458 -157082 -182511 -238135 79760 -93180 -238703 124508 -240483 120013 195931
19230 195931 268531 -42947 -179078 65462 -271501 -119758 -192613 155383 -202784 -317743
19220 -317743 -226753 -51480 52850 -99552 -63390 110027 -64798 -146943 -48289 -28727 -106986
19209 -106986 -372827 -113575 -178480 -120369 -61576 -87075 435630 -375187 182428 -125663
19198 -177133 -155950 -106934 78212 -342834 -145714 -237151 248500 53414 -91983 -96194 112172
$$ packed form
19275f5917B95934K54290A53757i6849j73481b0022p6314b7094k02154d9012j57948
19264b06960l27961b3823o5569p9469C8036e8929H1895b86148J24360B18132h3908
19252b4399p6031k88605B19382h8525j59118e612j25964A36396b03081j1227A2073
19240A03458a57082k5429n5624G9760i3180j45523A24508b40483A20013P5918
19230A95931P2600d2947j36131F5462b71501a19758p2855A55383b02784j14959
19220c17743R0990e1480E2850i9552L6162A10027f4798q2145d8289J9562p8259
19209a06986k65841a13575o4905N8111N8793k5499D35630c75187A82428a25663
19198a77133K1183M9016G8212c42834a45714r1437B48500E3414i1983m211A12172
$$ plain form
19186 1091 -52598 69026 -94288 -114494 70968 30670 402234 89092 -485228 -312559 -121828
19174 33876 -91886 -171106 20149 27359 -45872 73049 234161 -298257 -237406 143596 -125802
19162 -180704 -15537 -61375 -21025 -354084 24421 -310062 -107223 -347796 90068 205504
19152 205504 -154768 -135207 -111850 154066 352396 -151852 140967 -219531 -42556 60054
19141 -168500 -199129 250704 -132010 -242304 -291594 -120191 25658 -119702 376835 -55075
19130 -1946 -124140 -223840 -104111 -118928 -236929 -130466 266599 -81868 288141 -299068
19119 -24819 -191135 -240342 -262037 -124662 -141617 -6306 248380 -215007 14077 250140 -159288
19107 -297804 4313 217487 27018 -146633 -230274 -70845 -324943 -312780 -109300 -202091 -48814
$$ packed form
19186A091e2598F9026i4288k0206G0968C0670L71564H9092d85228J72669a21828
19174C3876i1886p9220B0149P210d5872G3049J61112b98257O0851A43596a25802
19162a80704a5537m5838b1025l33059B4421c10062a07223k40573I0068J15436
19152B05504a54768J9561K3357A54066J98330a51852A40967b19531d2556F0054
19141a68500l0629B50704a32010j10294m9290a20191B5658a19702C76835e5075
19130a946j22194r9700a04111j4817j18001J06463B66599h1868B88141b99068
19119b4819j66316m9207k1695a24662j6955f306B48380b15007A4077K36063a59288
19107b97804D313K13174B7018a46633q3641g0845k54098J2163a09300r2791d8814
$$ plain form
19095 101024 -22004 56560 126163 -331169 4791 -102219 -196039 -148728 163235 320835 -109363
19083 118791 -162038 -169948 -100448 90473 -42731 -21267 -11323 414042 -82950 -132114 4070 -99077
19070 -357440 42422 50669 -198924 -197348 193407 -48905 119979 341407 -30281 14138 7378
19059 7378 173530 173884 -433488 -126465 -102511 245472 -104364 23285 -329226 -123986 -82443
19048 -82443 -26736 -77523 -25534 38829 -236119 160332 -255698 42039 93287 29831 2616
19036 -3095 9349 -150730 93994 23431 -6548 48892 75728 87927 -235107 -85543 108719 -248710
19023 -45381 -116662 32836 -198294 32029 -313856 3345 118802 -84641 -100105 -129549 -37041
19011 -286027 -193346 230087 -200962 147296 102809 55571 69123 24215 83230 112296 -143892
$$ packed form
19095A01024b2004E6560O9603c31169D791a02219r3820M7311A63235J57600a09363
19083A18791a62038p910O9500I0473d2731b1267R944D14042h2950m9164D070i9077
19070c57440D2422Q247a98924J576A93407d8905A19979K21428c0281A4138o760
19059G378J66152L54d33488a26465K3954B45472a04364B3285c29226a23986M1543
19048h2443b6736n0787b5534C8829b36119A60332b55698D2039N1248B9831B616
19036c095I349a50730I3994B3431f548D8892K6836J2199b35107h5543A08719b48710
19023d5381p1281C2836a98294C2029c13856C345J15457h4641j5464k9444c7041
19011b86027R2681B30087b00962A47296m4487m7238J3552B4215N9015K9066a43892
$$ plain form
18999 26506 -87450 -269011 124371 69380 -168715 177552 -189044 -132001 102076 14739
18988 -64305 148858 -164679 -220920 -41764 182982 -85850 88944 97377 51388 105484 -149320
18976 54448 -60266 -59665 -705148 8401 -149540 -156257 280799 -174527 -55185 -344485 70171
18964 -58097 -4781 -25993 4988 313170 -77837 -329294 -15947 -53047 84599 -291515 -258163
18953 -258163 49471 -198521 502470 76036 -306776 -93316 -22843 142479 -181572 4486 91212
18942 91212 -33500 -99800 10416 -170823 225548 -63847 -33833 17575 -168239 294554 -179739
18930 -229194 -16361 -226763 -77104 -6443 52705 -5337 -149816 23570 311679 219668 -183658
18918 -100203 -158598 -101439 99232 -213977 65016 -143781 -100917 -140913 216474 149679 -104800
$$ packed form
18999B6506h7450j81561A24371n4991a68715A77552a89044N7043A02076A4739
18988f4305A48858a64679n6241d1764A82982h5850H8944Q433m5989N4096a49320
18976E4448f0266O01o45483H401a49540o717B80799a74527e5185k89300G0171
18964e8097d781k1212D988L08182g7837k51457a5947l7100H4599b91515L3352
18953b58163D9471a98521E02470G6036c06776i3316b2843A42479a81572D486Q6726
18942I1212c3500o6300A0416a70823B25548f3847L0014A7575a68239B94554a79739
18930b29194a6361k10402g7104f443E2705e337j44479B3570K88109r2011a83658
18918a00203n8395N7159I9232b13977F5016a43781M2864l9996B16474o6795a04800
$$ plain form
18906 -156633 -86813 53242 156192 142900 -511538 -363754 37187 -1812 210686 -82224 -94370
18895 -94370 141148 -93626 112912 -80853 269144 1922 -196578 10732 38996 45942 -159239
18883 -143908 -461428 77156 229997 148501 -149113 966 27270 -118251 -258272 -188786 -275282
18872 -275282 -73407 167701 -35228 -31339 46514 6485 -267197 177704 224984 -185639 26370
18860 62687 221552 -80130 231861 -51118 79862 -41076 -157508 -59134 88247 -22276 -145600
18849 -145600 -31187 32621 40969 -231767 -311229 161647 -41270 74661 269274 -462878 -125120
18837 376207 -59987 -352776 21011 153155 79372 -151100 76008 50156 -173807 -73985 -13057
18825 -118427 165862 -375738 -49913 29766 170453 -51271 24725 -158953 -391099 -117760
$$ packed form
18906a56633O9820E3242J02950j3292e11538J47784C7187a812B10686h2224j2146
18895i4370A41148i3626A12912h0853B69144A922a96578A0732K8264O946a59239
18883a43908l17520G7156J52841q1496a49113I66K6304a18251j40021O9486q6496
18872b75282g3407A67701c5228L889D6514F485b67197A77704M7280a85639B6370
18860F2687J58865h0130B31861e1118G9862d1076j16432e9134H8247b2276j23324
18849a45600c1187C2621Q348b31767p9462A61647d1270G4661J94613d62878a25120
18837C76207e9987k92789B1011J32144p3783a51100G6008k5852a73807g3985a3057
18825a18427A65862c75738d9913B9766J40687e1271B4725a58953k32146a17760
$$ plain form
18814 -199845 376296 -166649 132293 119532 259055 456502 -13444 29487 -78130 100984
18803 64007 -76632 3806 -224347 47674 -92619 374153 -146993 -26798 -128141 3357 26743
18792 26743 97284 -101979 -160066 135803 223773 -171948 -90357 -74141 -119590 -238690 30164
18780 -160439 60696 -6717 586 -219357 41549 -112020 -152636 -115170 -17052 -22869 -132167 139947
18767 -10656 -7960 -231475 260458 -148698 -286412 -140350 101990 -29345 229981 -153356
18756 56976 -687426 115715 -237471 474111 -164389 -120334 -272829 72579 140271 26625
18745 50850 8336 -38301 -197576 -107804 57650 -165434 -130390 -64879 629 40757 -247937 58015
18732 -428770 -178419 -78336 71350 -17138 -469616 -438521 -293153 -19457 -202072 -90656 -176845
$$ packed form
18814a99845C76296a66649A32293j2761J39523J97447a3444B9487g8130A00984
18803F4007g6632C806b24347D7674i2619C74153a46993b6798j01343C357K3386
18792B6743P0541a01979n8087A35803Q7970a71948Q1591J6216m5449j19100C0164
18780a60439F0696f717E86b19357D1549a12020m0616L7466a7052n817j09298A39947
18767a0656K696k23515B60458a48698j37714a40350A01990b9345B29981a53356
18756E6976f87426A15715b37471D74111a64389M4055j52495G2579O7692B6625
18745E0850H336c8301j59275Q9772E7650a65434L5044f4879F29M0128b47937E8015
18732d28770a78419g8336G1350a7138m52478L1095J45368a9457j82615i0656q6189
$$ plain form
18721 -176845 -103673 119691 75864 -68952 -105581 -186323 -182901 -92731 402641 -41445 122020
18709 61191 72414 47221 -3322 -138123 219925 -189810 41697 55908 150964 -36765 -291 67847
18696 -38747 31769 81804 345347 157326 73483 -86943 -167903 229197 113857 -247700 6316
18684 -370541 -390030 -18159 -187137 -259807 -36533 -66755 43944 -102239 -9037 -48036 -190712
18673 -190712 -68992 -146484 -385778 11316 -167685 88010 201952 -104788 -10742 -108347 -143534
18662 -143534 -399005 -461241 78152 -244674 5801 -178420 -81136 -347927 -327833 -78069 225164
18650 -274 -64932 -125317 104529 -70596 -32227 -72309 78697 -68108 285823 188013 -27776 -48827
18638 -48827 151908 59295 49005 113378 -27482 -203088 -108744 42642 -54132 -170910 163483
$$ packed form
18721a76845P3172A19691m3827f8952l6629q0742L422R0170D02641d1445A22020
18709F1191J1223k5193c322j34801B19925a89810D1697J4211R5056c6765b91F7847
18696c8747C1769N0035K63543A57326G3483h6943q0960B29197A13857b47700F316
18684c70541j9489a8159j68978p2670c6533l0222D3944a02239i037l8999j42676
18673a90712f8992p7492k39294A1316a67685H8010J13942a04788a0742r7605l5187
18662a43534k55471o2236G8152b44674E801a78420h1136k66791K0094g8069B25164
18650b74o4658o0385A04529g0596c2227m0082G8697f8108B85823r7810b7776k1051
18638d8827A51908E9295j0290O4373b7482j75606R4344D2642e4132j16778A63483
$$ plain form
18626 308649 263876 -34514 131714 -159937 -22998 -182348 15468 149400 -262986 -194482
18616 -194482 217077 -85878 -39855 17383 42491 -326003 78856 102845 -281752 -175493 208574
18604 158673 -164591 -30343 -109028 -52087 -260414 -99263 34896 220681 -120182 -169637 131919
18592 -190416 -148609 -33439 -200765 -170130 -216751 -153356 -374853 -168362 -16644 -62688 -29856
18580 136479 -88160 -45472 34983 -307303 -301138 215674 -122044 -271497 22351 -154727 -73059
18568 184608 -7861 -53528 325260 -78672 -396521 237729 -134148 -92748 38785 -131425 -327556
18557 -327556 32125 261709 -173062 -261991 289079 228711 219904 242990 -180536 -290483 39017
18545 -33863 431000 -261856 221895 -145695 -17886 -139115 -164586 -131809 134386 -23568
$$ packed form
18626C08649m4773c4514A31714a59937b2998j59350A5468J33932b62986O8504
18616a94482B17077h5878c9855A7383K5108c26003G8856K3989b81752J06259B08574
18604A58673a64591c0343p8685e2087k08327i9263C4896J85785a20182m9455A31919
18592a90416M1807c3439j67326L0635m6621O3395k21497a68362a6644m6044b9856
18580A36479h8160M2688C4983c07303O165B15674a22044j49453B2351a54727g3059
18568A84608g861m5667C25260g8672l17849B37729a34148M1400C8785a31425j96131
18557c27556C2125K29584a73062q8929B89079o0368q807K3086a80536j09947C9017
18545c3863D31000b61856B21895a45695a7886j21229k5471L2777A34386b3568
$$ plain form
18534 107668 61736 -214646 32907 85887 40816 4806 -101762 150397 -44929 254011 12494
18522 -118353 -27409 15482 74909 368592 -19445 35237 119024 107170 258836 -122001 -15006
18510 -251401 133609 47347 -291958 -254118 -221576 -11761 -106758 231922 142845 -99199 -51368
18499 -51368 -256925 316734 128765 -74138 -91829 -108685 -218985 85849 -111054 -142792 -175369
18488 -175369 -8789 -128322 1079 -42927 -119563 -348942 -30437 -105139 -302442 -264197 67926
18476 15761 -184220 296093 57667 -2039 -144978 46876 144655 -174607 137441 -63426 -302174
18465 -302174 -57677 351240 158311 93304 104576 -261156 151190 75153 102941 -70298 -66039
18454 -66039 -9637 -83589 194752 -38187 -41327 -3139 -303752 134801 -22148 -215981 -105845
$$ packed form
18534A07668m5932b14646C2907N2980D0816D806a01762A50397d4929B54011A2494
18522a18353b7409A5482N9427K93683a9445C5237Q3787j1854J51666a22001a5006
18510b51401A33609D7347b91958L7840L2542a1761r4997B31922q9077i9199M7831
18499e1368k05557C16734A28765g4138j7691j6856j10300H5849a11054l1738l2577
18488a75369h789j19533A079d2927p6636k29379c0437p4702j97303L8245F7926
18476A5761a84220B96093E7667b039j42939D6876R7779a74607A37441f3426k38748
18465c02174e7677C51240A58311o5007J1272b61156A51190G5153K7788g0298M259
18454f6039i637p3952A94752c8187l140c139l00613A34801b2148j93833a05845
$$ plain form
18442 153773 -41976 -44933 -190764 -182262 -87318 -24349 58274 -44169 138832 -60195 -160897
18431 -160897 -67458 110643 139285 -54318 -215341 -180054 -28053 123893 124507 5836 253615
18420 253615 -158149 29270 -86127 -77007 107742 -237610 -194505 -9086 15502 27343 -127127
18408 -189543 -149720 -288165 69757 132309 83819 169346 -647657 -87965 -126560 -236919 -88544
18396 242058 -409288 -280937 67093 -185589 -28541 175908 106483 34841 56722 6088 -323001
18384 -162704 -335140 -31416 -287396 -306294 19168 44460 24199 64353 -86644 312570 375225
18373 375225 -26411 -106856 78562 -20707 19178 225594 452299 -10487 -146773 -105648 -36818
18361 242700 -384389 -103297 193576 64048 -45363 -8723 -114323 -310701 -133314 -144362
$$ packed form
18442A53773d1976k957j45831Q502h7318b4349E8274d4169A38832f0195j00702
18431a60897f7458A10643K8642e4318j61023L5287b8053A23893O14E836K47779
18420B53615a58149B9270h6127R120A07742b37610M3105i086A5502J1841a27127
18408a89543L9823j38445F9757O2552m8490Q5527f47657h7965l8595j10359h8544
18396B42058d09288J28351F7093a85589b8541A75908o9425C4841K1881F088c23001
18384a62704j72436c1416k55980j8898A9168K5292k0261M0154h6644C12570O2655
18373C75225b6411q0445G8562b0707A9178K06416K26705a0487j36286M1125c6818
18361B42700c84389a03297A93576F4048d5363h723j05600j96378a33314j1048
$$ plain form
18351 -144362 -146626 -24106 47016 -214150 -26088 -91435 -185567 123906 -258499 77662 162090
18340 162090 127524 -183188 83327 -299103 104188 -149367 -377235 -75216 -72536 -230175
18330 -230175 -48990 -113198 -71826 285936 -46287 -180975 130730 -173656 -3727 -97757 198641
18318 -101095 -29058 -264823 61911 -48029 -134688 150410 264246 -112302 234535 -122163
18307 15144 89719 -242056 -335792 -149007 -166895 16439 33752 -30941 -122422 -210538 -214367
18296 -214367 -75653 -129764 38840 -124765 156987 -92166 -144483 -238560 -91206 -321865 28183
18284 -131893 104123 19412 41372 -329502 -124774 110600 115184 -109674 50673 -186177
18273 -150345 183285 -153278 51195 -56361 69517 -212151 -172901 -37188 199714 98352 -353979
$$ packed form
18351a44362k264b4106D7016b14150b6088o5347r4132A23906b58499G7662Q4428
18340A62090l4566a83188H3327b99103A04188a49367k27868g5216K680j57639
18330b30175d8990o4208M1372B85936d6287j34688A30730a73656c727r4030A98641
18318a01095b9058k35765F1911d8029q6659A50410J13836a12302B34535a22163
18307A5144P4575b42056r3736a49007j7888A6439J7313c0941r1481q8116l829
18296b14367g5653n4111C8840a24765A56987i2166n2317r4077i1206k30659B8183
18284a31893A04123A9412K1960c29502a24774A10600M584a09674E0673a86177
18273a50345A83285a53278E1195e6361F9517b12151L9250c7188A99714I8352c53979
$$ plain form
18261 372446 -89304 -19032 -109621 -62372 -62700 -197585 -187859 5922 -27621 -19793 -159484 -107004
18249 -107004 24821 -149069 21010 -6864 -143379 72436 -70620 -134382 155213 158895 -542643
18237 -22995 73666 130140 -10116 -186314 22862 -123516 -102214 151037 273723 -3236 -225695
18226 -225695 -28080 40090 -19108 -140052 -62618 74581 -29352 -188869 28312 -5445 -39541
18215 -39541 -98336 -178510 60822 -95680 73869 -515397 -167980 -180305 -107465 75353 114981
18204 114981 -379850 132559 -147161 -34628 -14882 -289145 -51917 -501341 163420 -138954
18193 -114789 93534 330834 241179 123162 129027 22093 -193118 -94692 -47180 -28780 -302648
18182 -302648 -140529 209508 213882 9250 248799 21627 -42036 -335622 159370 -289448 -66267
$$ packed form
18261C72446h9304a9032r0589M7249l28j34885R726E922b7621P828j39691N2480
18249a07004B4821a49069B1010f864j36515G2436g0620o3762A55213L682e42643
18237b2995G3666N6474a0116j76198B2862a23516K1302A51037J22686c236k22459
18226b25695b8080D0090a9108j20944f2618G4581b9352j59517B8312e445l4096
18215c9541n8795q0174F0822i5680G3869e15397a67980j2325P2840G5353L9628
18204A14981c79850A32559a47161c4628a4882k74263e1917m49424A63420a38954
18193a14789I3534K37300q9655j18017N865B2093a93118i4692d7180J8400k73868
18182c02648a40529B09508M374I250K39549B1627d2036k93586A59370b89448f6267
$$ plain form
18170 -282237 -159223 -31298 270508 -143646 235906 -327100 -379037 248448 -214456 -27034
18159 -56171 -18648 13942 -59296 -53798 -203652 273618 -195344 12963 76785 293723 45371
18147 -187048 -98857 -178902 -113242 -109007 19514 -284138 22037 132264 -230296 -80999 241528
18135 254942 45095 -182563 -70843 -145145 -22772 138811 -79923 260388 -92159 -212750 331623
18123 328390 -234608 -325032 11104 -328498 247088 -39273 110968 -20507 -129133 -35698
18112 -269174 290270 180480 59333 -34389 97956 -171354 -268661 102356 -46657 -143141 -148498
18101 -148498 -32817 100585 -67608 -49070 -50279 189334 -177558 77791 230255 106588 50472
18089 -88345 -232833 -139008 11738 80261 127365 -195299 67112 -101536 16456 -266465 177864
$$ packed form
18170b82237J23014c1298B70508a43646B35906c27100n1937B48448b14456b7034
18159e6171a8648A3942e9296N498j49854B73618a95344A2963O3822K16938D5371
18147a87048Q8191q0045O5660M235A9514b84138B2037J10227b30296h0999B41528
18135B54942D5095a82563g0843p4302b2772A38811g9923B60388i2159j20591C31623
18123C28390b34608r0424A1104c28498B47088c9273A10968b0507j08626c5698
18112b69174B90270j09790E9333c4389I7956a71354r7307A02356d6657r6484n357
18101a48498c2817A00585f7608J8538j209A89334a77558G7791J52464A06588E0472
18089h8345j44488R3825A1738O8523M7104a95299F7112a01536A6456b66465A77864
$$ plain form
18077 -14677 -38730 -58788 -135817 -205673 4482 -32330 -231952 14498 -126138 -523718 -96432
18065 99418 -127905 71145 109357 68689 60423 147729 -104238 -93539 -67476 79667 93482
18054 93482 90671 52400 260929 -417877 -43131 135144 -339047 -187772 4460 -38603 23462
18042 -138260 -187819 40965 59193 131649 -265042 -98685 136584 106135 -117628 186881 53599
18030 162447 -59708 347388 -210787 -229508 100519 23144 -421276 16103 161267 68207
18019 300126 -313349 -312009 252051 174117 -126968 53361 -234917 88351 -93194 -328275 -116388
18007 -250114 86509 -39192 -208309 -356482 54985 136552 -4869 -244741 50165 136160 177389
17996 177389 -237196 78049 -38496 10659 670 -173193 -46266 -6442 5161 236021 -79109 221064
$$ packed form
18077a4677k4053k0058p7029o9856D482c2330j99622A4498a26138l97580i6432
18065I9418a27905G1145L8212m0668q266Q7306a04238J0699K6063G9667J3815
18054I3482k811l8271K08529d17877d3131A35144c39047J51275D460c8603B3462
18042a38260m9559D0965J8228P2456b65042i8685A36584l0449a17628A86881E3599
18030A62447e9708C47388b10787j8721A00519B3144d21276A6103J45164F8207
18019C00126c13349J340B52051p7934a26968E3361b34917H8351i3194k35081a16388
18007b50114H6509c9192j69117j48173E4985Q1567d869k39872E0165Q5995M1229
17996A77389b37196G8049c8496A0659F70a73193d6266f442E161K30860g9109B21064
$$ plain form
17983 -75815 -60576 226545 -189907 19243 46020 -200955 -150429 -294925 -150430 161692
17972 -176854 74878 153629 215203 -125182 17994 -321618 -174975 -56646 -93264 -44982 -82322
17961 -82322 -258069 -52991 -309831 125626 -92487 6970 217409 326874 199329 79085 17076
17949 -92542 -366141 278822 -484554 142334 63574 -284717 -14264 -14302 -204909 40041 -128549
17937 -219822 177379 332701 206635 -84979 -92455 -229824 -104400 -18789 -346745 -139811
17926 397213 -23771 89807 -212033 -114839 103501 404 33250 178408 -74336 241627 -157957
17914 -87778 5112 -450004 -20574 -204458 -4459 367339 -124009 -340973 31958 -513940 -361354
17903 -361354 146392 -41776 -187514 -73215 37020 -288697 35664 -199705 -200251 -162326 -104191
$$ packed form
17983g5815J5239B26545a89907A9243K6777b00955N0526j44496J44495A61692
17972a76854G4878P8751O1574a25182A7994c21618J46643e6646l6618d4982l7340
17961h2322j75747e2991k56840A25626i2487F970K10439J09465j27545G9085A7076
17949i2542k73599B78822d84554A42334F3574b84717a4264l8j90607D0041a28549
17937b19822A77379J55322j26066h4979p476j37369a04400a8789l27956a39811
17926C97213b3771H9807b12033R7194A03501D04L2846J45158g4336B41627a57957
17914h7778E112d50004b0574j83884d459C67339a24009k16964C1958e13940J52586
17903c61354A46392d1776j45738g3215C7020b88697C5664a99705n46L7925N8135
$$ plain form
17892 -104191 69843 -20021 -74191 -79484 -304647 -23420 127681 -30471 -242512 -32746 169421
17880 -68768 -269725 68479 -187993 24109 29584 96223 170908 2997 -30623 21452 -214859
17868 110128 -41122 230 -26126 110882 83830 -80867 81581 -39909 230386 -85730 -170860
17857 -170860 42669 -387527 -231838 311358 -16384 250720 -322012 -187707 -26131 -41408
17847 -41408 -163173 9736 151021 -150780 -182739 -72015 43575 319584 35670 125487 -76359
17835 -68849 -198141 -6332 -36401 49867 196670 104680 -277945 -124164 137226 -33950 -76642
17824 -76642 -17753 59718 -69010 120678 -512964 53194 -125989 28193 20445 126506 -102980
17812 76652 -136386 92480 187614 -233477 -203937 -23360 -81137 47500 61428 -66085 55137
$$ packed form
17892a04191F9843b0021n4170n293k25163b3420A27681c0471k12041c2746A69421
17880f8768k00957F8479a87993B4109N475O6639P4685B997c0623B1452b14859
17868A10128d1122B30b6126A10882k7052h0867H1581c9909B30386h5730q5130
17857a70860D2669c87527J55689C11358a6384B50720c22012J34305b6131j5277
17847d1408j21765I736J41285a50780l1959g2015D3575K76009C5670Q9817g6359
17835f8849j29292f332l0069D9867J46803r1990b77945a24164A37226c3950m2692
17824g6642a7753E9718f9010A20678e12964E3194a25989B8193p748J06061a02980
17812G6652a36386I2480R5134b33477K9540b3360n7777D7500J3928f6085E5137
$$ plain form
17800 135582 -34775 22627 -90894 37133 -269989 -80364 48974 116252 -236111 3313 -404161
17788 -13306 -17352 47433 51428 -519930 206195 162570 67204 -188556 73139 -60352 55369
17776 -39211 -206410 143448 165330 202707 26783 -241599 -96753 145354 104152 230952 -180030
17764 81448 -54184 187327 -16848 104314 -164372 210926 97890 92621 -141841 356578 -24323
17752 7310 -549893 111026 -349300 168946 417760 181836 255872 -70138 -51261 141789
17741 -72755 267642 16223 235822 65286 -247895 31211 -239464 127200 278880 248297
17731 248297 -237620 -286831 -80899 -288605 -114870 448553 104732 -72675 -3148 15162 -192733
17719 -66074 -36491 117737 157496 119323 -108528 -163438 18639 -108699 -116275 197351 297160
$$ packed form
17800A35582c4775B2627i0894C7133b69989h0364D8974O7278b36111C313d04161
17788a3306m046D7433L995e19930B06195m3625F7204a88556G3139f0352E5369
17776c9211j67199A43448K1882L7377B6783b41599i6753A45354m1202J26800a80030
17764H1448e4184A87327a6848A04314a64372B10926I7890n269a41841C56578b4323
17752G310e49893A11026c49300A68946K48814A81836P4036g0138J8877A41789
17741g2755B67642A6223K19599F5286b47895C1211b39464A27200J51680l0583
17731B48297b37620m9211h0899k07706a14870D48553A04732g2675c148A5162a92733
17719f6074K9583A17737L9759l8173a08528n4910A8639a08699p576A97351R9809
$$ plain form
17708 297160 122993 266795 -107443 23150 281059 67842 131740 157180 17608 103697 -178815
17696 29886 -105061 -57279 31746 37261 52686 -380237 -194159 -86636 6764 198691 111353
17685 111353 -87531 -97714 -85199 28857 293304 -26809 -42534 -240230 -250980 -105015 48285
17673 24870 -114018 27149 -167021 -42534 -147832 -138061 -248560 -21579 236146 149906 61874
17661 -350186 -13499 131092 11089 -229388 29412 122940 22021 -331081 251418 131754
17651 131754 191153 432001 329717 20313 134650 218840 -151289 1215 181457 74121 -200051
17639 -205138 131582 127169 330746 93056 160448 6884 -334359 76163 177737 -48361 28034
17627 195766 176170 232828 54709 -19330 -232252 120485 170073 149705 128278 -60560 -63033
$$ packed form
17708B97160A22993J43802a07443B3150K57909F7842O3898K5440A7608Q6089a78815
17696B9886a05061M7782C1746N515J5425c80237J86078h6636F764J91927q7338
17685A11353h7531j0183J2515B8857K64447b6809j5725j97696j0750a05015D8285
17673B4870a14018B7149a67021d2534j05298R771j10499b1579B36146q6240F1874
17661c50186a3499A31092A1089b29388B9412R3528B2021c31081B51418j19664
17651A31754N9399K40848j02284B0313J14337Q4190a51289A215J80242G4121b00051
17639b05138A31582m413K03577I3056O7392F884c34359G6163J01574d8361B8034
17627A95766j9596N6658E4709a9330k12922A20485M9588k0368k1427f0560k473
$$ plain form
17616 -63033 -63646 146513 -23778 74414 59783 -203894 249746 255840 102641 15614 63471
17605 63471 106886 161172 -38496 302143 118668 -51999 -144400 149928 -187125 75169 386942
17594 386942 -223446 12120 -88507 -169770 -26528 103920 152616 -130115 -184802 146792 -36613
17582 -46336 33487 42482 87851 34405 349927 25216 -15980 -121884 115223 299771 139746
17570 -104937 184010 85413 -10711 108764 -16649 255915 46396 58930 -357660 -65020 346389
17558 231366 -1835 178057 -50520 128219 -72948 -21987 65148 -42237 -188755 359501 -27933
17546 257410 3828 25154 284336 -292183 133264 48758 250669 20812 -48621 55570 51512
17535 51512 -247988 198027 110982 -306468 199492 -72291 204288 -219379 411714 -2817
$$ packed form
17616f3033o13A46513b3778G4414j4631b03894B49746O094A02641A5614M7857
17605F3471M3415N4286c8496C02143A18668e1999r2401A49928a87125G5169L11773
17594C86942b23446A2120h8507q1263b6528A03920M8696a30115n4687A46792c6613
17582d6336C3487Q995M5369C4405L15522B5216a5980j05904A15223J84548A39746
17570a04937A84010H5413a0711A08764a6649B55915D6396J2534c57660f5020C46389
17558B31366a835A78057e0520A28219g2948b1987F5148d2237j46518C59501b7933
17546B57410C828K1326K59182b92183A33264D8758K01911B0812d8621E5570m058
17535E1512b47988A98027q7045c06468A99492g2291B04288b19379D11714b817
$$ plain form
17524 26565 261510 383365 -58520 225126 32493 56080 60688 -117058 -9254 -224034 325604
17512 115381 -108556 175690 -48860 -290020 195559 -43956 -81343 351454 -224719 93607
17501 -85630 393563 -116677 267056 77058 170300 -101515 -27447 178737 550870 47353
17490 220806 112016 46120 -2809 122929 201143 -2926 44788 117988 173948 117398 11396
17478 92624 -508901 34739 363859 26777 146684 -144205 342253 104943 286491 -100926
17467 44225 -227235 330566 390341 196023 414203 9581 118468 665 309297 236311 -48353
17455 56259 -72612 54720 -24550 438812 135971 219695 132496 265152 257149 105768 250701
17444 250701 17754 -103363 354247 46695 182691 507827 280759 137701 529280 50318
$$ packed form
17524B6565K34945J21855e8520B25126C2493K3587M608a17058i254k14780C25604
17512A15381a08556A75690d8860k41160A95559d3956l7387C51454b24719I3607
17501h5630C93563a16677B67056G7058R3242a01515b7447A78737L72133D7353
17490B20806j08790D6120b809A22929P8214b926D4788P3200N5960n6550A1396
17478I2624e08901C4739L29120B6777J19907a44205C42253A04943J81548a00926
17467D4225b27235C30566N9775j94318K18180I581J08887F65L08632p2986d8353
17455E6259g2612E4720b4550D38812A35971Q3724q7199J32656q003A05768J44933
17444B50701A7754a03363C54247D6695J35996L25136k27068A37701L91579E0318
$$ plain form
17433 111607 263460 367586 133832 131973 330551 458656 -10165 624982 370897 201036
17423 201036 166315 89498 187091 182019 286711 337187 28454 94083 365934 460307 406697
17412 406697 145959 136852 72518 5705 55149 151848 176804 72793 49408 86391 -17212 219030
17399 -197444 -9505 223362 -9019 311530 -3183 1945 264972 210132 389037 -246993 -227877
17388 -227877 -163919 -53930 397744 281485 139186 42155 -29818 122610 115868 262867 -34348
17376 178765 -61907 54280 43097 381761 181309 509194 -38842 113829 61266 -154397
17365 193311 -19643 23879 187533 124021 177888 197730 40700 12474 267283 -173146 87666
17353 149929 108487 -139063 -41645 155367 -256649 -53982 184157 -93666 235691 253013
$$ packed form
17433A11607J51853J04126A33832j859J98578J28105a0165F24982k54085j69861
17423B01036l4721p6817R7593n072J04692N0476B8454O5629K71851R4373n3610
17412D06697A45959r107o4334E705M9444R6699K4956G2793k3385L6983a7212B19030
17399a97444i505B23362i019C11530c183A945K63027n4840J78905b46993J9116
17388b27877O3958e3930C97744j16259A39186D2155b9818A22610o742J46999c4348
17376A78765f1907E4280j1183L38664A81309L27885c8842A13829n2563a54397
17365A93311a9643B3879J63654o3512N3867J9842D0700A2474K54809a73146H7666
17353A49929m1442a39063d1645A55367b56649e3982A84157i3666B35691J7322
$$ plain form
17343 253013 396379 163778 316305 -56832 205215 70193 463784 -39841 -110880 -150508
17333 -150508 299691 258187 327399 -67840 325379 88462 -15615 -131142 296650 25257 73132
17322 73132 117072 -11522 -469746 -276687 640115 279089 333944 -8526 381597 168686 -263134
17310 368274 187229 -69686 148915 -47107 294066 14915 -194160 305804 232800 193093
17300 193093 300647 201470 -120055 196766 64776 296026 202122 550606 147403 186024
17290 186024 -119960 96445 138705 134474 250417 176354 -98197 85515 379029 6388 13420
17279 13420 205288 -68816 167352 186715 189421 -108365 213247 194672 21947 40882 56967
17268 56967 -180426 380042 383346 207812 347555 326118 45381 -71200 173707 95728 458404
$$ packed form
17343B53013J43366A63778J52527e6832B05215G0193L93591c9841p1039l9628
17333a50508B99691m1504O9212f7840C25379H8462a5615j15527B96650B5257M7875
17322G3132M3940a1522m58224J93059F40115B79089N4855h526C81597A68686b63134
17310C68274j81045f9686A48915d7107B94066A4915a94160C05804p3004l9707
17300A93093J07554r9177a20055A96766F4776K31250r3904L48484A47403L8621
17290A86024a19960I6445M2260m231J15943p4063i8197H5515K93514F388P032
17279A3420J91868f8816A67352J9363K706a08365B13247j8575B1947J8935J6085
17268E6967a80426C80042L304j75534J39743k1437D5381g1200A73707p7979L62676
$$ plain form
17257 458404 535535 157562 5439 99572 132600 80466 199578 471067 124796 313813 118704
17245 154192 278031 397969 292541 -31307 170770 97284 408339 234342 154755 314499
17235 314499 433829 -1178 178995 99099 363088 303344 -5067 233726 473817 701220 297126
17223 132680 528546 -21524 -62772 -82506 143567 470105 241554 230327 -2301 179160 242506
17212 242506 411442 171912 320407 258977 97427 318369 106398 390722 148461 374144
17202 374144 -24434 560214 289179 329952 57869 99075 387307 -93143 318546 160442
17192 160442 261278 138183 168908 351546 317346 107317 218688 354342 452673 243125
17182 243125 4662 334625 -19614 304230 449570 228014 286425 163056 397358 437428
$$ packed form
17257D58404P7131A57562E439R4133L3028n2134J19112K71489A24796J89017A18704
17245A54192J23839J19938j05428c1307A70770p3486L11055j73997p9587J59744
17235C14499J19330a178A78995p9896K63989n9744e067B33726K40091K27403B97126
17223A32680L95866b1524m1248j9734A43567L26538k28551j1227b301A79160O3346
17212B42506J68936A71912J48495o1430I7427K20942A06398K84324A48461K25683
17202C74144b4434E60214k71035M0773E7869M1206K88232i3143C18546j58104
17192A60442J00836j23095L0725J82638l4200A07317J11371J35654R8331k09548
17182B43125D662L29963a9614C04230J45340k21556N8411j23369K34302M0070
$$ plain form
17172 437428 10984 544773 -20038 -65265 362488 46737 85861 371142 56722 283133 113645
17160 119976 294092 71056 231968 108413 403586 420950 294948 408363 56481 437257
17150 437257 302223 299402 448326 -5603 63553 373135 194535 43918 337181 280418 335796
17139 335796 391525 359830 813877 499523 169367 530153 448503 337460 301011 186589
17129 186589 -68496 224054 175857 531325 412497 502080 470320 787123 315333 390446
17119 390446 492111 484864 428175 518868 386398 702100 273446 388812 336138 584095
17109 584095 146228 300818 297860 237551 284558 258270 462496 767647 467300 562132 339475
17098 339475 449408 56629 379889 398843 671245 222653 422043 233650 409489 189181
$$ packed form
17172D37428A0984N33789b0038m5227C62488D6737L9124K85281E6722K26411A13645
17160A19976J74116G1056J60912A08413K95173J7364j26002J13415E6481L80776
17150D37257j35034k821J48924e603F3553L09582j78600D3918K93263n6763N5378
17139C35796N5729l1695M54047l14354A69367L60786q1650j11043l6449j14422
17129A86589f8496B24054m8197L55468j18828Q9583l1760L16803C15333P5113
17119C90446J01665p247n6689R0693j32470L15702B73446J15366n2674K47957
17109E84095A46228J54590k958o0309M7007k6288K04226L05151l00347R4832k22657
17098C39475J09933E6629L23260J8954K72402B22653J99390j88393J75839A89181
$$ plain form
17087 384852 67537 467561 326120 299914 312761 224322 365239 373182 151737 397532 325748
17076 325748 268053 450672 713164 645654 335689 639737 333181 631087 516722 623536
17066 623536 785889 694679 592898 595185 402045 580617 524322 539721 397409 528130
17056 528130 310093 353757 475379 394338 519885 653903 642436 612560 614589 724643 416222
17045 416222 793641 493774 413137 520899 800660 542174 595430 606584 408688 684352
17035 684352 573157 766417 536017 703068 765961 415014 652971 795757 762728 568977
17025 568977 585840 644899 895530 553700 689369 647037 876431 520071 587471 628433
17015 628433 693932 704509 513436 910338 822251 326150 605898 841710 724288 640088
$$ packed form
17087C84852F7537M00024j41441k6206J2847q8439J40917P943A51737K45795p1784
17076C25748n7695J82619K62492o7510l09965L04048l06556K97906j14365J06814
17066F23536J62353r1210j01781K287j93140J78572n6295J5399j42312J30721
17056E28130k18037M3664J21622q1041J25547J34018j1467k9876K029J10054l08421
17045D16222L77419k99867q0637J07762K79761k58486N3256J1154j97896K75664
17035F84352j11195J93260k30400J67051O2893l50947K37957J42786l3029j93751
17025E68977J6863N9059K50631l41830J35669m2332K29394l56360O7400M0962
17015F28433O5499J0577j91073L96902q8087C26150K79748K35812j17422q4200
$$ plain form
17005 640088 508116 500743 545900 904145 927720 743670 526801 1021229 822657 822596 795489
16994 795489 721774 749297 583697 837533 767183 882322 1084652 659816 505668 719860
16984 719860 1047513 825425 731497 1133789 1076345 1170926 1140139 801893 850484 1023630
16974 1023630 760725 1076370 915861 1012192 1212849 970813 1024184 809400 959784 833581
16964 833581 984688 675657 1174300 1063692 1185336 909120 1323929 1050054 1171880 809675
16954 809675 1185155 1001320 1084700 844705 945582 1254985 1274410 1518131 1240110 1322254
16944 1322254 1105010 1619509 1228821 1142855 1253967 1281009 1292746 1203992 1358152 1550408
16934 1550408 1423377 1418967 1421402 1230900 1745611 1341992 1328077 1088057 1604018 1114771
$$ packed form
17005F40088j31972p373M5157L58245K3575j84050k16869M94428j98572o1k7107
16994G95489p3715K7523j65600K53836p0350J15139K02330m24836j54148K14192
16984G19860L27653k22088r3928M02292n7444R4581l0787l38246M8591J73146
16974A023630k62905L15645j60509R6331K00657k42036N3371k14784J50384j26203
16964H33581J51107l09031M98643j10608J21644k76216M14809k73875J21826l62205
16954H09675L75480j83835Q3380k39995J00877L09403J9425K43721k78021Q2144
16944A322254k17244N14499l90688q5966J11112K7042J1737q8754J54160J92256
16934A550408j27031m410K435j90502N14711m03619j3915k40020N15961m89247
$$ plain form
16924 1114771 1355324 1825554 1485063 1537154 1537392 1331580 1614211 1626671 1653465 1702532 1467504
16913 1467504 1774976 1469328 1514196 1885990 1690868 2019594 1653446 1963932 1675811 1915465
16903 1915465 1276310 1466585 1412018 1895810 1957225 2127209 1829995 1905876 2097988 2339288
16893 2339288 1824603 2047842 2113073 2334177 2199728 2145557 2207392 2089317 2411402 2638790
16883 2638790 2206258 2232806 2321114 2492020 2335598 2037200 2629661 2647591 2368522 2635173
16873 2635173 2612512 2701446 2867751 2619005 2593581 2955778 2516475 2809487 2886461 2822690
16863 2822690 2839726 3349659 2876046 3190692 2825592 3223267 3088951 3098490 3185679 3248670
16853 3248670 3318929 3188873 3540472 3508236 3745252 3205324 3662159 3817763 4067391 3958753
$$ packed form
16924A114771K40553M70230l40491N2091K38k05812K82631J2460K6794M9067k35028
16913A467504L07472l05648M4868L71794j95122L28726l66148L10486k88121K39654
16903A915465o39155J90275n4567M83792O1415J69984k97214P5881J92112K41300
16893B339288n14685K23239O5231K21104j34449n4171O1835j18075L22085K27388
16883B638790m32532K6548Q8308J70906j56422k98398N92461J7930k79069K66651
16873B635173k2661Q8934J66305k48746k5424L62197m39303K93012P6974o3771
16863B822690J7036N09933m73613L14646l65100L97675j34316R539Q7189O2991
16853C248670P0259j30056L51599l2236K37016n39928M56835J55604K49628j08638
$$ plain form
16843 3958753 4088406 4222821 3908462 4235330 4472242 4693529 4213670 4451364 4498973 4654797
16833 4654797 4511376 4853862 4649444 5204048 5232273 4967071 5170631 5263521 5586552 5268833
16823 5268833 5588544 5850553 5850656 5861717 6317087 5936769 6564134 6414338 6224169 6604275
16813 6604275 6388632 6884320 7075715 6893887 7306935 7438280 7469884 7813503 7927120 8083869
16803 8083869 8385357 8431432 8921576 8827929 9513547 9408352 9496916 9543275 10166829 10402335
16793 10402335 10488341 10563537 10947174 11359596 11565129 12024616 12475510 12833806 12758716 13033046
16783 13033046 13519630 14135072 14445216 14956034 15033081 15764593 16466784 16724423 17302886
16774 17302886 18196134 18272472 19310832 19769123 20560169 21141758 22086266 22602444 23465737
$$ packed form
16843C958753J29653J34415l14359L26868K36912K21287m79859K37694M7609J55824
16833D654797j43421L42486k04418N54604K8225k65202K03560R2890L23031l17719
16823E268833L19711K62009J03J1061M55370l80318O27365j49796j90169L80106
16813F604275k15643M95688J91395j81828M13048J31345L1604L43619J13617J56749
16803H083869L01488M6075M90144r3647O85618j05195Q8564M6359O23554K35506
16793A0402335Q6006P5196L83637M12422K05533M59487M50894L58296p5090K74330
16783A3033046M86584O15442L10144N10818P7047P31512P02191K57639N78463
16774A7302886Q93248P6338J038360M58291P91046N81589R44508N16178Q63293
$$ plain form
16765 23465737 23996118 25158048 26124155 27030375 27987927 29623909 30591010 31847338 33263130
16756 33263130 34340274 35924652 37549115 39372501 40645938 42803327 44663941 46751744
16748 46751744 49034165 51398811 54062922 56501063 59614983 62427574 65514433 69030620
16740 69030620 72560791 76632727 80195477 84810428 89163979 93448576 98488961 103701508
16732 103701508 108963503 114453607 119728480 125483846 131468188 136716625 142072228 147497381
16724 147497381 152525798 156542170 160424268 163781201 166371437 168117291 169226047 169053098
16716 169053098 168227923 166255717 164207974 160414202 156628507 152398118 147575355 142167233
16708 142167233 136449756 131048938 125065329 119736362 113965539 108312824 103084847 98041028
$$ packed form
16765B3465737N30381J161930R66107R06220R57552J635982R67101J256328J415792
16756C3263130J077144J584378J624463J823386J273437K157389J860614K087803
16748D6751744K282421K364646K664111K438141L113920K812591L086859L516187
16740F9030620L530171M071936L562750M614951M353551M284597N040385N212547
16732A03701508N261995N490104N274873N755366N984342N248437N355603N425153
16724A47497381N028417M016372L882098L356933K590236J745854J108756j72949
16716A69053098q25175j972206k047743l793772l785695m230389m822763n408122
16708A42167233n717477n400818n983609n328967n770823n652715n227977n043819
$$ plain form
16700 98041028 92974399 88255250 84244997 79293569 75744748 71803165 68325727 64919821
16692 64919821 61551600 58498581 55709783 53294640 50368132 48250894 45961348 44315803
16684 44315803 41943432 40034397 38304517 36568375 35046070 33657401 32403739 31061811
16676 31061811 29752529 28392882 27595157 26647020 25344007 24760037 23809883 22617652 21914808
16667 21914808 21249056 20701935 20055350 18972846 18592965 17593436 17352212 17196448 16297197
16658 16297197 15785118 15249997 14700922 14520574 14115802 13775559 13386453 12933991 12370061
16649 12370061 12022656 11678868 11553786 11397620 11169281 10496267 10344018 9999152 9933650
16640 9933650 9615209 9590380 9061183 8991392 8865626 8484803 8383930 8135043 7782160 7902655
$$ packed form
16700I8041028n066629m719149m010253m951428l548821l941583l477438l405906
16692F4919821l368221l053019k788798k415143k926508k117238k289546j645545
16684D4315803k372371j909035j729880j736142j522305j388669j253662j341928
16676C1061811j309282j359647p97725r48137j303013n83970r50154j192231p02844
16667B1914808o65752n47121o46585j082504l79881r99529k41224j55764q99251
16658A6297197n12079n35121n49075j80348m04772l40243l89106m52462n63930
16649A2370061l47405l43788j25082j56166k28339o73014j52249l44866o5502
16640I933650l18441k4829n29197o9791j25766l80823j00873k48887l52883J20495
$$ plain form
16630 7902655 7151085 7631311 7256304 7015702 6907729 6779611 6884241 6542845 6277024
16621 6277024 6189684 6142104 5920569 5947200 5745502 5280076 5472593 5289678 5547726 5200042
16611 5200042 5261520 5159785 4995404 5097363 4528728 4852944 4543471 4484653 4506804 4338883
16601 4338883 4355509 4530039 4116723 4163461 4006114 3913352 4116412 3746215 3749346 3552848
16591 3552848 3508244 3124679 3301399 3690501 3394915 3174289 3438943 3097417 3049519 3213979
16581 3213979 3109495 2846751 2920392 2741675 2904392 2793898 2662653 3097896 2873661 2910834
16571 2910834 2600198 2441946 2440547 2495735 2484745 2483015 2135213 2479165 2579666 2057798
16561 2057798 2529042 2345183 2178261 2080063 2264599 2476748 2023749 1923616 2351224 2201130
$$ packed form
16630G902655p51570M80226l75007k40602j07973j28118J04630l41396k65821
16621F277024q7340m7580k21535K6631k01698m65426J92517j82915K58048l47684
16611E200042O1478j01735j64381J01959n68635L24216l09473n8818K2151j67921
16601D338883J6626J74530m13316M6738j57347r2762K03060l70197L131j96498
16591C552848m4604l83565J76720L89102k95586k20626K64654l41526m7898J64460
16581C213979j04484k62744P3641j78717J62717j10494j31245M35243k24235L7173
16571B910834l10636j58252j399N5188j0990j730l47802L43952J00501n21868
16561B057798M71244j83859j66922r8198J84536K12149m52999j00133M27608j50094
$$ plain form
16551 2201130 2065302 2265228 2063706 2072574 2185260 1896238 2207745 2107738 1652182 1624706
16541 1624706 1863224 1929323 1928165 1956971 1518075 1477811 1723215 1771732 1726504 1693828 1832361
16530 1832361 1821925 1429987 1534957 1466952 1729799 1755325 1771911 1447131 1218960 1557392
16520 1557392 1373182 1469669 1227433 1820832 1605190 1430875 1402321 1451307 1353087 1339032
16510 1339032 1541405 1445847 1099209 1344281 1510172 1215113 1053597 1126287 1127897 1441385
16500 1441385 1378625 1298832 1193919 852862 1153505 841915 1059660 1488962 1056090 1176987
16490 1176987 877967 949709 1050334 958990 980191 1057468 1275104 1145710 1152270 800796
16480 800796 1241583 1061282 897956 913774 825358 840010 1228778 854143 776194 846699
$$ packed form
16551B201130j35828J99926k01522Q868J12686k89022L11507j00007m55556k7476
16541A624706K38518O6099j158K8806m38896m0264K45404M8517m5228l2676J38533
16530A832361j0436l91938J04970o8005K62847K5526J6586l24780k28171L38432
16520A557392j84210R6487k42236N93399k15642j74315k8554M8986r8220j4055
16510A339032K02373r5558l46638K45072J65891k95059j61516P2690J610L13488
16500A441385o2760p9793j04913l41057L00643l11590K17745M29302m32872J20897
16490A176987k99020P1742J00625r1344K1201P7277K17636j29394O560l51474
16480H00796M40787j80301j63326J5818q8416J4652L88768l74635p7949P0505
$$ plain form
16470 846699 967879 796808 917983 779852 918176 762447 1101449 1265119 1067844 734726
16460 734726 526825 1092400 843940 843968 410394 718906 695915 1246363 983242 664934
16450 664934 1028346 1102722 766300 814086 717006 494478 595209 758587 718193 715822 704152
16439 704152 833267 733109 722843 576529 1044546 963036 555916 657136 710990 1135333
16429 1135333 511009 730999 668283 824255 833404 953585 816061 643859 812489 683594
16419 683594 539048 1008891 285185 600426 945527 861783 531089 572699 911410 419715
16408 534627 632902 451334 834397 737440 734264 622102 502007 935648 657873 691775
16398 691775 448746 319352 168913 566692 601209 657491 596592 415920 620979 591462
$$ packed form
16470H46699J21180j71071J21175j38131J38324j55729L39002J63670j97275l33118
16460G34726k07901N65575k48460K8D10394L08512k2991N50448k63121l18308
16450F64934L63412P4376l36422M7786r7080k22528J00731J63378m0394k371j1670
16439G04152J29115j00158j0266j46314M68017q1510m07120J01220N3854M24343
16429A135333E11009K19990o2716J55972R149J20181j37524j72202J68630j28895
16419F83594j44546M69843B85185L15241L45101q3744l30694M1610L38711D19715
16408E34627R8275j81568L83063r6957l176j12162j20095M33641k77775L3902
16398F91775k43029j29394j50439L97779L4517N6282o0899j80672K05059k9517
$$ plain form
16388 591462 538733 440606 393954 701378 327901 620565 464183 248669 304985 748080
16378 748080 399944 353662 388886 591340 524349 768116 492131 311168 303664 331596 411259
16367 411259 607671 409579 527192 632840 677673 525467 587768 404650 440570 284165
16357 284165 466345 289842 211768 317150 525889 172950 209060 183801 287355 426581
16347 426581 445078 408423 538661 263370 142945 316691 472555 384019 344530 204552
16337 204552 199167 357237 360972 365430 267562 209850 512095 609616 184225 86125 -99799
16325 339851 543781 72510 567856 546099 444577 319062 157954 94734 516149 466381
16315 466381 440942 332001 -76627 466195 291496 255143 146976 200883 358297 292952
$$ packed form
16388E91462n2729r8127m6652L07424C27901K92664j56382k15514N6316M43095
16378G48080l48136m6282L5224K02454o6991K43767k75985j80963p504K7932P9663
16367D11259J96412j98092J17613J05648M4833j52206O2301j83118L5920j56405
16357B84165J82180j76503p8074J05382K08739A72950L6110k5259J03554J39226
16347D26581J8497l6655J30238B63370j20425J73746J55864q8536l9489j39978
16337B04552n385J58070L735M458r7868n7712L02245R7521A84225H6125i9799
16325C39851K03930G2510M95346k1757j01522j25515A57954o3220M21415m9768
16315D66381k5439j08941g6627D66195j74699l6353j08167N3907J57414o5345
$$ plain form
16305 292952 406343 143911 75188 321131 503407 555837 172515 427619 93735 299437
16295 299437 432909 381746 225070 329888 414118 336222 222976 277674 490752 127202
16284 131406 301705 392615 186245 343106 -254151 393985 451213 268379 321963 381429
16274 381429 120712 616109 15635 270034 188267 119581 145356 325692 -56948 288455
16263 586272 -97032 52892 -178683 228158 140782 288882 106114 179733 288931 401087
16253 401087 120659 274811 208819 107770 300154 212363 211826 16745 105343 484655 285387
16242 285387 223472 332562 400079 223576 199214 326211 49934 280570 -21838 135631
16231 6582 154392 351498 318421 26727 -102197 209125 -117776 503279 223704 310724
$$ packed form
16305B92952J13391A43911o8723K45943J82276N2430A72515K55104I3735K05702
16295B99437J33472n1163j56676J04818Q4230p7896j13246N4698K13078A27202
16284A31406J70299R0910A86245J56861b54151C93985N7228j82834N3584N9466
16274C81429A20712M95397A5635K54399q1767o8686K5775J80336e6948B88455
16263E86272i7032E2892a78683B28158q7376J48100A06114P3619J09198J12156
16253D01087A20659J54152o5992j01049J92384q7791n37A6745Q8598L79312j99268
16242B85387o1915J09090O7517j76503k4362J26997D9934K30636b1838A35631
16231F582J47810J97106l3077B6727a02197B09125a17776E03279B23704Q7020
$$ plain form
16221 310724 451810 -110059 286719 93461 -109747 -141105 456897 30345 109712 146212
16211 146212 89184 -2338 91937 22963 53284 253813 243985 310345 224762 323462 282147 -314806
16198 -15897 -1440 210421 59647 -275239 214674 251942 227565 -52790 90751 80031 256587
16187 256587 127561 323726 99508 181215 -212251 130655 162724 66973 65963 -61882 149016
16175 206453 84388 -63927 -153083 49893 -197858 -132572 124362 -122577 -128375 -30081 121636
16163 99403 94349 269276 84507 240803 69613 221929 207676 231404 -191778 98166 51072
16152 51072 -115575 -131193 266742 125313 195424 397817 111050 46735 69759 -31899 -34644
16141 -34644 -98456 -77397 -48745 408414 -53305 137690 115661 156112 -21722 396007 86426
$$ packed form
16221C10724J41086a10059B86719I3461a09747l1358D56897C0345P9367L6500
16211A46212n7028b338I1937B2963L0321K00529r828O6360q5583R8700m1315c14806
16198a5897a440B10421E9647b75239B14674L7268k4377e2790I0751j0720J76556
16187B56587A27561J96165I9508Q1707b12251A30655L2069F6973j010f1882A49016
16175B06453H4388f3927q9156D9893a97858O5286A24362a22577n798c0081A21636
16163I9403n054J74927H4507J56296F9613J52316j4253K3728a91778I8166m7094
16152E1072a15575j5618B66742A25313P0111K02393A11050D6735K3024c1899k745
16141c4644o3812K1059K8652D08414e3305A37690k2029M0451b1722C96007H6426
$$ plain form
16129 112205 -169890 113700 137580 283172 -62162 331727 168088 -97648 -58476 86883
16118 62745 -83798 179475 126050 105533 378807 160901 199972 453845 162055 143699 146142
16107 146142 36812 -215329 80142 82665 -91003 -42688 246292 296276 -236295 105873 -231832
16095 112596 -17879 201038 -95169 -152146 15653 -193979 -125531 212508 -73228 -8376 113898
16083 303293 189483 46913 -44453 -8754 -118748 113223 302893 96350 24667 2104 -115366
16071 -103639 -146842 -238867 153918 263338 -86397 24455 -153871 -17946 8080 93106 -56234
16059 178116 -139181 13069 -219168 211901 -65543 -179667 4832 -48750 18719 116823 195550
16048 195550 150665 -30294 44086 -13954 88680 231249 151255 84176 265559 -135941 -148091
$$ packed form
16129A12205a69890A13700K3880J45592f2162C31727j63639i7648L9172H6883
16118F2745h3798A79475n3425k0517K73274A60901L9071K53873A62055j8356K443
16107A46142C6812b15329H0142K523i1003d2688B46292M9984b36295A05873b31832
16095A12596a7879B01038i5169n6977A5653a93979O8448B12508g3228h376A13898
16083C03293j13810D6913d4453h754j09994A13223J89670I6350B4667B104a15366
16071a03639m3203r2025A53918J09420h6397B4455a53871a7946H080Q5026e6234
16059A78116a39181A3069b19168B11901f5543j14124D832d8750A8719R8104P8727
16048A95550m4885c0294D4086a3954H8680J42569p9994o7079J81383a35941j2150
$$ plain form
16037 -148091 212059 259518 119723 220487 61638 -54112 -38254 7642 76036 -178664 125269
16025 -282643 100268 216883 -269883 49471 -48208 20614 18816 -262855 -81287 -27986 209241
16013 -19702 -33540 347063 177556 227766 101636 50945 110305 9296 -123879 10102 -12176
16001 -239544 21238 262105 -44211 -53715 127511 -8138 -48628 -107228 -6545 -48787 -100568 -247284
15989 -247284 195415 118098 -8213 231999 23841 18684 509691 230336 408382 -178999 112939
15977 160164 -135988 -35406 -120034 -71481 -106733 29443 -126414 -95088 135006 57709 174549
15966 174549 -252244 26099 -20206 -104736 161218 -247681 296860 -183654 -410199 148343
15955 -258072 71038 104712 54011 250382 277957 109648 -66971 -20701 -32459 25946 -44786
$$ packed form
16037a48091B12059M7459A19723J00764F1638e4112J5858G642O8394a78664A25269
16025b82643A00268J16615b69883D9471d8208B0614j798b62855h1287b7986B09241
16013a9702j3838C47063j69507N0210A01636n0691N9360I296a23879A0102a2176
16001b39544B1238K40867d4211r504A27511h138m0490n8600f545m2242n1781j46716
15989b47284A95415p7317h213B31999B3841n157M91007B30336J78046a78999A12939
15977A60164a35988c5406q4628M8553l5252B9443a26414L1326A35006E7709J16840
15966A74549b52244B6099b0206q4530A61218b47681B96860a83654k26545A48343
15955b58072G1038L3674n0701J96371K7575A09648f6971b0701j1758B5946d4786
$$ plain form
15943 -235057 -144301 154835 152730 -45691 -81282 -71011 256353 -197798 -295528 -65055 -91111
15932 -91111 287191 358352 252937 -380537 -178842 14427 252242 -354300 33611 -111891
15921 37069 70509 -60184 73180 -76445 -10605 -127502 134161 54905 -138650 180168 353155
15910 353155 -30346 -118208 375027 375147 175363 -154615 -9013 -3100 -316499 -174902 370799
15898 146017 26744 -20193 284633 -184647 -303372 -390474 -129805 -238881 228700 -166680
15887 254963 -72137 75854 205057 -124654 111070 -353584 52850 19134 -185464 -203087
15877 -203087 -672398 -175119 -82727 200574 -173263 -141495 -30978 -87290 30898 6040 -64976
15865 64070 -204915 -17464 84275 -14626 -113293 28198 -58407 -89753 -323082 52524 -231027
$$ packed form
15943b35057R0756A54835k105d5691l5591J0271B56353a97798r7730f5055k6056
15932i1111B87191P1161j05415c80537a78842A4427K37815c54300C3611a11891
15921C7069L3440f0184G3180g6445a0605j16897A34161E4905a38650A80168J72987
15910C53155c0346q7862C75027J20A75363a54615i013c100l13399J41597C70799
15898A46017B6744b0193B84633a84647j18725q7102a29805j09076B28700a66680
15887B54963g2137G5854J29203a24654A11070c53584E2850A9134a85464j7623
15877b03087m69311a75119h2727B00574a73263L1768c0978n6312C0898F040f4976
15865F4070b04915a7464H4275a4626r8667B8198e8407l1346k33329E2524b31027
$$ plain form
15853 61790 -155120 -102939 110078 -227193 312626 355057 -83036 -110848 25310 257057 -59574
15841 230306 119042 -84498 -211874 21240 -49361 -220329 21812 -59392 -79003 -104757 41069
15829 -50398 3941 80445 -84975 -70332 -253398 -285834 -118792 -107375 -67323 88526 1790 -108520
15816 -82366 -243296 121930 -199874 180291 -67212 -332332 176812 65660 -69514 265969
15805 -143687 253590 -349198 72370 153902 -84627 157066 -116792 94517 -214547 -107205
15794 -103107 187343 291628 28005 -60375 -56486 -298559 -116000 -6245 -95977 237602 -160008
15782 -181175 -316427 882 -274324 7195 -264345 252456 -3414 -78685 -41063 188327 140182
15771 140182 -384159 7844 -551095 216051 -192398 72820 -308349 49994 485976 -120384
$$ packed form
15853F1790a55120N2181A10078b27193C12626M2431h3036k7812B5310K31747e9574
15841B30306j11264h4498j27376B1240d9361j70968B1812e9392j9611k5754D1069
15829e0398C941P6504h4975J4643j83066l2436a18792J1417M0052H8526A790a08520
15816h2366j60930A21930a99874A80291f7212k65120A76812F5660f9514B65969
15805a43687B53590c49198G2370Q1532h4627A57066a16792I4517b14547a07205
15794a03107A87343J04285B8005f0375L889k42073a16000f245q9732B37602a60008
15782a81175j35252H82b74324G195b64345B52456c414p5271L7622A88327m8145
15771A40182c84159G844e51095B16051a92398G2820c08349D9994M35982a20384
$$ plain form
15760 -123243 403430 211719 -209868 247629 172106 277115 18284 -303947 -254937 -50404
15749 113753 105946 -180742 181310 95871 333216 43372 164260 -67148 -30348 -102442 -60819
15738 -60819 -210872 -248949 61750 -74481 74983 -30710 22447 161654 -219163 209337 -171111
15726 111004 -97388 -40993 -149947 24096 -140590 -64167 29805 -94759 158607 -10352 -187844
15715 -187844 -252380 275724 -97332 17381 -12187 -32955 -176484 -92754 -323622 -3763 -304889
15704 -304889 395783 143252 59721 -15899 -7427 140725 57444 -170122 -20964 -41594 61821
15692 -28275 152918 181717 224652 -79133 84966 -215951 -21774 -511899 -131003 188474 185115
15681 185115 126996 -389402 -204566 233993 252463 54690 238308 181772 -74931 86385 -238963
$$ packed form
15760a23243D03430j91711b09868B47629p5523J05009A8284c03947M9010e0404
15749A13753p807a80742A81310q5439K37345D3372J20888f7148c0348p2094M1623
15738f0819j50053l8077F1750g4481G4983c0710B2447J39207b19163B09337a71111
15726A11004i7388d0993j08954B4096a40590f4167B9805i4759A58607a0352j77492
15715a87844o4536B75724i7332A7381a2187k0768j43529Q3730k30868c763l01126
15704c04889C95783A43252E9721a5899g427A40725E7444a70122b0964k0630F1821
15692b8275A52918K8799M2935g9133H4966b15951b1774m90125a31003A88474l359
15681A85115n8119c89402J84836B33993J8470E4690J83618n6536g4931H6385b38963
$$ plain form
15669 190285 -38313 -20142 151624 -71422 90126 30949 -39571 -136939 143830 17550 -33877
15657 52310 384356 143374 -187204 -204318 87322 -238665 -100351 -153461 211158 -312843
15646 114189 -229380 76758 170409 -152309 84238 279237 34635 264155 -295463 41458
15635 -194910 507469 -136647 316140 -135934 -55113 -231369 210808 320992 -60631 -185685
15625 -185685 181616 176976 -326875 -355702 10219 -74623 -155824 -247673 -314811 141377 111679
15614 111679 -161875 -56608 -72175 232549 14868 95348 133870 113698 -119906 9366 -76894
15602 -203777 -322332 165703 2250 -320017 -366175 -343569 -51916 134551 96525 -41581 53419
15590 -255020 130682 -92800 -455 -32215 184859 -53577 -12035 -110485 215851 -46959 266156
$$ packed form
15669A90285c8313J8171A51624g1422I0126C0949c9571r7368A43830A7550c3877
15657E2310L32046A43374a87204j7114H7322b38665a00351n3110B11158c12843
15646A14189b29380G6758R3651a52309H4238J94999C4635K29520b95463D1458
15635a94910E07469a36647C16140a35934e5113j76256B10808J10184f0631j25054
15625a85685A81616m640c26875k8827A0219g4623q1201r1849o7138A41377k9698
15614A11679a61875e6608j5567B32549A4868Q0480L8522k0172a19906I366g6894
15602b03777j18555A65703B250c20017m6158K2606e1916A34551l8026d1581E3419
15590b55020A30682i2800d55l1760A84859e3577a2035r8450B15851d6959B66156
$$ plain form
15578 193911 -287385 -83171 97783 44380 -157439 -121601 105838 -225101 164865 341061
15568 341061 -33730 -8592 70455 -183210 319398 21025 -79415 228298 78586 100816 -192090
15556 -141321 61659 43027 236831 129362 140650 -294631 -186808 107345 229507 -270908
15545 -94277 -73759 -8133 -107834 -28101 88939 -177436 127221 -121861 183354 45511 51162
15534 51162 -84822 -232455 302399 -309982 -114573 -169798 377004 -199776 5215 -308503
15523 -16995 -131988 42655 -139525 -137851 190225 88516 -47866 -47570 -16804 -52490 -120735 -219980
15511 -219980 72922 -40560 -373058 -140542 280863 146766 129634 12516 77593 -216771
15500 -495366 -113255 350746 -60542 -73616 56553 -96537 28654 -75263 -204481 -107257 121334
$$ packed form
15578A93911b87385h3171I7783D4380a57439L5838A05838b25101A64865J76196
15568C41061c3730h592G0455a83210C19398B1025g9415B28298G8586K2230a92090
15556a41321F1659j8632J93804j07469J1288b94631J07823A07345J22162b70908
15545i4277K0518h133r9701b8101H8939a77436A27221a21861A83354D5511N651
15534E1162h4822j47633C02399c09982a14573n5225C77004a99776E215c08503
15523a6995j14993D2655a39525J674A90225H8516d7866K96a6804l5686o8245r9245
15511b19980G2922d0560l32498a40542B80863j34097j7132A2516O5077b16771
15500d95366a13255C50746f0542j3074E6553i6537B8654g5263j29218R7224A21334
$$ plain form
15488 119186 58948 -99519 268075 -31045 -172996 165448 -90411 93783 17504 -93995 149478
15476 86638 49937 212677 245237 124378 -110 166073 -42281 109722 -127987 -224647 38460
15464 -92755 -140910 30770 -20701 318074 -134557 266854 -92943 216059 268912 -276982 200137
15452 260959 12324 -108421 49991 21578 -148569 -278759 -255208 53652 34923 -52872 -194683
15441 -194683 -214290 265943 -396089 16044 107570 16003 -41807 -122175 162689 -139735 10311
15429 -35893 -7291 167807 -52732 118662 -52979 -21840 73687 72010 -404720 101981 10705
15417 93618 211854 220480 -302149 -262714 407689 90156 -50703 -13266 159408 181255 -55639
15405 -2424 94303 82998 -110351 -74051 -75223 -102131 -209100 17285 -28137 -190551 -113957
$$ packed form
15488A19186E8948i9519B68075c1045j41951A65448i0411I3783A7504i3995A49478
15476H6638l6701J62740L2560j20859a10A66073d2281A09722a27987r6660C8460
15464i2755m8155C0770b0701C18074a34557B66854i2943B16059N2853b76982B00137
15452B60959A2324a08421D9991B1578a48569j30190K3551E3652j8729e2872j41811
15441a94683j9607B65943c96089A6044R1526A6003d1807q0368A62689a39735A0311
15429c5893g291A67807e2732A18662e2979b1840G3687j677d04720A01981A0705
15417I3618J18236Q626c02149L9435D07689I0156e0703a3266A59408K1847e5639
15405b424I4303j1305a10351L6300j172k6908j06969A7285b8137j62414P6594
$$ plain form
15394 -113957 -22476 -215177 86061 73539 -285563 -163951 -93188 -109774 -122764 -169349 -48264
15382 -114444 -59503 -112297 -64837 235545 66274 26908 -120304 175609 96533 -104561 -67331
15371 -67331 252216 -221381 70529 370773 77014 -49430 15559 29685 -109391 -82818 -45373
15360 -45373 21063 -100851 165397 -182373 -149102 -65597 -168254 -19028 -45929 196084 -216615
15348 -78504 -28821 140559 -279439 -125488 104221 206055 157603 254384 332650 -255559
15337 -210576 308771 -20512 -102968 -126835 47989 -135502 84725 -237058 73711 -36690 373226
15325 140580 24676 -264594 172952 -375732 -146713 421469 255999 -137386 205533 116021
15315 116021 64308 -54595 16902 157945 3448 436770 120231 -81191 -242124 12478 135740
$$ packed form
15394a13957b2476j92701H6061j2522b85563J21612P0763j6586j2990m6585d8264
15382a14444N4941n2794M7460B35545F6274B6908a20304A75609p9076a04561L7230
15371f7331B52216b21381G0529L00244G7014d9430A5559J4126a09391K6573L7445
15360d5373B1063a00851A65397a82373L3271f5597j02657a9028k6901A96084b16615
15348g8504b8821A40559b79439a25488A04221J01834m8452R6781P8266b55559
15337b10576C08771b0512q2456k3867D7989a35502H4725b37058G3711c6690C73226
15325A40580B4676b64594A72952c75732a46713D21469j65470a37386B05533q9512
15315A16021n1713e4595A6902J41043C448M33322A20231h1191j60933A2478J23262
$$ plain form
15304 135740 234599 -61560 175614 -93413 -90402 -165184 54783 152601 230425 -240789 345442
15292 172223 302124 -14137 167458 -168712 -205158 -165372 -122664 -257091 -151532 -56957
15281 304596 -141119 123321 126432 223189 343646 117307 -185277 309680 89485 -220374
15270 86746 21495 53302 81041 -139547 -134183 181435 -532016 -288109 102771 -56799 116691
15258 155985 328790 267356 102467 -67398 16158 238994 332524 295312 969945 1143944
15248 1143944 535220 1244903 1378837 615423 439002 -29678 -78829 188251 -107793 78559
15237 73547 -332021 331328 370980 307588 89801 -144507 275184 -100466 -121288 -107662 -256799
15226 -256799 -382060 225246 376785 218159 238920 56519 259582 -172319 359736 -36741
$$ packed form
15304A35740R8859f1560A75614i3413L011p4782E4783R7818P7824b40789C45442
15292A72223J29901a4137A67458a68712l6446L9786M2708j34427J05559e6957
15281C04596a41119A23321L111R6757J20457A17307a85277C09680H9485b20374
15270H6746B1495L1807K7739a39547N364A81435e32016K43907A02771e6799A16691
15258A55985J72805o1434A02467f7398A6158K22836R3530l7212O74633J73999
15248A143944E35220P09683J33934F15423j76421b9678m9151A88251a07793G8559
15237G3547c32021C31328L9652o3392H9801a44507B75184a00466k0822J3626j49137
15226b56799j25261B25246J51539j58626K0761E6519K03063a72319C59736c6741
$$ plain form
15215 202716 426566 94361 -20400 -143148 -52541 95377 36637 92700 -11920 -21104 -164330
15204 -164330 -45723 -59571 -17850 292465 14118 -12745 -43820 117910 -3736 -2899 -23472 -91226
15192 -91226 227325 -98380 140015 161163 141605 -52420 223463 369046 -230752 62336 77249
15181 77249 -4209 -210243 -74995 -12616 44316 210178 45335 -115918 93137 107157 -57574
15169 171549 -143944 353234 203526 -177046 20780 90211 361011 296582 143963 194559
15159 194559 -290364 74788 281779 323447 -76189 174423 602137 372028 283425 314277
15149 314277 148218 207686 -14491 162129 -268876 281086 -274329 28203 134967 75941
15139 75941 34290 -68482 143009 381182 332613 86456 44809 134943 175485 339006 512059
$$ packed form
15215B02716K23850I4361b0400j22748e2541I5377C6637N6063a1920r184j43226
15204a64330d5723j3848a7850B92465A4118a2745l1075A17910c736Q37k0573o7754
15192i1226B27325i8380A40015K1148j9558e2420B23463J45583b30752F2336J4913
15181G7249d209k06034g4995a2616D4316J65862D5335a15918I3137J4020e7574
15169A71549a43944C53234j49708a77046B0780O9431K70800o4429A43963N0596
15159A94559b90364G4788K06991M1668g6189A74423M27714k30109q8603L0852
15149C14277A48218N9468a4491A62129b68876B81086b74329B8203J06764n9026
15139G5941C4290f8482A43009K38173m8569H6456m1647R0134M0542J63521J73053
$$ plain form
15128 512059 328598 130704 132244 -132071 141577 328225 88794 73183 107828 112956 -174614
15116 -2553 -226068 8061 -76899 47883 13055 74133 -48481 21717 49094 -66995 -77051 42384
15103 37282 436372 -45160 55596 -41185 115578 -10685 79929 104159 116956 400465 119002
15091 163881 -85036 144631 -97704 252942 -146622 115247 203867 359267 8110 175550
15081 175550 159615 133576 20237 9421 -188935 -80730 41538 45057 288367 -137668 163324
15069 320999 145334 220709 44468 276642 -75459 172267 -46963 53047 37422 425658 333696
15058 333696 -106685 96352 73081 -66232 102098 93959 427331 82154 136607 144913 247431
15047 247431 210838 300401 144528 483786 432702 234210 -41987 171867 278514 -3637 -162486
$$ packed form
15128E12059j83461A30704J540a32071A41577J86648H8794j5611L4645N128a74614
15116b553k23515H061g6899D7883A3055O1078d8481B1717K7377f6995j0056D2384
15103C7282L99090d5160E5596d1185A15578a0685G9929K4230J2797K83509A19002
15091A63881h5036A44631i7704B52942a46622A15247Q8620J55400H110J67440
15081A75550j5935k6039B0237I421a88935h0730D1538L519K43310a37668A63324
15069C20999A45334P5375D4468K32174g5459A72267d6963E3047j5625L88236r1962
15058C33696a06685I6352k3271f6232A02098q139L33372H2154N4453Q306J02518
15047B47431l6593Q9563A44528L39258n1084j98492d1987A71867J06647c637j58849
$$ plain form
15036 -162486 265050 237949 204044 -139361 426721 207250 68069 176279 -84640 216181
15025 397488 191111 245159 69134 103515 -22074 266513 2862 -74878 431492 173236 106866
15014 106866 328344 133123 -35813 364952 615148 259627 349264 197109 295394 197593
15004 197593 55700 291470 230213 368191 210166 327874 316105 180548 403252 263912
14994 263912 8544 130909 450887 370991 -178 411638 358140 357551 227507 288372 -34394 49227
14981 183470 96 90269 -10185 163465 271793 99737 99151 31118 218745 104575 323960
14970 323960 102943 -144957 252743 -78370 335019 177187 187736 289108 226940 390030
14960 390030 313223 358710 162668 523174 -53639 32814 138299 -35898 185674 347073
$$ packed form
15036a62486B65050k7101l3905a39361D26721B07250F8069J08210h4640B16181
15025C97488A91111N4048F9134L4381b2074B66513B862g4878D31492A73236o6370
15014A06866K21478A33123c5813C64952K50196B59627Q9637j52155R8285r7801
15004A97593E5700K35770o1257J37978j58025J17708j1769j35557K22704j39340
14994B63912H544J22365L19978p9896a78D11638n3498n89j30044O0865c4394D9227
14981A83470I6R0173a0185A63465J08328I9737n86C1118J87627A04575K19385
14970C23960A02943a44957B52743g8370C35019j57832J0549J01372o2168J63090
14960C90030p6807M5487A62668L60506e3639C2814J05485c5898A85674J61399
$$ plain form
14950 347073 285441 332689 297522 550115 78435 186441 42934 278933 352332 93743 197032
14939 197032 234348 278752 49589 425720 275888 -11897 85602 178390 360825 485161 233532
14927 195583 142131 230022 357572 169808 277026 257763 564566 215556 -12218 282511
14916 526717 411841 502015 224498 223823 294724 414486 199603 133482 235289 363912 324627
14905 324627 -239210 284612 227645 -60224 70921 212087 347155 488180 490854 286162
14895 286162 322091 242414 133914 244497 291943 223989 340842 334161 87075 284398 215441
14884 215441 488496 345233 303080 356797 226085 234994 321579 261189 199234 564806 437905
14873 437905 308347 378481 165917 512534 606477 353999 294921 324236 443042 397830
$$ packed form
14950C47073o1632M7248l5167K52593G8435J08006D2934K35999P3399I3743J03289
14939A97032L7316M4404D9589L76131j49832a1897H5602R2788J82435J24336B33532
14927A95583n3452Q7891J27550A69808J07218j9263L06803B15556a2218B82511
14916E26717j14876R0174B24498o75P0901J19762A99603o6121J01807J28623l9285
14905C24627b39210B84612n6967f0224G0921J41166J35068J41025K674k04692
14895B86162L5929p9677j08500J10583M7446o7954J16853o681H7075J97323o8957
14884B15441K73055j43263m2153N3717j30712Q909Q6585o0390o1955L65572j26901
14873D37905j29558P0134A65917L46617R3943k52478n9078K9315J18806m5212
$$ plain form
14863 397830 194329 407456 234664 424338 429087 219310 160409 597475 517709 220775
14852 257941 133737 390131 201611 608469 397333 334462 445031 296866 254464 145404
14842 145404 413357 393348 231424 313206 595314 498454 551787 360867 249159 372770
14832 372770 365971 338150 538472 516139 182264 452159 534561 334430 395381 363394 495308
14821 495308 315489 431093 367734 258990 103395 518352 461497 540728 913859 293058
14810 487482 477108 153814 461986 486057 473537 535113 447531 937215 534149 326674
14800 326674 487280 517347 588892 517071 459667 834425 568494 314248 542580 687871
14790 687871 566649 622530 416167 314019 535015 643155 212772 544358 326049 586892
$$ packed form
14863C97830A94329K13127j72792J89674M749k09777n8901M37066p9766B20775
14852B57941j24204K56394j88520M06858k11136o2871J10569j48165m2402j09060
14842A45404K67953k0009j61924Q1782K82108r6860N3333j90920j11708J23611
14832C72770o799k7821K00322k2333A82264K69895Q2402k00131O0951l1987J31914
14821D95308j79819J15604o3359j08744A03395M14957n6855P9231L73131B93058
14810D87482j0374A53814L08172K4071j2520O1576q7582M89684m03066k07475
14800C26674J60606L0067P1545p1821n7404L74758k65931k54246K28332J45291
14790F87871j21222N5881k06363j02148K20996J08140B12772L31586k18309K60843
$$ plain form
14780 586892 459037 778502 440485 703171 519864 992827 598822 667029 240797 666503
14770 666503 515389 678698 667558 841857 471467 520857 688711 289276 755264 464917
14760 464917 478955 559107 924234 588620 526479 596971 516719 679225 583776 540379 568164
14749 568164 638930 760715 683920 656983 873351 850205 525571 560730 588703 709828 790161
14738 790161 719446 723613 674432 962483 576063 668763 529593 688812 615058 892932 799378
14727 799378 1040380 817895 674516 912184 785242 613732 782794 562628 1018455 743894
14717 743894 771909 695344 1012385 768421 530088 899713 959912 723628 576820 724999
14707 724999 1030630 877312 466646 882149 1055737 853518 672628 1132982 1021607 817881
$$ packed form
14780E86892j27855L19465l38017K62686j83307M72963l94005O8207B40797M25706
14770F66503j51114J63309j1140J74299l70390M9390J67854B89276M65988k90347
14760D64917J4038Q0152L65127l35614o2141P0492q0252J62506r5449m3397K7785
14749E68164P0766J21785p6795k6937K16368k3146l24634L5159K7973J21125Q0333
14738G90161p0715M167m9181K88051l86420R2700j39170J59219p3754K77874r3554
14727G99378K41002k22485j43379K37668j26942j71510J69062k20166M55827k74561
14717G43894K8015p6565L17041k43964k38333L69625O0199k36284j46808J48179
14707G24999L05631j53318m10666M15503J73588k02219j80890M60354j11375k03726
$$ plain form
14697 817881 786255 692818 988544 713542 499277 761153 810010 722070 874852 972399
14687 972399 1002959 624723 719381 1209890 754732 1399671 871704 653971 677133 597949
14677 597949 1118032 1008023 852078 1047859 1020771 1260975 1024071 1292914 838440 1004140
14667 1004140 876189 1111534 965061 1050000 1425776 833709 1111676 766405 1199065 1199331
14657 1199331 1283486 1002597 910366 1199001 1094277 1326516 1094550 893038 919374 1026482
14647 1026482 797964 904816 986566 1100411 1317059 851786 1109211 1404912 1304492 1377992
14637 1377992 1051422 1281286 1141197 1292363 1248822 1303839 1408158 1232305 1491938 1288429
14627 1288429 1613384 1227168 1320632 1143440 1427412 1336521 1560375 1420287 1336913 1282082
$$ packed form
14697H17881l1626r3437K95726k75002k14265K61876M8857q7940J52782R7547
14687I72399L0560l78236R4658M90509m55158O44939n27967k17733K3162p9184
14677E97949N20083j10009j55945J95781k7088K40204k36904K68843m54474J65700
14667A004140j27951K35345j46473Q4939L75776n92067K77967l45271M32660K66
14657A199331Q4155k80889r2231K88635j04724K32239k31966k01512K6336J07108
14647A026482k28518J06852Q1750J13845K16648m65273K57425K95701j00420P3500
14637A377992l26570K29864j40089J51166m3541N5017J04319j75853K59633k03509
14627A288429L24955l86216R3464j77192K83972r0891K23854j40088q3374n4831
$$ plain form
14617 1282082 1437209 1310656 1198760 1317613 1765241 1462601 1354779 1541299 1089410
14608 1089410 1403990 1194229 1799814 1398721 1744171 1251731 1907421 1867313 1514697 1875718
14598 1875718 1454468 1683813 1471031 1599591 1561237 1844362 1892444 1675880 1640918 1572774
14588 1572774 1668941 1755308 1775095 1855141 1920257 1750172 1668724 2002552 1657514 1442946
14578 1442946 2322592 1740765 1924980 1723229 1926271 1935711 1802010 2181603 1921996 1980669
14568 1980669 1961364 2177895 2360091 2543632 2409032 2490545 2741085 2585914 2823858 2726137
14558 2726137 2780539 2667819 3062089 3436442 3610566 3727756 4283105 4958399 5921702 7624278
14548 7624278 11781846 21536282 44654067 41028284 17683897 7616152 4452686 2983690
$$ packed form
14617A282082J55127j26553j11896J18853M47628l02640j07822J86520m51889
14608A089410L14580k09761O05585m01093L45450m92440O55690m0108l52616L61021
14598A875718m21250K29345k12782J28560l8354K83125M8082k16564l4962o8144
14588A572774R6167Q6367J9787Q0046O5116j70085q1448L33828l45038k14568
14578A442946Q79646n81827J84215k01751K03042R440j33701L79593k59607N8673
14568A980669j9305K16531J82196J83541j34600Q1513K50540j55171K37944r7721
14558B726137N4402j12720L94270L74353J74124J17190N55349O75294R63303J702576
14548G624278M157568R754436K3117785l625783A7683897G616152l163466j468996
$$ plain form
14540 2983690 2283116 1975837 2129341 1941119 2032072 2096865 2180268 1925171 2115406 1924564
14530 1924564 2201303 2332047 2077722 2462041 2079937 2375342 2369765 2782620 2446620 2526225
14520 2526225 2615028 2433734 2631555 2545926 2537925 2505121 2822247 2552120 2807049 2694641
14510 2694641 3009597 3106273 2846795 3093974 2807713 2814368 3107481 2787109 3237307 3088338
14500 3088338 2930369 3049903 2725012 2853975 2948604 3354671 2903482 3177888 3275201 3374909
14490 3374909 3314515 3165561 3407137 3229720 3583759 3564175 3480682 4024714 3872326 3926278
14480 3926278 4236861 3916266 4167594 3917001 3890175 4207304 3929190 4091452 4129798 4213888
14470 4213888 4539140 4618589 4207915 4268927 4454268 4339804 4718076 4952648 4469777 4892257
$$ packed form
14540B983690p00574l07279J53504j88222R0953O4793Q3403k55097J90235j90842
14530A924564K76739J30744k54325L84319l82104K95405n577M12855l36000P9605
14520B526225Q8803j81294J97821q5629q001l2804L17126k70127K54929j12408
14510B694641L14956R6676k59478K47179k86261O655K93113l20372M50198j48969
14500C088338j57969J19534l24891J28963R4629M06067m51189K74406R7313R9708
14490C374909o0394j48954K41576j77417L54039j9584q3493N44032j52388N3952
14480C926278L10583l20595K51328k50593k6826L17129k78114J62262L8346Q4090
14470D213888L25252P9449m10674O1012J85341j14464L78272K34572m82871M22480
$$ plain form
14460 4892257 4526311 4993414 4950860 4871778 4778517 5052663 5112956 4984721 4856043 5273312
14450 5273312 5301682 5331943 5302618 5381651 5509791 5512471 5427960 5821276 5716497 5843494 5792837
14439 5792837 6337332 6256235 6229124 6667320 6508652 6396581 6503813 6940922 6785870 6751524
14429 6751524 6665701 7084043 7150454 7172733 7612539 7444427 7473463 7720146 7968449 8027555
14419 8027555 7925534 8121270 8143624 8638205 8913876 8786001 8579445 9132461 9080684 9029193
14409 9029193 9219811 9432689 9650062 9486690 9901442 9934989 9895204 10429952 10616949 10599248
14399 10599248 10990554 10899566 11197076 10994864 11315004 11922789 11545980 12090268 12223341
14390 12223341 12517505 12618088 12790862 13012684 13455296 13629560 13851858 13938807 14453120
$$ packed form
14460D892257l65946M67103m2554p9082r3261K74146O0293j28235j28678M17269
14450E273312K8370L0261k9325P9033J28140K680q4511L93316j04779J26997n0657
14439E792837N44495q1097k7111M38196j58668j12071J07232M37109j55052l4346
14429F751524q5823M18342O6411K2279M39806j68112K9036K46683K48303N9106
14419H027555j02021J95736K2354M94581K75671j27875k06556N53016n1777n1491
14409I029193J90618K12878K17373j63372M14752L3547l9785N34748J86997j7701
14399A0599248L91306r0988K97510k02212L20140O07785l76809N44288J33073
14390A2223341K94164J00583J72774K21822M42612J74264K22298Q6949N14313
$$ plain form
14381 14453120 14363836 14835305 14690981 15405580 15641646 15917624 16276859 16366447 16925840 17356287
14371 17356287 17564843 17628299 18264881 18534309 18970129 19559172 20167772 20048739 20366985
14362 20366985 21035270 21324806 22052618 22328592 23200001 23089634 24119175 24384701 25286773
14353 25286773 25684040 26478534 27206265 27591798 28169057 29137276 29429902 30697044 31153167
14344 31153167 32170133 32791608 33874752 34432480 35677022 36719614 37641694 38512410 39871817
14335 39871817 40821514 42063914 43475372 44728666 46282187 47444554 49094584 50731509
14327 50731509 51914508 54231678 56037083 57230998 59668627 61711603 63505652 66243339
14319 66243339 68433152 70643793 73644974 76644725 79585017 82595394 85464994 89323321
$$ packed form
14381A4453120q9284M71469j44324P14599K36066K75978L59235Q9588N59393M30447
14371A7356287K08556O3456O36582K69428M35820N89043O08600j19033L18246
14362B0366985O68285K89536P27812K75974Q71409j10367J029541K65526R02072
14353B5286773L97267P94494P27731L85533N77259R68219K92626J267142M56123
14344C1153167J016966O21475J083144N57728J244542J042592R22080Q70716J359407
14335C9871817R49697J242400J411458J253294J553521J162367J650030J636925
14327E0731509J182999K317170J805405J193915K437629K042976J794049K737687
14319F6243339K189813K210641L001181K999751K940292L010377K869600L858327
$$ plain form
14311 89323321 93066197 96520122 100543923 105201212 109610701 114506192 119371322 124911434
14303 124911434 130838798 136464077 143175499 150267246 157376544 165165273 173214850 182013467
14295 182013467 191265403 200986337 211482137 222358341 233991262 245865505 258521598
14288 258521598 271619173 285124571 299351920 313520439 328737219 343698382 358631371
14281 358631371 373651980 388582363 402881612 416220957 428760313 440287993 449554915
14274 449554915 457302637 462858583 464894123 464877188 463616086 459146099 454506320 448862799
14266 448862799 440041890 429300259 417365097 403978132 389684382 374484888 359066918
14259 359066918 343337303 327731449 312175375 297858670 283482394 269532252 255872118
$$ packed form
14311H9323321L742876L453925M023801M657289M409489M895491M865130N540112
14303A24911434N927364N625279O711422P091747P109298P788729Q049577Q798617
14295A82013467R251936R720934J0495800J0876204J1632921J1874243J2656093
14288B58521598J3097575J3505398J4227349J4168519J5216780J4961163J4932989
14281C58631371J5020609J4930383J4299249J3339345J2539356J1527680R266922
14274D49554915P747722N555946K035540j6935j261102m469987m639779n643521
14266D48862799q820909j0741631j1935162j3386965j4293750j5199494j5417970
14259C59066918j5729615j5605854j5556074j4316705j4376276j3950142j3660134
$$ plain form
14252 255872118 243327292 231390334 219474777 208616606 198429101 188610475 179693907
14245 179693907 171158172 162823801 155430455 148139850 141215284 134720558 128400523 123249119
14237 123249119 118025046 112730454 108200084 103359455 99194790 95156760 91744305 87993017
14229 87993017 84425401 81098018 78196381 74976439 72233302 69606012 67305336 64587709
14221 64587709 62403406 60881477 58692631 56583293 54736579 52708807 51313450 49880156
14213 49880156 48566862 46898765 45542941 43842062 42942108 41635566 41009949 39874145
14205 39874145 38624526 37383171 36090817 34824661 34615170 33661288 32737012 31736770
14197 31736770 30860997 30231296 29174829 29253688 28111080 27516483 26773704 25935456 25432684
$$ packed form
14252B55872118j2544826j1936958j1915557j0858171j0187505r818626q916568
14245A79693907q535735q334371p393346p290605o924566o494726o320035n151404
14237A23249119n224073n294592m530370m840629m164665m038030l412455l751288
14229H7993017l567616l327383k901637l219942k743137k627290k300676k717627
14221F4587709k184303j521929k188846k109338j846714k027772j395357j433294
14213D9880156j313294j668097j355824j700879q99954j306542o25617j135804
14205C9874145j249619j241355j292354j266156k09491r53882r24276j000242
14197C1736770q75773o29701j056467P8859j142608n94597p42779q38248n02772
$$ plain form
14188 25432684 24742174 24354217 23570608 23230118 22605372 21907721 21720966 21334044 20536472
14179 20536472 20404727 19823371 19532931 19010970 18597227 18401742 17930932 17564244 17498317
14170 17498317 16682648 16450190 16075957 15881415 15294426 15401183 14883397 15158006 14765714
14161 14765714 14308254 14034683 13739678 13698450 13222593 13174377 12785939 12850565 12335778 12072637
14151 12072637 12055822 12013772 11837955 11658998 11486415 11005593 10796367 10775971 10296631 10556362
14141 10556362 10110153 10226807 10008725 9999325 9325208 9462700 9388287 9297409 8914875 8796861
14131 8796861 8803157 8709106 8795723 8328039 8280860 8067458 8358690 7952736 8062011 8154189
14121 8154189 7966622 7735822 7264122 7463288 7396072 6856233 7385043 7239086 7137638 6798906
$$ packed form
14188B5432684o90510l87957p83609l40490o24746o97651j86755l86922p97572
14179B0536472j31745n81356k90440n21961m13743j95485m70810l66688o5927
14170A7498317q15669k32458l74233j94542n86989J06757n17786K74609l92292
14161A4765714m57460k73571k95005m1228m75857m8216l88438O4626n14787k63141
14151A2072637j6815m2050j75817j78957j72583m80822k09226k0396m79340K59731
14141A0556362m46209J16654k18082r400o74117J37492p4413r0878l82534j18014
14131H796861O296r4051Q6617m67684m7179k13402K91232m05954J09275R2178
14121H154189j87567k30800m71700J99166o7216n39839N28810j45957j01448l38732
$$ plain form
14111 6798906 6708532 6389837 6637852 6695854 6392584 6541685 6275276 6288834 6233402 6206841
14101 6206841 5783081 5786100 5834603 5598116 5676389 5804736 5576977 5506979 5626972 5516582
14091 5516582 5153496 5265956 5091374 5256097 5124362 5010023 5071088 5003836 4951781 4760836
14081 4760836 4928947 4856552 4416663 4841992 4696655 4752420 4208932 4603377 4120324 4414836
14071 4414836 4161281 4333443 4151837 4417558 4229914 3884017 4315721 4092671 3725211
14062 3725211 3772921 3988077 3948308 4052896 4089079 3870318 4001871 3635485 3828276 3444248
14052 3444248 4010422 3735583 3625372 3414926 3554729 3510911 3579323 3316920 3588891 3241176
14042 3241176 3423642 3353636 3002520 3330561 3609168 3383572 3123286 2936790 2934883 3123136
$$ packed form
14111F798906r0374l18695K48015N8002l03270J49101k66409J3558n5432k6561
14101F206841m23760L019M8503k36487P8273J28347k27759o9998J19993j10390
14091E516582l63086J12460j74582J64723j31735j14339O1065o7252n2055j90945
14081D760836J68111p2395m39889M25329j45337N5765n43488L94445m83053K94512
14071D414836k53555J72162j81606K65721j87644l45897M31704k23050l67460
14062C725211M7710K15156l9769J04588L6183k18761J31553l66386J92791l84028
14052C444248N66174k74839j10211k10446J39803m3818O8412k62403K71971l47715
14042C241176J82466p0006l51116L28041K78607k25596k60286j86496j907J88253
$$ plain form
14032 3123136 3057644 2974268 2989899 2967775 2867467 2729500 2846480 2953060 2714264 2826229
14022 2826229 2516847 2553704 2733862 2772650 2667915 2702879 2697395 2702434 2589011 2526170 2658285
14011 2658285 2541349 2517798 2382664 2304984 2433405 2295606 2438340 2054617 2150692 2342853
14001 2342853 1956464 2237205 2119801 2074485 2165832 2043999 2021409 1948147 2360841 2595497
13991 2595497 2415689 2989694 3788146 6155402 13521153 34814514 43699992 23803757
13983 23803757 12008746 7806986 5886028 4704722 4013784 3532953 3126603 3103755 2993151
13974 2993151 2643741 2813468 2755513 2642133 2413240 2305650 2551649 2072256 2477607 2437499
13964 2437499 2268528 2509145 2079175 2236141 2333041 2138622 2060657 1927934 2027049 1914366
$$ packed form
14032C123136o5492q3376J5631k2124j00308j37967J16980J06580k38796J11965
14022B826229l09382L6857J80158L8788j04735L4964n484N039j13423o2841J32115
14011B658285j16936k3551j35134p7680J28421j37799J42734l83723R6075J92161
14001B342853l86389K80741j17404m5316R1347j21833k2590p3262M12694K34656
13991B595497j79808N74005P98452K367256P365751K1293361Q885478j9896235
13983B3803757j1795011m201760j920958j181306o90938m80831m06350k2848j10604
13974B993151l49410J69727n7955j13380k28893j07590K45999m79393M05351m0108
13964B437499j68971K40617m29970J56966R6900j94419p7965j32723R9115j12683
$$ plain form
13954 1914366 2125339 1687896 2068076 2118572 1842166 1978883 1850518 2111045 1857993 2163525
13944 2163525 1898488 1956708 1765777 1832981 1649003 1838969 1482313 1761764 1658801 1679406
13934 1679406 1861061 1662629 1579449 1737031 1775115 1730764 1604043 1472461 1541044 1411305
13924 1411305 1484873 1446081 1654491 1632988 1675744 1672321 1293129 1515282 1510122 1481957 1395270
13913 1395270 1373455 1353872 1426164 1767560 1717040 1295986 1198350 1352432 1341112 1618193
13903 1618193 1174466 1354664 1478980 1514174 1357859 1180096 1541281 1561143 1328312 1342620
13893 1342620 1399786 1331912 1297159 924647 1381506 1115137 887702 1178501 1069246 1362938
13883 1362938 1176292 1347985 1390627 1231827 1149827 927989 1480154 1337462 1116603 1104201
$$ packed form
13954A914366K10973m37443L80180N0496k76406J36717j28365K60527k53052L05532
13944B163525k65037N8220j90931O7204j83978J89966l56656K79451j02963K0605
13934A679406J81655j98432q3180J57582L8084m4351j26721j31582O8583j29739
13924A411305P3568l8792K08410k1503M2756l423l79192K22153n160k8165q6687
13913A395270k1815j9583P2292L41396n0520m21054r7636J54082j1320K77081
13903A618193m43727J80198J24316L5194j56315j77763L61185J9862k32831J4308
13893A342620N7166o7874l4753l72512M56859k66369k27435K90799j09255K93692
13883A362938j86646J71693M2642j58800q2000k21838N52165j42692k20859j2402
$$ plain form
13873 1104201 1509002 1224460 956216 1088639 874387 869438 957218 1085456 1178297 1250771
13863 1250771 1135803 1197038 1168780 1164456 1009590 1357372 1332094 1191856 1094661 1080692 1025824
13852 1025824 1107122 942721 1063875 779346 1151743 859738 1429365 1032900 1089487 1042891
13842 1042891 1078923 1192135 857027 1024083 1144237 752062 944950 972172 938462 1215232
13832 1215232 968440 1020407 980002 971649 1182550 845588 1004611 1050282 941750 1031174
13822 1031174 852689 1016635 993481 605780 812968 869678 1015244 907765 319161 928340
13812 928340 831285 559278 870331 616102 1130554 1050031 935625 521431 868854 709477
13802 709477 1201586 472358 759869 529964 887193 809233 711374 567609 637569 808348
$$ packed form
13873A104201M04801k84542k68244J32423k14252m949Q7780J28238R2841P2474
13863A250771j14968O1235k8258m324j54866L47782k5278j40238r7195j3969n4868
13852A025824Q1298j64401J21154k84529L72397k92005N69627l96465N6587m6596
13842A042891L6032J13212l35108J67056J20154l92175J92888K7222l3710K76770
13832A215232k46792N1967m0405q353K10901l36962J59023M5671j08532Q9424
13822A031174j78485J63946k3154l87701K07188N6710J45566j07479C19161O09179
13812I28340r7055k72007L11053k54229N14452q0523j14406m14194L47423j59377
13802G09477M92109D72358K87511k29905L57229p7960r7859j43765O9960J70779
$$ plain form
13792 808348 1061714 771251 618025 612724 774393 496173 475264 907248 918035 821510
13782 821510 544139 956118 948976 905249 739908 907880 663228 766710 702996 405330
13772 405330 518424 821778 938551 582722 761272 676630 919318 911080 901056 735286
13762 735286 860616 759822 741493 919625 602462 869083 732143 789445 629525 750252
13752 750252 394202 720500 591973 594096 817481 764647 629858 705960 273614 643871
13742 643871 1005409 813419 506482 751220 583433 315267 683609 516839 656141 749979
13732 749979 1003298 674341 518045 356342 607957 706124 556605 589936 828617 1088449
13722 1088449 735830 208285 536917 423143 522225 751977 471057 733212 775456 650756
$$ packed form
13792H08348K53366k90463j53226n301J61669k78220k0909M31984J0787r6525
13782H21510k77371M11979p142m3727j65341J67972k44652J03482o3714k97666
13772D05330J13094L03354J16773l55829J78550q4642K42688q238j0024j65770
13762G35286J25330j00794j8329J78132l17163K66621j36940N7302j59920J20727
13752G50252l56050L26298j28527K123K23385n2834j34789P6102B73614L70257
13742F43871L61538j91990l06937K44738j67787k68166L68342j66770J39302R3838
13732G49979K53319l28957j56296j61703K51615R8167j49519L3331K38681K59832
13722A088449l52619B08285L28632j13774R9082K29752k80920K62155M2244j24700
$$ plain form
13712 650756 700503 896507 417932 440981 550683 606009 568345 561043 295003 909517 202530
13700 485911 485177 694530 538765 343678 326219 686784 645526 281385 318828 621734 379649
13689 379649 188684 653331 489072 557967 775238 387471 619906 384459 377225 273956
13679 273956 516055 1032843 265549 287464 555505 433942 486433 650281 817366 701641
13669 701641 625794 670514 618624 437775 180286 441085 426061 293327 610331 75634
13658 499067 743443 380844 226849 -4773 494401 653709 420056 691119 518382 420151
13648 420151 397076 349249 392530 254938 91690 451002 669334 292313 672446 483705
13638 483705 332703 714234 344400 804472 502754 553294 621748 679729 443327 320456
$$ packed form
13712F50756M9747J96004D17932K3049J09702N5326l7664p302k66040O14514B02530
13700D85911p34K09353j55765j95087j7459L60565m1258B81385L7443L02906k42085
13689C79649A88684M64647j64259O8895K17271C87471K32435k35447p234j03269
13679B73956K42099N16788B65549K1915K68041j21563N2491J63848J67085j15725
13669G01641p5847M4720n1890j80849A80286K60799j5024j32734L17004G5634
13658D99067K44376l62599j53995d773D94401J59308k33653K71063j72737r8231
13648D20151k3075m7827M3281j37592I1690L59312K18332B92313L80133j88741
13638D83705j51002L81531C44400M60072l01718N0540O8454N7981k36402j22871
$$ plain form
13628 320456 310932 203853 547325 430617 218847 274665 541785 239875 391925 343903
13618 343903 273490 534143 753709 535236 507291 595333 383157 227774 690690 396186
13608 396186 464409 307882 186733 623636 259532 344596 27839 163455 -121905 375433
13597 562731 633781 377282 442819 50937 378010 72524 500233 8550 238323 351667 222614
13586 222614 600592 586077 481641 -30180 169905 109088 332598 540179 51160 350214
13576 350214 56658 278695 139689 251944 607725 22182 564890 -6770 220361 590432
13566 590432 159202 31659 74027 132528 177111 263298 318576 330041 490936 324473 -202795
13554 83240 587890 156101 289581 496282 365667 423858 483664 373717 312797 142422
$$ packed form
13628C20456r524j07079L43472j16708k11770N5818K67120B39875J52050m8022
13618C43903p0413K60653K19566k18473k7945Q8042k12176j55383M62916k94504
13608C96186O8223j56527j21149M36903B59532Q5064B7839J35616a21905C75433
13597E62731P1050k56499O5537E0937L27073G2524M27709H550K29773J13344j29053
13586B22614L77978j4515j04436c0180A69905o0817K23510K07581E1160K99054
13576C50214E6658K22037j39006J12255L55781B2182N42708f770B20361L70071
13566E90432A59202C1659M2368N8501M4583Q6187N5278J1465J60895j66463b02795
13554H3240N04650A56101J33480K06701j30615N8191N9806j09947o0920A42422
$$ plain form
13543 239918 221921 119439 487353 471332 247247 671832 390562 347502 350519 325546 250086
13532 250086 109847 168428 589688 92287 334884 149617 345946 206089 368876 148213
13521 204588 434537 197401 33934 63150 240168 113161 -6230 292335 207968 305276 267627
13510 267627 368167 304848 328981 -83424 432806 159398 108194 11659 377143 542960
13500 542960 301613 239853 222829 -122280 489023 449992 74783 161275 212758 88956 141050
13489 141050 372035 366984 -3375 352867 311982 -3482 198778 513169 507371 336134 438135
13478 438135 149661 552583 357970 228141 71191 698966 214960 147154 425293 251272
13468 251272 605096 436544 415444 384059 346360 346977 406940 288318 -62025 369086 631054
$$ packed form
13543B39918j7997j02482L67914j6021k24085M24585k81270m3060L017k4973p5460
13532B50086A09847N8581M21260I2287K42597A49617J96329j39857J62787A48213
13521B04588K29949A97401C3934K9216J77018A13161f230B92335q4367R7308l7649
13510B67627J00540o3319K4133h3424D32806A59398n1204A1659L65484J65817
13500E42960k41347o1760j7024a22280D89023l9031G4783Q6492N1483H8956N2094
13489A41050K30985n051c375C52867m0885c482A98778L14391n798j71237J02001
13478D38135A49661M02922j94613j29829G1191O27775B14960o7806K78139j74021
13468B51272L53824j68552k1100l1385l7699O17N9963j18622f2025C69086K61968
$$ plain form
13457 631054 160745 293276 146652 53240 215407 262323 130572 426704 -20168 151510
13446 78703 313919 174643 -12895 512448 322852 475076 -20579 145933 311575 -102790
13435 129227 194422 188125 78058 73693 -56672 364504 200338 -150716 263549 366891 550429
13424 550429 105128 -67276 225273 334175 503291 112499 234937 364539 380776 133058
13413 312679 -29103 249731 261828 377692 224197 200818 147995 262656 -202524 120303
13402 342828 14626 46251 272737 329134 441725 328924 296009 241934 300625 -40889 384514
13390 176946 630644 452970 229308 -14460 150383 225750 77200 -26637 71401 145921 385404
13379 385404 223069 160967 423467 292135 315933 108989 483852 -78453 376030 73862
$$ packed form
13457F31054A60745J32531j46624E3240J62167M6916A30572K96132b0168A51510
13446G8703K35216j39276a2895E12448j89596J52224b0579A45933J65642a02790
13435A29227O5195o297G8058m365e6672C64504j64166a50716B63549J03342J83538
13424E50429A05128f7276B25273J08902J69116A12499J22438J29602J6237A33058
13413C12679b9103B49731J2097J15864j53495k3379n2823J14661b02524A20303
13402C42828A4626L1625K26486N6397J12591j12801l2915n4075N8691d0889C84514
13390A76946M53698j77674k23662a4460A50383P5367G7200b6637G1401P4520K39483
13379C85404j62335o2102K62500j31332K3798A08989L74863g8453C76030G3862
$$ plain form
13368 413947 163524 211482 156574 -153009 156024 -34772 436540 35770 -9411 356484 160360
13356 161856 66681 276356 -168534 42385 342667 494071 374417 54945 143057 425298
13346 425298 325295 194643 117704 393887 535286 -30705 338156 548576 268807 243243
13336 243243 385773 48983 444586 -218117 185832 72630 213642 20152 127716 593656
13326 593656 102881 125651 79367 -24066 -39202 161194 231307 539154 219642 511064
13316 511064 335725 166805 466 -4604 403740 607912 65214 47236 148253 210364 118577
13305 118577 227680 288494 28969 102307 163235 155727 182150 187330 -1549 249770 167336 253428
13293 253428 -46424 87495 -53864 239874 49417 51429 73754 114082 -31841 -9368 309450
$$ packed form
13368D13947A63524M7958n4908a53009A56024c4772D36540C5770i411C56484A60360
13356A61856F6681K09675a68534D2385L00282J51404j19654E4945Q8112K82241
13346D25298j00003j30652p6939K76183J41399c0705C38156K10420B68807k5564
13336B43243J42530D8983L95603b18117A85832G2630J41012B0152J07564M65940
13326E93656A02881K2770m6284b4066j5136A61194P0113L07847B19642K91422
13316E11064j75339A66805D66d604D03740K04172F5214j7978J01017O2111r1787
13305A18577J09103O0814B8969P3338O0928p508K6423N180a549B49770q2434Q6092
13293B53428d6424H7495e3864B39874D9417K012K2325M0328c1841i368C09450
$$ plain form
13281 348664 126861 6180 42678 113549 226575 311844 -90767 -236755 104896 202375 -78596
13269 305548 -22335 101483 41918 -24870 53840 83443 155150 -47119 92938 222813 384076
13258 384076 377622 417405 202627 7558 29092 -43893 -75415 -100664 221523 -47752 225781
13246 347156 -41716 -177497 53286 -31765 209087 -79223 38312 -139777 219648 56875 -329221
13234 60829 323104 81513 162855 192698 -22510 -25729 119565 167806 -492974 -297444 -43989
13222 101890 77656 153898 385424 99847 165253 -150019 176749 179249 183658 -112912 378920
13210 40728 319141 -53470 51709 16941 464555 -155370 59573 335544 299452 -3324 -71631
13199 -71631 451175 -133651 486393 135243 121816 36429 301102 75333 -15986 183455
$$ packed form
13281C48664A26861F180L6498P0871J13026Q5269i0767j45988A04896R7479g8596
13269C05548b2335A01483D1918b4870E3840K9603P1707d7119I2938J29875J61263
13258C84076o454L9783B02627G558K1534d3893l1522k5249B21523d7752B25781
13246C47156d1716j35781E3286c1765B09087g9223C8312a39777B19648E6875c29221
13234F0829K62275H1513Q1342K9843b2510l219A19565M8241d92974J95530d3989
13222A01890k4234P6242K31526I9847O5406a50019A76749K500M409a12912C78920
13210D0728K78413e3470E1709A6941M47614a55370E9573K75971l6092c324o8307
13199g1631D51175a33651D86393A35243j3427C6429K64673G5333a5986A83455
$$ plain form
13188 400242 98721 157361 78165 63785 264189 -208070 184120 -29446 45521 143541 242482
13177 242482 -104234 280733 333131 167919 51182 296735 -7019 144397 266030 38059
13166 101424 97555 225356 65085 287578 -356 144171 5067 17219 361550 -13973 124939
13154 52120 242571 167118 304886 338567 64020 45045 -113675 -166839 178941 393067 -54661
13142 -150196 222235 -26759 123128 179588 -120023 122719 -63371 -50224 508018 70185
13131 156961 91112 -88269 -90345 -232917 -192150 128214 276206 89216 151208 82700 -319940
13119 -235869 115374 -43458 -15737 245596 -25388 191123 160992 228657 -104578 187640
13108 135143 -143340 25214 -15775 69559 -89951 -92567 -186576 -263527 -303214 34381 -87633
$$ packed form
13188D00242I8721N8640G8165j4380K00404b08070A84120b9446D5521R8020R8941
13177B42482a04234B80733N2398j65212E1182K45553g019A44397J21633C8059
13166A01424l869J27801F5085K22493c56A44171E067J2152L44331a3973A24939
13154E2120J90451p5453J37768L3681F4020j8975a13675n3164A78941K14126e4661
13142a50196B22235b6759A23128N6460a20023A22719f3371J3147E08018G0185
13131A56961o5849h8269k076j42572M0767A28214J47992H9216O1992o8508c19940
13119b35869A15374d3458a5737B45596b5388A91123l0131O7665a04578A87640
13108A35143a43340B5214a5775F9559h9951k616r4009p6951l9687C4381h7633
$$ plain form
13096 -315661 153164 37559 -19074 386071 -250453 186445 88025 198734 -74547 145022
13085 210687 173114 -63876 35327 269558 62308 -165767 25096 -114553 50695 487360 -56747
13073 219299 -67532 229524 156772 249702 10698 154671 139451 116874 56366 175250 189703
13062 189703 99776 134285 -79160 415325 4699 -36624 188622 -188980 207787 240838 -125535
13050 318951 240884 -8527 -8470 166035 176105 93224 -92555 -275916 189525 104857 409681
13039 409681 551792 144823 -180919 57407 64298 -35747 305501 206981 210712 319227 124149
13027 252039 17875 15953 72163 324157 253965 123960 83566 17223 -125158 37738 334566
13016 334566 47485 -64320 257521 -202460 139640 348508 21465 -93682 224878 275564
$$ packed form
13096c15661A53164C7559a9074C86071b50453A86445H8025J10709g4547A45022
13085B10687l7573f3876C5327K34231F2308a65767B5096a14553E0695M36665e6747
13073B19299f7532B29524p2752R2930A0698J43973j5220k2577E6366J18884J4453
13062A89703q9927L4509g9160D15325D699c6624A88622a88980B07787L3051a25535
13050C18951p8067h527N7A66035J0070q2881i2555j83361A89525q4668L04824
13039D09681J42111A44823a80919E7407O891c5747C05501r8520L731J08515A24149
13027B52039A7875j922N6210K51994p0192A23960m0394A7223a25158C7738K96828
13016C34566D7485f4320B57521b02460A39640K08868B1465i3682B24878N0686
$$ plain form
13006 275564 -80637 431320 286873 139087 241181 -248624 -175021 -81498 -199843 321569
12995 -343837 201344 98775 150383 39168 296228 -241910 -153168 247444 178384 6982 -177119
12983 73512 -46739 130041 84508 -162506 31159 -302693 270173 -267795 210921 75682
12972 40565 358114 -3960 -205961 409783 18943 -159163 -89678 44147 98819 -58708 2770
12960 -274988 227304 137559 -12995 -98688 50864 -9961 657655 110858 -183258 176898 38613
12948 378354 -220306 93388 -74437 -59529 115114 80350 65297 208174 35804 66634 89537
12937 89537 -163324 19203 139397 -158268 232705 49005 60102 -45647 97280 15966 -67449
12925 380150 35491 24305 -193213 223347 177302 271299 -103521 -245527 -245775 -22968 -88554
$$ packed form
13006B75564h0637D31320j44447A39087J02094b48624P3603h1498j18345C21569
12995c43837B01344I8775N1608C9168K57060b41910Q8742B47444o9060F982a77119
12983G3512d6739A30041m5533a62506C1159c02693B70173b67795B10921G5682
12972D0565L17549c960k02001D09783A8943a59163O9485D4147N4672e8708B770
12960b74988B27304q9745a2995q5693E0864i961F57655A10858a83258A76898C8613
12948C78354b20306I3388g4437J4908A15114l4764j5053J42877C5804L0830K2903
12937H9537a63324A9203J20194a58268B32705D9005J1097d5647I7280A5966f7449
12925C80150C5491j1186a93213B23347m6045R3997a03521j42006k48b2968o5586
$$ plain form
12914 -88554 306099 -46897 72941 90102 156571 303364 165538 57088 17081 469219 -44648
12902 210507 123022 -30138 -8670 78283 27202 -228748 -36085 -44795 69637 -47643 202496
12890 48778 29832 -166727 194913 43020 112781 -32910 238585 168261 101799 -282931 140211
12878 -111888 -7270 -165515 409520 7582 55069 136479 -141862 2569 272322 106128 -14846
12866 -41260 139539 181447 -182543 45196 -41935 -26669 -127002 82562 123807 196704 -116238
12854 148854 -71980 889 3801 793 -28297 -34374 159135 444711 -22415 29368 -25104 68042
12841 208113 412144 85003 249666 -271861 -191452 341822 433801 96429 -187868 -49899
12830 -105138 -147554 -116048 33691 -69259 83575 134501 -257986 -13426 -16974 241858 332004
$$ packed form
12914h8554C06099d6897G2941J7161O6469J46793j37826E7088A7081M52138d4648
12902B10507q7485c0138h670G8283B7202b28748c6085q710F9637d7643B02496
12890D8778j8946a66727A94913D3020O9761c2910B38585p0324o6462b82931A40211
12878a11888g270j58245D09520G582M7487Q1410a41862B569K69753A06128a4846
12866d1260A39539M1908a82543D5196d1935J5266j00333H2562M1245P2897a16238
12854A48854g1980H89K912G93b8297o077A59135K85576b2415B9368b5104F8042
12841B08113K04031H5003J64663b71861Q0409C41822R1979I6429a87868d9899
12830a05138m2416L1506C3691f9259H3575N0926b57986a3426l548B41858R0146
$$ plain form
12819 332004 124433 113876 29260 383424 -131460 315841 80682 -222484 33185 -273277
12808 71655 -183211 -28384 -199870 -116378 72869 264458 291611 239394 -183915 -239963 105564
12796 -195033 -64299 -46051 -195570 125738 -157325 69041 -261173 -129093 -108114 -146603
12786 -146603 133924 -64637 -25792 -84399 51575 213382 40002 -98858 -205525 64326 123109
12775 123109 78900 368899 156811 90355 -478769 -273528 -56670 -269454 177976 18961
12764 18485 164753 246297 35575 -133304 -304757 -131821 -108293 -172581 88063 6013 -119747
12752 -56174 -93498 -38631 -21328 314443 87097 32423 115873 150570 -115874 42266 -198954
12740 173671 -97134 -55522 -336847 -72250 139006 -117015 222519 159933 -181191 191360
$$ packed form
12819C32004A24433j0557B9260L54164a31460C15841H0682b22484C3185b73277
12808G1655a83211b8384j71486Q3492G2869J91589K7153n2217a83915n6048A05564
12796a95033f4299J8248j49519A25738a57325F9041b61173a29093K0979l8489
12786a46603A33924f4637b5792n8607E1575J61807D0002i8858j06667F4326N8783
12775A23109m4209K89999A56811o6456d78769K05241e6670k12784A77976A8961
12764A8485J46268Q1544C5575a33304j71453a31821K3528o4288H8063F013a19747
12752e6174l7324c8631J7303C14443H7097C2423Q3450L4697a15874D2266a98954
12740A73671i7134M1612k81325g2250A39006a17015B22519o2586a81191A91360
$$ plain form
12729 -127815 -251311 300110 212190 -369287 -83743 63544 282318 297138 -205274 -131038
12719 -131038 46602 -164394 -89594 -97182 350316 -43182 77201 218150 12418 -354 307266
12707 2067 1583 247905 415371 244238 -21959 34263 407889 -208593 -892 316346 -47108
12695 77318 276341 -140634 150659 169061 -39992 50302 -36525 -3990 -98482 191942 77350
12683 13690 79969 133000 252339 399987 181923 149368 -7857 463243 67690 85810 -70756
12671 72367 -115471 376615 -10267 368451 -17141 263714 -15905 80774 12807 116761 307272
12660 307272 195670 146237 -155546 -65628 62569 253503 111311 -32851 35166 38781 445466
12649 445466 -103638 50813 4481 -4469 312803 136566 312582 109439 -80246 232996 75360
$$ packed form
12729a27815j23496C00110q7920c69287h3743F3544K18774J4820b05274P4236
12719a31038D6602a64394P4800p588C50316d3182G7201J40949A2418c54C07266
12707B067m84K46322J67466j71133b1959C4263L73626b08593h92C16346d7108
12695G7318J99023a40634A50659J8402c9992E0302c6525c990r4492A91942G7350
12683A3690O6279N3031J19339J47648A81923l2555g857D63243F7690J8120g0756
12671G2367a15471C76615a0267C68451a7141B63714a5905H0774A2807J03954J90511
12660C07272j11602m9433a55546f5628F2569J90934A11311c2851C5166L615M06685
12649D45466a03638E0813D481d469C12803A36566J76016A09439h0246B32996G5360
$$ plain form
12637 -183953 -95999 239273 93268 11308 -106120 -171820 -58968 184940 -5543 156976 271845
12626 271845 225843 305531 248379 -199018 141732 57966 389 386402 126295 -12650 36878
12614 62781 55373 79539 -223387 -165392 508538 69279 188570 363018 125158 174271 58660
12602 361831 -102399 142148 24430 410750 133851 1571 103875 -11793 9150 257034 192030
12591 192030 71775 -153898 -101748 -243263 3048 -44429 482800 78034 -70197 -130070 25128
12579 78478 174634 -274284 -260820 186505 -159547 -549626 -148310 61893 13327 -379213
12568 45495 39685 -17613 77955 19947 -35641 25732 -5830 147966 154452 142089 -152912 5883
12555 38513 178036 -114463 216668 98910 -77943 81814 -83163 91689 117329 86886 -2375
$$ packed form
12637a83953Q7954B39273I3268A1308a06120o5700e8968A84940e543A56976J14869
12626B71845m6002P9688n7152a99018A41732E7966C89L86013A26295a2650C6878
12614F2781p408K4166b23387N7995E08538F9279J19291J74448A25158M9113E8660
12602C61831a02399A42148B4430L86320A33851A571J02304a1793I150K47884o5004
12591A92030G1775a53898N2150j41515C048d4429D82800G8034g0197n9873B5128
12579G8478R6156b74284J3464A86505a59547l90079a48310F1893A3327c79213
12568D5495n810a7613G7955A9947c5641B5732e830A47966O486j2363a52912E883
12555C8513J39523a14463B16668I8910g7943H1814h3163I1689K5640l0443b375
$$ plain form
12543 113343 25255 -42264 86870 236129 -135406 -71719 206756 -8266 273462 93059 148503
12532 148503 -64363 -394090 36112 67641 -132101 -54985 112744 306790 -5308 205719 -56781
12520 -81734 -98383 -165415 -89138 138860 73473 -111851 -116158 -348981 -148898 236950 77425
12508 -35474 -28971 4978 14969 22487 13596 -22965 97870 -55876 1326 231436 -44688 -117009 299285
12494 -143143 8192 -177068 209754 4277 -85661 132215 140177 -11591 -36280 263632 40447
12482 -64784 5591 -137057 51451 32137 72559 -248940 -55596 -81829 -167202 175309 421365
12471 421365 -100929 -117028 15276 -72971 -114995 -71675 312091 -69441 298941 -39310 68314
12459 129011 129005 33020 -26298 168095 105503 261077 314670 322403 167597 -8007 84986 -262574
$$ packed form
12543A13343B5255d2264H6870J49259a35406O3687B06756h266B73462I3059N5444
12532A48503f4363l29727C6112L1529a32101e4985A12744J94046e308B05719e6781
12520h1734j6649o7032P6277A38860o5387a11851m307k32823a48898B36950G7425
12508c5474O503D978R991P518q891b2965I7870e5876A326K30110d4688p2321B99285
12494a43143H192a77068B09754D277h5661A32215P962a1591k4689B63632D0447
12482f4784E591a37057E1451j9314M0422b48940e5596k6233q5373A75309K46056
12471D21365a00929j6099A5276g2971m2024M3320C12091f9441B98941c9310F8314
12459A29011oC3020b6298A68095o2592J55574N3593P733j54806h007H4986b62574
$$ plain form
12446 -69531 82504 64535 -129348 -43642 -25616 -153523 -89602 8988 -242992 -258973 -160063
12435 -160063 -63445 -10954 314445 298155 79322 -111751 -49407 184525 156308 58101 -165744
12423 80103 -138996 50406 -163031 -64154 238508 50772 -323811 -112318 -207230 -50990 529
12411 4246 -28825 160524 -122489 160277 -46925 -146985 158756 161011 -86050 30493 117792
12400 117792 203928 252750 -291741 -189306 -256423 132646 -125641 -35978 264831 -122073
12389 -12470 -17264 254028 -139750 76771 3792 161072 -119072 138930 -23769 -142064 496784
12377 275297 59567 195458 -37224 -12329 -110409 71843 168151 48829 159547 -408151 85890
12365 378713 -357823 310920 -27391 -25544 126437 -241229 376117 -116069 21878 -220813
$$ packed form
12446f9531H2504j7969a29348d3642J8026j27907O3921H988b42992j5981R8910
12435a60063f3445a0954C14445j6290G9322a11751d9407A84525k8217E8101a65744
12423H0103a38996E0406a63031f4154B38508E0772c23811a12318r4912e0990E29
12411D246b8825A60524a22489A60277d6925j00060A58756K255h6050C0493Q7299
12400A17792Q6136M8822b91741J02435o7117A32646a25641c5978B64831a22073
12389a2470m794B54028a39750G6771C792J57280a19072A38930b3769j18295D96784
12377B75297E9567J35891c7224a2329r8080G1843R6308D8829J10718d08151H5890
12365C78713c57823C10920b7391J847A26437b41229C76117a16069B1878b20813
$$ plain form
12354 64241 -101573 -96702 -34124 -187810 -249024 -112116 -423104 80234 -145804 -45326 -88817
12343 -88817 85671 160834 41961 -9942 -108423 -153005 -4750 -83503 -374014 15314 -177467 -91201
12331 -91201 128975 69232 -18754 189765 2651 386676 -187641 89494 -9204 205001 -159953
12319 -235479 121405 -269320 98565 -386311 62539 165177 323721 -10532 -376972 44467
12308 -6057 -112236 94050 17048 28974 91831 7581 80061 211031 225183 15071 66978 -42550
12295 100525 -230972 215897 -316861 -194247 235688 -274722 -129708 157903 35538 -187675
12284 -81842 -15401 351246 639170 186308 -165328 56584 -98237 68577 224555 161193 58471
12272 -172995 -16134 -431816 710720 -128811 2934 -54161 146439 95012 -156047 66645 29054
$$ packed form
12354F4241a01573M871c4124j53686o1214a12116l10988H0234a45804d5326m3491
12343h8817H5671P5163D1961i942r8481m4582d750p8753k90511A5314a77467Q6266
12331i1201A28975n9743a8754A89765B651L84025a87641H9494i204B05001a59953
12319b35479A21405b69320I8565c86311F2539J02638J58544a0532l66440D4467
12308f057j06179I4050A7048J1926O2857G581P2480J30970J4152A5071N1907d2550
12295A00525b30972B15897c16861J22614B35688b74722a29708A57903C5538a87675
12284h1842a5401C51246K87924A86308a65328E6584i8237F8577J55978o3362E8471
12272a72995a6134m15682G10720a28811B934e4161A46439n1427a56047F6645B9054
$$ plain form
12260 137799 62181 -134347 294276 104809 104039 96543 210776 3161 3819 96420 -92596 460664
12247 220312 168856 34980 73621 117471 9326 -5004 164978 194940 36803 35482 -32835 122687
12234 105137 272288 -202730 224065 -99671 49060 104954 146858 258582 77069 246472
12224 246472 151765 554567 75606 185045 141884 20274 364624 182118 -230435 10959
12213 83941 256463 115818 324636 -225409 212828 -303144 -51526 84056 23875 27116 462019
12202 462019 345224 94453 32668 -56845 113619 170756 281263 -68077 211628 -43271 297760
12190 87435 17597 156507 395406 55409 -154322 -73820 359072 132417 22190 176681
12180 176681 124958 -22432 171242 79606 219782 364564 145647 343539 -19953 96788
$$ packed form
12260A37799F2181a34347B94276A04809p70p496J14233C161O58R2601i2596D60664
12247B20312n1456C4980L8641M3850I326e004A64978K9962C6803j321c2835A22687
12234A05137J67151b02730B24065i9671D9060N5894M1904J11724G7069J69403
12224B46472r4707M02802G5606J09439m3161B0274L44350A82118b30435A0959
12213H3941J72522A15818K08818b25409B12828c03144e1526H4056B3875L241M34903
12202D62019j16795I4453C2668e6845A13619N7137J10507f8077B11628d3271B97760
12190H7435A7597J38910K38899E5409a54322g3820C59072A32417B2190J54491
12180A76681n1723b2432A71242G9606J40176J44782A45647J97892a9953I6788
$$ plain form
12169 107089 81115 -98487 68837 -6131 145145 11960 -139538 10118 185173 -15267 33263
12157 420854 -127919 -120509 253164 -48794 81268 128578 238787 54683 426473 -2990 -3754
12146 -3754 -134575 -94855 320059 -5560 179755 -28303 149280 -25270 41979 128049 128904 -114760
12133 237487 349226 37351 177187 -69531 214354 14415 -73508 -6063 -52834 -87159 -9861
12121 60771 -9861 198204 360563 96636 123823 84775 19613 335495 120834 -255659 -49756
12109 130939 -96107 120629 -84444 63671 -75464 172113 12634 -201297 134623 -160817
12098 136995 -668 -176792 102889 -69937 118490 140380 -139144 56452 8549 337692 439959
12087 439959 112993 -69856 41637 154957 142466 115937 -94783 84658 -298602 9277 -73069
$$ packed form
12169A07089k5974i8487F8837f131A45145A1960a39538A0118J75055a5267C3263
12157D20854a27919P410B53164d8794H1268M7310J10209E4683L71790b990p64
12146c754j30821L9720C20059e560A79755b8303A49280b5270D1979Q6070Q55a14760
12133B37487J11739C7351J39836f9531B14354A4415g3508f063m6771l4325i861
12121F0771i861A98204J62359I6636K7187l9048A9613L15882A20834b55659d9756
12109A30939i6107A20629h4444F3671g5464A72113A2634b01297A34623a60817
12098A36995f68j76124A02889f9937A18490K1890a39144E6452H549L29143J02267
12087D39959A12993f9856D1637J13320j2491k6529i4783H4658b98602I277g3069
$$ plain form
12075 -97668 -55521 299398 -27742 807016 1794442 820978 131824 102099 156176 481602
12065 481602 241160 288699 141152 -80193 32373 64506 -170469 64940 -12710 -135179 -19260
12053 293811 -66955 57770 47812 -28247 1326 38679 -12209 61371 -392691 -13735 -220397
12042 -220397 -95945 -217888 -72930 113449 50189 -504775 -186907 -71127 264113 281969
12032 281969 -414418 -355328 -231352 -447094 2286 -76670 52758 153139 -3264 119788 278789
12021 278789 -128232 -87030 125860 -272364 154484 -66457 -53356 172916 -71324 17493
12010 -263283 -1621 1785 170295 368336 -81953 33018 -382126 199064 -224603 -366289 -227777
11999 -227777 120763 44421 -180738 170918 -45225 381831 30515 -68339 95897 -230367
$$ packed form
12075i7668M2147B99398b7742H07016R87426H20978A31824k9725N4077L25426
12065D81602k40442M7539A41152h0193C2373L2133a70469F4940a2710j22469a9260
12053B93811f6955E7770r958b8247A326L7353a2209F1371c92691a3735k06662
12042b20397i5945j21943g2930A13449E0189e04775a86907g1127B64113J7856
12032B81969d14418N9090J23976k15742B286g6670E2758J00381c264A19788J59001
12021B78789a28232M1202A25860b72364A54484f6457J3101A72916g1324A7493
12010b63283a621A785J68510J98041h1953C3018c82126A99064b24603j41686J38512
11999b27777A20763D4421a80738A70918d5225C81831C0515f8339I5897b30367
$$ plain form
11988 -258010 -65870 -205390 -47020 47112 261466 130574 8287 -195795 -85679 625 173284
11977 173284 442920 -91662 54410 -349980 -46840 -80521 -215437 85373 -96937 -77177 11378
11965 -290786 -286549 -250684 142322 -115680 297247 -60378 199271 -6557 -331984 -45217 94402
11953 -167195 -24771 -119542 -179453 44766 138488 314674 -200564 -18728 55283 -30316 215431
11941 -7470 -75483 -115107 -157683 77427 -216969 -170987 -158186 -137937 -5647 159888 -22301 254994
11928 -77194 -327598 254084 315733 -167576 -131365 28779 174619 143548 58576 39092 52197
11917 52197 3633 173162 183239 -460782 13009 -2640 -4665 -379484 -66565 64710 -86327 -85798
11905 -85798 4398 40645 -14250 14391 -15901 -25013 -95970 -170234 163601 -105551 165770
$$ packed form
11988b58010f5870j39520d7020D7112K14354A30574H287a95795h5679F25J72659
11977A73284K69636i1662E4410c49980d6840l3681j34916H5373i6937J9760A1378
11965b90786M237L5865A42322a15680B97247f0378A99271f557l25427d5217I4402
11953a67195b4771r4771n9911D4766R3722J76186b00564a8728E5283c0316B15431
11941g470o8013l9624m2576G7427b16969M5982J2801K0249e647A59888b2301B54994
11928g7194k50404B54084O1649a67576L6211B8779J45840l1071E8576j9484J3105
11917E2197C633J69529J0077d60782A3009b640k025l74819f6565F4710h6327N29
11905h5798D398L6247a4250A4391a5901r112p0957p4264A63601a05551A65770
$$ plain form
11893 -183222 -298222 -60589 -78832 -125901 477741 43164 -102272 73518 137684 -221574 -104192
11881 57588 -97268 130602 -168982 -14466 56163 179630 86112 -167624 241867 -111879
11870 -13044 -127091 -22466 -169034 -123920 283725 -283953 408754 -92449 53460 -250907
11859 -418079 34281 46509 80163 -54703 -102257 -31094 308305 -72611 295690 23274 -10374
11847 226599 -1212 144973 -212759 -331027 -265324 300226 51126 -105253 -75022 -49883 54668
11835 187 1016 -19870 -139143 -38835 -325577 -31273 -7081 -93657 -264698 -92783 -194715 -13650
11822 -7460 80568 76388 -89681 -34991 -230003 115 10673 -244168 158458 44320 171549 -147061
11809 -259423 -256295 -113124 138167 -2184 -379718 115901 -214232 -32281 -33088 181447 -122196
$$ packed form
11893a83222j15000f0589j8243m7069D77741D3164a02272G3518O4166b21574a04192
11881E7588i7268A30602a68982a4466E6163J23467H6112a67624B41867a11879
11870a3044j14047b2466j46568M5114B83725b83953D08754i2449E3460b50907
11859d18079C4281J2228L3654e4703m7554c1094C08305g2611B95690B3274a0374
11847B26599a212A44973b12759j18268O5703C00226E1126a05253L0231K5139E4668
11835A87Q29a9870j19273c8835k86742c1273g081q6576j71041i2783j01932a3650
11822g460H0568m180h9681c4991j95012A15J0558b44168A58458D4320J27229a47061
11809b59423L128a13124A38167b184l77534A15901b14232c2281q07A81447a22196
$$ plain form
11797 -81138 216031 129883 -175176 3323 12396 -338602 -151930 -270433 191830 -314485 47993
11785 94779 -185192 -100068 204158 -204054 -249789 -417729 -215113 249528 -91448 -300083
11775 -300083 163278 152649 -159128 -301447 -20414 149865 -183575 -157615 -196263 -187476 -80862
11763 48559 72104 -202472 112789 -122272 31554 46523 79283 106081 1034 -289139 -93956
11751 -39917 336493 -20944 317855 187461 -329142 -3173 93067 343921 56368 151591 17358
11739 -76224 -284421 -323176 -112661 -110798 -188128 67772 113048 93749 -146843 295122 67804
11727 -140782 125683 -241337 144394 -291612 -16517 30496 -149607 -68676 -259405 -26730
11716 -193542 97602 -11471 456145 67459 54814 1915 20154 116875 57561 239333 184315
$$ packed form
11797h1138B16031q6148a75176C323R073c38602a51930j18503A91830c14485D7993
11785I4779a85192Q5124B04158b04054m5735j67940K02616B49528i1448k08635
11775c00083A63278j0629a59128j42319b0414A49865a83575K5960l8648Q787h0862
11763D8559K3545b02472A12789a22272C1554J4969L2760K6798A034b89139i3956
11751c9917C36493b0944C17855j30394c29142c173I3067K50854E6368R5223A7358
11739g6224k08197l8755a12661J863p7330F7772M5276j9299a46843B95122F7804
11727a40782A25683b41337A44394b91612a6517C0496a49607f8676j90729b6730
11716a93542I7602a1471D56145F7459j2645A915J8239R6721E7561J81772n5018
$$ plain form
11705 184315 -113367 -96167 -15519 67455 525402 -224432 -14389 120544 -243111 24619
11694 -85277 -339429 97332 174059 -33221 -119864 11313 122992 151011 -48708 -37839 92672
11682 -143330 211136 -207407 -169443 408908 250018 -45753 51155 93859 238642 346446
11672 346446 -93736 112296 44644 89958 119790 86773 75904 327604 131594 122455 -6244
11660 51130 -126027 -113892 -14494 388322 75792 161391 -125797 81365 -40651 172911 -188147
11648 106242 56053 -107601 210421 -74776 -117470 373641 -13064 -120210 215624 -224404
11637 187774 -112374 100393 40790 228123 -67875 83589 -86152 71660 51655 151415 -313511
11625 -235261 581171 434850 13598 104266 -106701 139836 -50905 950 204760 -103064 351437
$$ packed form
11705A84315a13367J7200a5519F7455M57947b24432a4389A20544b43111B4619
11694h5277k54152I7332P6727c3221q6643A1313J11679K8019d8708J0869I2672
11682a43330B11136b07407L7964D08908j58890d5753E1155M2704J44783J07804
11672C46446i3736A12296D4644M5314K9832l3017j0869K51700A31594r139f244
11660E1130a26027J2135a4494C88322G5792Q5599a25797H1365d0651A72911a88147
11648A06242n0189a07601B10421g4776m2694C73641a3064j07146B15624b24404
11637A87774a12374A00393D0790J87333f7875H3589h6152G1660k0005R9760c13511
11625b35261E81171j46321A3598R0668a06701A39836e0905I50K03810a03064C51437
$$ plain form
11613 -248178 302926 199302 -28218 -41021 168161 27433 267131 -149182 -194212 174367
11602 455528 196526 167978 -25798 106222 125608 170726 147003 88139 -89662 249174 172556
11591 172556 -54915 203423 39563 238418 34794 232051 213768 175105 3022 47481 176621
11580 176621 219948 -64952 230957 -57696 -98304 41242 132376 6670 105544 -114343 11647
11568 -262345 -105276 198301 77608 69973 143583 97647 194673 155207 49270 76773 134740
11557 134740 -136452 16944 106936 -42494 -56035 -7045 -112546 194852 64724 201705 27371
11545 287950 376505 -31628 -327400 -50798 -103659 -119000 362260 -68790 48288 22103 5480
11533 120872 203943 148514 28253 -274532 16112 118655 16420 287 88905 153799 114289
$$ packed form
11613b48178C02926j03624b8218j2803A68161B7433K39698a49182m5030A74367
11602D55528A96526k8548b5798A06222J9386M5118k3723n8864h9662B49174p6618
11591A72556e4915B03423C9563J98855C4794J97257j8283l8663C022M4459J29140
11580A76621M3327f4952B30957e7696m0608D1242R1134F670R8874a14343A1647
11568b62345a05276A98301G7608p635P3610m5936R7026l9466D9270K7503N7967
11557A34740a36452A6944Q9992d2494j3541g045j05501A94852F4724J36981B7371
11545B87950Q8555c1628k95772e0798n2861j5341C62260f8790D8288B2103E480
11533A20872Q3071n5429B8253b74532A6112J02543A6420B87Q8618O4894l9510
$$ plain form
11522 114289 -181431 63939 257525 389229 -276260 -7626 -131068 265914 166323 -183081
11511 142599 -37667 165766 -16436 149751 246377 200783 -88156 125136 204007 133111 186041
11500 186041 182432 94589 -100154 -99194 178834 71094 -133633 -108439 -320729 -17907 434928
11488 305606 -184717 202929 65360 87054 190098 101010 185214 305220 286393 298875 -92089
11476 49115 315880 40570 290009 66389 410555 137526 131584 387350 456865 421041 371043
11465 371043 259896 -262749 -279850 142428 103734 277614 139092 20600 254289 -148549
11454 46876 33244 92959 -14340 23801 44084 260474 27106 -190558 231850 273335 -192908
11442 -153111 182276 84081 150597 -358574 57816 -33406 394959 313958 330447 205212 -155760
$$ packed form
11522A14289a81431F3939J93586J31704b76260g626j23442B65914r9591a83081
11511A42599c7667A65766a6436A49751R6626m5594h8156A25136P8871p0896N2930
11500A86041l609q7843a00154R60A78834G1094a33633K5194k12290a7907D34928
11488C05606a84717B02929F5360K1694J03044q9088Q4204J20006j8827J2482i2089
11476D9115K66765D0570K49439F6389L44166A37526n942K55766O9515l5824m9998
11465C71043j11147b62749j7101A42428l8694J73880j38522B0600K33689a48549
11454D6876j3632N9715a4340B3801K0283K16390B7106a90558B31850M1485a92908
11442a53111A82276H4081O6516c58574E7816c3406C94959q1001J6489j25235a55760
$$ plain form
11430 74548 -168180 89500 -2422 102207 66804 178893 7235 -75177 28981 118833 17808
11418 23497 -25664 -238125 -222310 191040 -34413 361253 212909 236906 150344 -122090 49153
11406 123745 41274 216187 160358 56668 378963 83782 274186 242911 -84090 54391 182804
11395 182804 -15790 -133826 -90268 -126832 -105734 -110518 -233355 -104920 -346918 233213 470234
11384 470234 -69364 50314 52975 -152986 45245 144978 3881 -62824 -281530 36979 12586
11372 25241 -103026 203670 104613 -65805 53283 5452 229737 -410189 9013 74754 -317258
11360 200831 -2986 -319783 -36485 -421258 -10036 43217 287805 -71821 -449530 27459 3054
11348 14161 202940 -8205 101419 -145401 -9025 28653 87077 -83377 -91446 -90801 -16287 161182
$$ packed form
11430G4548a68180H9500b422A02207l5403J12089G235g5177B8981Q9852A7808
11418B3497b5664k12461J5815A91040c4413C61253j48344K3997q6562a22090D9153
11406A23745D1274J74913n5829E6668L22295H3782J90404l1275h4090E4391J28413
11395A82804a5790j18036M3558l6564K1098m784j22837a04920k41998B33213K37021
11384D70234f9364E0314K661a52986D5245R9733C881f2824k18706C6979A2586
11372B5241a03026B03670r9057f5805E3283E452K24285d10189I013O5741c17258
11360B00831b986l16797c6485l84773a0036D3217K44588g1821l77709B7459C054
11348A4161J88779h205A01419a45401i025B8653N8424h3377q069O45a6287A61182
$$ plain form
11335 -197950 -351819 -99588 -343860 91989 43333 82117 -5154 282928 49950 -153819 -116130
11324 -116130 -105422 246651 8844 168295 290018 77554 188855 107157 165649 -100269 -189653
11313 -189653 -81858 59283 -221711 -353208 -294322 12000 193673 31581 -275435 -6316 57740
11301 142109 -169003 160226 -8188 -185076 -120242 -320436 6555 233495 154791 131952 -271663
11289 117725 -123899 -57433 -229877 -109410 174703 -105646 25792 242390 102646 228154
11279 228154 -144869 205607 146781 18174 -154411 -150826 -249028 199486 134551 -26622 114279
11267 178104 163337 64664 -151115 -162044 -53155 -40454 -541887 -115885 -243190 -194052 -161895
11256 -161895 -464079 14358 19285 -213841 -30282 252046 74208 -67244 -29590 -115318 182115
$$ packed form
11335a97950j53869i9588k44272I1989D3333L8784e154B82928D9950a53819L7689
11324a16130J0708B46651H844J59451J21723G7554J11301q1698N8492a00269q9384
11313a89653h1858E9283b21711j31497N8886A2000J81673C1581b75435f316E7740
11301A42109a69003A60226h188j76888O4834k00194F555K26940p8704k2839b71663
11289A17725a23899e7433j72444a09410A74703a05646B5792K16598A02646J25508
11279B28154a44869B05607n8826A8174a54411L585r8202A99486o4935b6622A14279
11267A78104j4767F4664a51115j0929e3155J2701n01433a15885j27305M9138L2157
11256a61895l02184A4358M927b13841c0282B52046G4208f7244b9590q5728A82115
$$ plain form
11244 204432 -327021 -326910 96644 5871 -10080 267610 -93394 -271270 -155547 -92303 141916
11232 -273225 -124954 -87770 -219276 -398167 -32073 -84976 -152462 -107418 -86971 -252231 -34802
11220 -56764 -307601 234353 -185938 -310197 94599 104489 -476358 -8105 85165 -77278 181985
11208 52297 92414 62082 -180216 28246 -67240 19008 -77104 -57823 -14007 99195 -224505
11196 71309 164905 171099 181466 -96965 121241 215138 -307414 16224 78487 -352162 -42132
11184 76077 120961 208990 28555 131579 -38006 -199449 41237 37604 216628 207632 171742
11173 171742 101618 -340334 -261354 -91126 -128482 183475 -102523 -229702 -156792 -25998 3255
11161 368937 87538 -236450 107798 -213628 192585 -110862 87118 -341323 252132 83687
$$ packed form
11244B04432c27021J11I6644E871a0080B67610i3394j77876J15723O3244A41916
11232b73225a24954L7184j31506j78891c2073n2903o7486M5044K0447j65260c4802
11220e6764k50837B34353a85938j24259I4599R890d76358h105H5165g7278A81985
11208E2297M0117l0332a80216B8246f7240A9008g7104J9281a4007I9195b24505
11196G1309R3596O194J0367i6965A21241R3897c07414A6224O2263c52162d2132
11184G6077M4884Q8029B8555J03024c8006j61443D1237l633J79024q996l5890
11173A71742p0124c40334P8980i1126l7356A83475a02523j27179P2910b5998C255
11161C68937H7538b36450A07798b13628A92585a10862H7118c41323B52132H3687
$$ plain form
11150 -169354 -206328 -48411 -48625 83466 -204097 -42103 -46216 265363 66370 -57196 156535
11138 232806 338992 -104235 -46093 25460 87505 17525 78123 35180 -126627 168688 263182
11127 263182 216416 -223854 217052 -24412 -13345 77931 -194227 -394588 236209 -120025
11116 175620 452107 -65434 -237738 -34852 112752 -21592 -181178 221960 185607 -26203
11105 248572 259918 8950 179163 176954 333035 215125 -177125 217637 192565 -43177 -151633
11094 -151633 386602 152905 -234517 65930 -69183 62895 -18239 441436 260000 301698
11084 301698 201477 103160 355811 139221 267088 368485 75823 356789 26566 60727
11074 60727 368310 300837 292682 517236 173383 304992 10812 315365 575167 605042 349329
$$ packed form
11150a69354l6974d8411k14H3466b04097d2103m113B65363F6370e7196A56535
11138B32806J06186a04235d6093B5460O2045A7525O0598C5180a26627A68688R4494
11127B63182m6766b23854B17052b4412J1067G7931a94227k00361B36209a20025
11116A75620K76487f5434j72304c4852A12752b1592j59586B21960l6353b6203
11105B48572J1346H950J70213k209J56081j17910a77125B17637k5072d3177j08456
11094a51633C86602A52905b34517F5930f9183F2895a8239D41436j81436M1698
11084C01698j00221r8317K52651A39221J27867J01397G5823K80966B6566L4161
11074F0727L07583o7473q155K24554A73383J31609A0812L04553K59802K9875k55713
$$ plain form
11063 349329 398553 409106 187660 788321 573679 386857 403289 478291 907604 214658
11052 788957 414595 634323 453395 457304 440697 653268 684357 333952 364877 907161
11042 907161 796777 529798 444445 580737 1080918 560237 346900 603852 615929 515172
11032 515172 680737 290351 691895 708779 910348 872280 734649 945184 807742 601194
11022 601194 657338 603716 527542 840106 671143 377160 536218 344203 622132 416727
11012 416727 509981 360132 359010 844543 897311 608701 420800 662700 771617 743706
11002 743706 316164 644409 904260 445980 716747 743276 704560 669338 714743 738755
10992 738755 488122 601804 619953 635013 862550 883507 807833 661501 1132899 1006448
$$ packed form
11063C49329M9224J0553A87660O00661k14642j86822J6432P5002M29313B14658
11052G88957l74362K19728j80928L909j6607K12571L1089C33952L0925N42284
11042I07161j10384k66979q5353J36292N00181n20681k13337K56952J2077j00757
11032E15172J65565B90351M01544J6884K01569l8068j37631K10535j37442k06548
11022F01194N6144n3622p6174L12564j68963k93983J59058j92015K77929k05405
11012D16727R3254j49849j122M85533N2768k88610j87901K41900J08917k7911
11002G43706C16164L28245K59851D45980K70767K6529l8716l5222M5405K4012
10992G38755k50633J13682J8149J5060K27537K0957p5674j46332M71398j26451
$$ plain form
10982 1006448 1136754 859874 1411707 1155128 1473586 1711924 2078785 2066078 2001497 2762177
10972 2762177 2307443 2362922 2405275 2438593 2084494 2066233 2130048 1803201 1861485 1456927
10962 1456927 1535241 1521777 1620822 1821677 1866139 1964301 2001369 1671462 1563427 1393162
10952 1393162 1380342 779231 1267124 705142 552533 617642 367020 334864 174311 236086
10942 236086 245646 36317 209929 421896 236051 238052 -68591 149008 364525 -24771 -250082
10931 -250082 55003 241573 147067 -35001 -54532 -20190 59978 -3520 28191 205603 -21587
10919 -159623 135450 207869 -72056 61842 50379 -210021 -190277 192302 217043 -263683 -96306
10907 -28640 -245816 364605 -145594 114897 -93682 -246371 16947 -574705 -61347 -147921
$$ packed form
10982A006448J30306k76880N51833k56579L18458K38338L66861j2707o4581P60680
10972B762177m54734N5479M2353L3318l54099j8261O3815l26847N8284m04558
10962A456927P8314j3464R9045K00855M4462R8162L7068l29907j08035j70265
10952A393162j2820o01111M87893n61982j52609O5109k50622l2156j60553O1775
10942B36086R560C6317J73612K11967j85845K001f8591A49008K15517b4771k25311
10931b50082E5003J86570r4506c5001j9531b0190E9978c520B8191J77412b1587
10919a59623A35450P2419g2056F1842j1463b10021J9744A92302K4741b63683i6306
10907b8640k17176C64605a45594A14897i3682j52689A6947e74705f1347q6574
$$ plain form
10897 -147921 157087 152455 169323 77104 -108511 30360 -64106 256731 -15757 -3604 -152574
10886 -152574 -157423 -70532 75353 -17439 108223 166010 174838 -400307 -57271 -252077 68578
10874 -105823 93204 166200 92860 -79785 -168424 61536 202987 -262791 65184 -253744 -177263
10863 -177263 185917 233127 70455 347128 -258608 77414 77846 56635 18438 -3632 252385
10851 350433 109754 120355 43976 -51190 -139508 -272482 -36770 97469 79339 66776 -86185
10839 -82284 -156627 123186 152688 7774 -113360 212764 -60600 152962 314488 126392 -71532
10827 16904 -233428 271853 112800 65580 46514 27375 171561 92553 53354 -161564 -354276
10816 -354276 79807 -63683 113853 152884 177661 -180543 166648 -234588 100280 -31242
$$ packed form
10897a47921A57087m632J6868G7104a08511C0360f4106B56731a5757c604j48970
10886a52574m849g0532G5353a7439A08223N7787Q828d00307e7271j94806F8578
10874a05823I3204P2996p3340g9785q8639F1536J41451b62791F5184b53744P6481
10863a77263A85917M7210G0455K76673b58608G7414M32k1211A8438c632B52385
10851C50433A09754J0601D3976e1190q8318j32974c6770I7469j8130j2563h6185
10839h2284p4343A23186K9502G774a13360B12764f0600A52962J61526A26392g1532
10827A6904b33428B71853A12800m7220j9066j9139J44186p9008l9199a61564j92712
10816c54276G9807f3683A13853L9031K4777a80543A66648b34588A00280c1242
$$ plain form
10805 -173405 -37300 -201956 -67851 -98802 -47534 -134904 -279192 288009 142344 -63196 122826
10793 -270547 -95458 -174307 -104107 122625 28285 22188 90082 6166 -39064 -26553 -80327 -186849
10781 -186849 271572 133078 245197 -59919 28285 -138841 -159 -84177 -274760 -47536 192830
10769 -8301 -82025 -59305 -25059 -130815 -20752 110378 -169528 -38988 273871 199728 173466
10758 173466 -59083 221954 -255802 74631 -360017 -258001 -151603 -47575 -115317 -249989
10748 -249989 -26939 -366152 -270228 -58945 -171013 -158075 -24835 215088 73353 137021 -210454
10736 -105588 15257 -234883 120341 -235438 -340013 78517 -30878 25770 -236717 33513
10725 136434 52886 4156 31721 -9177 126001 296750 -263451 68207 265945 -334839 190254
$$ packed form
10805a73405c7300j64656f7851l0951d7534q7370j44288B88009A42344f3196A22826
10793b70547i5458p8849P0200A22625B8285o097O7894F166c9064J2511n3774j06522
10781a86849B71572A33078J12119e9919B8285a38841a59q4018j90583d7536A92830
10769h301p3724K2720b5059j05756b0752A10378a69528c8988B73871p4143k6262
10758A73466e9083B21954b55802G4631c60017J02016J06398d7575o7742j34672
10748b49989b6939l39213R5924e8945j12068J2938b4835B15088G3353O3668b10454
10736a05588A5257b34883A20341b35438j04575G8517c0878B5770b36717C3513
10725A36434E2886D156K7565i177A26001J70749b63451F8207J97738c34839A90254
$$ plain form
10713 -93554 -202817 -2499 -267146 -132917 -168731 -18551 -87358 -354752 -52007 -64524 -250056
10702 -250056 -167086 54161 66969 -75481 -123193 82082 73892 -2605 -254341 -266199 -224865 -144992
10690 -144992 -302587 -116422 -86229 -284536 -384471 26622 34844 -51113 15775 -254049 -59212
10678 -154480 122849 227143 -99147 -67319 -30068 22998 125184 -72480 -41054 -305056 -422024
10667 -422024 -121448 -91226 -50366 11738 -301358 -39738 -172761 178365 132083 97281 -122574
10655 -157988 101399 96700 -52345 56016 -58942 -5450 -131247 286060 18908 -310219 -397125
10644 -397125 -110411 -40697 -347411 101182 126713 -305226 136036 -66872 -29128 -21185 77507
10632 -120859 -25929 -262291 -84456 82594 -232960 -291646 -119293 -72914 -100065 -55893 -128210
$$ packed form
10713i3554j09263b499k64647a32917l5814a8551o8807k67394e2007j2517j85532
10702b50056Q2970E4161J2808g5481m7712H2082q190b605k51736j1858M1334P9873
10690a44992j57595a16422L0193j98307r9935B6622Q222e1113A5775b54049e9212
10678a54480A22849J04294i9147L1828c0068B2998J02186g2480L1426k64002j16968
10667d22024a21448L0222M0860A1738c01358c9738j33023A78365m6282l4802a22574
10655a57988A01399m699e2345E6016e8942e450j25797B86060A8908c10219q6906
10644c97125a10411d0697l06714A01182K5531c05226A36036f6872b9128P943G7507
10632a20859b5929k36362h4456H2594b32960n8686a19293M6379k7151M4172p2317
$$ plain form
10621 -128210 -26854 50148 -92254 77597 43100 325519 -66373 45448 -190031 123148 -105827
10609 400943 -149582 -51976 -38320 -3841 207164 -66760 46033 -461390 -59688 248188 -129047
10597 -191004 -144854 -339758 -49684 -179851 -191743 403875 -149613 -3952 -225283 -137872 -65434
10585 72802 -135770 214127 -30966 -118100 116076 -184982 -232706 58554 131167 13688 149025
10574 149025 270880 -39172 91118 -28101 245887 238595 -340899 183736 -175522 -72369 -99784
10563 -99784 19562 173530 156174 -184338 169491 -318770 137756 -215799 -178378 -153933
10553 -153933 -83334 67267 -333588 146570 46158 -61695 135217 65293 382710 -168640
10542 37940 -196637 47902 151630 -100881 -42623 143550 -234945 -36535 -182039 251927
$$ packed form
10621a28210b6854E0148i2254G7597l4497K82419f6373D5448a90031A23148a05827
10609D00943a49582e1976J3656c841B07164f6760D6033d61390e9688B48188a29047
10597a91004M6150j94904d9684j30167j1892D03875a49613c952k21331Q7411f5434
10585G2802a35770B14127c0966q7134A16076a84982m7724E8554P2613A3688J35337
10574A49025J21855c9172I1118b8101B45887p292c40899A83736a75522g2369k7415
10563i9784A9562J53968j7356a84338A69491c18770A37756b15799L7421K4445
10553a53933P0599F7267c33588A46570D6158f1695A35217F5293L17417a68640
10542C7940a96637D7902J03728a00881d2623A43550b34945c6535j45504B51927
$$ plain form
10531 232382 146962 -272641 226926 -277001 144820 -212412 -184922 -299493 -42459 50196
10520 156870 20118 -10638 -473935 54618 79008 -171095 123025 -184709 -20250 202753
10509 43391 -136175 -102933 -73519 124542 -42801 77462 -121581 13080 75328 -206339 215738
10497 -157292 -116310 -39595 -361112 104489 106944 -284151 -266436 -438928 -62967 445758 -74817
10485 -147869 149055 -313536 -27760 166267 689689 112942 479723 400934 75641 -67471
10474 -163442 -89037 35429 -87690 -24172 -123465 -48982 -169619 -206503 255052 152764 -199567
10462 -72073 -24688 70836 -123398 -151980 97454 -132496 91463 -258753 -45071 -51777 150750
10450 -56 -299314 -47771 -205803 380967 180064 21846 73430 248709 239318 -271 244028 -54420
$$ packed form
10531B32382q5420b72641B26926b77001A44820b12412K7490j14571d2459E0196
10520A56870B0118a0638m63297E4618K4390a71095A23025a84709b0250B02753
10509D3391a36175L3242K9414A24542d2801G7462a21581A3080O2248b06339B15738
10497a57292M0982c9595l21517A04489K455b84151J7715j72492f2967D45758g4817
10485a47869A49055c13536b7760A66267N23422A12942L66781p8789G5641f7471
10474a63442P4405C5429h7690b4172r9293d8982j20637l6884B55052j02288a99567
10462g2073b4688G0836a23398k8582I7454a32496I1463b58753d5071o706A50750
10450e6k99258d7771j58032C80967A80064B1846N1584J75279r391b71B44028e4420
$$ plain form
10437 -459324 173689 32690 -22888 -102694 157472 70264 -87918 -11198 14640 -75066 -361859
10426 -361859 -579564 -169185 -309834 216539 183517 -115054 -64168 -263913 -368500 123509
10415 -35839 81224 358854 54601 97611 -316295 -345190 -40558 -231496 166014 -210329 215558
10403 171792 -43989 -159288 -491951 1484 -349998 156650 -163984 210814 37433 -352012
10392 179115 -245625 273658 206295 -62055 194271 -149973 -181152 40781 433556 35954
10381 84994 29816 145272 51554 35610 357717 365507 380635 -74799 40333 229494 64333
10369 88880 151705 421035 364678 445771 227258 115158 388618 307387 170344 91551 123984
10358 123984 394376 -17995 246339 363207 326681 166472 461286 227292 418713 393111
$$ packed form
10437d59324A73689C2690b2888p9806A57472G0264h7918a1198A4640g5066k86793
10426c61859k17705a69185j40649B16539l3022a15054N0886j99745j04587A23509
10415c5839H1224K77630E4601M3010c16295k8895d0558j90938A66014b10329B15558
10403A71792d3989j15299l32663A484c49998A56650a63984B10814C7433c52012
10392A79115b45625B73658o7363f2055A94271a49973l1179D0781L92775C5954
10381H4994B9816J15456E1554j5944L22107P790J5128g4799D0333J89161F4333
10369H8880O2825K69330n6357Q1093k18513j12100K73460q1231j37043p8793L2433
10358A23984K70392a7995B46339J16868l6526j60209K94814B27292J91421k5602
$$ plain form
10348 393111 217284 516084 223559 -5435 74428 558525 379593 2254 116174 53079 -113643
10336 388088 83456 463137 111744 -2431 129355 82474 294081 20573 30501 -66207 358949
10324 94973 -9098 306467 339837 -76296 67160 195323 23859 131142 306688 166943 2619
10312 191286 -166355 353865 113019 -246626 184577 -19448 -108218 74625 410284 306795
10302 306795 159420 -106241 -189308 372712 -207911 -203766 250823 65219 141113 -493509
10291 -128685 -219319 -50815 -97156 -19204 -22737 -244726 -13953 -357221 150256 177370 69971
10279 122177 150250 241601 127270 -125558 -210575 -362595 338123 220692 -69951 -220614
10269 -220614 -153433 28483 161845 180809 12718 59712 -95132 127087 271081 394063 328248
$$ packed form
10348C93111j75827K98800B23559e435G4428M84097j78932B254J13920E3079a13643
10336C88088H3456L79681A11744b431A29355m6881K11607B0573R928f6207C58949
10324I4973i098C06467L3370g6296F7160J28163B3859J07283J75546j39745B619
10312A91286a66355C53865A13019b46626A84577a9448q8770G4625L35659j03489
10302C06795j47375a06241q3067C72712b07911M145B50823F5219P5894d93509
10291a28685r0634e0815m6341a9204l533k21989a3953l43268A50256K7114F9971
10279A22177K8073R1351j14331a25558q5017j52020C38123j17431f9951j50663
10269b20614O7181B8483J33362J8964A2718M6994i5132A27087J43994J22982o5815
$$ plain form
10258 328248 111097 284990 502750 288213 -192620 18583 107080 7958 73810 -39363 -325448
10247 -325448 207080 29904 293732 -247068 53865 -23361 169914 -443955 407268 -198082
10236 255054 -12164 -97579 265860 252032 -59848 -266142 -62146 374789 77610 -59302 -312286
10225 -312286 -222350 -171401 357261 29044 -169558 65035 -65583 -113663 -78732 -386156 -8481
10213 -201187 -453708 -131947 176684 1445 -19136 150873 314044 -36784 169084 -290477
10202 -47055 -206601 89800 120272 197049 -108776 -4690 -297757 323795 -194552 -137978 139297
10190 237397 -48909 -18944 376492 -71046 43725 135757 -258475 -150727 138672 -23860 -59552
10179 -59552 -390395 -347426 -125932 -265696 -393314 75190 29738 26373 61739 -277911 -151782
$$ packed form
10258C28248A11097J73893K17760k14537a92620A8583Q8497G958O5852c9363k86085
10247c25448B07080B9904K63828b47068E3865b3361A69914d43955D07268a98082
10236B55054a2164q5415B65860j3828e9848k06294f2146C74789G7610e9302k52984
10225c12286Q9936N0949C57261B9044a69558F5035f5583m8080L4931l07424h481
10213b01187k52521a31947A76684A445a9136A50873J63171c6784A69084b90477
10202d7055j59546H9800L0472P6777a08776d690k93067C23795a94552N6574A39297
10190B37397d8909a8944C76492g1046D3725R2032b58475J07748A38672b3860l5692
10179e9552l30843M2969a25932j39764j27618G5190B9738l365L5366b77911J26129
$$ plain form
10168 -151782 -269475 -149308 81810 392220 -254412 -233472 -18185 12305 178529 53308
10157 -19832 143150 -6188 -185465 10536 248223 -158337 -207564 -222426 -262183 128388 -284185
10145 176453 -70417 137763 51969 -169300 250279 59201 -118065 -243711 -95914 -114345
10135 -114345 -110136 -252092 -439891 58044 73280 185509 -30318 191947 -224316 165981
10124 -169467 -210477 -7903 158084 82391 -264597 -335635 -214529 28212 14125 179056 -54473
10112 -237811 -138440 -517935 -69714 51529 -208583 106134 -97436 -68460 -92134 -127397 -223836
10101 -223836 -57199 -22057 -123048 -119967 -48251 -92058 150358 192117 65455 64702 29177 171262
10089 171262 -111942 -129628 -164257 -136910 -95759 15230 -45710 -36255 -274108 -104984 -91527
$$ packed form
10168a51782j17693J20167H1810L10410b54412K0940a8185A2305J66224E3308
10157a9832A43150f188j79277A0536K37687a58337m9227j4862l9757A28388b84185
10145A76453g0417A37763E1969a69300B50279E9201a18065j25646i5914j8431
10135a14345M209j41956j87799E8044J5236J12229c0318A91947b24316A65981
10124a69467m1010g903A58084p5693b64597p1038J21106B8212j4087J64931e4473
10112b37811R9371l79495f9714E1529b08583A06134i7436K8976k3674l5263r6439
10101b23836e7199b2057j00991L081d8251m3807A50358M1759F5455p53B9177J42085
10089A71262a11942j7686l4629K7347M1151A5230d5710R455k37853a04984J3457
$$ plain form
10078 -91527 -54472 -220635 -57190 154380 45176 -127223 269661 -43619 -66679 107615 -159332
10066 378458 8846 -120641 214681 -34078 -318561 103640 173292 -118147 292487 -128914
10055 -59858 -57431 -20003 123674 -267146 -87933 -86308 -261486 -46362 -144706 -42170 114471
10043 -425794 -199107 -404036 35749 -302789 101855 -191421 -136956 43629 -257972 -267076
10033 -267076 -314588 50002 46659 133389 166628 -29553 20162 95846 -80634 -170076 78972 -59300
10020 -54353 -460435 143712 -213280 -20238 -171556 -310828 107596 240054 76107 -32416
10009 -80378 39003 44398 59887 16948 156056 19899 14415 -89242 -137549 180288 61723 37418
9997 37418 379148 -301542 242204 -20403 -22773 -233171 -179456 -190921 211374 -415951 -386918
$$ packed form
10078i1527L7055j66163e7190A54380D5176a27223B69661d3619k3060A07615a59332
10066C78458H846a20641B14681c4078k84483A03640O9652a18147B92487a28914
10055e9858K427b0003A23674b67146h7933J625j75178d6362r8344d2170A14471
10043d25794a99107k04929C5749c02789A01855a91421N4465D3629b57972r104
10033b67076m7512E0002l343Q6730L3239b9553B0162P5684h0634q9442G8972e9300
10020e4353m06082A43712b13280b0238j51318j39272A07596J32458G6107c2416
10009h0378C9003N395J5489A6948J39108A9899n484h9242m8307A80288F1723k4305
9997C7418L41730c01542B42204b0403k370k10398N3715j1465B11374d15951K9033
$$ plain form
9986 -386918 -94836 -296645 -193324 -137787 -438643 -153822 71016 -227779 -284641 -237143 573
9974 -48121 7726 -8318 -29854 -80600 146123 -186554 -316486 -101768 -96767 -29851 -186051
9963 -186051 34310 38792 90262 -248820 384 400574 -88932 -38181 -164934 124536 13236
9951 -54945 123964 -161054 65593 -417434 109909 31427 173631 -88203 280750 -613839
9940 254058 -41711 -277174 -95365 -87392 186858 -229858 -197869 -22839 116667 -79943 115841
9928 249625 -257777 -373127 -232332 154811 -333088 -134295 -8325 5309 -90863 -358054 -283298
9917 -283298 186525 -140558 34157 -102124 -185684 -440099 141300 -38468 -164482 180045
9906 -171191 118555 -72545 224698 32168 -3602 -146333 -217849 -98756 294159 67428 28219
$$ packed form
9986c86918i4836k01809J03321N5537l00856a53822G1016b27779n6862M7498E73
9974d8121G726h318k1536n0746A46123a86554j29932a01768N001b9851j56200
9963a86051C4310M482N1470b48820C84M00190h8932c8181j26753A24536A3236
9951e4945A23964a61054F5593d17434A09909C1427J42204h8203B80750f13839
9940B54058d1711k35463i5365P973A86858b29858L1989b2839A16667g9943A15841
9928B49625b57777j15350J40795A54811c33088a34295h325E309i0863k67191P4756
9917b83298A86525a40558C4157a02124q3560k54415A41300c8468j26014A80045
9906a71191A18555g2545B24698C2168c602j42731p1516i8756B94159F7428B8219
$$ plain form
9894 309151 -278042 -61759 -145360 -22524 -214605 128919 55296 -114461 -29151 103010 -47053
9882 133691 -63862 370608 118838 145162 162984 -120425 -177450 -7246 5955 -211801 -25148
9870 -48795 -195597 -79702 -44817 79031 -95201 184794 -43222 -144300 166853 36387 58448
9859 58448 -271675 -287806 -9079 16288 -123219 78200 -216536 70887 -101670 183083 -13056
9847 294350 -245094 -187857 270186 -126099 50312 -222910 -548273 308609 -124745 -279071
9837 -279071 -208787 -37817 91803 -160415 172792 -129942 -166088 94555 -7746 27966 -171549
9825 -186323 270179 -259504 -147048 231668 -40006 -112154 284925 -253872 85288 -293271
9814 197238 301430 25293 -302056 -512447 -58002 -375893 -123369 -235738 41575 -129065
$$ packed form
9894C09151b78042f1759q3601b2524j92081A28919E5296a14461b9151A03010d7053
9882A33691f3862C70608A18838K6324J7822a20425n7025g246E955b11801b5148
9870d8795j46802g9702L4885G9031i5201A84794d3222j01078A66853C6387K2061
9859E8448b71675j6131i079A6288a23219G8200b16536G0887a01670A83083a3056
9847B94350b45094N7237B70186a26099E0312b22910l25363C08609a24745j54326
9837b79071P0284c7817I1803a60415A72792a29942l6146I4555g746B7966a71549
9825a86323B70179b59504J12456B31668d0006p2148B84925b53872H5288b93271
9814A97238J04192B5293c02056k10391e8002l17891a23369j12369D1575a29065
$$ plain form
9803 -73451 -286831 -34159 -210099 -128683 -86577 -322279 201661 318189 133872 -305364
9792 -142698 78453 -123250 -245347 -14957 -35243 -110365 57831 59814 185567 -105659 -205703
9781 -205703 184645 -136613 -36776 -214783 -228538 279602 103983 -44923 31583 -70138 48676
9769 356105 -219184 -40922 -111170 -232027 -278077 -246676 239757 -194710 -49314 -389996 21922
9757 -225388 -163035 -321990 21967 -319954 -332461 41036 218611 -73025 -117926 -341762 104895
9745 -104794 -258246 -44895 45846 -258359 57469 -58436 -211282 43730 -433207 -80228 -157901
9734 -157901 -185386 -371199 -50136 -198429 55016 -193387 -126948 97135 86970 -62006 -140925
9723 -140925 -324798 -231437 174959 -142270 72954 -268461 -146041 -75769 -354239 142796
$$ packed form
9803g3451k13380c4159j75940Q1416M2106k35702B01661J16528A33872c05364
9792a42698G8453a23250j22097a4957k0286p5122E7831J983J25753a05659j00044
9781b05703A84645a36613c6776j78007j3755B79602A03983d4923C1583g0138D8676
9769C56105b19184d0922p0248j20857m6050L1401B39757a94710d9314l40682B1922
9757b25388O2353j58955B1967c19954j2507D1036J77575g3025m4901k23836A04895
9745a04794j53452d4895D5846b58359E7469e8436j52846D3730d33207h0228p7673
9734a57901k7485j85813e0136j48293E5016a93387O6439I7135j0165f2006p8919
9723a40925j83873R3361A74959a42270G2954b68461J22420P0272k78470A42796
$$ plain form
9712 -533614 122485 -215495 -90000 184489 97079 -120733 -153200 -143079 -213416 4911 15581
9701 15581 70152 -145595 201086 -307852 -180566 -55747 -103381 6009 -306575 34918 197111
9690 197111 32032 -34830 -112527 -100300 -280352 -166113 118458 -305273 47785 112279 -163982
9678 160937 -343319 -39826 -66701 -96888 406416 -126150 -334434 15175 -22961 11371 -202942
9666 31035 -194546 39349 -125135 202209 73909 314229 -212276 -471920 -163921 -125245
9656 -125245 168232 167409 -68511 -83534 -24694 -92374 -36603 -134273 34974 -182266 87039 147425
9644 147425 -39776 260262 -377058 -209358 360562 -137350 -108703 -52585 41809 -76813 -6594
9632 -214399 51497 -164559 -120562 -247357 36660 -92510 121572 91779 63370 137657 -216576
$$ packed form
9712e33614A22485b15495i0000A84489q7410a20733l2467J0121p0337D911J0670
9701A5581N4571a45595B01086c07852J27286e5747m7634F009c06575C4918J62193
9690A97111C2032c4830p7697J2227j80052J14239A18458c05273D7785O4494a63982
9678A60937c43319c9826k6875l0187D06416a26150k08284A5175b2961A1371b02942
9666C1035a94546C9349a25135B02209G3909K40320b12276k59644a63921L8676
9656a25245A68232q23f8511j5023b4694o7680c6603r7670C4974a82266H7039O0386
9644A47425c9776B60262c77058J67700C60562a37350K8647e2585D1809g6813f594
9632b14399E1497a64559M3997j26795C6660i2510A21572k9793k8409P4287b16576
$$ plain form
9620 -11075 -97000 160044 7420 -72123 76535 -133709 156128 -210073 -309359 20080 -4970
9608 -99817 -87761 -45077 175022 120849 -65082 -214506 -52277 216543 -218300 -145632 156750
9596 85811 -248349 -18994 160711 -81759 -104586 33975 235852 -251197 50280 245767 114503
9584 -28678 -63552 19896 327438 -75781 -34339 -191948 -207757 42620 112588 -108860 213041
9572 201769 34237 -72589 25482 -55420 -100262 -242781 274919 -208951 -102932 19011 232790
9561 232790 -236018 -34449 87379 -173512 -186486 45019 -176995 -90703 -59775 29361 -95275
9549 -162839 191604 -161396 -264164 3504 -108754 -240050 -247405 139510 -56364 -222910 272
9537 3346 16240 -229446 -72605 156832 17141 -6863 -273330 178040 2653 -121679 -74522
$$ packed form
9620a1075q5925A60044G420g2123G6535a33709A56128b10073r9286B0080d970
9608i9817J2056M2684A75022n4173f5082j49424e2277B16543b18300P2668A56750
9596H5811b48349a8994A60711h1759k2827C3975K01877b51197E0280J95487A14503
9584b8678l4874A9896L07542g5781c4339j57609j5809D2620O9968a08860B13041
9572B01769C4237g2589B5482e5420m4842j42519B74919b08951a02932A9011K13779
9561B32790b36018c4449H7379a73512j2974D5019a76995Q6292L0928B9361i5275
9549a62839A91604a61396j02768C504a08754j31296p355A39510e6364j66546B72
9537C346J2894b29446g2605A56832A7141f863k66467A78040B653a21679M7157
$$ plain form
9526 -74522 135918 -162673 -81391 -133412 -121292 -120996 50225 -114508 152513 -511911 -27434
9514 -175487 16350 -91518 -41772 -50291 -67013 151999 175422 -169893 6195 228191 -156475
9502 -153443 -274215 -62455 -241223 -235549 -85376 -36597 -256419 175370 -30106 -92273 -98880
9491 -98880 -32446 -195202 197974 443655 88708 66437 -359520 -128916 82340 -186864 -84456
9479 -294475 -141860 102574 -86870 33985 38285 -193247 144721 17597 -190557 -188733 32254
9467 -152599 -156151 241689 -116234 6666 228622 -44559 52805 148793 -345083 82169 110477
9456 110477 55884 130911 -231876 6626 -185099 93340 -245020 -211666 -36141 157697 -184242
9444 -104913 -46064 -405032 -275990 -159686 -238864 -6159 -386089 201890 -287598 162948
$$ packed form
9526g4522A35918a62673Q1282n2021J2120K96E0225a14508A52513e11911b7434
9514a75487A6350i1518d1772q519j6722A51999K3423a69893F195K21996a56475
9502a53443j20772f2455j78768N674h5376c6597k19822A75370c0106o2167o607
9491i8880c2446j62756A97974K45681H8708k2271c59520a28916H2340a86864h4456
9479b94475a41860A02574h6870C3985M300a93247A44721A7597a90557J824C2254
9467a52599l552B41689a16234F666K21956d4559E2805R5988c45083H2169K8308
9456A10477n4593P5027b31876F626a85099I3340b45020L3354c6141A57697a84242
9444a04913d6064l58968J29042J16304p9178f159l79930B01890b87598A62948
$$ plain form
9433 -210530 35562 -278487 92279 -181068 11650 46259 -270861 73475 -113131 -169360 -68928
9421 218854 -150892 13556 46889 -159742 220912 -163169 -114449 59441 -100603 -144963 133170
9409 -241156 -182305 -8625 -127506 -200032 90527 29477 36166 -102963 -197293 -157378 42904 -159290
9396 -139993 -24590 239100 -107662 -62605 -183209 -489683 -200615 37790 -79 58572 -232324
9384 260205 171676 -124906 -8124 -181512 -147011 -153019 -322061 89166 -88165 -44986 -33437
9373 -33437 262277 40382 -182839 86470 -95159 43859 -127217 268030 -17055 -193403 -164669
9362 -164669 -176597 -122030 -337739 -45457 353304 -130382 89469 192564 -240872 2974 -94720
9350 44932 -143918 3784 139516 -15610 -187680 -114758 -227304 -241805 33991 -41547 60932
$$ packed form
9433b10530C5562b78487I2279a81068A1650L4609b70861G3475a13131n6229f8928
9421B18854a50892A3556L3333a59742B20912a63169M8720E9441a00603m4360A33170
9409b41156N8851h625j18881p2526I0527B9477O689a02963r4330L9915D2904a59290
9396a39993b4590B39100a07662M5057j20604l06474b00615C7790g9E8572b32324
9384B60205q8529a24906h124j73388L4501o008j69042H9166h8165M3179J1549
9373c3437B62277D0382a82839H6470i5159D3859a27217B68030a7055j76348K8734
9362a64669j1928N4567k15709d5457C53304a30382H9469J03095b40872B974i4720
9350D4932a43918C784J35732a5610j72070P2922j12546j4501C3991d1547F0932
$$ plain form
9338 110584 25761 -37762 -158450 4633 -41289 -80505 129318 -48740 32333 -57704 -113516
9327 -113516 -151160 -188296 110118 125205 -23472 -128440 143525 212149 35509 -152657 -230126
9316 -230126 12096 -242809 -195157 177886 -114432 -377948 -140481 -53027 138203 33667
9305 -46426 103863 -266829 227732 -156211 -124717 56031 -170556 -186715 -99710 -103053 -26182
9293 44452 161418 176224 196472 -194588 239609 -15847 -58497 -192694 122800 63291 -137322
9281 -420653 -4252 1641 55934 -4026 -194595 32351 -134659 -183411 -61779 -210428 -146658 101021
9268 6196 178380 -5939 -388665 -3540 -28046 -15362 -102003 228017 -7736 49160 -63733 6060
9255 -310621 -55702 -105033 -189047 76170 -388804 83147 -7847 32836 -105291 -40597 -108669
$$ packed form
9338A10584B5761c7762j20688D633d1289l9216A29318d8740C2333e7704n5812
9327a13516l7644l7136A10118J5087b3472j04968A43525O8624C5509a52657p7469
9316b30126A2096b42809M7652A77886a14432k63516a40481e3027A38203C3667
9305d6426A03863b66829B27732a56211L1494E6031a70556j6159Q7005l343b6182
9293D4452J16966J4806K0248a94588B39609a5847m2650j34197A22800n9509a37322
9281d20653d252A641N4293d026j90569C2351a34659m8752f1779j48649O3770A01021
9268F196J72184e939l82726c540k4506J2684q6641B28017g736D9160f3733F060
9255c10621e5702m9331q4014G6170c88804H3147g847C2836a05291d0597o8072
$$ plain form
9244 -108669 213145 113883 -65917 46309 -107730 -58490 47912 -110048 -102445 -192197 268264
9232 -75622 -120362 -446422 -60036 62489 324489 3390 128124 -143078 -121708 -174520 -18406
9220 47356 -95921 -518013 104370 261182 -161063 -145419 65948 207974 -113900 -292711
9210 -292711 190203 -148150 -58171 -118502 -172975 -15094 94696 171167 -117497 -130371 -649
9198 -318208 -249413 -112239 -278 -99245 2226 53789 411351 -115860 276286 -129021 -56531
9186 -113824 159669 58591 183113 -100724 -87851 -5964 -111814 -134422 120473 -343222 -22610
9174 -220276 -33600 94210 109465 -268389 -143272 4747 -109929 36295 67475 -302051 102404
9162 -182944 -248857 -49491 -51800 43182 -6602 7147 -95979 -394339 176860 -135294 -128195 -167261
$$ packed form
9244a08669B13145r9262f5917D6309a07730M9240D7912a10048P603q9752B68264
9232g5622m4740l26060f0036F2489K62000C390J24734a43078K1370n2812a8406
9220D7356i5921m22092A04370J56812a61063J5644F5948J42026a13900j78811
9210b92711A90203a48150e8171o0331n4473a5094I4696P6471a17497j2874f49
9198c18208O8795a12239b78r8967B226N1563L57562a15860B76286a29021e6531
9186a13824A59669E8591J24522a00724J2873e964j05850k2608A20473c43222b2610
9174b20276c3600I4210J5255b68389J25117D747a09929C6295L1180c02051A02404
9162a82944o5913d9491k309D3182f602G147i5979k98360A76860a35294P099l9066
$$ plain form
9150 -167261 -225345 -197376 -57416 -37941 133182 -28394 21935 -468163 43544 -97379 -246371
9139 -246371 -387517 -3388 76662 -290847 -251447 -111308 132548 -169 -119213 93593 -288434
9127 36091 135484 58981 7777 -124546 -156719 97039 -70260 -60034 -180881 -315402 120206
9115 -273703 -209771 -8670 18340 -116082 49203 -296509 83151 83616 -79758 -369494 30754 233286
9103 233286 -252356 -25848 192434 -300561 -91536 -82231 -48784 -200465 -27169 -471049 116362
9091 341689 4455 -74444 -71272 -119064 -214670 54368 14736 264922 225480 -68468 -11595 107108
9078 -332240 50628 -238503 -31795 -26299 108657 -40279 158584 30113 24839 -133074 -113306
9067 -113306 175608 -311909 -520639 -7558 -126728 74877 -162402 -40851 -271590 -310225 -33063
$$ packed form
9150a67261n8084K7969e7416J9475A33182b8394B1935d68163D3544i7379j48992
9139b46371j41146c388G6662b90847L9400a11308A32548a69j19044I3593b88434
9127C6091R9393E8981G777a24546l2173I7039g0260J0226j20847j34521A20206
9115b73703O3932h670A8340a16082D9203b96509H3151M65g9758k89736C0754K02532
9103B33286b52356b5848A92434c00561i1536R305L3447j51681b7169m43880A16362
9091C41689D455g4444L172m7792r5606E4368A4736K50186l9442f8468a1595A07108
9078c32240E0628b38503c1795N496A08657d0279A58584C0113n274a33074J9768
9067a13306A75608c11909k08730g558j19170G4877a62402d0851k30739l8635c3063
$$ plain form
9055 125369 -160224 -43343 121981 -32746 138044 77887 -552809 -175098 -148062 -169690 60152
9043 28903 42460 -293653 -87117 101996 -118565 -19411 76160 -271113 -5608 -83416 -71525
9032 -71525 -305165 -133124 233756 93280 -194661 -189196 105614 -234893 -171047 -79341 130028
9020 57581 212014 -153640 -37066 -97670 -9374 77021 -121382 -344685 -5871 63692 -212369
9008 -179015 142584 -9058 -228022 -170401 285931 -154851 195705 -150926 -42202 180026
8997 -265329 -307557 121931 -51958 143560 18528 194892 17527 29665 182735 250576 -408362
8985 -132820 263190 -84231 -115881 -154335 -86158 71157 -99363 -493051 2583 -169778 -216954
8974 -216954 14019 118589 -101927 -388027 115492 -340221 -294641 213332 -339104 -407939
$$ packed form
9055A25369a60224d3343A21981c2746A38044o0157e52809a75098K7036k1628F0152
9043B8903J3557b93653h7117A01996a18565a9411G6160b71113e608p7808J1891
9032g1525k33640a33124B33756I3280a94661N465A05614b34893O3846g9341A30028
9020E7581J54433a53640c7066o0604i374G7021a21382k23303e871F3692b12369
9008a79015A42584i058k18964N7621B85931a54851A95705a50926d2202A80026
8997b65329m2228A21931e1958A43560A8528J76364A7527J2138J53070O7841d08362
8985a32820B63190h4231l1650l8454O8177G1157i9363l93688B583a69778m7176
8974b16954A4019J04570a01927k86100A15492c40221M5580B13332c39104o8835
$$ plain form
8964 -407939 2804 -229939 304623 -217973 7487 198843 -32176 -176009 -28123 43014 -320836
8952 -55851 -57072 -176136 127408 79848 347217 233834 326298 101458 -16375 21706 -32511
8940 -40850 -49678 71705 -321132 -263279 -60325 -3083 -558495 -69944 -200748 -275158 47519 -364161
8927 -230142 57127 -157231 -76108 156385 430946 878243 768842 218597 348625 326572
8917 326572 -114944 13400 101793 -20066 -36500 -24279 -133712 -34289 62211 -122604 -29497
8905 289278 -36863 -50091 53610 -247107 -48666 53734 -75130 -401994 -349307 -99941 127585
8893 240482 -249524 -249090 272620 -96972 15550 66770 -48788 -57150 -187833 -95204 -174236 98310
8880 -222825 341959 166102 81212 180906 -449804 -315011 197656 150826 -92335 -102108 -78503
$$ packed form
8964d07939B804b29939C04623b17973G487J91356c2176j43833b8123D3014c20836
8952e5851j221j19064A27408m7560K67369j13383R2464A01458a6375B1706c2511
8940d0850q828G1705c21132N7853f0325c083n55412f9944j30804p4410D7519c64161
8927b30142E7127a57231g6108A56385K74561M47297j09401B18597J30028k2053
8917C26572a14944A3400Q8393b0066j6434J2221j09433c4289F2211a22604b9497
8905B89278c6863j3228E3610b47107d8666E3734g5130l26864N2687i9941A27585
8893B40482b49524M34B72620i6972A5550N1220d8788q362j30683R2629p9032I8310
8880b22825C41959A66102H1212R9694d49804J34793A97656m6830i2335r773K3605
$$ plain form
8869 -78503 -191283 109089 -38652 -39276 29423 -56706 -142571 5691 -147862 -45902 -24428 -118750
8857 -118750 -432906 95184 -331140 -454646 -122368 -416763 -37772 -76597 156133 150076 -247898
8845 46641 85015 -78511 -115057 -136071 130832 238792 -309080 -104892 176921 -126052 183772
8833 -147143 -76004 -107431 -27649 51941 235447 -246924 -189873 -37866 64236 -365710 62321
$$ packed form
8869g8503j12780A09089c8652o24B9423e6706q5865E691a47862d5902K1474r4322
8857a18750l14156I5184c31140j23506a22368k94395c7772l8825A56133o057b47898
8845D6641L8374g8511l6546k1014A30832J07960c09080a04892A76921a26052A83772
8833a47143P1139l1427b7649E1941J83506b46924N7051c7866F4236c65710F2321
$$ [...]
##END NTUPLES=NMR SPECTRUM
##END=
