##TITLE=AC1448_MCIAH13257_8011404_WFWI8kt7uq
##JCAMPDX= 6.0         $$ Bruker NMR JCAMP-DX V2.0
##DATA TYPE= NMR SPECTRUM
##DATA CLASS= NTUPLES
##ORIGIN= BRUKER
##OWNER= Administrator
$$ 1.72 TOPSPIN		Version 2.1
$$ 2013-07-05 21:16:36.090 -0700  Administrator@X
$$ Compression mode = diff/dup
##.OBSERVE FREQUENCY= 400.02188249412
##.OBSERVE NUCLEUS= ^1H
##.ACQUISITION MODE= SIMULTANEOUS (DQD)
##.ACQUISITION SCHEME= undefined
##.AVERAGES= 64
##.DIGITISER RES= 22
##SPECTROMETER/DATA SYSTEM= spect
##.PULSE SEQUENCE= noesygpps1d.comp
##.SOLVENT NAME= COFFEE_meoh
##.SHIFT REFERENCE= INTERNAL, COFFEE_meoh, 1, 14.96083
##AUDIT TRAIL= $$ (NUMBER, WHEN, WHO, WHERE, PROCESS, VERSION, WHAT)
$$ ##TITLE= Audit trail, TOPSPIN		Version 2.1
$$ ##JCAMPDX= 5.01
$$ ##ORIGIN= Bruker BioSpin GmbH
$$ ##OWNER= Administrator
$$ $$ E:\/data/COFFEE/nmr/AC1448_MCIAH13257_8011404_WFWI8kt7uq/12/pdata/1/auditp.txt
$$ ##AUDIT TRAIL=  $$ (NUMBER, WHEN, WHO, WHERE, PROCESS, VERSION, WHAT)
(   1,<2013-07-05 21:16:30.981 -0700>,<Administrator>,<X>,<go>,<TOPSPIN 2.1>,
      <created by zg
	started at 2013-07-05 21:05:01.028 -0700,
	POWCHK enabled, PULCHK disabled,
       configuration hash MD5:
       C8 4E 4E 5D D3 5C D8 9E 9F 52 82 E0 59 8A DE 15
       data hash MD5: 64K
       96 17 51 BF 94 8E 21 2F 82 55 B5 09 56 EA CD 8B>)
(   2,<2013-07-05 21:16:33.965 -0700>,<Administrator>,<X>,<proc1d>,<TOPSPIN 2.1>,
      <Start of raw data processing
       efp LB = 0.3 FT_mod = 6 PKNL = 1 PHC0 = 0 PHC1 = 0 SI = 128K 
       data hash MD5: 128K
       D4 E5 B1 FF E1 BD D3 14 6E BC 49 41 D1 6A 58 95>)
(   3,<2013-07-05 21:16:35.028 -0700>,<Administrator>,<X>,<proc1d>,<TOPSPIN 2.1>,
      <pk PHC0 = -82.76001 PHC1 = 0 
       data hash MD5: 128K
       49 23 28 13 EA FD 62 91 98 FC EE 95 28 04 D6 7C>)
(   4,<2013-07-05 21:16:35.481 -0700>,<Administrator>,<X>,<proc1d>,<TOPSPIN 2.1>,
      <abs ABSG = 1 
       data hash MD5: 128K
       5E C5 94 75 DD AA CC 63 F8 10 B9 D1 72 87 D6 7B>)
(   5,<2013-07-05 21:16:35.606 -0700>,<Administrator>,<X>,<proc1d>,<TOPSPIN 2.1>,
      <abs ABSG = 2 
       data hash MD5: 128K
       CE FC 1C 49 E1 71 A3 F7 5E 2C 05 71 2B 55 15 EE>)
(   6,<2013-07-05 21:16:35.715 -0700>,<Administrator>,<X>,<proc1d>,<TOPSPIN 2.1>,
      <abs ABSG = 3 
       data hash MD5: 128K
       28 BE C9 88 13 8B 38 93 79 3A 50 FB 0C AD 07 91>)
(   7,<2013-07-05 21:16:35.809 -0700>,<Administrator>,<X>,<proc1d>,<TOPSPIN 2.1>,
      <abs ABSG = 4 
       data hash MD5: 128K
       93 E3 D6 6B 76 0C D8 25 E7 34 D3 BF AC 0C A4 5C>)
(   8,<2013-07-05 21:16:35.887 -0700>,<Administrator>,<X>,<proc1d>,<TOPSPIN 2.1>,
      <abs ABSG = 5 
       data hash MD5: 128K
       D7 C9 7E 0F 6B FD 8E BD 4F 1B AD 00 30 13 5D 4F>)
$$ ##END=
$$ 
$$ $$ hash MD5
$$ $$ 5A 23 55 2B 36 FF 6A A5 5A F0 34 7B E6 F2 89 55
##$RELAX= 
##$RELAX= 
##$RELAX= 
##$RELAX= 
##$RELAX= 
##$RELAX= 
##$RELAX= 
##$RELAX= 
$$ Bruker specific parameters
$$ --------------------------
##$DU= <E:\>
##$EXPNO= 12
$$ [...]
##$TP07= 0
##$TPNAME0= <>
##$TPNAME1= <>
##$TPNAME2= <>
##$TPNAME3= <>
##$TPNAME4= <>
##$TPNAME5= <>
##$TPNAME6= <>
##$TPNAME7= <>
##$TPOAL= (0..7)
0.5 0.5 0.5 0.5 0.5 0.5 0.5 0.5
##$TPOFFS= (0..7)
0 0 0 0 0 0 0 0
##$TUNHIN= 0
##$TUNHOUT= 0
##$TUNXOUT= 0
##$USERA1= <user>
##$USERA2= <user>
##$USERA3= <user>
##$USERA4= <user>
##$USERA5= <user>
##$V9= 5
##$VALIST= <valist>
##$VCLIST= <CCCCCCCCCCCCCCC>
##$VD= 0
##$VDLIST= <DDDDDDDDDDDDDDD>
##$VPLIST= <PPPPPPPPPPPPPPP>
##$VTLIST= <TTTTTTTTTTTTTTT>
##$WBST= 1024
##$WBSW= 4
##$XGAIN= (0..3)
0 0 0 0
##$XL= 0
##$YL= 0
##$YMAX_a= 6198925
##$YMIN_a= -12015757
##$ZGOPTNS= <>
##$ZL1= 120
##$ZL2= 120
##$ZL3= 120
##$ZL4= 120
##$ABSF1= 14.96083
##$ABSF2= -5.597352
##$ABSG= 5
##$ABSL= 3
##$ALPHA= 0
##$AQORDER= 0
##$ASSFAC= 0
##$ASSFACI= 0
##$ASSFACX= 0
##$ASSWID= 0
##$AUNMP= <proc_prof1d_extract.lims>
##$AXLEFT= 0
##$AXNAME= <>
##$AXNUC= <1H>
##$AXRIGHT= 0
##$AXTYPE= 0
##$AXUNIT= <>
##$AZFE= 0.1
##$AZFW= 0.1
##$BCFW= 0
##$BC_mod= 0
##$BYTORDP= 0
##$COROFFS= 0
##$CY= 15
##$DATMOD= 1
##$DC= 0
##$DFILT= <>
##$DTYPP= 0
##$F1P= 0
##$F2P= 0
##$FCOR= 0.5
##$FTSIZE= 131072
##$FT_mod= 6
##$GAMMA= 0
##$GB= 0
##$INTBC= 1
##$INTSCL= 1
##$ISEN= 128
##$LB= 0.3
##$LEV0= 0
##$LPBIN= 0
##$MAXI= 10000
##$MC2= 0
##$MEAN= 0
##$ME_mod= 0
##$MI= 0
##$NCOEF= 0
##$NC_proc= -2
##$NLEV= 6
##$NOISF1= 0
##$NOISF2= 0
##$NSP= 0
##$NTH_PI= 0
##$NZP= 0
##$OFFSET= 14.96083
##$PC= 1
##$PHC0= -82.76001
##$PHC1= 0
##$PH_mod= 1
##$PKNL= yes
##$PPARMOD= 0
##$PPDIAG= 0
##$PPIPTYP= 0
##$PPMPNUM= 2147483647
##$PPRESOL= 1
##$PSCAL= 4
##$PSIGN= 0
##$PYNMP= <proc.py>
##$REVERSE= no
##$SF= 400.020009705848
##$SI= 131072
##$SIGF1= 0
##$SIGF2= 0
##$SINO= 400
##$SIOLD= 131072
##$SPECTYP= <>
##$SREGLST= <1H.CDCl3>
##$SSB= 0
##$STSI= 131072
##$STSR= 0
##$SW_p= 8223.68421052631
##$SYMM= 0
##$S_DEV= 0
##$TDeff= 65536
##$TDoff= 0
##$TI= <>
##$TILT= no
##$TM1= 0
##$TM2= 0
##$TOPLEV= 0
##$USERP1= <user>
##$USERP2= <user>
##$USERP3= <user>
##$USERP4= <user>
##$USERP5= <user>
##$WDW= 1
##$XDIM= 131072
##$YMAX_p= 402720194
##$YMIN_p= -12537
##$CURPLOT= <Network HP LaserJet P1505>
##$CURPRIN= <$Network HP LaserJet P1505>
##$DFORMAT= <normdp>
##$LAYOUT= <+/1D_H.xwp>
##$LFORMAT= <normlp>
##$PFORMAT= <normpl>
##$SURQMSG= 1
$$ End of Bruker specific parameters
$$ ---------------------------------
##NTUPLES= NMR SPECTRUM
##VAR_NAME=  FREQUENCY,     SPECTRUM/REAL,   SPECTRUM/IMAG
##SYMBOL=    X,             R,               I
##VAR_TYPE=  INDEPENDENT,   DEPENDENT,       DEPENDENT
##VAR_FORM=  AFFN,          ASDF,            ASDF
##VAR_DIM=   131072,        131072,          131072
##UNITS=     HZ,            ARBITRARY UNITS, ARBITRARY UNITS
##FACTOR=    0.0627417313425164, 1,          1
##FIRST=     8223.62146879497, 1542,         -54655
##LAST=      0,             3217,            -54386
##MIN=       0,             -12537,          0
##MAX=       8223.62146879497, 402720194,    0
$$ Real data points
##PAGE= N=1
##DATA TABLE= (X++(R..R)), XYDATA
$$ [...]
63955G27832M3252M9971N7328O5892P6208Q7877J00072J12480J25423J39259J53799
$$ 727832 771084 821055 878383 944275 1020483 1108360 1208432 1320912 1446335 1585594 1739393
63944A739393J68168J81115J91700J99749K05588K09282K10281K07662K00479
$$ 1739393 1907561 2088676 2280376 2480125 2685713 2894995 3105276 3312938 3513417
63935C513417J88018J70114J47467J21396R3050O2911L1161j622l4321o5788r5367
$$ 3513417 3701435 3871549 4019016 4140412 4233462 4296373 4327534 4325912 4291591 4225803 4130436
63924D130436j22783j47597j68806j85102j95689k00877k01863j99914j95722
$$ 4130436 4007653 3860056 3691250 3506148 3310459 3109582 2907719 2707805 2512083
63915B512083j89406j80924j70418j58297j45132j31531j18024j04972r2461q0428
$$ 2512083 2322677 2141753 1971335 1813038 1667906 1536375 1418351 1313379 1220918 1140490
63905A140490o9065n8994n0749m4034l7905l1867k6400k2151j9043j6672j5238
$$ 1140490 1071425 1012431 961682 917648 879743 847876 821476 799325 780282 763610 748372
63894G48372j5229j6284j7172j7100j6426j5803j5291j4635j3817j2720j0884
$$ 748372 733143 716859 699687 682587 666161 650358 635067 620432 606615 593895 583011
63883E83011q151n169k616k10K712N956Q671J0747J3022J5962J8935K1176K2759
$$ 583011 574860 569691 567075 566865 569577 575533 584204 594951 607973 623935 642870 664046 686805
63870F86805K4194K5676K7241K9026L0757L1440L0357K8179K6336K5291K4086
$$ 686805 710999 736675 763916 792942 823699 855139 885496 913675 940011 965302 989388
63859I89388K1673J8121J4337J0994Q034M868R65l641q299j2363j5850j9210k2539
$$ 989388 1011061 1029182 1043519 1054513 1062547 1067415 1068380 1064739 1056440 1044077 1028227 1009017 986478
63846I86478k5444k7751k9808l1837l3428l4125l4211l4385l4811l4906l4123
$$ 986478 961034 933283 903475 871638 838210 804085 769874 735489 700678 665772 631649
63835F31649l2517l0524k8479k6501k4603k2721k0798j8908j7234j5841j4623
$$ 631649 599132 568608 540129 513628 489025 466304 445506 426598 409364 393523 378900
63824C78900j3434j2209j0925r660q657q154q081q021p588o748n807n164m982
$$ 378900 365466 353257 342332 332672 324015 315861 307780 299759 292171 285423 279616 274452 269470
63811B69470m991m620l628k504j977k132k363k222j895j708j636j538j499j643
$$ 269470 264479 259859 256231 253727 251750 249618 247255 245033 243138 241430 239794 238256 236757 235114
63797B35114j935k448l333m229m244l073j699j259j585j645j122o09l97j68qn60
$$ 235114 233179 230731 227398 223169 218925 215852 214153 212894 211309 209664 208542 207933 207536 207368 207360 206800
63781B06800j753k396j693l87L12K44N5M0L2l7j90o96j477j675o90O02O80o05
$$ 206800 205047 202651 200958 200571 200883 201127 201182 201222 201254 201217 201027 200331 198854 197179 196489 197091 197771 197166
63763A97166j772j592l93O93J037P09O7m45m84r0L89P60J017R96N44P0L44J522
$$ 197166 195394 193802 193409 194102 195139 195848 195915 195470 194986 194896 195285 196045 197062 198058 198602 198672 199016 200538
63745B00538K831L444L259K643J940J416J231J252J181J016J032J214J312J462
$$ 200538 203369 206813 210072 212715 214655 216071 217302 218554 219735 220751 221783 222997 224309 225771
63731B25771K072K897L080K484K199L055M333M739M121L427L216L139K744K051
$$ 225771 227843 230740 233820 236304 238503 241558 245891 250630 254751 258178 261394 264533 267277 269328
63717B69328J242M06k91o64q59j300k220l434m456m697l823k250r49l89J5Q88
$$ 269328 270570 270976 270685 270021 269162 267862 265642 262208 257752 253055 249232 246982 246033 245644 245659 246547
63701B46547J794J821J036M95Q94J911K953L785M286M279L844L306K771K118J543
$$ 246547 248341 250162 251198 251693 252587 254498 257451 261236 265522 269801 273645 276951 279722 281840 283383
63686B83383J431J568J233L08l87k63J63J18l13m79j87K13M64N20K56l29p06k79
$$ 283383 284814 286382 287615 287923 287536 287273 287436 287554 287241 286762 286575 286788 287252 287772 288028 287699 286993 286714
63668B86714P06J280Q62o0n69l70j5l10j519l104m149m167l436k558j900j554
$$ 286714 287420 288700 289562 289502 288933 288563 288548 288238 286719 283615 279466 275299 271863 269305 267405 265851
63652B65851j640k211k910l109k502j397l72K53N86R66J585K271K678K718K733
$$ 265851 264211 262000 259090 255981 253479 252082 251710 251963 252549 253515 255100 257371 260049 262767 265500
63637B65500L046L552L980M367M932N615O115O428O905P654Q310Q610Q874R587
$$ 265500 268546 272098 276078 280445 285377 290992 297107 303535 310440 318094 326404 335014 343888 353475
63623C53475J0769J2113J3523J5075J6609J7811J8823K0227K2236K4227K5451
$$ 353475 364244 376357 389880 404955 421564 439375 458198 478425 500661 524888 550339
63612E50339K5960K6497K7526K8707K9229K8317K5429K0477J4136P702K285j798
$$ 550339 576299 602796 630322 659029 688258 716575 742004 762481 776617 784319 786604 784806
63600G84806m775o798p823q000p752p452p361p834r314j1831j4840j7755k0419
$$ 784806 780031 773233 765410 757410 749658 742206 734845 727011 717697 705866 691026 673271 652852
63587F52852k2808k4470k4729k3530k1656j9921j8382j6586j4385j2109j0039
$$ 652852 630044 605574 580845 557315 535659 515738 497356 480770 466385 454276 444237
63576D44237q052n953l850k011n47N74J426K265L544N428P387Q657R134R430J0005
$$ 444237 436185 430232 426382 424371 423824 424398 425824 428089 431633 437061 444448 453105 462239 471669 481674
63561D81674J0664J1041J1256J1795J3074J5287J8346K1744K4794K7412L0310
$$ 481674 492338 503379 514635 526430 539504 554791 573137 594881 619675 647087 677397
63550F77397L3892L7218L8587L7118L3124K7074J9057R631M54o681j1245j3949
$$ 677397 711289 748507 787094 824212 857336 884410 903467 913098 913552 906871 895626 881677
63538H81677j5408j5465j3848j1125q594p268p209p882r092j1294j4883j9384
$$ 881677 866269 850804 836956 825831 817237 809969 802760 794878 785786 774492 759609 740225
63526G40225k3615k6699k8603k9668k9962k9371k8067k6490k4858k2989k0720
$$ 740225 716610 689911 661308 631640 601678 572307 544240 517750 492892 469903 449183
63515D49183j8294j6184j4631j3414j2139j0675r344q604q515q474p682n951m027
$$ 449183 430889 414705 400074 386660 374521 363846 354502 345898 337383 328909 321227 315276 311249
63502C11249k890k702k692k190j487j277j482j273l57M31K64m82p86m04L4L10
$$ 311249 308359 305657 302965 300775 299288 298011 296529 295256 294899 295330 295594 295112 294326 293922 293956 294266
63486B94266J001K355L549L657K976K667L266M091M198L418K318J447R03M50j55
$$ 294266 295267 297622 301171 304828 307804 310471 313737 317828 322026 325444 327762 329209 330112 330562 330407
63471C30407r52j773k304k308j876j496j648k237k617k324j680j383j588j740
$$ 330407 329455 327682 325378 323070 321194 319698 318050 315813 313196 310872 309192 307809 306221 304481
63457C04481j309l63P08J692K571L287L829M381N184O208P180P961Q793J0151
$$ 304481 303172 302809 303517 305209 307780 311067 314896 319277 324461 330669 337849 345810 354603 364754
63443C64754J2329J5135J8068K0830K3550K6337K8706K9733K8808K6077K2181
$$ 364754 377083 392218 410286 431116 454666 481003 509709 539442 568250 594327 616508
63432F16508J7781J3304Q934M878J836R63K895O884J1463J5950K0652K5562K9761
$$ 616508 634289 647593 656527 661405 663241 664204 667099 673983 685446 701396 722048 747610 777371
63419G77371L2495L4047L4776L3959L0485K4459J7293J0275L829j847o228q921
$$ 777371 809866 843913 878689 912648 943133 967592 984885 995160 998989 997142 990914 981993
63407I81993j0110j0275r859r371r472j0627j2834j5786j9143k2590k5929k9106
$$ 981993 971883 961608 951749 942378 932906 922279 909445 893659 874516 851926 825997 796891
63395G96891l1943l3879l4314l3224l1120k8425k5284k2016j9193j7009j5077
$$ 796891 764948 731069 696755 663531 632411 603986 578702 556686 537493 520484 505407
63384E05407j3080j1253r833q381o206l306m22J783L257M289N116N967P139Q817
$$ 505407 492327 481074 471241 462860 456654 453348 452926 454709 457966 462255 467371 473338 480477 489294
63370D89294J0912J3224J5642J8069K0239K1905K3156K4424K6071K8134L0429
$$ 489294 500206 513430 529072 547141 567380 589285 612441 636865 662936 691070 721499
63359G21499L2719L4543L5184L4118L1465K7670K2874J7020J0572M510n73m839
$$ 721499 754218 788761 823945 858063 889528 917198 940072 957092 967664 972174 971601 966762
63347I66762q328j0397j0628r856r527j0201j1470j3198j5879j9578k3360k6280
$$ 966762 958434 948037 937409 927553 918026 907825 896355 883157 867278 847700 824340 798060
63335G98060k8292k9806l0741l0621k9270k6939k3939k0501j6836j3047r156n560
$$ 798060 769768 739962 709221 678600 649330 622391 598452 577951 561115 548068 538912 533352
63323E33352l218l019m941q039j1169j3616j5297j6571j7706j8314j7667j5734
$$ 533352 530134 527115 522174 514135 502966 489350 474053 457482 439776 421462 403795 388061
63311C88061j3487j1810j0478q801o848n332m453l677k772k231k438k996l258
$$ 388061 374574 362764 352286 343485 336637 331305 326852 323175 320403 318172 315734 312738 309480
63298C09480l070k656k162j690j463j539j591j372j142j312j779k003j688j036
$$ 309480 306410 303754 301592 299902 298439 296900 295309 293937 292795 291483 289704 287701 286013 284977
63284B84977l87N2J92P5k8K27Q29J339J317P50J5m63n06k29J09L70N93Q50J100
$$ 284977 284590 284642 284834 284909 284881 285108 285937 287276 288593 289343 289358 288895 288389 288160 288269 288639 289232 290082 291182
63265B91182J274J396J517J705K117K844L554L602K883K327K940M439N404M939
$$ 291182 292456 293852 295369 297074 299191 302035 305589 309191 312074 314401 317341 321780 327184 332123
63251C32123L723L106L663M951O323P433Q172Q572Q861R365J0300J1708J3467
$$ 332123 335846 338952 342615 347566 353889 361322 369494 378066 386927 396292 406592 418300 431767
63238D31767J5220J6579J7655J9056K1047K3007K4131K4474K4723K5128K5241
$$ 431767 446987 463566 481221 500277 521324 544331 568462 592936 617659 642787 668028
63227F68028K4710K3725K2629K1659K1161K1428K2169K2727K3010K3563K4428
$$ 668028 692738 716463 739092 760751 781912 803340 825509 848236 871246 894809 919237
63216I19237K4692K3625K1610J9319J6528J2535P395J797l982j0172j6553k2290
$$ 919237 943929 967554 989164 1008483 1025011 1037546 1044941 1046738 1042756 1032584 1016031 993741
63204I93741k6794l0066l2096l2670l2039l0989k9821k7814k4290j9811j5725
$$ 993741 966947 936881 904785 872115 840076 809087 779266 751452 727162 707351 691626
63193F91626j2688j0151p221l704j06L068N838Q504J1078J3217J4856J6439J8217
$$ 691626 678938 668787 661566 657862 657756 660824 666662 675166 686244 699461 714317 730756 748973
63180G48973J9597J9831J9201J8856J9411K0383K1070K1355K1263K0518J9034
$$ 748973 768570 788401 807602 826458 845869 866252 887322 908677 929940 950458 969492
63169I69492J7331J5889J4381J2081Q673M239j174p370j3643j9203k3873k7917
$$ 969492 986823 1002712 1017093 1029174 1037847 1042086 1040912 1033542 1019899 1000696 976823 948906
63157I48906l1332l3805l5183l5554l4998l3729l2276l0960k9412k7156k4517
$$ 948906 917574 883769 848586 813032 778034 744305 712029 681069 651657 624501 599984
63146E99984k2247k0381j8294j5841j3625j1962j0424q777p514o938o398n114
$$ 599984 577737 557356 539062 523221 509596 497634 487210 478433 470919 463981 457583 452469
63134D52469l309j796q27K0Q86J312Q91j19r74r98l4J420K555K985L082L415M003
$$ 452469 449160 447364 446537 446557 447443 448755 449646 449527 448553 447555 447521 448941 451496 454481 457563 460978 464981
63117D64981M337M045L310K665K556K935L235K936K229J775J719J429N66j42J28
$$ 464981 469318 473363 476673 479338 481894 484829 488064 491000 493229 495004 496723 498152 498718 498576 498704
63102D98704R90J246N08m08p29o21o18q15r90j024p99j21Q89J643J736J528J620
$$ 498704 499694 500940 501448 501040 500311 499690 499072 498257 497267 496243 495444 495323 496212 497855 499591 501119 502739
63085E02739J992K049J571J162J586K882M337N280N756O285P056P637P665P513
$$ 502739 504731 506780 508351 509513 511099 513981 518318 523598 529354 535639 542695 550332 557997 565510
63071E65510P887Q898J0035J1040J2251J3901J5589J6823J7705J8713K0079K1744
$$ 565510 573397 582295 592330 603370 615621 629522 645111 661934 679639 698352 718431 740175
63059G40175K3676K5891K8348L1203L4835L9161M3235M6123M8137N0500N3681
$$ 740175 763851 789742 818090 849293 884128 923289 966524 1012647 1060784 1111284 1164965
63048A164965N6626N7980N7639N6711N6208N6209N6192N5806N5138N4472N4056
$$ 1164965 1221591 1279571 1337210 1393921 1450129 1506338 1562530 1618336 1673474 1727946 1782002
63037A782002N4079N4602N5227N5030N3167M9682M5287M0222L3722K4984J4190
$$ 1782002 1836081 1890683 1945910 2000940 2054107 2103789 2149076 2189298 2223020 2248004 2262194
63026B262194K176j0514k3523l5984m6868n6025o3980p0513p4373p4971p3428
$$ 2262194 2264370 2253856 2230333 2194349 2147481 2091456 2027476 1956963 1882590 1807619 1734191
63015A734191p1156o7937o2562n5045m7096m0056l3406k5932j7737j0209m156
$$ 1734191 1663035 1595098 1532536 1477491 1430395 1390339 1356933 1331001 1313264 1303055 1298899
63004A298899J227P260J4173K0935K6429L0309L2872L4555L5703L6513L6971L7060
$$ 1298899 1300126 1307386 1321559 1342494 1368923 1399232 1432104 1466659 1502362 1538875 1575846 1612906
62992A612906L7166L7842L8946L9345L8005L5182L1943K8658K4594J9055J2187
$$ 1612906 1650072 1687914 1726860 1766205 1804210 1839392 1871335 1899993 1924587 1943642 1955829
62981A955829M370m495j4521k5053l4927m3467n0779n7164o2566o6621o9001o9647
$$ 1955829 1960199 1955704 1941183 1916130 1881203 1837736 1786957 1729793 1667227 1600606 1531605 1461958
62969A461958o8808o6857o4006o0333n6088n1741m7563m3410l9114l4891l1179
$$ 1461958 1393150 1326293 1262287 1201954 1145866 1094125 1046562 1003152 964038 929147 897968
62958H97968k8231k6101k4770k4011k3331k2380k1320k0519j9945j9131j7749
$$ 897968 869737 843636 818866 794855 771524 749144 727824 707305 687360 668229 650480
62947F50480j5967j4328j3322j3050j3063j2722j1837j0816j0043r345q321o980
$$ 650480 634513 620185 606863 593813 580750 568028 556191 545375 535332 525987 517666 510686
62935E10686n715m816m280m033l994l998l895l674l356k840k095j377j019j054
$$ 510686 504971 500155 495875 491842 487848 483850 479955 476281 472925 470085 467990 466613 465594 464540
62921D64540j285j591j981k421k761k814k492k044k083k926l893l870k717j479
$$ 464540 463255 461664 459683 457262 454501 451687 449195 447151 445068 442142 438249 434379 431662 430183
62907D30183r34p49m93o33j564k484k278j134j40L42P25R84P05K33L85Q86N79
$$ 430183 429249 428500 428007 427374 425810 423326 421048 419914 419774 420116 420841 421825 422530 422763 423148 424034 424613
62890D24613n77j178o11l6l52n88M25J976K525K005J586J557J068r3r51r10o91
$$ 424613 424036 422858 422247 422211 421859 421271 421696 423672 426197 428202 429788 431345 432413 432320 431369 430459 429768
62873D29768j202k244k911k742j987j121m75j71p7R9N16R97J159P80J07k50L8
$$ 429768 428566 426322 423411 420669 418682 417561 417086 416915 416838 416937 417453 418450 419609 420389 420496 420246 420284
62856D20284N39N66J67R3O32J085Q24K20k9Jk34o89q25n80m55o03n91j41M11N96
$$ 420284 420823 421389 421556 421649 422281 423366 424190 424410 424381 424382 424148 423459 422634 422054 421599 420996 420405 420264 420675 421271
62836D21271K41o35j825k717k610j476r6P27Q74Q21J073J726K379K548K321K371
$$ 421271 421512 420877 419052 416335 413725 412249 412153 412880 413754 414575 415648 417374 419753 422301 424622 426993
62820D26993L015L689L843L917M648N680N876N085M501M980N895O203N882N671
$$ 426993 430008 433697 437540 441457 446105 451785 457661 462746 467247 472227 478122 484325 490207 495878
62806D95878N957O590P416Q336R077R414R531R752J0168J0835J2028J3822J5766
$$ 495878 501835 508425 515841 524177 533254 542668 552199 561951 572119 582954 594982 608804 624570
62793F24570J7466J9280K1863K5230K8915L2861L7355M2156M6545N0530N5206
$$ 624570 642036 661316 683179 708409 737324 770185 807540 849696 896241 946771 1001977
62782A001977O1305O8030P3980P8857Q3413Q7877R1335R2885R2635R1034Q7712
$$ 1001977 1063282 1131312 1205292 1284149 1367562 1455439 1546774 1639659 1732294 1823328 1911040
62771A911040Q1643P2324O0306M6546L1733J6268N18j5126l0265m4485n7426o8757
$$ 1911040 1992683 2065007 2125313 2171859 2203592 2219860 2220378 2205252 2174987 2130502 2073076 2004319
62759B004319p7947q4239q7384q8247q8167q7521q5565q1813p7026p2336o7991
$$ 2004319 1926372 1842133 1754749 1666502 1578335 1490814 1405249 1323436 1246410 1174074 1106083
62748A106083o3433n8330n2899m7493m2419l8035l4496l1434k8334k5167k2291
$$ 1106083 1042650 984320 931421 883928 841509 803474 768978 737544 709210 684043 661752
62737F61752j9863j7712j5691j3712j1582r264p181n821n109m588l997l266k148
$$ 661752 641889 624177 608486 594774 583192 573928 566747 560926 555817 551229 547232 543966 541818
62724E41818n37J071K058K601L440M748N994O934Q015R653J1785J4235J6820J9029
$$ 541818 541281 542352 544410 547011 550451 555199 561193 568127 576142 585795 597580 611815 628635 647664
62710F47664K0459K1793K4395K8536L2924L6498L9797M3861M8620N3313N7832
$$ 647664 668123 689916 714311 742847 775771 812269 852066 895927 944547 997860 1055692
62699A055692O2652O7659P2102P5542P8101P9750Q0053P8595P5106O9234O0785
$$ 1055692 1118344 1186003 1258105 1333647 1411748 1491498 1571551 1650146 1725252 1794486 1855271
62688A855271N0153L7964K4365R266o708k2198l6169m8475n9235o8196p4948p9338
$$ 1855271 1905424 1943388 1967753 1977019 1970311 1948113 1911944 1863469 1804234 1736038 1661090 1581752
62676A581752q1467q1580q0159p7727p4443p0134o4989n9760n5064n0797m6550
$$ 1581752 1500285 1418705 1338546 1260819 1186376 1116242 1051253 991493 936429 885632 839082
62665H39082m2326l8382l4604l0634k6673k3575k1738k0332j8218j5484j3429
$$ 839082 796756 758374 723770 693136 666463 642888 621150 600818 582600 567116 553687
62654E53687j2904j3292j3376j2691j1468r828p867o240n803o497p351p599p168
$$ 553687 540783 527491 514115 501424 489956 480128 472261 466021 460218 453721 446370 438771 431603
62641D31603n999l951j621l36o22j466j714j510j575j792j515r12q17j372j797
$$ 431603 425604 421653 420032 419696 419074 417608 415894 414384 412809 411017 409502 408590 407773 406401 404604
62626D04604j552r26l17K99R74J527J961K606L567M413M672M384M065M263N126
$$ 404604 403052 402126 401809 402108 403082 404609 406570 409176 412743 417156 421828 426212 430277 434540 439666
62611D39666O163O615O373O292P228Q994J0776J2278J3825J5620J7687K0405K4141
$$ 439666 445829 452444 458817 465109 472337 481331 492107 504385 518210 533830 551517 571922 596063
62598E96063K8307L1736L4158L6495L9413M2358M4423M5352M5275M4155M1937
$$ 596063 624370 656106 690264 726759 766172 808530 852953 898305 943580 987735 1029672
62587A029672L8669L4034K7461J9159J0409K302n334j3094k0771k7544l2972l7089
$$ 1029672 1068341 1102375 1129836 1148995 1159404 1161706 1156372 1143278 1122507 1094963 1061991 1024902
62575A024902l9979m1865m3169m3797m2867l9931l6155l3200l1304k9382k6837
$$ 1024902 984923 943058 899889 856092 813225 773294 737139 703939 672635 643253 616416
62564F16416k4173k1760j9275j6701j4752j3713j2755j1141r393q414p974p048
$$ 616416 592243 570483 551208 534507 519755 506042 493287 482146 472753 464339 456365 449317
62552D49317n476m240l979m036l431k174j077n39j84L32P82Q63P98R81J188Q52
$$ 449317 443841 439601 435622 431586 428155 425981 424904 424365 424181 424513 425295 426158 426956 427937 429125 429977
62536D29977R8o0J035K705L679L569L155L321M276N799P703R846J2081J4443J7078
$$ 429977 430075 430015 431050 433755 437434 441003 444158 447479 451755 457554 465257 475103 487184 501627 518705
62521E18705J9870K2354K4248K5841K7747L0429L4010L8207M2221M5064M6311
$$ 518705 538575 560929 585177 611018 638765 669194 703204 741411 783632 828696 875007
62510H75007M6424M6014M5032M2864L9145L4060K7999K1196J3835O137j630r061
$$ 875007 921431 967445 1012477 1055341 1094486 1128546 1156545 1177741 1191576 1197713 1196083 1187022
62498A187022j5468k0176k3086k4696k5456k5240k3622k0524j6471j2226q293
$$ 1187022 1171554 1151378 1128292 1103596 1078140 1052900 1029278 1008754 992283 980057 971764
62487I71764m607o73L805Q383J2093J4428J5741J6452J6071J3647R072L458j995
$$ 971764 967157 966484 970289 978672 990765 1005193 1020934 1037386 1053457 1067104 1076176 1079634 1077639
62474A077639o958j1649j6136k0438k4902k9760l4421l7871l9780m0663m0861
$$ 1077639 1070681 1059032 1042896 1022458 997556 967796 933375 895504 855724 815061 774200
62463G74200l9992l7788l4857l2101k9615k6758k3250j9725j7046j5428j4274
$$ 774200 734208 696420 661563 629462 599847 573089 549839 530114 513068 497640 483366
62452D83366j2740j0376p398m501k318r64q9P11J621K606L535M262M702M845M693
$$ 483366 470626 460250 452852 448351 446033 445069 444980 445691 447312 449918 453453 457715 462417 467262 471955
62437D71955M216L425K450J424L98o16j663k921m553o316p594q019p936p917p997
$$ 471955 476171 479596 482046 483470 483868 483252 481589 478668 474115 467799 460205 452186 444250 436333 428336
62422D28336p736o960o047n356m803m177l614l465l763m078l925l291k655k400
$$ 428336 420600 413640 407593 402237 397434 393257 389643 386178 382415 378337 374412 371121 368466 366066
62408C66066k269j634l92O83P58p7r08r89k38J000K209K831K672K244K213K459
$$ 366066 363797 362163 361771 362454 363212 363135 362227 361238 361000 362000 364209 367040 369712 371956 374169 376628
62392C76628K331J783J526J866K185K032J912K372L037L362L743M835O266P099
$$ 376628 378959 380742 382268 384134 386319 388351 390263 392635 395672 399034 402777 407612 413878 420977
62378D20977P374P959Q870R075Q282P724Q485J0078J1446J2556J4041J5934J7805
$$ 420977 428351 436310 445180 454255 462537 470261 478746 488824 500270 512826 526867 542801 560606
62365E60606J9820K2521K5746K8760L1595L5229M0018M4819M8258N0266N1694
$$ 560606 580426 602947 628693 657453 689048 724277 764295 809114 857372 907638 959332
62354I59332N2718N2361M9611M4490L7833L0437K2697J4872P274P5o798j3321
$$ 959332 1012050 1064411 1114022 1158512 1196345 1226782 1249479 1264351 1271625 1271700 1264902 1251581
62342A251581j9141k3920k7912l1751l5571l8663m0256m0329l9388l7695l5164
$$ 1251581 1232440 1208520 1180608 1148857 1113286 1074623 1034367 994038 954650 916955 881791
62331H81791l1944k8620k5702k3193k0775j8362j6299j5116j4989j5512j6081
$$ 881791 849847 821227 795525 772332 751557 733195 716896 701780 686791 671279 655198
62320F55198j6541j7118j7710j7688j6739j5475j4594j3886j2682j1103r968r501
$$ 655198 638657 621539 603829 586141 569402 553927 539333 525447 512765 501662 491694 482193
62308D82193q990p956o802n962n184m216l509l477l574k883j433j54L82M90O50
$$ 482193 473203 465247 458445 452483 447299 443083 439574 436097 432523 429640 428207 428053 428435 428925 429575
62293D29575R40J326J919K619K946K606K015J930K662L788M609M734M292L721
$$ 429575 430515 431841 433760 436379 439325 441931 443946 445876 448538 452326 456935 461669 465961 469682
62279D69682L416L532L998M570M940M983M984N387O263P254Q198R513J1675J4569
$$ 469682 473098 476630 480628 485198 490138 495121 500105 505492 511755 519009 527207 536720 548395 562964
62265E62964J7693K0831K4114K7515L0708L3614L6716M0603M5269M9953N3601
$$ 562964 580657 601488 625602 653117 683825 717439 754155 794758 840027 889980 943581
62254I43581N5521N5692N4425N1768M7372M1017L3057K4195J5047O179j862q939
$$ 943581 999102 1054794 1109219 1160987 1208359 1249376 1282433 1306628 1321675 1327854 1325992 1317053
62242A317053j5639k2697l0076l6945m2557m6746m9695n1581n2474n2164n0110
$$ 1317053 1301414 1278717 1248641 1211696 1169139 1122393 1072698 1021117 968643 916479 866369
62231H66369m6109m0998l6203l2364k8876k5004k0910j7278j4357j1862r550p403
$$ 866369 820260 779262 743059 710695 681819 656815 635905 618627 604270 592408 582858 575455
62219E75455n415l574k015q73j4Q23J658K247K360J979J320P23M44L13j74j240
$$ 575455 570040 566466 564451 563578 563564 564387 566045 568292 570652 572631 573951 574674 575118 575431 575257 574017
62203E74017k420l001k758k150j841k143k758k949k190q40Q8J13m8O58K307M004
$$ 574017 571597 568596 565838 563688 561847 559704 556946 553997 551807 550967 551055 551168 551120 551778 554085 558089
62187E58089N104N828O585P298P651P640P469P171O678O159N925O045O344O912
$$ 558089 563193 569021 575606 582904 590555 598195 605664 612835 619513 625672 631597 637642 643986 650898
62173F50898Q274J0855J4370J8020K1319K4524K8102L1948L5402L8019L9926M1219
$$ 650898 659172 670027 684397 702417 723736 748260 776362 808310 843712 881731 921657 962876
62161I62876M1273L9043L4060K6940J8912J1088M110j880p044j1551j5377j8597
$$ 962876 1004149 1043192 1077252 1104192 1123104 1134192 1138302 1136422 1129378 1117827 1102450 1083853
62149A083853k1728k5326k9095l1900l3071l3249l3335l2958l0867k6837k2235
$$ 1083853 1062125 1036799 1007704 975804 942733 909484 876149 843191 812324 785487 763252
62138G63252j8313j4827j1086p625n707n384n227m186k718j685j009m3J351K865
$$ 763252 744939 730112 719026 711401 705694 700310 695083 690897 688179 686494 685485 685442 686793 689658
62124F89658M465O264P923Q946R445R855R917Q717O030K992J069O71J038J150
$$ 689658 694123 700387 708310 717256 726701 736556 746473 755190 761220 764212 765281 765952 766990 768140
62110G68140M68r79k887n080p607j0301j2374j2913j1870j0103q267o128l252
$$ 768140 768608 767629 764742 759662 752055 741754 729380 716467 704597 694494 686227 680099 676847
62097F76847N6K933M860N978O669P242P918Q772R626J0183J0303J0098R813R733
$$ 676847 676903 679836 684696 690674 697343 704585 712503 721275 730901 741084 751387 761485 771298 781031
62083G81031J0048J0656J1313J2066J3320J5277J7485J9261K0415K1278K2140
$$ 781031 791079 801735 813048 825114 838434 853711 871196 890457 910872 932150 954290
62072I54290K2915K3393K3571K3644K3808K4123K4576K5167K5841K6274K5874
$$ 954290 977205 1000598 1024169 1047813 1071621 1095744 1120320 1145487 1171328 1197602 1223476
62061A223476K4255K1566J8093J3757Q452K726k482o874j0826j4328j6803j8406
$$ 1223476 1247731 1269297 1287390 1301147 1309599 1312325 1309843 1302969 1292143 1277815 1261012 1242606
62049A242606k0543k4234k8627l2129l4524l6764l8925l9809l8831l7067l5840
$$ 1242606 1222063 1197829 1169202 1137073 1102549 1065785 1026860 987051 948220 911153 875313
62038H75313l5164l4286l3048l1812l0456k8428k5661k2806k0393j8336j6343
$$ 875313 840149 805863 772815 741003 710547 682119 656458 633652 613259 594923 578580
62027E78580j4425j2769j1443j0421r732r337r009q504p882p518p704q277q743
$$ 578580 564155 551386 539943 529522 519790 510453 501444 492940 485058 477540 469836 461559 452816
62014D52816q667p921o584m883l248k135j535q26N94K553M222M987M985M763M656
$$ 452816 444149 436228 429644 424761 421513 419378 417843 417017 417611 420164 424386 429373 434358 439121 443777
61999D43777M562M204L461K511J706J280J226J351J331P27o77k394l493l644l642
$$ 443777 448339 452543 456004 458515 460221 461501 462727 464078 465409 466136 465459 463065 459572 455928 452286
61984D52286m372n544o063n537m727m331m117l549k773k345k348k339k097j947
$$ 452286 447914 442370 436307 430770 426043 421712 417595 414046 411273 408928 406580 404241 402144 400197
61970D00197k216k732k958k582j891j543j842k297k092j045J24P10Q22J035J437
$$ 400197 397981 395249 392291 389709 387818 386275 384433 382136 380044 378999 379123 379833 380655 381690 383127
61955C83127J523J055O18J003K297L814M927N668O409P256Q051Q858J0045J1719
$$ 383127 384650 385705 386323 387326 389623 393437 398364 404032 410441 417697 425748 434606 444651 456370
61941D56370J3457J4745J5534J6072J6453J6623J6592J6327J5610J4376J3032
$$ 456370 469827 484572 500106 516178 532631 549254 565846 582173 597783 612159 625191
61930F25191J1973J0944R386P312N229L225R07j668l760n029o067p310q103p580
$$ 625191 637164 648108 657494 664806 670035 673260 674167 672499 668739 663710 657643 650333 642230 634650
61916F34650o016m467l292j828N02L449O400Q931J0774J1725J1934J1841J1586
$$ 634650 628634 624167 620875 619047 619549 622998 629398 638329 649103 660828 672762 684603 696189
61903F96189J0657Q456N037J226k004m255n949p836j0131j2246j3512j3984j4179
$$ 696189 706846 715302 720339 721565 719561 715306 709357 701521 691390 679144 665632 651648 637469
61890F37469j4196j3644j2476j1330j0732j0367r557q215o934o280o319o825p551
$$ 637469 623273 609629 597153 585823 575091 564724 555167 546952 540018 533738 527419 520594 513043
61877E13043q247q611q403p595o384n090l957k953j793l15J250K515L426M285
$$ 513043 504796 496185 487782 480187 473803 468713 464756 461803 460010 459695 460945 463460 466886 471171
61863D71171N283O263P058P841Q901J0258J1796J3677J6165J9078K1715K3645
$$ 471171 476454 482717 489775 497616 506517 516775 528571 542248 558413 577491 599206 622851
61851F22851K5180K6755K8149K8715K8330K7572K6800K5504K2884J8905J4460
$$ 622851 648031 674786 702935 731650 759980 787552 814352 839856 862740 881645 896105
61840H96105J0444O859K950j737o478r809j0938j0591j0123r866q798n902j494
$$ 896105 906549 913408 916358 914621 908143 898334 887396 876805 866682 856816 848018 842116 840622
61827H40622L042O500Q596R657R922R246P351M334P54k929o824j1207j5699j9433
$$ 840622 843664 850164 858760 868417 878339 887585 894936 899270 900024 897095 890271 879064 863365 843932
61813H43932k2138k4416k6648k8191k8258k7106k5634k4077k1927j9137j6539
$$ 843932 821794 797378 770730 742539 714281 687175 661541 637464 615537 596400 579861
61802E79861j4774j3495j1993j0238q772p878p306o731o156n746n490n154m495
$$ 579861 565087 551592 539599 529361 520589 512711 505405 498674 492518 486772 481282 476128 471633
61789D71633l511k421j464p86n57r43j787k514k654k344k068j964j762j324q91
$$ 471633 468122 465701 464237 463451 462894 461951 460164 457650 454996 452652 450584 448620 446858 445534 444643
61774D44643p06p39q61r53p98j91O64J211J093M43l78j007r96n2J402K389K424
$$ 444643 443937 443198 442337 441384 440586 440395 441059 442270 443363 443806 443428 442421 441425 441373 442775 445164 447588
61757D47588K023J786J500O89l99j041j086j050j220j345j307j345j488j332p73
$$ 447588 449611 451397 452897 453586 453187 452146 451060 450010 448790 447445 446138 444793 443305 441973 441200
61742D41200l47m36o43m64j85m37j074j236n89J73L04k9j33K59Q03J228J737K614
$$ 441200 440853 440417 439774 439310 439125 438688 437614 436378 435789 435962 436266 436237 436104 436363 437166 438394 440131 442745
61724D42745L674M307M036L043K071J745J978K134J812J307J188J533J786J322
$$ 442745 446419 450726 454762 457805 459876 461621 463599 465733 467545 468852 470040 471573 473359 474681
61710D74681N6j453k422k404j730j326j904l206m258m380l795l157k772k509k178
$$ 474681 474737 473284 470862 468458 466728 465402 463498 460292 456034 451654 447859 444702 441930 439421 437243
61695D37243j743j213o92n09r92k012k950l258k958k489k254k320k496k540k373
$$ 437243 435500 434287 433595 433086 432094 430082 427132 423874 420916 418427 416173 413853 411357 408817 406444
61680D06444k094j843j637j460j392j505j679j734j682j669j649j459j196j187
$$ 406444 404350 402507 400870 399410 398018 396513 394834 393100 391418 389749 388100 386641 385445 384258
61666C84258j455j616j498j423j583j585j059l62p8j6N02J419J797J141J77j35
$$ 384258 382803 381187 379689 378266 376683 375098 374039 373677 373599 373583 374085 375504 377301 378442 378619 378484
61650C78484K64Q19J329J947K507K578K140J664J496J592J836K151K229J639M03
$$ 378484 378748 379567 380896 382843 385350 387928 390068 391732 393228 394820 396656 398807 401036 402675 403078
61635D03078r38j910k502k868l071l264l734m435m843m558l823l105k484j787
$$ 403078 402140 400230 397728 394860 391789 388525 384791 380356 375513 370955 367132 364027 361543 359756
61621C59756j066n15q7L29M72o2j100j864j814j200o38m55o17j072j866l031m443
$$ 359756 358690 358175 358088 358417 358889 358827 357727 355863 354049 352849 352211 351756 351139 350067 348201 345170 340727
61604C40727n724o323n931m929m128l920l860l299k254j344r80r53q74p80r47
$$ 340727 335003 328680 322749 317820 313692 309772 305912 302613 300359 299015 298035 297082 296208 295428 294481
61589B94481j356j589j398j067j003j185j353j527j939k397k323j673j267j705
$$ 294481 293125 291536 290138 289071 288068 286883 285530 284003 282064 279667 277344 275671 274404 272699
61575B72699k402k298j291k55K37M62O81O01O4m16l23R9L13L20M98Q61J075J070
$$ 272699 270297 267999 266708 266453 266690 267152 267833 268434 268498 268082 267759 267858 268171 268491 268989 269850 270925 271995
61557B71995J026Q71L77k34l67R7N72N38J78m9l8R9L82Q02J082J012R35J358K154
$$ 271995 273021 273892 274269 274035 273668 273765 274337 274875 275053 275004 274966 275065 275447 276249 277331 278343 279278 280636 282790
61538B82790K567K202J551J300J484J648J584J421J112M20m76q61l76L40L22n44
$$ 282790 285357 287559 289110 290410 291894 293542 295126 296547 297659 298079 297603 296742 296366 296706 297028 296484
61522B96484j478j850j815j797j769j403o85m1J41n0j91J8M38O82N96M04K98P4
$$ 296484 295006 293156 291341 289544 287775 286372 285687 285646 285787 285737 285546 285564 286002 286684 287280 287684 287982 288056
61504B88056n52j372j797j634j367j462j728j583q50K7M94M19R8r5%L59R71J840
$$ 288056 287504 286132 284335 282701 281334 279872 278144 276561 275711 275738 276232 276651 276749 276654 276654 277013 277984 279824
61486B79824K685K906K124P46l20n47j57L43O85Q72R86J085J080P78K51J7M04
$$ 279824 282509 285415 287539 288285 287965 287418 287261 287604 288289 289161 290147 291232 292312 293090 293341 293358 293762
61469B93762R47R85P39R48J372Q20r21k268j843l89L60Q7j23K01L10k35p64o17
$$ 293762 294709 295694 296433 297381 298753 299573 298652 296384 294541 294152 294512 294599 294476 294677 294987 294752 293988 293371
61451B93371o3L97P92J183J168N37p7R4R27J675K011K214K504K725K778K852L099
$$ 293371 293308 293705 294497 295680 296848 297385 297308 297402 298329 300004 302015 304229 306733 309458 312236 315088 318187
61434C18187L351L305K903K397K106K052J928J449P32J93J16M83J083J633J829
$$ 318187 321538 324843 327746 330143 332249 334301 336229 337678 338410 338603 338719 339202 340285 341918 343747
61419C43747J619J423J712K333K580K048J134N28N02P60P65R4j190k430k901k590
$$ 343747 345366 346789 348501 350834 353414 355462 356596 357124 357626 358386 359151 359245 358055 355625 352724 350134
61403C50134k161k116k298k335k099j594q41j96k35r52j520j317q12q24j231j195
$$ 350134 347973 345857 343559 341224 339125 337531 336690 336494 336259 335307 333787 332470 331658 330834 329603 328408
61387C28408m97J60K43J17L51Q81J265J353J249R23L53q3Q8P45J224J206J124
$$ 328408 327911 328071 328314 328431 328782 329663 330928 332281 333530 334453 334806 334723 334811 335556 336780 337986 339110
61370C39110J441J925K047J808J630J522J091M95O26J878L298L712L289L194L847
$$ 339110 340551 342476 344523 346331 347961 349483 350574 351069 351695 353573 356871 360583 363872 367066 370913
61355C70913M501M634M777N539O619P377P794Q098P924O755N042L945L880M028
$$ 370913 375414 380048 384825 390364 396983 404360 412154 420252 428176 434931 439973 443918 447798 451826
61341D51826L592K853K596K939L309L278K891K168R13p63k123k429j842j330j611
$$ 451826 455418 458271 460867 463806 467115 470393 473284 475452 476365 475602 473479 471050 469208 467878 466267
61326D66267k400k825k381j340l55J01M2j12O4N58R82J222J736K904M300N135
$$ 466267 463867 461042 458661 457321 456966 457067 457109 456997 457061 457619 458601 459823 461559 464463 468763 473898
61310D73898N349N811P243R362J1266J2257J2198J1376J0202Q907P375N572L958
$$ 473898 479247 485058 492301 501663 512929 525186 537384 548760 558962 567869 575244 580816 584774
61297E84774L009K321R04j407l537m568m871n332o044o543o819p247p676p572
$$ 584774 587783 590104 591008 589601 586064 581496 576625 571293 565249 558706 551887 544640 536964 529392
61283E29392o999o646o726o589n668m198k764j660r39o14m16J41J137K000K210
$$ 529392 522393 515747 509021 502432 496764 492566 489802 488142 487203 486589 486173 486314 487451 489451 491661
61268D91661J964J798J906K226K913M217N917P350Q069Q180Q028P820P610P359
$$ 491661 493625 495423 497329 499555 502468 506685 512602 519952 528021 536201 544229 552049 559659 567018
61254E67018O873N876M391K880J822J172M64n41j543k167k502k922l475l769l544
$$ 567018 573891 579767 584158 587038 588860 590032 590496 589955 588412 586245 583743 580821 577346 573577 570033
61239E70033l059k737k607k402k007j536j039m21K84Q29J089J272J701K438L249
$$ 570033 566974 564237 561630 559228 557221 555685 554646 554225 554509 555338 556427 557699 559400 561838 565087
61224E65087L837M061M007L985M343N121N893O157N976O022O773P766P957O865
$$ 565087 568924 572985 576992 580977 585320 590441 596334 602491 608467 614489 621262 629028 636985 643850
61210F43850N079L522K537J921J587J714K358L287M347N619P160Q772J0188J1279
$$ 643850 648929 652451 654988 656909 658496 660210 662568 665855 670202 675821 682981 691753 701941 713220
61196G13220J2075J2775J3681J4841J5652J5204J3170J0163P202M965L556K587
$$ 713220 725295 738070 751751 766592 782244 797448 810618 820781 827983 832948 836504 839091
61184H39091J467k6j391k001k084k609m057n843p184p995q604r128r575j0111
$$ 839091 840558 840532 839141 837140 835056 832447 828390 822547 815363 807368 798764 789636 780061 769950
61170G69950j0830j1574j2342j3368j4461j4845j4195j3295j2958j2814j2017
$$ 769950 759120 747546 735204 721836 707375 692530 678335 665040 652082 639268 627251
61159F27251j0708r786r428q858p629o154m839l540k140q45K92J429K214J753
$$ 627251 616543 606757 597329 588471 580842 574688 569849 566309 564169 563324 563616 565045 567259 569012
61145E69012j86k530l995m388m381m406m323l907l172k215j074K61J825L536N052
$$ 569012 568826 566296 562301 557913 553532 549126 544803 540896 537724 535509 534435 534696 536521 540057 545109
61130E45109N994O413O872P843R305J0954J2589J4131J5547J6938J8520K0295
$$ 545109 551103 557516 564388 572231 581536 592490 605079 619210 634757 651695 670215 690510
61118F90510K1911K2918K3155K2868K2539K2501K2530K2008K0735J9351J8528
$$ 690510 712421 735339 758494 781362 803901 826402 848932 870940 891675 911026 929554
61107I29554J7909J6457J3820J0724P949N493K928M6l175o691j0216j3315j5932
$$ 929554 947463 963920 977740 988464 996413 1001906 1004834 1004880 1001705 995014 984798 971483 955551
61094I55551j8378k0619k2053k2332k1966k1680k1572k1334k0946k0618k0213
$$ 955551 937173 916554 894501 872169 850203 828523 806951 785617 764671 744053 723840
61083G23840j9284j7694j5850j4294j3205j2310j1143r491p681o314n664n448
$$ 723840 704556 686862 671012 656718 643513 631203 620060 610569 602888 596574 590910 585462
61071E85462n118m179k379kK067K976K789K348K306K673L321M281N412O415P367
$$ 585462 580344 576165 573786 573784 575851 578827 581616 583964 586270 588943 592264 596545 601957 608372 615739
61056F15739Q650J0124J1069J1280J1619J2925J4951J6921J8614K0273K1893K3233
$$ 615739 624389 634513 645582 656862 668481 681406 696357 713278 731892 752165 774058 797291
61044G97291K4278K5221K6129K7080K8312K9881L1477L2942L4571L6506L8311
$$ 797291 821569 846790 872919 899999 928311 958192 989669 1022611 1057182 1093688 1131999
61033A131999L9557M0365M0936M1137M1087M1471M2672M4179M5754M8458N3513
$$ 1131999 1171556 1211921 1252857 1293994 1335081 1376552 1419224 1463403 1509157 1557615 1611128
61022A611128O0626O8544P6871Q6161R6550J07749J20520J36876J58693J87097
$$ 1611128 1671754 1740298 1817169 1903330 1999880 2107629 2228149 2365025 2523718 2710815
61012B710815K23257K68501L23682L89902M70101N68295O87045Q27817R94107
$$ 2710815 2934072 3202573 3526255 3916157 4386258 4954553 5641598 6469415 7463522
61003G463522J189162J403445J601579J724851J713207J533619J198224P65618
$$ 7463522 8652684 10056129 11657708 13382559 15095766 16629385 17827609 18593227
60995A8593227L27225j8370j98663j96592o0180J15196K23192J83612l3235l98900
$$ 18593227 18920452 18902082 18703419 18506827 18446647 18561843 18785035 18968647 18935412 18536512
60985A8536512q36254j245829j542220j683572j677815j565279j393657j201555
$$ 18536512 17700258 16454429 14912209 13228637 11550822 9985543 8591886 7390331
60977G390331j014159q45119o99540n77258m75988l93011l25389k70216k25448
$$ 7390331 6376172 5531053 4831513 4254255 3778267 3385256 3059867 2789651 2564203
60968B564203j90044j62914j42059j25137j10655r8232q7738p8602p0034o1642
$$ 2564203 2374159 2211245 2069186 1944049 1833394 1735162 1647424 1568822 1498788 1437146
60958A437146n3479m5691l8442l2169k7473k4503k2753k1644k0975k0541j9788
$$ 1437146 1383667 1337976 1299534 1267365 1239892 1215389 1192636 1170992 1150017 1129476 1109688
60947A109688j8289j6343j4530j2926j1261r721q794q380p769o727n966o193p165
$$ 1109688 1091399 1075056 1060526 1047600 1036339 1026618 1017824 1009444 1001675 994948 988982 982789 975624
60934I75624q022q195p809p391p313p349o863n660m454l964l859l347k627k715
$$ 975624 967602 959407 951598 944207 936894 929545 922682 917022 912568 908604 904745 901398 898771 896056
60920H96056l759m672m804m876n580o297o049n035m285m250m669n361o233o795
$$ 896056 892297 887625 882821 877945 872365 866068 860019 854984 850699 846449 841780 836419 830186 823391
60906H23391o578n894n451n428n555n887o571p098o761n861n593o498p803q580
$$ 823391 816813 810919 805468 800040 794485 788598 782027 774929 768168 762307 756714 750216 742413 733833
60892G33833q799q908q980q735q108p437p140p376p871q111p930p731p861p975
$$ 733833 725034 716126 707146 698411 690303 682866 675726 668350 660479 652368 644438 636707 628846 620871
60878F20871p542o759o332o430o493o162n690n264m631l732l102l166l526l431
$$ 620871 613329 606570 600238 593808 587315 581153 575463 570199 565568 561836 558734 555568 552042 548611
60864E48611k747k031j768j894k052k117k364l135m228m899m624l739k988k603
$$ 548611 545864 543833 542065 540171 538119 536002 533638 530503 526275 521376 516752 513013 510025 507422
60850E07422k329k198k602l525m375m782n043n406n504m943m093l744m151m845
$$ 507422 505093 502895 500293 496768 492393 487611 482568 477162 471658 466715 462622 458878 454727 449882
60836D49882n309n457n430n185m426l074j652r46j009r67k57L18l92j971k617
$$ 449882 444573 439116 433686 428501 424075 421001 419349 418403 417394 416427 416170 416488 416096 414125 411508
60821D11508j482J65O38j06p95o13J56Q10Q02l0j186j593o91P78J522J123K13
$$ 411508 410026 410191 410829 410723 409928 409315 409471 410281 411083 411053 409867 408274 407583 408361 409883 411006 411219
60804D11219m99p86p12m71l76n42p25q09j088j601j682r24j59n72k042l331l778
$$ 411219 410720 409934 409222 408751 408375 407833 407108 406299 405211 403610 401928 401004 400845 400273 398231 394900 391122
60787C91122l761l567k993k270k159k691k867k186j486j569j855j371l02L55K44
$$ 391122 387361 383794 380801 378531 376372 373681 370814 368628 367142 365573 363718 362347 362045 362400 362644
60772C62644k27q09j531k056j844r98j87K58N60Q35Q97Q54J170J908K416K112
$$ 362644 362417 361608 360077 358021 356177 355179 354992 355250 355810 356645 357542 358396 359566 361474 363890 366002
60756C66002J212M71M18J021J881K568K862K808K534K178J935J959J995J476K82
$$ 366002 367214 367685 368103 369124 371005 373573 376435 379243 381777 383955 385890 387849 389844 391320 391602
60741C91602r46j632k074k890l938m465m244l792l508l269l019l022l301l444
$$ 391602 390656 389024 386950 384060 380122 375657 371413 367621 364113 360844 357825 354803 351502 348058
60727C48058l257l061l057k963k639k472k711k921k618k025j665j550j380j202
$$ 348058 344801 341740 338683 335720 333081 330609 327898 324977 322359 320334 318669 317119 315739 314537
60713C14537j235j222o57L51J000P24k11j099j503j414j033n18J46R89J754K004
$$ 314537 313302 312080 311423 311774 312774 313498 313287 312188 310685 309271 308238 307720 307866 308855 310609 312613
60697C12613J654J143Q44O57M77O38J402K286K590K384K325K587K703K508K436
$$ 312613 314267 315410 316254 316911 317388 318026 319428 321714 324304 326688 329013 331600 334303 336811 339247
60682C39247K723L005L030L102L436L625L276K692K449K612K857L018L011K524
$$ 339247 341970 344975 348005 351107 354543 358168 361444 364136 366585 369197 372054 375072 378083 380607
60668C80607J335j26j109j416j541j963k615l103l120k630j854j110n21JL57J93
$$ 380607 381942 381816 380707 379291 377750 375787 373172 370069 366949 364319 362465 361355 360834 360835 361192 361385
60652C61385n07j058p83R2P86J021J188J443J359N86o54j989l239m139m296l804
$$ 361385 360878 359820 359037 359129 359915 360936 362124 363567 364926 365512 364858 362869 359630 355491 351195 347391
60636C47391l442l708m087l771k898k352k446k458j644k41Q18R06K18n53q43n60
$$ 347391 343949 340241 336154 332383 329485 327133 324687 322229 320585 320344 321162 322068 322286 321733 320890 320330
60620C20330N8P99J543J973J597M33o33o37K70J009R36N39N17P88Q49O78O56Q21
$$ 320330 320388 321187 322730 324703 326300 326733 326100 325463 325733 326742 327678 328217 328734 329522 330371 331049 331705 332526
60602C32526Q58Q14J153J922K438K096J152L42J03M43J244K185K584J919N23o24
$$ 332526 333384 334198 335351 337273 339711 341807 342959 343301 343404 343847 345091 347276 349860 351779 352302 351678
60586C51678q63k90O96J677K022J134o39j813j194P43K432L080L279L804M520
$$ 351678 350815 350525 351221 352898 354920 356054 355415 353602 352408 353151 355583 358663 361942 365746 370266
60571C70266M900N022N509O632Q005R019R333Q909P977O939N972M710K634p8k448
$$ 370266 375166 380188 385697 392329 400334 409353 418686 427595 435572 442511 448483 453193 455827 455749 453301
60556D53301l674l966m135m482m455l459j673J48J513K566L686N008O346P454
$$ 453301 449627 445661 441526 437044 432589 429130 427457 427605 429118 431684 435370 440378 446724 454178
60542D54178Q253Q923R870J1307J2796J3450J2829J1423R906Q234N935L116M57
$$ 454178 462431 471354 481224 492531 505327 518777 531606 543029 552935 561169 567104 570220 570677
60529E70677j788l988o029o890o022m480l787m054m162l650l242l384l359k366
$$ 570677 568889 564901 558872 551982 545960 541480 537693 533639 529477 525827 522585 519201 515842 513476
60515E13476p48N54J189J476J702J997K573L482M366M975N831P735J0756J4229
$$ 513476 512728 513282 514471 515947 517649 519646 522219 525701 530067 535042 540873 548608 559364 573593
60501E73593J7743K1458K5397K9027L1843L3959L5767L7231L7791L6850L4177
$$ 573593 591336 612794 638191 667218 699061 733020 768787 806018 843809 880659 914836
60490I14836K9949K4434J7663R517K29r346j8237k5979l2479l7430m0350m1249
$$ 914836 944785 969219 986882 996399 996628 987282 969045 943066 910587 873157 832807 791558
60478G91558m0718l9242l6826l3490k9752k6285k3337k0798j8555j6586j4790
$$ 791558 750840 711598 674772 641282 611530 585245 561908 541110 522555 505969 491179
60467D91179j3031j1309r727q395p473p112p182p232o823n890m670l486k641k330
$$ 491179 478148 466839 457112 448717 441244 434132 426950 419718 412895 407005 402335 398849 396208 393878
60453C93878k479k786l017l096k902k262j242k68K23P4n91j354j534p66L06N08
$$ 393878 391399 388613 385596 382500 379598 377336 376094 375826 376049 376123 375532 374178 372644 371878 372184 372692
60437C72692l99j303j253p44q11j373j462q27k88l53m46O6Q91J340J274R74N00
$$ 372692 372293 370990 369737 368993 368182 366809 365347 364520 364232 363879 363433 363499 364390 365730 367004 367978 368478
60420C68478j99p76p37j34M85P89R45J133J200J017Q09Q50R88Q31L99K66Q32J649
$$ 368478 368279 367503 366766 366632 367117 367906 368851 369984 371184 372201 373010 373860 374848 375679 376078 376344 377176 378825
60402C78825J814J132M58P03J677K353K179J645J429J475J328J092J434K594L842
$$ 378825 380639 381771 382229 382932 384609 386962 389141 390786 392215 393690 395018 396110 397544 400138 403980
60387D03980M234L606K546J517N36k79l29Q20K630L934M129L659L196K816K282
$$ 403980 408214 411820 414366 415883 416419 416140 415811 416631 419261 423195 427324 430983 434179 436995 439277
60372D39277J799J867K487K943K590J576N75J7j79k79k73J75J356L081M653N376
$$ 439277 441076 442943 445430 448373 450963 452539 453114 453131 452952 452673 452400 452575 453931 457012 461665 467041
60356D67041N233M950N299O371P588Q419Q915R439R893R534P671M467Q60k272
$$ 467041 472274 477224 482523 488894 496482 504901 513816 523255 533148 542682 550353 554820 555680 553408
60342E53408m691o517p708q080p705p064o665o550o256n347l992k909k621k912
$$ 553408 548717 542200 534492 526412 518707 511643 504978 498428 492172 486825 482833 479924 477303 474391
60328D74391l226l406l650l903l815l350k890k519j812o56K33J99l37k91Q32K640
$$ 474391 471165 467759 464109 460206 456391 453041 450151 447632 445820 445164 445397 445596 445259 444968 445800 448440
60312D48440M624O621Q566J0326J1909J3482J5127J6805J8455J9747J9888J8138
$$ 448440 453064 459685 468251 478577 490486 503968 519095 535900 554355 574102 593990 612128
60300F12128J4486R563L940k045p900j2953j6745j9161k0115j9614j8000j5769
$$ 612128 626614 636177 640117 638072 630172 617219 600474 581313 561198 541584 523584 507815
60288E07815j3123j0211p615n963n064m147l044k446k740l382l736l868m033l990
$$ 507815 494692 484481 476866 470903 465839 461692 458648 456202 453462 450080 446344 442476 438443 434453
60274D34453l419k607k143k154k326k409k313j960j448j211j517j977j879j011
$$ 434453 431034 428427 426284 424130 421804 419395 417082 415122 413674 412463 410946 408969 407090 406079
60260D06079J47R01Q94L84J13O37J588J965J363N47M26Q89J139Q26K84j48m78
$$ 406079 406226 407127 408021 408405 408518 409155 410743 412708 414071 414618 415044 415933 417072 417898 418182 418034 417556
60243D17556p67r19q47m80K41J109J548J205N41M06J053J939K502K710K784K774
$$ 417556 416789 415870 415023 414543 414784 415893 417441 418646 419187 419593 420646 422585 425087 427797 430581 433355
60227D33355K524J901J001K61K59J136K310L041L204L191L275L458L841M655N765
$$ 433355 435879 437780 438781 439042 439301 440437 442747 445788 448992 452183 455458 458916 462757 467412 473177
60212D73177O630O883O728O576O483O146N293M003K737K056K174K788L388L678
$$ 473177 479807 486690 493418 499994 506477 512623 517916 521919 524656 526712 528886 531674 535062 538740
60198E38740L564K952J894Q23K43R3k58j229k521l520l969m038l884l465k795
$$ 538740 542304 545256 547150 547973 548216 548309 548051 546822 544301 540781 536812 532774 528890 525425 522630
60183E22630k143j844j969k269k469k494k390k130j629r84m36j81k64o45j179
$$ 522630 520487 518643 516674 514405 511936 509442 507052 504922 503293 502309 501873 501692 501428 500783 499604
60168D99604j518j373r14o96j039j676k101k010j414n53J74M84N13O43R83J340
$$ 499604 498086 496713 495799 495103 494064 492388 490287 488277 486863 486310 486484 486968 487481 488124 489107 490447
60152D90447J667K097K462K359J854J564J726J806J385Q94R25J334J675K043K786
$$ 490447 492114 494211 496673 499032 500886 502450 504176 505982 507367 508261 509186 510520 512195 514238 517024
60137E17024L691M179M136L960L924M067M404M670M193K752J241O51O36O5j097
$$ 517024 520715 524894 529030 532990 536914 540981 545385 550055 554248 557000 558241 558892 559528 559593 558496
60122E58496j609p87M87J026P44L31K00K55K64J5n62j184j472j460j484j545j426
$$ 558496 556887 556100 556587 557613 558357 558688 558888 559143 559407 559422 558860 557676 556204 554744 553260 551715 550289
60105E50289j416k031k886k836j662o33p35j227q66K09Q83R03J104J948K861L198
$$ 550289 548873 546842 543956 541120 539458 538825 538090 536863 535997 536206 537089 537992 539096 541044 543905 547103
60089E47103K990K555K098J897K240K905L186K748J951J143J55j173k494l478
$$ 547103 550093 552648 554746 556643 558883 561788 564974 567722 569673 570816 570971 569798 567304 563826
60075E63826m455n873p418q281q243p832p364o561n450m874n421o308o165m823
$$ 563826 559371 553498 546080 537799 529556 521724 514360 507799 502349 497475 492054 485746 479581 474758
60061D74758l512l229l682m076m119l874l286k431j712j212l71J079K350K619
$$ 474758 471246 468017 464335 460259 456140 452266 448980 446549 444837 443625 443254 444333 446683 449302
60047D49302K397K868M094M941M820M388M263M091L370K392J748J482J215O97
$$ 449302 451699 454567 458661 463602 468422 472810 477073 481164 484534 486926 488674 490156 491371 492068
60033D92068j49j268k225k482k263k560l819n215n782n694n717n901n729n225
$$ 492068 491919 490651 488426 485944 483681 481121 477302 472087 466305 460611 454894 448993 443264 438039
60019D38039n030n297n355m627l367k256j709j718k017k207j979j394q52o57p60
$$ 438039 433009 427712 422357 417730 414363 412107 410398 408680 406663 404456 402477 401083 400231 399574 398814
60004C98814r22r90j007j093j273j347j065l68O27J817L022L760L554K641J921
$$ 398814 397892 396902 395895 394802 393529 392182 391117 390749 391376 393193 396215 399975 403529 406170 408091
59989D08091J923K212K108J599J096O57L2o64r17n59p7j26r16k118l090l279k671
$$ 408091 410014 412226 414334 415933 417029 417686 417718 417054 416137 415578 415501 415375 414459 412341 409251 405972 403301
59972D03301j867j501j568j583j307j014r84j063q94l62L21Q70J090R04L56l69
$$ 403301 401434 399933 398365 396782 395475 394461 393477 392414 391520 391158 391479 392349 393439 394343 394699 394330
59956C94330r78j202r51l56K98P41Q33O83O46J016J665K146K290K365K507K305
$$ 394330 393352 392150 391199 390843 391141 391882 392715 393398 394044 395060 396725 398871 401161 403526 406033 408338
59940D08338J392J48o96r93j117j160q39j76M49R79J702K473K730K517K625L420
$$ 408338 409730 409878 409182 408189 407072 405912 405073 404897 405346 406325 408027 410500 413230 415747 418372 421792
59924D21792M223M406M262M248M112L545L048L282L976M322M105L650K966J835
$$ 421792 426015 430421 434683 438931 443043 446588 449636 452918 456894 461216 465321 468971 471937 473772
59910D73772O15kj7k28j131k345l163l213k528j475o34l28k58L5M81P70J097J944
$$ 473772 474387 474385 474368 474140 473009 470664 467501 464288 461760 460285 459651 459323 459065 459100 459581 460351 461448 463392
59892D63392L135L772L342K424K072K762M046N026N103M511M055M224M799N371
$$ 463392 466527 470299 473641 476065 478137 480899 484945 489971 495074 499585 503640 507864 512663 518034
59878E18034N822N950N243L643K020J147N73o29k361l701m402n035n686n635m621
$$ 518034 523856 529806 535049 538692 540712 541859 542432 541803 539442 535741 531339 526304 520618 514983 510362
59863E10362l393k589j971j192n25k33Q8R51K241L530M694N780O636P047O943
$$ 510362 506969 504380 502409 501217 500692 500459 500547 501498 503739 507269 511963 517743 524379 531426 538369
59848E38369O192M667K756J286N92J99k40l43J82O83L03q77k088k998l810m531
$$ 538369 544561 549228 551984 553270 553862 554061 553821 553478 553660 554343 554646 553769 551681 548683 544873 540342
59832E40342m818m622m238l659k516q81L76L77q56k482l637l950l563k889k341
$$ 540342 535524 530902 526664 523005 520489 519608 519984 520361 519505 517023 513386 509436 505873 502984 500643
59817E00643k058j896j754j818k298k890k802j678l13Or92k173k379j762j325
$$ 500643 498585 496689 494935 493117 490819 487929 485127 483449 483136 483142 482150 479977 477598 475836 474511
59802D74511j531k050k625l309l830l564k472j469j290j560j435q40m43o07r30
$$ 474511 472980 470930 468305 464996 461166 457602 455130 453661 452371 450811 449376 448536 448093 447486 446556
59787D46556q42l18K05L26N1k78k75J94R74J722K023J611P01k7j1O05J229J519
$$ 446556 445714 445396 445601 445927 445978 445700 445425 445619 446593 448315 450338 451949 452650 452623 452612 453217 454446 455965
59769D55965J540J340Q59K63l7J35N18P54O59J96l83m15O00K147L016K664J846
$$ 455965 457505 458845 459704 459967 459930 460065 460583 461337 461996 462192 461809 461394 461994 464141 467157 469821 471667
59752D71667J592K047K610K811K609K211J973K203K767L108K925K545K328K017
$$ 471667 473259 475306 477916 480727 483336 485547 487520 489723 492490 495598 498523 501068 503396 505413
59738E05413J178qp91o81J09R79J409J239P76N94R96J711K196K184J856J612J708
$$ 505413 506591 506583 505792 505111 505220 506199 507608 508847 509623 510217 511213 512924 515120 517304 519160 520772 522480
59721E22480J954J796R43r7m56J3N22L44l58q88q61m25P5L76M60N92R66J305J224
$$ 522480 524434 526230 527173 527076 526620 526633 527155 527499 527141 526253 525392 524967 525042 525418 525878 526470 527436 528741 529965
59702E29965R83J288K195K857K664J993J476J194J028J113J299Q56m85j776j986
$$ 529965 530948 532236 534431 537288 539952 541945 543421 544615 545643 546756 548055 548911 548426 546650 544664
59687E44664j459j259j490j380q65q14j546k270k380k307k608l076l348l639m194
$$ 544664 543205 541946 540456 539076 538211 537397 535851 533581 531201 528894 526286 523210 519862 516223 512029
59672E12029m555m144l275k830l102l532l522l042k362j686j164r11q52p28l28
$$ 512029 507474 503330 500055 497225 494123 490591 487069 484027 481665 479979 478815 477904 477052 476324 475996
59657D75996L54J158J826K047J737J253J110J378J566J255O35J82p6o03j628k723
$$ 475996 476350 477508 479334 481381 483118 484371 485481 486859 488425 489680 490315 490497 490421 489818 488190 485467
59641D85467l263l112k555j837j075n43n55j010j398j386j144j004j041j143j264
$$ 485467 482204 479092 476537 474700 473625 473082 472527 471517 470119 468733 467589 466585 465544 464401 463137
59626D63137j431j681k059k515k728k331j465p82p90j368k079k557k518j770n81
$$ 463137 461706 460025 457966 455451 452723 450392 448927 448145 447355 445987 443908 441351 438833 437063 436482
59611D36482L49O46P52J297K238L032L371L294K704J505K06k15N80J693J871Q15
$$ 436482 436831 437477 438229 439526 441764 444796 448167 451461 454165 455670 455876 455661 456241 457934 459805 460620
59595D60620n65j200q55j26L17K23l20j108j736j741j140o37p90j195j064n58
$$ 460620 460055 458855 458000 457874 458191 458414 458094 456986 455250 453509 452369 451732 450942 449747 448683 448125
59579D48125p29j952l220l450k788k073j586j128q76j241j954k169j527n39K34
$$ 448125 447396 445444 442224 438774 435986 433913 432327 431199 430323 429082 427128 424959 423432 422893 423127
59564D23127P45J134J313J177Q36M34K6j93J61J285K811L977M190L554K927L188
$$ 423127 423872 425006 426319 427496 428332 428766 428792 428599 428760 430045 432856 436833 441023 444577 447504 450692
59548D50692M277N212N352N281N958P352Q668R851J1908J5299J8654J9674J7095
$$ 450692 454969 460181 465533 470814 476772 484124 492792 502643 514551 529850 548504 568178 585273
59535E85273J1499M510k220p467j0525j1309j0287q189n709l341j300M48J981
$$ 585273 596772 601282 599062 591595 581070 569761 559474 551285 545576 542235 540935 541383 543364
59522E43364L114L442K789J534K62r34k437m299n803o270n993n872o250o682o819
$$ 543364 546478 549920 552709 554243 554505 553571 551134 546835 541032 534762 528769 522897 516647 509965 503146
59507E03146o834o776o220m959l594k930l023l191k797j804p23j73k88n07k85
$$ 503146 496312 489536 483316 478357 474763 471833 468810 465619 462822 461018 460295 460122 459834 459327 459042
59492D59042R5j2m38l14N01J026O86K91Q49K166L404M293M947N160M875M822N675
$$ 459042 459137 459125 458687 458373 458874 459900 460586 460877 461726 463892 467296 471589 476536 481696 486571 491393 497068
59475D97068O877P290O669N591M349K916J749J395J485J193O22N97J193J658J765
$$ 497068 503945 511235 517904 523495 527844 530760 532509 533904 535389 536582 537204 537801 538994 540652 542417
59460E42417K118K912L683M391N575P150Q220Q522Q806R348R295Q132O716N919
$$ 542417 544535 547447 551130 555521 561096 568246 576466 584988 593794 603142 612437 620569 627285 633204
59446F33204N241L576P00k769o215r074j0655j0782j0077r079p673n948m784m728
$$ 633204 638445 642021 642721 639952 633737 624663 614008 603226 593149 584070 576397 570449 565665 560937
59432E60937m954m411l418k981k908j851O97L574N418O273P281R265J1968J4469
$$ 560937 555983 551572 548154 545173 542265 540414 541111 544685 550103 556376 563657 572922 584890 599359
59418E99359J6222J7667J9729K2691K5766K7747K7564K4102J6483N360o397j5306
$$ 599359 615581 633248 652977 675668 701434 729181 756745 780847 797330 802690 796293 780987
59406G80987j9639j9900j7346j2766o697r3N579Q726Q213L865l400j1971j9933
$$ 780987 761348 741448 724102 711336 704639 704546 710125 718851 727064 730929 727529 715558 695625
59393F95625k5351k7000k5299k2078j8869j5789j2436r219o931n443l803j698
$$ 695625 670274 643274 617975 595897 577028 561239 548803 539584 532653 527210 523407 521709
59381E21709O1O65L20j32o9N58J411K107K566L034L652M181M444M700N186N565
$$ 521709 521770 522435 522755 522623 522554 523112 524523 526630 529196 532230 535882 540063 544507 549207 554393 559958
59365E59958N445N145N286N745N841N515N447N896O245O168O326P358Q717R370
$$ 559958 565403 570548 575834 581579 587420 592935 598382 604278 610523 616691 623017 630375 639092 648462
59351F48462R378R922J1658J3702J4577J3818J2311J1154J0614J0154R239P745
$$ 648462 657840 667762 679420 693122 707699 721517 733828 744982 755596 765750 774989 782734
59339G82734N738L245L52k610n234p267q723r861j1066j2506j3776j4196j3543
$$ 782734 788472 791717 792069 789459 784225 776958 768235 758374 747308 734802 721026 706830 693287
59326F93287j2295j1003r778q602p747p416p286o781n746m473l273k347j882j789
$$ 693287 680992 669989 660211 651609 643862 636446 629160 622379 616633 612160 608887 606540 604658 602869
59312F02869j489m26J203K677L713M812O531Q706J0496J0974R652O649K475k356
$$ 602869 601380 600954 602157 604834 608547 613359 619890 628596 639092 650066 659718 666367 668842 666486
59298F66486p358j1779j4741j5979j6144j5861j4828j2364q750n289l025j964
$$ 666486 659128 647349 632608 616629 600485 584624 569796 557432 548682 543393 540368 538404
59286E38404j565j421j236p49J0P49J436K411L771N045N837O379P117P987Q573
$$ 538404 536839 535418 534182 533433 533443 534192 535628 538039 541810 546855 552692 559071 566188 574175 582748
59271E82748Q767Q875R030Q968Q462P701O971O109M572K174m30k283l171l845
$$ 582748 591515 600390 609420 618388 626850 634551 641522 647631 652203 654377 653947 651664 648493 644648
59257F44648n053o551p445p349o795o420o250n920n297m544l727k722j481j19
$$ 644648 639595 633044 625599 618250 611455 605035 598785 592865 587568 583024 579297 576575 575094 574975
59243E74975J214K405L228L470L301L328L944M746M916M250L374K799K224J140
$$ 574975 576189 578594 581822 585292 588593 591921 595865 600611 605527 609777 613151 615950 618174 619314
59229F19314k30j230j767k298k841k869k417k467l617n072n564m872l699k532
$$ 619314 619084 617854 616087 613789 610948 608079 605662 603195 599578 594506 588942 584070 580371 577839
59215E77839j454q56j299k538l503l587l315l407l689l398k272q91p5j28o85j127
$$ 577839 576385 575529 574230 571692 568189 564602 561287 557880 554191 550793 548521 547630 547555 547427 546742 545615
59199E45615j200j168j324j508j400j109j100j461j744j525q76p7P09J358J699
$$ 545615 544415 543247 541923 540415 539015 537906 536806 535345 533601 532076 531200 531123 531832 533190 534889
59184E34889J746J845K266K841L183L166L050L143L490L884M159M436M948N637
$$ 534889 536635 538480 540746 543587 546770 549936 552986 556129 559619 563503 567662 572098 577046 582683
59170E82683O184O556P225Q475R701R900Q799P029N241L594K203J388J130O95
$$ 582683 588867 595423 602648 611123 620824 630724 639523 646552 651793 655387 657590 658978 660108 660803
59156F60803o79k920n265p106q334r020r121q602p692o890o689p122p652p699
$$ 660803 660124 657204 651939 644833 636499 627479 618358 609756 602064 595174 588485 581363 573711 566012
59142E66012p330p157p449p689p238o203n241m690m231l471k504j799j658j862
$$ 566012 558682 551525 544076 536387 529149 522946 517705 513015 508784 505313 502809 501010 499352 497490
59128D97490j824j147q4P12R78J213K041L349M449M985N355O045P017P936Q758
$$ 497490 495666 494519 494435 495147 496125 497338 499379 502728 507177 512162 517517 523562 530579 538515 547273
59113E47273R634J0408J0599J0054R251Q764Q639Q407P572O056M288K954K443
$$ 547273 556907 567315 577914 587968 597219 605983 614622 623029 630601 636657 640945 643899 646342
59100F46342K373J924P68n47j351j622j742j826j734j567j613j873k106k258k373
$$ 646342 648715 650639 651407 650860 649509 647887 646145 644319 642585 641018 639405 637532 635426 633168 630795
59085F30795k271j940k085l454n524o810o728o292o533p092p090o583o256o159
$$ 630795 628524 626584 624499 621045 615521 608711 601983 595691 589158 582066 574976 568393 562137 555978
59071E55978n728m839l987l480l175k980k971l047l003k891k813k536j848j145
$$ 555978 550250 545411 541424 537944 534769 531789 528818 525771 522768 519877 517064 514528 512680 511535
59057E11535j031j426j743j800j870j937j688j312j383j771j535l16R11J004K8
$$ 511535 510504 509078 507335 505535 503665 501728 500040 498728 497345 495574 494039 493723 494634 495638 495666
59042D95666j067j633j634j149k61O01Q32L48j46K00J515L042L915M083M256M922
$$ 495666 494599 492966 491332 490183 489922 490523 491355 491703 491557 491757 493272 496314 500229 504312 508568 513490
59026E13490N713O043O033O343P303Q624R866J0576J0190Q430N894L559J736J12
$$ 513490 519203 525246 531279 537622 544925 553549 563415 573991 584181 592611 598505 602064 603800 603912
59012F03912j190j539r96n80q26r63k26Q31J296J542K784N110P080P504O793O113
$$ 603912 602722 601183 600187 599607 598781 597818 597592 598423 599719 601261 604045 609155 616235 623739 630532 636645
58996F36645N923N826N471M978M489L807K707J410M37k9m53j400k758l753l805
$$ 636645 642568 648394 653865 658843 663332 667139 669846 671256 671693 671664 671211 669811 667053 663300 659495
58981F59495l105k189j223O9J823L725N275O290P010P812Q783R611R892R554R003
$$ 659495 656390 654201 652978 653047 654870 658595 663870 670160 677170 684982 693765 703376 713268 722822 731825
58966G31825Q748Q987R464R747R584R005Q104O885N377L760K046j26l037o173
$$ 731825 740573 749560 759024 768771 778355 787360 795464 802349 807726 811486 813532 813406 810369 804196
58952H04196q574j0063j1508j3483j5227j5574j4505j3083j2088j1458j0975j0578
$$ 804196 795622 785559 774051 760568 745341 729767 715262 702179 690091 678633 667658 657080
58940F57080r929q435o126l970k902k870l110l122l012l018l017k544j435l09
$$ 657080 647151 638716 632590 628620 625718 622848 619738 616616 613604 610586 607569 605025 603590 603281
58926F03281j02r10j718j656j108j015j490j866j836j638j226k39J074J849J809
$$ 603281 603179 602269 600551 598895 597787 596772 595282 593416 591580 589942 588716 588477 589551 591400 593209
58911E93209J634J837K118K305L042M902P393R521J0861J1584J1859J1806J1670
$$ 593209 594843 596680 598798 601103 604145 609047 616440 625961 636822 648406 660265 672071 683741
58898F83741J1489J0921R963R409J0017J1476J2934J4274J6127J8657K1044K2426
$$ 683741 695230 706151 716114 725523 735540 747016 759950 774224 790351 809008 830052 852478
58886H52478K2737K2310K1072J8708J5427J2052R069O013K201k101n872q738j1446
$$ 852478 875215 897525 918597 937305 952732 964784 973853 979866 982067 979966 974094 965356 953910
58873I53910j4509j7119j8119j7577j6533j5527j4291j2724j1129r521p720o233
$$ 953910 939401 922282 904163 886586 870053 854526 840235 827511 816382 806861 799141 792908
58861G92908n978o874p771q058q355r196j0084j0520j0881j1551j2006j1623j0751
$$ 792908 786930 780056 772285 764227 755872 746676 736592 726072 715191 703640 691634 680011 669260
58848F69260j0117r753r263q666q171p587o743o045n912o047n910n503n000m143
$$ 669260 659143 649390 640127 631461 623290 615703 608960 602915 597003 590956 585046 579543 574543 570400
58834E70400k779j502r90j032j055j127j561j886j294J22J546K646L651M335M085
$$ 570400 567621 566119 565129 564097 563042 561915 560354 558468 557174 557296 558842 561488 565139 569474 573559
58819E73559L092K501L014M034M527M152L297K484J959J519O65o99j867k105j699
$$ 573559 576651 579152 582166 586200 590727 594879 598176 600660 602619 604138 604803 604104 602237 600132 598433
58804E98433j652k423l530m385m892n162n231n222n321n499n568n542n478n110
$$ 598433 596781 594358 590828 586443 581551 576389 571158 565936 560615 555116 549548 544006 538528 533418
58790E33418m096k600j160o4P09J080J082J254K105L237L735L469L207L294L145
$$ 533418 529322 526722 525562 525498 526207 527287 528369 529623 531728 534965 538700 542169 545376 548670 551815
58775E51815K372J582J409J382M44j625l986n761o747p075o696n549l976k598
$$ 551815 554187 555769 557178 558560 559004 557379 553393 547632 540885 533810 527114 521565 517589 514991
58761E14991j708j014k04N12P52P10R91J663K103K001J825J917J814J166P00J413
$$ 514991 513283 512269 512065 512577 513329 514039 515030 516693 518796 520797 522622 524539 526353 527519 528219 529632
58745E29632L080M427M702M242L646L168L027L474M300M906N057N100N325N633
$$ 529632 532712 537139 541841 546083 549729 552897 555924 559398 563698 568604 573661 578761 584086 589719
58731E89719N931O322O748O887O622O214N852N398M737M113L957M518N656O821
$$ 589719 595650 601972 608720 615607 622229 628443 634295 639693 644430 648543 652500 657018 662674 669495
58717F69495P430P489P613Q112Q440P954O874N836M804L175Q46j632l920o154
$$ 669495 676925 684414 692027 700139 708579 716533 723407 729243 734047 737222 738068 736436 732516 726362
58703G26362q350j0289j2072j4033j5925j6977j6911j6286j5605j4753j3598j2415
$$ 726362 718012 707723 695651 681618 665693 648716 631805 615519 599914 585161 571563 559148
58691E59148j1414j0432r347q343p350n983m351l334l484m106m055l181k347k201
$$ 559148 547734 537302 527955 519612 512262 506279 501928 498594 495110 491004 486949 483768 481421 479220
58677D79220k420k222j257J12J244J913K434L191M109M881N568O571Q014R506
$$ 479220 476800 474578 473321 473433 474677 476590 479024 482215 486324 491205 496773 503344 511358 520864
58663E20864J0594J1085J0768R288O538L081j83k657m418n923p350q249p984o644
$$ 520864 531458 542543 553311 562599 569137 572218 572035 569378 564960 559037 551687 543438 535454 528810
58649E28810n184m416m165l766l020k261j688j231q80o08r1R62K275L286L831
$$ 528810 523626 519210 515045 511279 508259 505998 504310 503079 502199 501591 501500 502462 504737 508023 511854
58634E11854M044L832L071K169J679J397O18o43j494j346n78K11R16J607K136
$$ 511854 515898 519730 522801 524970 526649 528046 528664 528021 526527 525181 524603 524814 525730 527337 529473
58619E29473K435K787L415M183M875N435N747N530M679L421J999N23q11j662j866
$$ 529473 531908 534695 538110 542293 547168 552603 558350 563880 568559 571980 573979 574502 573691 572029 570163
58604E70163j594j193j036j409k227k926l037k692k273j818j232p39n99n17nR61
$$ 570163 568569 567376 566340 564931 562704 559778 556741 554049 551776 549958 548726 547987 547388 546871 546866 547827
58588E47827K190L882O211Q477R672R821R935J0544J1121J1011J0196Q997P725
$$ 547827 550017 553899 560110 568587 578259 588080 598015 608559 619680 630691 640887 649884 657609
58575F57609O746O225N858N461N698P372J0035J2312J3579J4458J5524J6657J7784
$$ 657609 664355 670580 676438 681899 687597 694969 705004 717316 730895 745353 760877 777534 795318
58562G95318J9237K0941K2140K2294K1489J9730J6717J2575Q055L723k84l591
$$ 795318 814555 835496 857636 879930 901419 921149 937866 950441 958496 962219 961935 958344
58550I58344n625o511o989p275p065o804p603r466j0955j1286j1544j2996j5256
$$ 958344 952719 946208 939219 931944 924879 918075 910472 901006 890051 878765 867221 854225 838969
58537H38969j7019j7744j7654j6890j5592j4138j2545j0270p362m994l973l494
$$ 838969 821950 804206 786552 769662 754070 739932 727387 717117 709755 704761 700788 697294
58525F97294k309n49O32Q57Q22J077J428J531J324Q76K80k57n89q19j116j612
$$ 697294 694985 694436 695068 695925 696747 697824 699252 700783 702107 702983 703263 703006 702417 701598 700482 698870
58509F98870k548m004n327n476m307k941k487k920l473l599l177k368j596j190
$$ 698870 696322 692318 686991 681515 677208 674267 671780 668860 665387 661788 658611 656243 654647 653457
58495F53457q86k36M74N69K84N81J525K076J919K188L651N435O474P133Q367J0135
$$ 653457 652571 652335 652809 653378 653662 654243 655768 657844 659763 661951 665602 671037 677511 684644 693011 703146
58479G03146J1696J2699J3073J2543J1166R663Q365O551L630K10k870n660q253
$$ 703146 714842 727541 740614 753157 764323 773986 782351 788902 792532 792742 789872 784212 775959
58466G75959r768r411p846o267m740k664l26J414K629M197O341Q381R784J0478
$$ 775959 766191 756780 748934 742667 737927 735263 734937 736351 738980 743177 749518 757899 767683 778161
58452G78161J0296R063P137N002K592k42k968m913o221p311p816p147n754m676
$$ 778161 788457 797520 804657 809659 812251 812009 809041 804128 797907 790596 782780 775633 769879 765203
58438G65203l977k743p02J194K019J919J718K082L228M939O677P958Q630Q715
$$ 765203 761226 758483 757781 758975 760994 762913 764631 766713 769941 774880 781557 789515 798145 806860
58424H06860Q265P512O746N855M491K846J572P19l72j840k979l550m289n452o090
$$ 806860 815125 822637 829383 835238 839729 842575 844147 844866 844494 842654 839675 836125 831836 826384 820294
58409H20294n688n323o000o874o501n040l818l247k624j564l83P41J896K895L499
$$ 820294 814606 809283 803283 796409 789908 784868 781050 777803 775179 773615 773232 773973 775869 778764 782263
58394G82263L870M130L917L116K346J992J557Q29O80J625K578K365J586J603K339
$$ 782263 786133 790263 794180 797296 799642 801634 803191 804020 804700 806325 808903 811268 812854 814457 816796
58379H16796K661K307K015K195K871M408O800Q784R152Q612Q793R840J0519J0384
$$ 816796 819457 821764 823779 825974 828845 833253 840053 848837 857989 866601 875394 885234 895753 906137
58365I06137J0231J0478J0652J0536J0496J0601J0564J0482J0602J0505R583Q092
$$ 906137 916368 926846 937498 948034 958530 969131 979695 990177 1000779 1011284 1020867 1028959
58353A028959O718N478M096L026K947L595M184M590N083N471N598O084P354Q628
$$ 1028959 1035677 1041155 1045251 1048277 1051224 1054819 1059003 1063593 1068676 1074147 1079745 1085829 1093183 1101811
58339A101811R131R553J0885J2641J3733J4403J5623J7146J7807J7291J6091J4300
$$ 1101811 1110942 1120495 1131380 1144021 1157754 1172157 1187780 1204926 1222733 1240024 1256115 1270415
58327A270415J1934R806Q509P272N373L841L951M943N211M971N572O929P918Q679
$$ 1270415 1282349 1292155 1300664 1307936 1313309 1317150 1321101 1326044 1331255 1336226 1341798 1348727 1356645 1365324
58313A365324J0214J2100J2942J2839J3162J4185J5080J5873J7143J8193J7814
$$ 1365324 1375538 1387638 1400580 1413419 1426581 1440766 1455846 1471719 1488862 1507055 1524869
58302A524869J6608J6304J7058J7728J8253J9311K0112J9334J7910J8089J9856
$$ 1524869 1541477 1557781 1574839 1592567 1610820 1630131 1650243 1669577 1687487 1705576 1725432
58291A725432K1144K1508K2512K4452K5740K5941K6507K7983K9267L0018L1223
$$ 1725432 1746576 1768084 1790596 1815048 1840788 1866729 1893236 1921219 1950486 1980504 2011727
58280B011727L2861L3713L3853L4692L6207L6872L6766L7893M0900M4130M6566
$$ 2011727 2044588 2078301 2112154 2146846 2183053 2219925 2256691 2294584 2335484 2379614 2426180
58269B426180M8989N1708N3728N4866N6216N7990N9261O0166O1921O4505O6741
$$ 2426180 2475169 2526877 2580605 2635471 2691687 2749677 2808938 2869104 2931025 2995530 3062271
58258C062271O8635P1019P3199P3857P3938P5571P8546Q1193Q4153Q9436R6206
$$ 3062271 3130906 3201925 3275124 3348981 3422919 3498490 3577036 3658229 3742382 3831818 3928024
58247C928024J01668J05926J11635J18886J25056J29852J35772J43263J50321
$$ 3928024 4029692 4135618 4247253 4366139 4491195 4621047 4756819 4900082 5050403
58238E050403J57231J66582J78043J88413J97591K09067K23659K38322K52199
$$ 5050403 5207634 5374216 5552259 5740672 5938263 6147330 6370989 6609311 6861510
58229F861510K68123K86917L06172L25971L49678L77567M05943M34246M66625
$$ 6861510 7129633 7416550 7722722 8048693 8398371 8775938 9181881 9616127 10082752
58220A0082752N04930N46750N92078O44779P05738P72072Q44992R30517J030517
$$ 10082752 10587682 11134432 11726510 12371289 13077027 13849099 14694091 15624608 16655125
58211A6655125J141791J265930J410695J579412J769872J987140K246652K561742
$$ 16655125 17796916 19062846 20473541 22052953 23822825 25809965 28056617 30618359
58203C0618359K940762L400429L967891M664486N502995O507818P722515R192626
$$ 30618359 33559121 36959550 40927441 45591927 51094922 57602740 65325255 74517881
58195G4517881J0961603J3089801J5647871J8673681K2158262K6068635L0284028
$$ 74517881 85479484 98569285 114217156 132890837 155049099 181117734 211401762
58188B11401762L4375885L7410061L8050996L5018392K7655586J6325729K481783
$$ 211401762 245777647 283187708 321238704 356257096 383912682 400238411 402720194
58181D02720194j1654534k3772126l2246720l6586014l7308793l5449444l2082191
$$ 402720194 391065660 367293534 335046814 298460800 261152007 225702563 193620372
58174A93620372k8075579k4027980k0281910j6984587j4171759j1825938r895516
$$ 193620372 165544793 141516813 121234903 104250316 90078557 78252619 68357103
58167F8357103q309864p005080n934615n057468m332250l727602l225635k809992
$$ 68357103 60047239 53042159 47107544 42050076 37717826 33990224 30764589 27954597
58159B7954597k460574k162989j912108j701941j521132j361811j223741j105907
$$ 27954597 25494023 23331034 21418926 19716985 18195853 16834042 15610301 14504394
58151A4504394j001951r07303q23122p49740o83223o21486n67062n20843m79413
$$ 14504394 13502443 12595140 11772018 11022278 10339055 9717569 9150507 8629664 8150251
58142H150251m41321m09465l84365l61142l36364l12280k91212k71296k50896
$$ 8150251 7708930 7299465 6915100 6553958 6217594 5905314 5614102 5342806 5091910
58133E091910k32173k16808k02773j88385j75416j65182j55553j44816j34816
$$ 5091910 4859737 4642929 4440156 4251771 4076355 3911173 3755620 3610804 3475988
58124C475988j27438j21265j14381j07374j01221r5118q8597q2995p8907p4975
$$ 3475988 3348550 3227285 3112904 3005530 2904309 2809191 2720594 2637599 2558692 2483717
58114B483717p0761o7908o6873o5530o2701o0024n8741n7612n5625n3791n2552
$$ 2483717 2412956 2345048 2278175 2212645 2149944 2089920 2031179 1973567 1917942 1864151 1811599
58103A811599n0398m6835m3865m2708m1739l9443l6834l5246l4224l3167l2600
$$ 1811599 1761201 1714366 1670501 1627793 1586054 1546611 1509777 1474531 1440307 1407140 1374540
58092A374540l2348l0980k8430k6592k5982k4697k2088k0380k0824k1358k0210
$$ 1374540 1342192 1311212 1282782 1256190 1230208 1205511 1183423 1163043 1142219 1120861 1100651
58081A100651j8958j9610k1167k1646k1286k1270k1142k0012j8636j8074j7702
$$ 1100651 1081693 1062083 1040916 1019270 997984 976714 955572 935560 916924 898850 881148
58070H81148j6536j5156j4440j3910j2975j2315j2397j2202j1125j0368j0676
$$ 881148 864612 849456 835016 821106 808131 795816 783419 771217 760092 749724 739048
58059G39048j0538q614o326n880p068q134q630r221r694r277q269p589p242o753
$$ 739048 728510 719896 713570 707690 700622 692488 683858 674637 664943 655666 647397 639808 632566 625813
58045F25813o426o792p490p926q230q571q420p617p058p220p197o329n588n968
$$ 625813 619387 612595 605105 597179 588949 580378 571958 564341 557283 550063 542866 536537 530949 524981
58031E24981o766o842o505o653p076p133p183p925q949r281q706p579o093m700
$$ 524981 518215 511373 504868 498215 491139 484006 476823 468898 459949 450668 441962 434383 428290 423590
58017D23590m219m572m483l410k510k637k817j993r13p46j132j114q57q06l56
$$ 423590 419371 414799 410316 406906 404396 401759 398942 396949 396036 395290 394158 393044 392187 391381 391025
58002C91025Q98J747J089Q0N08J821J961O73k42J41P21L59o72j597k120k205j928
$$ 391025 391923 393670 394759 394839 395347 397168 399129 399802 399560 399701 400422 400781 400109 398512 396392 394187 392259
57985C92259j818k413l446m161m374m418m324l842l154k759k820l113l435l491
$$ 392259 390441 388028 384582 380421 376047 371629 367305 363463 360309 357550 354730 351617 348182 344691
57971C44691k921j964j461j710j933j499q53n40j95O05J351J418J126R85O95j31
$$ 344691 341770 339806 338345 336635 334702 333203 332350 331810 331615 332220 333571 334989 336115 337100 337795 337664
57955C37664r31j135j278k091l039k997j928p20J59P86J088J062J317K317L543
$$ 337664 336733 335598 334320 332229 329190 326193 324265 323545 323704 324490 325578 326640 327957 330274 333817
57940C33817M317M928N990P200P814P811P665P440P100P012P167O574M606K160
$$ 333817 338134 343062 349052 356252 364066 371877 379542 386982 394082 401094 408261 414835 419441 421601
57926D21601L42j230l408n573o385n987n797o280o559o240o002o171o110n341
$$ 421601 421943 420713 417305 411732 405347 399360 393563 387283 380724 374484 368482 362311 356201 350860
57912C50860m295l578l313l294l165k523j453p16p63j055j110j514k870m369m700
$$ 350860 346565 342987 339674 336380 333215 330692 329239 328523 327760 326705 325595 324081 321211 316842 312142
57897C12142l935l156k589j520M7J095J071M95N3RM52J232J719J552J290J464
$$ 312142 308207 305051 302462 300942 300989 302084 303155 303650 303703 303712 304164 305396 307115 308667 309957 311421
57881C11421J462N23p20j044n91m99q82q15k16j01p71j402j602j893k319k088
$$ 311421 312883 313406 312686 311642 311051 310552 309670 308855 308639 308538 307767 306365 304763 302870 300551 298463
57865B98463j088k89j62k4N15P89M50L02R29J608J482R23Q18J178J342J055N89
$$ 298463 297375 297086 296924 296900 297415 298204 298654 298956 299885 301493 302975 303898 304716 305894 307236 308291 308880
57848C08880J35l54r86j863k909l666l700l314l273l722m022l682k847j776o27
$$ 308880 309015 308661 307675 305812 302903 299237 295537 292223 288950 285228 281206 277524 274677 272901 272274
57833B72274J89J95l57o78n65n35o80l53O31J387J204O43P51J676K629K883K322
$$ 272274 272463 272658 272301 271623 271058 270523 269843 269490 270121 271508 272712 273355 274106 275782 278411 281294 283616
57816B83616J231o5j443k978m611n903o396o069n173l884k597k064k535l034k488
$$ 283616 284847 284782 283339 280361 275750 269847 263451 257382 252209 248325 245728 243664 241129 238095 235607
57801B35607j239m92m21NJ245K460K882K782K648K352J759J329J498J988K271
$$ 235607 234368 233876 233455 233460 234705 237165 240047 242829 245477 247829 249588 250917 252415 254403 256674
57786B56674K222J981J637J362J427J797K166K478K918L334L284K799K390K175
$$ 256674 258896 260877 262514 263876 265303 267100 269266 271744 274662 277996 281280 284079 286469 288644
57772B88644J637M98q39j889k577k980l196l555m312n049n061m371l662l202k674
$$ 288644 290281 290779 289940 288051 285474 282494 279298 275743 271431 266382 261321 256950 253288 250086 247412
57757B47412k079j823j736j077J56J013J076J156J934K874L174K944K745K539
$$ 247412 245333 243510 241774 240697 240853 241866 242942 244098 246032 248906 252080 255024 257769 260308
57743B60308J966J120M21M6k1K16N01L25m40j268j692j814j866j719j251p21m63
$$ 260308 262274 263394 263815 263861 263840 264056 264557 264882 264442 263174 261482 259668 257802 256083 254832 254111 253648
57726B53648n70j013j622j923j566j024j121j797k133j783j427j588j970k309
$$ 253648 253078 252065 250443 248520 246954 245930 244809 243012 240879 239096 237669 236081 234111 231802
57712B31802k885l603l643k742j925k176l057l496l345l203l212k909k092j098
$$ 231802 228917 225314 221671 218929 217004 214828 211771 208275 204930 201727 198515 195606 193514 192416
57698A92416l64j30l44o37o22m77p56j465j896j621r63k39O49J558J859J395R75
$$ 192416 192052 191922 191578 190941 190319 189842 189086 187621 185725 184104 183141 182902 183551 185109 186968 188363 189338
57681A89338J372K447L746N236P005Q991J1455J4938J9222K3362K7251L2052L8315
$$ 189338 190710 193157 196903 202139 209144 218135 229590 244528 263750 287112 314363 346415 384730
57668C84730M4677M9235N0931M8564L9980K4280M338j4735k9558l9711m5649m7313
$$ 384730 429407 478642 529573 578137 618117 642397 646735 632000 602442 562731 517082 469769
57656D69769m5090m0477l5038k9461k3993j9018j4832j1448q897p223o179n362
$$ 469769 424679 384202 349164 319703 295710 276692 261860 250412 241515 234292 228113 222751
57644B22751m676m197l777l256k834k666k384j673r80q60r65n63J49L05k39p32
$$ 222751 218075 213878 210101 206845 204011 201345 198961 197288 196308 195448 194483 193920 194069 194374 194135 193403
57628A93403q16r81j530j973j857j487j447j854k355k552k320j987k047k393k178
$$ 193403 192587 191606 190076 188103 186246 184759 183312 181458 179103 176551 174231 172244 170197 167804 165626
57613A65626r65L69P00L23N23J531K122J476L91N3M38O19J78m26o86o94r08j531
$$ 165626 164661 165030 165730 166053 166576 168107 170229 171705 172096 172149 172587 173206 173384 172958 172272 171578 170670 169139
57595A69139k238k548k367k024j725j335q72p86j231j560j124l39k02r33j767
$$ 169139 166901 164353 161986 159962 158237 156902 156030 155244 154013 152453 151329 150990 150788 149855 148088
57580A48088k021j723j231q27p23r03r96p93o92j063j473j289q53j091j980k475
$$ 148088 146067 144344 143113 142286 141563 140660 139664 138871 138179 137116 135643 134354 133501 132410 130430 127955
57564A27955k082j449j115p28J3M99R8p35r76l15O50J314J615J802K019K128J790
$$ 127955 125873 124424 123309 122581 122594 123093 123191 122456 121480 121165 121815 123129 124744 126546 128565 130693 132483
57547A32483Q99j12o15n07k02J0K16M45N66O96J150J707J653Q32J63M93J428J878
$$ 132483 133382 133270 132655 132148 131946 131956 132172 132617 133183 133879 135029 136736 138389 139221 139384 139877 141305 143183
57529A43183J493R37Q14R52R08P28Q73J506K173K317J979J767K120K752K989K453
$$ 143183 144676 145613 146427 147379 148287 149015 149888 151394 153567 155884 157863 159630 161750 164502 167491 169944
57513A69944J321J47m31p4Q12J287Q17j62r43j506k277l197l680l502l199l405
$$ 169944 171265 171412 170981 170907 171719 173006 173823 173661 172718 171212 168935 165738 162058 158556 155357 151952
57497A51952m147m851m823l785k268j280j251j517j280p59p71j340j526p63L74
$$ 151952 147805 142954 138131 134346 132078 130798 129547 128030 126750 125991 125220 123880 122354 121591 121965
57482A21965R55P54K76M9J04n0q92k176k951k605j565n92J53Q09J058O13J7kK27
$$ 121965 122920 123674 123950 123999 124103 124053 123161 120985 118034 115429 113864 113272 113425 114234 115292 115905 115922 115920 116147
57463A16147j86j043j230n82k66r36j758j844j518j407j350r75n43l41L9R08J643
$$ 116147 115961 114918 113688 113106 112840 111904 110146 108302 106784 105377 104027 103052 102509 102168 102207 103115 104758
57446A04758J497P94M26N46N93L42Q0LO8L41P71Q50J76p82j105n80J61N92Q03
$$ 104758 106255 107049 107475 108021 108614 108956 109036 109039 109107 109448 110219 111069 111245 110463 109358 108778 108939 109531 110334
57427A10334J024J159R41L09m40p58j98J094K321K710K119R65j82p56l77P53J827
$$ 110334 111358 112517 113458 113767 113327 112569 112371 113465 115786 118496 120615 121580 121398 120642 120265 121018 122845
57410A22845K112J576P04Kk75k07k48p51j354j321o24o7k1J68R89J748J529O50
$$ 122845 124957 126533 127237 127239 126964 126757 126509 125758 124404 123083 122459 122392 122371 122539 123528 125276 126805 127455
57392A27455K35O83J373J765J931K033J988J804J669J618J499J254R30N14J93
$$ 127455 127690 128373 129746 131511 133442 135475 137463 139267 140936 142554 144053 145307 146237 146751 146944
57377A46944M46J402K224J890N09p72j240j294j541j868j755j104k72M19Q93J155
$$ 146944 147390 148792 151016 152906 153415 152643 151403 150109 148568 146700 144945 143841 143569 143988 144881 146036
57361A46036J172R76O85M70M43N83Q03J021J201J255J097P44K71k68o93o02J05
$$ 146036 147208 148184 148869 149339 149782 150365 151168 152189 153390 154645 155742 156486 156757 156489 155796 155194 155299
57344A55299P98P43J95J41Q18J244O30m81j084j098j124j294j136m43M74J203
$$ 155299 156097 156840 157035 157176 157994 159238 159868 159387 158303 157205 156081 154787 153651 153208 153682 154885
57328A54885J505J314R31Q50J126J263J073J062J415J411N90j65J66J080J291
$$ 154885 156390 157704 158635 159485 160611 161874 162947 164009 165424 166835 167425 167260 167426 168506 169797
57313A69797P48N80J152J597J422J239J528J812J588J116Q60Q95J213J874K530
$$ 169797 170545 171125 172277 173874 175296 176535 178063 179875 181463 182579 183439 184334 185547 187421 189951
57298A89951K620K362K610L407L677K925K194K559L448L494K492J620J840K932
$$ 189951 192571 194933 197543 200950 204627 207552 209746 212305 215753 219247 221739 223359 225199 228131
57284B28131L998M361M023L540L427L584L600L566L939M507M280K897J296M54
$$ 228131 232129 236490 240513 244053 247480 251064 254664 258230 262169 266676 270956 273853 275149 275603
57270B75603J92k9L5Q31J856K163J799J663K064K338K037J603J683K327L088L450
$$ 275603 275795 275766 275801 276632 278488 280651 282450 284113 286177 288515 290552 292155 293838 296165 299253 302703
57254C02703L172K592K514L254M014L754K670J960K234K914L358L743M416N129
$$ 302703 305875 308467 310981 314235 318249 322003 324673 326633 328867 331781 335139 338882 343298 348427
57240C48427N482N598N758N757N237M497M297M868N576N776N624N792O558P483
$$ 348427 353909 359507 365265 371022 376259 380756 385053 389921 395497 401273 406897 412689 419247 426730
57226D26730P962P882P604P472P501P566P643P803Q148Q742R496J0049J0026R550
$$ 426730 434692 442574 450178 457650 465151 472717 480360 488163 496311 505053 514549 524598 534624 544174
57212E44174R245R506J0030J0325J0442J0888J1852J2963J3774J4223J4529J4785
$$ 544174 553419 562925 572955 583280 593722 604610 616462 629425 643199 657422 671951 686736
57200F86736J4830J4504J4009J3888J4386J4989J4981J4496J4455J5275J6307
$$ 686736 701566 716070 730079 743967 758353 773342 788323 802819 817274 832549 848856
57189H48856J6912J7450J8544J9947K1036K2048K3720K5793K7015K6862K6260
$$ 848856 865768 883218 901762 921709 942745 964793 988513 1014306 1041321 1068183 1094443
57178A094443K6133K6082K5094K2993K0544J8595J7724J8289K0142K2429K4193
$$ 1094443 1120576 1146658 1171752 1194745 1215289 1233884 1251608 1269897 1290039 1312468 1336661
57167A336661K5217K5955K6790K7749K8758K9762L0601L1082L1249L1331L1492
$$ 1336661 1361878 1387833 1414623 1442372 1471130 1500892 1531493 1562575 1593824 1625155 1656647
57156A656647L1745L1974L1882L1154K9885K8720K8273K8506K8956K9369K9807
$$ 1656647 1688392 1720366 1752248 1783402 1813287 1842007 1870280 1898786 1927742 1957111 1986918
57145A986918L0322L0881L1547L2321L2851L2724L2146L1913L2588L3976L5579
$$ 1986918 2017240 2048121 2079668 2111989 2144840 2177564 2209710 2241623 2274211 2308187 2343766
57134B343766L7214L8969M0862M2935M5553M9104N3292N7111N9819O1727O3739
$$ 2343766 2380980 2419949 2460811 2503746 2549299 2598403 2651695 2708806 2768625 2830352 2894091
57123B894091O6228O8804P1154P3631P6838Q1069Q6482R3480J02444J13328J25909
$$ 2894091 2960319 3029123 3100277 3173908 3250746 3331815 3418297 3511777 3614221 3727549 3853458
57112C853458J40305J56799J75345J95739K18118K42830K70164L00947L37392
$$ 3853458 3993763 4150562 4325907 4521646 4739764 4982594 5252758 5553705 5891097
57103E891097L82617M39403N10125N97719P05788Q37851R97647J190350J422187
$$ 5891097 6273714 6713117 7223242 7820961 8526749 9364600 10362247 11552597 12974784
57094A2974784J698306K021513K392382K808175L260529L735440M215731M681748
$$ 12974784 14673090 16694603 19086985 21895160 25155689 28891129 33106860 37788608
57086C7788608N109559N471175N735743N863789N797645N469525M839026L933038
$$ 37788608 42898167 48369342 54105085 59968874 65766519 71236044 76075070 80008108
57078H0008108K844063J680816N16434o20698j717658k748334l669554m434006
$$ 80008108 82852171 84532987 85049421 84428723 82711065 79962731 76293177 71859171
57070G1859171n003533n357945n499919n453382n254914m944196m559046m133606
$$ 71859171 66855638 61497693 55997774 50544392 45289478 40345282 35786236 31652630
57062C1652630l696294l268276k864164k493562k161526j868848j613652j393132
$$ 31652630 27956336 24688060 21823896 19330334 17168808 15299960 13686308 12293176
57054A2293176j204069j042828r05940p90483o93567o11983n42867m84163m34093
$$ 12293176 11089107 10046279 9140339 8349856 7656289 7044306 6501439 6017276 5583183
57045E583183l90718l52609l19356k90781k65957k43429k22041k01144j80300
$$ 5583183 5192465 4839856 4520500 4229719 3963762 3720333 3498292 3297148 3116848
57036C116848j59339j38423j17714r7141p6880n8001m2528l3127l2376m1430n8522
$$ 3116848 2957509 2819086 2701372 2604231 2527351 2469350 2426822 2393695 2361319 2319889 2261367
57025B261367p9122r7963j11218j17256j16413j10479j01762r1877q1473p1097
$$ 2261367 2182245 2084282 1973064 1855808 1739395 1628916 1527154 1435277 1353804 1282707
57015A282707o1651n3731m7186m1800l7772l5058l2871l0540k8346k6793k5530
$$ 1282707 1221056 1167325 1120139 1078339 1040567 1005509 972638 942098 913752 886959 861429
57004H61429k3816k1749k0204j9615j9584j9575j9385j8940j8191j7273j6274
$$ 861429 837613 815864 795660 776045 756461 736886 717501 698561 680370 663097 646823
56993F46823j4933j3034j0963r280p837n916l278m65J992M068N729O412N423K589
$$ 646823 631890 618856 607893 598613 590776 584860 581582 581117 583109 587177 592906 599318 604741 607330
56979F07330j703o810j2020j6543j9657k0929k0415j8594j6090j3326j0531p972
$$ 607330 605627 598817 586797 570254 550597 529668 509253 490659 474569 461243 450712 442740
56967D42740n876m062k044L88K958N497Q191J1066J3646J5579J7032J7938J7265
$$ 442740 436864 432802 430758 431146 434104 439601 447792 458858 472504 488083 505115 523053 540318
56954E40318J3843P721J17p676j4668j9760k2055k1749k0067j8018j5700j2961
$$ 540318 554161 561882 561999 554323 539655 519895 497840 476091 456024 438006 422306 409345
56942D09345j0019p221m594j990O84L584O929J0699J4598J8417K2064K5063K6320
$$ 409345 399326 392105 387511 385521 386205 389789 396718 407417 422015 440432 462496 487559 513879
56929E13879K4736J9902J2249K758p347j6801k4495k9571l1598l0860k8304k4987
$$ 513879 538615 558517 570766 573524 566177 549376 524881 495310 463712 432852 404548 379561
56917C79561k1514j8185j5314j3028j1014q984p259o358o095n616m409k802j385
$$ 379561 358047 339862 324548 311520 300506 291522 284263 277905 271810 266194 261785 258983 257598
56904B57598m13J29K67J24LK26R59K128L401M431N335O620Q384J0050J1291J2774
$$ 257598 257185 257314 257581 257705 257708 257934 258893 261021 264422 268853 274188 280808 289192 299242 310533 323307
56888C23307J5208J8031J9911K0248J9252J6708J1891N010k366q693j3531j6827
$$ 323307 338515 356546 376457 396705 415957 432665 444556 449566 447200 438507 424976 408149
56876D08149j8108j7061j4308j0889p381l866l35L375P618J2449J7453K2381K7528
$$ 408149 390041 372980 358672 347783 340402 336536 336201 339576 347194 359643 377096 399477 427005
56863D27005L3159L9042M4792M9995N3438N2879M6503L4462J8601J142j5767k9721
$$ 427005 460164 499206 543998 593993 647431 700310 746813 781275 799876 801018 785251 755530
56851G55530l8578m1640l9982l5436k9495k2980j6172r064j716N616J2859K0469
$$ 755530 716952 675312 635330 599894 570399 547419 531247 522183 520467 526083 538942 559411
56839E59411K9114L9020M9888O1172P2067Q1138Q6249Q5024P5595N7339L1551
$$ 559411 588525 627545 677433 738605 810672 891810 978059 1063083 1138678 1196017 1227568
56828A227568J536k8137n3025p0147p8675p9734p5353o7463n7622m7214l7262
$$ 1227568 1229104 1200967 1147942 1077795 999120 919386 844033 776570 718948 671734 634472
56817F34472k8019j9099j0165j174P916J7169K6394L5338M4055N2318N8536O0018
$$ 634472 606453 587354 577189 576015 583931 601100 627494 662832 706887 759205 817741 877759
56805H77759N4761M2571K4435J971k1899m2855n7153o3873o4713o1904n6874n0520
$$ 877759 932520 975091 999526 1001497 979598 936743 879590 815717 751004 689100 632226 581706
56793E81706m3562l6310k8704k0901j3544p186j666L778R698J5826K1308K5547
$$ 581706 538144 501834 473130 452229 438685 431499 429833 433611 443309 459135 480443 505990
56781E05990K8538L0037K8772K3184J3130L40j2872k4697l3745l9016m0550l9541
$$ 505990 534528 564565 593337 616521 629651 629991 617119 592422 558677 519661 479111 439570
56769D39570l7187l3931l0047k6190k2788j9558j6318j3615j1878j0549q898p109
$$ 439570 402383 368452 338405 312215 289427 269869 253551 239936 228058 217509 208611 201502
56757B01502n813m997m377m226m820n377m759l136j875j731k106k207j988j716
$$ 201502 195689 190692 186315 182089 177269 171892 167133 163997 162122 160391 158285 156078 154090 152374
56743A52374j430j122r12q08p25p95j107j258p45J57N73J65m92p96q05q51r71
$$ 152374 150944 149822 148910 148102 147377 146582 145475 144217 143472 143629 144202 144367 143875 143079 142274 141423 140452
56726A40452q71k31R34J946J850N89n36l32P39J254Q88O47J083J434R49J01j11
$$ 140452 139581 139350 140284 142230 144080 144669 144133 143801 144540 145794 146682 147329 148412 149846 150795 150896 150785
56709A50785N32J428J945J818J155M48K71O37R12N79j91q85j252j360j327j184
$$ 150785 151317 152745 154690 156508 157663 158111 158382 159019 159931 160510 160319 159434 158182 156822 155495 154311
56693A54311r18n45k41k35m34m26p5J87J00J05N84R87N74l43q47q85j215j919
$$ 154311 153393 152848 152607 152372 151938 151512 151437 151624 151724 151829 152413 153400 153974 153631 152784 151899 150684 148765
56675A48765k150j583r75q75p40mQ24R05L20j30L7O42J233J312M84j111k633l191
$$ 148765 146615 145032 144057 143182 142442 142438 143262 144167 144487 144357 144394 145036 146269 147581 148065 146954 144321 141130
56657A41130k524j057M45J181Q47N0j45O10J585J976J866J910K431L185L796M138
$$ 141130 138606 137549 137994 139175 140022 140072 139927 140537 142122 144098 145964 147874 150305 153490 157286 161424
56641A61424M285M242L760K669J467J113J886K866L092K700K281J646L09j168
$$ 161424 165709 169951 173711 176380 177847 178960 180846 183712 186804 189504 191785 193431 193740 192572
56627A92572j642j165j013j750k481k392j862j546j421j350j593k123k295j862
$$ 192572 190930 189765 188752 187002 184521 182129 180267 178721 177300 175950 174357 172234 169939 168077
56613A68077j508j721j933j491p90n91q17p43l8R67J710J653O49n55q06M3Q50
$$ 168077 166569 164848 162915 161424 160634 160043 159226 158483 158445 159412 161122 162775 163424 162869 162063 162106 162956
56596A62956P32J42o7J60M76R31J524J683J083L80L30O78P16M31K56J96P1J68
$$ 162956 163688 163830 163763 163923 164399 165330 166854 168537 169620 170000 170330 171008 171724 172155 172411 172607 172678 172846
56578A72846P83J472J610J351J275J401J334J139J206J513J781K214L315N083
$$ 172846 173629 175101 176711 178062 179337 180738 182072 183211 184417 185930 187711 189925 193240 198323
56564A98323O957Q428R222R270Q998R219J0169J0942J0522Q999P199N590M173
$$ 198323 205280 213708 222930 232200 241198 250417 260586 271528 282050 291049 298248 303838 308011
56551C08011K961J908Q62J64O10K060K873J771l87j802k099k304k922l519l918
$$ 308011 310972 312880 313742 313906 314516 316576 319449 321220 320833 319031 316932 314628 311706 308187 304269
56536C04269m482n111n275n072n211n811o202n992n437m780m087l652l649l542
$$ 304269 299787 294676 289401 284329 279118 273307 267105 261113 255676 250896 246809 243157 239508 235966
56522B35966k813k016k003k341j841n46K54P2k66l54q59j950k633k414k199k606
$$ 235966 233153 231137 229134 226793 224952 224406 224660 224732 224466 224112 223253 221303 218670 216256 214057 211451
56506B11451k679j455J45M26p22j823j878j308r16r02j069j314j530j443q93j46
$$ 211451 208772 207317 207462 207888 207166 205343 203465 202157 201241 200339 199270 197956 196426 194983 194090 193944
56490A93944K32p7p47j183j306j554j888j412L07K046K082M43j020r41J77J105
$$ 193944 194176 194099 193352 192169 190863 189309 187421 186009 186316 188362 190444 190887 189867 188926 189103 190208
56474A90208J462J570J599J540J564J803K041K004J755J516J316J025N00l10j154
$$ 190208 191670 193240 194839 196379 197943 199746 201787 203791 205546 207062 208378 209403 209903 209593 208439
56459B08439j430p39N18J449J605J202O06Q4n4L02P26O69J97k32n14p92p69k1
$$ 208439 207009 206270 206788 208237 209842 211044 211650 211734 211680 211982 212708 213377 213574 213342 212828 212036 211267 211246
56441B11246J095J651J323O56J69p4lM12P24L79m09r04r32q68p23k85M8k21m45
$$ 211246 212341 213992 215315 215971 216140 216066 216063 216475 217199 217578 217169 216265 215333 214465 213742 213457 213505 213284 212839
56422B12839M39J923K163O66q63r23m5M90M35J83j90n56m01K63N84K11n3L01N60
$$ 212839 213278 215201 217364 218030 217167 216244 216199 216689 217124 217307 217117 216561 216160 216423 217007 217218 217165 217466 218026
56403B18026K32J83J140K123J783M69m09m79m69o10l52N17J583K529L236L410
$$ 218026 218258 218441 219581 221704 223487 223956 223547 223068 222599 221989 221637 222154 223737 226266 229502 232912
56387B32912K941K409K324K286J685Q21M51N95P58R67J485J896J524P00M35R03
$$ 232912 235853 238262 240586 242872 244557 245378 245829 246424 247182 248149 249634 251530 253054 253754 254189 255092
56371B55092J190O26m73j421j793j431n39J92J84l60p99q79o61l2R59J621J380
$$ 255092 256282 256908 256435 255014 253221 251790 251251 251443 251627 251267 250468 249589 248928 248896 249855 251476 252856
56354B52856P85Q93J795K517K362J512M39m54o54P5J109J454R87M74M13N75O99
$$ 252856 253641 254534 256329 258846 261208 262720 263159 262705 262051 262126 263235 264689 265676 266150 266563 267138 267837
56337B67837R37J362J712J824J836J885J994K262K690K965K857K718L054L688
$$ 267837 268774 270136 271848 273672 275508 277393 279387 281649 284339 287304 290161 292879 295933 299621
56323B99621L986L791L488L192K594J668Q99O26O61O66N01K03RL06J197K196K716
$$ 299621 303607 307398 310886 314078 316672 318340 319239 319865 320526 321192 321693 321896 321905 322211 323408 325604 328320
56306C28320K771K808L076L553M229M974N381N195M706M250L778L317L311L861
$$ 328320 331091 333899 336975 340528 344757 349731 355112 360307 365013 369263 373041 376358 379669 383530
56292C83530M197L760L286L782M876N365N125N171N931O703P074P538Q343Q869
$$ 383530 387727 391487 394773 398555 403431 408796 413921 419092 425023 431726 438800 446338 454681 463550
56278D63550Q684Q383Q715R576J0368J0883J1360J2076J3191J4711J6438J8241
$$ 463550 472234 480617 489332 498908 509276 520159 531519 543595 556786 571497 587935 606176
56266F06176K0278K2545K4479K5726K7141L0037L4420L8934M2828M6956N2390
$$ 606176 626454 648999 673478 699204 726345 756382 790802 829736 872564 919520 971910
56255I71910N9014O6130P3684Q2041R1024R9954J08416J16367J23650J29896J34871
$$ 971910 1030924 1097054 1170738 1252779 1343803 1443757 1552173 1668540 1792190 1922086 2056957
56244B056957J38496J40427J39877J35939J28102J16458J01410Q3239O2153L8891
$$ 2056957 2195453 2335880 2475757 2611696 2739798 2856256 2957666 3040905 3103058 3141949
56234C141949J4951q197k9950n0326o9108q5694r9600j10600j18439j22986j24717
$$ 3141949 3156900 3148703 3118753 3068427 2999319 2913625 2814025 2703425 2584986 2462000 2337283
56223B337283j24535j23040j20302j16283j11086j04859r7841r0459q3053p5629
$$ 2337283 2212748 2089708 1969406 1853123 1742037 1637178 1539337 1448878 1365825 1290196
56213A290196o8341o1870n6780n2674m8585m4188l9989l6444l3467l0829k8425
$$ 1290196 1221855 1159985 1103205 1050531 1001946 957758 917769 881325 847858 817029 788604
56202G88604k6080k3604k1113j8947j7161j5527j3924j2442j1144j0020q992p800
$$ 788604 762524 738920 717807 698860 681699 666172 652248 639806 628662 618642 609650 601850
56190F01850o158m324l018k469k142j793k055l202m208l939k733j713j139n36
$$ 601850 595692 591368 588350 585881 583739 581946 579891 576689 572481 568542 565809 564096 562957 562421
56176E62421L5J55J71P33J510J689J633K512M243N386N326N080N475N982O022
$$ 562421 562456 562611 562782 563515 565025 566714 568347 570859 575102 580488 585814 590894 596369 602351 608373
56161F08373O186P235Q751R686R726R415R387R961J1185J2834J4619J6491J8488
$$ 608373 614559 621794 630545 640231 649957 659372 668759 678720 689905 702739 717358 733849 752337
56148G52337K0507K2640K5518K9683L4850M0489M6794N4112O1714O8109P2506
$$ 752337 772844 795484 821002 850685 885535 926024 972818 1026930 1088644 1156753 1229259
56137A229259P4839P4647P1164O4702N6821M8981M1977L6542L3153L1031K8451
$$ 1229259 1304098 1378745 1449909 1514611 1571432 1620413 1662390 1698932 1732085 1763116 1791567
56126A791567K4390J8994J2554N293j820p436j1431j4994j9050k3781k9807l8131
$$ 1791567 1815957 1834951 1847505 1852798 1850978 1843542 1832111 1817117 1798067 1774286 1744479 1706348
56114A706348m8300n7959o4983o8996p0377o8961o4592n8001n0428m2854l5872
$$ 1706348 1658048 1600089 1535106 1466110 1395733 1326772 1262180 1204179 1153751 1110897 1075025
56103A075025k9638k3762j7994j2998r608p478n543l577k086q52Q49K741L859
$$ 1075025 1045387 1021625 1003631 990633 981025 973547 968004 964427 962341 961489 962338 965079 968938
56090I68938M362N373O898P730P586P547Q040Q274Q054Q234Q894R061Q743R248
$$ 968938 973300 978673 985571 993301 1000887 1008434 1016474 1024748 1032802 1041036 1049930 1058991 1067734 1076982
56076A076982J0790J1853J1721J1547J2084J2459J2263J2692J4353J5929J6371
$$ 1076982 1087772 1099625 1111346 1122893 1134977 1147436 1159699 1172391 1186744 1202673 1219044
56065A219044J6538J7346J8048J7852J7519J7878J8343J8232J8020J8013J7424
$$ 1219044 1235582 1252928 1270976 1288828 1306347 1324225 1342568 1360800 1378820 1396833 1414257
56054A414257J6154J5669J6718J7897J7977J7905J8889K0287K1121K1964K3514
$$ 1414257 1430411 1446080 1462798 1480695 1498672 1516577 1535466 1555753 1576874 1598838 1622352
56043A622352K4875K5192K5488K6993K9006L0239L0987L2173L3546L4616L6061
$$ 1622352 1647227 1672419 1697907 1724900 1753906 1784145 1815132 1847305 1880851 1915467 1951528
56032A951528L8461M0888M2400M3647M5404M6923M7388M7580M8466M9542N0236
$$ 1951528 1989989 2030877 2073277 2116924 2162328 2209251 2256639 2304219 2352685 2402227 2452463
56021B452463N1332N3419N5538N7059N9201O2905O7005P0319P3687P8068Q2559
$$ 2452463 2503795 2557214 2612752 2669811 2729012 2791917 2858922 2929241 3002928 3080996 3163555
56010C163555Q6288R0287R5412J00439J04323J08332J13743J19612J25008J31092
$$ 3163555 3249843 3340130 3435542 3535981 3640304 3748636 3862379 3981991 4106999 4238091
56000D238091J38657J46020J51976J58351J66916J76315J84948J94264K06047
$$ 4238091 4376748 4522768 4674744 4833095 5000011 5176326 5361274 5555538 5761585
55991E761585K19044K31616K45192K61764K80438K99757L20825L44752L70004
$$ 5761585 5980629 6212245 6457437 6719201 6999639 7299396 7620221 7964973 8334977
55982H334977L95731M24595M58637M95911N35139N79762O32877O92415P56397
$$ 8334977 8730708 9155303 9613940 10109851 10644990 11224752 11857629 12550044 13306441
55973A3306441Q28675R13969J011801J121519J248770J400314J577349J781474
$$ 13306441 14135116 15049085 16060886 17182405 18431175 19831489 21408838 23190312
55965B3190312K022485K312652K659196L071691L571106M181467M918902N800940
$$ 23190312 25212797 27525449 30184645 33256336 36827442 41008909 45927811 51728751
55957E1728751O860829Q141237R682941J1534580J3760642J6415310J9513433
$$ 51728751 58589580 66730817 76413758 87948338 101708980 118124290 137637723
55950A37637723K3037533K6915239L0864835L4178369L5696467L4138353K8649706
$$ 137637723 160675256 187590495 218455330 252633699 288330166 322468519 351118225
55943C51118225J9259504P026049o183653j8230626k7381871l2816082l4692216
$$ 351118225 370377729 377403778 371220125 352989499 325607628 292791546 258099330
55936B58099330l3811028l1163824k7629447k3858598k0260034j7036293j4253766
$$ 258099330 224288302 193124478 165495031 141636433 121376399 104340106 90086340
55929I0086340j1911151r972677q379724p069002n990309n104696m374202l764313
$$ 90086340 78175189 68202512 59822788 52753786 46763477 41658781 37284579 33520266
55921C3520266l252264k823572k463120k156424j895555j675904j489600j328112
$$ 33520266 30268002 27444430 24981310 22824886 20929331 19253427 17763827 16435715
55913A6435715j188283j069611r68104q78348p98974p30615o70795o15901n65920
$$ 16435715 15247432 14177821 13209717 12331369 11532395 10801780 10130985 9515084 8949164
55904H949164n22296m83166m45452m09671l78174l50318l23630k98145k75431
$$ 8949164 8426868 7943702 7498250 7088579 6710405 6360087 6036457 5738312 5462881
55895E462881k54911k35035k16667k01437j88078j74026j59574j47057j37137
$$ 5462881 5207970 4972935 4756268 4554831 4366753 4192727 4033153 3886096 3748959
55886C748959j28997j22999j19893j18399j16448j13775j10716j06049r8867r1164
$$ 3748959 3619962 3496963 3377070 3258671 3142223 3028448 2917732 2811683 2712816 2621652
55876B621652q5552q1622p7457p3336p0860o9568o7603o4850o2434n9995n6358
$$ 2621652 2536100 2454478 2377021 2303685 2232825 2163257 2095654 2030804 1968370 1908375 1852017
55865A852017n2172m9022m6592m3513m0376l9039l9338l9240l7933l6341l4837
$$ 1852017 1799845 1750823 1704231 1660718 1620342 1581303 1541965 1502725 1464792 1428451 1393614
55854A393614l2912l0899k9666k8832k7411k5913k5681k6401k6475k5646k5108
$$ 1393614 1360702 1329803 1300137 1271305 1243894 1217981 1192300 1165899 1139424 1113778 1088670
55843A088670k5164k4885k4018k3326k2966k2292k1241k0320j9369j7875j6295
$$ 1088670 1063506 1038621 1014603 991277 968311 946019 924778 904458 885089 867214 850919
55832H50919j5499j5199j4428j3214j2298j1542j0274q784p923p616p308p427
$$ 850919 835420 820221 805793 792579 780281 768739 758465 749681 741758 734142 726834 719407
55820G19407q714j0548j1541j1549j1496j1541j1083j0206r514q753p189n095
$$ 719407 710693 700145 688604 677055 665559 654018 642935 632729 623215 614462 607273 602178
55808F02178l382k027m57R45J298J018J506L176N181O858P998Q029O400L699J032
$$ 602178 598796 596769 596312 597257 598555 599573 601079 604255 609436 616294 624292 632321 638721 642420 643452
55793F43452j422m013o316p626q223q735q856q252p982r184j0983j1674j1469
$$ 643452 642030 638017 631701 624075 615852 607117 598261 590009 582027 572843 561860 550186 538717
55780E38717j1874j2641j1662p967k802K390P128J0883J2859J3023J1699Q154
$$ 538717 526843 514202 502540 494573 491771 494161 501289 512172 525031 538054 549753 557907
55768E57907J539o726j3582j7621j9790k0692j9486j6179j2691j0532r185p707
$$ 557907 559446 552720 539138 521517 501727 481035 461549 445370 432679 422147 412962 405255
55756D05255o381n702n240m661m601n549o788p362p184o585n669m705m160l838
$$ 405255 398874 393172 387932 383271 378670 373121 366333 358971 351787 345202 339533 334828 330668 326830
55742C26830k985j600o43o36j141j918l221m642n064m400l911m167m116l068k091
$$ 326830 323845 322245 321602 320966 319825 317907 314686 310044 304980 300580 296669 292502 288386 285318 283227
55727B83227k359l297l646l427l542m108m428m152l467k362o59J428L397M969
$$ 283227 280868 277571 273925 270498 266956 262848 258420 254268 250801 248439 247780 249208 252605 257574
55713B57574O048O444O061N077L613J621o97k706l861m074l562k798k538l281
$$ 257574 263622 270066 276127 281204 284817 286438 285741 283035 279174 275100 271538 268740 266202 262921
55699B62921m554n346n316m976m793m764m848m971m741l914l091k984l152k460
$$ 262921 258367 253021 247705 242729 237936 233172 228324 223353 218612 214698 211607 208623 205471 203011
55685B03011p45J078K431L452M021L856L555M094N069M995L617K275J651Q61n57
$$ 203011 202266 203344 205775 209227 213248 217104 220659 224753 229822 234817 238434 240709 242360 243221 242664
55670B42664j568j491j287j831k341j799o80M8M75J024J190M59l40m8J074J897
$$ 242664 241096 239605 238318 236487 234146 232347 231667 231715 232190 233214 234404 234863 234523 234475 235549 237446
55654B37446K142K294K385K138J891K097K244J469l8j376k435l845n579o769p035
$$ 237446 239588 241882 244267 246405 248296 250393 252637 254106 254068 252692 250257 246412 240833 234064 227029
55639B27029o937o962o876o371n682n312n452n778n617m510k867j731j506j434
$$ 227029 220092 213130 206254 199883 194201 188889 183437 177659 172042 167532 164665 162934 161428 159994
55625A59994p20K37M22l92j473k114k157j778j325j245j702k270k395j965j236
$$ 159994 159274 159511 159933 159541 158068 155954 153797 152019 150694 149449 147747 145477 143082 141117 139881
55610A39881n15j03j63m01l26k2j08p32j322j584j872k182j842p88j60o91j487
$$ 139881 139366 139263 139100 138699 138373 138351 138243 137511 136189 134605 132733 130551 128709 127921 127761 127070 125583
55593A25583j381o88m36n65l51J4l10j121j250l83N27Q41J030J513J805J419Q16
$$ 125583 124202 123514 123078 122513 122162 122176 121866 120745 119495 119112 119639 120480 121510 123023 124828 126247 127063
55576A27063P79J403K129K552K704K761K747K534K062J486R92M30m49j380j711
$$ 127063 127842 129245 131374 133926 136630 139391 142138 144672 146734 148220 149212 149642 149193 147813 146102
55561A46102j418j389k202l236l549l158k694k285j611p50j35J69M14N51L67N5
$$ 146102 144684 143295 141093 137857 134308 131150 128456 126171 124560 123810 123675 123844 124258 124809 125176 125231
55545A25231L5L31P07J155J613J549O86j81m0Q46J265Q10L26M81R27J096R36N62
$$ 125231 125266 125597 126304 127459 129072 130621 131307 131126 131086 131932 133197 134007 134333 134814 135741 136837 137773 138335
55527A38335j25j073j966k710l463l972l616k388j189q05j096j589k211l045l757
$$ 138335 138210 137137 135171 132461 128998 125026 121410 119022 117833 117028 115932 114343 112132 109087 105330
55512A05330l889l471k871k221j326j37R60J388R01j37j047j446j496j430j155
$$ 105330 101441 97970 95099 92878 91552 91415 92375 93763 94664 94527 93480 92034 90538 89108 87953
55497H7953n45J25M77N74P12Q07M87k12p30o30jP37J164J035M57j69n95q93j018
$$ 87953 87408 87533 88010 88584 89296 90103 90590 90378 89648 89018 89017 89754 90918 91953 92410 92241 91646 90753 89735
55478H9735o17K39O56j7j082j284m66M30Q73J160J372J064K94j08J89L84j81r64
$$ 89735 89118 89357 90013 89996 88914 87630 87164 87594 88467 89627 90999 92063 92357 92249 92438 92822 92641 91677
55460I1677j138q72q71j131j028m21J81M65N97O35L52j21j17P38J792J929Q41
$$ 91677 90539 89667 88796 87665 86637 86216 86397 86862 87459 88094 88446 88325 88208 88946 90738 92667 93508
55443I3508n86j212p96l6L32K44M7q4k45m67o23n91l73m4K26K31l1k67j71K96
$$ 93508 92922 91710 90914 90878 91210 91454 91501 91417 91172 90705 90082 89491 89118 89074 89300 89531 89500 89233 89062 89358
55423H9358R81J676K044J793J214J068J603K076J806J220J139J401J111J68n96
$$ 89358 90339 92015 94059 95852 97066 98134 99737 101813 103619 104839 105978 107379 108490 108658 108062
55408A08062q44j252k206k928k613j756j504k062k538k200j270m75k30m30o75
$$ 108062 107218 105966 103760 100832 98219 96463 94959 92897 90359 88159 86889 86414 86184 85754 85079
55393H5079o46m27l98o85q65m19N44J273J134K43p37j328j622j875j935j392l63
$$ 85079 84433 84006 83608 82923 82058 81639 82183 83456 84590 84833 84096 82768 81146 79271 77336 75944 75581
55376G5581L05mp88r52j96O73Q63N95O71J356K060K131J625J172J137J188Q71
$$ 75581 75886 75882 75094 74142 73946 74619 75482 76077 76748 78104 80164 82295 83920 85092 86229 87417 88288
55359H8288L92M00R73J393J139O11M32N17M01J06J4R6k9l35l66k2K78K69J52P9
$$ 88288 88680 89080 90053 91446 92585 93196 93628 94145 94546 94652 94666 94762 94733 94398 94032 94010 94288 94557 94709 94788
55339I4788o5k86l62k75l53p49j163j227r06m40j61l20p53q63k96M70P14M41J81
$$ 94788 94723 94437 94075 93800 93447 92698 91535 90308 89402 88962 88801 88481 87728 86865 86569 87039 87753 88194 88375
55320H8375O5k06n47n50l16l94p30o37k9L20O1j12L55R86J169J045Q59K72p75
$$ 88375 88440 88234 87687 87137 86821 86427 85697 85060 85031 85351 85412 85300 85655 86641 87810 88855 89714 89986 89211
55301H9211j337o29O02R49K77k88q1L98N56M93N57P90J073J225R39J56n44n40
$$ 89211 87874 87245 87847 88796 89073 88785 88704 89102 89658 90151 90708 91498 92571 93796 94735 94891 94347 93807
55283I3807j69l75j257j792j297l53J53K02K04P9m21q00k88Q39J356P59N2K82
$$ 93807 93638 93263 92006 90214 88917 88564 88717 88919 89123 89202 88781 87981 87693 88532 89888 90647 90699 90981
55265I0981R81Q77j82r84o68J93N72L49R7Qk43p75j244j333j041m88J48N41M66
$$ 90981 91962 92839 92657 91673 91005 91198 91770 92119 92216 92224 91981 91206 89962 88629 87588 87100 87248 87789 88255
55246H8255J34q7k29n53q70o77K6N64M54m8m59o60p05m48K31J078J580J368M82
$$ 88255 88389 88302 88073 87520 86650 85973 85999 86563 87017 86969 86510 85850 85145 84697 84928 86006 87586 88954 89436
55227H9436n39r35m49K42L16r3j42L82P51N00P4m1j04m59p68n49qL06L43M11N29
$$ 89436 88897 87962 87513 87755 88071 87978 87836 88218 88969 89469 89543 89502 89398 88939 88171 87622 87614 87920 88263 88674 89203
55206H9203M78K67L1l02p42r11n04J73O14Q35J127J329J007K05n53r51j085j046
$$ 89203 89681 89948 89979 89677 88935 88024 87520 87693 88307 89142 90269 91598 92605 92810 92257 91306 90221 89175
55188H9175q06n02l61l38k40j27j47j15K63P52P65K09l12k94P9L39M16O47J206
$$ 89175 88369 87867 87506 87168 86928 86801 86654 86539 86802 87554 88319 88528 88216 87922 88001 88340 88756 89403 90609
55169I0609J767J749J041K74J26L43L9q94j388o84M52P36R2m97o13p39j032q46
$$ 90609 92376 94125 95166 95440 95566 95909 95948 95054 93666 92982 93434 94170 94262 93765 93152 92413 91381 90535
55151I0535J46J245J599J228P30M39L13K68K52J74kk35n69j044j358j030p3Q71
$$ 90535 90681 91926 93525 94753 95483 95922 96235 96503 96755 96929 96927 96692 96123 95079 93721 92691 92618 93489
55133I3489J220R65L72l40q72q00j32M64L81k46p86q48m58J86P41P21j1q33q56
$$ 93489 94709 95674 96046 95706 94834 94034 93902 94366 94747 94501 93715 92867 92409 92595 93336 94057 94046 93213 92357
55114I2357O2J116J458J037M28J01R4K80N85Q30O89J11l15J37J283J935J217k60
$$ 92357 92419 93535 94993 96030 96458 96559 96653 96933 97518 98348 99037 99148 98833 98970 100253 102188 103405 103145
55096A03145j064o67Q2K82J20L26Q99J047L46n71p70j05O92R65Q23P52Q58Q07
$$ 103145 102081 101414 101496 101778 101898 102224 103123 104170 104516 103945 103175 103070 103762 104727 105550 106302 107160 107967
55078A07967M46N9j36l35p68j236j397j269j096q51l69J56K79K3m0M29J085J402
$$ 107967 108413 108472 108336 108001 107233 105997 104600 103331 102235 101384 101015 101171 101450 101473 101433 101862 102947 104349
55060A04349J298R74N18l7m91o55o25o02n34k13L19P27P60M72P6k89o21r89j399
$$ 104349 105647 106621 107139 107102 106611 105956 105331 104729 104195 103982 104301 105028 105788 106260 106336 106047 105426 104437 103038
55041A03038j653j448p86j37j2l16m20PN59O56L41J55L36N56N26L90K95Ko40j183
$$ 103038 101385 99937 99151 99014 99002 98686 98266 98273 98832 99488 99829 99984 100320 100876 101402 101792 102087 102089 101449 100266
55021A00266j063m53n8q6o9K43M41K36O1M79J359K041K105J595P94N9l24m27n81
$$ 100266 99203 98750 98692 98606 98537 98780 99221 99457 99518 99997 101356 103397 105502 107097 107891 107950 107626 107199 106618
55002A06618q01o93k18K0l45q02p29l19j15p3J67M73N41O96J397K159K046J155
$$ 106618 105817 105124 104906 104926 104581 103779 103050 102731 102616 102543 102710 103183 103724 104420 105817 107976 110022 111177
54984A11177M91L73J27m21m98Q2K26p61j870j792q35l18n49o38o4O62R98J023
$$ 111177 111668 112041 112168 111747 111249 111331 111557 110796 108926 107134 106299 105981 105432 104794 104730 105392 106390 107413
54966A07413R89Q56N49K04QJ25O91J549K075J770R17K12j72n37q47o10K41R93
$$ 107413 108402 109258 109807 110011 110019 110144 110835 112384 114459 116229 117146 117358 117186 116649 115802 115192 115433 116426
54948A16426R66K54n66j050j093q62p39j006j410j370o80L47J385K307K792K409
$$ 116426 117392 117646 117080 116030 114937 114075 113336 112330 110920 109550 108870 109217 110602 112909 115701 118110
54932A18110J371N60M58N99N55P58J719K956L664L982M633N457N476M528L706
$$ 118110 119481 120041 120499 121098 121653 122411 124130 127086 130750 134732 139365 144822 150298 154826 158532
54917A58532L719L782K769P45j371l059m268m776m400l625l231l258l093k513
$$ 158532 162251 166033 168802 169547 168176 165117 160849 156073 151673 148048 144817 141559 138466 135953
54903A35953j976j832j953k158k383k318j569l92M03M98L85M24L69J35K81J089
$$ 135953 133977 132145 130192 128034 125651 123333 121764 121372 121775 122273 122658 123082 123451 123586 123867 124956
54887A24956J869J898J545J676K278K572K333K240K861L927M737M841M190L066
$$ 124956 126825 128723 130268 131944 134222 136794 139127 141367 144228 148155 152892 157733 161923 164989
54873A64989J958J133L38q04k159l181l608l648l585l561l683l918l897l284k317
$$ 164989 166947 168080 168418 167614 165455 162274 158666 155018 151433 147872 144189 140271 136374 133090 130773
54858A30773j672j687k100k437k397j880j124o87q73j228j114o50n37r87j379
$$ 130773 129101 127414 125314 122877 120480 118600 117476 116789 115916 114688 113574 112924 112387 111400 110021
54843A10021j078j50Q53J376J105K22n63o77m37o06j231j529j007m7P53J133R55
$$ 110021 108943 108793 109646 111022 112127 112349 111786 111109 110672 110066 108835 107306 106299 106252 107005 108138 109093
54826A09093J66p59r59k29O70J014Q47M95L3l36j38N84R82M79l45n97l04j14j67
$$ 109093 109259 108500 107541 107312 107982 108996 109843 110338 110371 110035 109897 110481 111463 111942 111597 111000 110696 110582 110415
54807A10415p2K76N65O36O07N13L36K77M89P17N94J56l29p62j024p32J47Q33N29
$$ 110415 110343 110619 111184 111820 112427 112940 113276 113553 114042 114759 115353 115509 115180 114418 113394 112662 112809 113642 114171
54788A14171m34r87o70R4R82K075L095L220K163P43M8L48J222K271L256L934M135
$$ 114171 113737 112750 112080 112174 113156 115231 118326 121546 123709 124452 124500 124848 126070 128341 131597 135531 139666
54771A39666L971L657L270K867K718L141M132N237N757N102L131M03k064l450
$$ 139666 143637 147294 150564 153431 156149 159290 163422 168659 174416 179518 182649 183052 180988 177538
54757A77538l673l339l199l577m269m888n291n516n457m841l685k483j752j479
$$ 177538 173865 170526 167327 163750 159481 154593 149302 143786 138329 133488 129803 127320 125568 124089
54743A24089j224n82M59J435J625P30n18q88n7R32J028M74K00M46P55J092J963
$$ 124089 122865 122283 122742 124177 125802 126532 126014 125126 125069 126001 127029 127503 127703 128149 128904 129996 131959
54726A31959L401M647N144N133N021M725M048L203K486J764N95j148l019m246
$$ 131959 135360 140007 145151 150284 155305 160030 164078 167281 169767 171531 172126 170978 167959 163713
54712A63713m325l558k942l122l617l512k829k477k818l060k498j585j217j465
$$ 163713 159388 155830 152888 149766 146149 142637 139808 137331 134513 131453 128955 127370 126153 124688
54698A24688j655j394q50k66K07L18n8n60o61l49o8q7l44p83j365j713j394n99
$$ 124688 123033 121639 120789 120523 120730 121048 120990 120430 119769 119420 119352 119265 118921 118138 116773 115060 113666 113067
54680A13067n3o5j79OK07L3l20m18l24m11n99m20K03P22P09L60J12O6O4O8J92
$$ 113067 113014 112949 112770 112776 112983 113016 112696 112278 111954 111543 110944 110524 110727 111449 112158 112518 112630 112696 112760 112828 113020
54659A13020N10R49J325J353R04L01R8L44M17j36q81j015m21K57N18N02N61P17
$$ 113020 113530 114479 115804 117157 118061 118362 118460 118804 119221 119085 118204 117189 116768 117025 117543 118045 118606 119323
54641A19323P68O30M35L68M71N54L97J08K2Q6k71j204j841j292pP27N37K74M55
$$ 119323 120091 120721 121156 121524 121995 122549 122946 123054 123076 123162 122891 121687 119846 118554 118547 119274 119811 120085 120540
54622A20540N01q6p78r53r45j316j706j379n14J3o3j74O5M25O92R67J191J027
$$ 120540 121041 120955 120177 119224 118279 116963 115257 113878 113364 113377 113314 113140 113205 113630 114322 115289 116480 117507
54604A17507M39j20l34l97n85q32r07p35l67J60P19J062R50L88k72m83o9L56l2
$$ 117507 117946 117826 117492 117095 116510 115678 114771 114036 113669 113829 114548 115610 116560 116948 116676 116193 116124 116480 116448
54585A16448j033j404m81P88J084N55M13J029J488J043P8o63r12o27K63J395J910
$$ 116448 115415 114011 113530 114318 115402 115957 116370 117399 118887 119930 120008 119345 118433 117806 118069 119464 121374
54568A21374J391M68j2NN7L2K03N34N29p7q37r74k70N98P07o2q62q53j59M66O12
$$ 121374 122765 123233 123221 123226 123283 123315 123518 124052 124581 124504 123667 122693 122423 123021 123728 123666 122804 121951 121792 122258 122870
54547A22870M63K82J43J22K25K24J5%N52J246J272N90n7k94n18r69j272j163r87
$$ 122870 123333 123615 123758 123880 124105 124329 124344 124344 124896 126142 127414 128004 127947 127653 127135 126166 124894 123731 122744
54528A22744j011r20m04L44J037J699K247K217J408K87n62r89r96n52LK3n21q07
$$ 122744 121733 120813 120409 120753 121790 123489 125736 127953 129361 129648 129086 128097 127101 126549 126552 126575 126054 125247
54510A25247m08Jj37j84O67J869K222J671J250J275Q65m87j927k308j583o31j76
$$ 125247 124839 124840 124703 124519 125186 127055 129277 130948 132198 133473 134338 133851 131924 129616 128033 127402 127226
54493A27226k94o93j003r68o27k89k20l88n16l14K52Q07Q57L81k4J58O90R08O03
$$ 127226 126932 126239 125236 124268 123641 123352 123132 122744 122228 121914 122166 122973 123830 124211 124187 124345 125035 125943 126546
54474A26546K43L32Q49J342J378Q92K84Q7M34Q72Q87M96J70K79P61J193J133M57
$$ 126546 126789 127121 127970 129312 130690 131582 131866 131953 132387 133259 134146 134642 134812 135091 135852 137045 138178 138635
54456A38635m85j184j451j354q53K2O85L97o36j264q77k28k51p06p55k92J38M11
$$ 138635 138150 136966 135515 134161 133308 133330 134015 134412 133776 132512 131635 131407 131156 130450 129695 129403 129541 129952
54438A29952Q66J413J473Q80J31l25m56l24L7L52L04O0N8K83K98O6M0L74N96L57
$$ 129952 130818 132231 133704 134584 134715 134390 133934 133610 133647 133999 134303 134363 134421 134704 135002 135068 135108 135482 136078 136435
54418A36435pJ0M12P59P44M48K09K26K65j04p86j038m67K78L35j02r8O22J369
$$ 136435 136428 136438 136850 137609 138353 138801 139010 139236 139501 139397 138611 137573 137106 137384 137719 137617 137519 138141 139510
54399A39510J528J192O50P9j70K53J014J277Q37L55K77K27j43m86m21k60m10n90
$$ 139510 141038 142230 142880 142959 142789 143042 144056 145333 146170 146525 146802 147029 146886 146400 145979 145719 145309 144719
54381A44719k49N15J084J157J027J093J423J700J453N76l49n70j48J23j07k37
$$ 144719 144470 144985 146069 147226 148253 149346 150769 152469 153922 154498 154149 153579 153431 153554 153447 153210
54365A53210K79J050J386J304J247J207Q09J38k33J3O49J375K144K943L594L871
$$ 153210 153489 154539 155925 157229 158476 159683 160492 160630 160397 160410 161059 162434 164578 167521 171115 174986
54349A74986L659K991K088J216M01n56j646k479k751k646k527k458k338k272k460
$$ 174986 178645 181636 183724 184940 185341 184785 183139 180660 177909 175263 172736 170278 167940 165668 163208
54334A63208k805k931k560j744q55l92o02j162j439j173o07k5M74O99M12r8j72
$$ 163208 160403 157472 154912 153168 152313 151921 151319 150157 148718 147545 146938 146913 147387 148086 148498 148400 148228
54317A48228K09J98o44j469j207l6R28J074O71J00n12q74o42J0M51L39j37p60
$$ 148228 148437 148635 147991 146522 145315 145279 146207 147281 147952 148052 147540 146666 146024 146034 146485 146824 146687 145927
54299A45927j458j981j979j454p36K8Q41J419J374Q85N83O72P11M27J50K23N00
$$ 145927 144469 142488 140509 139055 138319 138347 139188 140607 141981 142866 143449 144121 144832 145259 145409 145632 146132
54282A46132P49R96J174R30K21l42j90L91O07J57m99p42l66L38Q33P42K33j24
$$ 146132 146881 147877 149051 149981 150202 149860 149670 150061 150668 150825 150326 149584 149218 149556 150389 151131 151364 151240
54264A51240k3K06Q8l07m75j39N04J106J456J426R61K79j60p3L19N34L17j48n45
$$ 151240 151217 151423 151511 151204 150729 150590 151094 152200 153656 155082 156043 156322 156162 156089 156408 156942 157259 157111 156566
54245A56566p05n76j06N96J113J039M62j16m15o08q68j068j121j200j322j108
$$ 156566 155861 155285 155179 155775 156888 157927 158389 158273 157858 157250 156382 155314 154193 152993 151671 150563
54229A50563m27J23l3m98l66M43J114J166J005R95Q12J06p17r73n70RL09J64l90
$$ 150563 150136 150259 150226 149728 149362 149805 150919 152085 153090 154085 154897 155003 154286 153313 152743 152752 153061 153225 152835
54210A52835j054j387j281j059q67l86M90J106Q08n8n83n07l35k91J1P24J290
$$ 152835 151781 150394 149113 148054 147187 146801 147291 148397 149205 149147 148564 148057 147722 147431 147442 148166 149456
54193A49456J230Q52P23Q45Q25N43K14j01n06q29o97j45K70J93l2J22N91Q52O66
$$ 149456 150686 151538 152261 153106 153931 154474 154688 154587 154081 153252 152555 152410 152680 152873 152841 152963 153554 154406 155072
54174A55072L18J05n5l31o22p02n35k87j16j13k95m73l29J30L69n9q20j149q56
$$ 155072 155390 155495 155440 155109 154487 153785 153250 152963 152847 152734 152439 151966 151637 151767 152136 152077 151257 150108 149252
54155A49252n86q72j378j344n53M45J001R55O32L69J47l05j026j578j452o48L63
$$ 149252 148666 147794 146416 145072 144519 144964 145965 146920 147552 147921 148068 147763 146737 145159 143707 143059 143422
54138A43422J168J636J676J233N92K59L07J94m98j348j500o80M96J131R04L41
$$ 143422 144590 146226 147902 149135 149727 149986 150293 150487 149989 148641 147141 146461 146957 148088 148992 149333
54122A49333L21J127K071K271J760J339J352J276P56K81L01L67q3n61k08P42J124
$$ 149333 149654 150781 152852 155123 156883 158222 159574 160850 161606 161887 162188 162555 162472 161911 161703 162445 163569
54105A63569M88l90p85q23p68m22K35O07K98k01k73j58m54j021j153p01k52k02
$$ 163569 164057 163667 162882 162059 161291 160869 161104 161711 162009 161808 161535 161377 160923 159902 158749 158048 157796 157594
54087A57594k39N1O09J132J481J679J728J679J691J851K061K264K658L527M777
$$ 157594 157355 157406 158015 159147 160628 162307 164035 165714 167405 169256 171317 173581 176239 179766 184543
54072A84543N830O137N819N625O064O637O268M497J919n35k442l786m575m906
$$ 184543 190373 196510 202329 207954 214018 220655 226923 231420 233339 232804 230362 226576 222001 217095
54058B17095n101n245m818l377j439j04K77M26R78J625J695J202P79R10J576K544
$$ 217095 211994 206749 201931 198554 197115 197011 197288 197714 198692 200317 202012 203214 203993 204903 206479 209023
54042B09023L553M307M663M855N264N933O502O682O519O188N728N084M269L294
$$ 209023 212576 216883 221546 226401 231665 237598 244100 250782 257301 263489 269217 274301 278570 281864
54028B81864K156R85J48n3K17M54L78J84O4k05r04j758k179k181k470l391m230
$$ 281864 284020 285005 285153 285100 285317 285771 286149 286333 286397 286192 285288 283530 281351 279170 276700 273309 269079
54011B69079m128l324k899l334l997m082l498k617j665p60o1M17R17J470J678
$$ 269079 264951 261627 258728 255394 251397 247315 243817 241200 239535 238775 238714 239131 240048 241518 243196
53996B43196J299Q24R77J810K633K756J984M70j440l262m564n208n247m779m098
$$ 243196 244495 245319 246296 248106 250739 253495 255479 255949 254509 251247 246683 241475 236228 231449 227351
53981B27351l726l901m198m055l410k541j514m54No09j615j805j117p07j052j147
$$ 227351 223625 219724 215526 211471 208061 205520 204006 203552 203557 202948 201333 199528 198411 197704 196652 195505
53965A95505j53J173J600J167P77O53L86J79P52J947K593K126J420J596K701L998
$$ 195505 195352 196525 198125 199292 200069 200722 201108 201287 202039 203986 206579 208705 210125 211721 214422 218420
53949B18420M905N239N036M550M135L850L525L340L765M695N314N206N026N586
$$ 218420 223325 228564 233600 238150 242285 246135 249660 253000 256765 261460 266774 271980 277006 282592
53935B82592O789Q024Q997R634R690R321R582J1400J4264J6825J8693K0590K2587
$$ 282592 289381 297405 306402 316036 325726 335047 344629 356029 370293 387118 405811 426401 448988
53922D48988K3337K1504J7163J1268M543k373q275j1862j2900j2307j1094r703
$$ 448988 472325 493829 510992 522260 526803 524430 516155 504293 491393 479086 467992 458289
53910D58289q300p189o645o572o550o212n553m910m606m576m443l961l274k818
$$ 458289 449989 442800 436155 429583 423033 416821 411268 406358 401752 397176 392733 388772 385498 382680
53896C82680l050m170n801p002p077o385n986o347o891o953o635o313n895n171
$$ 382680 379630 375460 369659 362657 355580 349195 343209 336862 329971 323018 316383 310070 304175 299004
53882B99004m447m207m322m308m135m137m191l808l086k785l194l613l370k776
$$ 299004 294557 290350 286028 281720 277585 273448 269257 265449 262363 259578 256384 252771 249401 246625
53868B46625k598l000l496l717l659l334k683j878j349j327j526j441r01k78r5
$$ 246625 244027 241027 237531 233814 230155 226821 224138 222260 220911 219584 218058 216617 215716 215438 215343
53853B15343m57r86j373j731k169k289j624m84K28Q5m81r79j365j535j032J40
$$ 215343 214886 213900 212527 210796 208627 206338 204714 204230 204458 204543 204062 203083 201718 200183 199151 199291
53837A99291J012O83m34j105p93n6M54O58O67M23n8n47q68r49o10K41J168J518
$$ 199291 200303 200986 200552 199447 198654 198598 199052 199710 200377 200800 200742 200195 199327 198378 197768 198009 199177 200695
53819B00695J312J311J948K687K790K300J828J749K007K470K977L251L181L161
$$ 200695 202007 203318 205266 207953 210743 213043 214871 216620 218627 221097 224074 227325 230506 233667
53805B33667L734M883N986O519O435N882M904L656K584K102K180K417K526K519
$$ 233667 237401 242284 248270 254789 261224 267106 272010 275666 278250 280352 282532 284949 287475 289994
53791B89994K385J900R89J60Q2O74R39P7j503k695l020k961l073l389l828m517
$$ 289994 292379 294279 295268 295428 295510 296184 297123 297200 295697 293002 289982 287021 283948 280559 276731 272214
53775B72214n341n689n178m267l611l130k352j468j258j913k643k731k324j873
$$ 272214 266873 261184 256006 251739 248128 244998 242646 241178 239920 238007 235364 232633 230309 228436
53761B28436j394p87m56r08j905k621k662k381k115j725j083n23l95n13m87l79
$$ 228436 227042 226255 225799 224891 222986 220365 217703 215322 213207 211482 210399 209876 209481 208968 208481 208102
53745B08102n64j034j353j303j096r12o34j98K54P47J543K496K821K026P39N3
$$ 208102 207538 206504 205151 203848 202752 201840 201206 201008 201262 202009 203552 206048 208869 210895 211634 211687
53729B11687K55P41R98J044R39O29L81O90J448J822J341N50J88K40L20N31J252
$$ 211687 211942 212683 213681 214725 215664 216293 216674 217364 218812 220634 221975 222525 222713 222953 223273 223804 225056
53712B25056K278K928K932K644K379K052J661J540J889K387K561K369K153K134
$$ 225056 227334 230262 233194 235838 238217 240269 241930 243470 245359 247746 250307 252676 254829 256963
53698B56963K146J941J631J670K269K962L076K583K108J945J653R18K72L10N79
$$ 256963 259109 261050 262681 264351 266620 269582 272658 275241 277349 279294 280947 281865 282137 282447 283026
53683B83026Q3j269k502k897k677k245j547n86J44K43qj34j21k16l94m92n64p16
$$ 283026 283109 281840 279338 276441 273764 271519 269972 269386 269530 269773 269765 269631 269510 269294 268900 268408 267844 267128
53665B67128q67j014j393j934j984j095J70R19J105J393J918K046J397M42j53
$$ 267128 266261 265247 263854 261920 259936 258841 259011 259930 261035 262428 264346 266392 267789 268231 268078
53650B68078k75j95j41k42n07o77m50M3M03O17J045J625J821J578J605K197K493
$$ 268078 267803 267608 267467 267225 266718 266041 265591 265634 266037 266654 267699 269324 271145 272723 274328 276525 279018
53633B79018J682L97k4O57J452J722J852K221K505K416K333K626K918K745K439
$$ 279018 280700 281097 281073 281730 283182 284904 286756 288977 291482 293898 296231 298857 301775 304520 306959
53618C06959K668L332L708L682M060N358O836P225O227M869M401N119O331P189
$$ 306959 309627 312959 316667 320349 324409 329767 336603 343828 350055 354924 359325 364444 370775 377964
53604C77964P392P163O848O546O035M941L092Q19j249k733l667m082l775k868
$$ 377964 385356 392519 399367 405913 411948 416889 419981 420800 419551 416818 413151 409069 405294 402426
53590D02426k152k311k902k860k019j386j673k355k622k587k807l150l019k392
$$ 402426 400274 397963 395061 392201 390182 388796 387123 384768 382146 379559 376752 373602 370583 368191
53576C68191j903j879k030k066j949j562q45k87n79j580k229j781n90N61J329
$$ 368191 366288 364409 362379 360313 358364 356802 355957 355670 355091 353511 351282 349501 348911 349472 350801
53561C50801J746J802J549J247J079R97R99J164J330J175P98O80Q12O48K02L84
$$ 350801 352547 354349 355898 357145 358224 359221 360220 361384 362714 363889 364687 365367 366179 366827 367029 367413
53545C67413J570K674K500J532J292K249L386L835L857M075M623N390O416P601
$$ 367413 368983 371657 374157 375689 376981 379230 382616 386451 390308 394383 399006 404396 410812 418413
53531D18413Q520Q886Q918Q992R257R698J0219J0566J0568J0562J1193J2569J3958
$$ 418413 426933 435819 444737 453729 462986 472684 482903 493469 504037 514599 525792 538361 552319
53518E52319J4579J4461J4352J4984J6526J8489K0076K0793K0844K0816K1100
$$ 552319 566898 581359 595711 610695 627221 645710 665786 686579 707423 728239 749339
53507G49339K1726K2593K3433K3723K3130K2003K1030K0428J9978J9660J9647
$$ 749339 771065 793658 817091 840814 863944 885947 906977 927405 947383 967043 986690
53496I86690J9643J9032J7829J6889J6832J7334J7755J7890J7792J7438J6947
$$ 986690 1006333 1025365 1043194 1060083 1076915 1094249 1112004 1129894 1147686 1165124 1182071
53485A182071J6733J6974J7327J7418J7216J6750J5984J5168J4704J4277J2868
$$ 1182071 1198804 1215778 1233105 1250523 1267739 1284489 1300473 1315641 1330345 1344622 1357490
53474A357490J0169P321N537M527L071O97k033m565o890r056j0953j2530j3740
$$ 1357490 1367659 1374980 1380517 1385044 1388115 1388812 1386779 1382214 1375324 1366268 1355315 1342785 1329045
53461A329045j4304j4105j3628j3525j3884j4467j5313j6513j7661j8365j8984
$$ 1329045 1314741 1300636 1287008 1273483 1259599 1245132 1229819 1213306 1195645 1177280 1158296
53450A158296k0023k0903k0452j8647j6840j5926j5378j4447j3335j2477j1473
$$ 1158296 1138273 1117370 1096918 1078271 1061431 1045505 1030127 1015680 1002345 989868 978395
53439I78395r629p155n000l636k727j910j278r65o58J46J538L029M064M658N358
$$ 978395 968766 961611 956611 952975 950248 948338 947060 946095 945437 945583 947121 950150 954214 958872 964230
53424I64230O473P699Q720R847J1528J3509J5097J6206J7358J8677J9676K0271
$$ 964230 970703 978402 987122 996969 1008497 1022006 1037103 1053309 1070667 1089344 1109020 1129291
53412A129291K1135K2677K4348K5522K6377K7383K8526K9676L1205L3505L6194
$$ 1129291 1150426 1173103 1197451 1222973 1249350 1276733 1305259 1334935 1366140 1399645 1435839
53401A435839L8567M0573M2649M4765M6394M7402M8300M9499N0855N2015N2723
$$ 1435839 1474406 1514979 1557628 1602393 1648787 1696189 1744489 1793988 1844843 1896858 1949581
53390A949581N2773N2139N1264N0699N0364M9513M7660M5142M2663M0546L8537
$$ 1949581 2002354 2054493 2105757 2156456 2206820 2256333 2303993 2349135 2391798 2432344 2470881
53379B470881L6191L3241K9816K6274K2741J8873J4324R330M495N0m361r230j4892
$$ 2470881 2507072 2540313 2570129 2596403 2619144 2638017 2652341 2661671 2666166 2666216 2661855 2652625 2637733
53366B637733k1454k8561l5179m0250m3757m6582m9141n0762n0784m9767m8918
$$ 2637733 2616279 2587718 2552539 2512289 2468532 2421950 2372809 2322047 2271263 2221496 2172578
53355B172578m8656m8330m7304m5688m3927m2201m0502l8973l7868l7254l6964
$$ 2172578 2123922 2075592 2028288 1982600 1938673 1896472 1855970 1816997 1779129 1741875 1704911
53344A704911l6797l6547l5982l4926l3425l1770l0232k8837k7441k5931k4283
$$ 1704911 1668114 1631567 1595585 1560659 1527234 1495464 1465232 1436395 1408954 1383023 1358740
53333A358740k2408k0169j7595j5037j2970j1597j0758j0257j0203j0876j2219
$$ 1358740 1336332 1316163 1298568 1283531 1270561 1258964 1248206 1237949 1227746 1216870 1204651
53322A204651j3553j4066j3579j2671j1919j1278j0437r475q695p914o535m423
$$ 1204651 1191098 1177032 1163453 1150782 1138863 1127585 1117148 1107673 1098978 1091064 1084529 1080106
53310A080106k214n04P81J943K916L523L926M420N086O114P986J0796J3727J5898
$$ 1080106 1077892 1077388 1078169 1080112 1083028 1086551 1090477 1094897 1099983 1106097 1114083 1124879 1138606 1154504
53296A154504J7448J9066K0810K2224K3412K4856K6211K6382K5205K3890K3309
$$ 1154504 1171952 1191018 1211828 1234052 1257464 1282320 1308531 1334913 1360118 1384008 1407317
53285A407317K2796K1384J9274J7252J5335J3082J0700Q791P123M806J617j698
$$ 1407317 1430113 1451497 1470771 1488023 1503358 1516440 1527140 1535931 1543054 1547860 1549477 1547779
53273A547779m588p287j0031j2430j4029j5027j6078j7653j9760k2009k3835k4937
$$ 1547779 1543191 1535904 1525873 1513443 1499414 1484387 1468309 1450656 1430896 1408887 1385052 1360115
53261A360115k5559k6112k6575k6611k6221k5808k5561k5311k5033k4976k5136
$$ 1360115 1334556 1308444 1281869 1255258 1229037 1203229 1177668 1152357 1127324 1102348 1077212
53250A077212k5099k4659k4075k3558k2968k2337k2148k2579k2946k2450k1249
$$ 1077212 1052113 1027454 1003379 979821 956853 934516 912368 889789 866843 844393 823144
53239H23144k0189j9574j8850j7556j6044j4954j4287j3441j2073j0581r513q819
$$ 823144 802955 783381 764531 746975 730931 715977 701690 688249 676176 665595 656082 647263
53227F47263q034p191o989p766q757q994q642q736r680j0807j1515j2037j2739
$$ 647263 639229 632038 625049 617283 608526 599532 590890 582154 572474 561667 550152 538115 525376
53214E25376j3372j3563j3383j2920j1875j0223q739q121q041p851p754q302r006
$$ 525376 512004 498441 485058 472138 460263 450040 441301 433180 425139 417288 409534 401232 392226
53201C92226q685p238n948n737o107o252o237o456o712o625o365o256n987n049
$$ 392226 383541 376303 370355 364618 358511 352259 346022 339566 332854 326229 319864 313608 307621 302572
53187C02572l714k824k697k881k918k815k630k247j663j172r73r64j015j169j477
$$ 302572 298858 296034 293337 290456 287538 284723 282093 279846 278183 277011 276038 275074 274059 272890 271413
53172B71413j863k247k554k606k246j716j559j871k008j328j38N45J99n77q36
$$ 271413 269550 267303 264749 262143 259897 258181 256622 254751 252743 251415 251277 251822 252021 251444 250608
53157B50608m53j27l77r14j189j192j309j542j439q19j40J37J02P4L6k38p15j164
$$ 250608 250155 250028 249651 248737 247548 246356 245047 243505 242066 241247 241107 241244 241346 241420 241456 241218 240503 239339
53139B39339j522j789j704r85P0P55Q03O80Q67J260J468J358J083Q56Q96J319
$$ 239339 237817 236028 234324 233339 233409 234164 234967 235647 236514 237774 239242 240600 241683 242539 243435 244754
53123B44754J856J960J520J139J339J810J880J491J094P04j75j554k554k456j668
$$ 244754 246610 248570 250090 251229 252568 254378 256258 257749 258843 259547 259372 257818 255264 252808 251140
53108B51140j192j391j801j945j836j681j558j456j333j031m56J42L66K27J63
$$ 251140 249948 248557 246756 244811 242975 241294 239736 238280 236947 235916 235460 235602 235968 236195 236358
53093B36358L73M85K18o2J72P59R60L91n56j272j488j225o03Q4L92J82j43n6M97
$$ 236358 236731 237216 237434 237372 237544 238303 239263 239654 239098 237826 236338 235113 234510 234594 234986 235168 235025 234969 235466
53074B35466J084J249P84k33j420k185k133j461p32l47l52o99j286j718j491o23
$$ 235466 236550 237799 238583 238350 236930 234745 232612 231151 230419 230072 229720 229021 227735 226017 224526 223903
53058B23903J78L23O2J04O55J237J419J288J117R70Q25P26N51l9j033j747j493
$$ 223903 224081 224404 224466 224570 225225 226462 227881 229169 230286 231256 232081 232807 233358 233319 232286 230539 229046
53041B29046m53N62J126J453J620J241J56j060j707j752j590j358r58m69q3K51
$$ 229046 228593 229155 230281 231734 233354 234595 234751 233691 231984 230232 228642 227284 226326 225857 225774 226025
53025B26025O40Q71O98M03M34O18M07p8n0O43J065N45k18j13Q06J556J746J898
$$ 226025 226665 227536 228234 228637 229071 229689 230096 230018 229968 230611 231676 232221 232003 231890 232696 234252 235998 237896
53007B37896K250K168J182r6o83m99l34o27r20o66j25m2n37q40k77Q22J517J382
$$ 237896 240146 242314 243496 243400 242717 242218 241884 241257 240337 239671 239546 239504 238967 238127 237850 238672 240189 241571
52989B41571Q06K49k51o83o50J43J274J938J847J428J162J073R83R11J014J328
$$ 241571 242377 242626 242375 241692 241042 241185 242459 244397 246244 247672 248834 249907 250890 251801 252815 254143
52973B54143J729K042K104J766J049K38k48k20Q5K41R3q2L1L24L73o0p99j520
$$ 254143 255872 257914 260018 261784 262833 263071 262823 262603 262688 262929 263022 262940 262971 263295 263668 263608 262809 261289
52955B61289k010k171j995j651j351j151j034j105j401j546j112l59p1n08j056
$$ 261289 259279 257108 255113 253462 252111 250960 249926 248821 247420 245874 244762 244403 244332 243824 242768
52940B42768j184j077r86o19J66P00K94o62j231j250j285j449j262o06L9M48Q06
$$ 242768 241584 240507 239521 238902 239068 239768 240062 239400 238169 236919 235634 234185 232923 232317 232356 232804 233610
52923B33610R72M75m65q19j06Q63J128P19K26j74n90p94n03N9M28N85Q63J255
$$ 233610 234582 235057 234592 233773 233667 234530 235658 236377 236603 236429 235839 235045 234542 234601 235029 235614 236477 237732
52905B37732J354Q79Mq38j244j095p08m80l40J18Q10R90K64o79q53k04M24L99
$$ 237732 239086 239965 239969 239131 237887 236792 236084 235604 235264 235382 236192 237182 237446 236767 235914 235710 236134 236533
52887B36533j23n52m51J18N78L72k75m99N6P30Q67P72J036J368J038J88k47J42
$$ 236533 236410 235858 235407 235525 236103 236475 236200 235701 235757 236487 237354 238126 239162 240530 241568 241756 241509 241651
52869B41651Q35J410K068K850L145K496J375O18L83J50m24j080j455j639k057
$$ 241651 242486 243896 245964 248814 251959 254455 255830 256448 256831 256981 256557 255477 254022 252383 250326
52854B50326k803l328l042k193j756k226k918k814j810o74j06k84j067k046k516
$$ 250326 247523 244195 241153 238960 237204 234978 232060 229246 227436 226762 226656 226372 225305 223259 220743
52839B20743k055j108m49j58J88M97K24n16p75j11P62J028P91N58L62J5k92k25
$$ 220743 218688 217580 217131 216973 217161 217658 217882 217366 216591 216480 217242 218270 219061 219619 219981 219996 219704 219479
52821B19479R5K75K12Q2J4J29N53J104J310J130J204J837K235J382n46k276k852
$$ 219479 219574 219849 220061 220143 220157 220286 220839 221943 223253 224383 225587 227424 229659 231041 230495 228219 225367
52804B25367k403j582q78m95m20m64n17p24j087j137m30P14J476J453Q92J13p27
$$ 225367 222964 221382 220504 220009 219589 219125 218608 217884 216797 215660 215230 215944 217420 218873 219765 219878 219151
52787B19151j291j137k79O91J293J556J672J654J515J351J103N75j47o83r29j164
$$ 219151 217860 216723 216444 217135 218428 219984 221656 223310 224825 226176 227279 227854 227707 227024 226095 224931
52771B24931j446j332n47M97J142J220R28L46n06j365j859j875j456n91N42J346
$$ 224931 223485 222153 221606 222103 223245 224465 225393 225739 225233 223868 222009 220134 218678 218087 218629 219975
52755B19975J294O11P0J35O24J184J595J668J310Q44Q04J278J738J751J482J335
$$ 219975 221269 221880 221950 222085 222709 223893 225488 227156 228466 229310 230114 231392 233130 234881 236363 237698
52739B37698J412J587J764J797J426O31j27m11l41k83k50o0Q4k16p91r72n98l63
$$ 237698 239110 240697 242461 244258 245684 246315 246188 245777 245436 245153 244903 244843 244927 244711 243920 242948 242350 241987
52721B41987p95j419j432q69m88o39r01q79p83r43j191j057m28L73R79J256J184
$$ 241987 241192 239773 238341 237472 236984 236345 235444 234565 233782 232839 231648 230591 230163 230536 231515 232771 233955
52704B33955P86K37j07J1M89Q95R18O83N98Q64J237J353J147Q20M85Q1l91p86
$$ 233955 234741 234978 234871 234882 235371 236266 237184 237867 238465 239329 240566 241919 243066 243886 244371 244452 244061 243275
52686B43275j006j070r84o99l02k9j6j83m38p62j025j002p55o88r48r88k03J142
$$ 243275 242269 241199 240215 239516 239214 239185 239169 238986 238548 237786 236761 235759 235004 234316 233368 232380 232177 233319
52668B33319K072J982J197L93j02k19J85J137K160K524K032J290J108J639K179
$$ 233319 235391 237373 238570 238963 238861 238642 238827 239964 242124 244648 246680 247970 249078 250717 252896
52653B52896J836M11j335k349k249j531r22o83o40o41p16q63r10p38m32k11j48
$$ 252896 254732 255143 253808 251459 249210 247679 246757 246074 245434 244793 244077 243214 242304 241566 241134 240923 240775
52636B40775p4K85R89J744K118J961J522J087O78J82l64q37j269j746k074j863
$$ 240775 240701 240986 241975 243719 245837 247798 249320 250407 251085 251267 250903 250066 248797 247051 244977 243114
52620B43114j004N8P10P29M57M49R34J506J506P93P5J43Q97J524J495J029M95
$$ 243114 242110 242168 242878 243607 244064 244513 245447 246953 248459 249252 249327 249470 250367 251891 253386 254415 254910
52603B54910m3n22o76m82l35m28l91j2K45j3k86R8P96R23N16M74R70J060K50n75
$$ 254910 254867 254345 253669 253187 252852 252424 252033 252021 252266 252253 251967 252065 252861 253784 254300 254774 255744 256804 257054 256479
52583B56479m22M00Q94Q35P39P59M96j87r04j248j080l90O00J249R48j67j335
$$ 256479 256057 256457 257351 258186 258925 259684 260180 259993 259089 257841 256761 256371 256971 258220 259168 259001 257666
52566B57666j989k107j798j095k15M05M88Q8n45j053j006l31L67L87j42l64J28
$$ 257666 255677 253570 251772 250677 250462 250867 251355 251443 250898 249845 248839 248508 248875 249262 249120 248756 248884
52549B48884P63Q05K44m23q79j101j072p53k83Q7K44L12M94Q66J247J313J026
$$ 248884 249647 250452 250696 250273 249394 248293 247221 246468 246185 246272 246516 246828 247322 248188 249435 250748 251774
52532B51774P86R17J098P72O4k53R8L81j59j195j727j387p60m55l59k6N62J003
$$ 251774 252560 253477 254575 255347 255411 255158 255256 255637 255478 254283 252556 251169 250409 249954 249595 249569 250131 251134
52514B51134J172J521K444L536L877L181K233J886J946J512K37j268k309k767
$$ 251134 252306 253827 256271 259807 263684 266865 269098 270984 272930 274442 274679 273411 271102 268335
52500B68335k810k483j828j116o40n36q60j496j921j515l37P66J141R89Q50Q46
$$ 268335 265525 263042 261214 260098 259458 258922 258062 256566 254645 253130 252793 253559 254700 255689 256539 257385
52484B57385Q23Q08Q80Q31M86J76L45Q24R57N04l9j05K86P36J052J407J903K270
$$ 257385 258208 259016 259896 260727 261213 261389 261734 262558 263515 264019 263980 263875 264161 264897 265949 267356 269259 271529
52466B71529K171J808J861K543L102K715J719J120R77K42j479k962k952j961j484
$$ 271529 273700 275508 277369 279912 283014 285729 287448 288568 289545 289787 288308 285346 282394 280433 278949
52451B78949j962k539k656k664k787k593j923j422j552j740j277n42m95j198j607
$$ 278949 276987 274448 271792 269128 266341 263748 261825 260403 258851 257111 255834 255292 254797 253599 251992
52436B51992j026J4O41Q53J287K003K232J487L37k42L6P22J360J787J916J757
$$ 251992 250966 250980 251621 252474 253761 255764 257996 259483 259820 259578 259614 260336 261696 263483 265399 267156
52420B67156J653J908K292K386K380K814L611M184M632N824P952R925J0859J1150
$$ 267156 268809 270717 273009 275395 277775 280589 284200 288384 293016 298840 306792 316717 327576 338726
52406C38726J1291J0527P844L636p24m576p975j0374j0774r319p494o356n533
$$ 338726 350017 360544 368388 372024 371300 366724 358749 348375 337601 328282 320788 314432 308899
52393C08899m313k864j858j597j932k503k711k017o00O63J101Q18L17P1M78J620
$$ 308899 304586 301722 299864 298267 296335 293832 291121 289104 288504 289167 290268 291086 291403 291474 291952 293572
52377B93572K885L428L183K908L091L493L801M083M329M265L889L524L145K292
$$ 293572 296457 299885 303068 305976 309067 312560 316361 320444 324773 329038 332927 336451 339596 341888
52363C41888R76q8m33l41p5N16J279J503R89N39P76J205J185J045J396K023K365
$$ 341888 342864 342776 342343 342002 341927 342443 343722 345225 346214 346753 347529 348734 349919 350964 352360 354383 356748
52346C56748K525K893L252L211L062L311L729L888M240N481P166Q091Q102Q286
$$ 356748 359273 362166 365418 368629 371691 375002 378731 382619 386859 392340 399506 407597 415699 423985
52332D23985R320J0704J1896J3087J4437J5499J5989J6394J7302J8642J9942K0908
$$ 423985 433305 444009 455905 468992 483429 498928 514917 531311 548613 567255 587197 608105
52320F08105K1355K1107K0327J9553J9083J8724J8389J8427J9024J9717J9892
$$ 608105 629460 650567 670894 690447 709530 728254 746643 765070 784094 803811 823703
52309H23703J9435J8608J7646J6745J6097J5537J4554J3016J1563J0828J0504
$$ 823703 843138 861746 879392 896137 912234 927771 942325 955341 966904 977732 988236
52298I88236R649P813N441L177J126j034l445n697p142p589p588p883q562r048
$$ 988236 997885 1005698 1011139 1014316 1015442 1014408 1010963 1005266 998124 990535 982947 975064 966502 957454
52284I57454q865q105p030n591l662j520K55J413K357L731N705P682Q884R302
$$ 957454 948589 940484 933454 927863 924201 922681 922936 924349 926706 930437 936142 943824 952708 962010
52270I62010R794J1021J2515J3284J3156J2927J3178J3639J3928J4241J4807J5192
$$ 962010 971804 982825 995340 1008624 1021780 1034707 1047885 1061524 1075452 1089693 1104500 1119692
52258A119692J4748J3528J2259J1514J1274J1143J0605R211O911M244J839k55
$$ 1119692 1134440 1147968 1160227 1171741 1183015 1194158 1204763 1213974 1220885 1225129 1226968 1226713
52246A226713k438m830p007q508r307r705j0029j0516j1216j1889j2144j1842
$$ 1226713 1224275 1219445 1212438 1203930 1194623 1184918 1174889 1164373 1153157 1141268 1129124 1117282
52234A117282j1270j0810j0515j0145r497q652p809o990n995m729l440k509j972
$$ 1117282 1106012 1095202 1084687 1074542 1065045 1056393 1048584 1041594 1035599 1030870 1027430 1024921 1022949
52221A022949j462o50L71J324K137K900L588M045M260M392M519M548M455M369
$$ 1022949 1021487 1020837 1021208 1022532 1024669 1027569 1031157 1035202 1039462 1043854 1048373 1052921 1057376 1061745
52207A061745M370M310M053L759L741M064M532N040N679O374O712O423N864N636
$$ 1061745 1066115 1070425 1074478 1078237 1081978 1086042 1090574 1095614 1101293 1107667 1114379 1120802 1126666 1132302
52193A132302N760N683N067M148L112J665l40k357l776m814o133p686q755r089
$$ 1132302 1138062 1143745 1148812 1152960 1156072 1157737 1157397 1155040 1151264 1146450 1140317 1132631 1123876 1114787
52179A114787r245r504r293q172o759n992n791n222l878k404j565j317j050l70
$$ 1114787 1105542 1096038 1086745 1078573 1071814 1065822 1060031 1054809 1050931 1048527 1046962 1045645 1044595 1044225
52165A044225O12J503J944J838J433J152J234J567J829J749J238M32l00n61k06
$$ 1044225 1044837 1046340 1048284 1050122 1051555 1052707 1053941 1055508 1057337 1059086 1060324 1060756 1060456 1059895 1059689
52150A059689N50J324J836J991J867J687J700J919J937J244j66j576k179j835
$$ 1059689 1060239 1061563 1063399 1065390 1067257 1068944 1070644 1072563 1074500 1075744 1075578 1074002 1071823 1069988
52136A069988r54K89K179M746P242Q878R838J1053J3041J5455J7847K0258K2831
$$ 1069988 1069034 1069323 1071502 1076248 1083490 1092368 1102206 1113259 1126300 1141755 1159602 1179860 1202691
52123A202691K5295K7138K8136K8417K8217K7821K7450K7071K6373K5174K3677
$$ 1202691 1227986 1255124 1283260 1311677 1339894 1367715 1395165 1422236 1448609 1473783 1497460
52112A497460K2211K0888J9608J8214J6510J4474J2484J1028J0002Q734O931N127
$$ 1497460 1519671 1540559 1560167 1578381 1594891 1609365 1621849 1632877 1642879 1651613 1658544 1663671
52100A663671L805K524M76k404n531q593j1756j4952j7673j9585k0772k1283k0870
$$ 1663671 1667476 1670000 1670476 1668072 1662541 1653948 1642192 1627240 1609567 1589982 1569210 1547927 1527057
52087A527057j9449j7375j5089j2791j0597q655o889m968k710l52J770L560N066
$$ 1527057 1507608 1490233 1475144 1462353 1451756 1443101 1436212 1431244 1428534 1428182 1429952 1433512 1438578
52074A438578O373P740R563J1859J4004J5243J5510J5475J5787J6393J6673J6183
$$ 1438578 1444951 1452691 1462254 1474113 1488117 1503360 1518870 1534345 1550132 1566525 1583198 1599381
52062A599381J5132J4074J3228J2402J1529J0861J0332R145O534K768j126m491
$$ 1599381 1614513 1628587 1641815 1654217 1665746 1676607 1686939 1696084 1702618 1705386 1704260 1699769
$$ [...]
##END NTUPLES=NMR SPECTRUM
##END=
