##TITLE=AC1449_MFUAH13258_8011668_1sLsY1adv6
##JCAMPDX= 6.0         $$ Bruker NMR JCAMP-DX V2.0
##DATA TYPE= NMR SPECTRUM
##DATA CLASS= NTUPLES
##ORIGIN= BRUKER
##OWNER= Administrator
$$ 1.72 TOPSPIN		Version 2.1
$$ 2013-07-05 16:58:53.297 -0700  Administrator@X
$$ Compression mode = diff/dup
##.OBSERVE FREQUENCY= 400.02188249412
##.OBSERVE NUCLEUS= ^1H
##.ACQUISITION MODE= SIMULTANEOUS (DQD)
##.ACQUISITION SCHEME= undefined
##.AVERAGES= 64
##.DIGITISER RES= 22
##SPECTROMETER/DATA SYSTEM= spect
##.PULSE SEQUENCE= noesygpps1d.comp
##.SOLVENT NAME= COFFEE_meoh
##.SHIFT REFERENCE= INTERNAL, COFFEE_meoh, 1, 14.96081
##AUDIT TRAIL= $$ (NUMBER, WHEN, WHO, WHERE, PROCESS, VERSION, WHAT)
$$ ##TITLE= Audit trail, TOPSPIN		Version 2.1
$$ ##JCAMPDX= 5.01
$$ ##ORIGIN= Bruker BioSpin GmbH
$$ ##OWNER= Administrator
$$ $$ E:\/data/COFFEE/nmr/AC1449_MFUAH13258_8011668_1sLsY1adv6/12/pdata/1/auditp.txt
$$ ##AUDIT TRAIL=  $$ (NUMBER, WHEN, WHO, WHERE, PROCESS, VERSION, WHAT)
(   1,<2013-07-05 16:58:47.890 -0700>,<Administrator>,<X>,<go>,<TOPSPIN 2.1>,
      <created by zg
	started at 2013-07-05 16:47:18.359 -0700,
	POWCHK enabled, PULCHK disabled,
       configuration hash MD5:
       C8 4E 4E 5D D3 5C D8 9E 9F 52 82 E0 59 8A DE 15
       data hash MD5: 64K
       BA D3 58 58 0A CC 76 99 21 64 E6 49 CA C5 9E 4D>)
(   2,<2013-07-05 16:58:51.078 -0700>,<Administrator>,<X>,<proc1d>,<TOPSPIN 2.1>,
      <Start of raw data processing
       efp LB = 0.3 FT_mod = 6 PKNL = 1 PHC0 = 0 PHC1 = 0 SI = 128K 
       data hash MD5: 128K
       A1 CE 07 39 A0 24 2F BF 7B B5 EE BF 7B 0A 0B 44>)
(   3,<2013-07-05 16:58:52.125 -0700>,<Administrator>,<X>,<proc1d>,<TOPSPIN 2.1>,
      <pk PHC0 = -83.2489 PHC1 = 0 
       data hash MD5: 128K
       A2 72 67 F2 EE CA 1C 26 A1 11 63 6B F5 DF CC 32>)
(   4,<2013-07-05 16:58:52.625 -0700>,<Administrator>,<X>,<proc1d>,<TOPSPIN 2.1>,
      <abs ABSG = 1 
       data hash MD5: 128K
       61 5E BB 1A 65 63 BA B8 D9 93 DC D8 37 04 7A F5>)
(   5,<2013-07-05 16:58:52.734 -0700>,<Administrator>,<X>,<proc1d>,<TOPSPIN 2.1>,
      <abs ABSG = 2 
       data hash MD5: 128K
       21 4E 5E 2E 00 C1 E4 4A A9 E8 FA A3 43 03 4C 4B>)
(   6,<2013-07-05 16:58:52.828 -0700>,<Administrator>,<X>,<proc1d>,<TOPSPIN 2.1>,
      <abs ABSG = 3 
       data hash MD5: 128K
       E6 7C 7C C3 3A 8D 08 B9 5D 28 19 B7 8F C2 D1 4F>)
(   7,<2013-07-05 16:58:52.906 -0700>,<Administrator>,<X>,<proc1d>,<TOPSPIN 2.1>,
      <abs ABSG = 4 
       data hash MD5: 128K
       B9 98 D0 2F D1 62 42 38 0E D6 54 17 7B F1 0C 50>)
(   8,<2013-07-05 16:58:53.031 -0700>,<Administrator>,<X>,<proc1d>,<TOPSPIN 2.1>,
      <abs ABSG = 5 
       data hash MD5: 128K
       D4 62 63 DF 2A C7 20 B6 A7 D9 67 EC 84 08 6B 37>)
$$ ##END=
$$ 
$$ $$ hash MD5
$$ $$ B4 4F D5 E3 BB E9 61 31 5E AF 91 27 80 80 31 F9
##$RELAX= 
##$RELAX= 
##$RELAX= 
##$RELAX= 
##$RELAX= 
##$RELAX= 
##$RELAX= 
##$RELAX= 
$$ Bruker specific parameters
$$ --------------------------
##$DU= <E:\>
##$EXPNO= 12
$$ [...]
150 150 150 150 150 150 150 150
##$TP07= 0
##$TPNAME0= <>
##$TPNAME1= <>
##$TPNAME2= <>
##$TPNAME3= <>
##$TPNAME4= <>
##$TPNAME5= <>
##$TPNAME6= <>
##$TPNAME7= <>
##$TPOAL= (0..7)
0.5 0.5 0.5 0.5 0.5 0.5 0.5 0.5
##$TPOFFS= (0..7)
0 0 0 0 0 0 0 0
##$TUNHIN= 0
##$TUNHOUT= 0
##$TUNXOUT= 0
##$USERA1= <user>
##$USERA2= <user>
##$USERA3= <user>
##$USERA4= <user>
##$USERA5= <user>
##$V9= 5
##$VALIST= <valist>
##$VCLIST= <CCCCCCCCCCCCCCC>
##$VD= 0
##$VDLIST= <DDDDDDDDDDDDDDD>
##$VPLIST= <PPPPPPPPPPPPPPP>
##$VTLIST= <TTTTTTTTTTTTTTT>
##$WBST= 1024
##$WBSW= 4
##$XGAIN= (0..3)
0 0 0 0
##$XL= 0
##$YL= 0
##$YMAX_a= 6189007
##$YMIN_a= -12095479
##$ZGOPTNS= <>
##$ZL1= 120
##$ZL2= 120
##$ZL3= 120
##$ZL4= 120
##$ABSF1= 14.96081
##$ABSF2= -5.597372
##$ABSG= 5
##$ABSL= 3
##$ALPHA= 0
##$AQORDER= 0
##$ASSFAC= 0
##$ASSFACI= 0
##$ASSFACX= 0
##$ASSWID= 0
##$AUNMP= <proc_prof1d_extract.lims>
##$AXLEFT= 0
##$AXNAME= <>
##$AXNUC= <1H>
##$AXRIGHT= 0
##$AXTYPE= 0
##$AXUNIT= <>
##$AZFE= 0.1
##$AZFW= 0.1
##$BCFW= 0
##$BC_mod= 0
##$BYTORDP= 0
##$COROFFS= 0
##$CY= 15
##$DATMOD= 1
##$DC= 0
##$DFILT= <>
##$DTYPP= 0
##$F1P= 0
##$F2P= 0
##$FCOR= 0.5
##$FTSIZE= 131072
##$FT_mod= 6
##$GAMMA= 0
##$GB= 0
##$INTBC= 1
##$INTSCL= 1
##$ISEN= 128
##$LB= 0.3
##$LEV0= 0
##$LPBIN= 0
##$MAXI= 10000
##$MC2= 0
##$MEAN= 0
##$ME_mod= 0
##$MI= 0
##$NCOEF= 0
##$NC_proc= -2
##$NLEV= 6
##$NOISF1= 0
##$NOISF2= 0
##$NSP= 0
##$NTH_PI= 0
##$NZP= 0
##$OFFSET= 14.96081
##$PC= 1
##$PHC0= -83.2489
##$PHC1= 0
##$PH_mod= 1
##$PKNL= yes
##$PPARMOD= 0
##$PPDIAG= 0
##$PPIPTYP= 0
##$PPMPNUM= 2147483647
##$PPRESOL= 1
##$PSCAL= 4
##$PSIGN= 0
##$PYNMP= <proc.py>
##$REVERSE= no
##$SF= 400.02000971124
##$SI= 131072
##$SIGF1= 0
##$SIGF2= 0
##$SINO= 400
##$SIOLD= 131072
##$SPECTYP= <>
##$SREGLST= <1H.CDCl3>
##$SSB= 0
##$STSI= 131072
##$STSR= 0
##$SW_p= 8223.68421052631
##$SYMM= 0
##$S_DEV= 0
##$TDeff= 65536
##$TDoff= 0
##$TI= <>
##$TILT= no
##$TM1= 0
##$TM2= 0
##$TOPLEV= 0
##$USERP1= <user>
##$USERP2= <user>
##$USERP3= <user>
##$USERP4= <user>
##$USERP5= <user>
##$WDW= 1
##$XDIM= 131072
##$YMAX_p= 465917328
##$YMIN_p= -11085
##$CURPLOT= <Network HP LaserJet P1505>
##$CURPRIN= <$Network HP LaserJet P1505>
##$DFORMAT= <normdp>
##$LAYOUT= <+/1D_H.xwp>
##$LFORMAT= <normlp>
##$PFORMAT= <normpl>
##$SURQMSG= 1
$$ End of Bruker specific parameters
$$ ---------------------------------
##NTUPLES= NMR SPECTRUM
##VAR_NAME=  FREQUENCY,     SPECTRUM/REAL,   SPECTRUM/IMAG
##SYMBOL=    X,             R,               I
##VAR_TYPE=  INDEPENDENT,   DEPENDENT,       DEPENDENT
##VAR_FORM=  AFFN,          ASDF,            ASDF
##VAR_DIM=   131072,        131072,          131072
##UNITS=     HZ,            ARBITRARY UNITS, ARBITRARY UNITS
##FACTOR=    0.0627417313425164, 1,          1
##FIRST=     8223.62146879497, 2067,         -59372
##LAST=      0,             4474,            -58470
##MIN=       0,             -11085,          0
##MAX=       8223.62146879497, 465917328,    0
$$ Real data points
##PAGE= N=1
##DATA TABLE= (X++(R..R)), XYDATA
$$ [...]
63913B373364j88565j76761j63327j49007j34398j19817j05519r1928p9509o8477
$$ 2373364 2184799 2008038 1844711 1695704 1561306 1441489 1335970 1244042 1164533 1096056
63903A096056n8820n0653m4250l9582l6068l3079l0545k8653k7113k5210k2758
$$ 1096056 1037236 986583 942333 902751 866683 833604 803059 774406 747293 722083 699325
63892F99325k0451j8960j8090j7178j5976j4634j3088j1192r347q199p578o389
$$ 699325 678874 659914 641824 624646 608670 594036 580948 569756 560409 552210 544632 538243
63880E38243l957q67J891M165O402Q611J0341J1549J2896J4988J7764K0662K3027
$$ 538243 534286 533419 535310 539475 545877 554488 564829 576378 589274 604262 622026 642688 665715
63867F65715K4410K4931K5329K6177K7029K6898K5662K4291K3412K2342K0043
$$ 665715 690125 715056 740385 766562 793591 820489 846151 870442 893854 916196 936239
63856I36239J6533J2743R294O040K674q39m437q084j1677j5121j8400k1358k3593
$$ 936239 952772 965515 974809 980849 983523 982684 978247 970163 958486 943365 924965 903607 880014
63843H80014k5050k6415k8367l0515l1821l2035l1946l2000l1509k9715k7045
$$ 880014 854964 828549 800182 769667 737846 705811 673865 641865 610356 580641 553596
63832E53596k4647k3090k2076k1169k0169j8893j7247j5551j4276j3326j2070
$$ 553596 528949 505859 483783 462614 442445 423552 406305 390754 376478 363152 351082
63821C51082j0255q511p671p802q222q274p844p124o196n066l954l259l045k801
$$ 351082 340827 332316 324645 316843 308621 300347 292503 285379 279183 274117 270163 266904 263859 261058
63807B61058k053j137r97j967l220l665l214k650k497k483k202j794j709k028
$$ 261058 259005 257868 256871 254904 251684 248019 244805 242155 239658 237175 234973 233179 231470 229442
63793B29442k344k237j656q93l09j35l94q99j330j409j191j070j347j742j655
$$ 229442 227098 224861 223205 222312 222003 221868 221474 220575 219245 217836 216645 215575 214228 212486 210831
63778B10831r41j59K01L38P05J200J227M64p71j870k323j956j112m98m46m68o1
$$ 210831 209890 209731 209932 210270 210975 212175 213402 213866 213095 211225 208902 206946 205834 205336 204890 204422 204361
63761B04361L28j44j272j802j158k41o3k42K78J574K589K557J783J044Q11J149
$$ 204361 204689 204545 203273 201471 200313 200072 200009 199767 200045 201619 204208 206765 208548 209592 210403 211552
63745B11552J888K640K996K894K603K293J815J101N24N81J223J716J415N81J90
$$ 211552 213440 216080 219076 221970 224573 226866 228681 229782 230306 230887 232110 233826 235241 235822 236012
63730B36012P31J555J794J601J861K825L820M451N162O170O716O097M831L961
$$ 236012 236743 238298 240092 241693 243554 246379 250199 254650 259812 265982 272698 278795 283626 287587
63716B87587L577K887J499j58j616k762l496l701l580l455l241k697k069j819
$$ 287587 291164 294051 295550 295392 293776 291014 287518 283817 280237 276782 273541 270844 268775 266956
63702B66956j772j313m12L36P36J241K031K664K925L241L922M772N661O675P338
$$ 266956 265184 263871 263459 263795 264531 265772 267803 270467 273392 276633 280555 285327 290988 297663 305001
63687C05001O636M477K324J578J909J910R46m30j484j925j740j165o97o16n83
$$ 305001 311637 316114 318438 320016 321925 323835 324781 324351 322867 320942 319202 318037 317340 316724 316141
63672C16141j37O11J189J370J144M84m09r60r39r24j466k219k559k678l195l983
$$ 316141 316004 316615 317804 319174 320318 320802 320393 319433 318494 317570 316104 313885 311326 308648 305453 301470
63656C01470m338m142l932l821l327k427j835j966k338k333j880j179l48M10Q54
$$ 301470 297132 292990 289058 285237 281910 279483 277648 275682 273344 271011 269131 267952 267604 268014 268868
63641B68868J199J925K922L390K928K134J842K244L111M252N406O185O610P248
$$ 268868 270067 271992 274914 278304 281232 283366 285208 287452 290563 294815 300221 306406 313016 320264
63627C20264Q383R459R816R595R523J0019J0986J2242J3726J5424J7364J9570
$$ 320264 328647 338106 347922 357517 367040 377059 388045 400287 414013 429437 446801 466371
63615D66371K1855K3933K5862K8004L0335L2268L3385L3851L3662L2063K8337
$$ 466371 488226 512159 538021 566025 596360 628628 662013 695864 729526 761589 789926
63604G89926K2844J6616J0195L585k793p850j0778j1740j1542j0950j0466j0342
$$ 789926 812770 829386 839581 843166 840373 832523 821745 810005 798463 787513 777047 766705
63592G66705j0634j1413j2968j5552j8825k1795k3452k3470k2359k1022k0079
$$ 766705 756071 744658 731690 716138 697313 675518 652066 628596 606237 585215 565136
63581E65136j9454j8603j7134j5076j2588r806p057m823l194j632L14K400M146
$$ 565136 545682 527079 509945 494869 482281 472475 465418 460595 457401 455769 456083 458483 462629
63568D62629N534O856Q101R121J0159J1537J2847J3175J2333J1257J0963J1578
$$ 462629 468163 475019 483120 492241 502400 513937 526784 539959 552292 563549 574512 586090
63556E86090J2713J4280J6547J9618K3349K7672L2637L8045M3198M6859M7467
$$ 586090 598803 613083 629630 649248 672597 700269 732906 770951 814149 861008 908475
63545I08475M3611L4898K2579R218k599j1434j7124k0089k0754j9629j7480j5043
$$ 908475 952086 986984 1009563 1018781 1016182 1004748 987624 967535 946781 927152 909672 894629
63533H94629j2635j0421r017r391j1919j5873k0021k3597k6467k8691l0231l1040
$$ 894629 881994 871573 862556 853165 841246 825373 805352 781755 755288 726597 696366 665326
63521F65326l1140l0583k9440k7787k5696k3401k1351j9804j8329j6262j3710
$$ 665326 634186 603603 574163 546376 520680 497279 475928 456124 437795 421533 407823
63510D07823j1581j0378r592q606p486o408n038l310k172k458l424l542k590j798
$$ 407823 396242 385864 376272 367666 360180 353772 348734 345424 343252 340794 337370 333828 331238 329440
63496C29440j885k153j882j445j506j940k159j872j029L95K011K997L076L035
$$ 329440 327555 325402 323520 322075 320569 318629 316470 314598 313569 313964 315975 318972 322048 325083
63482C25083L713M872N593N448M773M019L378K846K229J310K12o53j274k171l489
$$ 325083 328796 333668 339261 344709 349482 353501 356879 359725 361954 363264 363476 362823 361549 359378 355889
63467C55889m504m565m076l883m069m033l539k966k608k386k184j850r82O75K623
$$ 355889 351385 346820 342744 338861 334792 330759 327220 324254 321646 319260 317076 315226 314244 314919 317542
63452C17542L994M603N030N652O240O670P390Q830J0728J2478J3884J5383J7635
$$ 317542 321536 326139 331169 336821 343061 349731 357121 365951 376679 389157 403041 418424 436059
63439D36059K1083K5716L1013L6013L9382L9616L5770K8386J9490J1225M642M
$$ 436059 457142 482858 513871 549884 589266 628882 664652 693038 712528 723753 728395 728399
63427G28399k241j612J467N726J0243J5075K0516K6311L1748L6081L8731L9419
$$ 728399 726158 724546 726013 731739 741982 757057 777573 803884 835632 871713 910444 949863
63415I49863L8179L4935K9226K0950J1314K306m882j0254j3892j5464j5199j4365
$$ 949863 988042 1022977 1052203 1073153 1084467 1086773 1081891 1071637 1057745 1042281 1027082 1012717
63403A012717j4057j4215j4500j5496j8095k2089k6226k9561l1986l3600l4254
$$ 1012717 998660 984445 969945 954449 936354 914265 888039 858478 826492 792892 758638
63392G58638l3829l2408l0144k7307k4468k2218k0666j9419j7937j5777j2805
$$ 758638 724809 692401 662257 634950 610482 588264 567598 548179 530242 514465 501660
63381E01660r521o789m831k898m26J926L228L818M977P133R443J1241J2907J4885
$$ 501660 492139 485350 480519 477621 477195 479121 482349 486167 491144 498277 507720 518961 531868 546753
63367E46753J6807J8232J9571K1611K4449K7524L0461L3286L5914L8038L9462
$$ 546753 563560 581792 601363 622974 647423 674947 705408 738694 774608 812646 852108
63356H52108M0173L9918L8029L3860K7327J9067J0121J534n797j1146j4149j5103
$$ 852108 892281 932199 970228 1004088 1031415 1050482 1060603 1062137 1056340 1045194 1031045 1015942
63344A015942j4891j4340j3799j3527j4113j6080j9200k2685k5987k8872l0912
$$ 1015942 1001051 986711 972912 959385 945272 929192 909992 887307 861320 832448 801536
63333H01536l1594l1052l0063k9028k7425k4580k0526j5847j1045o280j537K907
$$ 801536 769942 738890 708827 679799 652374 627794 607268 591421 580376 574096 572559 575466
63321E75466N866N321J42q087j5810k0484k2192k2202k1144j9331j7593j6466
$$ 575466 581332 586653 586795 578708 562898 542414 520222 498020 476876 457545 439952 423486
63309D23486j5189j2783r783p636o694o040n263m924n165n097m190l110k602k385
$$ 423486 408297 395514 385731 378095 371401 365361 360098 355174 350009 344912 340722 337612 335010 332625
63295C32625j899j432j666k546l330l574l443l191k790k107j254o88q94j740k347
$$ 332625 330726 329294 327628 325082 321752 318178 314735 311544 308754 306647 305393 304705 303811 302071 299724
63280B99724k023j226r48j187r51O1P81L97l21j67O81J064P00M61R00J519J691
$$ 299724 297701 296475 295527 294340 293389 293450 294231 294628 294307 294140 294821 295885 296585 297046 297946 299465 301156
63263C01156J481J245J073R94J202J729K261K538K629K629K430K056J916K331
$$ 301156 302637 303882 304955 305949 307151 308880 311141 313679 316308 318937 321367 323423 325339 327670
63249C27670L062L642M040M674N740O934P882Q622R441J0439J1479J2525J3703
$$ 327670 330732 334374 338414 343088 348828 355762 363644 372266 381707 392146 403625 416150 429853
63236D29853J4981J6037J6704J7319J8291J9423K0093K0099J9954K0126K0430
$$ 429853 444834 460871 477575 494894 513185 532608 552701 572800 592754 612880 633310
63225F33310K0362J9797J9060J8544J8542J9199K0370K1624K2574K3091K3068
$$ 633310 653672 673469 692529 711073 729615 748814 769184 790808 813382 836473 859541
63214H59541K2274K0658J8448J5644J1794O658Q25m850j0132j5204j9785k3163
$$ 859541 881815 902473 920921 936565 948359 955017 955842 950992 940860 925656 905871 882708
63202H82708k5116k6165k6820k6998k6317k4470k1318j7104j2697r045o294l812
$$ 882708 857592 831427 804607 777609 751292 726822 705504 688400 675703 666658 660364 656552
63190F56552j203J331L788O733J0395J3980J6528J8097J9514K1211K2937K4450
$$ 656552 655349 656680 660468 667201 677596 691576 708104 726201 745715 766926 789863 814313
63178H14313K5760K6657K6684K5841K4854K4429K4516K4554K4205K3507K2417
$$ 814313 840073 866730 893414 919255 944109 968538 993054 1017608 1041813 1065320 1087737
63167A087737K0551J7501J3266Q222K696l312r945j7037k3947k9866l4357l7574
$$ 1087737 1108288 1125789 1139055 1147277 1149973 1146661 1136716 1119679 1095732 1065866 1031509 993935
63155I93935l9987m1843m2831m2381m0362l7416l4438l1782k9127k6174k3152
$$ 993935 953948 912105 869274 826893 786531 749115 714677 682895 653768 627594 604442
63144F04442k0565j8631j7102j5573j3814j1961j0428r453q701p506n744m127
$$ 604442 583877 565246 548144 532571 518757 506796 496368 486915 478214 470708 464964 460837
63132D60837l428l501l471k763j606n16L30J068J808K585L378M014M243M126M127
$$ 460837 457409 453908 450437 447674 446068 445552 445882 446950 448758 451343 454721 458735 462978 467104 471231
63117D71231M493M713M077K797K004K389L282L539L015K558K641K689K057J046
$$ 471231 475724 480437 484514 487311 489315 491704 494986 498525 501540 504098 506739 509428 511485 512531
63103E12531M86N85P25L40m46j125j398j360j240j166j064p95m52m28r73j713
$$ 512531 513017 513602 514327 514667 514221 513096 511698 510338 509098 507932 506868 506073 505621 505193 504220 502507
63087E02507j891j162N7J097J721K141K561K945L216L420L636L832L895L869M038
$$ 502507 500616 499454 499511 500608 502329 504470 507031 509976 513192 516612 520248 524080 527975 531844 535882
63072E35882M743O050P632Q956R637R692R536R726J0526J1772J3249J5068J7419
$$ 535882 540625 546675 554307 563263 572900 582592 592128 601854 612380 624152 637401 652469 669888
63059F69888K0012K2194K3809K5562K8245L1810L5550L8881M1612M3683M5147
$$ 669888 689900 712094 735903 761465 789710 821520 857070 895951 937563 981246 1026393
63048A026393M6366M7744M9232N0346N0775N0624N0118M9398M8661M8165M8029
$$ 1026393 1072759 1120503 1169735 1220081 1270856 1321480 1371598 1420996 1469657 1517822 1565851
63037A565851M8226M8765M9563N0207N0158M9187M7261M4003L8736L1174K1756
$$ 1565851 1614077 1662842 1712405 1762612 1812770 1861957 1909218 1953221 1991957 2023131 2044887
63026B044887J1161j37j1768k3248l4079m3786n1818n7787o1754o3948o4188o2149
$$ 2044887 2056048 2055911 2044143 2020895 1986816 1943030 1891212 1833425 1771671 1707723 1643535 1581386
63014A581386n8237n3485m8309m2081l4394k6110j8450j1499m355L373J0996J7599
$$ 1581386 1523149 1469664 1421355 1379274 1344880 1318770 1300320 1288821 1284466 1287839 1298835 1316434
63002A316434K2952K7457L1628L5698L9439M2324M4163M5463M6841M8166M8783
$$ 1316434 1339386 1366843 1398471 1434169 1473608 1515932 1560095 1605558 1652399 1700565 1749348
62991A749348M8584M8345M8739M9322M8846M6485M2487L7618L2111K5328J6465
$$ 1749348 1797932 1846277 1895016 1944338 1993184 2039669 2082156 2119774 2151885 2177213 2193678
62980B193678N461o903j9656l2112m3867n4645o4247p2284p7990q0749q0952p9808
$$ 2193678 2199139 2192236 2172580 2140468 2096601 2041956 1977709 1905425 1827435 1746686 1665734 1585926
62968A585926p8021p5181p0822o5577o0606n6216n1786m6968m2299l8494l5669
$$ 1585926 1507905 1432724 1361902 1296325 1235719 1179503 1127717 1080749 1038450 999956 964287
62957I64287l3464l1552k9845k8396k7156k5789k3892k1610j9746j8921j8828
$$ 964287 930823 899271 869426 841030 813874 788085 764193 742583 722837 703916 685088
62946F85088j8664j8067j7202j6161j4898j3646j2754j2044j1016r698q670q097
$$ 685088 666424 648357 631155 614994 600096 586450 573696 561652 550636 540938 532268 524171
62934E24171p436o336n155m242l377k396j813k147k985l425l158k564j885j039
$$ 524171 516735 510399 505244 501002 497625 495229 493416 491269 488284 484859 481701 479137 477252 476213
62920D76213j99J13k47p74j036j274j890k662k907k397j713j605k183k899l201
$$ 476213 476014 476127 475880 475106 474070 472796 470906 468244 465337 462940 461227 459622 457439 454540 451339
62905D51339l063k870k901k996k731j878o66M45J122J269Q53o4j128j759j742
$$ 451339 448276 445406 442505 439509 436778 434900 434234 434679 435801 437070 437923 437859 436731 434972 433230
62890D33230j504j520j539r40K25J059R40L28R3M84J097J604J927J963J589J000
$$ 433230 431726 430206 428667 427727 427952 429011 429951 430279 430372 430856 431953 433557 435484 437447 439036 440036
62874D40036N21J54l92j160j876k334k531k433k006j485j255j350j485j564j757
$$ 440036 440557 440711 440319 439159 437283 434949 432418 429985 427979 426494 425239 423889 422404 420840 419083
62859D19083j939j584n02O50J041O76L95R11K049K993L135K637K080J700J135
$$ 419083 417144 415560 415058 415708 416749 417425 417820 418731 420780 423773 426908 429545 431625 433325 434460
62844D34460R2j070j699j663j452j456j547j423j035o22m96q02j239j103l6J329
$$ 434460 434552 433482 431783 430120 428668 427212 425665 424242 423207 422585 422089 421287 420048 418945 418909 420238
62828D20238J900J307J96o71j068j003m29M36J075J327J717K641L673M149M174
$$ 420238 422138 423445 423641 422970 421902 420899 420470 420906 421981 423308 425025 427666 431339 435488 439662
62813D39662M425N104N644N576N130M840M846M895M829M856N259O045O951P729
$$ 439662 444087 449191 454835 460411 465541 470381 475227 480122 484951 489807 495066 501111 508062 515791
62799E15791Q253Q361P970P478P739R192J1224J2902J4210J6042J8953K2553K6278
$$ 515791 524044 532405 540375 547853 555592 564784 576008 588910 603120 619162 638115 660668 686946
62786F86946L0145L4408L9006M3738M8568N3415N8036O2534O7493P3098P8423
$$ 686946 717091 751499 790505 834243 882811 936226 994262 1056796 1124289 1197387 1275810
62775A275810Q2162Q3849Q3788Q1994P7919P1242O2370N1912M0146K7136J3124
$$ 1275810 1357972 1441821 1525609 1607603 1685522 1756764 1819134 1871046 1911192 1938328 1951452
62764A951452j428j5894k9506m1482n1377n9241o5375o9977p3044p4513p4467
$$ 1951452 1950024 1934130 1904624 1863142 1811765 1752524 1687149 1617172 1544128 1469615 1395148
62753A395148p3198p1061o8297o5058o1555n7970n4236n0145m5747m1344l7108
$$ 1395148 1321950 1250889 1182592 1117534 1055979 998009 943773 893628 847881 806537 769429
62742G69429l2963k8997k5567k2834k0499j8307j6420j4952j3543j1793r858q172
$$ 769429 736466 707469 681902 659068 638569 620262 603842 588890 575347 563554 553696 545524
62730E45524o688m972l001j420q07r28q59J57J976L659M507M874N656P097Q652
$$ 545524 538836 533864 530863 529443 528636 527708 526849 527006 528982 532641 537148 542022 547678 554775 563427
62715E63427J0078J1865J4209J6409J7972J9590K2157K5426K8652L2141L6829
$$ 563427 573505 585370 599579 615988 633960 653550 675707 701133 729785 761926 798755
62704G98755M2512M7806N2106N6344O1405O6959P2431P8064Q4128Q9866R4199
$$ 798755 841267 889073 941179 997523 1058928 1125887 1198318 1276382 1360510 1450376 1544575
62693A544575R6922R8212R7344R3019Q4953P4156O1391M6332K8691R609q871k5608
$$ 1544575 1641497 1739709 1837053 1930072 2015025 2089181 2150572 2196904 2225595 2235204 2226333 2200725
62681B200725m1012n5760o9329q0233q7536r1663r3620r3902r2564q9942q6635
$$ 2200725 2159713 2103953 2034624 1954391 1866855 1775192 1681572 1587670 1495106 1405164 1318529
62670A318529q2741p7805p1705o5145n8992n3496m8435m3673l9267l5229l1556
$$ 1318529 1235788 1157983 1086278 1021133 962141 908645 860210 816537 777270 742041 710485
62659G10485k8270k5263k2310j9495j7367j6292j5880j5338j4295j2988j1844
$$ 710485 682215 656952 634642 615147 597780 581488 565608 550270 535975 522987 511143
62648E11143j1111j0828j0697j0111q650o624m870l920l575l259k647j861j245
$$ 511143 500032 489204 478507 468396 459746 453122 448252 444332 440757 437498 434851 432990 431745
62635D31745j006j033j075j107j345j897k511k876k947k836k519j928j205o04
$$ 431745 430739 429706 428631 427524 426179 424282 421771 418895 415948 413112 410593 408665 407460 406856
62621D06856k41r4q6L4O92J970L260L806L608L351L484L869M343N079O117P057
$$ 406856 406615 406521 406435 406469 407161 409131 412391 416197 419805 423156 426640 430509 434852 439931 446048 453105
62605D53105P627Q182R225J0743J2451J4470J7179K0523K3941K7056K9952L2713
$$ 453105 460732 468914 478139 488882 501333 515803 532982 553505 577446 604502 634454 667167
62593F67167L5169L7271L9182M0684M0979L9436L6325L2417K8053K3014J7066
$$ 667167 702336 739607 778789 819473 860452 899888 936213 968630 996683 1019697 1036763
62582A036763J0205K488n792j3757k0320k5106k8660l1569l3805l5066l5361l4913
$$ 1036763 1046968 1049456 1043664 1029907 1009587 984481 955821 924252 890447 855381 820020 785107
62570G85107l3832l2251l0546k9013k7431k5366k2820k0279j8079j6101j4092
$$ 785107 751275 719024 688478 659465 632034 606668 583848 563569 545490 529389 515297
62559E15297j2048j0192q693p577o800o398o449o785o795n867m131k450j482j043
$$ 515297 503249 493057 484364 476787 469987 463589 457140 450355 443560 437693 433562 431112 429630 428587
62545D28587o33k00L0J54M54Q21Q71N21K4m66q06n15P76K534L756M332N125O567
$$ 428587 427954 427754 427784 427938 428392 429213 430084 430605 430629 430163 429357 428842 429618 432152 435908 440240 445365 451932
62527D51932P983Q834R662J1162J3028J4665J6542J9632K3760K7576L0397L3084
$$ 451932 459915 468749 478411 489573 502601 517266 533808 553440 577200 604776 635173 668257
62515F68257L6686M1052M5287M8976N2260N5038N6828N7327N6530N4256N0054
$$ 668257 704943 745995 791282 840258 892518 947556 1004384 1061711 1118241 1172497 1222551
62504A222551M3748L5773K6747J7000O755l378j2478j9852k5320k8940l0720l0739
$$ 1222551 1266299 1302072 1328819 1345819 1352574 1349196 1336718 1316866 1291546 1262606 1231886 1201147
62492A201147k9293k6693k3051j8461j3286q007k853K243P343J2403J7349K1820
$$ 1201147 1171854 1145161 1122110 1103649 1090363 1082356 1079503 1081746 1089089 1101492 1118841 1140661
62480A140661K4844K5222K2558J7677J1880N952J03n613j1250j7213k4002l1501
$$ 1140661 1165505 1190727 1213285 1230962 1242842 1248794 1248897 1243284 1232034 1214821 1190819 1159318
62468A159318l8734m4464m8026m9666n0165n0098m9308m7239m3863m0003l6464
$$ 1159318 1120584 1076120 1028094 978428 928263 878165 828857 781618 737755 697752 661288
62457F61288l3100k9174k4618k0348j7191j4930j2791j0525q551p141n997m675
$$ 661288 628188 599014 574396 554048 536857 521927 509136 498611 490060 482919 476922 472247
62445D72247l129j564o2J344K436L005L328L975M960N475M815L315J856O29r78
$$ 472247 469118 467554 467492 468836 471272 474277 477605 481580 486540 492015 496830 500145 502001 502630 501652
62430E01652l184n192o184o393o623p064p258p070o899o859o467n493m464l940
$$ 501652 498468 493276 487092 480699 474076 467012 459754 452684 445785 438926 432459 426966 422502 418562
62416D18562l726l449l410m129n217n537m689l536k996k911k657k235k042j934
$$ 418562 414836 411387 407977 403848 398631 393094 388405 384869 381873 378962 376305 374070 372028 370094
62402C70094j375m17K68N15R66J940K758K663J921J343J139R50P32Q74J458K048
$$ 370094 368719 368302 368570 369085 370051 371991 374749 377412 379333 380676 381815 382765 383497 384371 385829 387877
62386C87877K336K485K748L152L688M349N015N634O510P842R033R143Q212P523
$$ 387877 390213 392698 395446 398598 402286 406635 411650 417284 423794 431636 440669 449812 458024 465547
62372D65547Q165R917J1845J3430J4612J5379J5994J7279J9924K3601K7375L0894
$$ 465547 473712 483629 495474 508904 523516 538895 554889 572168 592092 615693 643068 673962
62360F73962L4692L9315M4683N0279N5441N9437O1681O2035O0604N7251N1632
$$ 673962 708654 747969 792652 842931 898372 957809 1019490 1081525 1142129 1199380 1251012
62349A251012M3749L4146K3582J2868L007n088j1326j6608k1976k7662l3049l7378
$$ 1251012 1294761 1328907 1352489 1365357 1368364 1363276 1351950 1335342 1313366 1285704 1252655 1215277
62337A215277m0419m2495m3973m4707m4143m2032l8887l5472l2027k8400k4782
$$ 1215277 1174858 1132363 1088390 1043683 999540 957508 918621 883149 851122 822722 797940
62326G97940k1857k0114j9387j9136j8914j8449j7718j7050j6903j7282j7607
$$ 797940 776083 755969 736582 717446 698532 680083 662365 645315 628412 611130 593523
62315E93523j7269j6130j4472j2752j1491j0967j0840j0380r285p992o925n903
$$ 593523 576254 560124 545652 532900 521409 510442 499602 489222 479937 471945 465020 459117
62303D59117m586l193k227j716j257p14l49k10P1O28J007P84L50N35J546K622
$$ 459117 454531 451338 449111 447395 446138 445424 445075 444865 444936 445564 446571 447355 447705 448240 449786 452408
62287D52408K872K250J534J485K205L200L870L942L642L527L995M820N329N251
$$ 452408 455280 457530 459064 460549 462754 465954 469824 473766 477408 480935 484930 489750 495079 500330
62273E00330N173N893P356Q662R245R649J0862J3134J5845J8494K1339K4894K9129
$$ 500330 505503 511396 518752 527414 536659 546308 557170 570304 586149 604643 625982 650876 680005
62260F80005L3558L8043M3060M8909N4931N9931O3240O4972O5159O3142N8198
$$ 680005 713563 751606 794666 843575 898506 958437 1021677 1086649 1151808 1214950 1273148
62249A273148N0430M0700K9912J8881Q629N1o938j3393k0185k7228l3996m0222
$$ 1273148 1323578 1364278 1394190 1413071 1421700 1421751 1414813 1401420 1381235 1354007 1320011 1279789
62237A279789m5670m9720n1813n2128n1268m9349m6055m1514l6583l2027k7937
$$ 1279789 1234119 1184399 1132586 1080458 1029190 979841 933786 892272 855689 823662 795725
62226G95725k4111k0557j7378j4487j1913j0057r237r112q961q489q002p851q035
$$ 795725 771614 751057 733679 719192 707279 697222 687985 678873 669912 661423 653421 645570 637535
62213F37535q425r024r814j0581j1069j1184j0953j0427r695q908q175p511o844
$$ 637535 629110 620086 610272 599691 588622 577438 566485 556058 546363 537455 529280 521769 514925
62200E14925n932m356j998M86K057K443K489L065M040M793N412O574Q277R502
$$ 514925 508993 504637 502639 503125 505182 507625 510114 513179 517219 522012 527424 533998 542275 551777
62186E51777R483Q771Q540R210J0169J0633J0306R334Q044O880O276O427P201
$$ 551777 561260 570031 578571 587781 597950 608583 618889 628223 636267 643147 649423 655850 663051
62173F63051Q353R822J1866J4863J8878K3468K8122L2828L7854M2944M7056M9172
$$ 663051 671404 681226 693092 707955 726833 750301 778423 811251 849105 892049 939105 988277
62161I88277M8966M6496M1713L4715K6286J7636R657K669l317q515j3407j8370
$$ 988277 1037243 1083739 1125452 1160167 1186453 1204089 1213746 1216415 1213098 1204583 1191176 1172806
62149A172806k3231k7516l1055l4012l6336l7613l7552l6240l3943l0989k7825
$$ 1172806 1149575 1122059 1091004 1056992 1020656 983043 945491 909251 875308 844319 816494
62138H16494k4789k1778j8524j5209j2382j0208q290o397m905m194m035l824l155
$$ 816494 791705 769927 751403 736194 723812 713604 705314 698917 694012 689818 685783 681959 678804
62125F78804j893L6K517N152P555R617J1158J1652J0677Q545O084L854J900K93
$$ 678804 676911 676947 679464 684616 692171 701788 712946 724598 735275 743820 749904 753758 755658 755951
62111G55951n64l98L24N20o67l204o252q891j0671j1498j1240r759p341m731k537
$$ 755951 755387 754989 755313 755833 755166 751962 745710 736819 726148 714650 703410 693651 686310 681579 679042
62096F79042p47J001K835M537N958P160Q214R011R488R903J0582J1430J1903J1749
$$ 679042 678295 679296 682131 686668 692626 699786 708000 717011 726499 736402 746984 758414 770317 782066
62082G82066J1522J2034J3344J4753J5905J7304J9453K1932K3874K4979K5450
$$ 782066 793588 805622 818966 833719 849624 866928 886381 908313 932187 957166 982616
62071I82616K5335K4662K4043K4302K5405K6539K7318K8122K9014K9218K8122
$$ 982616 1007951 1032613 1056656 1080958 1106363 1132902 1160220 1188342 1217356 1246574 1274696
62060A274696K5997K3232J9534J4542Q667K709k945q101j2316j5472j8361k1835
$$ 1274696 1300693 1323925 1343459 1358001 1366668 1369377 1366432 1358331 1346015 1330543 1312182 1290347
62048A290347k5589k8702l1131l3767l6911l9647m0967m0803l9718l8246l6870
$$ 1290347 1264758 1236056 1204925 1171158 1134247 1094600 1053633 1012830 973112 934866 897996
62037H97996l6021l5605l4917l3435l1424k9423k7457k5127k2322j9466j7107
$$ 897996 861975 826370 791453 758018 726594 697171 669714 644587 622265 602799 585692
62026E85692j5379j3886j2095r963q172p528q065q962r331q902p957o936o194
$$ 585692 570313 556427 544332 534369 526197 518669 510604 501642 492311 483409 475452 468516 462322
62013D62322n819n533m962m075l170k334j234L83K252L860N004N934O924P874
$$ 462322 456503 450970 446008 441933 438763 436429 435195 435578 437830 441690 446694 452628 459552 467426
61999D67426Q297P826O689N587M924M422L702K884K231J443K3j775l077l603m080
$$ 467426 475723 483549 490238 495825 500749 505171 508873 511757 513988 515431 515454 513679 510602 506999 502919
61984E02919n087o207o710o582o323o110n747n268m978m976n086n218n394n425
$$ 502919 497832 491625 484915 478333 472010 465900 460153 454885 449907 444931 439845 434627 429233 423808
61970D23808m909l702k217j166j044j734k534k787k529k317k322k046j163j48
$$ 423808 418899 415197 412980 411814 410770 409036 406502 403715 401186 398869 396547 394501 393338 393190
61956C93190M04P05J378K373K984L021L209M219N753O993P649Q237R448J1420
$$ 393190 393594 394299 395677 398050 401034 404055 407264 411483 417236 424229 431878 440115 449563 460983
61942D60983J3582J5173J5990J6566J7414J8264J8375J7592J6598J6030J5741
$$ 460983 474565 489738 505728 522294 539708 557972 576347 593939 610537 626567 642308
61931F42308J5169J4112J2783J1340R749P986O085L937J377j473m096o029p295
$$ 642308 657477 671589 684372 695712 705461 713447 719532 723469 724846 723373 719277 713248 705953
61918G05953q297r237r757r226p369m470j017K586N952Q680J0699J2402J4104
$$ 705953 697656 688419 678662 669436 662067 657597 656580 659166 665118 673798 684497 696899 711003
61905G11003J5448J5677J4444J2037Q868N169J201k570n726q135r938j1499j3241
$$ 711003 726451 742128 756572 768609 777477 782646 783847 781277 775551 767416 757478 745979 732738
61892G32738j5143j6429j6270j4885j3423j2597j2043j1207j0269r679r372r030
$$ 732738 717595 701166 684896 670011 656588 643991 631948 620741 610472 600793 591421 582391
61880E82391q740q766q935q823q386p793o917n623m362l686l218j995O0J841K548
$$ 582391 573651 564885 555950 547127 538741 530948 524031 518408 514046 510360 507142 505147 505207 507048 509596
61865E09596K648L001L729M620N948Q100J0673J2717J3922J4924J6441J8535K0858
$$ 509596 512244 515245 518974 523594 529542 537642 548315 561032 574954 589878 606319 624854 645712
61852F45712K3156K5365K7446K9311L0866L2047L2794L2843L1563K8395K3626
$$ 645712 668868 694233 721679 750990 781856 813903 846697 879540 911103 939498 963124
61841I63124J8454J3828R501M611r50o312j0661j3848j5769j5877j3838j0299
$$ 963124 981578 995406 1004907 1009518 1008568 1002256 991595 977747 961978 946101 932263 921964
61829I21964o423k719J123N270R079J1716J2991J3208J2343R927N866Q26m465
$$ 921964 915541 912822 913945 919215 928294 940010 953001 966209 978552 988479 994345 995171 990706
61816I90706r954j5770k1263k5252k7343k8434k9594l0885l1607l1256k9858k7634
$$ 990706 980752 964982 943719 918467 891124 862690 833096 802211 770604 739348 709490 681856
61804F81856k4915k2200j9819j7602j5275j3053j1403j0256r041p523o178n478
$$ 681856 656941 634741 614922 597320 582045 568992 557589 547333 538292 530769 524591 519113
61792E19113n232m877m189l424k915k703k597k465k410k534k549j952p55K98N45
$$ 519113 513881 509004 504815 501391 498476 495773 493176 490711 488301 485767 483218 481266 480511 480809 481354
61777D81354J50l74j041k110l159l249k142o65L15P01Q08Q01Q31J093J435J409
$$ 481354 481504 481130 480089 477979 474820 471571 469429 468764 469079 469780 470588 471389 472220 473313 474748 476157
61761D76157J054J061J724K308K066J368J120J329J126J36q91r75n9R30Q93n49
$$ 476157 477211 478272 479996 482304 484370 485738 486858 488187 489313 489449 488558 487583 487524 488454 489347 488798
61745D88798k657m129m213l332k431j966j725j391r05l41J61M02L56L05M82P34
$$ 488798 486141 482012 477799 474467 472036 470070 468345 466954 466049 465708 465869 466271 466627 466932 467414 468148
61729D68148P74O65O92Q95J052J073J084J220J544K084K670K930K669K143J664
$$ 468148 468922 469587 470279 471174 472226 473299 474383 475603 477147 479231 481901 484831 487500 489643 491307
61714D91307J227P63M74M51L30k13q79j243j568k421l601m212l796k797j884j357
$$ 491307 492534 493297 493771 494222 494552 494339 493460 492217 490649 488228 484627 480415 476619 473822 471938 470581
61698D70581j303j650j975j855j478j420j758j986j867j740j873k146k486k937
$$ 470581 469278 467628 465653 463798 462320 460900 459142 457156 455289 453549 451676 449530 447044 444107
61684D44107l238l009k548k672l509m220m200l778l343k696j815j418k006k947
$$ 444107 440869 437860 435312 432640 429131 424911 420711 416933 413590 410894 409079 407661 405655 402708
61670D02708l276k900k308j633p98j64j41m32m20j28o8l74o96p74n15J93J102
$$ 402708 399432 396532 394224 392591 391793 391629 391488 391056 390636 390508 390440 390066 389370 388596 388081 388274 389376
61653C89376J460R50M65J002K175K762K551K458K930L385L436L484L827M100M031
$$ 389376 390836 391786 392251 393253 395428 398190 400741 403199 406129 409514 412950 416434 420261 424361 428392
61638D28392L768L113J478r15k750l225l075l322l844l964l735l664l779l876
$$ 428392 432160 435273 436751 435836 433086 429861 426786 423464 419620 415656 411921 408257 404478 400602
61624D00602m149m591m354k847j073o35j502k141j794j371j697k264k314k131
$$ 400602 396453 391862 387508 384661 383588 382953 381451 379310 377516 376145 374448 372184 369870 367739
61610C67739k358k886l226l459l926m389m334l890l693l953m278m358m210l816
$$ 367739 365381 362495 359269 355810 351884 347495 343161 339271 335578 331625 327347 322989 318779 314963
61596C14963l128k430k127k149k032j667j408j387j285r48p04q47j256j689k029
$$ 314963 311835 309405 307278 305129 303097 301430 300022 298635 297350 296402 295698 294851 293595 291906 289877
61581B89877k074j652j120j135j608j589p26o8n87j571j558n28J13k83p63m74
$$ 289877 287803 286151 285031 283896 282288 280699 279973 279905 279318 277747 276189 275661 275774 275491 274728 274254
61565B74254j3k61q29o80K01Q23O97L86M40O42N72L51M27R32J608K122K290K065
$$ 274254 274241 273980 273151 272471 272672 273495 274192 274578 275018 275660 276232 276583 277010 277942 279550 281672 283962 286027
61547B86027J551R93O70P23J054J329J205P07K74L14P27J055J046Q89R28J288
$$ 286027 287578 288571 289241 289964 291018 292347 293552 294259 294533 294847 295574 296629 297675 298564 299492 300780
61531C00780J740J878J462P38K55K18K05k38r22j303j317j399j695j757j262n89
$$ 300780 302520 304398 305860 306598 306853 307071 307276 307038 306116 304813 303496 302097 300402 298645 297383 296794
61515B96794l23m87n59j99L83O88M28k27p76q15m25q4j59o07j104j349j182o76
$$ 296794 296471 295984 295425 295226 295609 296297 296725 296498 295722 294907 294482 294398 294239 293632 292528 291179 289997 289321
61497B89321j87p0k70l81k08LO5K30P95J574K103K190J911J324N51N8K29P85J044
$$ 289321 289134 289064 288794 288413 288205 288208 288273 288503 289298 290872 292975 295165 297076 298400 298951 299009 299238 300023 301067
61478C01067Q55P13Q39P55R6o71q67n60l31k31K79J345K260K305J667J088R07
$$ 301067 301922 302635 303474 304229 304325 303654 302787 302227 301896 301665 301944 303289 305549 307854 309521 310609 311516
61461C11516P36Q9j032k128k658k415j619p04j6L78O00P79R51J088J112R52O17
$$ 311516 312252 312341 311309 309181 306523 304108 302489 301785 301769 302147 302747 303526 304477 305565 306677 307629 308246
61444C08246K90K77Q09J768K651K969K790K670K928L224L107K786K845L300L493
$$ 308246 308536 308813 309622 311390 314041 317010 319800 322470 325398 328622 331729 334515 337360 340660 344153
61429C44153L029K343K041K164K377K486K400K049J673J840K621L209K963K416
$$ 344153 347182 349525 351566 353730 356107 358593 360993 363042 364715 366555 369176 372385 375348 377764
61415C77764K409K564J716j46j570j598j059j217k039k571k476k215k057j830
$$ 377764 380173 382737 384453 384307 382737 381139 380080 378863 376824 374253 371777 369562 367505 365675
61401C65675j585j727k311k787k686k153j687j593j779j890j586q83k08K5j79
$$ 365675 364090 362363 360052 357265 354579 352426 350739 349146 347367 345477 343891 343008 342800 342825 342646
61386C42646n58r03j045p58m4O47Q82P67O87P25P45Q83J412K121K398K042J546
$$ 342646 342088 341185 340140 339382 339338 339985 340867 341634 342321 343046 343791 344674 346086 348207 350605 352647 354193
61369C54193J442J700J966K005J760J249O93N04R72J978L072L779L907L737L843
$$ 354193 355635 357335 359301 361306 363066 364315 365008 365512 366484 368462 371534 375313 379220 382957 386800
61354C86800M497N341N892O215O770P648Q485R015R285R234Q608P436O166N120
$$ 386800 391297 396638 402530 408745 415515 423163 431648 440663 449948 459182 467790 475226 481392 486512
61340D86512M237L496L146L273L499L427L011K273J001q41k742m056m659m851
$$ 486512 490749 494245 497391 500664 504163 507590 510601 512874 513875 513034 510292 506236 501577 496726
61326D96726m731m111k970j748j055j116j522j512o63O86J830K426K623K610K515
$$ 496726 491995 487884 484914 483166 482111 480995 479473 477961 477298 477984 479814 482240 484863 487473 489988
61311D89988K724L687N176O331O777P218Q462J0235J1500J1596J0608Q836O549
$$ 489988 492712 496399 501575 507906 514683 521901 530363 540598 552098 563694 574302 583138 589687
61298E89687M159K077L47j231k633l645m341n109o141p181p882q157q124p930
$$ 589687 593846 595923 596270 595039 592406 588761 584420 579311 573170 565989 558107 549950 541826 533896
61284E33896p657p290o772o193n747n368m628l182j231O90K181L037L152K690
$$ 533896 526239 518949 512177 505984 500237 494869 490241 487059 485828 486518 488699 491736 494888 497578
61270D97578K213K225K653L113L526M151N084O065O832P360P818Q487R469J0311
$$ 497578 499791 502016 504669 507782 511308 515459 520543 526608 533440 540800 548618 557105 566574 576885
61256E76885J0256R196Q006P431P008N832M033K564J634M20j446l159l962m237
$$ 576885 587141 596337 604343 611774 618782 624614 628647 631211 632845 633265 631819 628660 624698 620461
61242F20461m695n189n130m607m248m162l829l102k572k742l301l468k827j602
$$ 620461 615766 610577 605447 600840 596592 592430 588601 585499 582927 580185 576884 573416 570589 568987
61228E68987k84P88J537K022K326K580K927L367L709L888M215N037O172O996P161
$$ 568987 568703 569491 571028 573050 575376 577956 580883 584250 587959 591847 596062 601099 607271 614267 621428
61213F21428O889O500N949N050L852K608J532Q30O85J077J743K510L442M569N735
$$ 621428 628317 634817 640766 645816 649668 652276 653808 654638 655323 656400 658143 660653 664095 668664 674399
61198F74399O931Q435J0410J2603J4719J6786J8724J9800J9066J6385J2693R237
$$ 674399 681330 689765 700175 712778 727497 744283 763007 782807 801873 818258 830951 840188
61186H40188O741N217M273L473K623J744P77n41k277m004n240o074p008q234r382
$$ 840188 846929 852146 856419 859892 862515 864259 865036 864495 862218 858214 852974 846900 839892 831658 822276
61171H22276j0071j0371j0645j1115j1752j2415j2985j3457j3948j4498j4901
$$ 822276 812205 801834 791189 780074 768322 755907 742922 729465 715517 701019 686118
61160F86118j4809j4154j3264j2534j1955j1075r475p255m990l104j416L97K039
$$ 686118 671309 657155 643891 631357 619402 608327 598852 591597 586607 583503 582087 582484 584523
61147E84523K705K108R06k08j416l239n379o796o909o113m978l565j834k27P84
$$ 584523 587228 589336 590242 590034 588618 585379 580000 573204 566295 560182 555204 551639 549805 549578 550362
61132E50362J386K125L002L448L411L893N974R405J2707J4769J5963J7404J9434
$$ 550362 551748 553873 556875 560323 563734 567627 573601 583006 595713 610482 626445 643849 663283
61119F63283K1271K2182K2462K2998K4190K5676K6895K7523K7389K6386K4709
$$ 663283 684554 706736 729198 752196 776386 802062 828957 856480 883869 910255 934964
61108I34964K2963K1705K0844J9653J7459J4263J0593O820K893j274n387r056
$$ 934964 957927 979632 1000476 1020129 1037588 1051851 1062444 1069264 1072157 1070883 1065496 1056440
61096A056440j2264j5268j8111k0633k2841k4806k6205k6520k5859k5036k4549
$$ 1056440 1044176 1028908 1010797 990164 967323 942517 916312 889792 863933 838897 814348
61085H14348k4047k3071k1818k0740j9835j8879j7888j6827j5275j3062j0898
$$ 814348 790301 767230 745412 724672 704837 685958 668070 651243 635968 622906 612008
61074F12008r571q727p323n213l413k669k534k177j408n54K07R55J801K781L788
$$ 612008 602437 593710 586387 581174 577761 575092 572558 570381 568973 568419 568626 569581 571382 574163 577951
61059E77951M525M873N301O412Q033R330R932J0403J1336J2646J4104J5963J8446
$$ 577951 582476 587349 592650 599062 607095 616425 626357 636760 648096 660742 674846 690809 709255
61046G09255K0960K2497K2818K2784K3490K5292K7650K9765L1290L2390L3307
$$ 709255 730215 752712 775530 798314 821804 847096 874746 904511 935801 968191 1001498
61035A001498L4147L5205L7006L9567M1974M3313M3679M3675M3261M2126M1002
$$ 1001498 1035645 1070850 1107856 1147423 1189397 1232710 1276389 1320064 1363325 1405451 1446453
61024A446453M1383M3922M8138N3806O1201O9670P7396Q3452Q9042R6179J06405
$$ 1446453 1487836 1531758 1579896 1633702 1694903 1764573 1841969 1925421 2014463 2110642 2217047
61013B217047J21457J43665J74484K13919K62533L22778L97538M89630O04707
$$ 2217047 2338504 2482169 2656653 2870572 3133105 3455883 3853421 4343051 4947758
61004D947758P52611R43357J183032J472066J794093K089389K241714K122054
$$ 4947758 5700369 6643726 7826758 9298824 11092917 13182306 15424020 17546074
60996A7546074J682522J022119L49705j34704l37196k74935k3555L12951N94320
$$ 17546074 19228596 20250715 20600420 20465716 20128520 19853585 19830030 20142981 20737301
60987B0737301O58890L99518j53691q33481j432721j817008j965612j933785j793968
$$ 20737301 21396191 21795709 21642018 20808537 19375816 17558808 15593196 13659411 11865443
60978A1865443j603384j399143j201994j020680q58029p16019n95827m95761m12204
$$ 11865443 10262059 8862916 7660922 6640242 5782213 5066194 4470367 3974606 3562402
60969C562402l42586k85838k40596k04604j75763j52466j33122j16442j02086
$$ 3562402 3219816 2933978 2693382 2488778 2313015 2160549 2027427 1910985 1808899
60960A808899q9938p9023o8170n7435m7669l8881l0341k2397j6738j4255j3676
$$ 1808899 1718961 1639938 1571768 1514333 1466664 1427783 1397442 1375045 1358307 1344052 1330376
60949A330376j2976j1427r495p446m972k079N67K425L686M781N634N826N517N611
$$ 1330376 1317400 1305973 1296478 1289032 1284060 1281981 1282548 1284973 1288659 1293440 1299074 1304900 1310417 1316028
60935A316028O664P914Q023O669M882L690L047K256Q73j273m334q146j1961j5065
$$ 1316028 1322692 1330606 1338629 1345298 1350180 1353870 1356917 1359173 1360046 1358773 1354439 1346293 1334332 1319267
60921A319267j7497j9821k2347k4910k7186k8858k9694k9839k9780k9734k9322
$$ 1319267 1301770 1281949 1259602 1234692 1207506 1178648 1148954 1119115 1089335 1059601 1030279
60910A030279k8159k6400k4424k2364k0360j8738j7414j5691j3328j1292j0645
$$ 1030279 1002120 975720 951296 928932 908572 889834 872420 856729 843401 832109 821464
60899H21464j1007j1082j0424r739r498r428r391r743j0388j0465r500q246p795
$$ 821464 810457 799375 788951 779212 769714 760286 750895 741152 730764 720299 710799 702553 694758
60886F94758q292r017r334r165q733q254p822p458p236p266p394p138o312n473
$$ 694758 686466 677449 668115 658950 650217 641963 634141 626683 619447 612181 604787 597649 591337 585864
60872E85864n217n268m930m323m339n273o353o784o536n787m467k832j820k132
$$ 585864 580647 575379 570449 566126 561787 556514 550161 543377 536841 531054 526587 523755 521935 519803
60858E19803l406m717n586o001n956n458m796m212l577k768k122k062k459k766
$$ 519803 516397 511680 506094 500093 494137 488679 483883 479671 476094 473326 471204 469142 466683 463917
60844D63917k693k415k245k383k857l440l798l859l914m155m368m254l796l132
$$ 463917 461224 458809 456564 454181 451324 447884 444086 440227 436313 432158 427790 423536 419740 416608
60830D16608k347j548q69j51R82K483L681M022L732L417L322L332L330L170K577
$$ 416608 414261 412713 411844 411693 412675 415158 418839 422861 426593 430010 433332 436664 439994 443164 445741
60815D45741J547O02K28K77L09K76L40L20j08p34r74o89l33k63m07p39j500k687
$$ 445741 447288 447890 448118 448395 448704 448980 449320 449640 449532 448798 447824 447135 446802 446539 446132 445393 443893 441206
60797D41206l659l707k881j980j691j944k187k198k355l022l900m377m381m416
$$ 441206 437547 433840 430959 428979 427288 425344 423157 420959 418604 415582 411682 407305 402924 398508
60783C98508m699m785m301l570l138l046k963k743k468k168j874j720j621j185
$$ 398508 393809 389024 384723 381153 378015 374969 372006 369263 366795 364627 362753 361033 359412 358227
60769C58227l24L78M07J35L10R65J458J531J633K158K944L675M234M537M463M095
$$ 358227 357903 358281 358688 358823 359133 360098 361556 363087 364720 366878 369822 373497 377731 382268 386731 390826
60753C90826L755L617L641L815M140M277L717K435J066K84K21N34P32K99j092
$$ 390826 394581 398198 401839 405654 409794 414071 417788 420223 421289 421573 421794 422328 423060 423359 422267
60738D22267l342n929q224r662r819q707p050n844n534n740n763n186m100l072
$$ 422267 418925 412996 404772 395110 385291 376584 369534 363690 358156 352416 346653 341467 337367 334295
60724C34295k716k972l018k341j592j723k472k578j557l35J24q7m70r84j625j840
$$ 334295 331579 328607 325589 323248 321656 319933 317461 314883 313326 312991 313115 313028 312558 311574 309949 308109
60708C08109j186j10O07Q70J044J099P72K86J29J77q0n11l42O04J532J840J902
$$ 308109 306923 306813 307420 308290 309334 310433 311205 311491 311620 311797 311717 311206 310864 311468 313000 314840 316742
60691C16742K253K664K685K601L086M055M661M534M375M987O144O813O367N270
$$ 316742 318995 321659 324344 326945 330031 334086 338747 343281 347656 352643 358787 365600 371967 377237
60677C77237M526M644N171N234M537L656L218K978K097M35j033j428j226j641
$$ 377237 381763 386407 391578 396812 401349 405005 408223 411201 413298 413733 412700 411272 410046 408405
60663D08405k985m311m732m410l986l664l323l046k954k804k340j817j628j549
$$ 408405 405420 401109 396377 391967 387981 384317 380994 377948 374994 372190 369850 368033 366405 364856
60649C64856j020j12M13J98k51m37o43j363k382k996k971k764k798k923k827k636
$$ 364856 363836 363724 364137 364335 364084 363647 363004 361641 359259 356263 353292 350528 347730 344807 341980 339344
60633C39344k797l387l785l258j833l53L95L71O2j41j10K27Q36J450J759J727
$$ 339344 336547 333160 329375 326117 324284 323931 324326 324697 324759 324618 324508 324735 325571 327021 328780 330507
60617C30507J386N58p32j712j447o8J122J139L97j1K79P29P89M65R8j7K28O89
$$ 330507 331893 332451 331719 330007 328560 328492 329614 330753 331150 331139 331418 332147 332936 333401 333499 333482 333710 334399
60599C34399J052J124J033J052J311J770K274K571K518K340K378K471K014R44
$$ 334399 335451 336575 337608 338660 339971 341741 344015 346586 349104 351444 353822 356293 358307 359251
60585C59251J12J86N95K22r93j960j897j166m85L0O77J512K349L097L797M575
$$ 359251 359363 359549 360144 360366 359373 357413 355516 354350 353865 353895 354572 356084 358433 361530 365327 369902
60569C69902N719P486R524J0899J1062J0455R720Q697O859M458K407R58o13k726
$$ 369902 375621 383107 392631 403530 414592 425047 434767 443464 450323 454781 457188 458146 457533 454807
60555D54807m648n437n130m440l637k451q08J009K830M578N862O283O170O375
$$ 454807 450159 444722 439592 435152 431515 429064 428256 429265 432095 436673 442535 448818 454988 461363
60541D61363P242Q376R538J0958J2474J3215J2695J1542J0421Q843N946K064j394
$$ 461363 468605 476981 486519 497477 509951 523166 535861 547403 557824 566667 572613 574677 573283
60528E73283l544m607n025m875m376m063m132m184l913l521l139k474j378k64
$$ 573283 569739 565132 560107 555232 550856 546793 542661 538477 534564 531043 527904 525430 524052 523788
60514E23788M09O54N79K4r29j499q38R99L225N240O971Q539J0189J2524J6181
$$ 523788 524197 524851 525430 525454 524525 523026 522188 523187 526412 531652 538623 547162 557351 569875 586056
60499E86056K1036K6068L0183L3043L4992L6473L7597L8068L7341L4914L0577
$$ 586056 607092 633160 663343 696386 731378 767851 805448 843516 880857 915771 946348
60488I46348K4494J7040Q589n91j0193j9582k7735l3822l7768m0044m0838l9880
$$ 946348 970842 987882 996471 995880 985687 966105 938370 904548 866780 826736 785898 746018
60476G46018l7281l4043l1267k9087k6791k3962k0959j8294j6009j3861j1857
$$ 746018 708737 674694 643427 614340 587549 563587 542628 524334 508325 494464 482607
60465D82607j0303r402q984q599p924o986o043n186m302l414k828k726k763k390
$$ 482607 472304 462902 453918 445319 437395 430409 424366 419180 414878 411464 408636 405910 403147 400757
60451D00757j549p63n29p89j088j111j004j237k045k960l087k071o39J24n1n00
$$ 400757 399208 398445 397916 397127 396039 394928 393924 392687 390642 387682 384595 382524 381885 382009 381958 381458
60435C81458o07m67m97p97j165j438j548j394r92n77l63k81j94k14m70p22n90
$$ 381458 380851 380384 379887 379090 377925 376487 374939 373545 372553 371976 371613 371332 371138 370924 370454 369732 369142
60418C69142j86l0j77N7J102K314K624J917J137J030J286J124L51m69o79j09Q59
$$ 369142 368956 368926 368749 368806 369908 372222 374846 376763 377900 378930 380216 381340 381691 381222 380543 380434 381293
60401C81293J644K004K268K826L393L216K128R97P84J510K488L209L531L334K607
$$ 381293 382937 384941 387209 390035 393428 396644 398772 399769 400553 402063 404551 407760 411291 414625 417232
60386D17232J846J760K500L478M011L820L060K216J841K047K274J986J393J101
$$ 417232 419078 420838 423338 426816 430827 434647 437707 439923 441764 443811 446085 448071 449464 450565
60372D50565J244J498J734K046K192J831J236R90R39L25p85j231k89J314K539
$$ 450565 451809 453307 455041 457087 459279 461110 462346 463336 464275 464600 463815 462584 462295 463609 466148
60357D66148L377M386N522O310O817P609Q889J0217J1065J1112J0188Q392O131
$$ 466148 469525 473911 479433 485743 492560 500169 509058 519275 530340 541452 551640 560032 566163
60344E66163L719J085j779m397o259p387q044q132p458o375n554n206n044m868
$$ 566163 569882 570967 569188 564791 558532 551145 543101 534969 527511 521136 515582 510376 505332 500464
60330E00464m748m613m229l606l085k918l043l223l206k787k022j284q47n34M4
$$ 500464 495716 491103 486874 483268 480183 477265 474222 470999 467793 465006 462984 461700 460853 460319 460363
60315D60363J023K191L173L677L880M698P049J0547J3557J5042J5780J7055J8728
$$ 460363 461386 463577 466750 470427 474307 479005 486054 496601 510158 525200 540980 558035 576763
60302E76763J9434J8366J5811J2148P321J519m469r803j3976j6566j7297j6538
$$ 576763 596197 614563 630374 642522 649843 651362 646893 637090 623114 606548 589251 572713
60290E72713j5165j3668j1828r461p001n148m225m010l974l739l492l805m719
$$ 572713 557548 543880 532052 522591 515590 510442 506217 502207 498233 494494 491002 487197 482478
60277D82478n365m997m057l527l571l663l791m416n213n094l816k510k061j952
$$ 482478 477113 472116 468059 464532 460961 457298 453507 449091 443878 438784 434968 432458 430397 428445
60263D28445j355n42l49p97j191j228j153r89l90O07J309J148L54l16m39k81l31
$$ 428445 427090 426548 426199 425402 424211 422983 421830 420841 420451 421058 422367 423515 423869 423553 423114 422833 422502
60246D22502n88n52k2N06N29L05M15P71P28J92k04r0J66K56M60J021J632J966
$$ 422502 421914 421362 421340 421846 422375 422680 423095 423866 424594 424786 424582 424492 424658 424914 425374 426395 428027 429993
60228D29993K153K290K057J400J048J745L190M363M667M307L767L467L739M616
$$ 429993 432146 434436 436493 437893 438941 440686 443876 448239 452906 457213 460980 464447 468186 472802
60214D72802N663O377O746P127P692Q212Q296P680O445N193M632M794M925M460
$$ 472802 478465 484842 491588 498715 506407 514619 522915 530595 537040 542233 546865 551659 556584 561044
60200E61044L729L394L539L732L653L198K218P60o69j525j890k248k730l027l025
$$ 561044 564773 568167 571706 575438 579091 582289 584507 585267 584598 583073 581183 578935 576205 573178 570153
60185E70153l053l454m250n246o163o611o300n342m199l301k802k615k509k266
$$ 570153 567100 563646 559396 554150 547987 541376 535076 529734 525535 522234 519432 516817 514308 512042
60171E12042j904j685j714j768j629j408j276j149q79n57l70l07l05m34o49o11
$$ 512042 510138 508453 506739 504971 503342 501934 500658 499509 498630 498073 497703 497396 497091 496657 496008 495397
60155D95397j20M73P09O61P30J014J285J498J758J948J835J564J529J782K073
$$ 495397 495277 495750 496459 497120 497850 498864 500149 501647 503405 505353 507188 508752 510281 512063 514136
60140E14136K503L543N206O691P235O963O595O513O445N970N042M012L218K640
$$ 514136 516639 520182 525388 532079 539314 546277 552872 559385 565830 571800 576842 580854 584072 586712
60126E86712K004J264P60P59R67Q86N75O35J281J831J473L44n58n88k94p17k022
$$ 586712 588716 589980 590740 591499 592466 593352 593927 594562 595843 597674 599147 599491 598933 598345 598051 597334 595312
60109E95312l200l381l007l193m037m320l220j650j247k362l777m293l856l024
$$ 595312 592112 588731 585724 582531 578494 574174 570954 569304 568057 565695 561918 557625 553769 550745
60095E50745k064j049k55R6L58J138K502L813M491M547M322L967L482L035K847
$$ 550745 548681 547632 547377 547473 547831 548969 551471 555284 559775 564322 568644 572611 576093 579128 581975
60080E81975K716K081P10r11k164l083m168n574o898p792q313q514q229p501o867
$$ 581975 584691 586772 587482 586571 584407 581324 577156 571582 564684 556892 548579 540065 531836 524335 517468
60065E17468o716o651n987m763l809l745m239m428l792k555j359p13o23o93n70
$$ 517468 510752 504101 498114 493351 489542 485797 481558 477130 473338 470783 469424 468711 468088 467395 466825
60050D66825j95L63J202K452L905N025N468N488N683O254O701O355N198L899K995
$$ 466825 466630 466993 468195 470647 474552 479577 485045 490533 496216 502470 509171 515526 520724 524623 527618
60035E27618K364J681J040O43J62r25k443l626m273n013o177p081p058o532o409
$$ 527618 529982 531663 532703 533346 533508 532583 530140 526514 522241 517228 511051 503970 496912 490380 483971
60020D83971o727o696n938m949m258l793l337l037l117l419l565l428l124k710
$$ 483971 477244 470548 464610 459661 455403 451610 448273 445236 442119 438700 435135 431707 428583 425873
60006D25873k131j481j080j098j279j189p16j56K14M00M98N60P30J212J864K231
$$ 425873 423742 422261 421181 420083 418804 417615 416899 416743 416957 417357 417855 418415 419145 420357 422221 424452
59990D24452K255K544L429M251M268L824L696L608K578O96p07r48q79j398k191
$$ 424452 426707 429251 432680 436931 441199 445023 448719 452327 454905 455601 454894 453946 453067 451669 449478
59975D49478k644k948l415l603l075k391k293k480k092j066r2M31O17O51Q81J818
$$ 449478 446834 443886 440471 436868 433793 431402 429109 426629 424537 423471 423379 423810 424427 425078 425959 427777
59959D27777L237L805K612O20n22o36p96j329j455r06m12l75k76K16O58P13O39
$$ 427777 431014 434819 437431 438051 437529 436893 436097 434768 433313 432407 431995 431620 431344 431560 432218 432931 433570
59942D33570M87k27j558k694k914k362j474m83K14N2p31r04L05K146L276L264
$$ 433570 434057 433830 432272 429578 426664 424302 422828 422345 422559 422611 421880 420976 421281 423427 426703 429967
59926D29967K676K201K272L085M418N626O286O633P079P700Q371R029R405Q958
$$ 429967 432643 434844 437116 440201 444619 450245 456531 463164 470243 477943 486314 495343 504748 513706
59912E13706P469N428L534K071R70J18o75j606k562l202l478l683l781l296k099
$$ 513706 521175 526603 530137 532208 533178 533296 532621 531015 528453 525251 521773 518090 514309 511013 508914
59897E08914q64l21m87q55r24l68P97J963K394K176K193K851L588L912M208M928
$$ 508914 508050 507729 507242 506387 505463 505095 505892 507855 510249 512425 514618 517469 521057 524969 529177 534105
59881E34105N731O114O250O494O591O166N502N002M255K608L87j320k056k317
$$ 534105 539836 545950 552200 558694 565285 571451 576953 581955 586210 588818 589205 587885 585829 583512
59867E83512k562k725k783k960l169k946k200j472j146r45n21q8m0j95J62J564
$$ 583512 580950 578225 575442 572482 569313 566367 564167 562695 561549 560604 560083 559995 559955 559760 559922 561486
59851E61486L876O363Q096Q397P174M879K101p30l195m600m189j912J112L240
$$ 561486 565362 571725 579821 588218 595392 600271 602372 601642 598447 593847 589658 587746 588858 592098
59837E92098L539K270K01k162m403n820n897n009m071l514l158k985l255l779
$$ 592098 595637 597907 598108 595946 591543 585723 579826 574817 570746 567232 564074 561089 557834 554055
59823E54055l874l380l011l273l627l287k229r55K78J270J471N11r69j751j365
$$ 554055 550181 546801 543790 540517 536890 533603 531374 530419 530697 531967 533438 533949 532980 531229 529864
59808E29864n18k40r36k213l343l809l697l487l434l341l028k630k344k192k250
$$ 529864 529346 529106 528170 525957 522614 518805 515108 511621 508187 504846 501818 499188 496844 494652 492402
59793D92402k659l141l086k368j612j269r83l69K32L40J48J4k81r84j498j065
$$ 492402 489743 486602 483516 481148 479536 478267 477284 476915 477147 477487 477635 477649 477368 476384 474886 473821
59777D73821o0M30K28K72J074J925J948J224N23M34R91J733J966J424P78R77J969
$$ 473821 473761 474191 474419 474691 475765 477690 479638 480862 481385 481819 482810 484543 486509 487933 488711 489688 491657
59760D91657K698K523K005J953K295K380K005J559J423J644K157K850L417L522
$$ 491657 494355 496878 498883 500836 503131 505511 507516 509075 510498 512142 514299 517149 520566 524088
59746E24088L249L138L586M324M646M209L376K687K236J837J569J703K040J926
$$ 524088 527337 530475 534061 538385 543031 547240 550616 553303 555539 557376 558945 560648 562688 564614
59732E64614J129K14k09j85n3J67N13O40K08n18r98j156j270j334j096o53m08
$$ 564614 565743 565957 565748 565563 565510 565677 566190 566830 567038 566520 565522 564366 563096 561762 560666 560013 559605
59715E59605n18q34j316j952k353k014j043j17L86P34J261J842K140K005J551
$$ 559605 559087 558253 556937 554985 552632 550618 549575 549458 549844 550578 551839 553681 555821 557826 559377
59700E59377J059Q82J180J808K555L330L847L545K221N64n46j017j303j426r75
$$ 559377 560436 561318 562498 564306 566861 570191 574038 577583 579804 580368 579822 578805 577502 576076 575101
59685E75101l4O95P81N07K30q6n70j179j919k856l812m458m803n157n559n704
$$ 575101 575067 575762 576543 577050 577280 577194 576624 575445 573526 570670 566858 562400 557597 552440 546881 541177
59669E41177n461m929m045k733j491j056j412j750j680j633j849j741q08N35J549
$$ 541177 535716 530787 526742 524009 522518 521462 520050 518300 516620 514987 513138 511397 510589 511124 512673
59654E12673K106K453K586K408K135J968J709J187P14N71L38n91k015l115l519
$$ 512673 514779 517232 519818 522226 524361 526329 528038 529225 529939 530510 530848 530257 528242 525127 521608
59639E21608l585l563l156k183j169q57j293j751j565q64l47m85j146j994k896
$$ 521608 518023 514460 511304 509121 507952 507095 505802 504051 502486 501622 501275 500790 499644 497650 494754
59624D94754l732m093l686k954k704l063l290k879k335k407k886k756j484K72
$$ 494754 491022 486929 483243 480289 477585 474522 471232 468353 466018 463611 460725 457969 456485 456757
59610D56757J436J640J359J079P97M16K78P69J527J713J161O76Q18J093R33P90
$$ 456757 458193 459833 461192 462271 463068 463484 463762 464531 466058 467771 468932 469608 470426 471519 472452 473242
59594D73242J351K174K177J279M49P2m50j343j863j584j173j282j525j313r08
$$ 473242 474593 476767 478944 480223 480672 480744 480294 478951 477088 475504 474331 473049 471524 470211 469303
59579D69303q92j222j609k180k941l187k396j283r54j268j136k58N00N47K91J23
$$ 469303 468411 467189 465580 463400 460459 457272 454876 453593 452639 451371 450235 449977 450477 451024 451315 451438
59563D51438l23j290k039j634k95P18O20rm4Q51J920K343K140J866J778J760J977
$$ 451438 451115 449825 447786 446152 445857 446575 447195 447186 447142 447993 449913 452256 454396 456262 458040 459800 461777
59546D61777K893M506O144P385Q575J0150J2104J4633J8375K2822K5002K1477
$$ 461777 464670 469176 475320 482705 491280 501430 513534 528167 546542 569364 594366 615843
59534F15843J2141J017p287j1216j2021j1090q789n535k447l50J154K914M874
$$ 615843 627984 629001 621714 610498 598477 587387 578598 573063 570616 570266 571420 574334 579208
59521E79208O024N673M218K507Q54r74l054n001o424p336q046q765r405r638r119
$$ 579208 585232 590905 595123 597630 598484 597510 594456 589455 583031 575695 567649 558884 549479 539841 530722
59506E30722p899o537n625n155m649l907l248k922k681k208j598j123p68l26K23
$$ 530722 522823 516286 510661 505506 500857 496950 493702 490780 488099 485891 484293 483170 482402 482076 482299
59491D82299O88R63J092J190J339J478J291N34m32p85j39J083K307L458M596N457
$$ 482299 482987 483950 485042 486232 487571 489049 490340 490874 490442 489657 489518 490601 492908 496366 500962 506419
59475E06419N779N744N482M591K819R58J53L86N22k2m85k0J073J933K421L065
$$ 506419 512198 517942 523424 528015 530834 531792 531945 532331 532853 532831 532346 532326 533399 535332 537753 540818
59459E40818M038M933N561O326P584R068J0233J0812J0828J0255R105P752O607
$$ 540818 544856 549789 555350 561676 569260 578328 588561 599373 610201 620456 629561 637313 643920
59446F43920N418L371J91l225n804p498q944j0122j0241r019p302o058n430n140
$$ 643920 649338 652709 652900 649675 643871 636373 627429 617307 607066 598047 590745 584687 579257 574117
59432E74117n168n415n257m193k558j027L81K123M238O379Q489J0682J2612J3892
$$ 574117 568949 563534 558277 554084 551526 550499 550880 553003 557241 563620 572109 582791 595403 609295
59418F09295J5131J7566K1447K5687K9410L2709L5013L3795K6394J3216j764j3899
$$ 609295 624426 641992 663439 689126 718536 751245 786258 820053 846447 859663 857899 844000
59406H44000k0774k2495k0351j5791r961l297M218J1604J5766J3004K604j1367
$$ 844000 823226 800731 780380 764589 754628 751331 755549 767153 782919 795923 798527 787160
59394G87160k2744k8001k8077k5892k3126j9866j6246j3039j0661q721o911n537
$$ 787160 764416 736415 708338 682446 659320 639454 623208 610169 599508 590787 583876 578339
59382E78339m695l682j893P7J102J136J305K276L308L401K796K640L398M319M605
$$ 578339 573644 569962 568069 568146 569248 570384 571689 573965 577273 580674 583470 586110 589508 593827 598432
59367E98432M394M267M245L877L158K736L096L898M397M288L948L956M503N313
$$ 598432 602826 607093 611338 615215 618373 621109 624205 628103 632500 636788 640736 644692 649195 654508
59353F54508O038O759P973R952J2220J3913J4682J4983J5460J6285J7103J7335
$$ 654508 660546 667305 675278 685230 697450 711363 726045 741028 756488 772773 789876 807211
59341H07211J6443J4253J1195P989M990K012j084m022o518q726j0933j3057j4711
$$ 807211 823654 837907 849102 857091 862081 864093 863009 858987 852469 843743 832810 819753 805042
59328H05042j5640j5797j5125j3611j1542r522q202p921q392q736q140o691n220
$$ 805042 789402 773605 758480 744869 733327 723805 715603 707682 699290 690554 682414 675723 670503
59315F70503m269l568k741j991j672j591j289o69J52J450L695O838J0252J3180
$$ 670503 666234 662666 659925 657934 656262 654671 653382 652713 652865 654315 658010 664848 675100 688280
59301F88280J4735J3697R121J468p258j4684j9239k0516j9209j6788j4589j2897
$$ 688280 703015 716712 725833 727301 720043 705359 686120 665604 646395 629607 615018 602121
59289F02121j1221r392p853o829n866m562l164j994q03P47K318L227L475L862
$$ 602121 590900 581508 573655 566826 560960 556398 553234 551240 550437 551184 553502 556729 560204 564066
59275E64066N050O873Q687J0053J0884J1211J1057J0526R832R135Q389P386N991
$$ 564066 569116 575989 584676 594729 605613 616824 627881 638407 648239 657374 665763 673149 679140
59262F79140M231K180r7k365m133n043n342n712o528p442p837p440o411n007l490
$$ 679140 683371 685551 685454 683089 678956 673913 668571 662859 656331 648889 641052 633612 627201 622194 618704
59247F18704k257j688j666j539p79M24J564K621M075N999P696Q533Q705Q691Q322
$$ 618704 616447 614759 613093 611554 610775 611199 612763 615384 619459 625458 633154 641687 650392 659083 667405
59232F67405P079N192L578K619J713L12j276k547l562m503n061m870m216l648
$$ 667405 674484 679676 683254 685873 687586 687898 686622 684075 680513 676010 670949 666079 661863 658215
59218F58215l206k721k569l354m870o085o294n742n139m967n314n863o019n448
$$ 658215 655009 652288 649719 646365 641495 635410 629116 623374 618235 613268 607954 602091 596072 590624
59204E90624m513l818l447l089k743k674k744k520k066j889j995j762j050n92
$$ 590624 586111 582293 578846 575757 573014 570340 567596 565076 563010 561121 559126 557364 556314 555722
59190E55722q04r01N9J764K994L219L110L478M225M577M068L108K600L033L995
$$ 555722 554918 554017 554076 555840 558834 562053 565163 568641 572866 577443 581511 584619 587219 590252 594247
59175E94247M704M960N272O046P080Q034Q958J0007J0973J1496J1529J1227J0552
$$ 594247 598951 603911 609183 615229 622309 630343 639301 649308 660281 671777 683306 694533 705085
59162G05085R366P843O330M800K824K29k541m888o683q220r687j0910j1620j1825
$$ 705085 714451 722294 728624 733424 736248 736477 733936 729048 722365 714145 704458 693548 681928 670103
59148F70103j1856j2021j2259j2119j1168r516p912p205p530q183q352p909p279
$$ 670103 658247 646226 633967 621848 610680 601164 593252 586047 578517 570334 561982 554073 546794
59135E46794o702o029n210m511l954l070j628k59J88k03m90k7R37J843K482K887
$$ 546794 540092 534063 528853 524342 520388 517318 515690 515431 515619 515416 514926 514899 515836 517679 520161 523048
59119E23048L117L432M342O016P817Q801Q770Q531R037J0296J1345J1337J0500
$$ 523048 526165 529597 533939 539955 547772 556573 565343 573874 582911 593207 604552 615889 626389
59106F26389R785R652R589Q968P842O583N173L414J583J97p54j702k652l101k891
$$ 626389 636174 645826 655415 664383 672225 678808 683981 687395 688978 689175 688421 686719 684067 680966 678075
59091F78075k497k209j724r11m32r47k070k783k792k921l993n720o938o866n931
$$ 678075 675578 673369 671645 670734 670302 669355 667285 664502 661710 658789 654796 649076 642138 635272 629341
59076F29341n253n413n884n824n156m554m433m457m189l766l626l864m165m280
$$ 629341 624088 618675 612791 606967 601811 597257 592824 588367 584178 580412 576786 572922 568757 564477
59062E64477m180l873l287k500j795j478j607j990k375k579k507k131j582j156
$$ 564477 560297 556424 553137 550637 548842 547364 545757 543767 541392 538813 536306 534175 532593 531437
59048E31437j060j185j233j181j286j607j781j507j026p66o99m39J01M97L78n0
$$ 531437 530377 529192 527959 526778 525492 523885 522104 520597 519571 518805 518106 517667 517768 518265 518643 518593
59032E18593j20O94K260L856M854N416O286P819R484J0579J1123J1754J2842J4023
$$ 518593 518473 519167 521427 525283 530137 535553 541839 549658 559142 569721 580844 592598 605440 619463
59018F19463J4418J3215J0366O922M285K800J492m68k534l585l434k813k169j320
$$ 619463 633881 647096 657462 664384 668669 671469 672961 672493 669959 666374 662940 660127 657958 656638
59004F56638j69J060K286L600M766N394N581N729N741N142M002L055K721K657
$$ 656638 656469 657529 659815 663415 668181 673575 679156 684885 690626 695768 699770 702825 705546 708203
58990G08203K472K178J744P88r36l125n179o527o703n630l835k020l56J319K854
$$ 708203 710675 712853 714597 715385 714449 711324 706145 699618 692915 687285 683450 681430 681074 682393 685247
58975F85247L990N029O529Q342R730J0438J0800J0865J0367R636R458R849R948
$$ 685247 689237 694266 700795 709137 718867 729305 740105 750970 761337 770973 780431 790280 800228
58962H00228R412Q854Q551P829O245M306K454L04k432n242p752j0335j3044j4903
$$ 800228 809640 818494 827045 834874 841119 845425 847879 848183 845751 840509 832757 822422 809378 794475
58948G94475j5278j5059j5301j5496j4428j2299j0524r634q713p020n063l694
$$ 794475 779197 764138 748837 733341 718913 706614 696090 686456 677743 670723 665660 661966
58936F61966l053k734k396j881j136l08K54K53l60j291j956j932j562j721k711
$$ 661966 658913 656179 653783 651902 650766 650458 650712 650965 650605 649314 647358 645426 643864 642143 639432
58921F39432l747l926l278k530k177k188k308k236j810j297j097r02K25K477M701
$$ 639432 635685 631759 628481 625951 623774 621586 619278 617042 615232 613935 612838 611936 612161 614638 619339
58906F19339N764N993O518P719R116J0401J1683J2827J3366J3102J2225J1025
$$ 619339 625103 631096 637614 645333 654449 664850 676533 689360 702726 715828 728053 739078
58894G39078R954R772J0921J2850J4632J6124J8003K0634K3431K5342K5509K3612
$$ 739078 749032 758804 769725 782575 797207 813331 831334 851968 875399 900741 926250 949862
58882I49862K0066J5915J2096Q711N220J249k987o925j0104j2487j4418j6028
$$ 949862 969928 985843 997939 1006650 1011870 1013119 1010132 1003207 993103 980616 966198 950170
58870I50170j6793j6165j4649j3445j2833j1756r482o818n068m522m695n378o559
$$ 950170 933377 917212 902563 889118 876285 864529 855047 848229 843161 838639 833944 828566 822007
58857H22007p887r038j0225j1588j2505j2311j1208r849q427o992o073o078o516
$$ 822007 814120 805082 794857 783269 770764 758453 747245 737396 728969 721977 715904 709826 703310
58844G03310o665o642o953p544q081q680r295r096p578n837n332n813n832m979
$$ 703310 696645 690003 683050 675506 667425 658745 649450 640354 632776 626939 621607 615794 609962 604983
58830F04983m092l410k257p03J32r2k53M71J438J806J901K480L488M302M597M364
$$ 604983 600891 597481 595224 594521 594653 594561 594308 594779 596217 598023 599924 602404 605892 610194 614791 619155
58814F19155L662K788K272K234K201J820J243O34j06r05j442j764k361l356m188
$$ 619155 622817 625605 627877 630111 632312 634132 635375 636009 635903 634998 633556 631792 629431 626075 621887
58799F21887m406m260m196m338m650n123n515n484n104m836m714m173k908j371
$$ 621887 617481 613221 609025 604687 600037 594914 589399 583915 578811 573975 569261 565088 562180 560809
58785E60809k04M09O53Q56J466K758M368N546O004O069N958N411M235K640Q97
$$ 560809 560605 561014 561667 562523 563989 566747 571115 576661 582665 588734 594692 600103 604338 606978 607875
58770F07875q94k586l920m864n600o144o318o086n568m805l942l314k971k390
$$ 607875 606981 604395 600475 595611 590011 583867 577549 571463 565895 561090 557148 553834 550863 548473
58756E48473j266k16Q1P0O97J810K266J635P38M03O30J170J963K799L307L598
$$ 548473 547207 546991 547072 547142 547839 549649 551915 553550 554288 554691 555321 556491 558454 561253 564560 568158
58740E68158M112M766N001M762M615M760M865M889N209N748O002O079O701P904
$$ 568158 572270 577036 582037 586799 591414 596174 601039 605928 611137 616885 622887 628966 635667 643571
58726F43571Q735Q595P980P511P155O753O479O469O784P885J0112J2578J3696
$$ 643571 652306 660901 668881 676392 683547 690300 696779 703248 710032 717917 728029 740607 754303
58713G54303J3139J2132J1458J0430Q418O064M107K033j061n030q955j2252j4785
$$ 754303 767442 779574 791032 801462 809880 815944 820051 822084 821023 815993 807038 794786 780001
58700G80001j6521j7750j9090k0650k1738k1762k0878j9371j7294j4970j3019
$$ 780001 763480 745730 726640 705990 684252 662490 641612 622241 604947 589977 576958
58689E76958j1385r369p107n857o168o820o530n595n000m764m351l842l566l188
$$ 576958 565573 556204 549097 543240 537072 530252 523722 518127 513127 508363 504012 500170 496604 493416
58675D93416k228r84K2J009K373L765M713N654P264R237J0842J2275J4198J6115
$$ 493416 491188 490204 490226 491235 493608 497373 502086 507740 515004 524241 535083 547358 561556 577671
58661E77671J6452J4391J0678O450K178j980n535p893r031r560j0169j0918j1200
$$ 577671 594123 608514 619192 625642 627820 625840 620305 612412 603381 593821 583652 572734 561534
58648E61534j0492r099p745o682n721n058n145n585n166l355r48J107K674L827
$$ 561534 551042 541943 534198 527516 521795 516737 511592 506007 500841 497486 496538 497645 500319 504146
58634E04146M289M075L850M014M152L843L258K450J118m04j006l35N69R16J283
$$ 504146 508435 512510 516360 520374 524526 528369 531627 534077 535195 534791 533785 533450 534019 534935 536218
58619E36218K221L008K982K996M134N864O880O981O750O067M522K756J830J542
$$ 536218 538439 541447 544429 547425 551559 557423 564303 571284 578034 584101 588623 591379 593209 594751
58605E94751Q79j85p96r10j463k730l929m505m742m930m947m772m524l949k634
$$ 594751 595630 595445 594649 593739 592276 589546 585617 581112 576370 571440 566493 561721 557197 553248 550614
58590E50614o79J491L733N900P387P918Q397R865J1890J3107J3094J2542J1844
$$ 550614 549935 551426 555159 561059 568446 576364 584761 594626 606516 619623 632717 645259 657103
58577F57103J0770R494Q602P988P001N880N848P439R728J1599J3028J4758J7490
$$ 657103 667873 677367 685969 693957 700958 706838 712686 720125 729853 741452 754480 769238 786728
58564G86728K1489K6259L0447L2772L3226L2742L1684K9422K5444K0101J4105
$$ 786728 808217 834476 864923 897695 930921 963663 995347 1024769 1050213 1070314 1084419
58553A084419Q019K369k351n955q392r440r101q181p747q061q725r708j1470j4124
$$ 1084419 1092438 1094807 1092456 1086501 1078109 1068669 1059568 1051387 1043640 1035579 1026854 1017146 1005676 991552
58539I91552j7198k0186k2686k4144k4237k3472k2591k1546j9735j7152j4431
$$ 991552 974354 954168 931482 907338 883101 859629 837038 815492 795757 778605 764174
58528G64174j1879r265o653m503k878j336K49J423J900J920J753J344N84n16j845
$$ 764174 752295 743030 736377 731874 728996 727660 727909 729332 731232 733152 734905 736249 736833 736317 734472
58513G34472l050l586l397l238l756m530m676m108l495l176k956k798k953l410
$$ 734472 731422 727836 724439 721201 717445 712915 708239 704131 700636 697460 694504 691706 688753 685343
58499F85343l775l680k983j856r98j174k067k261j017P15J771K405L422M593N239
$$ 685343 681568 677888 674905 673049 672051 670877 668810 666549 665532 666247 668018 670423 673845 678438 683677
58484F83677N749P111R267J1320J3065J4954J6846J8089J8628J8671J7509J4130
$$ 683677 689426 696537 705804 717124 730189 745143 761989 780078 798706 817377 834886 849016
58472H49016R002L889k20l706o894r362j0827j1466j1182r657p309n098l235j116
$$ 849016 858018 861907 861687 857981 851087 841725 830898 819432 808250 798593 791284 786186 782951 781835
58458G81835J375L600N326P093R200J1239J2705J3230J2313R695N965J988k018
$$ 781835 783210 786810 792136 799229 808429 819668 832373 845603 857916 867611 873576 875564 873546
58445H73546o033r345j1206j1928j2080j1126q383m908k684k064j703r31l69q2
$$ 873546 867513 858168 846962 835034 822954 811828 803445 798537 795853 793789 792086 791155 790786 790704
58431G90704R72L132N304O614P462Q456R489J0372J1155J1472J0578Q414N674
$$ 790704 791676 794808 800112 806726 814188 822644 832133 842505 853660 865132 875710 884124 889798
58418H89798K757l16l043m730n581o282o700o407o172p209q932r397q183o884
$$ 889798 892555 892239 889196 884466 878885 872603 865903 859496 853324 846115 837183 827786 819603 812719
58404H12719o504o186n091l696k605j640p50k56K62J731L735M576L739K650K355
$$ 812719 806215 800029 794938 791242 788637 786997 786247 785991 786253 787984 791719 796295 800034 802684 805039
58389H05039K206J586J177J516J875J617J363J805K570L163L819M652N155N253
$$ 805039 807245 808831 810008 811524 813399 815016 816379 818184 820754 823917 827736 832388 837543 842796
58375H42796N697O679P302P101O871P304P976Q382Q718R092R138R116J0058J2160
$$ 842796 848493 855172 862474 869575 876446 883750 891726 900108 908826 917918 927056 936172 946230 958390
58361I58390J4113J4714J4068J2820J1295R880Q989Q283P018N361M066K913J108
$$ 958390 972503 987217 1001285 1014105 1025400 1035280 1044269 1052552 1059570 1064931 1068997 1071910 1073018
58348A073018p33r86L30J347J311J619L265N331O948Q736J1203J3475J4802J5736
$$ 1073018 1072285 1071299 1071629 1072976 1074287 1075906 1079171 1084502 1091450 1100186 1111389 1124864 1139666 1155402
58334A155402J6835J7679J8003J8298J8501J7586J5316J2858J0957R042O766M784
$$ 1155402 1172237 1189916 1207919 1226217 1244718 1262304 1277620 1290478 1301435 1310477 1317243 1322027
58322A322027L439K314J551J820K640K740K475L602O192Q212Q803R379J0762J1854
$$ 1322027 1325466 1327780 1329331 1331151 1333791 1336531 1339006 1342608 1348800 1357012 1365815 1375194 1385956 1397810
58308A397810J2191J3114J5189J6989J7677J8288J9269J9400J8418J8049J8925
$$ 1397810 1410001 1423115 1438304 1455293 1472970 1491258 1510527 1529927 1548345 1566394 1585319
58297A585319J9219J7942J6919J7780J9506K0684K1693K2887K3195K2283K1751
$$ 1585319 1604538 1622480 1639399 1657179 1676685 1697369 1719062 1741949 1765144 1787427 1809178
58286A809178K2485K3278K3581K4832K7429K9304K9414K9739L1809L4073L4871
$$ 1809178 1831663 1854941 1878522 1903354 1930783 1960087 1989501 2019240 2051049 2085122 2119993
58275B119993L5155L6134L7029L7367L8620M1361M3666M4517M5859M9100N2597
$$ 2119993 2155148 2191282 2228311 2265678 2304298 2345659 2389325 2433842 2479701 2528801 2581398
58264B581398N4904N7285O0679O3507O4925O6732O9511P0592O8632O6572O6969
$$ 2581398 2636302 2693587 2754266 2817773 2882698 2949430 3018941 3089533 3158165 3224737 3291706
58253C291706O8245O8674P0126P4255P8812Q1627Q4629R0138R6701J02389J08536
$$ 3291706 3359951 3428625 3498751 3573006 3651818 3733445 3818074 3908212 4004913 4107302 4215838
58242D215838J16402J23851J29252J34894J42749J50941J58223J67415J80120
$$ 4215838 4332240 4456091 4585343 4720237 4862986 5013927 5172150 5339565 5519685
58233E519685J92820K02801K13220K27392K43122K57814K74027K94381L16130
$$ 5519685 5712505 5915306 6128526 6355918 6599040 6856854 7130881 7425262 7741392
58224G741392L36809L60012L89463M22614M56313M93336N36834N84250O33522
$$ 7741392 8078201 8438213 8827676 9250290 9706603 10199939 10736773 11321023 11954545
58215A1954545O89139P55092Q28580R08087J000287J111020J237412J377407J538540
$$ 11954545 12643684 13398776 14227356 15135443 16135730 17246750 18484162 19861569 21400109
58206B1400109J728494J947215K199238K503672K881558L345704L915945M631827
$$ 21400109 23128603 25075818 27275056 29778728 32660286 36005990 39921935 44553762
58198D4553762N537616O670554Q079099R835984J2021631J4724621J8080943K2273292
$$ 44553762 50091378 56761932 64841031 74677015 86698646 101423267 119504210 141777502
58190A41777502K7436698L3534570M0218882M6547084N0637482M9839959M1929598
$$ 141777502 169214200 202748770 242967652 289514736 340152218 389992177 431921775
58183D31921775K6799047P196506j2402685k8026576l7816380m2068751m2222061
$$ 431921775 458720822 465917328 453514643 425488067 387671687 345602936 303380875
58176C03380875l9848284l6170886l1989448k7766372k3759339k0127957j6963443
$$ 303380875 263532591 227361705 195372257 167605885 143846546 123718589 106755146
58169A06755146j4278556j2028487j0155607q605443p317983o235819n323483
$$ 106755146 92476590 80448103 70292496 61687053 54369070 48133251 42809768
58162D2809768m562413l930103l399102k951333k577258k263624j995429j766640
$$ 42809768 38247355 34317252 30918150 27966817 25389559 23125935 21130506 19363866
58154A9363866j576097j415348j271878j141415j026221r24085q29413p42516
$$ 19363866 17787769 16372421 15100543 13959128 12932907 12008822 11179409 10436893
58146A0436893o67559o03209n44477m91804m49376m16126l86693l59693l37150
$$ 10436893 9769334 9166125 8621648 8129844 7680468 7264342 6877649 6517956 6180806
58137F180806l17287k95794k73163k53569k37376k21401k05464j92177j81148
$$ 6180806 5863519 5567725 5294562 5040993 4803617 4582216 4376752 4184575 4003427
58128D003427j69583j57847j48567j41089j32389j22693j14817j08707j01827
$$ 4003427 3833844 3675997 3527430 3386341 3253952 3131259 3016442 2907735 2805908
58119B805908r4261q8465q4559q0523p6334p3468p1202o7733o4006o2086o0831
$$ 2805908 2711647 2623182 2538623 2458100 2381766 2308298 2237096 2169363 2105357 2043271 1982440
58108A982440n7628n3385n1240n1146n0277m8131m6737m6276m4884m2562m1205
$$ 1982440 1924812 1871427 1820187 1769041 1718764 1670633 1623896 1577620 1532736 1490174 1448969
58097A448969m0823l9593l7479l6142l5465l3637l0521k7619k5059k1890j8860
$$ 1448969 1408146 1368553 1331074 1294932 1259467 1225830 1195309 1167690 1142631 1120741 1101881
58086A101881j7594j7466j6583j5340j5619j7086j7778j7845j9028k0792k0771
$$ 1101881 1084287 1066821 1050238 1034898 1019279 1002193 984415 966570 947542 926750 905979
58075I05979j9013j8083j8728j8982j7982j7092j6699j5264j2508j0474j0329
$$ 905979 886966 868883 850155 831173 813191 796099 779400 764136 751628 741154 730825
58064G30825j0604r772q311p265o709o504o994q184r498j0560j1239j1062r877
$$ 730825 720221 710449 702138 694873 688164 681660 674666 666482 656984 646424 635185 624123 614246
58051F14246q659q359q532q425q425q919q876p464n945n851o481o378o084o838
$$ 614246 605587 597228 588696 580271 571846 562927 554051 546587 540642 534791 528310 521932 515848 509010
58037E09010p753p134n607n016n090m306l330m188o433p523o973o820p787q272
$$ 509010 501257 494123 488516 483500 478410 474104 470774 466586 460153 452630 445657 438837 431050 422778
58023D22778p616p219p654p561o298n128m890m736l992l238k877k536k264k543
$$ 422778 415162 407943 400289 392728 386430 381302 376412 371676 367684 364446 361569 359033 356769 354226
58009C54226k910k482j817k153k940k510j088n59j136j065Q5O65j3o47o37j048
$$ 354226 351316 348834 347017 344864 341924 339414 338326 337767 336631 335566 335651 336316 336303 335656 335019 333971
57993C33971k031k052p10K82jk65L36O74J36J66J572K559J292j262k955l341l360
$$ 333971 331940 329888 329178 329460 329459 329194 329530 330204 330340 330506 332078 334637 335929 334667 331712 328371 325011
57976C25011l405l343l392l544l111j964j127j182j268o52k6j40m34j76J46j30
$$ 325011 321606 318263 314871 311327 308216 306252 305125 303943 302675 302023 301997 301857 301423 301247 301393 301263
57960C01263n03j74N44Q37O51M15J61k18n27p22j163j834k129j856j591j560j178
$$ 301263 300760 300586 301130 301967 302618 303033 303194 302976 302449 301727 300564 298730 296601 294745 293154 291594 290416
57943B90416k06O95J185J913L319M784N636O150O850P703Q545R480J0257J0154
$$ 290416 290210 290905 292090 294003 297322 302106 307742 313892 320742 328445 336990 346470 356727 366881
57929C66881Q893O954M730K257l2j477k350l580n131n925n702n438n540n177m056
$$ 366881 375774 382728 387458 389715 389683 388206 385856 382276 377145 371220 365518 360080 354540 349363 345307
57914C45307l184l080k790j675o34m86m88K59J145J036kj182k357l820n391o625
$$ 345307 342123 339043 336253 334578 333944 333458 332970 333229 334374 335410 335408 334226 331869 328049 322658 316033
57898C16033p299p099n678l659k496k590k645j710o66o48j162r89p5P37J126J305
$$ 316033 308734 301635 295957 292298 289802 287212 284567 282857 282191 281543 280381 279392 279317 280054 281180 282485
57882B82485J218P67K95k5o15j608k269k143j863k003j981j122N8P34J121J808
$$ 282485 283703 284470 284765 284740 284125 282517 280248 278105 276242 274239 272258 271136 271194 271928 273049 274857
57866B74857K458K418J972J836J907J691J471J901K738L091K689K032J530J352
$$ 274857 277315 279733 281705 283541 285448 287139 288610 290511 293249 296340 299029 301061 302591 303943
57852C03943J685K313K319J173l47j148j401k096l360m310m457m286m344m549
$$ 303943 305628 307941 310260 311433 311086 309938 308537 306441 303081 298771 294314 290028 285684 281135
57838B81135m497m017l361l050l351l758l442k426j618j394j018J2R66J029N97
$$ 281135 276638 272621 269260 266210 262859 259101 255659 253233 251615 250221 249203 249215 250181 251210 251807
57823B51807N18P35P30O94J165J927K255J971J298O0j931l994n141n413n731o469
$$ 251807 252325 253060 253790 254484 255649 257576 259831 261802 263100 263160 261229 257235 252094 246681 240950 234481
57807B34481p010o756n800m552l372k547k122j791j358j136j340j453p86M76J412
$$ 234481 227471 220715 214915 210363 206991 204444 202322 200531 199173 198037 196697 195244 194458 194934 196346
57792A96346J507J103Q27R60J409J938K503L358M614N736O073N922O259P116P283
$$ 196346 197853 198956 199783 200743 202152 204090 206593 209951 214565 220301 226374 232296 238555 245671 252954
57777B52954O130M730M321M426L644J715k51j402j970k599l569m677n408n365
$$ 252954 259084 263814 268135 272561 276205 277920 277669 276267 274297 271698 268129 263452 258044 252679
57763B52679m871m681m813m339k918j729j929k861k884j641l28J60K34O37J345
$$ 252679 247808 243127 238314 233975 231057 229328 227399 224538 221654 220013 219685 219845 220079 220716 222061
57748B22061J784J711J585K148L524M722M505K917J390J028J453J732J654J481
$$ 222061 223845 225556 227141 229289 232813 237535 242040 244957 246347 247375 248828 250560 252214 253695
57734B53695J292J290K027L423M185L198R70j098k492l608m552m983m935m843
$$ 253695 254987 256277 258304 261727 265912 269110 270080 268982 266490 262882 258330 253347 248412 243569
57720B43569m804m638m494m657n004n217n300n308n041m553m426m804m835l923
$$ 243569 238765 234127 229633 224976 219972 214755 209455 204147 199106 194553 190127 185323 180488 176565
57706A76565k886k775l170k827j583m08J72M61O30N24K96K40Q7n63j268j300r52
$$ 176565 173679 170904 167734 164907 163324 162916 163088 163549 164179 164703 164999 165239 165326 164763 163495 162195 161243
57689A61243j180k069k734k707k336j846j125l88NM29J670L665N540O969Q515
$$ 161243 160063 157994 155260 152553 150217 148371 147246 146858 146863 147292 148962 152627 158167 165136 173651
57674A73651J0630J3354J6938K1772K7595L3830M0572M7882N3897N4954M8253
$$ 173651 184281 197635 214573 236345 263940 297770 338342 386224 440121 495075 543328
57663E43328L3902J4439o462k4751l7148m2704m2957m0241l6232l1880k7627k3371
$$ 543328 577230 591669 585207 560456 523308 480604 437647 397406 361174 329294 301667 278296
57651B78296j9031j5315j3048j1758j0038p556n483m597m175l340k366j919j898
$$ 278296 259265 243950 230902 219144 209106 201550 196067 191470 187295 183955 181589 179670 177772
57638A77772j799j548j305j007p02o78q20m87M58J188J006L00j59k84m58p65j081
$$ 177772 175973 174425 173120 172113 171411 170733 169913 169426 169884 171072 172078 172378 172219 171935 171477 170712 169631
57621A69631j493k044k373k188j826j867k406l090l637l980m045l671k765j485
$$ 169631 168138 166094 163721 161533 159707 157840 155434 152344 148707 144727 140682 137011 134246 132761
57607A32761m10k44r96j649j166K30J388J654J255M82o43j736k138j849j619j850
$$ 132761 132351 132107 131111 129462 128296 128526 129914 131568 132823 133305 132662 130926 128788 126939 125320 123470
57591A23470k113k062j938j880j591j086r08j160j169o56m47j248k386k628j802
$$ 123470 121357 119295 117357 115477 113886 112800 111892 110732 109563 108907 108460 107212 104826 102198 100396
57576A00396q56n88r93j643k132k167j712j032m11K9J49k99j280k263k615k114
$$ 100396 99540 98952 97959 96316 94184 92017 90305 89273 88862 88891 89040 88741 87461 85198 82583 80469
57560H0469j057l9L77J53j79j97j17k07o6P72J814K130J749J495J428O69r11k064
$$ 80469 79412 79373 79750 79903 79724 79527 79410 79203 79137 79909 81723 83853 85602 87097 88525 89194 88283 86219
57542H6219j753m46P86J642K385L004L254L055K351J119j94q39p39o31r02j101
$$ 86219 84466 84020 84806 86448 88833 91837 95091 98146 100497 101616 101422 100583 99844 99213 98311 97210
57526I7210r25q19j070j284j270j484j951j737m21R08J192J078J816L190L829
$$ 97210 96285 95466 94396 93112 91842 90358 88407 86670 86249 87157 88349 89427 91243 94433 98262
57511I8262L233K156J223L81k99m62k41k03m90p72j134k050l315l991l692l154
$$ 98262 101495 103651 104874 105255 104956 104494 104253 104050 103560 102788 101654 99604 96289 92298 88606 85452
57495H5452l066l155k880k517k768l537l875l238k272k016k578l074k828k065
$$ 85452 82386 79231 76351 73834 71066 67529 63654 60416 58144 56128 53550 50476 47648 45583
57481D5583j213j85J102J968J666O02r2k29p41j953k817k450j418p53m73J2O13
$$ 45583 44370 44185 45287 47255 48921 49523 49431 49202 48461 46508 43691 41241 39823 39070 38597 38609 39222
57464C9222P27L89K38M73O11L64R3K87R49J618J774J270N84L86P80J214J258J058
$$ 39222 39949 40338 40576 41049 41660 42024 42117 42404 43353 44971 46745 48015 48599 48985 49765 50979 52237 53295
57446E3295Q94Q13R31J445K038J917R80J81K16M39j05j147j587j087l40P4K82
$$ 53295 54189 55002 55933 57378 59416 61333 62313 62494 62710 63149 63044 61897 60310 59223 58883 58957 59239
57429E9239N19P10P57P54P73P41N87L34Q9k8n8l34j021j552j202k34K55o8k49
$$ 59239 59758 60468 61225 61979 62752 63493 64080 64414 64503 64475 64417 64083 63062 61510 60308 60074 60329 60261 60012
57410F0012M12J231J290Q53P48R65Q52K35n74j407k070j980r35J66L49l8N1O90
$$ 60012 60424 61655 62945 63798 64546 65511 66363 66598 66024 64617 62547 60567 59632 59798 60147 60109 60160 60850
57392F0850J006O62K35J20J06J41N46J275J822K006K166K496K809K979K964K450
$$ 60850 61856 62518 62753 62873 62979 63120 63666 64941 66763 68769 70935 73431 76240 79219 82183 84633
57376H4633J185k99j065r59p32r25j286j373j158q25m67p9L79Q79J036L34j006
$$ 84633 85818 85519 84454 83495 82763 81838 80552 79179 78021 77196 76729 76650 77029 77908 78944 79278 78272
57359G8272j890j645q86m23j4Q46J584J363P52J044K104K507J866J359J579J523
$$ 78272 76382 74737 73851 73428 73414 74260 75844 77207 77959 79003 81107 83614 85480 86839 88418 89941
57343H9941M67o28n85J72M25l7m22k56K46P89J209J318J089Q00O01K75k85p54
$$ 89941 90408 89780 89195 89367 89792 89755 89333 89077 89323 90112 91321 92639 93728 94528 95129 95404 95119 94365
57325I4365q64p99p67o11k09K00M59Q13J354J609J146L13j07K69J184K109K546
$$ 94365 93501 92702 91935 91324 91115 91315 91774 92587 93941 95550 96696 97009 96902 97171 98355 100464 103010
57308A03010K269J639J376J812K524K878K644J975J160N89N88J050J537J844K061
$$ 103010 105279 106918 108294 110106 112630 115508 118152 120127 121287 121876 122464 123514 125051 126895 128956
57293A28956K105J700J092J112K130L452M147M097L830L713L716L663L377K873
$$ 128956 131061 132761 133853 134965 137095 140547 144694 148791 152621 156334 160050 163713 167090 169963
57279A69963K626L195M303M799L998K612J903K266L228M332N261N423M314K396
$$ 169963 172589 175784 180087 184886 188884 191496 193399 195665 198893 203225 208486 213909 218223 220619
57265B20619Q63L14K59P5j32J9M21P15R13J253J581J511J232J503K591L735M134
$$ 220619 221482 221796 222055 222130 221998 222017 222438 223153 224066 225319 226900 228411 229643 231146 233737 237472 241606
57248B41606M000M028M207L934L251L039L715M600M937M919N128N605O044O393
$$ 241606 245606 249634 253841 257775 261026 264065 267780 272380 277317 282236 287364 292969 299013 305406
57234C05406O652O494N795N166N280O010O820P653Q666R475R576R270R249R431
$$ 305406 312058 318552 324347 329513 334793 340803 347623 355276 363942 373417 382993 392263 401512 410943
57220D10943R152Q460Q176Q610R156R382R591J0026J0332J0260J0226J0760J1860
$$ 410943 420095 428555 436731 445341 454497 463879 473470 483496 493828 504088 514314 525074 536934
57207E36934J3234J4655J5882J6632J6853J6764J6533J6304J6344J6730J7004
$$ 536934 550168 564823 580705 597337 614190 630954 647487 663791 680135 696865 713869
57196G13869J6755J6353J6399J6617J6256J5386J4808J4581J3860J2436J1341
$$ 713869 730624 746977 763376 779993 796249 811635 826443 841024 854884 867320 878661
57185H78661J1389J2140J2809J3402J4274J5306J6182J6970J7881J8867J9901
$$ 878661 890050 902190 914999 928401 942675 957981 974163 991133 1009014 1027881 1047782
57174A047782K1164K2623K3855K4564K4817K4641K4034K3559K4143K5902K7737
$$ 1047782 1068946 1091569 1115424 1139988 1164805 1189446 1213480 1237039 1261182 1287084 1314821
57163A314821K8513K8157K7413K7115K7823K9465L1082L1620L1142L0589L0333
$$ 1314821 1343334 1371491 1398904 1426019 1453842 1483307 1514389 1546009 1577151 1607740 1638073
57152A638073K9864K9007K8301K7858K7052K5795K4953K4899K4764K3855K2786
$$ 1638073 1667937 1696944 1725245 1753103 1780155 1805950 1830903 1855802 1880566 1904421 1927207
57141A927207K2389K2405K2157K1705K1477K1386K1172K0962K0805K0264J9147
$$ 1927207 1949596 1972001 1994158 2015863 2037340 2058726 2079898 2100860 2121665 2141929 2161076
57130B161076J8008J7407J7329J7813J9267K1606K4044K6346K9267L3006L6419
$$ 2161076 2179084 2196491 2213820 2231633 2250900 2272506 2296550 2322896 2352163 2385169 2421588
57119B421588L8638M0365M2671M5479M8406N1974N6866O2953P0213P9682R2279
$$ 2421588 2460226 2500591 2543262 2588741 2637147 2689121 2745987 2808940 2879153 2958835 3051114
57108C051114J07665J25432J46443J71820K01801K37081K80277L34570M01852
$$ 3051114 3158779 3284211 3430654 3602474 3804275 4041356 4321633 4656203 5058055
57099E058055M83773N83601P05535Q53131J029777J238877J481487J754992K056289
$$ 5058055 5541828 6125429 6830964 7684095 8713872 9952749 11434236 13189228 15245517
57090A5245517K384549K737755L106935L475022L818723M109024M314238M407456
$$ 15245517 17630066 20367821 23474756 26949778 30768501 34877525 39191763 43599219
57082D3599219M365246M148756L691534K931339J877263O47522n71477j615552
$$ 43599219 47964465 52113221 55804755 58736094 60613357 61260879 60689402 59073850
57074E9073850k406253k948323l287998l476992l557161l556560l490285l366346
$$ 59073850 56667597 53719274 50431276 46954284 43397123 39840563 36350278 32983932
57066C2983932l193191k982605k747696k500749k252762k012846j787144j578903
$$ 32983932 29790741 26808136 24060440 21559691 19306929 17294083 15506939 13928036
57058A3928036j389761j220461j070746r39527q25557p27763o45017n75970n19028
$$ 13928036 12538275 11317814 10247068 9307541 8481984 7754221 7109204 6533234 6014206
57049F014206m72091m32320l96696l63026l30391k98751k68322k39477k12810
$$ 6014206 5542115 5109795 4713099 4350073 4019682 3720931 3452609 3213132 3000322
57040C000322j88834j67461j48016j29928j13141r7624q2789o7834n2447l6709
$$ 3000322 2811488 2644027 2496011 2366083 2252942 2155318 2072529 2004695 1952248 1915539
57030A915539k0764n774M629N372o120k6830m9658o8040p9121q3409q2765p9005
$$ 1915539 1894775 1889001 1893630 1899002 1892882 1866052 1816394 1748354 1669233 1585824 1503059 1424054
57018A424054p3488o7125o0581n4518m9400m5149m1250l7385l3788l0876k8713
$$ 1424054 1350566 1283441 1222860 1168342 1118942 1073793 1032543 995158 961370 930494 901781
57007I01781k6886k4942k2871k1160k0264j9947j9425j8233j6726j5463j4383
$$ 901781 874895 849953 827082 805922 785658 765711 746286 728053 711327 695864 681481
56996F81481j2974j1161r517q488p776o754n225l502j792J00K437N055P488R287
$$ 681481 668507 657346 647829 639341 631565 624811 619586 616084 614292 614392 616829 621884 629372 638659
56982F38659J0009Q965N513j44o618j2190j5939j7917j8460j7693j5835j3499
$$ 638659 648668 657633 663146 663002 656384 644194 628255 610338 591878 574185 558350 544851
56970E44851j1458j0057q929p347m937k103L57K190L976O442R657J3153J6493
$$ 544851 533393 523336 514407 507060 502123 500020 500377 502567 506543 512985 522642 535795 552288
56957E52288J9332K0925K0053J5712P930j907j1471j8629k2586k3951k3667k2223
$$ 552288 571620 592545 612598 628310 636240 634333 622862 604233 581647 557696 534029 511806
56945E11806j9942j7370j4818j1965q575n258k750o78K092N928J0146J4277J8762
$$ 511806 491864 474494 459676 447711 439136 433878 431128 430450 432542 438470 448616 462893 481655
56932D81655K3975K9121L2368L1751K6012J5453K328j0175j9832k6143k9434l0074
$$ 481655 505630 534751 567119 598870 624882 640335 642663 632488 612656 586513 557079 527005
56920E27005k8736k6550k4332k2094j9677j7398j5580j3935j2007r947q341p376
$$ 527005 498269 471719 447387 425293 405616 388218 372638 358703 346696 336749 328408 321032
56908C21032o612n557m217l067k560k563k364j474k94L99M80M49M84L38J95Q11
$$ 321032 314420 308863 304646 301579 299019 296456 294092 292618 292324 292723 293203 293652 294136 294474 294669 295480
56892B95480K406M311O136Q519J2102J6465K0658K4007K5560K3625J7246P965
$$ 295480 297886 302197 308333 316852 328954 345419 366077 390084 415644 439269 456515 464480
56880D64480j005p536j1663j4054j4669j3423j1086q651o210l308j19K562M615
$$ 464480 463475 455939 444276 430222 415553 402130 391044 382393 376183 372875 372756 375318 379933
56867C79933P149J1360J7260K3980L1029L8619M6746N4492O0257O2059N7544M4973
$$ 379933 387082 398442 415702 439682 470711 509330 556076 610568 670825 732884 790428 835401
56855H35401K5332L018j6655l0797l9456m3456m3129l9124l3071k6585k0271j4089
$$ 835401 860733 863751 847096 816299 776843 733387 690258 651134 618063 591478 571207 557118
56843E57118p933j415O132J4859K4159L3802M4671N7703P2499Q7281R9274J04510
$$ 557118 549185 547770 553902 568761 592920 626722 671393 729096 801595 888876 988150 1092660
56831A092660R8362P8199M6104Q527k6942n4683p2277q0337q1378p7983p1535
$$ 1092660 1191022 1269221 1315325 1323852 1296910 1242227 1169950 1089613 1008235 930252 858717
56820H58717o2707n2652m2837l3893k5383j6809q135P32J0268K0864L2492M4907
$$ 858717 796010 743358 700521 666628 641245 624436 616301 617033 627301 648165 680657 725564
56808G25564N7515O8543P4677P2202N9035L6215P899k0218m3248n8708o6546o8102
$$ 725564 783079 851622 926299 998501 1057536 1093751 1101650 1081432 1038184 979476 912930 844828
56796H44828o5188n9576n2647m5276l8059l1424k5337j9346j3197p140j242N160
$$ 844828 779640 720064 667417 622141 584082 552658 527321 507975 494778 487638 486396 491556
56784D91556J2615K0556K7707L3272L6819L7149L2387K1770O819r465k4137l5044
$$ 491556 504171 524727 552434 585706 622525 659674 692061 713831 720650 711185 687048 652004
56772F52004m1079m2596m1253l8759l5694l1859k7438k3283k0082j7773j5912
$$ 652004 610925 568329 527076 488317 452623 420764 393326 370043 349961 332188 316276
56761C16276j4252j2758j1301r758q327p434p162p018o432n415m432l708k991
$$ 316276 302024 289266 277965 268207 259880 252446 245284 238266 231834 226419 221987 218279 215288
56748B15288k115j399j278j667k032k066k003k227k679k842k332j393o98o39r95
$$ 215288 213173 211774 210496 208829 206797 204731 202728 200501 197822 194980 192648 191255 190557 189918 188923
56733A88923j312j424j358j022k97O28J394J838J904J451O11J71Q50K197K854
$$ 188923 187611 186187 184829 183807 183510 184138 185532 187370 189274 190725 191336 191507 192357 194554 197408
56718A97408K160Q81J22Q6K53K31K3j97k07N2J87k26q63q73j48L45o1p64q76n14
$$ 197408 199568 200449 200571 200657 200910 201141 201164 200967 200760 200812 200999 200773 199910 199037 198889 199234 199173 198409 197533 197019
56698A97019l85o27r13j249j818k214j799p64j30n82j784k859l107k357j139l39
$$ 197019 196634 196007 195094 193845 192027 189813 188014 187250 187120 186538 184754 181895 178788 176431 175292 174953
56682A74953k44j44O21J563J660Q03j09m43l43K2Q57K116L131L268K583J665J118
$$ 174953 174709 174565 175186 176749 178409 179212 179103 178660 178317 178339 179196 181312 184443 187711 190294 191959 193077
56665A93077J320K201L129L337K712J914J647K009K578K896K841K674K732K922
$$ 193077 194397 196598 199727 203064 205776 207690 209337 211346 213924 216820 219661 222335 225067 227989
56651B27989K746K023J223P77M06l05j028j037l03M55P78Q67Q95O03k35j340k164
$$ 227989 230735 232758 233981 234758 235164 234859 233831 232794 232491 232946 233724 234591 235486 236089 235854 234514 232350
56634B32350k324j735o71K92P65R11R98P85j08j321j952j711j337j585k328k824
$$ 232350 230026 228291 227620 227912 228677 229588 230586 231371 231263 229942 227990 226279 224942 223357 221029 218205
56618B18205k563j674p73n32j091j831k003j555j032p63o61p24j138j771k118
$$ 218205 215642 213968 213195 212663 211572 209741 207738 206183 205151 204388 203727 203003 201865 200094 197976
56603A97976j927j477j015m90kKo58j413j527r55k51J63L46N59R07J335J696J802
$$ 197976 196049 194572 193557 193067 193065 193067 192409 190996 189469 188514 188263 188426 188772 189331 190238 191573 193269 195071
56585A95071J511Q81K55K2K19M43L38P6J23N85J159J650K128K494K420J946J610
$$ 195071 196582 197463 197718 197740 197959 198402 198740 198816 198939 199524 200683 202333 204461 206955 209375 211321 212931
56568B12931J752K214K897L974N201N808N658N776O986Q545R080Q316P027N690
$$ 212931 214683 216897 219794 223768 228969 234777 240435 246211 253197 261742 270822 279138 286165 291855
56554B91855M260K994K393K299K055J541J201J027M75n10j269j429j307j156q37
$$ 291855 296115 299109 301502 303801 305856 307397 308598 309625 310100 309590 308321 306892 305585 304429 303592
56539C03592m74o43j537k575l180l353l259k856k217j760j802k221k687k917k660
$$ 303592 303118 302475 300938 298363 295183 291830 288571 285715 283498 281738 279936 277715 275028 272111 269451
56524B69451j918j176r80j209j293j047q38r41j288j837k579l223l457l451l507
$$ 269451 267533 266357 265377 264168 262875 261828 260990 260049 258761 256924 254345 251122 247665 244214 240707
56509B40707l330k344p44M69N67l21j592k496k328j124lj7p99j262j349j833k629
$$ 240707 237377 235033 234289 234758 235325 235004 233412 230916 228588 227464 227461 227444 226645 225383 224034 222201 219572
56492B19572k699j817j031r74j002n31P0M41R19J608J869J424R71J001J026P46
$$ 219572 216873 215056 214025 213051 212049 211518 211588 212029 212948 214556 216425 217849 218820 219821 220847 221593
56476B21593R01K020L178L088J789L52n16o87j11R49J664J512J068J068J201O65
$$ 221593 222494 224514 227692 230780 232569 232921 232405 231718 231607 232556 234220 235732 236800 237868 239069 239734
56460B39734m04j053q36j44O03J308J764J585P78j32o17n71l05k43n02p07m65
$$ 239734 239330 238277 237441 237297 237900 239208 240972 242557 243335 243203 242586 242015 241710 241467 240965 240258 239793
56443B39793o2j09n65o80j41N34R79J485K120K247J513O05K49K23P4J23Q49J789
$$ 239793 239731 239622 239057 238377 238236 238770 239749 241234 243354 245601 247114 247719 247968 248191 248265 248388 249237 251026
56425B51026K049J605J231J297J455J381J138Q33N07L38M72O45L45o87k211l606
$$ 251026 253075 254680 255911 257208 258663 260044 261182 262015 262522 262860 263332 263977 264322 263635 261424 257818
56409B57818m136l532k403j681j575j661j923k771l861l998k780j345p37m56M60
$$ 257818 253682 250150 247747 246066 244491 242830 240907 238136 234275 230277 227497 226152 225415 224959 225419
56394B25419J791K576K669K714K971L137L111L025K715J878O41n14j217j207m30
$$ 225419 227210 229786 232455 235169 238140 241277 244388 247413 250128 252006 252647 252133 250916 249709 249279
56379B49279M41K29j282k709k631j258J90J060J415J259P23N58J324K373K649
$$ 249279 249720 249949 248667 245958 243327 242069 242259 243319 244734 245993 246716 247274 248598 250971 253620
56364B53620K231K057K337K355J773J099Q11Q68J146J604J955J867J500J285J261
$$ 253620 255851 257908 260245 262600 264373 265472 266283 267151 268297 269901 271856 273723 275223 276508 277769
56349B77769J220J377K178L532M747N223M739L464K127J757K528L288K958J981
$$ 277769 278989 280366 282544 286076 290823 296046 300785 304249 306376 308133 310661 313949 316907 318888
56335C18888J539J797J951J718J585J720J678J291R43Q34Q09R38J405J818J464
$$ 318888 320427 322224 324175 325893 327478 329198 330876 332167 333110 333944 334753 335691 337096 338914 340378
56320C40378L92n26q00q50j130j442j395j010n90l55l18k62J62J031J969K638
$$ 340378 340770 340244 339444 338594 337464 336022 334627 333617 333027 332672 332354 332092 332254 333285 335254 337892
56304C37892L164L690L933L658L257L219L358L222K960L107L668M094M051L653
$$ 337892 341056 344746 348679 352337 355594 358813 362171 365393 368353 371460 375128 379222 383273 386926
56290C86926L117K758L018L937M810M985M784N016N860O771P289P384P287P448
$$ 386926 390043 392801 395819 399756 404566 409551 414335 419351 425211 431982 439271 446655 453942 461390
56276D61390Q231R263R637R266R309J0514J2020J2754J3131J4189J5715J6766
$$ 461390 469621 478884 488521 497787 507096 517610 529630 542384 555515 569704 585419 602185
56264F02185J7513J9063K1536K3891K5743K8005L1469L5922M0886M6251N1951
$$ 602185 619698 638761 660297 684188 709931 737936 769405 805327 846213 892464 944415
56253I44415N7968O4786P2960Q2097R1118R9589J07835J15676J22131J26656J29733
$$ 944415 1002383 1067169 1140129 1222226 1313344 1412933 1520768 1636444 1758575 1885231 2014964
56242B014964J31776J32112J29456J22878J12142R7549P9754N9439L7212J3991
$$ 2014964 2146740 2278852 2408308 2531186 2643328 2740877 2820631 2880070 2917282 2931273
56232B931273q753k9720m8539o5376q0044r2021j01093j07467j11448j13391j13620
$$ 2931273 2922520 2892800 2844261 2778885 2698841 2606820 2505727 2398260 2286812 2173421 2059801
56221B059801j12125j08776j04140r9264r4309q8373q1211p4025o7831o2221n6700
$$ 2059801 1947676 1838900 1734760 1635496 1541187 1452814 1371603 1297578 1229747 1167526 1110826
56210A110826n1983m8690m5910m2481l8718l5412l2210k8533k5072k2593k0243
$$ 1110826 1058843 1010153 964243 921762 883044 847632 815422 786889 761817 739224 718981
56199G18981j7002j3899j2610j2631j2039j0507r242q437p238n958n763o232n742
$$ 718981 701979 688080 675470 662839 650800 640293 631051 622614 615376 609418 603655 597423 591681
56186E91681m331l687m071l827k456j530j854k101j267k28J45M04J000J183N93
$$ 591681 587350 583663 579592 575765 573309 571779 569925 567824 566557 566329 566474 566878 567878 569061 569654
56171E69654K59R03J753K060K339L156M034M486M904N562N972N924N994O458O889
$$ 569654 569913 570816 572569 574629 576968 580124 584158 588644 593548 599110 605082 611006 617000 623458 630347
56156F30347P299Q302R755J0667J0923J1536J2826J3992J5002J7095K0743K4851
$$ 630347 637646 645948 655703 666370 677293 688829 701655 715647 730649 747744 768487 793338
56144G93338K8821L3698M0445M8620N7520O7000P6271Q3411Q6979Q6809Q2723
$$ 793338 822159 855857 896302 944922 1002442 1069442 1145713 1229124 1316103 1402912 1485635
56133A485635P4302O2808N1565M3329L8473L6260L5945L5764L2853K5788J6029
$$ 1485635 1559937 1622745 1674310 1717639 1756112 1792372 1828317 1864081 1896934 1922722 1938751
56122A938751N978l008r967j3757j4669j5433j9109k6712l7387m9611o1447p0919
$$ 1938751 1944729 1941721 1931754 1917997 1903328 1887895 1868786 1842074 1804687 1755076 1693629 1622710
56110A622710p7061p9745p8451p2816o4518n6472m9612m2474l4489k7316k2052
$$ 1622710 1545649 1465904 1387453 1314637 1250119 1193647 1144035 1101561 1067072 1039756 1017704
56099A017704j7587j2994r221p023n332l219j479p20K14K252M367N422O032P046
$$ 1017704 1000117 987123 977902 970879 965547 962328 960849 960129 960343 962595 966962 972384 978416 985462
56085I85462P839P693P293P390P463P096P121P969Q569Q225P969Q681R558R820
$$ 985462 993301 1000994 1008287 1015677 1023140 1030236 1037357 1045326 1053895 1062120 1070089 1078770 1088328 1098148
56071A098148J0189J1293J2325J2724J3421J4977J6266J6410J6307J6805J7159
$$ 1098148 1108337 1119630 1131955 1144679 1158100 1173077 1189343 1205753 1222060 1238865 1256024
56060A256024J6710J6298J6582J6754J6276J6018J6433J6497J5746J5340J5940
$$ 1256024 1272734 1289032 1305614 1322368 1338644 1354662 1371095 1387592 1403338 1418678 1434618
56049A434618J6621J7066J8457K0958K2811K3192K3430K4178K4220K3457K3930
$$ 1434618 1451239 1468305 1486762 1507720 1530531 1553723 1577153 1601331 1625551 1649008 1672938
56038A672938K6278K8285K8713K9352L1340L2866L2619L2256L3183L4237L4736
$$ 1672938 1699216 1727501 1756214 1785566 1816906 1849772 1882391 1914647 1947830 1982067 2016803
56027B016803L6309L9354M1307M1103M1524M4435M7559M8953N0614N4249N7609
$$ 2016803 2053112 2092466 2133773 2174876 2216400 2260835 2308394 2357347 2407961 2462210 2519819
56016B519819N8685N9659O2817O6371O8262P0312P4510P8957Q1709Q4780R0116
$$ 2519819 2578504 2638163 2700980 2767351 2835613 2905925 2980435 3059392 3141101 3225881 3315997
56005C315997R5498R8864J02597J08924J15251J19003J22817J29776J37794J44069
$$ 3315997 3411495 3510359 3612956 3721880 3837131 3956134 4078951 4208727 4346521 4490590
55995D490590J50801J60749J71513J80190J89345K02268K16699K29576K43432
$$ 4490590 4641391 4802140 4973653 5153843 5343188 5545456 5762155 5991731 6235163
55986F235163K61494K81134K99137L18728L44054L72638M00728M31142M68035
$$ 6235163 6496657 6777791 7076928 7395656 7739710 8112348 8513076 8944218 9412253
55977I412253N09216N51647N98952O55202P17470P83341Q59024R50632J055195
$$ 9412253 9921469 10473116 11072068 11727270 12444740 13228081 14087105 15037737 16092932
55968A6092932J170663J306544J473343J670647J898438K170655K504362K907400
$$ 16092932 17263595 18570139 20043482 21714129 23612567 25783222 28287584 31194984
55960C1194984L393215L996925M760441N715680O901121Q379106J0219444J2493524
$$ 31194984 34588199 38585124 43345565 49061245 55962366 64341472 74560916 87054440
55952H7054440J5314006J8846635K3228963K8465310L4339710M0199245M4580375
$$ 87054440 102368446 121215081 144444044 172909354 207249064 247448309 292028684
55945B92028684M5169363L9706924K7570238J0730787o969008k1767831l1617094
$$ 292028684 337198047 376904971 404475209 415205996 408236988 386469157 354852063
55938C54852063l6450043l7385824l5808343l2862046k9322156k5643843k2082746
$$ 354852063 318402020 281016196 245207853 212345807 183023651 157379808 135297062
55931A35297062j8803358j5910048j3432521j1341323r591390q138889o931756
$$ 135297062 116493704 100583656 87151135 75809812 66218422 58079533 51147777
55924E1147777n916847n060284m344107l745986l238982k807344k445230k141519
$$ 51147777 45230930 40170646 35826539 32080553 28841571 26034227 23588997 21447478
55916B1447478j880429j654857j465162j306211j167828j045952r41678q51134
$$ 21447478 19567049 17912192 16447030 15140819 13972991 12927039 11985361 11134227
55908A1134227p67319o90199o24470n68907n17685m70438m31125l98400l66549
$$ 11134227 10366908 9676709 9052239 8483332 7965647 7495209 7064084 6665684 6299135
55899F299135l35024l08047k85633k63458k41096k22267k07269j92684j78107
$$ 6299135 5964111 5656064 5370431 5106973 4865877 4643610 4436341 4243657 4065550
55890D065550j66014j55390j42601j28387j17420j11048j06610j03444j03198
$$ 4065550 3899536 3744146 3601545 3473158 3355738 3244690 3138080 3034636 2931438
55881B931438j04438j03163r8876r4593r0962q5901p9891p6077p4842p3365p0673
$$ 2931438 2827000 2723837 2624961 2530368 2439406 2353505 2273614 2197537 2122695 2049330 1978657
55870A978657o8385o6491o3144n8607n4891n1677m7079m2094l9644l9449l8493
$$ 1978657 1910272 1843781 1780637 1722030 1667139 1615462 1568383 1526289 1486645 1447196 1408703
55859A408703l6389l5535l6050l5364l3052l1388l0645k8439k4438k1422k0818
$$ 1408703 1372314 1336779 1300729 1265365 1232313 1200925 1170280 1141841 1117403 1095981 1075163
55848A075163k1132k1464k2724k4577k4968k3635k2680k2889k2689k1465k0583
$$ 1075163 1054031 1032567 1009843 985266 960298 936663 913983 891094 868405 846940 826357
55837H26357k0431j9600j7750j6316j5702j4637j2869j1697j1298j0347q658p539
$$ 826357 805926 786326 768576 752260 736558 721921 709052 697355 686057 675710 667052 659513
55825F59513p175o405n419n753p337q284q070q138q996r532r555j0092j0792r917
$$ 659513 652338 645933 640514 634761 627424 619140 611070 602932 593936 584404 574849 564757 553965 544048
55811E44048p521n790n533n107l552k010j204p7K072M416O361Q338J0181J0873
$$ 544048 536527 530737 525204 520097 516545 514535 513331 513254 515326 519742 526103 534441 544622 555495
55797E55495J0398R709Q495N434J006k455m090n336o886p533o840o344p060q203
$$ 555495 565893 575602 584097 589531 590537 588082 583992 578656 571770 564237 557397 551053 543993 535790
55783E35790r377j1588j4882j7264j7205j5358j2767r425n573k283M08L898Q284
$$ 535790 526413 514825 499943 482679 465474 450116 437349 427924 422351 420068 420476 424374 432658
55770D32658J1055R882N209q82o724j0982j2504j1680j0564j0490j0715j0183
$$ 432658 443713 453595 458804 457922 451198 440216 427712 416032 405468 394978 384263 374080
55758C74080r122q043o736n253m478m776n372n740o232o642n913m111k972l445
$$ 374080 364958 356915 350179 344926 340448 335672 330300 324560 318328 311686 305773 301662 298690 295245
55744B95245m263l992k993k159j349l23R5q27k380l480m066m470m351l408k285
$$ 295245 290982 286990 283997 281838 280489 280166 280261 279434 277054 273574 269508 265038 260687 257279 254994
55729B54994j775j764j801j967k488l192l904m625m972m362l075k110j665r18
$$ 254994 253219 251455 249654 247687 245199 242007 238103 233478 228506 224144 221069 218959 217294 216376
55715B16376L83J470K108L080M579N511N112L930K593J077k16k59Q38J339J44
$$ 216376 216759 218229 220337 223417 227996 233507 238619 242549 245142 246219 246003 245744 246582 247921 248065
55700B48065j824l437n033p090q680q680p507o315n304m112l001k437k083j325
$$ 248065 246241 242804 237771 230681 222001 213321 205814 199499 194195 190083 187082 184645 182562 181237
55686A81237k82N82J276J883K056J703J500J986K743L148L225L134K536J193n10
$$ 181237 180955 181537 182813 184696 186752 188455 189955 191941 194684 197832 201057 204191 206727 207920 207410
55671B07410k081l307l787l078j732j076j422j543n33R59J925K278K288J933J542
$$ 207410 205329 202022 198235 195157 193425 192349 190927 189384 188851 189810 191735 194013 196301 198234 199776
55656A99776J885K858L320K984L057M118M898M298L153K587K062O23j121k041
$$ 199776 201661 204519 207839 210823 213880 217998 222896 227194 230347 232934 234996 235619 234498 232457
55642B32457k565l842n539o300o007n822o221o534o378o100n768m959l718k661
$$ 232457 229892 226050 220511 214211 208204 202382 196161 189627 183249 177149 171381 166422 162704 160043
55628A60043k034j495q57l31r3j97o57j167j142n87l41r15j704k048k245k675
$$ 160043 158009 156514 155657 155326 155233 155036 154379 153212 152070 151483 151142 150227 148523 146475 144230 141555
55612A41555k750j875p90o91j442j909j679j283r40l63K40J45p29j535j647j319
$$ 141555 138805 136930 136140 135449 134007 132098 130419 129136 128196 127833 128073 128218 127489 125954 124307 122988
55596A22988j087j102j227j418j774k329k691k117m46J194J493Q22Q24J896K511
$$ 122988 121901 120799 119572 118154 116380 114051 111360 109243 108797 109991 111484 112306 113130 115026 117537
55581A17537J667M97K97M85j3n28K85K041L171L462M022M944M928L521J957J276
$$ 117537 119204 119701 119998 120483 120470 119942 120227 122268 125439 128901 132923 137867 142795 146316 148273 149549
55565A49549J022M23l38p81j132j902k986l840m244m504m979n517n432m252k599
$$ 149549 150571 150994 150656 149875 148743 146841 143855 140015 135771 131267 126288 120771 115339 111087 108488
55550A08488j726j947k129j313j01L56Q7P9P75J739K512K937K943K787L103L903
$$ 108488 106762 104815 102686 101373 101272 101628 101715 101794 102569 104308 106820 109757 112700 115487 118590 122493
55534A22493M083K818Q30p38k014l621m916m650l118j988j964k232k244k438k842
$$ 122493 126576 129394 130224 129486 127472 123851 118935 114285 111167 109179 107215 104983 102739 100301 97459
55519I7459k559j261R9P17R25J192J222O76r4o79j163j553j476r37n36m87k20
$$ 97459 94900 93639 93738 94455 95380 96572 97794 98470 98376 97697 96534 94981 93505 92568 92032 91545 91325
55502I1325M99R71O57R1m4L4j67l67M4Q94J400J280J030J143J547J778J441N31
$$ 91325 91824 92795 93452 93543 93499 93533 93366 92999 93043 93937 95337 96617 97647 98790 100337 102115 103556 104087
55484A04087n18j254j666j974k062j662j143j351k379l151k756j610q03o85p54
$$ 104087 103569 102315 100649 98675 96613 94951 93808 92457 90078 86927 84171 82561 81758 81073 80319
55469H0319o18m30m16m75l80l5M73R12J038Q57O96Q21J048Q82J55o34p60q9P12
$$ 80319 79701 79271 78855 78380 78000 77965 78438 79350 80388 81245 81941 82762 83810 84692 84847 84213 83453 83364 84076
55450H4076R22N89K54O6k88p45p59l39l46j143j677q21Q96J983K034J937K119
$$ 84076 84998 85587 85841 85907 85619 84874 84115 83776 83430 82287 80610 79789 80685 82668 84702 86639 88758
55433H8758J916R35q4l34m7P3j42l93n03l83R7P78J069O46jp2O62J711K406K385
$$ 88758 90674 91609 91525 91191 91144 91217 91075 90682 90179 89796 89893 90671 91740 92386 92385 92313 92975 94686 97092 99477
55413I9477J762J040O36M01j43j047j769j873j542j240j184j321j477j421j050
$$ 99477 101239 102279 102915 103316 103173 102126 100357 98484 96942 95702 94518 93197 91720 90299 89249
55398H9249n93l93l77j31M45J004J247J202Q32rj054j584j233n05j05j22j59l1
$$ 89249 88656 88263 87886 87755 88200 89204 90451 91653 92485 92476 91422 89838 88605 88100 87995 87873 87714 87683
55380H7683R7P1r4l42o31q69r37p63m05p2k5k61m34l10j82m50r72j217r96n80
$$ 87683 87780 87851 87757 87415 86784 85915 84978 84215 83810 83738 83713 83452 83018 82708 82526 82076 81104 79887 78891 78311
55360G8311j63K52M82K61j09J18J060J841J648P16j23m66m97m43l83l79m03k24
$$ 78311 78148 78400 78882 79143 79034 79152 80212 82053 83701 84417 84294 83828 83331 82888 82505 82126 81723 81499
55342H1499K92Q60J099J057J115J330J270O34k21n86k21L30L52k51r22j110p78
$$ 81499 81791 82651 83750 84807 85922 87252 88522 89156 88935 88349 88128 88458 88810 88559 87637 86527 85749
55325H5749k35J94K84Kk75M1J034K032K261J647O57j99n28j09O90R38J70q64j101
$$ 85749 85514 85708 85992 85994 85719 85760 86794 88826 91087 92734 93391 93192 92664 92555 93245 94183 94353 93489 92388
55306I2388n59j39k33l62j54J63L34M58N90N42L31K68M37N60N22N18N90N05K49
$$ 92388 91829 91690 91457 91095 90941 91104 91438 91896 92486 93028 93359 93627 94064 94624 95146 95664 96254 96759 97008
55287I7008J02Q4j48o59j059j075q74o96n89o25p95p24p4O91P47K13J38Q88J435
$$ 97008 97110 97194 97046 96387 95328 94253 93379 92683 92094 91469 90674 89950 89876 90567 91314 91527 91665 92553 93988
55268I3988Q54l00q17m01K58N98N46J44m57p70l88L50O09P2p03r89p32n10p19
$$ 93988 94842 94542 93725 93324 93582 94180 94726 94870 94413 93643 93255 93605 94214 94286 93583 92594 91862 91352 90633
55249I0633r99o77J79O31J42n41m17K49L80j12j70O11J295J120N94M41M72L27
$$ 90633 89634 88957 89136 89767 89909 89368 88951 89200 89580 89468 89298 89909 91204 92324 92918 93359 93831 94158
55231I4158L81Q89J114L53p05q89l45k15p73j078n73K13P09J067J518J756J434
$$ 94158 94539 95428 96542 96895 96190 95301 94956 94741 93968 92890 92317 92530 93239 94306 95824 97580 99014
55214I9014P20Jn56r46j179j330j410j216o42j01q1l47k20L18N06K4m48l09lk70
$$ 99014 99734 99735 99179 98233 97054 95724 94314 93098 92456 92355 92274 91927 91707 92025 92531 92555 92107 91798 91795 91525
55194I1525q89r49j99N96P41M63L63M85L78q4m15k51K0k64j037j443r12M3M17
$$ 91525 90636 89687 89488 90084 90825 91288 91651 92136 92514 92430 92015 91764 91784 91520 90483 89040 88128 88171 88588
55175H8588o1o40m96L33J009P92k34j285j618j199n88k21L3N17J145J431J124
$$ 88588 88527 87887 87391 87724 88733 89525 89291 88006 86388 85189 84601 84380 84413 84930 86075 87506 88630
55158H8630O35N38P78O43k15j049p90M63J278O18p84j317m85P06J232J161J099
$$ 88630 89265 89803 90581 91224 91009 89960 89170 89633 90911 91529 90745 89428 88943 89649 90881 92042 93141
55141I3141J231J279J021M65j57m62k58Ll49j164j400n13O68R77M08l0K44P98
$$ 93141 94372 95651 96672 97137 96980 96518 96260 96263 95914 94750 93350 92837 93505 94482 94890 94860 95104 95902
55123I5902R98P67M43K78K49K01L3j30o2K28M05K53l9k11l38n60o11j15P10J082
$$ 95902 96900 97667 98110 98388 98637 98838 98871 98741 98679 98907 99312 99565 99526 99315 98977 98417 97806 97691 98401 99483
55103I9483N40m77j110r84m27O3L76O86J024J166J037Q79Q69P64L13j85j37N03
$$ 99483 100023 99546 98436 97452 97025 97088 97464 98150 99174 100340 101377 102256 103125 103889 104202 104017 103880 104383
55085A04383J137J276R61M40j23m57k34M22R28J006J013J276J540J403Q90K38
$$ 104383 105520 106796 107757 108197 108074 107617 107383 107805 108733 109739 110752 112028 113568 114971 115861 116099
55069A16099n50j412j856j405l10N78N97k14j227j679j276n44l05o23o66P1R27
$$ 116099 115549 114137 112281 110876 110566 111144 111741 111527 110300 108621 107345 106801 106496 105873 105207 105278 106205
55052A06205R20M9p87r78p24m92m96p06r74j062q04k82K68O50O91K71m54j024
$$ 106205 107125 107174 106387 105409 104685 104193 103697 102991 102017 100955 100151 99869 100137 100787 101478 101749 101295 100271
55034A00271j132r03n95k96m1L2j11k91m10n07m35J04R79J592J641J461J319R40
$$ 100271 99139 98236 97641 97345 97304 97336 97225 96934 96524 96017 95582 95686 96665 98257 99898 101359 102678 103618
55016A03618K27k18Q6O22M79m23j303j513j008j47N36O16K63J55M96O71K57k37
$$ 103618 103845 103627 103713 104335 104814 104391 103088 101575 100567 100420 100956 101572 101835 101990 102486 103157 103414 103177
54998A03177k37j9M4M06J417K112J289m81j319n36O49J058R17Q60P61K61m10p86
$$ 103177 102940 102921 102965 103371 104788 106900 108189 107708 106389 105853 106502 107560 108477 109337 110098 110359 109949 109163
54980A09163p79n15k7M73N91L47L22Q26J455J753J791J764J510Q69J14l52m33
$$ 109163 108384 107869 107842 108315 108906 109253 109575 110401 111856 113609 115400 117164 118674 119543 119657 119305 118872
54963A18872k12K16N85M84j06o50o62k04L60P30O68L1r32j677j920j825j585j182
$$ 118872 118660 118876 119461 119945 119839 119189 118527 118323 118683 119413 120081 120112 119180 117503 115583 113758 112173 110991
54945A10991o95l42j14K13N68N99L67M14R17J299J074N54L41M93O55O63O26O68
$$ 110991 110296 109954 109840 110053 110621 111220 111587 112001 112918 114217 115291 115845 116186 116679 117334 117997 118623 119291
54927A19291R42J667K787L844M438M634M691M628M356L961L587L164K476J374
$$ 119291 120233 121900 124687 128531 132969 137603 142294 146922 151278 155239 158826 161990 164466 165840
54913A65840j66j953l530m405m491m065l392k643k160k251k681k860k625k295
$$ 165840 165674 163721 160191 155786 151295 147230 143838 141195 139035 136784 134103 131243 128618 126323
54899A26323j957j372p44p16j223j228j87R74J130N71L71O55N86q6n47k14M71
$$ 126323 124366 122994 122250 121534 120311 119083 118896 119870 121000 121571 121942 122597 123183 123097 122550 122336 122807
54882A22807R42J476K643M223N298N319M688M168M049L977L499K507J152m55k192
$$ 122807 123749 125225 127868 132091 137389 142708 147396 151564 155613 159590 163089 165596 166748 166293 164101
54867A64101l654m299m015l337k903k841k867k809k741k712k560k142j562j068
$$ 164101 160447 156148 152133 148796 145893 143052 140185 137376 134635 131923 129363 127221 125659 124591
54853A24591p81o16n32o47r78j138p15J3K30l60j055j177j013j183j518j404r32
$$ 124591 123810 123194 122662 122015 121037 119899 119184 119197 119427 119067 118012 116835 115822 114639 113121 111717 110785
54836A10785p82j003q72j76M01M07K35J94j17q46j166l63R21J430R93N96R00J451
$$ 110785 110003 109000 108128 107952 108353 108760 108995 109189 109072 108226 107060 106697 107618 109048 110041 110637 111537 112988
54818A12988J408M99q42j900k161j633p64N3P45J277J447J214R27R05J056J110
$$ 112988 114396 114895 114053 112153 109992 108359 107595 107648 108393 109670 111117 112331 113258 114163 115219 116329
54802A16329R74O52J14n04r11j100j314j430q96L17J305J322P23L04J84M1k2L04
$$ 116329 117303 117955 118069 117565 116654 115554 114240 112810 111914 112231 113536 114858 115581 115885 116069 116110 116088 116392
54784A16392P86R68J028J465K038J913R63R3J30R57J953K676K986K967K943L179
$$ 116392 117178 118146 119174 120639 122677 124590 125553 125646 125776 126733 128686 131362 134348 137315 140258 143437
54768A43437L472L487L427L845M733N381N210M215K530L23j744k740k616k517
$$ 143437 146909 150396 153823 157668 162401 167782 172992 177207 179737 180060 178316 175576 172960 170443
54754A70443l396m737n256m519l283k455k277k530k909l074k728j958j265j033
$$ 170443 167047 162310 157054 152535 149252 146797 144520 141990 139081 136007 133279 131321 130056 129023
54740A29023j083r15l95P8P7l04n60l16L59J115J595J608J289J146J612K525L281
$$ 129023 127940 127025 126630 126708 126785 126481 125921 125605 125964 127079 128674 130282 131571 132717 134329 136854 140135
54723A40135L575L710M004M337M453M290L742K534P92o92j359j776k934m761o069
$$ 140135 143710 147420 151424 155761 160214 164504 168246 170780 171572 170880 169521 167745 164811 160050 153981
54708A53981n956m731l307k346k087k455k939k842j987r12j97J58M23O02N16K24
$$ 153981 148025 143294 139987 137641 135554 133099 130160 127318 125331 124419 124222 124380 124803 125405 125921 126145
54692A26145m4k98q03j599k232k128j217p6O20P19N38K44l65j307k011j840r20
$$ 126145 126101 125803 125000 123401 121169 119041 117824 117748 118368 119087 119625 119869 119504 118197 116186 114346 113426
54675A13426k2L09K29J92M13Q11J195J374J247Q67M25J95M43J144J757J648Q80
$$ 113426 113404 113713 113942 114134 114547 115358 116553 117927 119174 120041 120466 120661 121104 122248 124005 125653 126533
54658A26533K06M0m8m36o55k02M00K59l81m14L53Q05J86q06j132p93m80m13k95
$$ 126533 126739 126779 126731 126295 125640 125438 125838 126097 125716 125302 125655 126460 126646 125840 124708 123915 123435 123022 122727
54639A22727k2J65J19j19m63p17n41R5P22R41Q91Q77P96M23p0l02k91l11l66k21
$$ 122727 122705 122870 122989 122870 122407 121690 121149 121244 121966 122907 123798 124675 125471 125894 125824 125522 125231 124920 124554 124333
54619A24333P9K16J09MR0L94R54J687K104J671N38n28j091j376j561j317m96K18
$$ 124333 124412 124628 124737 124741 124831 125225 126179 127866 129970 131641 132179 131651 130560 129184 127623 126306 125810 126028
54601A26028L9p51j064n02J26k5o27p18p1N61N17K3k50lM94P79N94J11j04L48
$$ 126028 126067 125316 124252 123750 123876 123851 123224 122506 122435 122996 123513 123536 123286 123283 123777 124556 125150 125261 125157 125505
54581A25505J092J300P64K07K35M65K17l40m73p3J88l5k31J59R21J348R81m3j035
$$ 125505 126597 127897 128661 128868 129103 129568 129785 129445 128972 128899 129087 129052 128821 128980 129901 131249 132230 132187 131152
54562A31152j156j91R99J273N54k10m17m76q27j141r29l13L69J155J967K175J403
$$ 131152 129996 129805 130804 132077 132631 132421 132004 131528 130701 129560 128631 128318 128687 129842 131809 133984 135387
54545A35387L96J82O47Q52N99P00J557K463K646K271J907J624J059Q2j029j843
$$ 135387 135783 135965 136612 137464 138063 138763 140320 142783 145429 147700 149607 151231 152290 152372 151343 149500
54529A49500j971j319l57J41n8m17m22k62l97q33j207j360j350j107n64nJ49r2
$$ 149500 147529 146210 145853 145994 145936 145519 145097 144835 144438 143605 142398 141038 139688 138581 138017 138012 138161 138069
54511A38069k97k49j57k09k73j71NL0j50m33o30m95Q2Q34J201Q89J65m64p42o85
$$ 138069 137772 137523 137366 137157 136884 136713 136718 136748 136598 136165 135535 135040 135122 135956 137157 138046 138211 137747 137005 136320
54491A36320m10n6K06L15M09N87P57Q75J104J500J697J292N32J85N86J122R58
$$ 136320 135910 135854 136060 136375 136784 137371 138128 139003 140107 141607 143304 144596 145128 145313 145899 147021 147979
54474A47979N1p65o80K80J352J828J703J539J667J693R86m23j708k057j417l41
$$ 147979 148030 147265 146585 146865 148217 150045 151748 153287 154954 156647 157633 157210 155502 153445 152028 151687
54458A51687N94J072R92M63j76n37m97k69k07n38j166j697j739j235m69K46P04
$$ 151687 152281 153353 154345 154808 154632 154095 153598 153329 153122 152584 151418 149721 147982 146747 146278 146524 147228
54441A47228P89N04J22n3o8j88l53j97K48L64k19j007j240q35k89Q7L34M81N31
$$ 147228 148017 148521 148643 148590 148522 148334 147981 147784 148032 148396 148177 147170 145930 145095 144806 144893 145227 145708 146239
54422A46239P07J174J543J242L95j88j9M97O73L39j56m29l39QL55M87M84N71P87
$$ 146239 146946 148120 149663 150905 151300 151112 151093 151590 152263 152602 152446 152017 151678 151686 152041 152528 153012 153583 154370
54403A54370R50R55Q52O70M12K06K38M64O82P80O96K85l63p00l38K33J81m38p18
$$ 154370 155320 156275 157127 157797 158209 158415 158653 159117 159799 160579 161275 161560 161197 160497 160159 160392 160573 160135 159417
54384A59417k82J68L6k65j21K29J89j30j48J88M01L93N56R65J132P63K37L3J43
$$ 159417 159135 159303 159339 159074 158953 159182 159371 159241 159093 159281 159682 160075 160631 161596 162728 163491 163728 163761 163904
54365A63904K82L93O00Q76J086J303J813K676L443L505K791J922J543J571J441
$$ 163904 164186 164579 165179 166055 167141 168444 170257 172933 176376 179881 182672 184594 186137 187708 189149
54350A89149R57N08L11k0q43j861k535k855l162l450l373k908k430k131j899j788
$$ 189149 190106 190614 190925 190905 190062 188201 185666 182811 179649 176199 172826 169918 167488 165357 163458 161670
54334A61670k041k450k311j364l30J2j57r8K63K90k71q07p60m48m63o83m68K52
$$ 161670 159629 157179 154868 153504 153174 153186 153029 152931 153194 153484 153213 152406 151646 151198 150735 150052 149584 149836
54316A49836P50N45Q5nJ18j36p02q30k65K65J65o9M16J410J779J011j13o71p68
$$ 149836 150586 151131 151216 151211 151329 151193 150491 149661 149396 149661 149826 149757 150173 151583 153362 154373 154260 153589 152821
54297A52821j012j368j261o48j60r6pM04O03O2o89n72N33J519J368K34r83j580
$$ 152821 151809 150441 149180 148532 148372 148276 148269 148673 149276 149338 148649 148077 148610 150129 151497 151731 150748 149168
54279A49168j372n56L44O76K66l34n12l09k18m03n22k09N45J465K162K317J956
$$ 149168 147796 147240 147584 148260 148526 148192 147680 147371 147153 146750 146228 146019 146564 148029 150191 152508 154464
54262A54464J540J471J662J700J397R27M86R5k82o26q92j033j048j007r01m53
$$ 154464 156004 157475 159137 160837 162234 163161 163647 163742 163460 162834 161942 160909 159861 158854 157953 157500
54246A57500N21J531J680P38m83j183j414j530j425r63o31q92j358j373j000n94
$$ 157500 158021 159552 161232 161970 161487 160304 158890 157360 155935 154972 154341 153449 152091 150718 149718 149124
54230A49124J29J427K371J733n6j259j239j013j149p80N90J842J785Q59J94K8
$$ 149124 149253 150680 153051 154784 154728 153469 152230 151217 150068 149288 149878 151720 153505 154364 154558 154586
54214A54586O1M40J180J400M54q09j083m51l6k17m45m35l05J39R94J348K42j515
$$ 154586 154647 155087 156267 157667 158121 157312 156229 155778 155742 155525 155080 154645 154340 154479 155473 156821 157063 155548
54196A55548j959o26Q18R89M31K41L17m9p00q66m11O0J39K5k0q1m06r87j404j145
$$ 155548 153589 152963 153781 154770 155201 155442 155759 155710 155010 154144 153733 153793 153932 153957 153937 153856 153450 152463 151059 149914
54176A49914k91L34Q1o25q78o23n80q77o79M05J476J467N10m22p36m64K28J058
$$ 149914 149623 149957 150038 149413 148535 147912 147332 146455 145776 146181 147657 149124 149634 149212 148476 148012 148240 149298
54158A49298J501J253O85L41J79j53n31m92k6L43L49K35J92N2k18k47J88O91O82
$$ 149298 150799 152052 152737 153078 153257 153104 152573 152081 152055 152398 152747 152982 153174 153226 153008 152761 152949 153640 154322
54139A54322J52l68n20m00j94J59P20J231J349J036M94j60p92r34j70J029J499
$$ 154322 154474 154106 153586 153186 152992 153151 153871 155102 156451 157487 157981 157821 157029 156095 155925 156954 158453
54122A58453Q21J3K61J375K195K208J890J594J111M95L16O51O66j89j202j348
$$ 158453 159274 159287 159548 160923 163118 165326 167216 168810 169921 170416 170732 171383 172049 171860 170658 169310
54106A69310p09k16k99n84p70r57j089q13j01N69R14J173J455J334N88j16PO39
$$ 169310 168601 168385 168086 167502 166732 165775 164686 163873 163772 164341 165255 166428 167883 169217 169805 169689 169696 170335
54088A70335P01k0m44K68J470J949J602J365J670J975J967K201L184M489N446
$$ 170335 171036 171016 170572 170840 172310 174259 175861 177226 178896 180871 182838 185039 188223 192712 198158
54073A98158O010O340N983M422K091lj557l037m481n170m734l852l412l493l502
$$ 198158 204168 210508 216491 220913 223004 223001 221444 218407 213926 208756 204022 200170 196758 193265 189763
54058A89763k976j904o67J89L55J34J17M32O86P22Q84J427K094K522K656K582
$$ 189763 186787 184883 184216 184405 184760 184894 185011 185443 186129 186851 187735 189162 191256 193778 196434 199016
54042A99016K404K467L119M058M451M108L893M547N580O008N710N368N319N218
$$ 199016 201420 203887 207006 211064 215515 219623 223516 228063 233643 239651 245361 250729 256048 261266
54028B61266M802M277L836L302K489J575R54Q01R32R59O03n1o26q70q27n92m2
$$ 261266 266068 270345 274181 277483 279972 281547 282501 283302 284234 285193 285796 285745 285119 284249 283422 282830 282788
54011B82788R31K046K661K221P19j196k689l537m305n429o399o358n460m760m751
$$ 282788 283719 285765 288426 290647 291366 290170 287481 283944 279639 274210 267811 261453 255993 251233 246482
53996B46482m792m351l918m047m294l861k927k358k450k718k761k570k126j425
$$ 246482 241690 237339 233421 229374 225080 221219 218292 215934 213484 210766 208005 205435 203309 201884
53982B01884q71r45j434j630j347j110j256j450j245o10J82P98R00M70R9M01J111
$$ 201884 201013 200068 198634 197004 195657 194547 193291 191841 190596 189986 190168 190966 191866 192336 192435 192836 193947
53965A93947J344Q68L39J85J8l79l31P26K087K533J969J511J896K608K725K071
$$ 193947 195291 196159 196498 196683 196701 196322 195991 196717 198804 201337 203306 204817 206713 209321 212046 214117
53949B14117J208P30R51J915L253M169M045L196K704L380N035O808P971Q296P972
$$ 214117 215325 216055 217006 218921 222174 226343 230388 233584 236288 239668 244703 251511 259482 267778 275750
53934B75750P530P723R018J1193J3669J6225J8925K1220K1640J8811J2718M872
$$ 275750 283280 291003 300021 311214 324883 341108 360033 381253 402893 421704 434422 439294
53922D39294k541p657r680r255p878o579n220l300j082N72J275J412J389J152
$$ 439294 436753 429096 419416 410161 402283 395704 390484 387184 386102 386674 387949 389361 390750 391902
53908C91902O22J13m8k4l50j271k394l025k954k784l276m331n065n047m937n475
$$ 391902 392524 392637 392589 392565 392215 390944 388550 385525 382571 379787 376511 372180 367115 362068 357131 351656
53892C51656o306o518o001n482n356n404n578o132o756o616n658m949n107n234
$$ 351656 345350 338832 332831 327349 321993 316589 311011 304879 298123 291507 285849 280900 275793 270559
53878B70559m273k708j991k569l569m206m474m427l773k574j520j133j249j660
$$ 270559 266286 263578 261587 259018 255449 251243 246769 242342 238569 235995 234475 233342 232093 230433
53864B30433k571l912m796m397l059j864j266q70m30k77o02r94j021p69n08k75
$$ 230433 227862 223950 219154 214757 211698 209834 208568 207698 207268 206991 206389 205395 204374 203605 203097 202822
53848B02822j40l87r88j264o64L96J018R36N59J21m70r59p76N4P13O48K02j18
$$ 202822 202682 202295 201307 200043 199379 199775 200793 201729 202288 202409 201939 200980 200204 200258 200971 201619 201821 201703
53830B01703l96q64j227j067n41q0K73O98J014R57Q19J116J678J799J397J279
$$ 201703 201307 200443 199216 198149 197608 197528 197801 198499 199513 200470 201289 202405 204083 205882 207279 208558
53814B08558J937K679K490J507R97J859L516M574M398L698L483L825M080M072
$$ 208558 210495 213174 215664 217171 218168 220027 223543 228117 232515 236213 239696 243521 247601 251673
53800B51673M276M821N052M537L788L430L251K792K337K366K431J636J46p85n19
$$ 251673 255949 260770 265822 270359 274147 277577 280828 283620 285957 288323 290754 292390 292536 291751 291232
53785B91232J95L62j85j107k181l115l480l348l458m256n205n530n155m467l635
$$ 291232 291427 291789 291604 290497 288316 285201 281721 278373 274915 270659 265454 259924 254769 250302 246667
53770B46667k751k260k535l171l290k603j735j458j863k350k292j670j105j175
$$ 246667 243916 241656 239121 235950 232660 230057 228322 226864 225001 222651 220359 218689 217584 216409
53756B16409j727k098j951j529j069n73k26m57j208j696j401q26p06q97o63J55
$$ 216409 214682 212584 210633 209104 208035 207462 207236 206779 205571 203875 202474 201648 200942 200045 199382 199537
53740A99537R56J258J197J076R53P50M19m8n23p00m30L0M63J081K047K780K456
$$ 199537 200493 201751 202948 204024 204977 205727 206146 206098 205575 204875 204445 204475 204938 206019 208066 210846 213302
53723B13302J239L35M94J060R52J65k67L12J354J814J339M81j0J85J013K315L690
$$ 213302 214541 214876 215370 216430 217382 217547 217280 217592 218946 220760 222099 222580 222570 222755 223768 226083 229773
53706B29773M391L879K635J923K470L650M275L931L178K679K615K891L336L595
$$ 229773 234164 238043 240678 242601 245071 248721 252996 256927 260105 262784 265399 268290 271626 275221
53692B75221L249K290J212M46l6m14n90m18j43k13o82j101j130r26p66n77k21
$$ 275221 278470 280760 281972 282418 282382 281968 281378 280960 280817 280604 279922 278821 277691 276765 275999 275422 275201
53675B75201K8j78n23k63N86R34M1j309j766j203o79p77r40o64l27l99n95m06
$$ 275201 275229 275051 274528 274265 274851 275785 275826 274517 272751 271548 270869 270092 269152 268488 268161 267762 267167 266761
53657B66761J00N49Q73J138J146Q35N92N75K08r07j985j847n80M86M89p5l05K0
$$ 266761 266861 267410 268283 269421 270567 271402 271994 272569 272777 271870 269885 268038 267458 267944 268433 268358 268053 268073
53639B68073N59R75J084Q77O49P86J246J635J850K162K578K610J974J100O83R36
$$ 268073 268632 269607 270691 271568 272217 273003 274249 275884 277734 279896 282474 285084 287058 288158 288841 289777
53623B89777J522J991K113K048K237K945L867M472M684M839M993M831M356M078
$$ 289777 291299 293290 295403 297451 299688 302633 306500 310972 315656 320495 325488 330319 334675 338753
53609C38753M282M598M686M812N355O056O281N815M935L873K639J350L48j07j51
$$ 338753 343035 347633 352319 357131 362486 368542 374823 380638 385573 389446 392085 393435 393783 393676 393525
53594C93525k66r64k306l700m331l951l097k426k071j755j263o90l72o90j656
$$ 393525 393259 392295 389989 386289 381958 378007 374910 372484 370413 368658 367395 366705 366333 365643 363987
53579C63987k627k766j958r37l57k04k52n66j146j520j260n97K0O45J529K325
$$ 363987 361360 358594 356636 355699 355342 355138 354886 354320 353174 351654 350394 349797 349817 350462 351991 354316
53563C54316K352J596Q07M98M61L25P0k03n18p78p07l07O8K61N97J285J945K075
$$ 354316 356668 358264 359071 359569 360030 360355 360425 360222 359704 358926 358219 357912 357980 358241 358838 360123 362068 364143
53545C64143J772J522J521J574J656K045K865L818M542M986N337N708O093O485
$$ 364143 365915 367437 368958 370532 372188 374233 377098 380916 385458 390444 395781 401489 407582 414067
53531D14067O909P319P616P825Q141Q695R320R660R666R809J0648J2099J3328
$$ 414067 420976 428295 435911 443736 451877 460572 469892 479552 489218 499027 509675 521774 535102
53518E35102J3543J2852J2244J2720J4496J6985J9335K0998K1917K2411K2800
$$ 535102 548645 561497 573741 586461 600957 617942 637277 658275 680192 702603 725403
53507G25403K3004K2585K1320J9727J8777J8928J9687K0225K0217J9849J9201
$$ 725403 748407 770992 792312 812039 830816 849744 869431 889656 909873 929722 948923
53496I48923J8165J6900J5986J5887J6488J7330J8014J8256J7886J7113J6549
$$ 948923 967088 983988 999974 1015861 1032349 1049679 1067693 1085949 1103835 1120948 1137497
53485A137497J6602J6963J6992J6523J5980J5701J5520J5037J4095J2886J1745
$$ 1137497 1154099 1171062 1188054 1204577 1220557 1236258 1251778 1266815 1280910 1293796 1305541
53474A305541J0863J0053Q840O968M664K246m18l591o911r488j0929j1780j2700
$$ 1305541 1316404 1326457 1335297 1342265 1346929 1349175 1348757 1345166 1338255 1328767 1317838 1306058 1293358
53461A293358j3600j4010j3986j4076j4556j5211j5836j6480j7113j7559j7851
$$ 1293358 1279758 1265748 1251762 1237686 1223130 1207919 1192083 1175603 1158490 1140931 1123080
53450A123080j8244j8654j8602j7997j7527j7742j8095j7540j5903j4036j2529
$$ 1123080 1104836 1086182 1067580 1049583 1032056 1014314 996219 978679 962776 948740 936211
53439I36211j1013q993o798n149m179l422k596j880j376p97J38J328K513L644
$$ 936211 925198 916205 909407 904258 900079 896657 894061 892181 890805 890008 890146 891474 893987 897631
53425H97631M870O218P550Q794J0106J1664J3344J4732J5575J6130J6871J7853
$$ 897631 902501 908719 916269 925063 935169 946833 960177 974909 990484 1006614 1023485 1041338
53413A041338J8781J9648K0851K2429K3716K4252K4689K6091K8570L1231L3404
$$ 1041338 1060119 1079767 1100618 1123047 1146763 1171015 1195704 1221795 1250365 1281596 1315000
53402A315000L5217L7005L8915M1199M4026M6754M8221M8251M8118M8911N0124
$$ 1315000 1350217 1387222 1426137 1467336 1511362 1558116 1606337 1654588 1702706 1751617 1801741
53391A801741N0616N0408N0491N1162N1534N0784M9044M6856M4447M1844L9255
$$ 1801741 1852357 1902765 1953256 2004418 2055952 2106736 2155780 2202636 2247083 2288927 2328182
53380B328182L6909L4726L2300K9235K5538K1823J8838J6525J3853R945N042j64
$$ 2328182 2365091 2399817 2432117 2461352 2486890 2508713 2527551 2544076 2557929 2567874 2572916 2572752
53368B572752n773j2400j9830k6864l2673l7486m1679m4970m6941m7799m8084
$$ 2572752 2566979 2554579 2534749 2507885 2475212 2437726 2396047 2351077 2304136 2256337 2208253
53357B208253m8168m8311m8730m9087m8394m6019m2596l9442l7299l6052l5422
$$ 2208253 2160085 2111774 2063044 2013957 1965563 1919544 1876948 1837506 1800207 1764155 1728733
53346A728733l5374l5875l6609l7071l6898l6153l5336l4796l4113l2517k9970
$$ 1728733 1693359 1657484 1620875 1583804 1546906 1510753 1475417 1440621 1406508 1373991 1344021
53335A344021k7303k5035k2743k0039j7488j5811j4718j3417j2015j1457j2056
$$ 1344021 1316718 1291683 1268940 1248901 1231413 1215602 1200884 1187467 1175452 1163995 1151939
53324A151939j2933j3148j2713j2130j1562j0850j0031r352q934q609q045o949
$$ 1151939 1139006 1125858 1113145 1101015 1089453 1078603 1068572 1059220 1050286 1041677 1033632 1026683
53312A026683n239l168j194K68J096J553K173L316M790O160P457R148J1250J3104
$$ 1026683 1021444 1018276 1017082 1017350 1018446 1019999 1022172 1025488 1030278 1036438 1043895 1053043 1064293 1077397
53298A077397J4379J5681J7569J9594K1092K2371K4158K6140K7204K7040K6384
$$ 1077397 1091776 1107457 1125026 1144620 1165712 1188083 1212241 1238381 1265585 1292625 1319009
53287A319009K5587K4153K1971J9886J8492J7307J5742J4008J2390J0407P545
$$ 1319009 1344596 1368749 1390720 1410606 1429098 1446405 1462147 1476155 1488545 1498952 1506497
53276A506497M269J393j041l501n966q000r604j1195j2906j4621j6528j8918k1471
$$ 1506497 1510766 1512159 1511118 1507617 1501651 1493651 1484047 1472852 1459946 1445325 1428797 1409879 1388408
53263A388408k3428k4497k5016k5295k5407k5542k5949k6425k6493k6159k5924
$$ 1388408 1364980 1340483 1315467 1290172 1264765 1239223 1213274 1186849 1160356 1134197 1108273
53252A108273k5870k5391k4056k2352k1162k0863k1202k1729k2110k2172k1988
$$ 1108273 1082403 1057012 1032956 1010604 989442 968579 947377 925648 903538 881366 859378
53241H59378k1832k1901k2036k1789k0793j9137j7405j6199j5540j4878j3770
$$ 859378 837546 815645 793609 771820 751027 731890 714485 698286 682746 667868 654098
53230F54098j2315j0832r451q282p584p372p230o967p068p962r190r975j0378
$$ 654098 641783 630951 621500 613218 605634 598262 591032 584065 576997 569035 559845 549870 539492
53217E39492j1042j2013j2669j2821j2919j3010j2450j0973r237p896o885o074
$$ 539492 528450 516437 503768 490947 478028 465018 452568 441595 432358 424462 417577 411503
53205D11503n801o122o280n644m739m546n176n906o215o102n628m940m553m853
$$ 411503 405702 399580 393300 387656 382917 378371 373195 367289 361074 354972 349344 344404 339851 334998
53191C34998n336n092m149l581m058m869m831l777k657k330k637k760k246j418
$$ 334998 329662 324570 320421 316840 312782 307913 303082 299305 296648 294318 291681 288921 286675 285257
53177B85257q85q51j141j623k252k749k718k210j666j207n25K75L56p58k250k872
$$ 285257 284372 283521 282380 280757 278505 275756 273038 270828 269162 267955 267430 267705 268061 267303 265053 262181
53161B62181k415j652j091n76k1K27n6o34j176j463j203k85P02Q26J0p07m76K57
$$ 262181 259766 258114 257023 256447 256426 256653 256597 255963 254787 253324 252121 251836 252538 253364 253374 252667 252191 252448
53143B52448M17k86j093j230p32k13o2o2K53Q82J208P62m1l25J32O35N73K16K36
$$ 252448 252865 252579 251486 250256 249524 249311 249249 249187 249440 250322 251530 252292 252251 251926 252058 252693 253266 253482 253718
53124B53718P99J453J730J558J149P63N50N36O76Q92R93P01pp26j062j168j465
$$ 253718 254517 255970 257700 259258 260407 261170 261720 262256 262932 263824 264817 265518 265511 264785 263723 262555 261090
53107B61090j952k280k411k564k547j861p28j56n58j072q10j48J2k97l54r4j41
$$ 261090 259138 256858 254447 251883 249336 247475 246747 246591 246033 244961 244151 244003 244015 243718 243364 243270 243129
53090B43129n90p59l70q2m50j077j219p67j90J68L61N80R00J122Q55L5o60m23
$$ 243129 242539 241780 241410 241328 240878 239801 238582 237815 237625 237793 238154 238734 239634 240756 241611 241646 240986 240563
53072B40563N64J143N95m61r68o89j84L9j86r03j835k285j759o57K14O26Q90R63
$$ 240563 241127 242270 242865 242404 241436 240747 240563 240602 240416 239513 237678 235393 233634 232977 233191 233817 234707 235670
53054B35670M38n18j035o77n7Q9q4M4N47R62J003P76M31J24J39N62R37P46J39
$$ 235670 236108 235590 234555 233878 233821 233910 233826 233870 234417 235379 236382 237158 237589 237713 237852 238414 239351 240097 240236
53035B40236k96m29o80j157j397j158q36p67o36o9N78O93L58K19M89P29O65N93
$$ 240236 239940 239511 238831 237674 236277 235119 234283 233516 232880 232811 233389 234082 234440 234659 235148 235877 236542 237135
53017B37135P44P67L05k47j40O85J386J230N08J95P52J617J890J362O59M38O56
$$ 237135 237879 238646 238951 238704 238564 239249 240635 241865 242373 242568 243320 244937 246827 248189 248848 249286 249942
53000B49942P01J51p46j305j096m42j45o54j499j751j019J98J115J424J353J299
$$ 249942 250643 250794 250048 248743 247647 247205 247060 246406 244907 243156 242137 242335 243450 244874 246227 247526
52984B47526J523J948K080J430J88p16n59M11J455K213K762L088L085K894K707
$$ 247526 249049 250997 253077 254507 254695 253979 253420 253831 255286 257499 260261 263349 266434 269328 272035
52969B72035K275J199k50j234j371j056o56l7P43R95K25j017j748j818j889k278
$$ 272035 274310 275509 275259 274025 272654 271598 270942 270905 271648 272643 272868 271851 270103 268285 266396 264118
52953B64118k465j918r86n46r59j625j706j133o63q52j289j162m12J78Q8l47n71
$$ 264118 261653 259735 258749 258203 257244 255619 253913 252780 252117 251265 249976 248814 248402 248580 248668 248321 247750
52936B47750n48n60o80q09q99q15l60K62M47O0j79L28J084J193O50K02J89K70
$$ 247750 247202 246642 245962 245153 244254 243439 243079 243341 243788 243848 243669 243997 245081 246274 246924 247126 247315 247585
52918B47585J89M0j61m42m56J16P21M22o26j086k20J095J670J461J164R65N17
$$ 247585 247774 247814 247653 247211 246755 246871 247592 248014 247388 246302 246082 247177 248847 250308 251472 252437 252954
52901B52954k35r46j417j612j422q89m52m62o04l75J21M30N47Q48J240J129L46
$$ 252954 252719 251773 250356 248744 247322 246433 245981 245519 244915 244540 244661 245091 245638 246486 247726 248855 249201
52884B49201m33m78J72Q64J039O53R4k37k84k26RP36J790K364K033J517J695K263
$$ 249201 248768 248290 248462 249326 250365 251018 251112 250875 250591 250365 250374 251110 252900 255264 257297 258814 260509 262772
52866B62772K272J738J553J786J389j7j230j133k70J55K0k5p7q61k312l412l629
$$ 262772 265044 266782 268335 270121 271510 271493 270263 269130 268860 269015 269035 269010 268933 268072 265760 262348 258719
52849B58719l521l687l901l658k958k200j732j685j863j689q09K42N37N1l05r2
$$ 258719 255198 251511 247610 243952 240994 238794 237062 235377 233514 231825 231016 231258 231795 231846 231541 231449
52833B31449N1l57o28K9J090J330M98n02j015j295j702k065k119j896j421n45
$$ 231449 231500 231143 230515 230544 231634 232964 233462 232960 231945 230650 228948 226883 224764 222868 221447 220902
52817B20902O01J462J685J536J466J636K060K749L323K967J311q63k338k794k881
$$ 220902 221503 222965 224650 226186 227652 229288 231348 234097 237420 240387 241698 240835 238497 235703 232822
52802B32822l092l162k726k030j581j364q54J60J142J339O60k06n46l77k57m57
$$ 232822 229730 226568 223842 221812 220231 218867 218013 218173 219315 220654 221314 221108 220562 220185 219928 219471
52786B19471o05k21O01J305J485J226Q89P48Q07Q53P11M57K40q9q80j988k584
$$ 219471 218866 218645 219246 220551 222036 223262 224151 224899 225706 226559 227270 227727 227967 227878 226998 225010 222426
52769B22426k059r10j78q7J25R22J658J468N56k8L30J151J547J211N89L06M85
$$ 222426 220367 219457 219279 219192 219317 220239 221897 223365 223921 223893 224223 225374 226921 228132 228721 229027 229512
52752B29512O79N13K49M91J314K064K227K070K087K178J876J219P74P84P94L10
$$ 229512 230191 230704 230953 231444 232758 234822 237049 239119 241206 243384 245260 246479 247253 248037 248831 249141
52736B49141o12j516j979j764r13R4O43N80K64r7o74j401j648j028r5K92P5j36
$$ 249141 248529 247013 245034 243270 242357 242451 243094 243674 243938 243841 243167 241766 240118 239090 238995 239287 239362 239226
52718B39226j85n98j575k376k136r34K57O32K60j68q9M51R71J099R18O98N05K47
$$ 239226 239041 238443 236868 234492 232356 231422 231679 232311 232571 232403 232314 232765 233736 234835 235753 236451 236956 237203
52700B37203m6j96j16J38M77P60P66M10k7j49J11N41R96J350J335Q50L43L65P32
$$ 237203 237157 236961 236845 236983 237460 238220 238986 239396 239369 239220 239331 239872 240868 242218 243553 244403 244746 245111 245843
52681B45843P33J86l42m67m56n13l57N2J38l88q69o09J01O17J017J711K404K440
$$ 245843 246576 246762 246420 245953 245497 244984 244627 244679 244817 244429 243560 242951 243052 243669 244686 246397 248801 251241
52663B51241J933J525J182L48p26r45N5J322J948K066K015J527M25o55j039r83
$$ 251241 253174 254699 255881 256229 255503 254558 254613 255935 257883 259949 261964 263491 263916 263261 262222 261239
52647B61239j132j457j457j103q16o87m12J49P86J261J356Q60k7n83l55K21N25
$$ 261239 260107 258650 257193 256090 255274 254587 254175 254324 255110 256371 257727 258587 258560 257977 257622 257843 258368
52630B58368P70J558K662L088K356R93l58j493k246k238j440m12L35Q10J067Q58
$$ 258368 259138 260696 263358 266446 268802 269795 269437 267944 265698 263460 262020 261608 261943 262753 263820 264678
52614B64678R0p56j112r24m91J2M91P44P20P49J105J510J425P81P9j78R3O38J118
$$ 264678 264768 264012 262900 261976 261485 261497 261988 262732 263452 264201 265306 266816 268241 269022 269101 268923 269016 269654 270772
52595B70772J352J407J409J231O46q8j88P22J919K310J711R41O64O90N14M7n04
$$ 270772 272124 273531 274940 276171 276817 276729 276541 277263 279182 281492 283203 284144 284808 285498 286012 286059 285555
52578B85555j086j715k075j712o55L93P05K65k30j73L43P15N53l2p45j430j862
$$ 285555 284469 282754 280679 278967 278312 278705 279410 279675 279445 279272 279615 280330 280883 280851 280106 278676 276814
52561B76814j615n37P51J320R32K45p2n9p5j53r7L7L8k9K6K5m44j271j700j243
$$ 276814 275199 274662 275413 276733 277665 277910 277838 277779 277704 277551 277454 277491 277529 277500 277526 277551 277107 275836 274136 272893
52541B72893l33K55L18K60M38Q37J299J636J583J025K90q3M8L13L46J21k04m80
$$ 272893 272560 272815 273133 273393 273831 274668 275967 277603 279186 280211 280501 280418 280466 280779 281125 281246 281042 280562
52523B80562n63m21k86l80m83j40N77J015Q72O59R25J483J867K156K750L527L873
$$ 280562 279999 279578 279292 278912 278429 278289 278866 279881 280753 281412 282337 283820 285687 287843 290593 294120 297993
52506B97993L454K453J079o05k296l422l689l347k786k171j543j002o08l56k77
$$ 297993 301447 303900 304979 304374 302078 298656 294967 291620 288834 286663 285120 284118 283510 283154 282877
52491B82877l70m65m54n49r27j185o94M32J294J337R67Q02Q41P52N30M05M35O14
$$ 282877 282507 282042 281588 281039 280112 278927 278233 278665 279959 281296 282263 283065 283906 284658 285188 285593 286028 286642
52473B86642J082J740K006J513P70N82R96J392J544J846K460K910K736J991Q99
$$ 286642 287724 289464 291470 292983 293753 294335 295331 296723 298267 300113 302573 305483 308219 310210 311109
52458C11109m82j902k734k679k349k592l413l973l704k904k151j572r78m57m06
$$ 311109 310627 308725 305991 303312 300963 298371 294958 290985 287281 284377 282226 280654 279676 279219 278813
52443B78813r43j594j789j486j052o50r1O26R77N53k00l73K27P94O08M7O1Q69
$$ 278813 277870 276276 274487 273001 271949 271299 271208 271834 272811 273364 273164 272791 273018 273812 274420 274467 274528 275397
52425B75397J711J910J676J584J627J234J95p97p59N42K323L514L725L490L766
$$ 275397 277108 279018 280694 282278 283905 285139 285334 284537 283778 284320 286643 290157 293882 297372 301138
52410C01138N195P769J0876J3606J5075J4737J2512Q644L588j862o519r330j0234
$$ 301138 306333 314102 324978 338584 353659 368396 380908 389552 393140 391278 384759 375429 365195
52397C65195j0148r860r187p607n470l859l195k702j637m34p4o22j159j064o75
$$ 365195 355047 345187 336000 328393 322923 319064 315869 313167 311530 311096 311022 310400 309241 308177 307502
52382C07502m73k39O00K045L363L836L430K790K609L020L552L791L929M442N212
$$ 307502 307029 306790 307390 309435 312798 316634 320064 322854 325463 328483 332035 335826 339755 344197 349409
52367C49409N327M084J947K14l25j17j93r25j711j789j156m74k33l14l62k41N1
$$ 349409 354736 358820 360767 360981 360656 360539 360346 359421 357710 355921 354765 354291 354058 353744 353382 353141 353192
52350C53192N61J217J700J809J784J943K190K274K304K615L232L978M924O141
$$ 353192 353753 354970 356670 358479 360263 362206 364396 366670 368974 371589 374821 378799 383723 389864
52336C89864P154P367P066P230Q136R025R455J0151J1870J4167J6014J7139J7904
$$ 389864 397018 404385 411451 418681 426817 435842 445297 455448 467318 481485 497499 514638 532542
52323E32542J8292J8003J7381J7220J7624J7839J7467J7029J7050J7226J7027
$$ 532542 550834 568837 586218 603438 621062 638901 656368 673397 690447 707673 724700
52312G24700J6608J6544J6874J6941J6257J5185J4556J4713J5116J4999J4276
$$ 724700 741308 757852 774726 791667 807924 823109 837665 852378 867494 882493 896769
52301H96769J3523J3093J2608J1527R840P853N579K854j17k798m869o372p352
$$ 896769 910292 923385 935993 947520 957360 965213 970792 973646 973529 970731 965862 959490 952138
52288I52138p873q240q741r121q850p920o808n614l810j236J276K715L033L014
$$ 952138 944265 936025 927284 918163 909313 901393 894585 888971 885161 883925 885201 887916 890949 893963
52274H93963L379M381O086Q451J1004J2855J3278J2398J1236J0920J1655J2530
$$ 893963 897342 901723 907809 916260 927264 940119 953397 965795 977031 987951 999606 1012136
52262A012136J2566J1940J1741J2585J3870J4605J4502J3973J3460J3088J2705
$$ 1012136 1024702 1036642 1048383 1060968 1074838 1089443 1103945 1117918 1131378 1144466 1157171
52251A157171J1894J0187P615M824K351Q2k232m290n643o495p406q265q384p726
$$ 1157171 1169065 1179252 1186867 1191691 1194042 1194124 1191892 1187602 1181959 1175464 1168058 1159793 1151409 1143683
52237A143683p279p794q762r156q809q343p982p165n509l534k148j724j956k309
$$ 1143683 1136404 1128610 1119848 1110692 1101883 1093540 1085558 1078393 1072884 1069350 1067202 1065478 1063522 1061213
52223A061213k310j626l22J018J811K177K729L662M473M786N037N845P023P675
$$ 1061213 1058903 1057277 1056955 1057973 1059784 1061961 1064690 1068352 1072825 1077611 1082648 1088493 1095516 1103191
52209A103191P305O368N657N515N738N909N756N396N351N995O985P533P341O905
$$ 1103191 1110496 1116864 1122521 1128036 1133774 1139683 1145439 1150835 1156186 1162181 1169166 1176699 1184040 1190945
52195A190945O736O708O451O018N703N474M961L964K533P21j399l513n232o500
$$ 1190945 1197681 1204389 1210840 1216858 1222561 1228035 1232996 1236960 1239493 1240214 1238815 1235302 1230070 1223570
52181A223570p578q565r323r852j0352j0798j0787j0013q688p258n948m809l973
$$ 1223570 1215992 1207427 1198104 1188252 1177900 1167102 1156315 1146302 1137614 1130356 1124408 1119599 1115626
52168A115626l510l128k313r41N01J427J761J907K182K465K462K140J732J331
$$ 1115626 1112116 1108988 1106675 1105734 1106235 1107662 1109423 1111330 1113512 1115977 1118439 1120579 1122311 1123642
52154A123642P81K1o28p33l32K2j15n20n47J28J041J329M84j189k870l879m104
$$ 1123642 1124423 1124444 1123816 1123083 1122751 1122773 1122658 1122138 1121591 1121719 1122760 1124089 1124573 1123384 1120514 1116635 1112531
52137A112531l853l418k778j729j34J959M294O519Q397J0080J2080J4750J7755
$$ 1112531 1108678 1105260 1102482 1100753 1100619 1102578 1106872 1113391 1121788 1131868 1143948 1158698 1176453
52124A176453K0289K1949K3187K4667K6312K7352K7325K6702K6326K6504K6829
$$ 1176453 1196742 1218691 1241878 1266545 1292857 1320209 1347534 1374236 1400562 1427066 1453895
52113A453895K6660K5563K3419K0458J7289J4634J2880J1856J1077J0174R103
$$ 1453895 1480555 1506118 1529537 1549995 1567284 1581918 1594798 1606654 1617731 1627905 1637008
52102A637008P950O618M892K908J265J82j240m250q734j3057j5914j7666j9184
$$ 1637008 1644958 1651576 1656468 1659376 1660641 1660823 1659583 1655333 1646599 1633542 1617628 1599962 1580778
52089A580778k0180j9706j7937j6183j5100j4010j2253j0163q239o287m064j994
$$ 1580778 1560598 1540892 1522955 1506772 1491672 1477662 1465409 1455246 1447007 1440720 1436656 1434662
52077A434662n08Q19K694N043P261R083J0620J1797J2500J3110J4097J5204J5702
$$ 1434662 1434154 1434973 1437667 1442710 1449971 1459054 1469674 1481471 1493971 1507081 1521178 1536382 1552084
52064A552084J5434J4946J4611J4203J3539J2835J2218J1359R869P799N603L707
$$ 1552084 1567518 1582464 1597075 1611278 1624817 1637652 1649870 1661229 1671098 1678897 1684500 1688207
52052A688207K207O41j736n174q932j2027j4340j6471j8593k0113k0643k0643
$$ 1688207 1690414 1691055 1689319 1684145 1675213 1663186 1648846 1632375 1613782 1593669 1573026 1552383
52040A552383k0784k1090k1039k0186j8489j6342j4487j3471j3051j2485j1597
$$ 1552383 1531599 1510509 1489470 1469284 1450795 1434453 1419966 1406495 1393444 1380959 1369362
52029A369362j1088j1546j2597j3425j3674j3481j3017j2443j2061j2000j1959
$$ 1369362 1358274 1346728 1334131 1320706 1307032 1293551 1280534 1268091 1256030 1244030 1232071
$$ [...]
##END NTUPLES=NMR SPECTRUM
##END=
