##TITLE=AC1451_MAGAH13260_8011492_QYp4jsbOs2
##JCAMPDX= 6.0         $$ Bruker NMR JCAMP-DX V2.0
##DATA TYPE= NMR SPECTRUM
##DATA CLASS= NTUPLES
##ORIGIN= BRUKER
##OWNER= Administrator
$$ 1.72 TOPSPIN		Version 2.1
$$ 2013-07-05 22:21:08.311 -0700  Administrator@X
$$ Compression mode = diff/dup
##.OBSERVE FREQUENCY= 400.02188249412
##.OBSERVE NUCLEUS= ^1H
##.ACQUISITION MODE= SIMULTANEOUS (DQD)
##.ACQUISITION SCHEME= undefined
##.AVERAGES= 64
##.DIGITISER RES= 22
##SPECTROMETER/DATA SYSTEM= spect
##.PULSE SEQUENCE= noesygpps1d.comp
##.SOLVENT NAME= COFFEE_meoh
##.SHIFT REFERENCE= INTERNAL, COFFEE_meoh, 1, 14.96083
##AUDIT TRAIL= $$ (NUMBER, WHEN, WHO, WHERE, PROCESS, VERSION, WHAT)
$$ ##TITLE= Audit trail, TOPSPIN		Version 2.1
$$ ##JCAMPDX= 5.01
$$ ##ORIGIN= Bruker BioSpin GmbH
$$ ##OWNER= Administrator
$$ $$ E:\/data/COFFEE/nmr/AC1451_MAGAH13260_8011492_QYp4jsbOs2/12/pdata/1/auditp.txt
$$ ##AUDIT TRAIL=  $$ (NUMBER, WHEN, WHO, WHERE, PROCESS, VERSION, WHAT)
(   1,<2013-07-05 22:21:03.045 -0700>,<Administrator>,<X>,<go>,<TOPSPIN 2.1>,
      <created by zg
	started at 2013-07-05 22:09:33.373 -0700,
	POWCHK enabled, PULCHK disabled,
       configuration hash MD5:
       C8 4E 4E 5D D3 5C D8 9E 9F 52 82 E0 59 8A DE 15
       data hash MD5: 64K
       2D 73 13 AE 9C 0D 17 C8 00 2A 25 CD E0 E0 02 23>)
(   2,<2013-07-05 22:21:06.170 -0700>,<Administrator>,<X>,<proc1d>,<TOPSPIN 2.1>,
      <Start of raw data processing
       efp LB = 0.3 FT_mod = 6 PKNL = 1 PHC0 = 0 PHC1 = 0 SI = 128K 
       data hash MD5: 128K
       D4 C1 F8 CE 7B C7 72 16 91 E2 3D 14 42 04 19 97>)
(   3,<2013-07-05 22:21:07.232 -0700>,<Administrator>,<X>,<proc1d>,<TOPSPIN 2.1>,
      <pk PHC0 = -84.36401 PHC1 = 0 
       data hash MD5: 128K
       61 7B 40 B0 F9 56 5E 3E 62 2F ED C0 32 E9 86 61>)
(   4,<2013-07-05 22:21:07.670 -0700>,<Administrator>,<X>,<proc1d>,<TOPSPIN 2.1>,
      <abs ABSG = 1 
       data hash MD5: 128K
       76 DD 0A FB A3 7D 20 BF 78 0D 70 7A AE 9A A3 74>)
(   5,<2013-07-05 22:21:07.779 -0700>,<Administrator>,<X>,<proc1d>,<TOPSPIN 2.1>,
      <abs ABSG = 2 
       data hash MD5: 128K
       07 69 46 F3 7F 0F EE 39 F7 BB C9 5C F9 03 80 91>)
(   6,<2013-07-05 22:21:07.904 -0700>,<Administrator>,<X>,<proc1d>,<TOPSPIN 2.1>,
      <abs ABSG = 3 
       data hash MD5: 128K
       98 EF 5E 1F 6C 88 ED 61 96 73 81 5B 19 94 42 5E>)
(   7,<2013-07-05 22:21:08.014 -0700>,<Administrator>,<X>,<proc1d>,<TOPSPIN 2.1>,
      <abs ABSG = 4 
       data hash MD5: 128K
       1F 98 2A F9 61 50 DC 95 6A 9D FC FE 2A 10 5C E0>)
(   8,<2013-07-05 22:21:08.107 -0700>,<Administrator>,<X>,<proc1d>,<TOPSPIN 2.1>,
      <abs ABSG = 5 
       data hash MD5: 128K
       1B 31 C2 25 7E C1 C9 C7 BE 01 85 EC B9 00 0D FF>)
$$ ##END=
$$ 
$$ $$ hash MD5
$$ $$ 03 4A 0F A6 7F B8 F0 60 A9 7A C1 95 D3 5F 37 4E
##$RELAX= 
##$RELAX= 
##$RELAX= 
##$RELAX= 
##$RELAX= 
##$RELAX= 
##$RELAX= 
##$RELAX= 
$$ Bruker specific parameters
$$ --------------------------
##$DU= <E:\>
##$EXPNO= 12
$$ [...]
##$TP07= 0
##$TPNAME0= <>
##$TPNAME1= <>
##$TPNAME2= <>
##$TPNAME3= <>
##$TPNAME4= <>
##$TPNAME5= <>
##$TPNAME6= <>
##$TPNAME7= <>
##$TPOAL= (0..7)
0.5 0.5 0.5 0.5 0.5 0.5 0.5 0.5
##$TPOFFS= (0..7)
0 0 0 0 0 0 0 0
##$TUNHIN= 0
##$TUNHOUT= 0
##$TUNXOUT= 0
##$USERA1= <user>
##$USERA2= <user>
##$USERA3= <user>
##$USERA4= <user>
##$USERA5= <user>
##$V9= 5
##$VALIST= <valist>
##$VCLIST= <CCCCCCCCCCCCCCC>
##$VD= 0
##$VDLIST= <DDDDDDDDDDDDDDD>
##$VPLIST= <PPPPPPPPPPPPPPP>
##$VTLIST= <TTTTTTTTTTTTTTT>
##$WBST= 1024
##$WBSW= 4
##$XGAIN= (0..3)
0 0 0 0
##$XL= 0
##$YL= 0
##$YMAX_a= 6365964
##$YMIN_a= -12236501
##$ZGOPTNS= <>
##$ZL1= 120
##$ZL2= 120
##$ZL3= 120
##$ZL4= 120
##$ABSF1= 14.96083
##$ABSF2= -5.597352
##$ABSG= 5
##$ABSL= 3
##$ALPHA= 0
##$AQORDER= 0
##$ASSFAC= 0
##$ASSFACI= 0
##$ASSFACX= 0
##$ASSWID= 0
##$AUNMP= <proc_prof1d_extract.lims>
##$AXLEFT= 0
##$AXNAME= <>
##$AXNUC= <1H>
##$AXRIGHT= 0
##$AXTYPE= 0
##$AXUNIT= <>
##$AZFE= 0.1
##$AZFW= 0.1
##$BCFW= 0
##$BC_mod= 0
##$BYTORDP= 0
##$COROFFS= 0
##$CY= 15
##$DATMOD= 1
##$DC= 0
##$DFILT= <>
##$DTYPP= 0
##$F1P= 0
##$F2P= 0
##$FCOR= 0.5
##$FTSIZE= 131072
##$FT_mod= 6
##$GAMMA= 0
##$GB= 0
##$INTBC= 1
##$INTSCL= 1
##$ISEN= 128
##$LB= 0.3
##$LEV0= 0
##$LPBIN= 0
##$MAXI= 10000
##$MC2= 0
##$MEAN= 0
##$ME_mod= 0
##$MI= 0
##$NCOEF= 0
##$NC_proc= -2
##$NLEV= 6
##$NOISF1= 0
##$NOISF2= 0
##$NSP= 0
##$NTH_PI= 0
##$NZP= 0
##$OFFSET= 14.96083
##$PC= 1
##$PHC0= -84.36401
##$PHC1= 0
##$PH_mod= 1
##$PKNL= yes
##$PPARMOD= 0
##$PPDIAG= 0
##$PPIPTYP= 0
##$PPMPNUM= 2147483647
##$PPRESOL= 1
##$PSCAL= 4
##$PSIGN= 0
##$PYNMP= <proc.py>
##$REVERSE= no
##$SF= 400.020009703397
##$SI= 131072
##$SIGF1= 0
##$SIGF2= 0
##$SINO= 400
##$SIOLD= 131072
##$SPECTYP= <>
##$SREGLST= <1H.CDCl3>
##$SSB= 0
##$STSI= 131072
##$STSR= 0
##$SW_p= 8223.68421052631
##$SYMM= 0
##$S_DEV= 0
##$TDeff= 65536
##$TDoff= 0
##$TI= <>
##$TILT= no
##$TM1= 0
##$TM2= 0
##$TOPLEV= 0
##$USERP1= <user>
##$USERP2= <user>
##$USERP3= <user>
##$USERP4= <user>
##$USERP5= <user>
##$WDW= 1
##$XDIM= 131072
##$YMAX_p= 411191479
##$YMIN_p= -11604
##$CURPLOT= <Network HP LaserJet P1505>
##$CURPRIN= <$Network HP LaserJet P1505>
##$DFORMAT= <normdp>
##$LAYOUT= <+/1D_H.xwp>
##$LFORMAT= <normlp>
##$PFORMAT= <normpl>
##$SURQMSG= 1
$$ End of Bruker specific parameters
$$ ---------------------------------
##NTUPLES= NMR SPECTRUM
##VAR_NAME=  FREQUENCY,     SPECTRUM/REAL,   SPECTRUM/IMAG
##SYMBOL=    X,             R,               I
##VAR_TYPE=  INDEPENDENT,   DEPENDENT,       DEPENDENT
##VAR_FORM=  AFFN,          ASDF,            ASDF
##VAR_DIM=   131072,        131072,          131072
##UNITS=     HZ,            ARBITRARY UNITS, ARBITRARY UNITS
##FACTOR=    0.0627417313425164, 1,          1
##FIRST=     8223.62146879497, 1420,         -55170
##LAST=      0,             3749,            -55536
##MIN=       0,             -11604,          0
##MAX=       8223.62146879497, 411191479,    0
$$ Real data points
##PAGE= N=1
##DATA TABLE= (X++(R..R)), XYDATA
$$ [...]
63944A893425J88383K05804K21027K33823K43845K50209K52268K50098K43693
$$ 1893425 2081808 2287612 2508639 2742462 2986307 3236516 3488784 3738882 3982575
63935C982575K32144K14300J90196J61293J29308R5203N9336K2129j5749n3524
$$ 3982575 4214719 4429019 4619215 4780508 4909816 5005019 5064355 5086484 5070735 5017211
63925E017211r0303j24966j56363j83599k06030k23025k34049k39149k39196k35475
$$ 5017211 4926908 4801942 4645579 4461980 4255950 4032925 3798876 3559727 3320531 3085056
63915C085056k28963k20031k08726j95197j79886j63509j46962j31131j16580
$$ 3085056 2856093 2636062 2427336 2232139 2052253 1888744 1741782 1610651 1494071
63906A494071j03436r1624q1091p1749o3367n5764m9055m3448l8848l4974l1799
$$ 1494071 1390635 1299011 1217920 1146171 1082804 1027040 977985 934537 895689 860715 828916
63895H28916k9466k7696k5736k3229k0745j9053j8150j7428j6549j5626j4703
$$ 828916 799450 771754 746018 722789 702044 682991 664841 647413 630864 615238 600535
63884F00535j3598j2289j0875r189o939m304j806M83K964N504P275Q010Q695J0314
$$ 600535 586937 574648 563773 554584 547645 543341 541535 542018 544982 550486 557761 565771 574466 584780
63870E84780J2413J3838J4464J5203J6350J7049J6635J5643J4960J4579J3784
$$ 584780 597193 611031 625495 640698 657048 674097 690732 706375 721335 735914 749698
63859G49698J2167J0009P797N773L829J650r23l569n742p361q924j0792j2785
$$ 749698 761865 771874 779671 785444 789273 790923 790000 786431 780689 773328 764404 753612 740827
63846G40827j4691j6618j8470j9600j9703j9628k0509k2079k2798k1895k0495
$$ 740827 726136 709518 691048 671448 651745 632117 611608 589529 566731 544836 524341
63835E24341k0113k0598k0374j8635j6425j5204j5001j4625j3450j2191j1664
$$ 524341 504228 483630 463256 444621 428196 412992 397991 383366 369916 357725 346061
63824C46061j1495j0637q884p110o136n930o055o235o186n521m242k960k163j664
$$ 346061 334566 323929 315045 307935 301799 295869 289814 283579 277393 271872 267630 264670 262507 260843
63810B60843j122p44q44j123j050p56q33j331j729j929k437l308l730l147k202
$$ 260843 259721 258977 258133 257010 255960 255204 254371 253040 251311 249382 246945 243637 239907 236760 234558
63795B34558j968k545l061k892k309j939j979k124k047j733j394j130q37m72k46
$$ 234558 232590 230045 226984 224092 221783 219844 217865 215741 213694 211961 210567 209437 208600 208128 207882
63780B07882l09l78p0M66O67L93J62L08M50J19m31n51j34K75J92k99p89j007r93
$$ 207882 207573 207195 207125 207591 208258 208651 208813 209121 209571 209690 209259 208708 208574 208849 209041 208742 207953 206946 205953
63761B05953r79j101j172r00l80l6NR3M18N96L49J57O38J523J906J498R53Q94
$$ 205953 204974 203873 202701 201801 201421 201385 201390 201483 201901 202497 202846 203003 203641 205164 207070 208568 209521 210415
63743B10415J179J326J187R90J014J422K117K718K866K664K432K124J496Q22Q10
$$ 210415 211594 212920 214107 215097 216111 217533 219650 222368 225234 227898 230330 232454 233950 234772 235582
63728B35582J534K158K096J911K482L703M613M599L876K993K362K255K610K886
$$ 235582 237116 239274 241370 243281 245763 249466 254079 258678 262554 265547 267909 270164 272774 275660
63714B75660K481J419K19q44j862k687k822k143j230o66m07j15J52Q9k66m94k97
$$ 275660 278141 279560 279779 278935 277073 274386 271564 269421 268191 267525 267118 267003 267155 267244 266978 266484 266187
63697B66187K79J074J936K609K828K677K582K875L470M026M247L915K946J568
$$ 266187 266466 267540 269476 272085 274913 277590 280172 283047 286517 290543 294790 298705 301651 303219
63683C03219K97n54j214j990k607k440j460n04l28p09p85j35Q66J613J817J578
$$ 303219 303516 302962 301748 299758 297151 294711 293251 292747 292419 291710 290925 290790 291656 293269 295086 296664
63667B96664J284J384J886K116J359k10j691k555l103l632l854l510l023k957
$$ 296664 297948 299332 301218 303334 304693 304483 302792 300237 297134 293502 289648 286138 283115 280158
63653B80158l208l269l041k789k470j860j157q77j013r96n20J09O24J197J931
$$ 280158 276950 273681 270640 267851 265381 263521 262364 261487 260474 259478 258958 259067 259691 260888 262819
63638B62819K543K796K872K986L056L079L398M249N312O090O483O693O850P091
$$ 262819 265362 268158 271030 274016 277072 280151 283549 287798 293110 299200 305683 312376 319226 326317
63624C26317P744R010J0664J2307J3775J4996J5764J6059J6412J7459J9340K1834
$$ 326317 334061 343071 353735 366042 379817 394813 410577 426636 443048 460507 479847 501681
63612E01681K4831K8151L1074L2726L3015L2594L1812L0159K6958K2256J6809
$$ 501681 526512 554663 585737 618463 651478 684072 715884 746043 773001 795257 812066
63601H12066J1467O720K608j046m233o514p474p368p002p049p750r249j1690j4838
$$ 812066 823533 830253 832861 831815 827582 821068 813594 806226 799224 792175 784425 775176 763486 748648
63587G48648j8020k0772k3205k5463k7073k7200k5508k2655j9870j8049j7046
$$ 748648 730628 709856 686651 661188 634115 606915 581407 558752 538882 520833 503787
63576E03787j5817j3486j0277p202m883l084j389J99J530K691L746M482M878N434
$$ 503787 487970 474484 464207 457005 452122 449038 447649 447848 449378 452069 455815 460297 465175 470609
63562D70609O564P885Q687R038R782J1397J3418J5238J7036J9431K2508K5644
$$ 470609 477173 485058 493745 502783 512565 523962 537380 552618 569654 589085 611593 637237
63550F37237K8410L1122L4258L7437L9397L8959L5808L0276K2844J4217N577j788
$$ 637237 665647 696769 731027 768464 807861 846820 882628 912904 935748 949965 955542 953754
63538I53754p158j0400j1542j0833r152p673o907o610o891q618j2265j6820k0662
$$ 953754 946596 936196 924654 913821 904669 896996 890089 883479 876588 867970 855705 838885 818223
63525H18223k3243k5313k7597k9933l1630l2231l1717l0426k8842k7256k5586
$$ 818223 794980 769667 742070 712137 680507 648276 616559 586133 557291 530035 504449
63514E04449k3644k1472j9119j6453j3630j1425j0463j0213r446p800o165n349
$$ 504449 480805 459333 440214 423761 410131 398706 388243 378030 368584 360784 354619 349270
63502C49270n041m494l602k803k353k233k409k678k453j360N3P42L60m19q13p45
$$ 349270 344229 339735 336133 333330 330977 328744 326335 323657 321204 319844 319897 320639 320999 320580 319767 319022
63486C19022n30k36L10J078J753K133K360K657L023L252L167K731K019J188M52
$$ 319022 318492 318256 318566 319644 321397 323530 325890 328547 331570 334822 337989 340720 342739 343927 344379
63471C44379n6m62j045j823k487k792k928l188l442l248k565j989k106k719l011
$$ 344379 344323 343861 342816 340993 338506 335714 332786 329598 326156 322908 320343 318354 316248 313529 310518
63456C10518k367r18O55J720K088K020K011K511L660N137O336O935P305Q116R513
$$ 310518 308151 307233 307888 309608 311696 313716 315727 318238 321898 327035 333371 340306 347611 355727 365240
63441C65240J0962J2180J3791J6664K0626K4342K6535K6943K5999K4056K1292
$$ 365240 376202 388382 402173 418837 439463 463805 490340 517283 543282 567338 588630
63430E88630J8101J5213J3242J2300J2007J1990J2411J3908J6889K0933K5166
$$ 588630 606731 621944 635186 647486 659493 671483 683894 697802 714691 735624 760790
63419G60790K9094L2781L6171L8713L9709L8704L5448K9932K2756J5072P836J460
$$ 760790 789884 822665 858836 897549 937258 975962 1011410 1041342 1064098 1079170 1087006 1088466
63407A088466l655o794p743p544p766r010j0753j2550j4726j7743k1489k5525
$$ 1088466 1084811 1078017 1070274 1062730 1054964 1045954 1035201 1022651 1007925 990182 968693 943168
63395I43168k9577l3343l6195l7554l7497l6657l5434l3658l1022k7681k4242
$$ 943168 913591 880248 844053 806499 769002 732345 696911 663253 632231 604550 580308
63384E80308k1200j8544j5944j3254j0678q421o354m227k050l4J847L924O379
$$ 580308 559108 540564 524620 511366 500688 492267 485913 481686 479636 479602 481449 485373 491752
63371D91752Q911J0996J2330J3029J3561J4566J6526J9332K2322K4929K7206K9546
$$ 491752 500663 511659 523989 537018 550579 565145 581671 601003 623325 648254 675460 705006
63359G05006L2019L4302L6159L7624L8564L8408L6520L2747K7386K0830J3545
$$ 705006 737025 771327 807486 845110 883674 922082 958602 991349 1018735 1039565 1053110
63348A053110O297K6m714p992j0074j1029j0983j0586j0842j2343j4907j8018
$$ 1053110 1059407 1059433 1054719 1046727 1036653 1025624 1014641 1004055 993213 980870 965963 947945
63336I47945k1446k5184k8942l2022l3855l4501l4400l3683l1984k9044k5283
$$ 947945 926499 901315 872373 840351 806496 771995 737595 703912 671928 642884 617601
63325F17601k1478j7998j4662j1438q846p506p522q574j0336j2435j4231j5170
$$ 617601 596123 578125 563463 552025 543179 535673 528151 519577 509241 496806 482575 467405
63313D67405j5358j5335j5226j4563j3057j1095r234p549n873m367l425l105k999
$$ 467405 452047 436712 421486 406923 393866 382771 373537 365988 360115 355748 352323 349218 346219
63300C46219k732k290j943j878j990j963j701j652k322l382l719k804j533j189
$$ 346219 343487 341197 339254 337376 335386 333423 331722 330070 327748 324366 320647 317843 316310 315121
63286C15121j825k416k422k330k501k451j764r75q29j047p27K76J125J279J135
$$ 315121 313296 310880 308458 306128 303627 301176 299412 298437 297608 296561 295834 296110 297235 298514 299649
63271B99649J191J198O81n6j51O91J783K335K301K155K112J980J691J614K081
$$ 299649 300840 302038 302719 302663 302512 303203 304986 307321 309622 311777 313889 315869 317560 319174 321255
63256C21255K880L432L468L229L055L013L115L601M660O016P128P827Q454R309
$$ 321255 324135 327567 331035 334264 337319 340332 343447 347048 351708 357724 364852 372679 381133 390442
63242C90442J0215J0875J1401J2226J3591J5341J7157J8767K0027K1042K2142
$$ 390442 400657 411532 422933 435159 448750 464091 481248 500015 520042 541084 563226
63231E63226K3444K4513K4761K4187K3438K3028K2949K3011K3188K3390K3362
$$ 563226 586670 611183 635944 660131 683569 706597 729546 752557 775745 799135 822497
63220H22497K3153K3293K4114K5090K5330K4478K2751K0382J7516J4473J1329
$$ 822497 845650 868943 893057 918147 943477 967955 990706 1011088 1028604 1043077 1054406
63209A054406P346J615n552j2530j7997k2048k5383k8063k9683l0263l0167k9348
$$ 1054406 1061752 1063367 1057815 1045285 1027288 1005240 979857 951794 922111 891848 861681 832333
63197H32333k7396k4368k1012j7956j5062j1796p955l865kL415O480R324J1830
$$ 832333 804937 780569 759557 741601 726539 714743 706788 702923 702921 706336 712816 722140 733970
63184G33970J3833J5565J7574K0004K2189K3338K3368K2837K2304K2127K2628
$$ 733970 747803 763368 780942 800946 823135 846473 869841 892678 914982 937109 959737
63173I59737K3797K4870K4841K3567K1836K0161J8003J4561R923M973L02m389
$$ 959737 983534 1008404 1033245 1056812 1078648 1098809 1116812 1131373 1141296 1146269 1146571 1142182
63161A142182r766j5992k2374k7824l1721l4362l6449l8163l9041l8762l7625
$$ 1142182 1132416 1116424 1094050 1066226 1034505 1000143 963694 925531 886490 847728 810103
63150H10103l6030l3920l1178k8224k5662k3420k0913j8068j5654j4269j3487
$$ 810103 774073 740153 708975 680751 655089 631669 610756 592688 577034 562765 549278
63139E49278j2364j0569q567o890n647m724m039l475k823j983j085k27O90J754
$$ 549278 536914 526345 517778 510888 505241 500517 496478 493003 490180 488197 487112 486885 487575 489329
63125D89329K760L296L154K594K217K513L317L782L256K255K116L341M721M705
$$ 489329 492089 495385 498539 501133 503350 505863 509180 512962 516218 518473 520589 523930 528651 533356
63111E33356L326K059J880K281K393K117J707J012p5r44r14l49k27p26j030p03
$$ 533356 536682 538741 540621 542902 545295 547412 549119 550131 550056 549112 548198 547849 547622 546896 545866 545163
63095E45163l78p72j609k036j714j067o86p98j118r96J02J970L651M320M006L396
$$ 545163 544785 544013 542404 540368 538654 537587 536901 536103 534985 533989 534091 536061 539712 544032 548038 551434
63079E51434L110L325L877M458M899N440O462P851Q887R079Q798Q796R340J0226
$$ 551434 554544 557869 561746 566204 571103 576543 583005 590856 599743 608822 617620 626416 635756 645982
63065F45982J1409J3024J4935J6788J8600K0760K3348K5877K7978K9956L2381
$$ 645982 657391 670415 685350 702138 720738 741498 764846 790723 818701 848657 881038
63054H81038L5418L8818M2326M5761M8840N1311N3255N4984N6597N7786N8152
$$ 881038 916456 955274 997600 1043361 1092201 1143512 1196767 1251751 1308348 1366134 1424286
63043A424286N7639N6678N5887N5613N5692N5681N5424N5208N5341N5638N5441
$$ 1424286 1481925 1538603 1594490 1650103 1705795 1761476 1816900 1872108 1927449 1983087 2038528
63032B038528N4032N0914M5862L8934L0421K0541R282l195j6054k8052l8514m7747
$$ 2038528 2092560 2143474 2189336 2228270 2258691 2279232 2288514 2285319 2269265 2241213 2202699 2154952
63020B154952n6255o3689o8938p1212p0775o8513o5055o0517n4992m8903m2662
$$ 2154952 2098697 2035008 1966070 1894858 1824083 1755570 1690515 1629998 1575006 1526103 1483441
63009A483441l6130k8791k0593j2337m925J649Q150J4933K1377K6637L0661L4094
$$ 1483441 1447311 1418520 1397927 1385590 1380665 1382314 1390464 1405397 1426774 1453411 1484072 1518166
62997A518166L7408M0453M2714M3802M3730M3118M2919M3575M4434M4319M2648
$$ 1518166 1555574 1596027 1638741 1682543 1726273 1769391 1812310 1855885 1900319 1944638 1987286
62986A987286L9683L5778L0907K4947J7922R737J91j0472k1434l2026m2240n2155
$$ 1987286 2026969 2062747 2093654 2118601 2136523 2146260 2146451 2135979 2114545 2082519 2040279 1988124
62974A988124o1189o8392p3267p5897p6513p5365p2995p0054o6808o3141n9076
$$ 1988124 1926935 1858543 1785276 1709379 1632866 1557501 1484506 1414452 1347644 1284503 1225427
62963A225427n4981n1189m7683m4256m0740l7041l3198k9557k6693k4959k4133
$$ 1225427 1170446 1119257 1071574 1027318 986578 949537 916339 886782 860089 835130 810997
62952H10997k3539k2558k1080j9580j8617j8249j8010j7530j6908j6330j5561
$$ 810997 787458 764900 743820 724240 705623 687374 669364 651834 634926 618596 603035
62941F03035j4153j2123j0110q831q423q319p737o500n384n295o028o291n224
$$ 603035 588882 576759 566649 557818 549395 541076 533339 526839 521455 516160 510132 503841 498617
62928D98617l422k049j425j095q46q65j115j345j628k175k617k358j656j560k475
$$ 498617 495195 493146 491721 490626 489780 488915 487800 486455 484827 482652 480035 477677 476021 474461 471986
62913D71986l613m077l822l185k320j530j462k247k975k746j875j416j731k143
$$ 471986 468373 464296 460474 457289 454969 453439 451977 449730 446755 444009 442134 440718 438987 436844
62899D36844j925j079j95J14l39j097j393r12j51K24P1l08o30p01l76K22O62P46
$$ 436844 434919 433840 433645 433759 433420 432323 430930 430018 429867 430091 430162 429854 429224 428523 428147 428369 429031 429777
62881D29777P80J021J181R05M26K94O47J100J194O84l56j377j707j385j144j247
$$ 429777 430557 431578 432759 433664 434090 434384 435031 436131 437325 438009 437653 436276 434569 433184 432040 430793
62865D30793r41J85J074N25q19j156j14P46K78o47o14L22R82Q15L58K79P16J484
$$ 430793 429852 430037 431111 431636 430817 429661 429547 430293 430571 429924 429310 429632 430614 431429 431787 432066 432782 434266
62847D34266K246K459J691J78j180j638j278r21j246k073k550k131j226o31n01
$$ 434266 436512 438971 440662 440840 439660 438022 436744 435823 434577 432504 429954 427823 426597 425966 425465
62832D25465k96L02R32J158J117J228J576J820J645J149Q23J120J872K351K157
$$ 425465 425169 425471 426403 427561 428678 429906 431482 433302 434947 436096 436919 438039 439911 442262 444419
62817D44419J885K336L276L700L439L558M769O206O484N532M608M739N809P067
$$ 444419 446304 448640 451916 455616 459055 462613 467382 473588 480072 485604 490212 494951 500760 507827
62803E07827P904Q130P989Q050Q705R745J0646J1245J1822J2676J3891J5562J7826
$$ 507827 515731 523861 531850 539900 548605 558350 568996 580241 592063 604739 618630 634192 652018
62790F52018K0584K3465K6251K9192L2878L7808M3975N0708N7052O2548O7577
$$ 652018 672602 696067 722318 751510 784388 822196 866171 916879 973931 1036479 1104056
62779A104056P2771P8239Q3526Q8194R1991R4521R5111R3163Q8408Q0864P0767
$$ 1104056 1176827 1255066 1338592 1426786 1518777 1613298 1708409 1801572 1889980 1970844 2041611
62768B041611N8648M5207L0938J5990M70j5174l0154m3703n5467o5586p4289q1363
$$ 2041611 2100259 2145466 2176404 2192394 2192864 2177690 2147536 2103833 2048366 1982780 1908491 1827128
62756A827128q6162q8286q8131q6509q3922q0389p5915p0815o5610o0762n6474
$$ 1827128 1740966 1652680 1564549 1478040 1394118 1313729 1237814 1166999 1101389 1040627 984153
62745I84153n2512m8346m3723l9018l4804l1177k7825k4630k1744j9188j6841
$$ 984153 931641 883295 839572 800554 765750 734573 706748 682118 660374 641186 624345
62734F24345j4826j3355j2170j0693q889p327o094m389j789O74J583R61K41N14
$$ 624345 609519 596164 583994 573301 564412 557085 550991 546602 544813 545487 547070 548031 548272 548786
62720E48786J622L035M714O714Q668J0255J1700J3328J4951J6298J7807K0317
$$ 548786 550408 553443 558157 564871 573539 583794 595494 608822 623773 640071 657878 678195
62708F78195K3953K7919L1579L5269L9701M4922N0279N5284O0159O5385P0973
$$ 678195 702148 730067 761646 796915 836616 881538 931817 987101 1047260 1112645 1183618
62697A183618P6401Q1163Q5215Q8675R1176R1734Q9465Q4299P6807O7395N5926
$$ 1183618 1260019 1341182 1426397 1515072 1606248 1697982 1787447 1871746 1948553 2015948 2071874
62686B071874M2230K6657R998o985k3619l9123n2697o3938p2985q0073q5072q7683
$$ 2071874 2114104 2140761 2150759 2143774 2120155 2081032 2028335 1964397 1891412 1811339 1726267 1638584
62674A638584q8054q6995q5342q3189p9886p4983o8967o2928n7528n2575m7606
$$ 1638584 1550530 1463535 1378193 1295004 1215118 1140135 1071168 1008240 950712 898137 850531
62663H50531m2632l8130l4470l1584k9099k6636k4006k1274j8700j6529j4862
$$ 850531 807899 769769 735299 703715 674616 647980 623974 602700 584000 567471 552609
62652E52609j3685j2907j2300j1589j0680r684q662p534o350n401m849m437l839
$$ 552609 538924 526017 513717 502128 491448 481764 473102 465568 459218 453817 448968 444531 440692
62639D40692l107k493k044j738j742k078k222j685r72j168k366l241k676j223
$$ 440692 437585 435092 433048 431310 429568 427490 425268 423583 422611 421443 419077 415836 413160 411937
62625D11937l08l41m07K97J428K104J993J543J413J920K833L594L857L903M283
$$ 411937 411629 411288 410881 411178 412606 414710 416703 418246 419659 421579 424412 428006 431863 435766 440049
62610D40049N081N774O012O180O895Q175R567J1000J2989J5878J9227K2340K5108
$$ 440049 445130 450904 456916 463096 469991 478166 487733 498733 511722 527600 546827 569167 594275
62597E94275K7969L1169L4550L7904M1060M3528M4707M4687M4267M3731M2060
$$ 594275 622244 653413 687963 725867 766927 810455 855162 899849 944116 987847 1029907
62586A029907L8060L1929K4983J7988J0611K525n772j3565k0605k6826l1957l5859
$$ 1029907 1067967 1099896 1124879 1142867 1153478 1156003 1150231 1136666 1116061 1089235 1057278 1021419
62574A021419l8765m0807m1724m1396m0174l8347l5818l2831l0336k8851k7561
$$ 1021419 982654 941847 900123 858727 818553 780206 744388 711557 681221 652370 624809
62563F24809k5400k2606k0179j8110j5466j2227r678q597q181p425o569o324o407
$$ 624809 599409 576803 556624 538514 523048 510821 501143 492546 484365 476940 470371 464047 457640
62550D57640n895m642l375k522j742o84M06J028R81N09J51L70J073J544J213L72
$$ 457640 451745 447103 443728 441206 439464 438780 439186 440214 441195 441704 441855 442225 443298 444842 446055 446427
62534D46427j55J26J175K790M641O098O729O977P760R280J0895J2350J4394J7652
$$ 446427 446272 446398 447573 450363 455004 461102 467831 474808 482568 491848 502743 515093 529487 547139
62520E47139K1455K4522K6619K8816L2105L6281M0386M3850M6808M9549N1899
$$ 547139 568594 593116 619735 648551 680656 716937 757323 801173 847981 897530 949429
62509I49429N3316N3442N2339N0086M6377M0757L3329K4916J6372Q040Lp444j3862
$$ 949429 1002745 1056187 1108526 1158612 1204989 1245746 1279075 1303991 1320363 1328403 1328406 1320962 1307100
62496A307100j9034k2901k5229k5755k4565k2107j8751j4618r756m189K132R101
$$ 1307100 1288066 1265165 1239936 1214181 1189616 1167509 1148758 1134140 1124384 1120195 1122327 1131428
62484A131428J6129K2340K7223L0866L3536L5288L5923L4991L1841K6167J8656
$$ 1131428 1147557 1169897 1197120 1227986 1261522 1296810 1332733 1367724 1399565 1425732 1444388
62473A444388J0671L047m443j2300k0503k8777l7034m4944n1523n5844n8030n8950
$$ 1444388 1455059 1458106 1453663 1441363 1420860 1392083 1355049 1310105 1258582 1202738 1144708 1085758
62461A085758n9047n8060n5836n2676m8833m4298l9325l4592l0475k6675k2809
$$ 1085758 1026711 968651 912815 860139 811306 767008 727683 693091 662616 635941 613132
62450F13132j9018j5727j3088j0991r284p644n636l255j175p8J80L81J064K124
$$ 613132 594114 578387 565299 554308 545024 537380 531744 528489 527314 527236 527416 527797 528861 530985
62436E30985L138L758L772L085J720j99k357m194n270n859o728q070r064q975
$$ 530985 534123 537881 541653 544738 546458 546259 543902 539708 534438 528579 521851 513781 504717 495742
62422D95742q292q042q237p884o608n339n023n305n167m349l476l023k843k715
$$ 495742 487450 479408 471171 463287 456679 451340 446317 441012 435845 431496 428020 424997 422154 419439
62408D19439k690k722k513k003j642j757j948j554o13J66M35P11J554K634L065
$$ 419439 416749 414027 411514 409511 407869 406112 404164 402610 401997 402163 402598 403309 404863 407497 410562
62393D10562K562J775J422J490J505J329J387K080L282M437N180N663O258O975
$$ 410562 413124 414899 416321 417811 419316 420645 422032 424112 427394 431831 437011 442674 448932 455907
62379D55907P452P556P645Q028Q431Q448Q305Q646R636J0818J1905J3092J4521
$$ 455907 463359 470915 478560 486588 495019 503467 511772 520418 530054 540872 552777 565869 580390
62366E80390J6080J8010K0943K4861K8781L2045L5362L9777M4991M9720N3424
$$ 580390 596470 614480 635423 660284 689065 721110 756472 796249 841240 890960 944384
62355I44384N6649N9584O1236O0431N6957N1388M4356L6374K7944J9431J1012
$$ 944384 1001033 1060617 1121853 1182284 1239241 1290629 1334985 1371359 1399303 1418734 1429746
62344A429746K891m733j1963j9028k5703l1374l5850l9563m2682m4592m4696m3272
$$ 1429746 1432637 1427904 1415941 1396913 1371210 1339836 1303986 1264423 1221741 1177149 1132453 1089181
62332A089181m1047l8380l5382l2526l0367k8700k6661k3878k1056j9223j8646
$$ 1089181 1048134 1009754 974372 941846 911479 882779 856118 832240 811184 791961 773315
62321G73315j8697j8627j8286j8148j8659j9655k0371k0090j8701j6745j4990
$$ 773315 754618 735991 717705 699557 680898 661243 640872 620782 602081 585336 570346
62310E70346j3898j3186j1971r710p056n361n120n307m634l057j590r31q35p42
$$ 570346 556448 543262 531291 521581 514525 509164 504044 498737 494103 491046 489456 488525 487690 486948
62296D86948l64M13J674L237M648N689O625P759Q897R568R642R479R504R841J0292
$$ 486948 486584 486997 488671 491908 496556 502245 508870 516629 525526 535094 544736 554215 563719 573560 583852
62281E83852J0569J0448R889R075Q322P805P461P151O838O552O264O014O060O633
$$ 583852 594421 604869 614758 623833 632155 639960 647421 654572 661410 667962 674226 680240 686300 692933
62267F92933P568Q502R575J1492J4594J8302K2010K6089L1317L7467M3316M8155
$$ 692933 700501 709003 718578 730070 744664 762966 784976 811065 842382 879849 923165 971320
62255I71320N2446N6658O0180O1921O1340N8340N2744M4706L5297K5900J7076
$$ 971320 1023766 1080424 1140604 1202525 1263865 1322205 1374949 1419655 1454952 1480852 1497928
62244A497928Q561J66p985j5990k4111l2082l9147m4954m9830n3929n6760n7854
$$ 1497928 1506489 1506655 1498670 1482680 1458569 1426487 1387340 1342386 1292556 1238627 1181867 1124013
62232A124013n7380n5690n2722m8442m3552l9132l5528l2107k8207k4030k0391
$$ 1124013 1066633 1010943 958221 909779 866227 827095 791567 759460 731253 707223 686832
62221F86832j7768j5805j3737j1251q885p504p307p473o941n556m229l825m141
$$ 686832 669064 653259 639522 628271 619386 611882 604575 597102 590161 584605 580376 576551 572410
62208E72410m294l962l706l886l834k683p04R46J737K270L174M159M612M543M503
$$ 572410 568116 564154 560448 556562 552728 550045 549341 550287 552024 554294 557468 561627 566239 570782 575285
62193E75285M901N818P068Q110Q379Q112Q289R308J0263J0239R650R483R745R733
$$ 575285 580186 586004 593072 601182 609561 617673 625962 635270 645533 655772 665422 674905 684650 694383
62179F94383R408R280R168Q393P329P317Q807J0842J2801J5343J8986K3062K6985
$$ 694383 703791 713071 722239 730632 737961 745278 754085 764927 777728 793071 812057 835119 862104
62166H62104L1355L6696M1925M5345M6565M6304M4721M1235L5826K9358K2545
$$ 862104 893459 930155 972080 1017425 1063990 1110294 1155015 1196250 1232076 1261434 1283979
62155A283979J5534Q489J784m429j0187j5336j9810k4140k8866l3553l7182l9340
$$ 1283979 1299513 1308002 1309786 1305357 1295170 1279834 1260024 1235884 1207018 1173465 1136283 1096943
62143A096943m0208l9598l7144l3451k9930k7161k4470k1394j8445j6047j3748
$$ 1096943 1056735 1017137 979993 946542 916612 889451 864981 843587 825142 809095 795347
62132G95347j1219r108q153q067p992p498o509m913k920j215pJ414L455N235N756
$$ 795347 784128 775020 766867 758800 750808 743310 736801 731888 728968 727753 727746 729160 732615 737850 743606
62117G43606N400N122M615K709n03l351m558m401l703k886k494l388n630q008
$$ 743606 749006 754128 758743 761452 760949 757598 753040 748639 744936 742050 739556 736168 730538 722530
62103G22530r421j0093j0678j0894r992q099o073m274k416n57P61J461K210L441
$$ 722530 713109 703016 692338 681444 671452 663353 657280 653006 650590 650033 650794 652255 654465 657906
62089F57906M796N859O797P847Q773R280R624J0263J1154J1982J2825J4107J5847
$$ 657906 662702 668561 675358 683205 691978 701258 710882 721145 732299 744281 757106 771213 787060
62076G87060J7562J8914K0018K0991K1647K1931K2210K2827K3677K4564K5704
$$ 787060 804622 823536 843554 864545 886192 908123 930333 953160 976837 1001401 1027105
62065A027105K7375K9267L0665L1248L1157L0261K7911K3749J8314J2514O902
$$ 1027105 1054480 1083747 1114412 1145660 1176817 1207078 1234989 1258738 1277052 1289566 1296468
62054A296468J743k649o268r882j4394j9704k4817k9172l3196l7239m0556m2041
$$ 1296468 1298211 1295562 1289294 1279412 1265018 1245314 1220497 1191325 1158129 1120890 1080334 1038293
62042A038293m1698m0725m0131l9752l8815l6979l4586l2093k9649k7154k4514
$$ 1038293 996595 955870 915739 875987 837172 800193 765607 733514 703865 676711 652197
62031F52197k1777j9136j6805j4873j3271j1894j0699r649q655p713p008o708
$$ 652197 630420 611284 594479 579606 566335 554441 543742 534093 525438 517725 510717 504009
62019E04009o652o426n900n430n451n878o218o139n765n350m945m425l633k397
$$ 504009 497357 490931 485031 479601 474150 468272 462054 455915 450150 444800 439855 435430 431797 429400
62005D29400o89J127K427K967L168L559M131M596M925N161M868L485J305n16j222
$$ 429400 428711 429838 432265 435232 438400 441959 446090 450686 455611 460772 465640 469125 470430 469914 468692
61990D68692j232j396k005k940m255n919p300p661p127o555o424o419o142n614
$$ 468692 467460 466064 464059 461119 456864 450945 443645 435984 428857 422302 415878 409459 403317 397703
61976C97703m918l960k953k576l117l872l924l347l001l266l542l151k146j028
$$ 397703 392785 388825 385872 383296 380179 376307 372383 369036 366035 362769 359227 356076 353930 352902
61962C52902m5P78J227R84J85n20o15j95L40R16J778K916L850M201M267M715N764
$$ 352902 352857 353635 354862 355846 356031 355511 354896 354701 355041 355957 357735 360651 364501 368702 372969 377684 383448
61945C83448O995Q093R314J0990J2821J4087J4560J4768J5250J5867J6148J6021
$$ 383448 390443 398536 407850 418840 431661 445748 460308 475076 490326 506193 522341 538362
61933E38362J5748J5298J4203J2339J0405R268Q889Q299O680M132J298j393l794
$$ 538362 554110 569408 583611 595950 606355 615623 624512 632811 639491 643623 644921 643528 639734
61920F39734n658o685o996p073p095o590n031k556J31K469M383O075P717R304
$$ 639734 634076 627391 620395 613322 606227 599637 594606 592050 592181 594650 599033 605108 612825 622129
61906F22129J0617J1308J1235J0639R778Q440O205L158l2k850n360p685r551j0690
$$ 622129 632746 644054 655289 665928 675706 684146 690351 693509 693477 690627 685267 677582 668031 657341
61892F57341j1359j1882j1924j0948r335q282q326q660q352p605p199p207p111
$$ 657341 645982 634100 622176 611228 601893 593611 585285 576625 568273 560668 553469 546262 539151
61879E39151o903p111p651p664o800n868n616n563m775l325k135j628j360r67
$$ 539151 532248 525137 517486 509822 503022 497154 491538 485975 481200 477875 475740 474112 472752 471785
61865D71785n18J10J375L152M519N022N490O941R086J0828J1977J3516J6058J8850
$$ 471785 471267 471377 472752 475904 480423 485445 490935 497876 506962 517790 529767 543283 559341 578191
61851E78191K0761K1650K2288K3264K4451K5284K5192K3879K1551J8836J6117
$$ 578191 598952 620602 642890 666154 690605 715889 741081 764960 786511 805347 821464
61840H21464J3118R364N033Q60k710n796q410j0008j0053q735o756m571k126P37
$$ 821464 834582 843946 848979 849839 847129 841333 832923 822915 812862 804127 797371 792800 790674 791411
61826G91411L861O735Q760R705J0005J0311J0486R417O216J392l705q299j2417
$$ 791411 795272 802007 810767 820472 830477 840788 851274 860691 866907 868299 864594 856295 843878
61813H43878j5877j8110j9157j9945k0977k1552k0999j9954j9512j9538j8882
$$ 843878 828001 809891 790734 770789 749812 728260 707261 687307 667795 648257 629375
61802F29375j7155j5206j3767j2621j1416j0388r716q930p581o041n018m698m838
$$ 629375 612220 597014 583247 570626 559210 548822 539106 530176 522595 516554 511536 506838 502000
61789E02000n291n781n604m362k852k378l102l782l402k374j775j900k065j666
$$ 502000 496709 490928 485324 480962 478110 475732 472630 468848 465446 463072 461297 459397 457332 455666
61775D55666r11n35r61j848k370k006j108n10n51p16l99K69P06Q20J202K237L480
$$ 455666 454755 454220 453259 451411 449041 447035 445927 445417 444866 444150 443751 444020 444726 445546 446748 448985 452465
61758D52465M144M027L546K999K271J347O04K70o2q79j873k210j717j255j621
$$ 452465 456609 460636 464182 467181 469452 470799 471403 471673 471611 470732 468859 466649 464932 463677 462056
61743D62056k596l407l780m009m138l752k639j265l05L8N2M0M2K8R5L72Q35J326
$$ 462056 459460 456053 452273 448264 444126 440374 437735 436470 436165 436203 436255 436295 436337 436365 436460 436832 437667 438993
61725D38993J772K222K580K524J927J204R04J013J040Q31P43R40J012O69K59J24
$$ 438993 440765 442987 445567 448091 450018 451222 452126 453139 454179 455010 455753 456693 457705 458374 458633 458757
61709D58757j50j148k643l799m228m236m150m095m316m926n325m725l416k675
$$ 458757 458607 457459 454816 451017 446789 442553 438403 434308 429992 425066 419741 415016 411600 408925
61695D08925l060l650l476k935k945l377l230k164r52m78r13j874k752k924k275
$$ 408925 405865 402215 398739 395804 392859 389482 386252 384088 383136 382658 381745 379871 377119 374195 371920
61680C71920j541j572k193k440j975j513j606j735j148p4N66L66k55p61r53p70
$$ 371920 370379 368807 366614 364174 362199 360686 359080 357345 356197 356123 356689 357055 356800 356039 355086 354316
61664C54316k07M54P66O75O39J034J589J659R33j95r40p97l7N82O82P26J348K322
$$ 354316 354109 354563 355329 356004 356643 357677 359266 360925 361858 361663 360723 359926 359889 360471 361153 361879 363227 365549
61646C65549K737K212J475J399J950K495K807L088L232K801J839J015P20N35m1
$$ 365549 368286 370498 371973 373372 375322 377817 380624 383712 386944 389745 391584 392599 393319 393854 393813
61631C93813q69j570k236l145l979m040l260k454k353k770k955k481j607q86o18
$$ 393813 392944 391374 389138 385993 382014 377974 374714 372260 369907 367137 364182 361701 360094 359208 358590
61616C58590o44n72k02L07O57O46J37r38k279l213l380l244l465l900l806l067
$$ 358590 357946 357374 357172 357479 358136 358782 358919 357981 355702 352489 349109 345865 342400 338500 334694 331627
61600C31627k528k833l556l866l601l224l077l100l139l045k590j748r06n02m96
$$ 331627 329099 326266 322710 318844 315243 312019 308942 305842 302703 299658 297068 295320 294414 293912 293416
61585B93416n17m18l50l84l78k16J00M80O39J75q56j682j622j029p94j041j012
$$ 293416 292899 292481 292131 291747 291369 291153 291253 291733 292372 292547 291691 290009 288387 287358 286564 285523 284511
61568B84511m11J7l26q28n20M65J074P84J65pM26J205K009K398J942Q26l8Q6R24
$$ 284511 284100 284117 283791 282963 282443 282908 283982 284766 284931 284924 285350 286555 288564 290962 292904 293730 293692 293778 294702
61549B94702J666J952J973J792J245N56L67Q68J370J215P04O37J169J700J781
$$ 294702 296368 298320 300293 302085 303330 303886 304253 305121 306491 307706 308410 309047 310216 311916 313697
61534C13697J537J148M91m27j118j040j58J058J945J896P69p02j354q92l38o95
$$ 313697 315234 316382 316873 316446 315328 314288 314130 315188 317133 319029 319798 319096 317742 316850 316512 315817
61518C15817j515j577p15q1m31j077j001l05J57J36J38L26J86n16j131j012n40
$$ 315817 314302 312725 312010 311929 311498 310421 309420 309115 309272 309408 309546 309872 310058 309542 308411 307399 306859
61501C06859n89j128j105N7J449J742R18K48N14J025P61m8j92Q54K169K511J714
$$ 306859 306270 305142 304037 304094 305543 307285 308203 308451 308965 309990 310751 310703 310511 311365 313534 316045 317759
61484C17759O85K69M81P85P97N88M69O48J131J800K418K657K242J263J93m69n76
$$ 317759 318444 318713 319194 319979 320776 321364 321833 322481 323612 325412 327830 330487 332729 333992 334185 333716 333140
61467C33140k95J18M17L75p4p32j262j444j272q80l95J55Q02J380J414O33m54
$$ 333140 332845 332963 333380 333755 333681 332949 331687 330243 328971 328091 327696 327851 328653 330033 331447 332080 331626
61450C31626r08n46k22o41j396j681j418r87k53J142K646L036K069R15O43J051
$$ 331626 330718 330172 329950 329309 327913 326232 324814 323827 323574 324716 327362 330398 332467 333382 334025 335076
61434C35076J462J800K219K361J897J353J484K103K337J980J684J769J742J226
$$ 335076 336538 338338 340557 342918 344815 346168 347652 349755 352092 354072 355756 357525 359267 360493
61420C60493O82P37J317J828J924J667J184N88J29P5L41M91J71n15j147j485j689
$$ 360493 361175 361912 363229 365057 366981 368648 369832 370420 370549 370624 370965 371456 371627 371112 369965 368480 366791
61403C66791j976k148j721o52L39M75j59o91m15M76J227J279P29P7l28n99r39
$$ 366791 364815 362667 360946 360294 360633 361108 360949 360258 359843 360319 361546 362825 363554 363631 363303 362704 361765
61386C61765j116o65K94R36P91M92Q56J645J969J767J917K767L490L355K872K921
$$ 361765 360649 359984 360278 361214 362005 362497 363353 364998 366967 368734 370651 373418 376908 380263 383135 386056
61370C86056L360L257K317J278Q95J096J331J352J386J764K485L099L103K589
$$ 386056 389416 392673 394990 396268 397163 398259 399590 400942 402328 404092 406577 409676 412779 415368
61356D15368K318K910M071M931N041M732M530M579M696M615M106L105J920J126
$$ 415368 417686 420596 424667 429598 434639 439371 443901 448480 453176 457791 461897 465002 466922 468048
61342D68048J056J496J901J878J402P52L27L17M88L45l88j517k552l073l002k695
$$ 468048 469104 470600 472501 474379 475781 476533 476860 477177 477665 478010 477622 476105 473553 470480 467478 464783
61326D64783k723l303l901l680k434r08N7M68J032K154L412M115M166M166M676
$$ 464783 462060 458757 454856 451176 448742 447834 447891 448359 449391 451545 454957 459072 463238 467404 472080
61311D72080N629O565P337Q273R612J1092J2240J2909J3221J3087J2155J0252
$$ 472080 477709 484274 491611 499884 509496 520588 532828 545737 558958 572045 584200 594452
61299E94452P651M819K166N1j284j965k466l161m066n073o163p172p673p437o831
$$ 594452 602103 606922 609088 609139 607855 605890 603424 600263 596197 591124 584961 577789 570116 562679 555848
61284E55848o445o386o270n804n109m358l544k626j698q38k7O88J085J020O36
$$ 555848 549403 543017 536747 530943 525834 521476 517932 515306 513608 512770 512743 513431 514516 515536 516172
61269E16172K34O1K78R60J992L073M003M862N765O525O757O340N585M918M481
$$ 516172 516406 516467 516745 517705 519697 522770 526773 531635 537400 543925 550682 557022 562607 567525 572006
61254E72006M071L386K319J092R1m80q50j393k157k818l119l157l140l073k926
$$ 572006 576077 579463 581782 582874 582965 582485 581635 580242 578085 575267 572148 568991 565851 562778 559852
61239E59852k855k983l029k632k004j794k132k221j319K75J583K126K222K286
$$ 559852 556997 554014 550985 548353 546349 544555 542423 540202 538883 539158 540741 542867 545089 547375
61225E47375K413K666L233M091M976N779O597P226P095O093N025M786N339N870
$$ 547375 549788 552454 555687 559778 564754 570533 577130 584356 591451 597544 602569 607355 612694 618564
61211F18564N826N311M651L980L299K619K053J891K485L762N063N848O413P549
$$ 618564 624390 629701 634352 638332 641631 644250 646303 648194 650679 654441 659504 665352 671765 679314
61197F79314R523J1842J3930J5548J6479J6343J4950J2661J0119P823N920M235
$$ 679314 688837 700679 714609 730157 746636 762979 777929 790590 800709 808532 814452 818687
61185H18687K449N06j197k230k706l134l768m472n185o021o920p646q171q674
$$ 818687 821136 821642 820445 818215 815509 812375 808607 804135 798950 792929 786009 778363 770192 761518
61171G61518r070r157r182r644j0406j0734j0516j0606j1466j2267j2035j1054
$$ 761518 752448 743291 734109 724465 714059 703325 692809 682203 670737 658470 646435 635381
61159F35381j0263r724q727p224o033n575n231m282k809j357k23N25P28K15r53
$$ 635381 625118 615394 606667 599443 593410 587835 582604 578322 575513 574156 573933 574458 575186 575401 574448
61144E74448k434l762m575m912n145n374n158m194l025k451k306j576K24K443
$$ 574448 572014 568252 563677 558765 553620 548246 543088 538894 535869 533418 531112 529536 529760 532203
61130E32203M280N607O589P149P374P875R137J0802J2200J3324J4689J6375J7875
$$ 532203 536483 542090 548679 555828 563202 571077 580214 591016 603216 616540 631229 647604 665479
61117F65479J8904J9823K1052K2508K3816K4718K5032K4494K3115K1540K0641
$$ 665479 684383 704206 725258 747766 771582 796300 821332 845826 868941 890481 911122
61106I11122K0455J9951J8168J5424J2847J0761Q243M530K37l518o578r483j2100
$$ 911122 931577 951528 969696 985120 997967 1008728 1016971 1021501 1021738 1018220 1011642 1002159 990059
61093I90059j3599j3924j4156j4995j5825j5845j5340j5011j4691j3667j1961
$$ 990059 976460 962536 948380 933385 917560 901715 886375 871364 856673 843006 831045
61082H31045j0401r458q847q224p544o602m912k398K48K238L449M375N606P383
$$ 831045 820644 811186 802339 794115 786571 779969 775057 772659 772907 775145 778594 782969 788575 795958
61068G95958R418J0956J1412J1048J0890J1817J3826J6161J7977J8909J9320J9979
$$ 795958 805376 816332 827744 838792 849682 861499 875325 891486 909463 928372 947692 967671
61056I67671K1295K2872K4039K4672K5078K5264K4946K4267K3824K3783K3618
$$ 967671 988966 1011838 1035877 1060549 1085627 1110891 1135837 1160104 1183928 1207711 1231329
61045A231329K3033K2508K2441K2352K1643K0620K0008J9778J9330J8709J8656
$$ 1231329 1254362 1276870 1299311 1321663 1343306 1363926 1383934 1403712 1423042 1441751 1460407
61034A460407J9382K0203K0726K1485K2865K4219K4754K4776K5172K6090K7072
$$ 1460407 1479789 1499992 1520718 1542203 1565068 1589287 1614041 1638817 1663989 1690079 1717151
61023A717151K8433L1438L6851M4008N1711N9430O7355P5885Q5641R7570J12625
$$ 1717151 1745584 1777022 1813873 1857881 1909592 1969022 2036377 2112262 2197903 2295473 2408098
61012B408098J31655J56044J88092K30420K85418L55689M44664N56421O95268
$$ 2408098 2539753 2695797 2883889 3114309 3399727 3755416 4200080 4756501 5451769
61003E451769Q64864J064453J282612J494924J670024J777235J786056J663651
$$ 5451769 6316633 7381086 8663698 10158622 11828646 13605881 15391937 17055588
60995A7055588J389471R88360N48686J90943K04j9904O6730J77938K44231K06934
$$ 17055588 18445059 19433419 19982105 20173048 20173252 20153348 20220078 20398016 20642247 20849181
60985B0849181J8171l31642p84719j229816j560050j726088j742741j656707j513426
$$ 20849181 20867352 20535710 19750991 18521175 16961125 15235037 13492296 11835589 10322163
60976A0322163j345163j173081j009805q60674p27121o10328n11347m29259l61370
$$ 10322163 8977000 7803919 6794114 5933440 5206319 4595991 4084644 3655385 3294015
60967C294015l05284k59627k23022j93606j69709j50117j33553j18775j05244
$$ 3294015 2988731 2729104 2506082 2312476 2142767 1992650 1859097 1740322 1635078
60958A635078r3063q2109p1860o2210n3690m6704m1074l6601l3436l1512l0173
$$ 1635078 1542015 1459906 1388046 1325836 1272146 1225442 1184368 1147767 1114331 1082819 1052646
60947A052646k8764k7258k5875k4470k2814k1204k0173j9676j9056j7975j6902
$$ 1052646 1023882 996624 970749 946279 923465 902261 882088 862412 843356 825381 808479
60936H08479j6479j6678j6867j6621j6120j5698j5247j4371j3048j1830j1180
$$ 808479 792000 775322 758455 741834 725714 710016 694769 680398 667350 655520 644340
60925F44340j0825j0101q832p581o860o434n627m227k884k451l023l734l687k970
$$ 644340 633515 623414 614582 607001 600141 593707 588080 583853 580969 578518 575495 571761 568074 565104
60911E65104k480k654k794j990m09Q49J093P03L94M07N57O67N68L3r38j976k781
$$ 565104 562624 559970 557176 555186 554777 555626 556719 557422 557816 558223 558780 559447 560015 560048 559110 557134 554353
60894E54353l479m294n023n271n075m923n123n425n424n163n089n474o040o281
$$ 554353 550874 546580 541557 536286 531211 526288 521165 515740 510316 505153 500064 494590 488550 482269
60880D82269o161o252o955p755p646o352m692l572k979k372j694j437j724j849
$$ 482269 476108 469856 462901 455146 447500 441148 436456 432884 429905 427533 425839 424402 422678 420829
60866D20829j012P30K514L591L967M135M353M421M134L654L282L046K825K691
$$ 420829 419817 420547 423061 426652 430619 434754 439107 443528 447662 451316 454598 457644 460469 463160
60852D63160K757K730K247J625J688K532L102K433Q96m00j018j357j709j945k089
$$ 463160 465917 468647 470894 472519 474207 476739 479841 482274 483170 482770 481752 480395 478686 476741 474652
60837D74652k430k973l394l738m432n413n888n328m277l628l558l579l342k933
$$ 474652 472222 469249 465855 462117 457685 452272 446384 441056 436779 433151 429593 426014 422672 419739
60823D19739k619k667l220l975m241l738l052k906l256l596l872m359m790m504
$$ 419739 417120 414453 411233 407258 403017 399279 396227 393321 390065 386469 382597 378238 373448 368944
60809C68944l554k892l042l311k768j481k45M58O04J32r15j925k153j687j337
$$ 368944 365390 362498 359456 356145 353377 351896 351651 352109 352713 352845 351930 350005 347852 346165 344828
60794C44828j416j309n02N59J128J181J260J568J848J988K180K405K328J871J491
$$ 344828 343412 342103 341601 342160 343288 344469 345729 347297 349145 351133 353313 355718 358046 359917 361408
60779C61408J596J961K019J618J186J180J526J698J309N66L9j0O4j91o71r04q09
$$ 361408 363004 364965 366984 368602 369788 370968 372494 374192 375501 376067 376106 376096 376160 375969 375298 374394 373585
60762C73585q24j168j437j215p69o99j067j338j193r69j136j594j777j333n72
$$ 373585 372761 371593 370156 368941 368172 367473 366406 365068 363875 362906 361770 360176 358399 357066 356494
60747C56494j09j66l20o7M60N96L7o72q63o88r57k091l584m592m695m082l270
$$ 356494 356385 356219 355899 355832 356292 356888 356925 356253 355390 354702 353745 351654 348070 343478 338783 334701 331431
60730C31431k731k579k451j909j038l91k83l81j58M64J104J381J246R79R07J047
$$ 331431 328700 326121 323670 321761 320723 320332 320049 319668 319510 319974 321078 322459 323705 324684 325591 326638
60714C26638J059P51N02Q25J581K147K432K956L719L800K669J225O71Q93R23O06
$$ 326638 327697 328448 328950 329775 331356 333503 335935 338891 342610 346410 349079 350304 350975 351868 352791 353397
60698C53397O63J172J231M69k79l32k57q68j905k505k442k060j397l25P02R42
$$ 353397 354060 355232 356463 356932 356653 356321 356064 355196 353291 350786 348344 346284 344887 344562 345264 346206
60682C46206M57J05L71Q61J095J168J366J634J761J692J434R42K88l23q48j464
$$ 346206 346663 346768 347139 348000 349095 350263 351629 353263 355024 356716 358150 359092 359380 359057 358209 356745
60666C56745k255l069l739m139l996l113j871j063r61r78m84L75J040J332J494
$$ 356745 354490 351421 347682 343543 339547 336434 334563 333500 332539 331561 331077 331452 332492 333824 335318
60651C35318J707K030K616L548M446M622L704J968Q0j306j890j916j955k338k836
$$ 335318 337025 339055 341671 345219 349665 354287 357991 359959 360039 358733 356843 354927 352972 350634 347798
60636C47798l060k964k702k246j519q20o19r37j253j091m46L96J150J604J738
$$ 347798 344738 341774 339072 336826 335307 334487 333868 332931 331678 330587 330141 330537 331687 333291 335029
60621C35029J783J926J916J360M55p0K5L7o83j641j769r26j37k00o60o12K6N63
$$ 335029 336812 338738 340654 342014 342469 342399 342424 342461 341778 340137 338368 337442 337305 337105 336445 335833 335859 336422
60603C36422O79P94J252J724J785J600J592J714J638J514J873K675L078K447J203
$$ 336422 337101 337895 339147 340871 342656 344256 345848 347562 349200 350714 352587 355262 358340 360787 361990
60588C61990K54rJ78O08J215J693J607J055P75J255J989K027J180L68O19J896
$$ 361990 362244 362235 362413 363021 364236 365929 367536 368591 369366 370621 372610 374637 375817 376185 376804 378700
60572C78700L218L910M408N554P365Q997R867J0224J0481J0454R675Q096O034
$$ 378700 381918 385828 390236 395790 403155 412152 422019 432243 442724 453178 462853 470949 476983
60559D76983L680J125j319l277m727n807o302n811m416k768j399l36O14J551K572
$$ 476983 480663 481788 480469 477192 472465 466658 460356 454545 450129 447361 445962 445626 446240 447791 450363
60544D50363L784N037O016O718P609R129J1221J3436J5297J6509J7081J7294J7320
$$ 450363 454147 459184 465200 471918 479527 488656 499877 513313 528610 545119 562200 579494 596814
60531E96814J6788J5071J2092Q581N278K210j033m476p489r365j0007j0016j0011
$$ 596814 613602 628673 640765 649346 654624 656834 655801 651325 643836 634471 624464 614448 604437
60518F04437r953r273p790o149m994m093k879j600j117j474j545m12J597L735
$$ 604437 594484 585211 577421 571272 566278 562185 559306 557706 556589 555115 553570 553158 554755 558490
60504E58490N960Q662J1809J5131J8820K3186K7798L1671L4389L6431L8210L9323
$$ 558490 564450 573112 584921 600052 618872 642058 669856 701527 735916 772347 810557 849880
60492H49880L9003L7025L3928L0536K7355K4316K0962J6949J2336P295J766m406
$$ 849880 888883 925908 959836 990372 1017727 1042043 1063005 1079954 1092290 1099585 1101351 1096945
60480A096945j1120j8088k5111l1928l7874m2100m4282m4867m4483m3345m1321
$$ 1096945 1085825 1067737 1042626 1010698 972824 930724 886442 841575 797092 753747 712426
60469G12426l8355l4653l0605k6668k3222k0459j8257j6226j3941j1334q927p471
$$ 712426 674071 639418 608813 582145 558923 538464 520207 503981 490040 478706 469779 462308
60457D62308p133p191o759n707m693m284m363m364l915l135k423k065k024k065
$$ 462308 455175 447984 441225 435518 430825 426541 422178 417814 413899 410764 408341 406276 404252 402187
60443D02187k046j992j911j725j424j117q17m23J8K10l0n22j057j686k407k769
$$ 402187 400141 398149 396238 394513 393089 391972 391155 390732 390750 390960 390930 390408 389351 387665 385258 382489
60427C82489k218q53N15J089P17j60r58j334j325j132p73r9P98J449J570J507
$$ 382489 380271 379418 379933 381022 381739 381579 380621 379287 377962 376830 376057 375958 376756 378205 379775 381282
60411C81282J833K562L130L044K311J365P78R00J437J602J029L35L04P86J049
$$ 381282 383115 385677 388807 391851 394162 395527 396305 397205 398642 400244 401273 401608 401912 402698 403747
60396D03747J063J611K956M209M449L869L348L266L314L213L065L053L175L272
$$ 403747 404810 406421 409377 413586 418035 421904 425252 428518 431832 435045 438110 441163 444338 447610
60382D47610L094K415J402Q05J352K825M050M074L243K757L153L614L087J785
$$ 447610 450704 453119 454521 455326 456678 459503 463553 467627 470870 473627 476780 480394 483481 485266
60368D85266R65J239J828J827J500J587J877J472M31J37J653M450P084Q667R219
$$ 485266 486231 487470 489298 491125 492625 494212 496089 497561 497992 498129 499782 504232 511316 519983 529202
60353E29202R197R156R503J0078J0167R298P719N775L254o2l511o018p341q229
$$ 529202 538399 547555 557058 567136 577303 586601 594320 600095 603349 603287 599776 593758 586417 578188
60339E78188r191r780r358q111o836n952n190m223l254k764k891l281l563l718
$$ 578188 568997 559217 549859 541748 534912 528960 523770 519547 516293 513529 510638 507357 503794 500076
60325E00076l842l827l500l009k629k251j477k60R21J771K640M016N903Q027J0263
$$ 500076 496234 492407 488907 485898 483269 481018 479541 479281 480202 481973 484613 488629 494532 502559 512822
60310E12822J2402J3834J4081J3504J2938J2621J2030J0837R379P952O195L646
$$ 512822 525224 539058 553139 566643 579581 592202 604232 615069 624448 632400 638595 642241
60298F42241N23k467n016p474j0218j3058j5352j6494j6209j4620j2194r657p670
$$ 642241 642764 640297 635281 627807 617589 604531 589179 572685 556476 541856 529662 520005 512335
60285E12335o425n582m724l893l462l480l424k878k251k344l273m207m355l803
$$ 512335 505910 500328 495604 491711 488249 484769 481345 478467 476216 473872 470599 466392 462037 458234
60271D58234l170k781k554k403k366k388k357k329k409k405j947j046k13J57K23
$$ 458234 455064 452283 449729 447326 444960 442572 440215 437886 435477 433072 431125 430079 429866 430023 430246
60256D30246L16M37L78J35o8q2J24N51J081J391J313J146J255J479J392J100J151
$$ 430246 430562 430999 431377 431512 431444 431362 431486 432037 433118 434509 435822 436968 438223 439702 441094 442194 443345
60239D43345J533J472N49n42r33p89r09j397j514q17K88J275K089K786L159L106
$$ 443345 444878 446350 446899 446357 445424 444635 443726 442329 440815 439998 440286 441561 443650 446436 449595 452701
60223D52701K984L104L223K944K491K545L340M320M852N011N420O369P381P759
$$ 452701 455685 458789 462012 464956 467447 469992 473332 477652 482504 487515 492935 499304 506685 514444
60209E14444P474P239P615Q247Q308P572O675O262O172N757M713L422K461K001
$$ 514444 521918 529157 536772 545019 553327 560899 567574 573836 580008 585765 590478 593900 596361 598362
60195E98362J720J215N57L20R22J877K037P34j532l627m841n206n021m479l718
$$ 598362 600082 601297 601854 602174 603096 604973 607010 607744 606212 602585 597744 592538 587517 583038 579320
60180E79320k995k654k932l734m576m868m443l719l209k962k627k023j438j317
$$ 579320 576325 573671 570739 567005 562429 557561 553118 549399 546190 543228 540601 538578 537140 535823
60166E35823j827k621l041k562j328j48K08k57q93j198j193r97m48N04J322J270
$$ 535823 533996 531375 528334 525772 524444 524296 524504 524247 523354 522156 520963 519966 519518 520022 521344 522614
60150E22614L56n13m85L50J220J595J597J598J749J978K203K485K985L784M620
$$ 522614 522970 522457 521972 522322 523542 525137 526734 528332 530081 532059 534262 536747 539732 543516 548136
60135E48136M929M402L488L020L350M032M432M257L519K391J295P63R21J386J872
$$ 548136 553065 557467 560955 563975 567325 571357 575789 580046 583565 585956 587251 588014 588935 590321 592193
60120E92193K502L305L832L710L156K556J948J369J248J723J978J093n96j871
$$ 592193 594695 598000 601832 605542 608698 611254 613202 614571 615819 617542 619520 620613 620017 618146
60106F18146k229k210k231k077j785j951k704l173k626j470n52o0L33P05R44J138
$$ 618146 615917 613707 611476 609399 607614 605663 602959 599786 597160 595690 595138 595078 595411 596116 597060 598198
60090E98198J391J490J283J078J137J088M30o40j431j706j910k489l439m463n197
$$ 598198 599589 601079 602362 603440 604577 605665 606095 605455 604024 602318 600408 597919 594480 590017 584820
60075E84820n415n252n207n626o304o772o780o282n329m289l833m274n138n761
$$ 584820 579405 574153 568946 563320 557016 550244 543464 537182 531853 527564 523731 519457 514319 508558
60061E08558n944n738n055m051l430l596l802l002j359p8K10J6q7n8L09J648L891
$$ 508558 502614 496876 491821 487770 484340 480744 476942 473940 472581 472503 472713 472729 472642 472584 472893 474541 478432
60044D78432N681N816M836M353M963N627N241M064L143K846K566J770O82j83o96
$$ 478432 484113 489929 494765 499118 504081 509708 514949 519013 522156 525002 527568 529338 530020 529837 529141
60029E29141r86j048j011j484k889m517n115m625m489n727p482q223p776p239
$$ 529141 528155 527107 526096 524612 521723 517206 512091 507466 502977 497250 489768 481545 473769 466530
60015D66530p196p086o345n223m176l236k357j831j913k359k661k606k377k235
$$ 466530 459334 452248 445903 440680 436504 433268 430911 429080 427167 424808 422147 419541 417164 414929
60001D14929k257k239j856j015m4N87O67K78k99n33J35J650L186M048M432M862
$$ 414929 412672 410433 408577 407562 407518 408105 408772 409050 408751 408218 408353 410003 413189 417237 421669 426531
59985D26531N150M637L265J766P71L57M01P05P28j03j625l003l652l613l136k499
$$ 426531 431681 436318 439583 441349 442120 442477 442878 443583 444311 444208 442583 439580 435928 432315 429179 426680
59969D26680k247k766l474l267j991p16k38j23L02Q68J110J187J479J750J453
$$ 426680 424433 421667 418193 414926 412935 412219 411981 411858 412160 413028 414138 415325 416804 418554 420007
59954D20007O46q4l76k85J14P49J335J600J590J496J310R88O63L62j98j063j678
$$ 420007 420653 420569 420193 419908 420022 420771 422106 423706 425296 426792 428102 429090 429753 430115 429917 428854 427176
59937D27176j532r31o19p44p99m25K62J092K086L259M526N772O651O486M946K793
$$ 427176 425644 424713 424094 423350 422551 422126 422388 423480 425566 428825 433351 439123 445774 452260 457206 459999
59921D59999J363J116J177N59o76j745k270k520k689k529j812p78J66J000J933
$$ 459999 461362 462478 463655 464214 463538 461793 459523 457003 454314 451785 449973 449195 449361 450361 452294
59906D52294K763K851J983Q89M84Q03J112J016Q56J046J495J928K301K642K863
$$ 452294 455057 457908 459891 460780 461264 462067 463179 464195 465051 466097 467592 469520 471821 474463 477326
59891D77326L034L473M247M911N073M993N216N844O493O802O699O343O049O133
$$ 477326 480360 483833 488080 492991 498064 503057 508273 514117 520610 527412 534111 540454 546503 552636
59877E52636O496O584O023N069M118L130J914P23k4m96j253k241k622j890p30
$$ 552636 559132 565716 571739 576808 580926 584056 585970 586693 586669 586173 584920 582679 580057 578167 577437
59862E77437l64j209k472k993k305r07L23Q92J039J338K113L207M309N287O122
$$ 577437 577073 575864 573392 570399 568094 567187 567510 568402 569441 570779 572892 576099 580408 585695 591817
59847E91817O552O058M403K103P6j176j746j731r78K75J096P90k67j316k358l766
$$ 591817 598369 604427 608830 610933 611009 609833 608087 606356 605378 605653 606749 607539 607272 605956 603598 599832
59831E99832n011n008l767k561k124j790r59k97o25j496j905j861k120k831l388
$$ 599832 594821 589813 586046 583485 581361 579571 578612 578315 577690 576194 574289 572428 570308 567477 564089
59816E64089l504l447l333k988k513k218k018j589j095j099j729k503l028l282
$$ 564089 560585 557138 553805 550817 548304 546086 544068 542479 541384 540285 538556 536053 533025 529743
59802E29743l351l362l619m176m440l869k936k607l004l387l383l254k924j852
$$ 529743 526392 523030 519411 515235 510795 506926 503990 501383 498379 494992 491609 488355 485431 483579
59788D83579k11Q33N58l80j017j365j943k614k690j893n83P53J746K125J952J749
$$ 483579 483368 484201 484759 484379 483362 481997 480054 477440 474750 472857 472274 473027 474773 476898 478850 480599
59772D80599J989K583L127L430L449L046K289J781K193L389M438M600M001L371
$$ 480599 482588 485171 488298 491728 495177 498223 500512 502293 504486 507875 512313 516913 520914 524285
59758E24285L257L657M200M531M481M028L302K756K959L904M709M507L526K808
$$ 524285 527542 531199 535399 539930 544411 548439 551741 554497 557456 561360 566069 570576 574102 576910
59744E76910K896L359L672L838L862L308J980O12K49J093K383L237L289K712J960
$$ 576910 579806 583165 586837 590675 594537 597845 599825 600437 600686 601779 604162 607399 610688 613400 615360
59729F15360J460J275J215J329J873K630K829K145J335J242J524J122j76j391
$$ 615360 616820 618095 619310 620639 622512 625142 627971 630116 631451 632693 634217 635339 635163 633772
59715F33772j556p34K98Q21N97j4l39o3L33K41j42j77R4nn44o89n9N84N80N38
$$ 633772 632216 631482 631780 632601 633198 633184 632845 632782 633115 633356 633214 633037 633131 633126 632582 631893 631834 632418 632998 633536
59695F33536J374K696L186K392J105J2r99k054k758k900k936l233l494l443l502
$$ 633536 634910 637606 640792 643184 644289 644301 643302 641248 638490 635590 632654 629421 625927 622484 618982
59680F18982m052m569m315l614l498m246n151n678n982o095n614m614l968m161
$$ 618982 614930 610361 606046 602432 598934 594688 589537 583859 577877 571782 566168 561554 557586 553425
59666E53425m409l681k110p53k49l82o51o18O6J258K087J864J112R84J718K415
$$ 553425 549016 545335 543225 542472 542223 541841 541190 540572 540638 541896 543983 545847 546959 547943 549661 552076
59650E52076K436K153J983J556M07j088k140k630l162m058m892n059m504l719
$$ 552076 554512 556665 558648 560204 560611 559523 557383 554753 551591 547533 542641 537582 533078 529359
59636E29359l121k627j906j035o70j268k382l053k902k410k109k016k004k205
$$ 529359 526238 523611 521705 520670 520000 518732 516350 513297 510395 507985 505876 503860 501856 499651
59622D99651k702l157l160k738k268k046k174k611l067l064k416j504q23l84J14
$$ 499651 496949 493792 490632 487894 485626 483580 481406 478795 475728 472664 470248 468744 467921 467537 467651
59607D67651O63R25Q13P14R98J503J736J464R87P88R91J289J348J211J181J436
$$ 467651 468314 469239 470052 470766 471764 473267 475003 476467 477454 478242 479233 480522 481870 483081 484262 485698
59591D85698J861K181K115J524N67l41r09j230j485j612j571j661k154k718k752
$$ 485698 487559 489740 491855 493379 493946 493605 492696 491466 489981 488369 486798 485137 482983 480265 477513
59576D77513k249j776j637j656j771k138k485k161j151l05j22p3L50O26L4j047
$$ 477513 475264 473488 471851 470195 468424 466286 463801 461640 460489 460184 460062 459989 460339 460965 460999 459952
59560D59952j557j149l94K30O68Q04M64lR9Q95J782K234K303K276K412L093M615
$$ 459952 458395 457246 456852 457082 457750 458554 459018 459015 459114 460009 461791 464025 466328 468604 471016 474109 478724
59543D78724O696Q715J0514J2398J4310J5670J6227J6206J5330J2572P541J563
$$ 478724 485420 494135 504649 517047 531357 547027 563254 579460 594790 607362 614903 616466
59531F16466l383o468q056q471p625n818l899k343q58P15J719J444K24q14j034
$$ 616466 613083 606615 598559 590088 582463 576645 572746 570403 569545 570260 571979 573423 573647 572833 571799
59516E71799q67j025j618k315l124m432o254p755p958o853n494m920n156n446
$$ 571799 570932 569907 568289 565974 562850 558418 552164 544409 536451 529598 524104 519184 514028 508582
59502E08582n228m618m023l582l154k655k168j738j198m36K87M58m2n84l76N91
$$ 508582 503354 498736 494713 491131 487977 485322 483154 481416 480218 479782 480069 480527 480485 479901 479525 480116
59486D80116J523J886K096K811L844M396M281M267M921N744N916N494N209N305
$$ 480116 481639 483525 485621 488432 492276 496672 500953 505220 510141 515885 521801 527295 532504 537809
59472E37809N253M583L387J908K75j125j686j344q30o88n10L68J775K944L585
$$ 537809 543062 547645 551032 552940 553215 552090 550404 549060 548230 547542 547032 547400 549175 552119 555704
59457E55704M104M851N768O703P565Q136Q254Q152Q095P752O570M793L359K586
$$ 555704 559808 564659 570427 577130 584695 592831 601085 609237 617332 625084 631654 636447 639806 642392
59443F42392J685j16k513m602n852o258n999n416m935m580l972l113k627k725
$$ 642392 644077 643961 641448 636846 630994 624736 618737 613321 608386 603806 599834 596721 594094 591369
59429E91369k553j259O41J869K164K582M000O097Q052R635J1299J3627J6922K0942
$$ 591369 588816 587557 588198 590067 592231 594813 598813 604910 612962 622597 633896 647523 664445 685387
59415F85387K4831K7661K9251L0094L0138K8015K2081J2334J098q399j3982j5294
$$ 685387 710218 737879 767130 797224 827362 855377 877458 889792 890890 882491 868509 853215
59403H53215j3098q496k835K388O200Q540R358P526J707p426j6711k2946k5341
$$ 853215 840117 831621 828786 831174 837374 845914 855272 862798 864505 857079 840368 817422 792081
59390G92081k5057k3157k0026j6416j3606j2106j1002r102o424m131l276l730
$$ 792081 767024 743867 723841 707425 693819 681713 670711 661609 655185 651054 647778 644048
59378F44048m274l745k218r17p41j208j214n44M4J2l74o30n35M6J130K251K826
$$ 644048 639774 636029 633811 632894 632153 630945 629731 629187 629231 629243 628869 628239 627704 627750 628880 631131 633957
59361F33957K977L417M337N147N523N948O804P722Q371R209J0780J2706J4145
$$ 633957 636934 640351 644688 649835 655358 661306 668110 675832 684203 693412 704192 716898 731043
59348G31043J4812J4963J4656J3834J2889J2375J2157J1476R950P967O035M221
$$ 731043 745855 760818 775474 789308 802197 814572 826729 838205 848155 856122 862157 866378
59336H66378K317J70k280m948p558r920j2185j4503j6473j7428j7266j6588j5893
$$ 866378 868695 868865 866585 861637 854079 844159 831974 817471 800998 783570 766304 749716 733823
59323G33823j5061j3826j2343j1100j0420j0251j0236r898q969p648o382n393
$$ 733823 718762 704936 692593 681493 671073 660822 650586 640688 631719 624071 617689 612296
59311F12296m636m110l814l328j970L96L112N509P590R571J1152J1671J0749Q346
$$ 612296 607660 603550 599736 596408 594438 594834 597946 603455 611045 620616 631768 643439 654188 662534
59297F62534M454o29n813r730j1899j2941j3519j3514j2522j0621q250n684l100
$$ 662534 666988 666359 660546 650816 638917 625976 612457 598943 586421 575800 567550 561866 558766
59284E58766r30M16J146J950L198M574N621O318O987P889R009J0102J0875J1267
$$ 558766 557836 558252 559398 561348 564546 569120 574741 581059 588046 595935 604944 615046 625921 637188
59270F37188J1590J2201J2951J3232J2642J1380R856Q213O443M741L407K448J562
$$ 637188 648778 660979 673930 687162 699804 711184 721040 729253 735696 740437 743844 746292 747854
59257G47854M41j092l066n184o680o792n575m002l057k857k779k315j491n38N40
$$ 747854 748295 747203 744137 738953 732273 725481 719906 715904 712847 709990 707211 704896 703405 702867 703407
59242G03407J787K855L163K582J757J497J936K489K519J767K76j705l604m761
$$ 703407 705194 708049 711212 713794 715551 717048 718984 721473 723992 725759 726035 724330 720726 715965
59228G15965n041n051n531o664q106r404j0149j0054r270q490q277q355p921o691
$$ 715965 710924 705873 700342 693678 685572 676168 666019 655965 646695 638205 629928 621573 613652 606961
59214F06961n262m364m044l792l209k355j531r46o00l73j85M4M69J201K013K369
$$ 606961 601699 597335 593291 589499 586290 583935 582404 581458 580858 580485 580300 580344 580813 582014 584027 586396
59198E86396K034J474J432K147L164L833L751K840J378N1m25L8Q02J131Q90M91
$$ 586396 588430 589904 591336 593483 596647 600480 604231 607071 608449 608500 608075 608113 608915 610046 610936 611427
59182F11427L57N61Q70R88P57K69j86l16p2K55K62j00l42P9J061J901K097J849
$$ 611427 611784 612345 613215 614203 614960 615229 615043 614727 614655 614910 615172 615072 614730 614809 615870 617771 619868 621717
59164F21717J624J524J392J228J111Q31M1j211k464l370m039m818n904p133p979
$$ 621717 623341 624865 626257 627485 628596 629427 629468 628257 625793 622423 618384 613566 607662 600529 592550
59149E92550p946p143o285n858n534m810l967l773m312m806m697m304m163m241
$$ 592550 584604 577461 571176 565318 559784 554974 551007 547234 542922 538116 533419 529115 524952 520711
59135E20711m149l781l353l047k880k744k408j664o22L44J057J742K655L775M996
$$ 520711 516562 512781 509428 506381 503501 500757 498349 496685 496063 496407 497464 499206 501861 505636 510632
59120E10632O261P407Q116Q310Q304Q441Q771R250R940J0731J1165J0874J0027
$$ 510632 516893 524300 532416 540726 549030 557471 566242 575492 585432 596163 607328 618202 628229
59107F28229R115Q396P732O888N766M486L353K623K184J590N30q80k297l397l871
$$ 628229 637344 645740 653472 660360 666126 670612 673965 676588 678772 680362 680892 680012 677715 674318 670447
59092F70447l557k750k010j513q97q6K33o14k263l617m088m109m375n031n704
$$ 670447 666890 664140 662130 660617 659720 659634 659867 659253 656990 653373 649285 645176 640801 635770 630066
59077F30066o051o092o101o299o569o572o147n482m848m314l874l634l620l560
$$ 630066 624015 617923 611822 605523 598954 592382 586235 580753 575905 571591 567717 564083 560463 556903
59063E56903l170k615k366k608k939k776j986j082q45j600k835l626l516k840
$$ 556903 553733 551118 548752 546144 543205 540429 538443 537361 536516 534916 532081 528455 524939 522099
59049E22099k167j695j323j034q62o94m23j88k22m95p74q83p02r3Q66J661J748
$$ 522099 519932 518237 516914 515880 515018 514324 513901 513713 513491 512996 512222 511339 510637 510544 511410 513071 514819
59032E14819J249Q92J201K038K971L784M493N179N991P121Q541R909J0824J1135
$$ 514819 516068 516960 518161 520199 523170 526954 531447 536626 542617 549738 558279 568188 579012 590147
59018E90147J0896J0201R208Q123O981N522L502J150r12k243k876l005k622j694
$$ 590147 601043 611244 620452 628575 635556 641078 644580 645730 644818 642575 639699 636694 634072 632378
59004F32378n38L34Q23J443K692M346N547N624M697L524K840K741K640J904O01
$$ 632378 631840 632174 632997 634440 637132 641478 647025 652649 657346 660870 663710 666451 669091 670995 671596
58989F71596m70o51j43K73Q2o50j606k428k689k099q95K93J157K010L280M959
$$ 671596 671126 670475 670332 670605 670687 670037 668431 666003 663314 661215 660320 660613 661770 663780 667060 672019
58973F72019O715Q247R381J0042J0410J0854J1461J1795J1417J0560R978J0109
$$ 672019 678734 686981 696362 706404 716814 727668 739129 750924 762341 772901 782879 792988
58961G92988J0547J0390R001O455L421O23j630l462n165o969r053j1516j4093
$$ 792988 803535 813925 822926 829381 832802 833425 831795 828333 823168 816199 807146 795630 781537
58948G81537j6088j6788j6094j4645j3260j2225j1208r879q421p219o190m872
$$ 781537 765449 748661 732567 717922 704662 692437 681229 671350 662929 655710 649520 644648
58936F44648l256k042j738j888j695j122q36j173j733k051k073j895j517j098
$$ 644648 641392 639350 637612 635724 634029 632907 632071 630898 629165 627114 625041 623146 621629 620531
58922F20531j035j478k067k307k112j754j456j156o56O8O59P53O19J102K554M223
$$ 620531 619496 618018 615951 613644 611532 609778 608322 607166 606510 606578 607237 607990 608609 609711 612265 616488
58906F16488N185N565O210P438Q874J0331J1870J3044J3110J2241J1590J1737
$$ 616488 621673 627238 633448 640886 649760 660091 671961 685005 698115 710356 721946 733683
58894G33683J2036J1817J1455J1617J2295J3188J4369J5854J7096J7560J7371
$$ 733683 745719 757536 768991 780608 792903 806091 820460 836314 853410 870970 888341
58883H88341J6736J5337J2878R836O892M169J584n38k119l995o939j0191j2054
$$ 888341 905077 920414 933292 943128 950020 954189 955773 955235 953116 949121 942182 931991 919937
58870I19937j1880j0601r320q305p442o785o284n652n009n058o184p734q634q617
$$ 919937 908057 897456 888136 879831 872389 865604 859320 853668 848659 843601 837417 829683 821049 812432
58856H12432q430q864r906j0987j1797j2439j2779j2272j0856r468q949q796q022
$$ 812432 804002 795138 785232 774245 762448 750009 737230 724958 714102 704634 695685 686889 678867
58843F78867o961o915p873q160p012n951o502p838q132p238o388n835m672k785
$$ 678867 671906 664991 657118 648958 641946 635995 629493 621655 613523 606285 599897 594062 589390 586605
58829E86605j305q39p37l68M4K67O21J224J649J772K103K864L484L452L017K661
$$ 586605 585300 584461 583724 583356 583400 583667 584288 585512 587161 588933 591036 593900 597384 600836 603853 606514
58813F06514K553K807L551M358M306L094J491K88o71j910l290m160m201l730l296
$$ 606514 609067 611874 615425 619783 624089 627183 628674 628962 628291 626381 623091 618931 614730 611000 607704
58798F07704l293l782m487n110n631o104o222n565m279l027k183j562r65m49R3
$$ 607704 604411 600629 596142 591032 585401 579297 573075 567510 563231 560204 558021 556459 555494 555045 555138
58783E55138J042K492L968M961N336N217M834M617M869N202M743L119Q81j218
$$ 555138 556180 558672 562640 567601 572937 578154 582988 587605 592474 597676 602419 605538 606419 605201
58769F05201k889m194n215o029o698p202p607q130q689q553p160n085l497k687
$$ 605201 602312 598118 592903 586874 580176 572974 565367 557237 548548 539995 532835 527750 524253 521566
58755E21566j954q99JL20L54N06P88J180J863K722L262L369L547M115M773N249
$$ 521566 519612 518713 518714 519034 519388 519894 520682 521862 523725 526447 529709 533078 536625 540740 545513 550762
58739E50762N738O361O759O680O419O373O571O896P246P348O989O573O732P266
$$ 550762 556500 562861 569620 576300 582719 589092 595663 602559 609805 617153 624142 630715 637447 644713
58725F44713P272O568O020O064N994N286M732N322O750P940Q467Q632Q568Q137
$$ 644713 651985 658553 664573 670637 676631 681917 686649 691971 698721 706661 715128 723760 732328 740465
58711G40465P393O444N150L448J703R7j792m271o823q870j0749j3082j5575j7277
$$ 740465 747858 754302 759452 762900 764603 764700 762908 758637 751814 742944 732195 719113 703538 686261
58697F86261j7881j7947j7970j7908j7561j6714j5052j2612j0242q907q537q173
$$ 686261 668380 650433 632463 614555 596994 580280 565228 552616 542374 533467 524930 516757
58685E16757p246o053n010m117l352k892k736k541k148j863j870j759r30N67J959
$$ 516757 509511 503458 498448 494331 490979 488087 485351 482810 480662 478799 476929 475170 474240 474807 476766
58670D76766K544K425K339K895M127N771P663R613J1122J1593J0772Q758N765
$$ 476766 479310 481735 484074 486969 491096 496867 504530 514143 525265 536858 547630 556388 562153
58657E62153K295o85k460l369m315n488o283o473o549o689o306n129l878l331
$$ 562153 564448 563763 561303 557934 553619 548131 541848 535375 528826 522137 515831 510702 506824 503493
58643E03493l254k892j941n78Q91J917J898J103Q14J792L160L496K600J342K41
$$ 503493 500239 497347 495406 494828 495719 497636 499534 500637 501451 503243 506403 509899 512499 513841 514082
58628E14082q69j991k763l129l437l740l564k625j332m07j11R4J134L327N832
$$ 514082 513213 511222 508459 505330 501893 498153 494589 491964 490632 490225 490114 490208 491342 494669 500501
58613E00501P435P860P767P461O482M736L113K359K164J941J773J812J538N44
$$ 500501 507936 515796 523563 531024 537506 542242 545355 547714 549878 551819 553592 555404 556942 557486
58599E57486n34r25j008j608k418k362j326l63p9P6P30J741K746L843N302P045
$$ 557486 556952 556027 555019 553411 550993 548631 547305 546942 546863 546939 547669 549410 552156 555999 561301 568346
58583E68346Q673R732R958R526R021Q830Q711Q310P779P436P185O789O539O985
$$ 568346 577019 586751 596709 606235 615256 624086 632797 641107 648886 656322 663507 670296 676835 683820
58569F83820Q155R623J1195J3011J5154J7644K0591K3831K6575K8010K8047K7019
$$ 683820 691975 701598 712793 725804 740958 758602 779193 803024 829599 857609 885656 912675
58557I12675K4994K1937J8216J4220R812M882J78l238n214o453p356p800p901
$$ 912675 937669 959606 977822 992042 1001854 1006736 1006914 1003676 998462 992009 984653 976853 968952
58544I68952q169q790r458j0097j1103j2768j4906j7111j8955k0005k0007j9175
$$ 968952 960783 951993 942535 932438 921335 908567 893661 876550 857595 837590 817583 798408
58532G98408j7944j6617j5384j4386j3371j1795r650p709o466n457m181l060k688
$$ 798408 780464 763847 748463 734077 720706 708911 699261 691552 685086 679629 675448 672388 669700
58519F69700k778k837l175m172n056m711l380k329k014j841j581j711k194k239
$$ 669700 666922 664085 660910 656738 651682 646971 643591 641262 639248 637407 635826 634115 631921 629682
58505F29682j527o64k22j63l53p06p53o3Q15Q87J96k51r1O1R2Q80K758M662N461
$$ 629682 628155 627491 627269 627106 626753 626047 625294 625231 626046 626933 627129 626878 626787 626848 626940 627820 630578 635240 640701
58486F40701N346N241N644O629Q260J0308J2098J3237J4155J5424J6808J7308
$$ 640701 646047 651288 656932 663561 671821 682129 694227 707464 721619 737043 753851 771159
58474G71159J6014J2791Q488M443J360j221l961o513p979q314q335q294p539n729
$$ 771159 787173 799964 808452 812895 814255 813034 809073 802560 794581 786267 777932 769638 762099 756370
58460G56370l464j318R10L558O358Q806J0700J2031J2731J2768J2064J0268P140
$$ 756370 752906 751588 752498 756056 762414 771220 781920 793951 806682 819450 831514 841782 848922
58447H48922L182n84l600n964p809r088r925j0465j0385r298p596o137n065l778
$$ 848922 852104 851520 847920 841956 834147 825059 815134 804669 794284 784986 777390 771253 766188 762410
58433G62410k098o09L16J012J846K749L653M767O238P938R550J0475R904P700
$$ 762410 760312 759703 760019 761031 762877 765626 769279 774046 780284 788222 797772 808247 818151 825851
58419H25851M894K625Q40j133l182m607n387o148p032p697q241q945r240q271
$$ 825851 830745 833370 834210 833077 829895 825288 819901 813753 806721 799024 790783 781838 772598 764327
58405G64327o429n068m647m357l592k551j394o4J033J483J896L132M539M634L544
$$ 764327 757898 752830 748183 743826 740234 737683 736289 736225 737258 738741 740637 743769 748308 752942 756486
58390G56486K967L537L975L405K679K639K750K347J810J603J344P38L27N24R12
$$ 756486 759453 762990 766965 770370 773049 775688 778438 780785 782595 784198 785542 786280 786607 787131 788043
58375G88043J157J650K651L770M782N944P120P705P794Q276R401J0412J1010J1827
$$ 788043 789200 790850 793501 797271 802053 807997 815117 822822 830616 838892 848293 858705 869715 881542
58361H81542J3115J4184J4568J4487J3887J2418J0623R598R123P816N506L708
$$ 881542 894657 908841 923409 937896 951783 964201 974824 984422 993545 1001361 1006867 1010575
58349A010575L228L176K918L135M070M703M620M886O108P335P937Q751J0325J1777
$$ 1010575 1013803 1016979 1019897 1023032 1027102 1031805 1036425 1041311 1047419 1054754 1062691 1071442 1081767 1093544
58335A093544J2540J3481J5044J6072J5804J5335J5669J5950J5082J3527J2017
$$ 1093544 1106084 1119565 1134609 1150681 1166485 1181820 1197489 1213439 1228521 1242048 1254065
58324A254065J0032P126M465L415L672M092M298M341M056L773M420N954P153P700
$$ 1254065 1264097 1271223 1275688 1279103 1282775 1286867 1291165 1295506 1299562 1303335 1307755 1313709 1320862 1328562
58310A328562Q761J0653J1970J2101J2414J3672J4615J4539J4853J6351J7355
$$ 1328562 1337323 1347976 1359946 1372047 1384461 1398133 1412748 1427287 1442140 1458491 1475846
58299A475846J6647J5889J6821J8286J8549J8483J9651K1154K1247K0609K1120
$$ 1475846 1492493 1508382 1525203 1543489 1562038 1580521 1600172 1621326 1642573 1663182 1684302
58288A684302K2604K3594K4218K5582K7237K7890K7913K8681L0147L1272L2106
$$ 1684302 1706906 1730500 1754718 1780300 1807537 1835427 1863340 1892021 1922168 1953440 1985546
58277A985546L3375L4788L5704L6612L8111L9426L9797M0112M1438M3200M4585
$$ 1985546 2018921 2053709 2089413 2126025 2164136 2203562 2243359 2283471 2324909 2368109 2412694
58266B412694M6303M9100N2098N4477N7093O0584O3636O5182O6297O7976O9158
$$ 2412694 2458997 2508097 2560195 2614672 2671765 2732349 2795985 2861167 2927464 2995440 3064598
58255C064598O9059O9100P0260P1165P1231P2777P7126Q1592Q3731Q5714R0697
$$ 3064598 3133657 3202757 3273017 3344182 3415413 3488190 3565316 3646908 3730639 3816353 3907050
58244C907050R7645J03658J08970J15452J22519J28753J35498J44628J54828J64049
$$ 3907050 4004695 4108353 4217323 4332775 4455294 4584047 4719545 4864173 5019001 5183050
58234E183050J73477J85031J97483K09225K22230K38750K56876K74038K91993
$$ 5183050 5356527 5541558 5739041 5948266 6170496 6409246 6666122 6940160 7232153
58225G232153L13480L37136L60896L87083M18516M53037M87948N26297N72325
$$ 7232153 7545633 7882769 8243665 8630748 9049264 9502301 9990249 10516546 11088871
58216A1088871O24504O80078P42485Q16753R01628R94552J100356J226116J371643
$$ 11088871 11713375 12393453 13135938 13952691 14854319 15848871 16949227 18175343 19546986
58207A9546986J534682J721365J941616K199326K499098K858631L302891L851851
$$ 19546986 21081668 22803033 24744649 26943975 29443073 32301704 35604595 39456446
58199C9456446M528555N375378O449156P807726R518150J1670032J4357796J7647122
$$ 39456446 43985001 49360379 55809535 63617261 73135411 84805443 99163239 116810361
58191A16810361K1553755K5996555L0687538L5045408L8254955L9425130L7693520
$$ 116810361 138364116 164360671 195048209 230093617 268348572 307773702 345467222
58184C45467222L2320503K3005298J0398456l682871j6782954k6840128l2955770
$$ 345467222 377787725 400793023 411191479 407508608 390725654 363885526 330929756
58177C30929756l5405860l5106589l3064438l0092840k6747769k3364427k0136117
$$ 330929756 295523896 260417307 227352869 197260029 170512260 147147833 127011716
58170A27011716j7185677j4587397j2359531j0476117q897019p580874o481407
$$ 127011716 109826039 95238642 82879111 72402994 63505975 55925101 49443694
58163D9443694n554212m770411m113054l562489l096275k700139k366859k085642
$$ 49443694 43889482 39119071 35006017 31443528 28347253 25647114 23280255 21194613
58155B1194613j842771j631159j449534j293227j154374j029894r21012q25908
$$ 21194613 19351842 17720683 16271149 14977922 13823548 12793654 11872642 11046734
58147A1046734p40198o63369n97535n40977m89690m43981m06917l77383l50992
$$ 11046734 10306536 9643167 9045632 8504655 8014965 7570984 7164067 6786684 6435692
58138F435692l26745l06598k89493k71972k53821k37511k22791k07440j92388
$$ 6435692 6108947 5802349 5512856 5240884 4987063 4749552 4526761 4319321 4126933
58129D126933j80595j71430j61496j50431j40865j33179j25306j17143j10366
$$ 4126933 3946338 3774908 3613412 3462981 3322116 3188937 3063631 2946488 2836122
58120B836122j04403r7280q9896q4802q1323p6616p1006o7412o5853o3320n9146
$$ 2836122 2731719 2634439 2544543 2459741 2378418 2301802 2230796 2163384 2097531 2034211 1975065
58109A975065n5716n3754n1448m8645m7347m7533m6654m4034m1846m1049m0119
$$ 1975065 1919349 1865595 1814147 1765502 1718155 1670622 1623968 1579934 1538088 1497039 1456920
58098A456920l8446l7323l6785l4988l1632k8768k7412k6329k4790k3502k2338
$$ 1456920 1418474 1381151 1344366 1309378 1277746 1248978 1221566 1195237 1170447 1146945 1124607
58087A124607k0137j7362j5935j5954j5481j4141j3848j5312j6790j7090j7028
$$ 1124607 1104470 1087108 1071173 1055219 1039738 1025597 1011749 996437 979647 962557 945529
58076I45529j7120j6575j5479j5291j6284j6860j6165j5144j4378j3301j2061
$$ 945529 928409 911834 896355 881064 864780 847920 831755 816611 802233 788932 776871
58065G76871j1733j2070j1499r920r002r131q756p513p201q592r967j0060r931
$$ 776871 765138 753068 741569 731649 722647 713516 704760 697247 690046 681454 671487 661427 651496
58052F51496j0549j0844r754q176p311o833o168n935o642p356p051o135n570n576
$$ 651496 640947 630103 620349 612173 604862 598029 591861 585926 579284 571928 564877 558742 553172 547596
58038E47596o040o958p711p210n536m184m029m425m805n652p108q214q400q300
$$ 547596 541556 534598 526887 519677 514141 509957 505928 501503 496698 491046 483938 475724 467324 459024
58024D59024q361p995o980o245o375o587o091n270m697m147l394k885k816k629
$$ 459024 450663 442668 435688 429443 423068 416481 410390 405120 400423 396276 392882 389997 387181 384552
58010C84552k035j569j553j543j219p92k17P58J560J188k1n34L6L75k60r74j107
$$ 384552 382517 380948 379395 377852 376633 375841 375624 376382 377942 379130 379109 378575 378611 378986 378726 377752 376645
57993C76645j408k389l124k742j798j110o52m18j004k258k841k191j582k108l008
$$ 376645 375237 372848 369724 366982 365184 364074 363422 363004 362000 359742 356901 354710 353128 351020 348012
57978C48012l236l253l845m375l801k495j524r41k49K05k27j057j222o45o1L14
$$ 348012 344776 341523 337678 333303 329502 327007 325483 324542 324293 324498 324271 323214 321992 321347 321286 321600
57962C21600P57J129J088R34J115J245O21o22j791k751l737m410m172l302k719
$$ 321600 322357 323486 324574 325508 326623 327868 328489 327867 326076 323325 319588 315178 311006 307704 304985
57947C04985k655k455j767j029n02L26J983M014N309N407N163N820P500R007R348
$$ 304985 302330 299875 298108 297079 296577 296903 298886 302900 308209 313616 318779 324599 332099 341106 350454
57932C50454Q870Q384P697N964L224M97j628l445n116o330p155q113r081r233
$$ 350454 359324 367708 375405 381369 384593 385090 383462 380017 374901 368571 361416 353303 344222 334989
57918C34989q430p596p273o909o082n297m915m376l274k183j599r50L60J731K069
$$ 334989 326559 318963 311690 304781 298699 293402 288487 284111 280837 278654 277055 276105 276465 278196 280265
57903B80265J274J58o20r11q06o26p43r42m99Q05K301L328L816L719K898J888
$$ 280265 281539 281697 281077 280166 279360 278734 277991 277049 276550 277355 279656 282984 286800 290519 293417 295305
57887B95305J812K872L926M127L950L970L777K981K219K092J960R22p63k196l099
$$ 295305 297117 299989 303915 308042 311992 315962 319739 322720 324939 327031 328991 329913 329150 326954 323855
57872C23855l593l474k734k176k351k497j612j05P42N59R6p2NK75Q06J392J758
$$ 323855 320262 316788 314054 311878 309527 307030 305418 305313 306055 306614 306710 306638 306643 306918 307724 309116 310874
57855C10874K023K396K684K670K522K285J545K77o06m06K00O8q03j428j263o33
$$ 310874 312897 315293 317977 320647 323169 325454 326999 327276 326670 326264 326464 326532 325729 324301 323038 322405
57839C22405p9Kn60j314j310l45N52N15J04L61J201J845K160K538K840K600J936
$$ 322405 322326 322328 321768 320454 319144 318799 319351 319866 319970 320331 321532 323377 325537 328075 330915 333515 335451
57822C35451J286O49k9j88M15P44l43k264l460l716m322n995p937r149r419q892
$$ 335451 336737 337386 337357 337169 337584 338328 337985 335721 332261 328545 324223 318228 310291 301142 291723 282831
57806B82831p734o495n853n716n443m946m698m634m049k743j363l84K91O18K34
$$ 282831 275097 268602 262749 257033 251590 246644 241946 237312 233263 230520 229157 228773 229064 229682 229916
57791B29916p01j370j256n74L86J524K370K260J418J051J872L253M279M941N735
$$ 229916 229215 227845 226589 226015 226401 227925 230295 232555 233973 235024 236896 240149 244428 249369 255104
57776B55104O629O994O380N025L647K844K480J742J95j433k078j787j594j943
$$ 255104 261733 268727 275107 280132 283779 286623 289103 290845 291040 289607 287529 285742 284148 282205
57762B82205k141j625q72n86o13k92N21J377J922K181K193J828J066K37j63P2
$$ 282205 280064 278439 277567 276981 276368 276076 276597 277974 279896 282077 284270 286098 287164 287401 287238 287310
57746B87310O07Q26L55p54k186l457l952l387k373j967k385k695k155j241q79
$$ 287310 287917 288743 289098 288344 286158 282701 278749 275362 272989 271022 268637 265942 263787 262546 261667
57731B61667j174j535j601j403r58l68K6J17L10P57Q91L87M0P02J852K261J789
$$ 261667 260493 258958 257357 255954 254996 254628 254654 254771 255081 255838 256729 257116 257156 257858 259710 261971 263760
57714B63760J331J234R99O03P58J555J989J342K57k13J03O14Q94R70R35O84M6
$$ 263760 265091 266325 267324 267927 268685 270240 272229 273571 273828 273615 273718 274332 275226 276196 277131 277815 277861
57697B77861q48j325o94O57J187j39k418l842l840l421l524m048m475m510l939
$$ 277861 277013 275688 274994 275651 276838 276699 274281 270439 266599 263178 259654 255606 251131 246621 242682
57682B42682k676j178o2Q45K325M528O758Q724J1215J5157K0606K7024L3892M0752
$$ 242682 240006 238828 238766 239611 241936 246464 253222 261946 273161 288318 308924 335948 369840 410592
57668D10592M7037N2145N5277N4983M9463L7702K0376j04k0123l5906m5238m8610
$$ 410592 457629 509774 565051 620034 669497 707199 727575 727471 707348 671442 626204 577594
57656E77594m8233m5805m1748l6376l0834k6298k2905j9938j6833j3783j1418
$$ 577594 529361 483556 441808 405432 374598 348300 325395 305457 288624 274841 263423
57645B63423j0099r395q376o591m514k887j990j825k312k849k373p36O90O55k52
$$ 263423 253324 243929 235553 228962 224448 221561 219571 217746 215434 212585 210212 209476 210166 210821 210569
57630B10569n94j92Pl64r07j639k791l579k880j202l24p00q82M2J068J017J70
$$ 210569 209975 209783 209790 209426 208519 206880 204089 200510 197630 196428 196104 195404 194522 194564 195632 196649 196819
57613A96819o09j138j478j393j020j062j564j610q67l53q74j751j998j733j557
$$ 196819 196210 195072 193594 192201 191181 190119 188555 186945 186078 185725 184851 183100 181102 179369 177812
57598A77812j458j290j438k044k420k104j677j679j603r70m80r47j835k089j793
$$ 177812 176354 175064 173626 171582 169162 167058 165381 163702 162099 161129 160649 159702 157867 155778 153985
57583A53985j774k016j731p55K09N61J72q33j856j819m23J017J037k1o44m43n22
$$ 153985 152211 150195 148464 147709 147918 148479 148651 147818 145962 144143 143720 144737 145774 145753 145109 144666 144144
57566A44144j558k757l084k616k142k048k029j646r08l14k96o20o46j74M09Q96
$$ 144144 142586 139829 136745 134129 131987 129939 127910 126264 125356 125042 124746 124126 123480 123306 123715 124611
57550A24611J475J990J856J182R60J533J788Q63k88k29P60J228Q23N89J073J535
$$ 124611 126086 128076 129932 131114 132074 133607 135395 136258 135970 135741 136501 137729 138552 139141 140214 141749
57534A41749J277N29k77j175k160k800k721k046j111j58N64Q28O75L37O3J19O63
$$ 141749 143026 143555 143278 142103 139943 137143 134422 132376 131265 131107 131671 132499 133174 133511 133574 133693 134356
57517A34356J324J373P81M74R63J443J144P86J504K847L270K447J598J446J324
$$ 134356 135680 137053 137834 138308 139271 140714 141858 142644 144148 146995 150265 152712 154310 155756 157080
57502A57080O42j30n36r62j694k129j726r89p30r19j062j195j681k291k323j625
$$ 157080 157722 157592 157056 156094 154400 152271 150545 149556 148826 147907 146845 145650 143969 141678 139355 137730
57486A37730q87q08j344j856j762j018j32K83J33lM68J359J745R67m55j251q37
$$ 137730 136843 136035 134691 132835 131073 130055 129923 130206 130339 130336 130804 132163 133908 134875 134420 133169 132332
57469A32332j2J53k69l77J2J19l33m68L09J175J012K6p54j082j526k151k294j688
$$ 132332 132320 132473 132204 131827 131839 131958 131625 131157 131466 132641 133653 133679 132925 131843 130317 128166 125872 124184
57451A24184q58l23j52l71j037j720j692q53J45P65J039J039O61J23K9N52J089
$$ 124184 123326 123003 122851 122480 121443 119723 118031 117178 117323 118088 119127 120166 120827 120950 120979 121531 122620
57434A22620J030M85J5QN08J256J755J626J074O40M87K89p9k76q5J86J92O7J63
$$ 122620 123650 124135 124150 124158 124666 125922 127677 129303 130377 131017 131504 131793 131714 131438 131353 131539 131731 131798 131961
57415A31961M98P73Q35R01J292J910K119J389J10o07k02O45R21N14Jl58p24r94
$$ 131961 132459 133232 134067 134968 136260 138170 140289 141678 141788 141181 140979 141624 142545 143059 143060 142702 141978 140984
57397A40984p84j56K93K23o7j23J72O43J022J113J096J490K402L078K778J936
$$ 140984 140200 140044 140337 140560 140493 140370 140542 141185 142207 143320 144416 145906 148308 151386 154164 156100
57381A56100J668K206K560J932P89K14O04J335J487P47k47n48K5O24M36l73j093
$$ 156100 157768 159974 162534 164466 165255 165469 166073 167408 168895 169642 169395 168847 168872 169496 169932 169559 168466
57364A68466j428j478j248q15o30q63p77L14J790K383J963J548J634J634J162
$$ 168466 167038 165560 164312 163497 162867 162004 161227 161541 163331 165714 167677 169225 170859 172493 173655
57349A73655O88N43L67l9j80K67Q54J124J247J439J451J196J185J703K140J786
$$ 173655 174343 174886 175253 175214 175034 175301 176155 177279 178526 179965 181416 182612 183797 185500 187640 189426
57333A89426Q86K21j8l03q46j240j006k23N00N81K5n77p28n59m28k54K32Q18J072
$$ 189426 190312 190533 190515 190212 189366 188126 187120 186897 187397 187978 188003 187426 186698 186139 185711 185457 185689 186507 187579
57314A87579J156J548K020J805J004P88J756K916K940J773L33p79j507j723j203
$$ 187579 188735 190283 192303 194108 195112 195900 197656 200572 203512 205285 205618 204839 203332 201609 200406
57299B00406j52Q58J500J940K464L124L652L653L039K385K481L385M217M096L101
$$ 200406 200254 201112 202612 204552 207016 210140 213792 217445 220484 222869 225350 228735 232952 237048 240149
57284B40149K057J643J847K128J976J383Q11N56L25k40q16p13J21Q99R42L95j04
$$ 240149 242206 243849 245696 247824 249800 251183 251994 252550 252875 252635 251819 251106 251227 252126 253068 253463 253359
57267B53359j15L41Q41R27O35N75J172K011K391K284K267K716L573M625N456N461
$$ 253359 253244 253585 254426 255353 255988 256563 257735 259746 262137 264421 266688 269404 272977 277602 283058 288519
57251B88519M545L608L562M219M872N486O347O980O703N974N844O191N954N156
$$ 288519 293064 296672 300234 304453 309325 314811 321158 328138 334841 340815 346659 352850 358804 363960
57237C63960N050O068P143P489P526P540P048O191O205P503Q754Q835Q478Q742
$$ 363960 369010 375078 382221 389710 397236 404776 411824 418015 424220 431723 440477 449312 457790 466532
57223D66532R164Q843Q354Q990J0687J2284J3439J4844J6614J7840J7891J7221
$$ 466532 475696 484539 492893 501883 512570 524854 538293 553137 569751 587591 605482 622703
57211F22703J6695J6743J7353J8288J9231J9980K0512K0808K0856K0919K1310
$$ 622703 639398 656141 673494 691782 711013 730993 751505 772313 793169 814088 835398
57200H35398K1797K1807K1354K1065K1160K1218K1224K1844K3133K3952K3397
$$ 835398 857195 879002 900356 921421 942581 963799 985023 1006867 1030000 1053952 1077349
57189A077349K2004K0874K0258J9751J9158J8574J8169J8442J9868K1781K2555
$$ 1077349 1099353 1120227 1140485 1160236 1179394 1197968 1216137 1234579 1254447 1276228 1298783
57178A298783K1632K0504K0767K2072K2954K2971K2884K3295K4109K5085K6038
$$ 1298783 1320415 1340919 1361686 1383758 1406712 1429683 1452567 1475862 1499971 1525056 1551094
57167A551094K6656K6834K6929K7198K7438K7556K8007K9117L0526L1688L2423
$$ 1551094 1577750 1604584 1631513 1658711 1686149 1713705 1741712 1770829 1801355 1833043 1865466
57156A865466L2722L2755L3304L5131L7617L9110L9057L8652L8839L9138L9085
$$ 1865466 1898188 1930943 1964247 1999378 2036995 2076105 2115162 2153814 2192653 2231791 2270876
57145B270876L9331M0344M1347M1679M1914M2634M3312M3538M4067M5501M7205
$$ 2270876 2310207 2350551 2391898 2433577 2475491 2518125 2561437 2604975 2649042 2694543 2741748
57134B741748M8662N0554N3233N5619N7005N8506O1174O4195O6600O9290P3421
$$ 2741748 2790410 2840964 2894197 2949816 3006821 3065327 3126501 3190696 3257296 3326586 3400007
57123C400007P8129Q1891Q5011Q8715R2979R7268J02351J09239J17342J25710
$$ 3400007 3478136 3560027 3645038 3733753 3826732 3924000 4026351 4135590 4252932 4378642
57113D378642J35086J46685J60150J75013J92914K16059K44429K76840L13642
$$ 4378642 4513728 4660413 4820563 4995576 5188490 5404549 5648978 5925818 6239460
57104F239460L56159M04883M61017N28751O13533P19365Q50191J012171J211657
$$ 6239460 6595619 7000502 7461519 7990270 8603803 9323168 10173359 11185530 12397187
57095A2397187J452561J738425K074311K462534K897927L369938L865545M365866
$$ 12397187 13849748 15588173 17662484 20125018 23022945 26392883 30258428 34624294
57087C4624294M844689N277666N650720N955123O181964O328771O394143O334589
$$ 34624294 39468983 44746649 50397369 56352492 62534456 68863227 75257370 81591959
57079H1591959O024401N297330M068951K427461N97982j179323k739971m004025
$$ 81591959 87616360 92913690 96982641 99410102 100008084 98828761 96088790 92084765
57071I2084765m948377n589707n972283o145114o143760n994144n725464n371786
$$ 92084765 87136388 81546681 75574398 69429284 63285524 57291380 51565916 46194130
57063D6194130m964991m532072m096126l674007l274110k900263k556665k246777
$$ 46194130 41229139 36697067 32600941 28926934 25652824 22752561 20195896 17949119
57055A7949119j970124j723977j506907j318004j154212j011375q87000p79614
$$ 17949119 15978995 14255018 12748111 11430107 10275895 9264520 8377520 7597906
57047G597906o86526o04588n32402m69681m15222l67373l25740k90445k60137
$$ 7597906 6911380 6306792 5774390 5304709 4889487 4522114 4196374 3905929 3645792
57038C645792k32463k06220j81618j58756j37101j16182r5683p5122n4476l4982
$$ 3645792 3413329 3207109 3025491 2866735 2729634 2613452 2517769 2442647 2388171 2353189
57028B353189j8688p814n012j3016l2242n8731q5529j06397j18283j21294j17575
$$ 2353189 2334501 2326687 2321675 2308659 2276417 2217686 2132157 2025760 1907477 1786183 1668608
57017A668608j10005j00875r1293q1777p2930o5218n8620n2992m8344m4364m0287
$$ 1668608 1558603 1457728 1366435 1284658 1211728 1146510 1087890 1034898 986554 942190 901903
57006I01903l5794l1600k8619k6876k5713k4607k3361k1912k0419j9269j8552
$$ 901903 866109 834509 805890 779014 753301 728694 705333 683421 663002 643733 625181
56995F25181j7795j6543j4858j3031j1187r365p519n286k271J198M190O282P883
$$ 625181 607386 590843 575985 562954 551767 542402 534883 529597 527326 528524 532714 538996 546879
56982E46879R172R376P584L693j741p930j3712j7753j9565j9883j9505j8307j5923
$$ 546879 556051 565427 573011 576704 574963 567033 553321 535568 516003 496120 476615 458308 442385
56969D42385j2835j0002p762n766l713j516J058M234P752J1107J4144J7004J9435
$$ 442385 429550 419548 411786 406020 402307 400791 401849 406083 413835 424942 439086 456090 475525
56956D75525K0526J9184J4862P999j6p566j3723j8429k1808k3619k3565k1790
$$ 475525 496051 515235 530097 538096 538080 530514 516791 498362 476554 452935 429370 407580
56944D07580j8894j5569j2300r175n919k386J033L943O719J0198J4577J9257K3777
$$ 407580 388686 373117 360817 351642 345723 343337 344370 348313 355032 365230 379807 399064 422841
56931D22841K8007L1114L1240K6838J8023O317o225j7350k5063k8779k9715k9510
$$ 422841 450848 481962 513202 540040 558063 564380 558155 540805 515742 486963 457248 427738
56919D27738k8676k6869k4115k1017j8040j5370j3239j1751j0502r034p602o806
$$ 427738 399062 372193 348078 327061 309021 293651 280412 268661 258159 249125 241523 234717
56907B34717o584o198n245m139l361k827k166j249k37O37J226J619K186L257M709
$$ 234717 228133 221935 216690 212551 209190 206363 204197 202948 202711 203348 204574 206193 208379 211636 216345
56892B16345O210P829J0095J3241J6725J9715K1893K3374K3841K2182J7407R920
$$ 216345 222555 230384 240479 253720 270445 290160 312053 335427 359268 381450 398857 408777
56880D08777J579n611j0633j3327j3804j2559j0701r200p814n434j625K799O982
$$ 408777 410356 404745 394112 380785 366981 354422 343721 334521 326707 321273 319648 322447 329429
56867C29429J1071J5682K0969K6738L3008L9821M6704N2705N6695N7267N2853
$$ 329429 340500 356182 377151 403889 436897 476718 523422 576127 632822 690089 742942
56856G42942M2659K7507R406r296k6039l8054m3543m3120l9340l4482k9184k3158
$$ 742942 785601 813108 822514 813218 787179 749125 705582 662462 623122 588640 559456 536298
56844E36298j6387r134j381P116J6339K6129L6671M8424O1295P4108Q4936R1883
$$ 536298 519911 510777 509396 516512 532851 558980 595651 644075 705370 779478 864414 956297
56832I56297R3294Q7410P2516M8260J7187j5437m3889o4459p6262q0458p9117
$$ 956297 1049591 1137001 1209517 1257777 1274964 1259527 1215638 1151179 1074917 994459 915342
56821I15342p4250o7116n8191m7995l7617k7927j8614q711J949J2568K2811L3395
$$ 915342 841092 773976 715785 667790 630173 602246 583632 574921 576870 589438 612249 645644
56809F45644M4677N5311O3004O6049O3408N3804L6304J2242j4122l7618n4777
$$ 645644 690321 745632 808636 874685 938093 991897 1028201 1040443 1026321 988703 933926
56798I33926o4692o8218o6922o2463n6075m8525m0501l2871k6120j9897j3534
$$ 933926 869234 801016 734094 671631 615556 567031 526530 493659 467539 447642 434108
56787D34108o924m43N880J2481J9372K5627K9972L1657L0434K6065J8252P163
$$ 434108 427184 426741 432621 445102 464474 490101 520073 551730 582164 608229 626481 633644
56775F33644o068j9363l0358l7429m0424m0422l8741l6185l3028k9392k5502k1742
$$ 633644 627576 608213 577855 540426 500002 459580 420839 384654 351626 322234 296732 274990
56763B74990j8546j6117j4233j2519j0829r245p825o631n842n502n264m765m103
$$ 274990 256444 240327 226094 213575 202746 193501 185676 179045 173203 167701 162437 157672 153569
56750A53569l499k750j687r29j282k366k872k384j880k086k402k108j518j146
$$ 153569 150070 147320 145633 144704 143422 141056 138184 135800 133920 131834 129432 127324 125806 124660
56736A24660o64K69R66O78j21n53q30j575k225j673k44N80M49M96J203J535Q84
$$ 124660 123996 124265 125231 125909 125788 125235 124405 122830 120605 118932 118688 119268 119717 120213 121416 122951 123835
56719A23835L09R07K081K544K120J518R34jj194k011k114j700r71K5J131K042
$$ 123835 124144 125051 127132 129676 131796 133314 134248 134247 133053 131042 128928 127228 126257 126282 127413 129455
56703A29455K556K548J971J114N92P74J384J931K215K203J845J331J066J119J068
$$ 129455 132011 134559 136530 137644 138236 139010 140394 142325 144540 146743 148588 149919 150985 152104 153172
56688A53172P68P39J299J855J713J197J152J592J682J046L17J50L71M20J37k56
$$ 153172 153940 154679 155978 157833 159546 160743 161895 163487 165169 166215 166532 166682 167053 167473 167610 167354
56672A67354n90p70o21r3M44M76m7n86n82NP68J310J475J289R38P78J034J439
$$ 167354 166764 165994 165373 165280 165724 166200 166153 165567 164985 164990 165758 167068 168543 169832 170770 171548 172582 174021
56654A74021J415Q07J33j00o1k14n53o52l67j6J40J33l8n19j163j373o82O25J643
$$ 174021 175436 176243 176376 176276 176215 176001 175448 174796 174429 174413 174553 174686 174648 174129 172966 171593 170911 171536 173179
56635A73179J614N13r06j737j666j128p05n58n30m62k12K89O63K23j055k095j947
$$ 173179 174793 175306 174400 172663 170997 169869 169164 168606 168076 167614 167402 167691 168354 168577 167522 165427 163480
56618A63480j090p65j264j694j422p86k73P7K23j59r64j468j249p86p06q97q48
$$ 163480 162390 161625 160361 158667 157245 156459 156186 156263 156486 156327 155363 153895 152646 151860 151154 150257 149409
56601A49409m12J81Q04J461K034K260J874P89o04j425j084j12L57j3m54k72L31
$$ 149409 148997 149178 149982 151443 153477 155737 157611 158400 157796 156371 155287 155175 155532 155519 155065 154793 155124
56584A55124Q37J067R86N03j37l53K8N68J039J727K640L107K752K177K091K374
$$ 155124 155961 157028 158014 158517 158380 158027 158055 158623 159662 161389 164029 167136 169888 172065 174156 176530
56568A76530K625L053M046N303O261P036Q284J0234J2466J4387J5428J5090J3385
$$ 176530 179155 182208 186254 191557 197818 204854 213138 223372 235838 250225 265653 280743 294128
56555B94128J1058Q795O525M054K018J397K169L141L196K169N47j156k616l703
$$ 294128 305186 313981 320506 324560 326578 327975 330144 333285 336481 338650 339197 338041 335425 331722
56541C31722m451m813m638m073l753m160n023n677n895n930n978o057o223o455
$$ 331722 327271 322458 317820 313747 309994 305834 300811 295134 289239 283309 277331 271274 265051 258596
56527B58596o418n882n220m992n100m908m229l626l602l928m067l861l554l348
$$ 258596 252178 246296 241076 236084 230984 226076 221847 218221 214619 210691 206624 202763 199209 195861
56513A95861l221l103k969k705k092j046J34R69J236J059N64k24r81j067l46L40
$$ 195861 192640 189537 186568 183863 181771 180725 180859 181828 183064 184123 184687 184463 183482 182415 182069 182409
56497A82409J70m68n56j2K57k9n9O04J090N17n66r54m57P5J71K53O91J055O46
$$ 182409 182579 182111 181555 181543 181800 181771 181712 182316 183406 183923 183357 182403 181946 182021 182192 182445 183136 184191 184837
56478A84837m89j400j130K05J460J794J571J550J541P98m12p93J62J405J811J497
$$ 184837 184348 182948 181818 182023 183483 185277 186848 188398 189939 190737 190325 189532 189694 191099 192910 194407
56462A94407J037M13m45r41o00QP4j62P4O88Q17J98m88n87j11O05J265J617J623
$$ 194407 195444 195857 195412 194471 193871 193879 193953 193791 193865 194553 195370 195568 195080 194493 194382 194987 196252 197869 199492
56443A99492J504J371R49O8q25j104o96jN59O84K68l00l95p0r2p31j195r22n75
$$ 199492 200996 202367 203316 203384 202559 201455 200759 200758 201317 202001 202269 201969 201574 201504 201412 200681 199486 198564 197989
56424A97989q88j277p34M39R65M63j90l54l61n94p67m82J56P84J170J198Q50L35
$$ 197989 197101 195824 195090 195529 196494 196957 196767 196413 196052 195458 194691 194209 194365 195149 196319 197517 198367 198702
56406A98702RP8N10J034J165O24n1J37J382K651L005K700K466K343J962J422J099
$$ 198702 198711 198789 199299 200333 201498 202122 202071 202208 203590 206241 209246 211946 214412 216755 218717 220139 221238
56389B21238R12N40J7n03j195k101k629k254j355o57k22L22R67J455J811K105
$$ 221238 222150 222690 222707 222204 221009 218908 216279 214025 212670 212013 211791 212113 213080 214535 216346 218451
56373B18451K114J921K117K746K771J581K94L36J350J857J498J176J253J162Q04
$$ 218451 220565 222486 224603 227349 230120 231701 231995 232331 233681 235538 237036 238212 239465 240627 241431
56358B41431Q99J632K181J975J441J229J440J786J851J211r4j210j322o74j19
$$ 241431 242330 243962 246143 248118 249559 250788 252228 254014 255865 257076 256982 255772 254450 253776 253657
56343B53657O3J18P1j16QP75J563J639J450J900K776L168L114L366L764L450K675
$$ 253657 253720 253838 253909 253793 253801 254576 256139 257778 259228 261128 263904 267072 270186 273552 277316 280766 283441
56326B83441K734L806M435L694K479J966J975J618O81l25q39n67L62J241J347
$$ 283441 286175 289981 294416 298110 300589 302555 304530 306148 306829 306504 305665 305098 305460 306701 308048
56311C08048P68J83m3N1N94J689K805L301L425L867M545M836M783M926N118M751
$$ 308048 308816 308999 308956 309007 309601 311290 314095 317396 320821 324688 329233 334069 338852 343778 348896 353647
56295C53647M025L720L762L426K886L133M218N008M956M757M952N181N248N660
$$ 353647 357672 361392 365154 368580 371466 374599 378817 383825 388781 393538 398490 403671 408919 414579
56281D14579O643P751Q743R799J0640J0581R755R195R498J0395J1643J3180J4471
$$ 414579 421222 428973 437716 447515 458155 468736 478491 487686 497184 507579 519222 532402 546873
56268E46873J5049J5692J7551K0169K1993K2963K4680K7772L1082L4014L7684
$$ 546873 561922 577614 595165 615334 637327 660290 684970 712742 743824 777838 815522
56257H15522M2891M8776N4607O1223O9483P8666Q7597R6284J05246J14271J22776
$$ 815522 858413 907189 961796 1023019 1092502 1171168 1258765 1355049 1460295 1574566 1697342
56246A697342J30548J37242J42011J44337J44333J41704J35457J25223J11787
$$ 1697342 1827890 1965132 2107143 2251480 2395813 2537517 2672974 2798197 2909984
56237B909984R5738P6830N5280L2413R306j3932l6847n7912p5954r1122j03623
$$ 2909984 3005722 3082552 3137832 3170245 3179551 3165619 3128772 3070860 2994906 2903784 2800161
56226B800161j12723j17965j20283j20988j20553j19006j16523j12914j07751
$$ 2800161 2687438 2569473 2449190 2328202 2207649 2088643 1972120 1859206 1751455
56217A751455j01564r5683r0380q4528p7789p1476o6417o1632n6213n0903m6532
$$ 1751455 1649891 1554208 1463828 1379300 1301511 1230035 1163618 1101986 1045773 994870 948338
56206I48338m2444l7922l3813l1114k9066k6318k3067k0552j9036j7728j6159
$$ 948338 905894 867972 834159 803045 773979 747661 724594 704042 685006 667278 651119
56195F51119j4409j2511j0679r586r456r409q534o983n368l901k761k393k684
$$ 651119 636710 624199 613520 603934 594478 585069 576535 569552 564184 560283 557522 555129 552445
56182E52445k723k098j528j545j573j023k21M35J088J621J483R76J311K607L393
$$ 552445 549722 547624 546096 544551 542978 541955 541734 542169 543257 544878 546361 547337 548648 551255 554648
56167E54648K936K478L145M242M761N109N937O724O927P306Q671J0446J1724J2714
$$ 554648 557584 560062 563207 567449 572210 577319 583256 589980 596907 604213 612884 623330 635054 647768
56153F47768J3985J5419J6950J9181K2187K5121K7936L2107L8540M6290N4398
$$ 647768 661753 677172 694122 713303 735490 760611 788547 820654 859194 905484 959882
56142I59882O3243P2768Q1141Q6734Q9794R0658Q8182Q1689P2970O4457N6766
$$ 959882 1023125 1095893 1177034 1263768 1353562 1444220 1532402 1614091 1687061 1751518 1808284
56131A808284M9617M3609L9222L5493L1371K7055K2401J5900P078j787q436j3565
$$ 1808284 1857901 1901510 1940732 1976225 2007596 2034651 2057052 2072952 2080030 2078243 2069807 2056242
56119B056242j9042k5066l1383l9514n0898o3901p5155q2916q7093q7327q3539
$$ 2056242 2037200 2012134 1980751 1941237 1890339 1826438 1751283 1668367 1581274 1493947 1410408
56108A410408p7335p0496o2945n4276m5903l9387l3937k8055k2412j8557j5924
$$ 1410408 1333073 1262577 1199632 1145356 1099453 1060066 1026129 998074 975662 957105 941181
56097I41181j2845r513p298n938m108j965n72M77K300M303M981M579M545N089
$$ 941181 928336 918823 911525 905587 901479 899514 898942 899419 901719 906022 911003 915582 920127 925216
56083I25216N452N837O821P669P518P301Q338J0006J0974J1531J2414J2784J1843
$$ 925216 930668 936505 943326 950995 958513 965814 974152 984158 995132 1006663 1019077 1031861 1043704
56070A043704J1081J2139J3865J4229J3796J4429J5872J6653J7029J8001J8685
$$ 1043704 1054785 1066924 1080789 1095018 1108814 1123243 1139115 1155768 1172797 1190798 1209483
56059A209483J7881J6862J7360J8173J7219J5477J5275J5998J5443J4244J4830
$$ 1209483 1227364 1244226 1261586 1279759 1296978 1312455 1327730 1343728 1359171 1373415 1388245
56048A388245J6904J8060J8259J9527K1796K3056K3290K4315K6066K6915K7272
$$ 1388245 1405149 1423209 1441468 1460995 1482791 1505847 1529137 1553452 1579518 1606433 1633705
56037A633705K8998L1581L2753L2619L3382L5300L6652L7307L8668M0518M1567
$$ 1633705 1662703 1694284 1727037 1759656 1793038 1828338 1864990 1902297 1940965 1981483 2023050
56026B023050M2416M4357M6153M5894M4937M6000M8477M9971N1091N4118N8142
$$ 2023050 2065466 2109823 2155976 2201870 2246807 2292807 2341284 2391255 2442346 2496464 2554606
56015B554606O0499O1947O5334P0137P3494P5701P9360Q4063Q7372R0012R4532
$$ 2554606 2615105 2677052 2742386 2812523 2886017 2961718 3041078 3125141 3212513 3302525 3397057
56004C397057R9923J03456J06592J12857J21009J26929J31254J38215J47769J56056
$$ 3397057 3496980 3600436 3707028 3819885 3940894 4067823 4199077 4337292 4485061 4641117
55994D641117J62925J71761J82522J92404K02720K17310K34858K50776K65987
$$ 4641117 4804042 4975803 5158325 5350729 5553449 5770759 6005617 6256393 6522380
55985F522380K85478L09003L32102L55520L84202M17705M51494M86986N29862
$$ 6522380 6807858 7116861 7448963 7804483 8188685 8606390 9057884 9544870 10074732
55976A0074732N79163O29229O81908P45110Q19940R01792R93561J104242J235051
$$ 10074732 10653895 11283124 11965032 12710142 13530082 14431874 15425435 16529677 17764728
55967A7764728J381687J550004J753889J998280K282078K618013L031309L539666
$$ 17764728 19146415 20696419 22450308 24448588 26730666 29348679 32379988 35919654
55959C5919654M157304M920795N888999P118032Q663417J0607186J3049303J6062198
$$ 35919654 40076958 44997753 50886752 58004784 66668201 77275387 90324690 106386888
55951A06386888J9667181K3815110K8291869L2599243L5979965L7591272L6619937
$$ 106386888 126054069 149869179 178161048 210760291 246740256 284331528 320951465
55944C20951465L2301176K4141009J2480607j084187j4085129k4285444l0631246
$$ 320951465 353252641 377393650 389874257 388790070 374704941 350419497 319788251
55937C19788251l3345516l3338491l1595629k8902337k5804608k2636318j9583066
$$ 319788251 286442735 253104244 221508615 192606278 166801670 144165352 124582286
55930A24582286j6763909j4263728j2113106j0287945q748394p461423o388553
$$ 124582286 107818377 93554649 81441543 71153598 62405204 54943781 48555228
55923D8555228n483635m714262m066910l526077l066652k670802k334262k050695
$$ 48555228 43071593 38357331 34290421 30764344 27697692 25026890 22692628 20641933
55915B0641933j805447j589193j403123j246001j108994r86965q82510p95146
$$ 20641933 18836486 17247293 15844170 14598169 13489175 12502210 11619700 10824554
55907A0824554p17818o47383n87584n38521m93564m49713m11124l79384l49810
$$ 10824554 10106736 9459353 8871769 8333248 7839684 7389971 6978847 6599463 6249653
55898F249653l20378k95072k75264k56324k36006k17974k04035j90540j75633
$$ 6249653 5929275 5634203 5358939 5102615 4866609 4648635 4444600 4254060 4078427
55889D078427j62584j52904j43117j31435j21179j14637j09681j05034j02896
$$ 4078427 3915843 3762939 3619822 3488387 3367208 3252571 3142890 3037856 2934960
55880B934960j03611j03449j00318r6386r2943q8073q1567p6688p4588p2092o7263
$$ 2934960 2831349 2727900 2627582 2531196 2438253 2350180 2268613 2191925 2117337 2045245 1977982
55869A977982o2391n9268n6327n2538m9500m7566m4536m0172l7593l8049l8705
$$ 1977982 1915591 1856323 1799996 1747458 1697958 1650392 1605856 1565684 1528091 1490042 1451337
55858A451337l7554l6220l5921l4999l2526l0270k9079k7318k4759k3859k5201
$$ 1451337 1413783 1377563 1341642 1306643 1274117 1243847 1214768 1187450 1162691 1138832 1113631
55847A113631k5770k3896k1952k1931k2307k1540k0943k1455k1229j9050j6908
$$ 1113631 1087861 1063965 1042013 1020082 997775 976235 955292 933837 912608 893558 876650
55836H76650j6625j6808j5675j4107j3486j3103j1923j0623r867q840p271o492
$$ 876650 860025 843217 827542 813435 799949 786846 774923 764300 754433 745593 738322 731830
55824G31830o984p283o823p200r073j0631j0739j0800j1795j2260j1128r836r572
$$ 731830 724846 717563 710740 703540 694467 683836 673097 662297 650502 638242 627114 617278 607706
55811F07706r057p181n365n114n340m343k418n78J442L961N993O901P654Q855
$$ 607706 598649 591468 586103 580989 575649 571306 568888 568310 569752 573713 579706 586607 594261 603116
55797F03116R285P993N937M111J953q87l217m268n044o235o831o308o043o905
$$ 603116 612401 620394 626331 630442 632395 631508 628291 624023 618979 612744 605913 599605 593562 586657
55783E86657p699p710q453j0766j2332j0609o417k151J971P233J3177J7685J9746
$$ 586657 578958 571248 562795 552029 539697 529088 522671 520520 522491 529724 542901 560586 580332
55770E80332J9843J7940J3074N029m821j4241k1075k4120k3972k2413k0456j7851
$$ 580332 600175 618115 631189 636218 631397 617156 596081 571961 547989 525576 505120 487269
55758D87269j4723j2268j1179j0769j0394j0320j0585j0542j0182j0316j0764
$$ 487269 472546 460278 449099 438330 427936 417616 407031 396489 386307 375991 365227
55747C65227j0174q343o792o195n294l353j598r57n11M19O56p64k735l896m550
$$ 365227 355053 346710 339918 333723 328429 325076 323478 322521 322010 322429 323085 322321 319586 315690 311140
55732C11140n230n179l989l001l281l819l474l093l756m574m270l505l498l588
$$ 311140 305910 300731 296742 293741 290460 286641 283167 280074 276318 271744 267474 263969 260471 256883
55718B56883k414l74J208K469M408O629P760P583O931N964M226J906l86k572m543
$$ 256883 254469 254095 255303 257772 262180 268809 276569 284152 291083 297047 301273 303179 302793 300221 295678
55703B95678n471n165n019o150p457p271o020n407n674n668n090m759m873m723
$$ 295678 290207 285042 280023 273873 266416 259145 253125 247718 242044 236376 231286 226527 221654 216931
55689B16931m074l288k253n76J260K251K324K330K753L346L877M318M552M580
$$ 216931 212857 209569 207316 206740 208000 210251 212575 214905 217658 221004 224881 229199 233751 238331
55675B38331M636M526L593J822J34j047k319l643l709k083m95m40q96j58J221
$$ 238331 242967 247493 251086 252908 253042 251995 249676 246033 242324 240241 239746 239306 238410 238252 239473
55660B39473J399K85n16k50L98R84J710K364K462K375K858L641L800L244K481
$$ 239473 240872 241157 240641 240391 240789 241773 243483 245847 248309 250684 253542 257183 260983 264227 266708
55645B66708J402l02j927k502k559l559n688p617q389q198p459o394n547n460
$$ 266708 268110 267808 265881 263379 260820 257261 251573 243956 235567 227369 219910 213516 207969 202509
55631B02509n819n914n756n698n380m240k772k012j938j695j098p07o06m25l97
$$ 202509 196690 190776 185020 179322 173942 169702 166930 164918 162980 161285 160187 159480 158874 158449 158052
55616A58052j107k284l018l079k869k397j524r55j506k523k478j214j19Qj22J82
$$ 158052 156945 154661 151643 148564 145695 143298 141774 140819 139313 136790 134312 133098 132979 132987 132865 133047
55600A33047N19L24j56m40m82m37l15j96k34m19p25j296j987k093j242j08M84
$$ 133047 133566 133890 133734 133294 132812 132375 132060 131864 131630 131211 130486 129190 127203 125110 123868 123760 124244
55583A24244P06J097J401J134Q38J404K505K973K598K225K286K502K988M175N571
$$ 124244 124950 126047 127448 128582 129420 130824 133329 136302 138900 141125 143411 145913 148901 153076 158647
55568A58647N949N097M123L734L348K281P40q56k572m417n772n968n003l559k549
$$ 158647 164596 169693 173816 177550 180898 183179 183919 183063 180491 176074 170302 164334 159331 155772 153223
55553A53223k620l545m270m054l351l034l016k482j198K24J219J696J728J521
$$ 153223 150603 147058 142788 138734 135383 132349 129333 126851 125653 125877 127096 128792 130520 132041
55539A32041J505J736J597P53j05k68j55m22n67K38J409J533M32p10j241j608
$$ 132041 133546 135282 136879 137632 137527 137259 137104 136682 136115 136353 137762 139295 139727 139017 137776 136168
55523A36168k043k107j742j566j834k106k113j995j672r72l57m12p84o96l89p51
$$ 136168 134125 132018 130276 128710 126876 124770 122657 120662 118990 118018 117661 117249 116465 115769 115380 114629
55507A14629j620j916j533j549k298k758k314j766j914k391k451k001j244k82
$$ 114629 113009 111093 109560 108011 105713 102955 100641 98875 96961 94570 92119 90118 88874 88592
55493H8592M83M95j01n07m91n67p93n19L24Q74P18M91O09N63Q6j54K44N48O5o73
$$ 88592 89075 89570 89469 88962 88471 87904 87111 86592 86916 87790 88508 88999 89608 90171 90257 90103 90347 90895 90960 90287
55473I0287p02K1Q48J395J610J419Q96L81Rm04p40n02L07R42R00N55L89L17J40
$$ 90287 89585 89606 90454 91849 93459 94878 95774 96155 96164 95760 95020 94518 94825 95767 96667 97222 97611 97928 98068
55454I8068M0J10N5k94o43p32p10p01o27n63o60o52j65L59Kj159j925j608p30
$$ 98068 98108 98218 98273 97979 97336 96604 95894 95193 94566 94003 93343 92691 92526 92885 92887 91728 89803 88195 87465
55435H7465J61J210K242K279J018k04J0J218J876J364L68m03q19q13k08P99J613
$$ 87465 87626 88836 91078 93357 94375 94171 94181 95399 97275 98639 99007 98604 97785 96972 96764 97563 99176
55418I9176J842J690J634J906K259K197J551P24J55k73q93j576j968k176k500
$$ 99176 101018 102708 104342 106248 108507 110704 112255 112979 113134 112861 111968 110392 108424 106248 103748
55403A03748k692k308j640j329j165m20O35Q12j23r25p16q4J82K75N09M55j29
$$ 103748 101056 98748 97108 95779 94614 94194 94829 95641 95518 94593 93877 93793 93975 94250 94759 95214 95085
55386I5085m24L05J409J692J018K02k49m69o45q23j043j160q83l31m0m2K75R83
$$ 95085 94661 94966 96375 98067 99085 99287 99038 98569 97924 97101 96058 94898 94015 93684 93644 93602 93877 94860
55368I4860J114P7j239j660j297j005r23o05j76k81r75j578j581j062l61J22J6
$$ 94860 95974 96051 94812 93152 91855 90850 89927 89322 89146 88865 87890 86312 84731 83669 83308 83430 83446
55351H3446n60q70m41L05P58R96J287J294O57n2JN73O73J43j55J70M19O2l38r9
$$ 83446 82886 82016 81575 81880 82638 83634 84921 86215 86872 86820 86821 87394 88067 88210 88055 88225 88644 88706 88368 88269
55331H8269M05K90m46q60m49P0k65j291j885j421m86J27M56R41J396J249O26K98
$$ 88269 88674 88964 88518 87658 87209 87279 87014 85723 83838 82417 81931 82058 82514 83455 84851 86100 86726 87024
55313H7024N32P60N88L44L96N71O32O38N68J63n27r64q20l52O7K39j44j200k147
$$ 87024 87556 88316 88904 89248 89644 90215 90847 91485 92053 92216 91689 90725 89905 89553 89620 89859 89715 88515 86368
55294H6368j814l40O83K95n72o53j45j1l07l36K9L48N77R76J245P96j55o51l06
$$ 86368 84554 84214 84897 85192 84620 83967 83822 83811 83504 83168 83197 83545 84122 85098 86343 87139 86984 86333 86027
55275H6027K41L07n4l42k73O7L87M51L58M64R16J413J627J529J157M72k78n14
$$ 86027 86268 86575 86521 86179 85906 85973 86360 86811 87169 87633 88549 89962 91589 93118 94275 94747 94469 93955
55257I3955l2N68O08J22l87o01m53M2O36Q61N82J42k19o53j087j093o86n85j057
$$ 93955 93923 94491 95099 95221 94834 94233 93780 93822 94458 95319 95901 96043 95824 95171 94084 92991 92305 91720 90663
55238I0663j329p63M7K28J1K20P68P96R4n84o36k79j8j02n41j181j666j671j158
$$ 90663 89334 88571 88618 88846 88857 89077 89845 90641 90735 90151 89515 89236 89218 89116 88575 87394 85728 84057 82899
55219H2899k97O27J055N27n10q73j25P41O98R4q3K68N04M63N15O37M65J33J50
$$ 82899 82602 83229 84284 84811 84301 83428 83303 84044 84742 84836 84753 85021 85525 85988 86503 87140 87605 87738 87888
55200H7888M97N97K27k76o85j078j309j014j68Q02J520J791J444N14m55q39n99
$$ 87888 88385 88982 89209 88933 88248 87170 85861 84847 84679 85481 87001 88792 90236 90750 90295 89456 88857
55183H8857j27L39P44Q90O33K10q9l41o40o94k64L06N27M09J73j73m71k03O65
$$ 88857 88730 89069 89813 90703 91336 91546 91457 91116 90476 89782 89518 89824 90351 90760 90933 90760 90289 90086 90751
55164I0751J183O83k0K72J307J709R35k22r41j130r22m85k89o28q51j19J189J778
$$ 90751 91934 92617 92597 92869 94176 95885 96820 96598 95657 94527 93605 93120 92831 92203 91352 91233 92422 94200
55146I4200J229L95q0m37q06o57J16O51K51n81r26o76m01l68l10J7M61O95N59
$$ 94200 95429 95824 95744 95307 94501 93844 93960 94611 94862 94281 93355 92679 92278 91910 91600 91617 92078 92773 93332
55127I3332K07q4l02o09q50o01M0K71k50o68r8J017J596J528J468J419P74k99
$$ 93332 93539 93455 93153 92544 91694 91093 91133 91404 91154 90486 90388 91405 93001 94529 95997 97416 98190 97891
55109I7891p75l26K20K35J34M52R47J032N40k82r60r51j47P14Q68N43M29L68l28
$$ 97891 97116 96790 97010 97245 97379 97831 98778 99810 100350 100068 99108 98157 98010 98724 99592 100135 100564 100932 100604
55090A00604j349j528o37K72O72J275K319K606J271n75j158l40N04M35j87o02
$$ 100604 99255 97727 97090 97362 98034 99309 101628 104234 105505 104930 103772 103432 103936 104371 104184 103582
55074A03582m77O9O78R19O53J51k96o61r79j163j218j196r56l49K45L11J08M11
$$ 103582 103105 103174 103852 104771 105424 105575 105279 104618 103639 102476 101258 100062 99106 98757 99002 99313 99421 99832
55056I9832J143J206J34j017j045j42O16P44M84J4o61j253j309p75nO99J186J343
$$ 99832 100975 102181 102315 101298 100253 100111 100727 101471 101955 101969 101308 100055 98746 97971 97966 98665 99851 101194
55038A01194J171Q57N22J23l11o73j014j392j515j066m20l05o17m47N04J411J596
$$ 101194 102365 103222 103744 103867 103556 102883 101869 100477 98962 97896 97476 97171 96554 96107 96611 98022 99618
55021I9618J366J092M80n36j119o76K5k9n03l27N06J000Q25O45Q29Q41K97l21
$$ 99618 100984 102076 102556 102020 100901 100225 100250 100221 99718 99391 99897 100897 101722 102367 103196 104037 104334 104013
55003A04013m10m4K99L82K32p6m08n78n98o39o76l89L33J077J299R86O53O62P30
$$ 104013 103603 103559 103858 104240 104472 104396 103988 103410 102812 102173 101497 101108 101441 102518 103817 104803 105456 106118 106848
54984A06848L37m61j000q64m30k24j34K46P84R66P10M20K92K15K80O15P77J97
$$ 106848 107185 106724 105724 104860 104430 104206 104072 104318 105102 106068 106778 107198 107490 107705 107985 108600 109377 109574
54966A09574o85p40K06J061J098Q45Q21O41N1k23L19Q48M29m54p78o96r90j383
$$ 109574 108889 108149 108355 109416 110514 111359 112180 112821 112872 112649 112968 113816 114245 113791 113013 112317 111327 109944
54948A09944q91L07Q92M29m8K05N13M0q81j319j057o14l94l71l28p2M66J104J534
$$ 109944 109053 109360 110252 110681 110633 110838 111351 111391 110510 109191 108134 107520 107126 106755 106427 106355 106821 107925 109459
54929A09459J675J664J608J564J768K440L423M375N241O116O769O812O326N745
$$ 109459 111134 112798 114406 115970 117738 120178 123601 127976 133217 139333 146102 152914 159240 164985
54915A64985N031L671J665k28j465k419l587m684n111m929m745m769m663m305
$$ 164985 170016 173687 175352 175124 173659 171240 167653 162969 157858 152929 148184 143415 138752 134447
54901A34447m093m253m288l531k043o09J43L21L90M98M18Q1j98j14K51O62J148
$$ 134447 130354 126101 121813 118282 116239 115630 115773 116094 116484 116982 117400 117481 117283 117169 117420 118082 119230
54884A19230J863K576K761K289J839K253L568M993N837O145O262O134N413M060
$$ 119230 121093 123669 126430 128719 130558 132811 136379 141372 147209 153354 159616 165750 171163 175223
54870A75223K440Q16p90k242l253l859m393m860m835m272l807l822l800l185k377
$$ 175223 177663 178479 177689 175447 172194 168335 163942 159082 154247 149975 146168 142346 138546 135361 132984
54855A32984k110k337k511k555k648k404j385k19l2p95j398j413j514j915j828
$$ 132984 130874 128537 126026 123471 120823 118419 117034 116815 116783 115988 114590 113177 111663 109748 107920
54840A07920r91m18q26j414j131k89J30N2J40N41P97P18N48M63N05O99Q32N47
$$ 107920 106929 106511 105685 104271 103140 102851 102981 103033 103173 103714 104511 105229 105777 106240 106745 107444 108276 108823
54822A08823Q2K78J259J828R96n75j476j372r07l76M06J191J351Q20J54k97m86
$$ 108823 108905 109183 110442 112270 113266 112691 111215 109843 108936 108560 108966 110157 111508 112328 112482 112185 111699
54805A11699k52M68J112J068N51J67p5m87p41k42O53R11L10l35m69l22p4M21Q97
$$ 111699 111447 111915 113027 114095 114646 114813 114738 114251 113510 113268 113921 114832 115142 114807 114338 114016 113942 114363 115260
54786A15260P09q0n36j33O14J130J530J983K158J817J315J033Q70P25R02J575
$$ 115260 115969 115889 115353 115220 115834 116964 118494 120477 122635 124452 125767 126800 127670 128395 129297 130872
54770A30872K383K977L572M511N707O794P505P579O822N538M430L686K678R27
$$ 130872 133255 136232 139804 144315 150022 156816 164321 171900 178722 184260 188690 192376 195054 195981
54756A95981j127k793m068n318o413o908o912o968p056o383m525k329j213j615
$$ 195981 194854 192061 187993 182675 176262 169354 162442 155474 148418 142035 137510 135181 133968 132353
54742A32353k511k567j506j51O62Q72Q48Q01P72Q74J172J496J655J677J622J476
$$ 132353 129842 127275 125769 125618 126280 127152 128000 128801 129573 130447 131619 133115 134770 136447 138069 139545
54726A39545J444J993L159M225M625M695M986N168M518L203K100J411M04j363
$$ 139545 140989 142982 146141 150366 154991 159686 164672 169840 174358 177561 179661 181072 181476 180113
54712A80113l352m831n573n582m940m154l906m121m011l302k657k499k288j508
$$ 180113 176761 171930 166357 160775 155835 151681 147775 143654 139643 136341 133684 131185 128897 127389
54698A27389o47m22o79p64n90m79l34J88Q35Q53L0r32j274r01k61J59K9o70j466
$$ 127389 126742 126320 125641 124877 124287 123808 123474 123662 124497 125350 125380 124448 123174 122273 122012 122171 122200 121530 120064
54679A20064j585o88N50R22p1j554k161j549o49k74j18L75P84K85p91j104j71
$$ 120064 118479 117791 118341 119263 119192 117638 115477 113928 113279 113005 112887 113262 114046 114331 113540 112436 112265
54662A12265Q88R45L37J05M32N99J92m20o92m60N9M59L68j95p02o17K3O84R30
$$ 112265 113153 114098 114435 114540 114972 115571 115763 115343 114651 114191 114250 114709 115077 114882 114180 113563 113586 114270 115200
54643A15200P91N79N00M26J18k98k92L23Q91O38k24p30n25k05k00j24L56P53N29
$$ 115200 115991 116570 117070 117496 117614 117316 117024 117347 118238 118876 118652 117922 117397 117192 116992 116868 117224 117977 118506
54624A18506N2O7N50P71L43l77q62r33o63k39J14K16K0m85j214j741j506m92O08
$$ 118506 118558 118625 119175 119946 120289 119912 119050 118117 117454 117215 117329 117545 117565 117080 115866 114125 112619 112127 112735
54605A12735J212J439J617J607J127M01o4j82k23k40p2J09j23p33j089p06J14
$$ 112735 113947 115386 117003 118610 119737 120138 120074 119892 119669 119429 119357 119466 119343 118610 117521 116815 116929
54588A16929N95L54k18m02NM45L50l7J2N34P19J42n04m04J43K60j52l64k8L77
$$ 116929 117524 117878 117660 117258 117263 117708 118058 118021 118033 118567 119286 119428 118924 118520 118663 118923 118771 118407 118379 118756
54568A18756L72J30N3K29M52M78J15n46r43n42L88Q92M53l99q18n70L3P45J457
$$ 118756 119128 119258 119311 119540 119992 120470 120585 120039 119096 118554 118942 119834 120287 119888 119070 118500 118533 119278 120735
54549A20735J914J854J483J331J564J742J443Q43M06K14j2l18l80p7J76k4m63
$$ 120735 122649 124503 125986 127317 128881 130623 132066 132909 133315 133529 133517 133199 132819 132742 132918 132894 132431
54532A32431o26m36k73l50n49p87j098j312j120o28l56n19p22o28l92j63L06J103
$$ 132431 131805 131369 131096 130746 130197 129410 128312 127000 125880 125252 124896 124377 123655 123027 122635 122472 122778 123881
54514A23881J606J139n2j072j446j439j347j077n44J7L34M39N19O79Q59Q72N40
$$ 123881 125487 126626 126574 125502 124056 122617 121270 120193 119649 119666 120000 120439 120958 121637 122496 123368 123908
54497A23908m8m73m44j96j49k75k15O3K04J84M75J250J879J660P14k79r50j305
$$ 123908 123860 123387 122943 122747 122598 122323 122108 122171 122375 122559 123034 124284 126163 127823 128537 128258 127308 126003
54479A26003j123o7J456K285J794P36L00O85J176J348J467J705J793J634J552
$$ 126003 124880 124813 126269 128554 130348 131084 131384 132069 133245 134593 136060 137765 139558 141192 142744
54464A42744J584J151Mj107j265o43j66k52n02n37m46m70p76j416k059j997j024
$$ 142744 144328 145479 145483 144376 143111 142468 142302 142050 141548 141011 140565 140095 139319 137903 135844 133847 132823
54447A32823o2o4n67l25P10J303R33N47Q07Q97Pj063j004J5O40K37n77j185j567
$$ 132823 132761 132697 132130 131805 132515 133818 134751 135298 136105 137002 137009 135946 134942 134957 135597 135834 135257 134072 132505
54428A32505j681j132J26J433K049J779R49J02k59j7M74P99R34R95Q26K69l70
$$ 132505 130824 129692 129818 131251 133300 135079 136028 136130 135871 135854 136328 137127 138061 139056 139882 140151 139781
54411A39781o39o29p57r89q04j4Q71J230R61M30J15L65J151J983K276J829Q83
$$ 139781 139142 138513 137756 136767 135963 135949 136820 138050 139011 139441 139556 139921 141072 143055 145331 147160 148043
54394A48043j95j075j468j285p44j28M14P20N97J88L0L25N47K16l05l10K15P08
$$ 148043 147848 146773 145305 144020 143276 143148 143562 144282 144879 145067 145097 145422 145969 146185 145880 145570 145785 146493
54376A46493R14R70Q14L16q1L14J412K379K791K996L175K960K331J997K280K346
$$ 146493 147407 148377 149191 149507 149426 149740 151152 153531 156322 159318 162493 165453 167784 169781 172061 174407
54360A74407J331k57j097p71j66k26r92j964k778l264l294k889k360j976j686
$$ 174407 175738 175481 174384 173613 173447 173221 172229 170265 167487 164223 160929 158040 155680 153704 152018
54345A52018j294q78o87o76m58N0K60l34j187j113J74J522J716R32J85j64o43
$$ 152018 150724 149846 149159 148483 148025 148075 148335 148001 146814 145701 145875 147397 149113 150045 150230 150066 149423
54328A49423j460k018j833j248q06m42K21J015J239N39o15j331j126k90L88K99
$$ 149423 147963 145945 144112 142864 142058 141616 141837 142852 144091 144630 144015 142684 141558 141268 141656 141955
54312A41955m99j394j805j615j060l66L57R58J151P59M6m11l53k13n44j166j270
$$ 141955 141456 140062 138257 136642 135582 135216 135573 136531 137682 138441 138487 138076 137723 137510 136966 135800 134530
54295A34530m70O55J283J259R80P17M89L37L44M04L34J29j16l45l55J68J075J552
$$ 134530 134060 134715 135998 137257 138237 138954 139443 139780 140124 140528 140862 140991 140875 140530 140175 140343 141418 142970
54277A42970J036R5k28K01N90M85L38O18J050J100P47M44N56J062J604J690J118
$$ 142970 144006 144101 143873 144074 144664 145149 145487 146105 147155 148255 149002 149446 150002 151064 152668 154358 155476
54260A55476K89j02K36J023J767K024J468K39p87o62M56J303R25k72j138j086
$$ 155476 155765 155663 155899 156922 158689 160713 162181 162420 161633 160971 161427 162730 163655 163383 162245 161159
54244A61159n44l27p82j418j396n00M68O52K38Q6L59L30l53j063j225j170j386
$$ 161159 160615 160288 159506 158088 156692 156192 156660 157312 157550 157636 157995 158325 157972 156909 155684 154514 153128
54227A53128j563j142l54M7o6n9M64J178J576J501J094N38k4n61j167j728j747
$$ 153128 151565 150423 150069 150116 150050 149991 150455 151633 153209 154710 155804 156342 156318 155757 154590 152862 151115
54210A51115r03K76Q08M63N5K95P44M40o81j532j208q6O83N47jk97l21m70q33
$$ 151115 150212 150488 151296 151759 151814 152109 152853 153293 152612 151080 149872 149786 150469 151016 151015 150718 150397 149927 149094
54191A49094j039p67j20M99P84P38O27P03R57J214J407J584J603J181M32n9N5
$$ 149094 148055 147288 147168 147667 148451 149189 149816 150519 151476 152690 154097 155681 157284 158465 158897 158838 158893
54174A58893L76L30n2m25q70j710k701l041k363j145l7P23J123J113Q53O82O40
$$ 158893 159269 159599 159547 159122 158252 156542 153841 150800 148437 147292 147255 147978 149101 150214 151067 151749 152389
54157A52389L19n16j406j673j159l72P2l2l63m62k80k79p64j351j436j020n84
$$ 152389 152708 152192 150786 149113 147954 147582 147654 147622 147259 146797 146517 146238 145474 144123 142687 141667 141083
54140A41083k59K09P62R76Q57R39J358J495R42J74j69r5P2L21O60P40M05K02N88
$$ 141083 140824 141033 141795 142771 143628 144567 145925 147420 148362 148536 148367 148272 148344 148665 149325 150065 150470 150672 151260
54121A51260J004O23k21l21O51J646J814J699K209L056L146K239J342J303J766
$$ 151260 152264 152887 152666 152345 152996 154642 156456 158155 160364 163420 166566 168805 170147 171450 173216
54106A73216J917J733J797K241K590K638K727K868K420J086l60j080j418k258
$$ 173216 175133 176866 178663 180904 183494 186132 188859 191727 194147 195233 194873 193793 192375 190117
54092A90117l446l836k942j617q23m94l9O94J426J904J980J571R10M31K06j58
$$ 190117 186671 182835 179893 178276 177453 176959 176920 177614 179040 180944 182924 184495 185405 185836 186042 185884
54076A85884q37j466j727j754j670j261m46L20N93M10j0o12j130j029l12J21l47
$$ 185884 185047 183581 181854 180100 178430 177169 176723 177043 177636 178046 178036 177424 176294 175265 174953 175074 174727
54059A74727j097j165p03o31j081j166k85J150K412L182L322K714J707J211J826
$$ 174727 173630 172465 171762 171131 170050 168884 168599 169749 172161 175343 178665 181379 183086 184297 186123
54044A86123L060L830L657L104K992L472M080M594N364O560P433P035N612M561
$$ 186123 189183 193013 196670 199774 202766 206238 210318 214912 220276 226836 234269 241304 246916 251477
54030B51477M640M915M066K238Q66Q42J592K014J688J006M97L08K13J3j89k26
$$ 251477 256117 261032 265098 267336 268202 269044 270636 272650 274338 275344 275841 276149 276362 276375 276186 275960
54014B75960l88j274k963m613n290m908m146l670l739m230m619m269l117j955
$$ 275960 275572 274298 271335 266722 261432 256524 252378 248708 244969 240739 236120 231851 228734 226779
54000B26779j600k006k538k763k566j868q76l02o15j306j506j244j281j746j821
$$ 226779 225179 223173 220635 217872 215306 213438 212562 212260 211645 210339 208833 207589 206308 204562 202741
53985B02741r67K66R64Q39K19m06n66nR58J623J759J899K511L340L990M722O124
$$ 202741 201774 202040 203004 203843 204062 203656 203090 203085 204043 205666 207425 209324 211835 215175 219165 223887 230011
53968B30011Q070R616J0041R558Q696P303M653O15l705o794q104q290q160p810
$$ 230011 238081 247697 257738 267296 275992 283295 287948 288563 284858 278064 269960 261670 253510 245700
53954B45700o932n523l977k663j661p96J00R10J196Q58O68J555L229M235L843
$$ 245700 238768 233245 229268 226605 224944 224148 224248 225158 226354 227212 227880 229435 232664 236899 240742
53939B40742L148L599N026N965N651M728M090L850L619L099K224J201N46P09J562
$$ 240742 243890 247489 252515 258480 264131 268859 272949 276799 280418 283517 285741 286942 287488 288197 289759
53924B89759K541L188L328K942K375K356L267M512N253N512N894O414O475N962
$$ 289759 292300 295488 298816 301758 304133 306489 309756 314268 319521 325033 330927 337341 343816 349778
53910C49778N485N373N226M655L751K622J138n42j877k620l052l330l241k804
$$ 349778 355263 360636 365862 370517 374268 376890 378028 377486 375609 372989 369937 366607 363366 360562
53896C60562k511k648l042l617m584n764o493o509o316o293o193n873n695n739
$$ 360562 358051 355403 352361 348744 344160 338396 331903 325394 319078 312785 306592 300719 295024 289285
53882B89285n419m540l883l925l858k863j666j627k641l347l257l337m185m880
$$ 289285 283866 279326 275443 271518 267660 264797 263131 261504 258863 255516 252259 248922 244737 239857
53868B39857m336k930k016k264l088l490l022k041j311j319j860k312k352k153
$$ 239857 235521 232591 230575 228311 225223 221733 218711 216670 215359 214040 212180 209868 207516 205363
53854B05363j922j577j063o51o30q88j064j033r99j135j281j139n99J57Q63J357
$$ 205363 203441 201864 200801 200150 199520 198632 197568 196535 195536 194401 193120 191981 191382 191539 192402 193759
53838A93759J527J264O18r9n03n11l24o9K86O74Q24O20L06J93L67Q08J494K106
$$ 193759 195286 196550 197168 197069 196566 196055 195731 195662 195948 196622 197446 198066 198372 198565 198932 199740 201234 203340
53820B03340K007R85j79m28K95J018J045P89R94J645K097K035J782J741K015K638
$$ 203340 205347 206332 206153 205725 206020 207038 208083 208872 209866 211511 213608 215643 217425 219166 221181 223819
53804B23819L671M827N436N189M689M791N454N752N124M111L618L776L888L347
$$ 223819 227490 232317 237753 242942 247631 252422 257876 263628 268752 272863 276481 280257 284145 287492
53790B87492K252J190O63P43J060J105O63o2p81j486k356l374m241m643m574m399
$$ 287492 289744 290934 291597 292340 293400 294505 295168 295106 294325 292839 290483 287109 282868 278225 273651 269252
53774B69252m530m895m902m230l505l543l998l596k047p94j169k472k907j954
$$ 269252 264722 259827 254925 250695 247190 243647 239649 236053 234006 233212 232043 229571 226664 224710
53760B24710q11n71j111j716j944j619q83m06q38j802k213j758j256j322j519
$$ 224710 223899 223328 222217 220501 218557 216938 216055 215649 214811 213009 210796 209038 207782 206460 204941
53745B04941j308q60m31K41J194J695J251N69N95J067J021L83Q6N30R95P67J45
$$ 204941 203633 202773 202342 202583 203777 205472 206723 207292 207887 208954 209975 210358 210444 210974 211969 212736 212881
53728B12881p2M09J181J719J793J517J072M72l45j123j300o58K74P92Q44R21J328
$$ 212881 212809 213218 214399 216118 217911 219428 220500 220972 220627 219504 218204 217546 217820 218612 219456 220377 221705
53711B21705J917K440K764K789K571K409K507K587K287J861J989K794L586L763
$$ 221705 223622 226062 228826 231615 234186 236595 239102 241689 243976 245837 247826 250620 254206 257969
53697B57969L535L449L550L489L220L104L286L391L039K357J685R86jj054j433
$$ 257969 261504 264953 268503 271992 275212 278316 281602 284993 288032 290389 292074 293060 293059 292005 290572
53682B90572q50n3j0p68j547j821j713j434r96o01o43j048j174p19k24j98l54
$$ 290572 289722 289669 289659 288891 287344 285523 283810 282376 281380 280779 280136 279088 277914 277195 276971 276773 276419
53665B76419j81J09l9m67m06L22R43P54J5n25n70l99k38M9O13J188J278P32Kk66
$$ 276419 276238 276347 276308 275841 275435 275757 276700 277454 277469 276944 276374 275975 275737 275786 276399 277587 278865 279597 279599 279333
53645B79333J73J075J993K544K491J929J341J165J345J498J478J436J465J589
$$ 279333 279506 280581 282574 285118 287609 289538 290879 292044 293389 294887 296365 297801 299266 300855
53631C00855K056L078M210M609M050L203K680K372J938J393R12N72O18J427K793
$$ 300855 302911 305989 310199 314808 318858 322061 324741 327113 329051 330444 331356 331928 332546 333973 336766
53616C36766L789L833L408L266L428L488L410L383L325L166L212L586L745L235
$$ 336766 340555 344388 347796 351062 354490 357978 361388 364771 368096 371262 374474 378060 381805 385040
53602C85040K569K484K728K466J742J445J801J936J200Q2n69n98m08l28n10j062
$$ 385040 387609 390093 392821 395287 397029 398474 400275 402211 403411 403493 402924 402326 401918 401590 401080 400018
53586D00018j835k340k144j330l91J34no40j324j829k316k868l101k684k053j987
$$ 400018 398183 395843 393699 392369 391978 392112 392107 391467 390143 388314 385998 383130 380029 377345 375292 373305
53570C73305k546k906k356j037L16J044R50M29J68M04N54l1j065j596j155j53
$$ 373305 370759 367853 365497 364460 364776 365820 366770 367199 367367 367771 368325 368294 367229 365633 364478 364325
53554C64325Q03J440J661J476J116Q11M25j69m88R2J287K101K207K352L116M050
$$ 364325 365128 366568 368229 369705 370821 371632 372057 371888 371400 371492 372779 374880 377087 379439 382555 386605
53538C86605M471M475M560M844N149N562O288P172P865Q342Q859R502J0113J0622
$$ 386605 391076 395551 400111 404955 410104 415666 421954 429126 436991 445333 454192 463694 473807 484429
53524D84429J1173J1864J2560J3015J3168J3265J3596J4120J4591J5110J6180
$$ 484429 495602 507466 520026 533041 546209 559474 573070 587190 601781 616891 633071
53513F33071J7930J9732K1086K2424K4314K6212K6926K6318K5499K5223K5015
$$ 633071 651001 670733 691819 714243 738557 764769 791695 818013 843512 868735 893750
53502H93750K4215K3000K1872K0939K0187J9872K0040K0194J9953J9548J9222
$$ 893750 917965 940965 962837 983776 1003963 1023835 1043875 1064069 1084022 1103570 1122792
53491A122792J8717J7928J7488J7977J8951J9435J9139J8592J8250J8189J8342
$$ 1122792 1141509 1159437 1176925 1194902 1213853 1233288 1252427 1271019 1289269 1307458 1325800
53480A325800J8566J8484J7910J7198J6656J5779J3705J0372O741L746J498m43
$$ 1325800 1344366 1362850 1380760 1397958 1414614 1430393 1444098 1454470 1461211 1464957 1466455 1466012
53468A466012k479m688o866q728j0272j1778j3340j4628j5407j5931j6451j6684
$$ 1466012 1463533 1458845 1451979 1443251 1432979 1421201 1407861 1393233 1377826 1361895 1345444 1328760
53456A328760j6408j6298j7340j9390k1072k1368k0668j9983j9659j9339j8870
$$ 1328760 1312352 1296054 1278714 1259324 1238252 1216884 1196216 1176233 1156574 1137235 1118365
53445A118365j8541j8447j8015j6522j3979j1295r369q179o999n476m076l326
$$ 1118365 1099824 1081377 1063362 1046840 1032861 1021566 1012197 1004018 997019 991543 987467 984141
53433I84141k980k362j227N0J087J875K665L798N497P487Q985R493R541J0189
$$ 984141 981161 978799 977572 977622 978709 980584 983249 987047 992544 1000031 1009016 1018509 1028050 1038239
53419A038239J1807J3834J5743J7611J9582K1321K2439K3154K4091K5554K7346
$$ 1038239 1050046 1063880 1079623 1097234 1116816 1138137 1160576 1183730 1207821 1233375 1260721
53408A260721K9214L1166L3259L5314L6943L7942L8640L9798M1958M4873M7716
$$ 1260721 1289935 1321101 1354360 1389674 1426617 1464559 1503199 1542997 1584955 1629828 1677544
53397A677544M9908N1576N3115N4566N5583N5966N5946N5932N6083N6187N5932
$$ 1677544 1727452 1779028 1832143 1886709 1942292 1998258 2054204 2110136 2166219 2222406 2278338
53386B278338N5207N4108N2698N0896M8616M5922M2925L9600L5936L2135K8476
$$ 2278338 2333545 2387653 2440351 2491247 2539863 2585785 2628710 2668310 2704246 2736381 2764857
53375B764857K4917K1050J6564J1599O476J222m414j0554j6947k3211k9133l4638
$$ 2764857 2789774 2810824 2827388 2838987 2845463 2846685 2842271 2831717 2814770 2791559 2762426 2727788
53363B727788l9633m4022m7762n0787n2868n3788n3680n3032n2301n1567n0568
$$ 2727788 2688155 2644133 2596371 2545584 2492716 2438928 2385248 2332216 2279915 2228348 2177780
53352B177780m9044m6978m4635m2449m0739l9551l8831l8711l9355m0351m0692
$$ 2177780 2128736 2081758 2037123 1994674 1953935 1914384 1875553 1836842 1797487 1757136 1716444
53341A716444l9612l7370l4934l2992l1514l0165k8703k6953k4776k2244j9726
$$ 1716444 1676832 1639462 1604528 1571536 1540022 1509857 1481154 1454201 1429425 1407181 1387455
53330A387455j7605j5938j4530j3271j2431j2463j3475j4926j6089j6691j6790
$$ 1387455 1369850 1353912 1339382 1326111 1313680 1301217 1287742 1272816 1256727 1240036 1223246
53319A223246j6134j4329j1812r958r583r863r394p874n996m035j644J025L019
$$ 1223246 1207112 1192783 1180971 1171013 1161430 1151567 1142173 1134299 1128303 1124268 1122624 1123649 1126668
53306A126668L775L850M178N173O743Q571J0189J1404J2776J5029J7834J9987
$$ 1126668 1130443 1134293 1138471 1143644 1150387 1158958 1169147 1180551 1193327 1208356 1226190 1246177
53294A246177K1083K2085K3826K5778K7004K7425K7422K6883K5586K4028K2836
$$ 1246177 1267260 1289345 1313171 1338949 1365953 1393378 1420800 1447683 1473269 1497297 1520133
53283A520133K1657J9649J6885J4345J2482J0632Q013M619R48k590n751q403j0612
$$ 1520133 1541790 1561439 1578324 1592669 1605151 1615783 1623796 1628415 1629363 1626773 1621022 1612619 1602007
53270A602007j2613j4541j6374j8069j9582k0898k2262k4096k6334k8119k8634
$$ 1602007 1589394 1574853 1558479 1540410 1520828 1499930 1477668 1453572 1427238 1399119 1370485
53259A370485k8068k7346k7091k7263k7617k7940k7939k7419k6604k5880k5319
$$ 1370485 1342417 1315071 1287980 1260717 1233100 1205160 1177221 1149802 1123198 1097318 1071999
53248A071999k4802k4449k4394k4302k3752k3007k2779k3117k3254k2656k1666
$$ 1071999 1047197 1022748 998354 974052 950300 927293 904514 881397 858143 835487 813821
53237H13821k0775j9866j8548j6904j5377j4103j2734j1009r208p962p593p797
$$ 813821 793046 773180 754632 737728 722351 708248 695514 684505 675297 667335 659742 651945
53225F51945q016q080q283q810r507j0282j1359j2795j4177j5083j5545j5656
$$ 651945 643929 635849 627566 618756 609249 598967 587608 574813 560636 545553 530008 514352
53213E14352j5193j4068j2816j1929j1080r663p927o786o571o691o564o220n931
$$ 514352 499159 485091 472275 460346 449266 439603 431676 424890 418319 411628 405064 398844 392913
53200C92913n892o313p219q051q167p710p408p380o971n942n024m894n268n463
$$ 392913 387021 380708 373489 365438 357271 349561 342153 334773 327802 321860 316836 311942 306674 301211
53186C01211n277m901m359l604k833k309k091k191k632l116l014k068q48j67k28
$$ 301211 295934 291033 286674 283070 280237 277928 275837 273646 271014 267898 264884 262816 261968 261801 261573
53171B61573o48j035j249j301j315j480j814k063j943j459r01o36q16j114r50
$$ 261573 260925 259890 258641 257340 256025 254545 252731 250668 248725 247266 246365 245729 244913 243799 242849
53156B42849k37L03J3o88q22k41K12j2n46r29j290j750j940j566r18l34L00J036
$$ 242849 242612 242915 242928 242240 241418 241177 241389 241377 240831 239902 238612 236862 234922 233356 232438 232104 232404 233440
53138B33440J372Q76l0n53m20R4P64J487K041K276K325K274J920J222O68O27P16
$$ 233440 234812 235688 235658 235105 234685 234779 235543 237030 239071 241347 243672 245946 247866 249088 249756 250383 251099
53121B51099L96r9k9P19J472J710J603J511J405J039L50m43j043j346j541j906
$$ 251099 251495 251396 251367 252086 253558 255268 256871 258382 259787 260826 261176 260733 259690 258344 256803 254897
53105B54897k392k652k511k137j657j019m40m15r57j223m86Q57J706J476M75o45
$$ 254897 252505 249853 247342 245205 243548 242529 242089 241674 240717 239494 239008 239865 241571 243047 243522 242877
53089B42877j377j542j426j528j824j664p91R0L05K30N16P72J24j227k060j807
$$ 242877 241500 239958 238532 237004 235180 233516 232725 232815 233120 233350 233866 234638 234762 233535 231475 229668
53073B29668j115o64m27k62l08m13j52K40j25j367k264j770l98O45J010J072R20
$$ 229668 228553 227889 227462 227200 226892 226479 226327 226567 226442 225075 222811 221041 220643 221288 222298 223370 224290
53056B24290L89k24m10k89l42m55k6R35J680J780J541J172M17n98r83j93J007
$$ 224290 224679 224455 224045 223756 223414 222959 222933 223868 225548 227328 228869 230041 230458 229860 228877 228684 229691
53039B29691J438R69L36j79r48j828j848n71R53J317M73l73l56K05N66M90K21
$$ 229691 231129 232098 232434 232255 231307 229479 227631 227060 228013 229330 229803 229430 229074 229279 229845 230335 230556
53022B30556R6L43R49J449J274N66J70N52J059P58k93j133j153o94l69k90j59
$$ 230556 230652 230995 231944 233393 234667 235233 235403 235955 237014 237772 237479 236346 235193 234499 234130 233840 233681
53005B33681K33Q04J311J521J368J065R15R66Q95L93l76p91l50P00J482J369O99
$$ 233681 233914 234718 236029 237550 238918 239983 240898 241864 242759 243152 242776 241985 241635 242335 243817 245186 245885
52988B45885L32N68Q95Q72P32Q65J157J307J391J618J731J280L94k92m29k17R6
$$ 245885 246217 246785 247680 248552 249284 250149 251306 252613 254004 255622 257353 258633 259027 258735 258306 258089 258185
52971B58185N25J053J502J767J857J666J103M45J40K23L05J89M4j31o18j381j881
$$ 258185 258710 259763 261265 263032 264889 266555 267658 268103 268243 268466 268771 268960 269004 268873 268255 266874 264993
52954B64993j787j443j321j380j383j477j945k576k698j938o91K54M33N7k66k23
$$ 264993 263206 261763 260442 259062 257679 256202 254257 251681 248983 247045 246354 246608 247041 247098 246832 246609
52938B46609p4j27j82J45O56P30K75r1n9j47p96j505j532r66m86l10j32P9l0m58
$$ 246609 246535 246408 246226 246371 247027 247757 248032 247941 247882 247735 246939 245434 243902 242936 242450 242140 242008 242087 242057 241599
52918B41599p40o71n50n22l07J11J38n39j212q99K96J226J128M91K40N10O32J87
$$ 241599 240859 240188 239638 239116 238809 238920 239058 238519 237307 236408 236704 237930 239058 239549 239789 240299 240931 241118
52900B41118m49o64m18j55j48k05j39r6k68n03n00k41O1L49P52J173J220P16M8
$$ 241118 240669 240005 239587 239432 239284 239079 238940 238844 238576 238073 237573 237332 237393 237742 238494 239667 240887 241603 241651
52881B41651k74k32j71j34K64J188K067K118J281L54J16N34J044J350J672K197
$$ 241651 241377 241145 240974 240840 241104 242292 244359 246477 247758 248112 248228 248762 249806 251156 252828 255025
52865B55025K616K417J501M02j74JL97J66j003k469l279l215k985l220l628l433
$$ 255025 257641 260058 261559 261961 261787 261788 262185 262351 261348 258879 255600 252385 249400 246180 242552 239119
52849B39119k497j551j296j622j883j696j256j007j190j651j927j649r56l93k26
$$ 239119 236622 235071 233775 232153 230270 228574 227318 226311 225121 223470 221543 219894 218938 218545 218319
52834B18319p9M86J177J176K58p52r04k24M03L44j32k83K34J008J288P86J01J60
$$ 218319 218240 218726 219903 221079 221337 220585 219681 219457 219860 220204 220072 219789 220023 221031 222319 223105 223206 223366
52816B23366J128K166K406J925J363R68N10K3j02J56K69j11p06j134j370j453
$$ 223366 224494 226660 229066 230991 232354 233322 233832 233855 233753 233909 234178 234067 233361 232227 230857 229404
52800B29404j310j077j166j577j735j387j108j382j724j416o52j51M0M91J224
$$ 229404 228094 227017 225851 224274 222539 221152 220044 218662 216938 215522 214870 214719 214759 215250 216474
52785B16474J569J197N29J6k78k72J45O01M71j35l41J64N54R1p86j212j105r62
$$ 216474 218043 219240 219769 219785 219507 219235 219380 219981 220452 220317 219976 220140 220694 220785 219999 218787 217682 216720
52767B16720q63m49K41O03K43m86q40l69O65J499J559J015M73K12J18L00J089
$$ 216720 215857 215408 215649 216252 216495 216009 215169 214800 215465 216964 218523 219538 220011 220223 220341 220641 221730
52750B21730K216K745K256J443J109J149J124J139J485J879J948J990K370K569
$$ 221730 223946 226691 228947 230390 231499 232648 233772 234911 236396 238275 240223 242213 244583 247152
52736B47152J888Q32N59J032J012N4p69n82k6o9n35o72n10o22j050j374j627k127
$$ 247152 249040 249872 250431 251463 252475 252529 251760 251178 251152 251083 250548 249876 249366 248744 247694 246320 244693 242566
52718B42566k533j955k88J332J680O74p63j641j540p00K08N93M71L17M27N78M50
$$ 242566 240033 238078 237790 239122 240802 241476 240713 239072 237532 236832 237040 237633 238104 238421 238848 239426 239876
52701B39876N2l80o93p49k99P05J726J997J377N63K41K49p2q49j427j280p40n29
$$ 239876 239928 239548 238855 238106 237807 238512 240238 242235 243612 244175 244416 244665 244593 243744 242317 241037 240297 239768
52683B39768p68q71m12K67M92K5p72j405j666j636j449j124o17J4N85R46J149
$$ 239768 239000 238129 237717 237984 238476 238501 237729 236324 234658 233022 231573 230449 229832 229846 230431 231377 232526
52666B32526J339J496J432J069O10L68M87R29J622K494L395M087M319L962L053
$$ 232526 233865 235361 236793 237862 238472 238840 239327 240256 241878 244372 247767 251854 256173 260135 263188
52651B63188J794M30q65j970k715k894k481j746j109p87o87o02m39k44o9Q1J72
$$ 263188 264982 265412 264547 262577 259862 256968 254487 252741 251632 250845 250158 249556 249117 248873 248804 248885 249057
52634B49057J93L28Q82J858K712K774J990R82L44J3m66j223j814j722r63j44M8
$$ 249057 249250 249578 250460 252318 255030 257804 259794 260776 261120 261133 260667 259444 257630 255908 254945 254801 254849
52617B54849n59j548k324k541k117j151QP93R34P84P72O64k4r29r85J4Q72O22
$$ 254849 254290 252742 250418 247877 245760 244609 244617 245410 246344 247128 247900 248564 248540 247611 246626 246640 247512 248134
52599B48134l8J75J133J502P96J1j0K46j6n52m85L47J249J642J606J463J279R17
$$ 248134 248096 248271 249404 250906 251702 251713 251703 251949 251933 251381 250896 251243 252492 254134 255740 257203 258482 259399
52581B59399L12l66p74p02l64j82k01J2O77J333J282M33n83j081r62o69o21o57
$$ 259399 259711 259345 258571 257869 257505 257323 257122 257134 257811 259144 260426 260859 260276 259195 258233 257564 256943 256286
52563B56286k09Q32J619J183k52j342j198l45J37k3l00l62m33p63j212j395j033
$$ 256286 256077 256909 258528 259711 259459 258117 256919 256574 256711 256688 256388 256026 255593 254830 253618 252223 251190
52546B51190j97N89P13J29n21o95n66n27m96j60L80Q27J279J948K468K231J469
$$ 251190 250993 251582 252295 252424 251903 251208 250642 250115 249619 249459 249839 250666 251945 253893 256361 258592 260061
52529B60061J122J428J484O29m99q95o15m52n41k22O93J397J191M73R8K03K96
$$ 260061 261183 262611 264095 264724 264225 263330 262715 262263 261722 261500 262193 263590 264781 265254 265352 265555 265851
52512B65851L31R15K244L492L690K909K031J527J032J25j050k115k906l363l397
$$ 265851 266182 267097 269341 272833 276523 279432 281463 282990 284022 284147 283097 280982 278076 274713 271316
52497B71316l139k915k690k017q75p0j78n98m33J11N6o66r99l93L36K36m55q47
$$ 271316 268177 265262 262572 260555 259680 259610 259432 258834 258401 258512 258568 257902 256903 256510 256846 257082 256627 255780
52479B55780p37o68r43j169p94K96J637K438K198J329R13J528K534K884K409J862
$$ 255780 255043 254375 253432 252263 251469 251765 253402 255840 258038 259367 260280 261808 264342 267226 269635 271497
52463B71497J852K299K842L281L404K871J609J16q97j190j187j490k229k923k936
$$ 271497 273349 275648 278490 281771 285175 288046 289655 289771 288874 287684 286497 285007 282778 279855 276919
52448B76919k184j289j052j722k805l529l429k599j481m39L96R84J243J175R64
$$ 276919 274735 273446 272394 270672 267867 264338 260909 258310 256829 256390 256786 257770 259013 260188 261152
52433B61152P61N21J99m1j37l81r39j313r13j43p5q27j096J42K116L134K646J699
$$ 261152 261913 262434 262633 262592 262455 262074 261135 259822 258909 258766 258691 257864 256768 256910 259026 262160 264806 266505
52415B66505J531K374L581M405M626M810N832P805R680J0327R760Q719P364N241
$$ 266505 268036 270410 273991 278396 283022 287832 293664 301469 311149 321476 331236 339955 347319 352560
52401C52560K392m28k845n255p699r191q807o985n127m130l791l428k599j331
$$ 352560 354952 354524 351679 346424 338725 329534 320727 313742 308615 304485 300694 297266 294667 293336
52387B93336l4Q14J071J008Q89P96R10J516K425K828K177J031M92R92K050L049
$$ 293336 293302 294116 295187 296195 297084 297880 298790 300306 302731 305559 307736 308767 309259 310251 312301 315350
52371C15350L675L777L409L132L631M705N154M083K035L99j20m9k09p13j064r33
$$ 315350 319025 322802 326211 329343 332974 337679 342833 346916 348951 349350 349230 349181 348972 348259 347195 346262
52355C46262m86J9N68J148J414J013K52N4R65K427L402L593L670M196M889N084
$$ 346262 345776 345795 346363 347511 348925 349938 350190 350244 351209 353636 357038 360631 364301 368497 373386 378470
52339C78470M686M286M484N433O870Q254Q962Q806Q486R028J0610J2327J3428
$$ 378470 383156 387442 391926 397359 404229 412483 421445 430251 438737 447765 458375 470702 484130
52326D84130J4316J5788J7653J8882J9093J9139J9835K0808K1104K0515J9722
$$ 484130 498446 514234 531887 550769 569862 589001 608836 629644 650748 671263 690985
52315F90985J9287J9116J8896J8590J8384J8414J8653J8891J8884J8608J8218
$$ 690985 710272 729388 748284 766874 785258 803672 822325 841216 860100 878708 896926
52304H96926J7675J6712J5411J4399J3912J3139J1163Q381O135M860L603J556
$$ 896926 914601 931313 946724 961123 975035 988174 999337 1007718 1013853 1018713 1022316 1023872
52292A023872q07k712m337o328q546j0146j0695j0476r801q736p528o606n940
$$ 1023872 1023065 1020353 1016016 1009688 1001142 990996 980301 969825 960024 951288 943760 937154 931214
52279I31214m871k883k41K287M152N320O127P075Q550J0483J2228J3067J2864
$$ 931214 926343 923460 923219 925506 929658 934978 941105 948180 956730 967213 979441 992508 1005372
52266A005372J2233J1959J2339J3125J4031J4941J5557J5323J4153J2986J2866
$$ 1005372 1017605 1029564 1041903 1055028 1069059 1084000 1099557 1114880 1129033 1142019 1154885
52255A154885J3524J3547J2236J0538R717R666R177P509N006K300l26k789n009
$$ 1154885 1168409 1181956 1194192 1204730 1214447 1224113 1233290 1240799 1245805 1248105 1247779 1244990 1239981
52242A239981p001q849j0444j1537j2069j2188j2052j1836j1778j1864j1642j0799
$$ 1239981 1232980 1224131 1213687 1202150 1190081 1177893 1165841 1154005 1142227 1130363 1118721 1107922
52230A107922r731r094q879q485p687o867o225n385m027k365p72O27J706K232
$$ 1107922 1098191 1089097 1080218 1071733 1064046 1057179 1050954 1045569 1041542 1039177 1038405 1039032 1040738 1042970
52216A042970K311K500L095L726M092M655N978P589Q226P310N642M449M129M191
$$ 1042970 1045281 1047781 1050876 1054602 1058694 1063349 1069327 1076916 1085142 1092452 1098094 1102543 1106672 1110863
52202A110863M131L998M153M721N432N919O055N933N651N234M771M492M589M938
$$ 1110863 1114994 1118992 1123145 1127866 1133298 1139217 1145272 1151205 1156856 1162090 1166861 1171353 1175942 1180880
52188A180880N050M335K607K91j938l823n565p153q087q112p890q259q964q840
$$ 1180880 1185930 1190265 1192872 1193163 1191225 1187402 1181837 1174684 1166597 1158485 1150595 1142336 1133372 1124532
52174A124532p464n918n417n724n565m364k866j975j667j293o10P0N83J252K298
$$ 1124532 1117068 1111150 1105733 1100009 1094444 1090080 1087214 1085239 1083572 1082279 1081669 1081739 1082322 1083574 1085872
52159A085872L260L435K806K023J428O49n70j621j749j129n77l30Q6P88J181R82
$$ 1085872 1089132 1092567 1095373 1097396 1098824 1099473 1098903 1097282 1095533 1094404 1093827 1093497 1093583 1094371 1095552 1096534
52143A096534Q12J268J945J965J121j1q36j024l20J333L431N208O416P520R067
$$ 1096534 1097346 1098614 1100559 1102524 1103645 1103634 1102798 1101774 1101454 1102787 1106218 1111426 1117842 1125362 1134429
52128A134429J1186J3688J6280J8585K0357K1858K3721K6162K8411K9380K8908
$$ 1134429 1145615 1159303 1175583 1194168 1214525 1236383 1260104 1286266 1314677 1344057 1372965
52117A372965K8043K7870K8262K8129K6801K4733K2707K0868J8948J7006J5302
$$ 1372965 1401008 1428878 1457140 1485269 1512070 1536803 1559510 1580378 1599326 1616332 1631634
52106A631634J3618J1432Q858O755N709N339M841L743J960m14l078n683q287j1226
$$ 1631634 1645252 1656684 1665542 1672297 1678006 1683345 1688186 1691929 1693889 1693475 1690397 1684714 1676427 1665201
52092A665201j4337j6816j8184j8867j9445j9855j9766j9245j8381j6767j4044
$$ 1665201 1650864 1634048 1615864 1596997 1577552 1557697 1537931 1518686 1500305 1483538 1469494
52081A469494j0738p819n594l641j670K28K106M216O494Q564J0268J1748J2973
$$ 1469494 1458756 1450937 1445343 1441702 1440032 1440260 1442366 1446582 1453076 1461640 1471908 1483656 1496629
$$ [...]
##END NTUPLES=NMR SPECTRUM
##END=
