##TITLE=AC1452_NESTRI271_7818727_KS3ssZnEED
##JCAMPDX= 6.0         $$ Bruker NMR JCAMP-DX V2.0
##DATA TYPE= NMR SPECTRUM
##DATA CLASS= NTUPLES
##ORIGIN= BRUKER
##OWNER= Administrator
$$ 1.72 TOPSPIN		Version 2.1
$$ 2013-04-30 16:22:36.722 -0700  Administrator@X
$$ Compression mode = diff/dup
##.OBSERVE FREQUENCY= 400.02188249412
##.OBSERVE NUCLEUS= ^1H
##.ACQUISITION MODE= SIMULTANEOUS (DQD)
##.ACQUISITION SCHEME= undefined
##.AVERAGES= 8
##.DIGITISER RES= 22
##SPECTROMETER/DATA SYSTEM= spect
##.PULSE SEQUENCE= zg30
##.SOLVENT NAME= COFFEE_meoh
##.SHIFT REFERENCE= INTERNAL, COFFEE_meoh, 1, 14.98509
##AUDIT TRAIL= $$ (NUMBER, WHEN, WHO, WHERE, PROCESS, VERSION, WHAT)
$$ ##TITLE= Audit trail, TOPSPIN		Version 2.1
$$ ##JCAMPDX= 5.01
$$ ##ORIGIN= Bruker BioSpin GmbH
$$ ##OWNER= Administrator
$$ $$ E:\/data/COFFEE/nmr/AC1452_NESTRI271_7818727_KS3ssZnEED/10/pdata/1/auditp.txt
$$ ##AUDIT TRAIL=  $$ (NUMBER, WHEN, WHO, WHERE, PROCESS, VERSION, WHAT)
(   1,<2013-04-30 16:22:30.307 -0700>,<Administrator>,<X>,<go>,<TOPSPIN 2.1>,
      <created by zg
	started at 2013-04-30 16:21:23.783 -0700,
	POWCHK enabled, PULCHK disabled,
       configuration hash MD5:
       F7 49 AB AC A2 8D 51 76 73 8D C1 9A A6 38 9F DE
       data hash MD5: 64K
       55 E0 79 50 05 34 5B 73 53 7F BD 10 FD 5A CC C9>)
(   2,<2013-04-30 16:22:33.021 -0700>,<Administrator>,<X>,<proc1d>,<TOPSPIN 2.1>,
      <Start of raw data processing
       efp LB = 0 FT_mod = 6 PKNL = 1 PHC0 = 0 PHC1 = 0 SI = 32K 
       data hash MD5: 32K
       09 CE 8D B1 BA DA 39 C7 B8 E8 F9 17 DB C8 97 E1>)
(   3,<2013-04-30 16:22:33.328 -0700>,<Administrator>,<X>,<proc1d>,<TOPSPIN 2.1>,
      <pk PHC0 = 99.59106 PHC1 = 0 
       data hash MD5: 32K
       8C DD 1E 03 B2 71 91 B7 B7 26 0E C0 35 89 0D 45>)
(   4,<2013-04-30 16:22:33.467 -0700>,<Administrator>,<X>,<proc1d>,<TOPSPIN 2.1>,
      <abs ABSG = 1 
       data hash MD5: 32K
       5E 22 3E 4B 79 F6 3B BB 5A 8F 1B D9 A3 3E 97 07>)
(   5,<2013-04-30 16:22:33.578 -0700>,<Administrator>,<X>,<proc1d>,<TOPSPIN 2.1>,
      <abs ABSG = 2 
       data hash MD5: 32K
       51 F5 52 4C 67 DF 1A CB E5 C5 A1 04 82 F7 DF AF>)
(   6,<2013-04-30 16:22:33.648 -0700>,<Administrator>,<X>,<proc1d>,<TOPSPIN 2.1>,
      <abs ABSG = 3 
       data hash MD5: 32K
       C2 D3 C5 60 0C 50 4E AB 39 51 D1 16 2F 9A 1E 42>)
(   7,<2013-04-30 16:22:33.717 -0700>,<Administrator>,<X>,<proc1d>,<TOPSPIN 2.1>,
      <abs ABSG = 4 
       data hash MD5: 32K
       22 6D 63 00 B9 87 4F BC 2C 59 B0 40 0A C4 4C B3>)
(   8,<2013-04-30 16:22:33.787 -0700>,<Administrator>,<X>,<proc1d>,<TOPSPIN 2.1>,
      <abs ABSG = 5 
       data hash MD5: 32K
       C2 67 D8 84 81 04 BB DD BD 49 87 17 A5 DE AF A4>)
$$ ##END=
$$ 
$$ $$ hash MD5
$$ $$ 2A 3F 4B 31 17 5C EB AA D3 F0 03 92 2E 45 C8 77
##$RELAX= 
##$RELAX= 
##$RELAX= 
##$RELAX= 
##$RELAX= 
##$RELAX= 
##$RELAX= 
$$ Bruker specific parameters
$$ --------------------------
##$DU= <E:\>
##$EXPNO= 10
##$NAME= <AC1452_NESTRI271_7818727_KS3ssZnEED>
$$ [...]
##$TP= (0..7)
150 150 150 150 150 150 150 150
##$TP07= 0
##$TPNAME0= <>
##$TPNAME1= <>
##$TPNAME2= <>
##$TPNAME3= <>
##$TPNAME4= <>
##$TPNAME5= <>
##$TPNAME6= <>
##$TPNAME7= <>
##$TPOAL= (0..7)
0.5 0.5 0.5 0.5 0.5 0.5 0.5 0.5
##$TPOFFS= (0..7)
0 0 0 0 0 0 0 0
##$TUNHIN= 0
##$TUNHOUT= 0
##$TUNXOUT= 0
##$USERA1= <user>
##$USERA2= <user>
##$USERA3= <user>
##$USERA4= <user>
##$USERA5= <user>
##$V9= 5
##$VALIST= <valist>
##$VCLIST= <CCCCCCCCCCCCCCC>
##$VD= 0
##$VDLIST= <DDDDDDDDDDDDDDD>
##$VPLIST= <PPPPPPPPPPPPPPP>
##$VTLIST= <TTTTTTTTTTTTTTT>
##$WBST= 1024
##$WBSW= 4
##$XGAIN= (0..3)
0 0 0 0
##$XL= 0
##$YL= 0
##$YMAX_a= 652697
##$YMIN_a= -555374
##$ZGOPTNS= <>
##$ZL1= 120
##$ZL2= 120
##$ZL3= 120
##$ZL4= 120
##$ABSF1= 14.98509
##$ABSF2= -5.573092
##$ABSG= 5
##$ABSL= 3
##$ALPHA= 0
##$AQORDER= 0
##$ASSFAC= 0
##$ASSFACI= 0
##$ASSFACX= 0
##$ASSWID= 0
##$AUNMP= <proc_prof1d_extract_pilot.lims>
##$AXLEFT= 0
##$AXNAME= <>
##$AXNUC= <1H>
##$AXRIGHT= 0
##$AXTYPE= 0
##$AXUNIT= <>
##$AZFE= 0.1
##$AZFW= 0.1
##$BCFW= 0
##$BC_mod= 0
##$BYTORDP= 0
##$COROFFS= 0
##$CY= 15
##$DATMOD= 1
##$DC= 0
##$DFILT= <>
##$DTYPP= 0
##$F1P= 0
##$F2P= 0
##$FCOR= 0.5
##$FTSIZE= 32768
##$FT_mod= 6
##$GAMMA= 0
##$GB= 0
##$INTBC= 1
##$INTSCL= 1
##$ISEN= 128
##$LB= 0
##$LEV0= 0
##$LPBIN= 0
##$MAXI= 10000
##$MC2= 0
##$MEAN= 0
##$ME_mod= 0
##$MI= 0
##$NCOEF= 0
##$NC_proc= -8
##$NLEV= 6
##$NOISF1= 0
##$NOISF2= 0
##$NSP= 0
##$NTH_PI= 0
##$NZP= 0
##$OFFSET= 14.98509
##$PC= 1
##$PHC0= 99.59106
##$PHC1= 0
##$PH_mod= 1
##$PKNL= yes
##$PPARMOD= 0
##$PPDIAG= 0
##$PPIPTYP= 0
##$PPMPNUM= 2147483647
##$PPRESOL= 1
##$PSCAL= 4
##$PSIGN= 0
##$PYNMP= <proc.py>
##$REVERSE= no
##$SF= 400.02
##$SI= 32768
##$SIGF1= 0
##$SIGF2= 0
##$SINO= 400
##$SIOLD= 32768
##$SPECTYP= <>
##$SREGLST= <1H.CDCl3>
##$SSB= 0
##$STSI= 32768
##$STSR= 0
##$SW_p= 8223.68421052631
##$SYMM= 0
##$S_DEV= 0
##$TDeff= 65536
##$TDoff= 0
##$TI= <>
##$TILT= no
##$TM1= 0
##$TM2= 0
##$TOPLEV= 0
##$USERP1= <user>
##$USERP2= <user>
##$USERP3= <user>
##$USERP4= <user>
##$USERP5= <user>
##$WDW= 1
##$XDIM= 32768
##$YMAX_p= 457815269
##$YMIN_p= -731894
##$CURPLOT= <Network HP LaserJet P1505>
##$CURPRIN= <$Network HP LaserJet P1505>
##$DFORMAT= <normdp>
##$LAYOUT= <+/1D_H.xwp>
##$LFORMAT= <normlp>
##$PFORMAT= <normpl>
##$SURQMSG= 1
$$ End of Bruker specific parameters
$$ ---------------------------------
##NTUPLES= NMR SPECTRUM
##VAR_NAME=  FREQUENCY,     SPECTRUM/REAL,   SPECTRUM/IMAG
##SYMBOL=    X,             R,               I
##VAR_TYPE=  INDEPENDENT,   DEPENDENT,       DEPENDENT
##VAR_FORM=  AFFN,          ASDF,            ASDF
##VAR_DIM=   32768,         32768,           32768
##UNITS=     HZ,            ARBITRARY UNITS, ARBITRARY UNITS
##FACTOR=    0.250966925370066, 1,           1
##FIRST=     8223.43324360094, 93955,        -56791
##LAST=      0,             128801,          -37150
##MIN=       0,             -731894,         0
##MAX=       8223.43324360094, 457815269,    0
$$ Real data points
##PAGE= N=1
##DATA TABLE= (X++(R..R)), XYDATA
$$ [...]
19559a07768m4571b8931B9328a76830b1332j72683o9015j3737a17212j51031j35273
19548d03516J71580J09579B63195a10826D3329a5597j76633E1730a62990h304
19537b57280c1629B29355b5478A86639a30035k40804J20660B51075q9203q0615
19527H1257C9592b187C04207h1266p3473k1922L5705r5454a15536C3443a57057
19515b9307A22669d43853a74055J7538B718a21622o8658f7041H6260d9596j21273
19504a70869A88111D7266J55289a06111O70j00919B4362a5695p6441o1985r8559
19493b52680l5133A21180a47786H1039L6657b9582e112B9483K67539A40079f020
19481F4962M978a49135m33757a06126E2035g3564m7402A6703b24093A66106f8220
$$ y = [-107768, -152339, -28931, 29328, -176830, -21332, -194015, -263030, -276767, -117212, -268243, -403516, -231936, -122357, 263195, -110826, 43329, -15597, -192230, 51730, -162990, -8304, -257280, -31629, 229355, -25478, 186639, -130035, -370839, -250179, 251075, 161872, 81257, 39592, -2187, 304207, -81266, -154739, -176661, -140956, -236410, -115536, 33443, -157057, -29307, 122669, -443853, -174055, -156517, 2718, -121622, -190280, -67041, 86260, -49596, -170869, 188111, 47266, 202555, -106111, -105441, -206360, 24362, -15695, -92136, -154121, -252680, -287813, 121180, -147786, 81039, 117696, -29582, -5112, 29483, 297022, 140079, -6020, 64962, 69940, -149135, -582892, -106126, 52035, -73564, -120966, 16703, -224093, 166106, -68220]
19469b33994J14095m7989p9694h8462K5708j53560I8682b654E6231g6871a1352
19457d0675H5532i5020A51587a40396A22426a57713B06984a04914M1510R943j01149
19446a54610j59575f3159k8555q1391P1670j10599O6712k61783O4914a27760j3214
19435a40974d7150f334m651H3699b0164A74301C9151P0346F617d88594i9033p9954
19423a78987A29672a11700e123l48169B25371c14640J55782j95853J28382I9282
19412a13226N1537M058j72800O7047D8165b27994Q1373e0908A55560a79247D4772
19400a50002j05007A49535F8421c66201h6197p1972g1843A03705a1941C7138a9624
19388b20749A37808A8030c3462J3260m1529A55639a01708G4962D203K66662K4557
$$ y = [-233994, -119899, -167888, -247582, -88462, -62754, -216314, 98682, -2654, 56231, -76871, -11352, -40675, 85532, -95020, 151587, -140396, 122426, -157713, 206984, -104914, -63404, -53461, -154610, -314185, -63159, -91714, -173105, -101435, -212034, -145322, -407105, -342191, -127760, -140974, -47150, -6334, -10985, 83699, -20164, 174301, 39151, 109497, 6617, -488594, -99033, -178987, 129672, -111700, -5123, -353292, 225371, -314640, -158858, -354711, -226329, 99282, -113226, -61689, -57631, -230431, -163384, 48165, -227994, -146621, -50908, 155560, -179247, 44772, -150002, -255009, 149535, 68421, -366201, -86197, -158169, -71843, 103705, -11941, 37138, -19624, -220749, 137808, 18030, -33462, -20202, -61731, 155639, -101708, 74962, 4203, 270865, 295422]
19377B95422b17504Q6029M890M1952H9372c28480q0541B20768g8183j88001A80966
19365C09877o4938n2027n3561a41416F5051B6539P5248A9420a05817F825O902
19354A3727J17902a51591g5772o0692d4912F344K50752e0686M39J1126l3700A01219
19341h6381j2771B68041c5488A12462d51766C1184d8134j34033f2197B48458o6794
19330A81664B106K19465r6674b5814j42910P2186k3227n8750m751k00707a17327
19318A00828c28300a52297M070B11768p7874a72335j30776H99R7850b62583c0397
19306B14547F3812b45967d1388j01214L5929a5884j74387m6178a7933B14787o4802
19295A49985e1299o9667C264K48206b17536a8194E0008c03616a1727E3072a15551
$$ y = [295422, -217504, -131475, -126585, -84633, 89372, -328480, -409021, 220768, -78183, -266184, 180966, 309877, 244939, 192912, 139351, -141416, 65051, 26539, 101787, 19420, -105817, 6825, 13727, 131629, -151591, -75772, -136464, -44912, 6344, 257096, -50686, -50247, -39121, -72821, 101219, -86381, -99152, 268041, -35488, 112462, -451766, 31184, -48134, -182167, -62197, 248458, 181664, 2106, 221571, 124897, -25814, -168724, -96538, -119765, -178515, -183266, -383973, -117327, 100828, -328300, -152297, -148227, 211768, 133894, -172335, -303111, 899, 98749, -262583, -30397, 214547, 63812, -245967, -41388, -142602, -106673, -15884, -190271, -236449, -17933, 214787, 149985, -51299, -120966, 3264, 251470, -217536, -18194, 50008, -303616, -11727, 53072, -115551]
19283a26991k49955f9179C6651K08336a95421M9230f0789k31354B73969A1935
19272h7641F2220J03643b80447G0513J3024f9383D2682g4609j13311p9688g3324
19260f7767k0724G0879d51098N6696A23891f7345k00937a652A89455g775l77457
19249c85232O5914k64586A24977b1049k37985B5416K36901b05333E0201b08853
19238c88019a203E9301b27163d2167B2065R1730N9265f4171q9375L915B095f786
19225a86170c8092k98999A05878O411n1272i8569A03220B8876b5433n7518o7323
19214a50274j18430C7732Q0135g3811a7882j46205I0315J21604b36654N7280P4657
19203a04717A58553g5556A32041b6520k67448M4714j22096I154h98j11654a362
$$ y = [-126991, -376946, -69179, 36651, 244987, -195421, -146191, -60789, -292143, 273969, 11935, -87641, 62220, 165863, -280447, 70513, 83537, -69383, 42682, -74609, -187920, -267608, -73324, -67767, -88491, 70879, -451098, -394402, 123891, -67345, -268282, -1652, 189455, -7775, -385232, -319318, -583904, 124977, -21049, -259034, 25416, 262317, -205333, 50201, -208853, -388019, -1203, 59301, -227163, -42167, 22065, 113795, 173060, -64171, -153546, -149631, 2095, -6786, -186170, -38092, -337091, 105878, 112289, 61017, -98569, 103220, 28876, -25433, -82951, -150274, -268704, 37732, 117867, -73811, -17882, -164087, 90315, 211919, -236654, -179374, -104717, 158553, -75556, 132041, -26520, -293968, -249254, -371350, 9154, -898, -112552, -1362]
19191A2543L0137k0147R0794J23155a74631B90646q9598d9830p1500A33419l2203
19180A01216b47357N4502e6665m1335K3456K0857E1454d18564N8327a11078q3930
19169a95008O7328j69915D2980b67025C756g3743I9368b09988C33379b50423I1896
19157b77472f6388n605k12293J03648F4166a28289B7232b77384J29720k5861A31175
19145d6552k29570M5479g2797C3417f2554B29953h1152K3202B22497r0375c24728
19133a42549C5576K80012B7778q724O5738a59628n2693C25465a42506j0366A6964
19121a80555G7071a7951G0516a33142j19417i5177R924G4602b00892A39157B1011
19109d2681b549j08180A21438m7265A6328J1920Q3384n522a98848P219c4535c156
$$ y = [12543, 42680, 22533, 113327, 236482, -174631, 290646, 201048, -49830, -121330, 133419, 101216, -247357, -192855, -56665, -98000, -74544, -53687, 51454, -418564, -360237, -111078, -195008, -127680, -297595, 42980, -267025, 3756, -73743, 99368, -209988, 333379, -250423, 91896, -277472, -66388, -71993, -284286, -180638, 64166, -128289, 27232, -277384, -147664, -173525, 131175, -46552, -276122, -230643, -72797, 33417, -62554, 229953, -81152, -57950, 222497, 132122, -324728, -142549, 35576, 315588, 27778, 19054, 84792, -159628, -212321, 325465, -142506, -152872, 16964, -180555, 77071, -17951, 70516, -133142, -252559, -95177, -85253, 74602, -200892, 139157, 21011, -42681, -2549, -110729, 121438, 74173, 16328, 28248, 111632, 106110, -198848, -191629, -34535, -3156]
19096a4481j26264l1578h5105p6477L9185H6746B9445b24506A36874a27101E5434
19084c22308L3682a1970k3234G6844h1381J6369k69929C339M28796i9000k85551
19073c84551B31945E1925N2659a2930A29948a09454G1265b35488a14817A4172
19062c40142D6948N207b38761a17281M2388B17836E7520g9351L9050r9970M7357
19051i2914j93647A1929a4903k15592A33354a77133E9813a7620A17296a67661
19040c1826A82934J9021q6759h6878E2959c0202I6938a89754A79642L4286l5308
19029A78620Q7411j12563L19362A5487J95814n2843n0508k3166C2696L3542K044
19018F8282K12399M5527C2851c3519l46630O4986k47771i8526a2195p6301B93171
$$ y = [-14481, -140745, -172323, -85105, -161582, -122397, 86746, 29445, -224506, 136874, -127101, 55434, -322308, -288626, -11970, -35204, 76844, -81381, -65012, -334941, 3339, 432135, -99000, -384551, 231945, 51925, 104584, -12930, 129948, -109454, 71265, -235488, -114817, 14172, -340142, 46948, 52155, -238761, -117281, -74893, 217836, 57520, -79351, -40301, -140271, -92914, -286561, 11929, -14903, -230495, 133354, -177133, 59813, -17620, 117296, -167661, -31826, 182934, 201955, 115196, -86878, 52959, -30202, 96938, -189754, 179642, 213928, 178620, 266031, 153468, 472830, 15487, 211301, 158458, 107950, 84784, 32696, 66238, 68282, 280681, 326208, 32851, -33519, -380149, -315163, -562934, -98526, -12195, -88496, 293171]
19006h092F3326B61c83322e827l08104a30076A6276a67545A9027a9814A37251
18994A81313e27515i1878b0517k89701J07235E8934b64756L3377G4138d2020j32803
18983a74823A56860a98462Q1409A99269C3490b68060f2071j37220e8518A60995
18972h1691n0833A3591a25809K682N8721A27879a54763n3687i5801k23290A7032
18960g2771A80669b03242P9442k62174j37524b61694a0262k17279a10844e1661
18949a15855H1627b40848l86427a09331k14048A07040E2467d3016j40515f5934
18938B29943A11819a20481c4619G4464K14913C4322J73826a02498j41138g2309
18927B00271a72777L5560A42416h4333G4343a13044L3005j03769A71795J51205
$$ y = [-8092, 63326, 261, -383322, -5827, -313931, -130076, 16276, -167545, 19027, -19814, 137251, 181313, -527515, -91878, -20517, -310218, -202983, 58934, -264756, -231379, 74138, -42020, -174823, 156860, -198462, -117053, 199269, 33490, -268060, -62071, -199291, -58518, 160995, -81691, -132524, 13591, -125809, -123127, -64406, 127879, -154763, -208450, -95801, -319091, 17032, -72771, 180669, -203242, -123800, -385974, -523498, -261694, -10262, -227541, -110844, -51661, -115855, 81627, -240848, -627275, -109331, -323379, 107040, 52467, -43016, -183531, -65934, 229943, 111819, -120481, -34619, 74464, 289377, 34322, 208148, -102498, -243636, -72309, 200271, -172777, -137217, 142416, -84333, 74343, -113044, -80039, -183808, 171795, 323000]
18917C23000D3151b46865b5305G7850I642g776A92076c20576a37333A26619J71279
18906B97898a94828i1745E3148a80425A00218d14987D1877g3052k12098a33299
18895F3378g7939j23866J00581L6167n3267A35421a08179A65108K1458e0537A93781
18883d08653N5262A74141e55r1672K5881J3298k70178a37040M9101J5360r0441
18872a63020j72989J29425L0819h675B24681F1185c72327J52609A54566D6195
18861b5116k25892h4011j55667a19080N6699A0132L06262a00167o29747L51507
18851c78407a02117m6845p7942B1721b53472E8280K60825A48903e964A2053a2688
18839a73015h6341A91731a05050p2914A42792J2149a80395n4006g9648l1015B81129
$$ y = [323000, 43151, -246865, -25305, 77850, 9642, -7776, 192076, -320576, -137333, 126619, 297898, -194828, -91745, 53148, -180425, 100218, -414987, 41877, -73052, -285150, -133299, 63378, -77939, -201805, -101224, -65057, -118324, 135421, -108179, 165108, 186566, -50537, 193781, -408653, -353391, 174141, -555, -92227, -66346, -53048, -323226, -137040, -87939, -72579, -163020, -336009, -206584, -175765, -8675, 224681, 61185, -372327, -219718, 154566, 46195, -25116, -251008, -84011, -239678, -119080, -62381, 10132, 316394, -100167, -729914, -378407, -102117, -148962, -226904, 21721, -253472, 58280, 319105, 148903, -5964, 12053, -12688, -173015, -86341, 191731, -105050, -177964, 142792, 154941, -180395, -234401, -79648, -110663, 281129]
18827H0523b67974J026a27219D462b23273h9457J2049B85073b01158P0058l381
18816a34481O5602K2956A90111G2638d9586b3387A94485r5480J05238j0697l3818
18805A59728E0233L455B777K15335r9177d0940G1652J2692b23942A98044R651
18794B07695a34046c7180C18172A14179a28661G2552b6158k50281B77334f1268
18783A6065o421K385c94959A2641P9616b43748i1833A20257h9286a7271A56457
18771E6297a66448C8172b89074J10482A2630J10465g7800l18813a54115g6441
18760g8077B5714O1323c3380E6679a29561k16329A00209F53J99587a52790G8822
18748c36167a28462l02526A78644m3467b70524E6063K26826a47517M8441B04622
$$ y = [80523, -267974, -266948, -127219, 4462, -223273, -89457, -77408, 285073, -201158, -131100, -134481, -68879, -45923, 190111, 72638, -49586, -23387, 194485, 99005, 204243, 193546, 159728, 50233, 53688, 2777, 218112, 118935, -40940, 71652, 84344, -223942, 198044, 207695, -134046, -37180, 318172, 114179, -128661, 72552, -26158, -276439, 277334, -61268, 16065, 9644, 12029, -394959, 12641, 92257, -243748, -91833, 120257, -89286, -17271, 156457, 56297, -166448, 38172, -289074, -178592, 12630, 123095, -77800, -396613, -154115, -76441, -78077, 25714, 87037, -33380, 56679, -129561, -345890, 100209, 653, 200240, -152790, 78822, -336167, -128462, -430988, 178644, 135177, -270524, 56063, 282889, -147517, -99076, 204622]
18737A15283a00640C2265b06811A0754Q149e076q6914H7334K4586a76706A79305
18725G0465K8781a43274j12641P8114b7559j27001c4823r3025m5611c0473J3633
18714a6840B58201B8950a30072j20626c6351B6430f4177j72326A60497a63360
18703a25331h327j37441I7507a65941j11308q9065e4120H5535c446A9589d8444
18691a03368B24611l0949a65381k7305A81574b09758j76995A57003a51497j76939
18681c28436A20607a32318F3518e2245k04456c0056k62776e1798j4439k99320
18671c65557c2776p6590d327k12603a9289h53E3267b50674C6875c74086J05970
18660b68116m9986J21741P0850m4805M0717q3091A29399P4619k4119b8865A09288
$$ y = [115283, -100640, 32265, -206811, 10754, 18903, -5076, -91990, 87334, 111920, -176706, 179305, 70465, 99246, -143274, -255915, -177801, -27559, -154560, -34823, -127848, -173459, -30473, -16840, 258201, 28950, -130072, -250698, -36351, 26430, -64177, -236503, 160497, -163360, -125331, -8327, -145768, 97507, -165941, -277249, -366314, -54120, 85535, -3446, 19589, -48444, -103368, 224611, 193662, -165381, -192686, 181574, -209758, -386753, 157003, -151497, -328436, 120607, -132318, 63518, -52245, -256701, -30056, -292832, -51798, -66237, -365557, -32776, -109366, -4327, -216930, -19289, -853, 53267, -250674, 36875, -374086, -268116, -318102, -196361, -125511, -170316, -129599, -212690, 129399, 204018, 179899, -28865, 109288]
18648A09446b62666A8085b61807j19343h5155k80876J23781e5644C67018a21276
18637B77395a03412j39065l5656r1334a66223J0740j68355a15670c7919J8744
18627a9175B12348D5478b92743h5272K326n6332A17876b89877h2819A94394G7935
18615b2284A35488i399C156g81n8396A8759J95743c88626C08114I1017c07591
18603a21287l6232h806k00924H462N1403g4266b2728B17953a97442b6048k10328
18592b36376b5229n5566b9315J898j54126A62625J51362c09423f5812A01315d81252
18580d44094K12604O3211K6255A86591g3867p5370N0032J7000j10861Q9850C677
18568h3688B08572a94876e171l77450A08731D9329A1077J22267o0355M9110P7797
$$ y = [109446, -262666, 18085, -261807, -381150, -85155, -366031, -242250, -55644, 367018, -121276, 277395, -103412, -242477, -278133, -369467, -166223, -155483, -323838, -115670, -37919, -19175, 212348, 45478, -292743, -85272, -82946, -139278, 117876, -289877, -82819, 194394, 77935, -22284, 135488, -9399, 3156, -781, -59177, 18759, 214502, -388626, 308114, 91017, -307591, -121287, -157519, -8806, -209730, 8462, 59865, -74266, -22728, 217953, -197442, -26048, -236376, -25229, -80795, -29315, -27417, -181543, 162625, 313987, -309423, -65812, 101315, -481252, -444094, -231490, -168279, -142024, 186591, -73867, -149237, -99205, -82205, -193066, -103216, 3677, -83688, 208572, -194876, -5171, -382621, 108731, 49329, 11077, 133344, 72989, 122099, 199896]
18557A99896a20866l7511M6936F5167b34694C21h9283j06094j61830l4253A94957
18545H913K2999d8556k39577C7171b65884a23940A91129d29589H1394M0347d4157
18533c32028K6433h0000j1577A2755J13360c62165h8191G4730J33888b84629A3795
18521c6642k47860A30905J53268c71414A70276q4250g4821j27683n3583A669i1478
18509g1768J939j54694A7508b34886b46A34050L1572n6007D761h4900q560B51133
18496C0636d6887o1548h372A55073a15536j80709k1738L3683G0831a94397B14769
18484a05581j3531k95002a77774p7845k4458E7002c78263A26389C3402o993c2379
18472a25717c539B0201a17908j06379Q6484A13349a07484j14276O801c8410D912
$$ y = [199896, -120866, -158377, -111441, 65167, -234694, 321, -89283, -195377, -357207, -391460, 194957, 8913, 31912, -48556, -288133, 37171, -265884, -123940, 191129, -429589, 81394, 121741, -44157, -332028, -305595, -80000, -91577, 12755, 126115, -362165, -88191, 74730, 208618, -284629, 13795, -36642, -284502, 130905, 284173, -371414, 170276, 86026, -74821, -202504, -256087, 1669, -91478, -71768, -69829, -224523, 17508, -234886, -246, 134050, 165622, 109615, 4761, -84900, -93460, 251133, 30636, -46887, -108435, -8372, 155073, -115536, -296245, -317983, -284300, 70831, -194397, 214769, -105581, -119112, -414114, -177774, -255619, -280077, 57002, -378263, 126389, 33402, 26409, -32379, -125717, -3539, 20201, -117908, -224287, -137803, 113349, -107484, -221760, -214959, -38410, 4912]
18460B7362J31763b57906B15295a65440J183F891h9372D3552b31027i1945k45322
18449c37267b2368G4053M739e5525k1279A2801b03837e211k36394c5558k59458
18438b95016d6612C00391b4208j38571C75446a01438j23725a09778A5393e3288
18427A0212K23721h4436k83872a60469j8934A70226a28093K7560l6070B59812
18416a04244j14544A0493h3561O675j3077J8550A6556e0271A26687c60934F6599
18404D8080D645f86B73587b65693D6418N7250G759J00474r644m2041O0075R985
18392A26608c62809G5138a75046C7855O1111B2797b1253F5341b74884a24819m9655
18381a74474D9778b75722A50688a51473A81117c4888r3616B11173b14221n2215
$$ y = [27362, 159125, -257906, 215295, -165440, -164257, 6891, -89372, 43552, -231027, -91945, -337267, -22368, 74053, 78792, -55525, -76804, 12801, -203837, -5211, -241605, -35558, -295016, -46612, 300391, -24208, -162779, 375446, -101438, -225163, -109778, 15393, -53288, 10212, 233933, -84436, -368308, -160469, -179403, 170226, -128093, -100533, -136603, 259812, -104244, -218788, 10493, -83561, -76886, -89963, -71413, 16556, -50271, 126687, -360934, 66599, 48080, 4645, -686, 273587, -265693, 46418, 103668, 7759, 108233, 98589, 56548, 116623, 126608, -362809, 75138, -175046, 37855, 98966, 22797, -21253, 65341, -274884, -124819, -174474, 49778, -275722, 150688, -151473, 181117, -34888, -128504, 211173, -214221, -266436]
18371b66436A73441p2422N2362a44108l6260G2939l203R6819A2546K95064b55834
18359c36765A14327D9078J1221b37368a1390k30700K1780A75665I605f5801A75717
18347B1958c95237a09371l01855A02793q243Q2746c3043l06477c4882B59646a89745
18335H8608k6756d4618A12490f1527A60306a07523j78586l8826a51179A72107
18324A48106c80031a77306C97157G2854c87120b8976j3617G7371l6237e4521l40724
18313c95245A81243C481c77600A11090K8976c4770o4331b6256B06891a12845B15606
18301A32429b28957A43166M8596B8792a99095n9407a15441B80602g4512a6314
18290i1654k91454A60452B6004a83180a2852K420r4191B4523a97053k6000j03103
$$ y = [-266436, 173441, 101019, 153381, -144108, -180368, 72939, 69736, 166555, 12546, 307610, -255834, -336765, 114327, 49078, 60299, -237368, -11390, -242090, -220310, 175665, 9605, -65801, 175717, 21958, -395237, -109371, -411226, 102793, 94550, 177296, -33043, -339520, -34882, 259646, -189745, 88608, 61852, -44618, 112490, -61527, 160306, -107523, -286109, -324935, -151179, 172107, 148106, -380031, -177306, 397157, 72854, -387120, -28976, -42593, 77371, 41134, -54521, -395245, 181243, 3481, -377600, 111090, 140066, -34770, -99101, -26256, 206891, -112845, 215606, 132429, -228957, 143166, 191762, 28792, -199095, -258502, -115441, 280602, -74512, -16314, -91654, -383108, 160452, 26004, -183180, -12852, -10432, -104623, 24523, -197053, -223053, -326156]
18279c26156b9971j66532c010B55745m2500b22128C3895d23179a25939d7013k28499
18268b75512D1806a3867j30826e2587F8934g7552p0191A28239b62919n6925J9016
18257c00828B4766d0749m6336B3682c09633j30281J92303J06582d384p7738A57824
18245B57856a62746A52833a07330n4327a093B25255i531k87688O4937A85204K5456
18234B10660E0138b31463f7118j33943K8174c859j73835O5930b2417A32587l4865
18223I7722K9395M8522A7110f2747B9656g7813A6413b19532B0012b04331n85k7641
18211b32557A79930b08020e0744P881q7347A22093i1389L2630j39938A9305J5891
18200C5196K20054A18666J23871H6726d11987E0204N2777b55737f6976j78314
$$ y = [-326156, -29971, -196503, -3010, 255745, 213245, -222128, 33895, -423179, -125939, -47013, -275512, 41806, -13867, -144693, -52587, 68934, -77552, -147743, 128239, -262919, -319844, -300828, 24766, -40749, -87085, 23682, -309633, -439914, -247611, -141029, -4384, -82122, 157824, 257856, -162746, 152833, -107330, -161657, -1093, 225255, -9531, -297219, -232282, 185204, 210660, 50138, -231463, -67118, -201061, -172887, -3859, -177694, -111764, -22417, 132587, 97722, 127117, 175639, 17110, -62747, 29656, -77813, 16413, -219532, 20012, -204331, -204916, -232557, 179930, -208020, -50744, -42863, -130210, 122093, -91389, -58759, -198697, 19305, 35196, 255250, 118666, 242537, 86726, -411987, 50204, 102981, -255737, -66976, -245290]
18190b45290A40064e3258J8347o0737L8742j77885O8997A14925A4891R1501c8751
18178C5459b82497J04254B26694J40186a48042g2873j6483k27915a51446L9659
18168a11787b7588E8951k6342a60982q7221g4252C0890d8968D8156j4258e8684
18156c27330J28265g1354k5984k53065c1327k1449j29063C33115h3272b8984k29910
18145b58894B28958n7745c9024l5421I9448j9526a07155j25405E5628a38701j89214
18134c27915O6551d2180B37209a23457r3279d6725j75899M3039L4913H9258a97879
18122a03722J5632A71992b69566R6537G5301b04529A82327L2600h492L112k6656
18111c2036A71980a38493C12301a89338g9364A3508a18812B26047L320A12177
$$ y = [-245290, 140064, -53258, -34911, -95648, -56906, -234791, -165794, 114925, 14891, 106392, -38751, 35459, -282497, -178243, 226694, 366880, -148042, -72873, -89356, -317271, -151446, -111787, -27588, 58951, 32609, -160982, -248203, -74252, 30890, -48968, 48156, 33898, -58684, -327330, -199065, -71354, -97338, -350403, -31327, -52776, -181839, 333115, -83272, -28984, -258894, 228958, 171213, -39024, -74445, 99448, 79922, -107155, -232560, 55628, -138701, -327915, -261364, -42180, 237209, -123457, -216736, -46725, -222624, -179585, -144672, 89258, -197879, -103722, -88090, 171992, -269566, -173029, 75301, -204529, 182327, 214927, -8492, -5380, -32036, 171980, -138493, 312301, -189338, -79364, 13508, -118812, 226047, 229367, 112177]
18100A53220a41945B35682d4177A04046h7747o2391C57547b78446J14064E1526
18089B96666a2735B18436E6743H177b82908a35191F1959J09211E3053J34893l7488
18078A50458b70765J27242b3044d084q8207E9915b50469B25103I6508d7096n1899
18067i8995B51832B3385J01445a00518l4779A80861b95866h4110p9982A42038
18056c2385A12421a14100A65578a4214o4453j05674k3080m1583j10575B58012
18045D0206a29668k40976d5619m9235A56269k6698P6145b55736c0707A95770a51902
18033I6893D3957b07377b432n1249b4780N202j69656B62064f1069j80440n7529
18022b99038a3334k18939G8010R1455j7562M5803a86872A35116l0731g955H8005
$$ y = [153220, -141945, 235682, -44177, 104046, -87747, -150138, 357547, -278446, -164382, 51526, 296666, -12735, 218436, 56743, 8177, -282908, -135191, 61959, 171170, 53053, 187946, 150458, -270765, -143523, -23044, -4084, -92291, 59915, -250469, 225103, 96508, -47096, -98995, 251832, 23385, 124830, -100518, -135297, 180861, -295866, -84110, -164092, 142038, -32385, 112421, -114100, 165578, -14214, -78667, -184341, -207421, -249004, -359579, 258012, 40206, -129668, -370644, -45619, -94854, 156269, 129571, 205716, -255736, -30707, 195770, -151902, 96893, 43957, -207377, -2432, -53681, -24780, -19578, -189234, 262064, -61069, -241509, -299038, -13334, -232273, 78010, 169465, 151903, 197706, -186872, 135116, 104385, -7955, 88005]
18010b41095A14810J73823a86552g2704j79911A82058a31381N2161k0417A56474
17999H2125b72331b726k1621A19312m8118J54228a62257k08575R2641I4476e18369
17987B8055e0765H5045a51388A81248E0047Q601k490Q1322a54503D32761c9369
17975a30267N4325Q093j07844d3483l867A9394i3617l2191A88115d2042l09551
17964c51593G2391c3521j48626B68831a57339i848m95973D568a04170B46767a42133
17952E8771c76869f4889D292J35583b46989h2204A05543J83718A2277J31363P2067
17941B15707g27j83199N5035o2596C9603d9041A1707K31254a75256A01184A2843
17929a23957A98569a09938d4980q4133q7821C80832j38464G4378Q9280R5312p7301
$$ y = [-241095, 114810, 288633, -186552, -72704, -252615, 182058, -131381, -79220, -99637, 156474, 82125, -272331, -2726, -24347, 119312, 71194, 225422, -162257, -370832, -278191, 94476, -518369, 28055, -50765, 85045, -151388, 181248, 50047, 58648, 56158, 137480, -154503, 432761, -39369, -130267, -75942, -67849, -175693, -43483, -47350, 19394, -93617, -125808, 188115, -42042, -351593, 72391, -33521, -182147, 268831, -157339, -9848, -505821, 4568, -104170, 246767, -142133, 58771, -376869, -64889, 4292, 139875, -246989, -82204, 105543, 289261, 12277, 143640, 215707, -727, -183926, -128891, -191487, 39603, -49041, 11707, 242961, -175256, 101184, 12843, -123957, 198569, -109938, -44980, -129113, -216934, 380832, 242368, 74378, 163658, 258970, 181669]
17918A81669h0293b1089o6310A62386a48856o2867j7907K4590d3262A42609d0890
17906A80474f7565C8223J72061b2005I4803C6650a50794A12306k6349l6471N0292
17895I9778c10419J21566I8706a15812e1099j58519O7841G5273a67439A43908
17884f3592A81281J5604D9908a01484a8492B9361a96624G7956e5020A12144m0386
17873G1758L3913a26381I5061M377l7929c0779o007j51297i690l42582J75730
17862a76542H4393K50255C1682g7260B06643K9326i454I56R6047a99952q9746
17851b89698D84204j88937C5463J95412E6306K15033C1292a06705L7964j18463
17841a87204B2537g2494k05454c1267D6275B0951Q0954J0946b1759A31083b39967
$$ y = [181669, -80293, -21089, -87399, 162386, -148856, -211723, -229630, -205040, -43262, 142609, -40890, 180474, -67565, 38223, 210284, -22005, 94803, 36650, -150794, 112306, 85957, 49486, 99778, -310419, -188853, 98706, -115812, -51099, -209618, -141777, 75273, -167439, 143908, -63592, 181281, 196885, 49908, -101484, -18492, 29361, -196624, 77956, -55020, 112144, 71758, 105671, -126381, 95061, 99438, 61509, -30779, -36786, -188083, -9690, -352272, -176542, 84393, 334648, 31682, -77260, 206643, 235969, -9454, 956, 97003, -199952, -289698, 484204, 295267, 35463, 230875, 56306, 271339, 31292, -106705, -68741, -187204, 22537, -72494, -277948, -31267, 46275, 20951, 101905, 112851, -21759, 131083, -239967]
17829E44J89379j527g8059F189b26934f2706K3039A16764c5609i64A02510a54025
17816a6120A46427a32753m3283j54506L9643a9944k07650A34355j021b79448J37273
17805a42175k62122B82087a20293d5562j64900I7643d02440h8787H310J3791a3876
17793i5375b0361j01530d497E1562b60222G3979b40788B09504b34011J12221D7173
17781C94772d02021a03291C80158j71515a12198K6833A63638k6170a68809A07673
17770a71706Q5754B1861c4258j43536k5021l9705B87273a42620M0002l9791F7198
17758C02088a01933A39205g947j15144A85953d8085b707A95167a36115G9546Q0775
17747A60321C6147c0237A38232a39315f3922A73014E3434f6530Q564j606o3106
$$ y = [544, 189923, 188396, -78059, 6189, -226934, -62706, -39667, 116764, -35609, -964, 102510, -154025, -16120, 146427, -132753, -176036, -330542, -290899, -19944, -227594, 134355, 133334, -279448, -142175, -404297, 282087, -120293, -45562, -210462, 97643, -402440, -88787, 8310, 22101, -13876, -95375, -20361, -121891, -4497, 51562, -260222, 73979, -240788, 209504, -234011, -121790, 47173, 394772, -402021, -103291, 380158, 208643, -112198, -85365, 163638, 137468, -168809, 107673, -171706, -85952, 21861, -34258, -177794, -202815, -242520, 287273, -142620, -102618, -142409, 67198, 302088, -101933, 139205, -7947, -123091, 185953, -48085, -2707, 195167, -136115, 79546, 160321, 36147, -30237, 138232, -139315, -63922, 173014, 53434, -66530, -57966, -59572, -122678]
17736a22678K3715E0820O4541D4434a05520m0080b5211A14469a74904o3119C18938
17724B15809e751B56110j17149c4121j48898e4759E021O0978L00080h9693b7403
17712A11561M318g9683E1661a62230I1833g9520j92B63604q2780R0813F6427j0928
17700E5499b30121A95671a28183G1566e7592C7970D817J27255g2428A95965P0801
17689B66766g1232o5268C3180F579a59223e9416b7408j58732A33381O0552D2668
17677a4335A4990L50325j53447c8695p0473j1696A59587a35569A517J85169G8913
17665h8340j24953A4720a69416D53884A57520N6234A05505c44703l9617a8083
17654a7537m3756m7789D66165c4866K475j12767e0889j44416B16586K3225g4891
$$ y = [-122678, -98963, 50820, 115361, 44434, -105520, -145600, -25211, 114469, -174904, -238023, 318938, 215809, -5751, 256110, 138961, -34121, -183019, -54759, 5021, 65999, 366079, -89693, -27403, 111561, 115879, -79683, 51661, -162230, 91833, -79520, -79712, 263604, 180824, 271637, 66427, 55499, -230121, 195671, -128183, 71566, -57592, 37970, 4817, 132072, -72428, 195965, 266766, -71232, -136500, 33180, 6579, -159223, -59416, -27408, -186140, 133381, 193933, 42668, -14335, 14990, 365315, 211868, -38695, -109168, -120864, 159587, -135569, 1517, 186686, 78913, -88340, -213293, 14720, -169416, 453884, 157520, 213754, 105505, -344703, -384320, -18083, -17537, -61293, -109082, 466165, -34866, -32391, -145158, -50889, -195305, 216586, 239811, -74891]
17642B73407e8762D091M5876K64200B2810J25430a02227d3825m42011B00128b2247
17630a39473G931a36902j53650A16764h3154A78054b1874j10713A7364c6618j05975
17619a42593G1330i1442j73850H778f4461B90504c82077C7472L3324c04726a15487
17607H5780a2456A22367k1135Q03h2496k2362A46622a01602G2827a18785A06058
17595F452g2628A58842B7204J82660b14559B38759n7301P1648I5449c880B07238
17583g210A81197E1423a7806p4577J5863B39846c8916o6885K1909G3482a2782
17571e1989k16444E8682B2350g2323B72492f6969B50649H2881K17078a54015H1811
17559A19195d0034A82778i36A67165d0321A01625l1891a5602B35023A4918g6261
$$ y = [273407, -58762, 4091, 49967, 314167, 22810, 148240, -102227, -43825, -485836, 200128, -22247, -139473, 7931, -136902, -290552, 116764, -83154, 178054, -21874, -132587, 17364, -36618, -142593, 71330, -91442, -265292, 8778, -64461, 290504, -382077, 37472, 70796, -304726, -115487, 85780, -12456, 122367, 101232, 102035, -82496, -104858, 146622, -101602, 72827, -118785, 106058, 6452, -72628, 158842, 27204, 209864, -214559, 238759, 181458, 253106, 95449, -3880, 207238, -7210, 181197, 51423, -17806, -92383, -76520, 239846, -38916, -105801, -83892, 73482, -12782, -51989, -268433, 58682, 22350, -72323, 272492, -66969, 250649, 82881, 299959, -154015, 81811, 119195, -40034, 182778, -936, 167165, -40321, 101625, 69734, -15602, 235023, 14918, -76261]
17547A10619Q8220a04527b0641j53305A17988k2588a5527D42958F9123a21733
17536A71498i698b418r3576n222A44136J2144J2090c3285q7290m612D0980K311
17524D3291b79159D8676e6888D3218g9619l2760D23105A34221o5044a16846A20362
17512E7575b87806C46634C5177Q00Q1331M7170b88604A53095B706K59559g1292
17500B20372q8295K06455K0214B5752b3350A94334m2414h8399k029B66700G5183
17488A18679J31813F4710k7375b63854h8749A85955r1080c1443I6573b88426a21141
17476I4432R8315b8772m695q8681C7547h4382B48583B413b57861H036N4715N2336
17464A15087c6862A53187e5387H875M5180J42858I3106J44971l7721m8102K16605
$$ y = [110619, 198839, -104527, -20641, -173946, 117988, 95400, -15527, 442958, 69123, -121733, 171498, -9698, -2418, -95994, -101216, 144136, 156280, 168370, -33285, -120575, -125187, 40980, 43291, -279159, 48676, -56888, 43218, -79619, -112379, 423105, 134221, 69177, -116846, 120362, 57575, -287806, 346634, 35177, 35977, 117308, 164478, -288604, 153095, 2706, 262265, -71292, 220372, 132077, 338532, 358746, 25752, -23350, 194334, 151920, -88399, -90428, 266700, 75183, 118679, 250492, 64710, 37335, -263854, -88749, 185955, 94875, -31443, 96573, -288426, -121141, 94432, 192747, -28772, -33467, -122148, 37547, -84382, 248583, 2413, -257861, 8036, 62751, 115087, -36862, 153187, -55387, 8875, 54055, 196913, 93106, 238077, 200356, 152254, 368859]
17453C68859D7200J97821K50011R7646F3211O61853l12223j9790j46863G240L99760
17442D07000I5528R5350e1679B62435J05135p1764H5659J13580L32026k54458
17432B76807O5897M8499m3986G4618J21358j0716K46975j60635A23828J84878
17422C08706p6092K4101k9860k6845K49300A07173K26969A32702M22488B57379
17411C85223j87259R4528l016o9872a56263B78091A05517b37584j77889H963c4132
17399D4194h5156C22746A34929L4936a67612G8829K96869h111A04149L41696j68516
17388B77329F6395a09951B78433m9331B2753O0464K93983H3557g5279A11878b78692
17376C61773r9187c560A03975J49120c1071A01526J51784k8467J2091H4411J00886
$$ y = [368859, 47200, 245021, 495032, 592678, 63211, 725064, 412841, 393051, 246188, 7240, 407000, 95528, 190878, -51679, 262435, 367570, 295806, 85659, 199239, 531265, 276807, 342704, 391203, 347217, 74618, 195976, 185260, 432235, 271600, 123828, 308706, 232614, 256715, 226855, 200010, 449310, 107173, 334142, 132702, 555190, 257379, 385223, 197964, 292492, 289476, 219604, -156263, 278091, 105517, -237584, -415473, 8963, -34132, 44194, -85156, 322746, 134929, 169865, -167612, 78829, 375698, -8111, 104149, 445845, 277329, 66395, -109951, 278433, 229102, 22753, 83217, 377200, 83557, -75279, 111878, -278692, 361773, 262586, -3560, 103975, 253095, -31071, 101526, 253310, 224843, 236934, 84411, 185297]
17365A85297q8363L07092j66857n8314b369B70083I4420e2690c106D54755g5589
17353F7657L9034b0098G8240d6044C77773j60487p633p4163m5279g8715c2893
17341C3383O276J81881a28281o3400a6798m7043A66270b17726H4547a07317H9259
17329A12664L0664c9810o020A82354h071A70955f7466Q617C88359I2798g3904
17317c2164C43592H8423d2584A51576b6164B97175I4254L10794A25938n1803J62018
17306B36153N1296r3916C4296L28487f8533E8820R9628n8722K08235j03555k6122
17295A78284h5054B16492K79998b86320C19843c5796A01691a0264A17712M7624
17285A65336N365g1849B53948a66739D6387L34919j82128E0340a00507E6894f1600
$$ y = [185297, 96934, 404026, 237169, 178855, -2369, 270083, 94420, -52690, -3106, 454755, -75589, 67657, 106691, -20098, 78240, -46044, 377773, 217286, 209653, 135490, 90211, -78715, -32893, 33383, 39659, 221540, -128281, -191681, -16798, -63841, 166270, -217726, 84547, -107317, 89259, 112664, 143328, -39810, -45830, 182354, -8071, 170955, -67466, -58849, 388359, 92798, -73904, -32164, 343592, 88423, -42584, 151576, -26164, 297175, 94254, 405048, 125938, 74135, 236153, 287449, 193533, 34296, 362783, -68533, 58820, 158448, 99726, 307961, 204406, 178284, -85054, 216492, 496490, -286320, 319843, -35796, 101691, -10264, 117712, 165336, 170701, -71849, 253948, -166739, 46387, 381306, 199178, 50340, -100507, 56894, -61600]
17273c3387B2294J54497b58840B85234a7774C69706j37253J24030A63931J39432
17263C03363p1252J7899q1177e974D5408K65316G045K76640A02529J53564j20896
17252A35197J21271L462A4765J88963C042M8325B1287J47821o4158g0497B15971
17240C95793I8453K03675L5609j33060r1247m0125K65948j45072f8923H6611P799
17229I4410J69652N3084E6535M26877B05681J10948N5047B0418L2283a03866l869
17218a07735A29936L1269A4801J55504B7371L8435J20276f8481B4883M89145c2187
17206C3445J55903R6191A4321i6789D06524j4759J20460f13o434B22199j05409
17195A16790K8874n9380M18480e8731A89852K37125o6939A37950J97600r8491
$$ y = [-33387, 22294, 176791, -258840, 285234, -17774, 369706, 232453, 356483, 163931, 303363, 232111, 250010, 168833, -5974, 45408, 310724, 7045, 283685, 102529, 256093, 135197, 256468, 259930, 14765, 203728, 3042, 51367, 21287, 169108, 104950, -70497, 215971, 395793, 98453, 302128, 337737, 204677, 113430, 73305, 339253, 194181, -68923, 86611, 94410, 264062, 317146, 56535, 483412, 205681, 316629, 371676, 20418, 52701, -103866, -107735, 129936, 161205, 14801, 170305, 27371, 65806, 186082, -68481, 24883, 514028, -32187, 33445, 189348, 285539, 14321, -96789, 406524, 391765, 512225, -613, -7047, 222199, 116790, 145664, 86284, 504764, -58731, 189852, 426977, 360038, 137950, 335550, 237059]
17185B37059F1939N21668j86327j06009H2498M79549k21515L3264o4152d2555
17174F2436L66260A88860m723M6841F8927K0167L01362q5799n1712j05702R0192
17163B37435Q8791q9578L45245A40833k9863J01513K26108B12568n348P3513H3094
17151c9831r135G6514L66903j29438l5358L98806B38232J26565E9648a1248B60572
17139E29956k50520Q1740A75890K82993j74045a13403A33972K4697J40746L6221
17129C35636K98804A78955J6398J3003J08230o9039R7718R978F3935M07623i919
17117A55238m6567K89762R5826P0339A41033k3141L50358A51637D4087O5561J49148
17106B58796R7377j03653H4053a06021B94256J96201r1138p6870J2731J1060A28159
$$ y = [237059, 61939, 583607, 397280, 291271, 82498, 562047, 340532, 373796, 309644, -42555, 62436, 428696, 188860, 184137, 230978, 68927, 89094, 390456, 304657, 252945, 147243, 237435, 326226, 236648, 581893, 140833, 110970, 212483, 438591, 212568, 207220, 280733, 83094, -39831, -48966, 76514, 443417, 313979, 278621, 677427, 238232, 364797, 59648, -11248, 260572, 529956, 279436, 361176, 175890, 458883, 284838, -113403, 133972, 158669, 299415, 335636, 634440, 178955, 195353, 208356, 316586, 247547, 345265, 355243, 63935, 471558, -9919, 155238, 108671, 398433, 494259, 564598, 141033, 117892, 468250, 151637, 44087, 109648, 258796, 356173, 252520, 84053, -106021, 294256, 490457, 399319, 322449, 335180, 346240, 128159]
17094B99229j1806J68504j57428F8764L19960K4619j5180J7131n1397r1399o8770
17083B03728r818J70292j36443L49453j59418B00843L21365A57802J88698J12861
17073D59361R1039j21198j26848M18468B07704M00073J80338C09042q9648L74990
17063E94384j06134J24159B97385L8332J14225p1995K13318B08088K34332j33892
17053C08528j37475J96209K44747k67584M0567P0327j74190K18030J22033B02264
17042D89375j52817J28334k7583J00274P4763B23257L42575m2179O1147l3953
17032E50847L016j76320J98025l8709J93293p4647k1814p0867L4155r1803k04390
17021C00786K88061j82421K61547k82018R1058K16310L4989j88169J24026B24907
$$ y = [299229, 287423, 455927, 298499, 68764, 388724, 413343, 398163, 415294, 363897, 272498, 203728, 193910, 364202, 227759, 577212, 417794, 200843, 522208, 157802, 346500, 459361, 550400, 429202, 302354, 720822, 207704, 607777, 788115, 309042, 219394, 594384, 488250, 612409, 297385, 335717, 449942, 377947, 591265, 208088, 442420, 308528, 171053, 367262, 612009, 344425, 384992, 455319, 281129, 499159, 621192, 202264, 489375, 336558, 464892, 437309, 537583, 612346, 223257, 565832, 523653, 584800, 550847, 553863, 377543, 575568, 536859, 730152, 655505, 633691, 562824, 596979, 505176, 300786, 588847, 406426, 667973, 385955, 477013, 693323, 728312, 540143, 664169, 224907]
17010F25408O1181j00642Q3160J16109K78802k17395k1844l4849j408p4739J66651
16999H80434l84598K31688n5130k4503j25654J52118J75352k31120K25406C75401
16988F92561N0525j5656l915k78986J99459L44362o9850j00593O3767n8012k89631
16977E34031K26824j3521L9095k34525K66450o5957M0709N0208m5953k35905K64699
16966H26155R3971M273l18336J78270Q7947K59702J4190m18706J94465J99141
16956A121072Q8790m48641j07943K31895j75327J73710J7531P8464N8423m9566
16946I88408k13994K30293N8338k59534J64458k18742M40392p1529m34954K38041
16936I21177j37931M89752n48206N07755j49560j2873K0777j60146M60418l56685
$$ y = [625408, 686589, 585947, 669107, 785216, 1064018, 846623, 824779, 789930, 788522, 713783, 880434, 495836, 727524, 672394, 647891, 522237, 674355, 849707, 618587, 843993, 375401, 692561, 743086, 727430, 723515, 444529, 643988, 988350, 918500, 817907, 881674, 823662, 534031, 760855, 747334, 786429, 551904, 818354, 752397, 793106, 843314, 797361, 561456, 826155, 920126, 924399, 606063, 784333, 872280, 1131982, 1146172, 727466, 921931, 1121072, 1209862, 761221, 653278, 885173, 709846, 883556, 901087, 979551, 1037974, 988408, 774414, 1004707, 1063045, 803511, 967969, 749227, 1189619, 1118090, 683136, 921177, 783246, 1272998, 724792, 1232547, 1082987, 1070114, 1090891, 930745, 1391163, 1034478]
16926A034478p3285L54910L38880m14362O2267j7887l6305k84593K63428K76150
16916A503681L3371k51196M10912n82908r1585M43836N1893o3024K13472j98473
16906A469979K25609j76222J694L1327k6882L8790m521O4311m9604J18396j320
16895A691557J0862k61715M06518m8743j42948m2747J93081J01998J81545q7570
16885B001838n222m829Q627L11921m38654K44487j16812P2768r7820K73380J65455
16874B415139k03024j3668J45876j70630Q7960R291K80834j01254k80580L45291
16864B515235j55467J14849J97862k7665r3885K22662o625k17898K43687l25295
16854B467460K04158J80696R2570l89557M00508Q0551l16380M69730O9962q3993
$$ y = [1034478, 961193, 1316103, 1654983, 1240621, 1302888, 1285001, 1248696, 964103, 1227531, 1503681, 1537052, 1285856, 1696768, 1113860, 1022275, 1466111, 1518004, 1454980, 1668452, 1469979, 1695588, 1519366, 1521060, 1552387, 1525505, 1564295, 1559774, 1624085, 1574481, 1692877, 1691557, 1702419, 1440704, 1847222, 1798479, 1655531, 1612784, 1805865, 1907863, 2089408, 2001838, 1996616, 1991787, 2000414, 2312335, 1873681, 2118168, 2001356, 2074124, 1976304, 2249684, 2415139, 2212115, 2198447, 2344323, 2173693, 2261653, 2270944, 2551778, 2450524, 2169944, 2515235, 2359768, 2474617, 2672479, 2644814, 2550929, 2773591, 2766966, 2549068, 2792755, 2467460, 2671618, 2852314, 2944884, 2555327, 2955835, 3036386, 2720006, 3189736, 3259698, 3175705]
16844C175705N56012l35311k69924J65838l01575M52219K81857r5929M61514n88854
16834C501552J32386M21830j56079K99061K4254J63334l25304K14051J55909K4250
16824D455244J71912J84971j05048K0597R9296M50672l80594M76754l22993K57560
16814E308371K28915k24347M58204n4481L01881J5828r7398L51676R5698M07955
16804F792302J76065k88781L04324p9503J85193J88775L68974l6887N19662J546
16794H131670M08696O1937l7334M38579K25361N23157J49200J33500L60231l60869
16784A0034128P06711N14095J08514L60088N72271j49182N44909N71052M56795
16775A3719381K29478Q73623O5859P46161Q74655j8294P46520L72256M71275Q08156
$$ y = [3175705, 3731717, 3396406, 3126482, 3292320, 2990745, 3442964, 3724821, 3628892, 4090406, 3501552, 3633938, 4055768, 3899689, 4198750, 4223004, 4386338, 4061034, 4275085, 4430994, 4455244, 4627156, 4812127, 4707079, 4727676, 4826972, 5277644, 4897050, 5373804, 5050811, 5308371, 5537286, 5312939, 5771143, 5716662, 6018543, 6034371, 5936973, 6288649, 6384347, 6792302, 6968367, 6679586, 6983910, 6904407, 7089600, 7278375, 7647349, 7610462, 8130124, 8131670, 8540366, 8602303, 8564969, 9003548, 9228909, 9752066, 9901266, 10034766, 10394997, 10034128, 10740839, 11254934, 11363448, 11723536, 12295807, 12146625, 12691534, 13262586, 13719381, 13948859, 14822482, 14888341, 15634502, 16509157, 16490863, 17237383, 17609639, 18080914, 18889070]
16765A8889070R40182N46690Q87021O91541P10298J091763P30540J210857J132325
16756B6830287J340356J135899J507964J083343J256995K075360J625454J450654
16748C8306312K024940J995313K296265K396226K332416K538644L330789L155573
16740E8376478L515825L606931L647357M282845M506544M911445N554174N328777
16732I3730376O019450O386828O995966P155135P295762Q236897P944906P955315
16724A51720635Q446336Q218209P825060P229341O597181N370662M441508K778571
16716B02627503J719135r2473j643232l082412m663893n414823o494330p393590
16708A75561885p828928q125715q123859q464292q202008q007949p380485p386695
$$ y = [18889070, 19829252, 20375942, 21262963, 21954504, 22664802, 23756565, 24487105, 25697962, 26830287, 28170643, 29306542, 30814506, 31897849, 33154844, 35230204, 36855658, 38306312, 40331252, 42326565, 44622830, 47019056, 49351472, 51890116, 55220905, 58376478, 61892303, 65499234, 69146591, 73429436, 77935980, 82847425, 88401599, 93730376, 99749826, 106136654, 113132620, 120287755, 127583517, 135820414, 143765320, 151720635, 160166971, 168385180, 176210240, 183439581, 190036762, 195407424, 199848932, 202627503, 204346638, 204254165, 202610933, 199528521, 194864628, 189449805, 182955475, 175561885, 167732957, 159607242, 151483383, 143019091, 134817083, 126809134, 119428649, 112041954]
16700A12041954p108999o431579n904159n890476n386591m666138m996983l886856
16692F7770173l795666l799205l247968l001919l494969k795317k379161k510591
16684D2745377j794710k536979j338846j911079j752841j912879r96201j544018
16676B8957824r92264j677164p62867j459243q87067q48490j001902r28399p65160
16667A9635268p48787p50128l98092n75531r19809m90984k04004r20239n19356
16658A4108338k48658o39272r8127n87421o35165j67283J0133p35586k46961j65311
16648A0594687n24973m14747j21654l40245n5906k48391k11475j76656o96307
16639G804333L21380m63599j19951k33152j80780k05840m2315n32430Q3268J61761
$$ y = [112041954, 104932955, 98501376, 92597217, 86706741, 81320150, 76654012, 71657029, 67770173, 63974507, 60175302, 56927334, 53925415, 50430446, 47635129, 45255968, 42745377, 40950667, 38413688, 37074842, 35163763, 33410922, 31498043, 30501842, 28957824, 27965560, 26288396, 25525529, 24066286, 23179219, 22330729, 21328827, 20400428, 19635268, 18886481, 18136353, 17738261, 17162730, 16242921, 15751937, 15547933, 14627694, 14108338, 13859680, 13220408, 13122281, 12534860, 11899695, 11732412, 11742545, 11006959, 10759998, 10594687, 10069714, 9654967, 9533313, 9193068, 9137162, 8888771, 8677296, 8500640, 7804333, 8125713, 7662114, 7542163, 7309011, 7128231, 6922391, 6880076, 6347646, 6430914, 6592675]
16629F592675k63905m97091j0160J20747m58483J5843l48124J26265q2480o8133
16619E127154j35894m0104n74419K14901j20854n3973k57350J48972p3785m16494
16609C818154J82665k9953K20979l69206j53252l57N146j50172J82173k43010
16599C463167j82273K00420j93457l43036p5805J54286j72565j93344R0898j75204
16589B573087K35317j23881L7311l07622K11776M28816k47288m17880J43663O3289
16579B596588l06563L6609N5217k50724J56717R4218j45547q6435J64066l79135
16569A935011l2927K71242j15833l3659j28055j68935n5821N78678j59607m17473
16559A672621K85296k21433k53942K46090K39313l56470k20295L56821l87851
$$ y = [6592675, 6328770, 5831679, 5821519, 5942266, 5483783, 5499626, 5151502, 5277767, 5195287, 5127154, 4991260, 4951156, 4376737, 4591638, 4470784, 4416811, 4159461, 4308433, 4234648, 3818154, 4000819, 3970866, 4191845, 3822639, 3669387, 3669030, 3674176, 3524004, 3706177, 3463167, 3280894, 3481314, 3287857, 2944821, 2869016, 3023302, 2850737, 2657393, 2748291, 2573087, 2808404, 2684523, 2721834, 2414212, 2625988, 3054804, 2807516, 2389636, 2533299, 2596588, 2290025, 2326634, 2381851, 2131127, 2287844, 2382062, 2236515, 2150080, 2314146, 1935011, 1902084, 2173326, 2057493, 2023834, 1895779, 1726844, 1671023, 2249701, 2090094, 1672621, 1957917, 1736484, 1482542, 1728632, 1967945, 1611475, 1391180, 1748001, 1360150]
16550A360150K03160n0937j61405K30707J0059j81532K73663j94740Q0369q7586
16540A481908O1027j41731j55803j17336K27257l20274K23094k9632j56431J70411
16530A242490J5552j2599j77276N27104o47393J78612R4001k19093K3767J50502
16520A175667K37295k68277j63986K17403J30686k59627r2232L40995k64025J09176
16510A163075J57878r4042P4916n35487K7757L3089J75038n4924K07325l63120
16500G91505j34820M89968m90776K72947J20085j63163K52064l60021L32460l32204
16490G78045J10696L0900J11406l10251J66148j71135N1561k40466K71617j98640
16480E99881M88559m91439K76380j44459o6355j54428K00748j96154J03158P015
$$ y = [1360150, 1563310, 1512373, 1350968, 1581675, 1591734, 1410202, 1683865, 1489125, 1569494, 1481908, 1542935, 1401204, 1245401, 1128065, 1355322, 1035048, 1258142, 1228510, 1072079, 1242490, 1258042, 1245443, 1068167, 1595271, 947878, 1126490, 1220491, 1001398, 1025165, 1175667, 1412962, 1144685, 980699, 1198102, 1328788, 1069161, 976929, 1317924, 1053899, 1163075, 1320953, 1226911, 1301827, 766340, 794097, 827186, 1002224, 947300, 1154625, 791505, 656685, 1146653, 655877, 928824, 1048909, 885746, 1137810, 777789, 1110249, 778045, 888741, 919641, 1031047, 720796, 886944, 715809, 767370, 526904, 798521, 599881, 1088440, 597001, 873381, 728922, 662567, 508139, 708887, 512733, 615891, 622906]
16470F22906K47136j70646j10364K57198r5793M0237j63224R8318C46176M30092
16460G76268n5652j88011N3162k9815A42871K75880J94806k55433j3766M09735
16450G54093j55394L6728J15441M4130p1475j68685j48009J38923k2750J36977
16440F59979k52674l869R4456R8907B48415n1064M88257C25903N13323k43783
16430E95443J79133o0187q3883o086j78308j69544j2902N05827l33554B15527
16419E10494B35665K54561j15519j36716R2043n5890J57210J08968K13828l45391
16409D08759N685L9815k5727O052j4368A15751K88622J39965B59187G0647O17037
16398F87684G0524J09911a07018D35685J00272A16835K18015K74063P7767l29254
$$ y = [622906, 870042, 699396, 589032, 846230, 750437, 790674, 627450, 725768, 346176, 776268, 720616, 532605, 585767, 555952, 142871, 418751, 613557, 358124, 344358, 754093, 598699, 635427, 750868, 794998, 723523, 554838, 406829, 545752, 523002, 659979, 407305, 403436, 497892, 596799, 248415, 197351, 685608, 325903, 839226, 595443, 774576, 714389, 630506, 624420, 446112, 276568, 263666, 769493, 435939, 215527, 510494, 235665, 490226, 374707, 237991, 330034, 274144, 431354, 540322, 754150, 408759, 414444, 454259, 428532, 434584, 420216, 115751, 404373, 544338, 259187, 70647, 687684, 70524, 180435, -107018, 435685, 535957, 116835, 334850, 608913, 686680, 357426]
16388C57426j33216J23058j707j43286F759K99541m0552P4306K44598k62286F8939
16376D11019A38641L96085E1185M59379A92983J61930l1005P7604j26656R7973
16366C72829j02139Q0777o1636a95232C34310l808F4100g0585B09041D8902g971
16354B27062O0307m9776j03949K63033I4498N22680B37141b2373E7731L22443
16344C80174l4856R7920A04184L8726K47239q4199J44201K6206B32381j12802
16334A19579J12962J20050A36534J14214b3653B3030K47755E6662J28774J80121
16324C65557D5009J42314J2217l7511m1205j147E9172K62590a4825k7412A66306
16312E7393O75186A73514J02597p1659D6250c0247B39172A17482J25597p5242
$$ y = [357426, 224210, 347268, 345561, 202275, 6759, 306300, 265748, 340054, 584652, 322366, 68939, 411019, 138641, 534726, 51185, 510564, 192983, 354913, 323908, 401512, 274856, 372829, 270690, 351467, 289831, -195232, 334310, 330502, 64100, -70585, 209041, 48902, -7971, 227062, 287369, 237593, 133644, 396677, 94498, 617178, 237141, -22373, 57731, 380174, 345318, 443238, 104184, 142910, 390149, 305950, 450151, 476357, 232381, 119579, 232541, 352591, 136534, 250748, -23653, 23030, 270785, 56662, 185436, 365557, 45009, 187323, 199540, 162029, 120824, 119677, 59172, 321762, -14825, -42237, 166306, 57393, 732579, 173514, 276111, 204452, 46250, -30247, 239172, 117482, 243079, 167837]
16302A67837N1263a22906C75364A59108o8202J47817m3292n3772F8329J74760
16292B43089O5306K95029A13461l7006a35939A74206b71658A14450R8193Q9343
16282C01986D9561L569J50279E7027J82308a06102A16619E1588l829f2j19406
16271a19468F1719g2967D1933P9374g6505A93592J54219K8034r0728A2884K70210
16260B83094M379J5347A50169J4947K88915a83260b2690A18413h7864B3689B701
16248B556c533D9621e4432A12608d2478I3337a36366A7755g2383j44000R8268
16237a18115B77828a94361f529A46710a08972A4634a28475A06808J74081n1783
16227B29106D9476N6959i5280d0828A6714K30694f5445A0732h6672B28259m8419
$$ y = [167837, 219100, -122906, 375364, 159108, 90906, 238723, 195431, 141659, 68329, 243089, 308395, 603424, 113461, 76455, -135939, 174206, -271658, 114450, 212643, 301986, 49561, 53130, 203409, 57027, 239335, -106102, 116619, 51588, 47759, -62, -119468, 61719, -72967, 41933, 121307, -76505, 193592, 347811, 375845, 285117, 12884, 283094, 287473, 302820, 150169, 165116, 454031, -183260, -22690, 118413, -87864, 23689, 2701, 2556, -3533, 49621, -54432, 112608, -42478, 93337, -136366, 17755, -72383, -216383, -118115, 277828, -194361, -6529, 146710, -108972, 14634, -128475, 106808, 280889, 229106, 49476, 106435, -95280, -40828, 16714, 247408, -65445, 10732, -86672, 228259, 179840]
16216A79840i0000f208G5272b27922C3986K80539D8116b4594A4297K99108L832
16205C17237j38250m270R0837i1673A05160M35784B04458M6855B8730q88R5509
16194A23351L5349K8298o9333h1121A52231D0796K73285j38754a01949H9834b7368
16182h5290B10513b6550a373k57395n9022A453a67504j93327C8295K47759a60593
16170b3730A97112p0201m5643i477A32006E9744O2405N8054a15847I1764J44402
16159B36166j6512f8674B03972d18710H5855k146J05309b17465C0211a16555D1992
16147A9086d11755B50778A02226D5468J98217M6441j2517a18482k67993B886h5144
16135d7815A78608d0507A26841Q3030b11993A20490a97508c40F0420J77294G5170
$$ y = [179840, -90000, -6208, 75272, -227922, 33986, 314525, 48116, -24594, 14297, 313405, 317237, 178987, 174717, 265554, -91673, 105160, 540944, 204458, 251313, 28730, 27842, 123351, 158700, 186998, 117665, -81121, 152231, 40796, 314081, 175327, -101949, 89834, -27368, -85290, 210513, -26550, -1373, -258768, -317790, 1453, -167504, -360831, 38295, 286054, -160593, -23730, 197112, 126911, 81268, -9477, 132006, 59744, 122149, 180203, -115847, 91764, 236166, 219654, -68674, 203972, -418710, 85855, 83709, 189018, -217465, 30211, -116555, 41992, 19086, -411755, 250778, 102226, 45468, 243685, 290126, 277609, -118482, -386475, 2886, -85144, -47815, 178608, -40507, 126841, 209871, -211993, 120490, -197508, -340, 60420, 237714, 75170]
16123I0243b9834A88990i2107A66555j4539g02k9790C17652e8021E7225i7534
16111C3423J3846a55507e194j83613B65340A5768a85058c4395D5273c377D08248
16099B49424A18249O2129o2501a44116B05503A9247b55944H6873a10558d2864
16088B81712d0325r0559H7275N2216a1877C32527b39212L3429A44704E6415a81777
16076A22415a01375B7102a82543B10540h8501q3404P9367B03653I6317b30667
16065a86096A90667E0145c9871m4110A58649o5755N428K8162a75137D8292e1094
16053a82329D9229b0997j29240A98757o3104K7012b49542J10250A9498c3324C51445
16041F4409a68458a4630m54193A42449c19048J53174E0283J86553a20066j53507
$$ y = [90243, -29834, 188990, -92107, 166555, 152016, -702, -30492, 317652, -58021, 57225, -97534, 33423, 47269, -155507, -5194, -188807, 265340, 15768, -185058, -34395, 45273, -3377, 408248, 249424, 118249, 180378, 117877, -144116, 205503, 19247, -255944, 86873, -110558, -42864, 281712, -40325, -130884, 87275, 139491, -11877, 332527, -239212, -205783, 144704, 56415, -181777, 122415, -101375, 27102, -182543, 210540, -88501, -171905, -92538, 203653, 96317, -230667, -186096, 190667, 50145, -39871, -83981, 158649, 92894, 98322, 126484, -175137, 48292, -51094, -182329, 49229, -20997, -150237, 198757, 135653, 162665, -249542, -139292, 19498, -33324, 351445, 64409, -168458, -14630, -468823, 142449, -319048, -165874, 50283, 236836, -120066, -273573]
16031b73573D1926A8467a80659C1487J8360e6880p2873b2096n0908m0235K3205
16020i0034k9711a4556A66176a10351k0112B79627F9376d2284p0139d7565A8320
16008G5136R3718a29904A40347O8049J31778E3494L05597B9989d2160G9085h7913
15996a99196D0513g9497j93343F2460J2088h4658j21950A1111e2994A0092J39743
15985A49835Q3967a0644l5394H1851K13763a28357C72194G1127a25270j6413O1408
15974h0275A90735H0786c2991a0858k34281A17151J3847a39818B87147g5703a9277
15962B02083a39037k44682G7253R6534c23869j12774c5635R59A39819a06400C7487
15950a16553C1881a0346j33772j95806c5307G2790b61073c93k186k10984n1208
$$ y = [-273573, 41926, 18467, -180659, 31487, 49847, -56880, -129753, -22096, -73004, -113239, -90034, -119745, -14556, 166176, -110351, -130463, 279627, 69376, -42284, -112423, -47565, 18320, 75136, 168854, -129904, 140347, 208396, 340174, 53494, 359091, 29989, -42160, 79085, -87913, -199196, 40513, -79497, -272840, 62460, 74548, -84658, -206608, 11111, -52994, 10092, 149835, 233802, -10644, -46038, 81851, 295614, -128357, 372194, 71127, -125270, -141683, -80275, 190735, 80786, -32991, -10858, -245139, 117151, 130998, -139818, 287147, -75703, -19277, 202083, -139037, -383719, 77253, 173787, -323869, -436643, -35635, -34676, 139819, -106400, 37487, -116553, 31881, -10346, -144118, -339924, -35307, 72790, -261073, -393, -2579, -213563, -264771]
15939b64771n8418f6072k0735A95507c60444a43073k68290i900j44787H7400g4729
15927A73670a35463A42471b34461a4191H0696b1694j4375q9464L0911a0443o5169
15916g5612k73665J71602j5810j63194a60779A93190a05209k1604a3811j18184
15906a31995I7451h3851k11855Q6610D705P0085j9181k0806J39578D259R7553
15895A01812k3076i464j2583m539B89006D3294a72949B27336e9663H1202l7981
15884D3221a89191C5255a03484j081A38140g7125k6620j35202N7598d2073b554
15872c55520a02030j827h365l24628I1684K1180c5216k13795A44403P4514r0149
15861A28768a80386C7691j4831a43211L6759j70393g5085j2781l3479c1463k7269
$$ y = [-264771, -323189, -66072, -86807, 195507, -360444, -143073, -411363, -9900, -154687, 87400, -74729, 173670, -135463, 142471, -234461, -14191, 80696, -21694, -36069, -125533, -94622, -10443, -75612, -349277, -177675, -193485, -356679, -160779, 193190, -105209, -126813, -13811, -131995, 97451, -83851, -295706, -209096, 4705, 74790, 55609, 34803, 174381, 4259, 101812, 78736, -9464, -22047, -26586, 289006, 43294, -172949, 227336, -59663, 81202, 43221, -189191, 35255, -103484, -104565, 138140, -77125, -103745, -238947, -181349, -42073, -2554, -355520, -102030, -103857, -8365, -332993, 91684, 112864, -35216, -249011, 144403, 218917, 128768, -180386, 37691, 22860, -143211, -106452, -276845, -75085, -87866, -121345, -31463, -58732]
15850e8732E248b50818C54939A12058b29385A27153E8636J5153J4980b42839C0828
15838e2533j30498A05597J93803A27590b29424B23990d1716o8664d0689B58952
15827c8408H4850a58851m4137A07098c13232A62946b56082j2336f1860a3455l5786
15816d9241j18202G8837b27613a3242D4861g5240j72553H443a15178k2550C85964
15804G4991i6739N197q606A84752I0473f2809b8570A1586a63687B7877o107Q4347
15792A06117c53995B2445e4603G3108J64532g9671j63389e4110j47504a00034
15781A79178L5354a28236e2315k41436C5167h8030k28756a12462j92656j3602
15771c18720J2317f9349j13886a9961p8290A1578b38405b9834p4955C41248a40123
$$ y = [-58732, 5248, -250818, 354939, 112058, -229385, 127153, 58636, 73789, 88769, -242839, 30828, -52533, -183031, 105597, 299400, 127590, -229424, 223990, -41716, -110380, -40689, 258952, -38408, 84850, -158851, -202988, 107098, -313232, 162946, -256082, -268418, -61860, -13455, -49241, -167443, 78837, -227613, -13242, 44861, -75240, -247793, 8443, -115178, -137728, 385964, 74991, -96739, -91542, -100148, 184752, 90473, -62809, -28570, 11586, -163687, 27877, 21770, 106117, -353995, 22445, -54603, 73108, 237640, -79671, -243060, -54110, -201614, -100034, 179178, 214532, -128236, -52315, -293751, 35167, -88030, -316786, -112462, -305118, -318720, -306403, -69349, -183235, -19961, -98251, 11578, -238405, -29834, -104789, 341248, -140123]
15759E995K80285b84792a40069A86604e9932j57700A23920O5334H9708a05844
15748B2693J89381g5508B48436b75648C22844b07628o5130B91956A09383b38854
15737d1092a5798k19552A95692b61579M2319A89869D1099c1160k42412b3217A7890
15725B90467G6153K59022B5784R6701b4733l5738I421i2394A35596b23315k41601
15714d64916a50491g237E25808a82695J7524b7207p7189A23180K52184b86442
15703B55466b77999o0892N7071m5367R7301b5211H1200k5701a36018A09903Q3816
15692A93719k2416d5295A06476g4940p5491M8609A78100M4544A8358a67232B6827
15680b92006B5494a55720O1307G3432b70760g2917I781B282g5703I9071K75694
$$ y = [5995, 286280, -284792, -140069, 186604, -59932, -217632, 123920, 189254, 89708, -105844, 22693, 212074, -75508, 248436, -275648, 322844, -207628, -272758, 291956, 109383, -238854, -41092, -15798, -235350, 195692, -261579, -219260, 189869, 41099, -31160, -273572, -23217, 17890, 290467, 76153, 335175, 25784, 122485, -24733, -60471, 9421, -92394, 135596, -223315, -464916, -150491, -7237, 525808, -182695, -165171, -27207, -104396, 123180, 375364, -286442, 255466, -277999, -338891, -281820, -327187, -229886, -25211, 81200, 55499, -136018, 109903, 193719, 171303, -45295, 106476, -74940, -150431, -101822, 178100, 222644, 18358, -167232, 26827, -292006, 25494, -155720, -94413, 73432, -270760, -72917, 9781, 2282, -75703, 99071, 374765]
15669C74765b29951J10069A20562o0022A4247g4841j19889C09048E6128j6228
15659C9900b82261O8137h4004j45367h7141E2914g7983K3051G9792a56762j46618
15648c03380R9161g7443A57384b66350D3682a93690c8595E8175K94916a04299
15637b01571k34755B07084q9990Q2494J01380I3150g2491B02601f3281m7910D2244
15625a05587j46430Q4588A82153c2942q8922q2861A59462n9681a8376q3292j01679
15614b03347j42028B32945b42158h1492j33733A26719M1526a51783k29054A25368
15603b70422A12569L7824n2725b26820h9339A97322h5062A02958h942A05621a44315
15591B14795A6777g5926m8978N0417C6340J62554b5573m0076j18006C512c08894
$$ y = [374765, -229951, -119882, 120562, 60540, 14247, -74841, -194730, 309048, 56128, 39900, -282261, -214124, -84004, -229371, -87141, 52914, -77983, -54932, 79792, -156762, -303380, -204219, -77443, 157384, -266350, 43682, -193690, -38595, 58175, 353091, -104299, -201571, -436326, 207084, 117094, 199588, 300968, 93150, -72491, 202601, -63281, -111191, 42244, -105587, -252017, -167429, 182153, -32942, -121864, -204725, 159462, 99781, -18376, -101668, -203347, -345375, 232945, -242158, -81492, -215225, 126719, 168245, -151783, -380837, 125368, -270422, 112569, 150393, 97668, -226820, -89339, 197322, -85062, 102958, -8942, 105621, -144315, 214795, 16777, -75926, -124904, -74487, 36340, 198894, -25573, -65649, -183655, 3512, -308894]
15579G6717b65770G8197K8393i2712C2825g0129A4698J1746a55602j86540B25688
15567a00167A16680j2753J23825b35702D4535d1472B23896m5244G6780a19305
15556d6163D9151j7631c69300a68612A36484B0719a71331A08607b99258A05367
15545c47577A72759b54369K1303N0885b9816j95272r6731A32175A108O0609O5374
15534A27091E7780a39965B55255I1755a90704j47676P2111L456A17142c3108G8801
15522h4037A15366e6696A11403P0735J6n0518a68099B9063d8358B07326b1448
15510a43827j6167F4285N6305D6731A9302a18436D0959h2380D0575a82787F2296
15498B28433b89949A28372C4265a8558n6984K7383l39145D6326r412h2733G1588
$$ y = [76717, -265770, 78197, 106590, -92712, 32825, -70129, 14698, 26444, -155602, -342142, 225688, -100167, 116680, 103927, 227752, -235702, 44535, -41472, 223896, 178652, 76780, -119305, -46163, 49151, 31520, -369300, -168612, 136484, 20719, -171331, 108607, -299258, 105367, -347577, 172759, -254369, -233066, -182181, -29816, -225088, -321819, 132175, 1108, 61717, 127091, 57780, -139965, 255255, 91755, -190704, -338380, -266269, -262813, 117142, -33108, 78801, -84037, 115366, -56696, 111403, 182138, 182154, 131636, -168099, 29063, -48358, 207326, -21448, -143827, -159994, 64285, 120590, 46731, 19302, -118436, 40959, -82380, 40575, -182787, 62296, 228433, -289949, 128372, 34265, -18558, -75542, -48159, -387304, 46326, 36914, -82733, 71588]
15486a39807G0241J43659d0685A32473b8481j2953C5315J83165G8471M6629K2683
15475A47783b9063B4194b13390R1872F7754P8808g0164j42388B1177Q0609d19740
15463E4664c469p3613j46523P9721N8489G1737a03896B55621h4754l120r0859
15452a78733N1040E1817J16084A6247c30643a51233P2773D0273K38005a37662
15441a76182l4501c718A5432b25334E552i4364M3855k02290k23075e4806I8246
15429F2384N4968L0240b00913N4499d3883E1650a14820a3137G5517L2650j6186
15418I1981j2488a60622f3684B6594f4520A59575F3579J40390G4043M6384J01954
15407B22381f0804n8122A94094e8320b1236n7888I784a85728j42221k1775E6583
$$ y = [-139807, 70241, 213900, -40685, 132473, -28481, -41434, 35315, 218480, 78471, 125100, 147783, -29063, 24194, -213390, -121518, 67754, 146562, -70164, -212552, 21177, 101786, -419740, 54664, -3469, -77082, -223605, -143884, -85395, 71737, -103896, 255621, -84754, -87874, -178733, -127693, 51817, 167901, 16247, -330643, -151233, -78460, 40273, 278278, -137662, -176182, -210683, -3718, 15432, -225334, 5552, -94364, -50509, -252799, -475874, -54806, 98246, 62384, 117352, 147592, -200913, -146414, -43883, 51650, -114820, -13137, 75517, 108167, 91981, 79493, -160622, -63684, 26594, -64520, 159575, 63579, 203969, 74043, 120427, 222381, -60804, -118926, 194094, -58320, -21236, -79124, 9784, -185728, -327949, -349724, 56583]
15395b23120F4578J2574K0093e0031J5535J5726j04352a4742B14842b4221m0722
15384f4943B82412m4685m5257b0116k73983h416j53163H454a11079A46426a00774
15372H7526a03466F75M4598N0399a55265A93266o9849b01026r5434B19283d3852
15360C067b95097A2838P3971a04228C7465d3117m7219n1410K0389A87781h4071
15348A30041M0827P0980j08978a67765I740a80501B93540n2233D2580P2157O7970
15337A82707a18214k30121C0322L08331A54880a73365j42800A23213e5971D9048
15326A6082K0190J08191b137A03455g2671A78868B1354b15030H9694g4565A7782
15314a75487f1773m3131c6039A00143a19527l0303e5066B27276G2592J09405E919
$$ y = [-223120, 64578, 77152, 97245, -50031, -34496, -18770, -123122, -14742, 214842, -24221, -64943, 282412, 237727, 192470, -20116, -294099, -8416, -161579, 8454, -111079, 146426, -100774, 87526, -103466, 675, 45273, 95672, -155265, 193266, 123417, -201026, -296460, 219283, -43852, 3067, -295097, 12838, 86809, -104228, 37465, -43117, -90336, -141746, -121357, 187781, -84071, 130041, 170868, 241848, 132870, -167765, 9740, -180501, 293540, 241307, 42580, 114737, 182707, -118214, -348335, 30322, 338653, 154880, -173365, -316165, 123213, -55971, 49048, 16082, 36272, 144463, -2137, 103455, -72671, 178868, 21354, -215030, 89694, -74565, 17782, -175487, -61773, -104904, -36039, 100143, -119527, -149830, -55066, 227276, 72592, 181997, 5919]
15302H3795a7937I4839i7756A35000a01270A48702C2221g1508C458R0336a03326
15290b15808B01874E7074a80356L4817f283j98963A88596D3155a59483C11178
15279F3810b1294A39756d7975j0232B76405d3603A36598e8304D7852j9831K5022
15268E3043b50357A04249K20768j17598h9581A53328l4768A7664e3451b2543A93413
15256e29424a74174h6904A24090N4083N177p6404N184K28533H4579J238910L40776
15245A664265n90213O95742G57949k86798j29472A13618b56597C05857c2545l7112
15235f9657B95198d8404A27872A9765b0091G861J45593j2929k0516j889C8331
15223B5635m364g3714j17211C05287j10272b34823a09864A57041b22897i130j37761
$$ y = [83795, -17937, 94839, -97756, 135000, -101270, 148702, 32221, -71508, 3458, 93794, -103326, -215808, 201874, 57074, -180356, -145539, -6283, -205246, 188596, 43155, -159483, 311178, 63810, -21294, 139756, -47975, -58207, 276405, -43603, 136598, -58304, 47852, 28021, 53043, -250357, 104249, 325017, 207419, -89581, 153328, 118560, 17664, -53451, -22543, 193413, -529424, -174174, -86904, 124090, 178173, 183350, 106946, 112130, 340663, 84579, 1323489, 1664265, 1074052, 1769794, 757949, 471151, 341679, 113618, -256597, 305857, -32545, -69657, 295198, -48404, 127872, 19765, -20091, 7861, 153454, 140525, 120009, 118120, 38331, 25635, 21271, -73714, -190925, 305287, 195015, -234823, -109864, 157041, -222897, -9130, -146891]
15212a46891j73668a43458q9477B5236a53718A39890o2893c24022c7516C8157
15201A56784k94K46124A59285K75022B09378e4156I0280B2437J20864J29558E6610
15189A75178J17904n2341n5847a3121B10713b63401I1036a02326j7392c0932k29239
15178b60171A46469J37665d6962j64379A95899J6251d4048B67629N2099o3695
15168B56033g0819B91589d1882B46196j21960c4525A63219c9700A38766E4125
15157A46926A9926J33033F3448N30567a21261E16634B41983b44917a17726D7347
15146c9331A42790N5790k0384b1095n247D2884P8121j296k8655a9459C31044C057
15133B7590g3133A04179K07569m2937a13700G062L2546K31057j16200a35651e6640
$$ y = [-146891, -320559, -143458, -232935, 25236, -153718, 139890, 76997, -324022, -37516, 38157, 156784, 156490, 402614, 159285, 434307, 209378, -54156, 90280, 22437, 143301, 272859, 56610, 175178, 293082, 240741, 184894, -13121, 210713, -263401, 91036, -102326, -119718, -30932, -260171, 146469, 284134, -46962, -211341, 195899, 212150, -44048, 267629, 319728, 256033, -70819, 291589, -41882, 246196, 124236, -34525, 163219, -39700, 138766, 54125, 146926, 19926, 152959, 63448, 594015, -121261, 516634, 241983, -244917, -117726, 47347, -39331, 142790, 198580, 178196, -21095, -26342, 42884, 121005, 119709, 91054, -19459, 331044, 3057, 27590, -73133, 104179, 311748, 268811, -113700, 7062, 39608, 270665, 154465, -135651, -56640]
15121D36461b9049B17838a44157I2907b7504A1537J33304K61121a97298c5808
15110C86848A73316J8985G0506L4632B9433i4762B70931a0956B64273B3775b69637
15098B429a12481F4177J88986D300d009j24702r240B72270d488j62939E2525L9471
15086I1996K00012K25139A31478E8790d2312A15656C8536J7065b9921C56423A20351
15074B61111A09045L4116i007j15516j50115O1924f7087C3135a1801H0492C8339
15062C40037F523Q4495J13009b4967B69931J80010e6928n4589B83165a20156C57066
15050C02906j17682A3323K79482j508K33145j82537B5893R4962J68238Q2258M8805
15039D20156A09215J8151P9327K1737a14187m5432B14516a00890B16656d3853
$$ y = [436461, -29049, 217838, -144157, 92907, -27504, 11537, 144841, 405962, -197298, -35808, 386848, 173316, 192301, 70506, 105138, 29433, -94762, 270931, -10956, 264273, 23775, -269637, 2429, -112481, 64177, 253163, 4300, -4009, -128711, -137951, 272270, -4488, -167427, 52525, 91996, 292008, 517147, 131478, 58790, -42312, 115656, 38536, 55601, -29921, 356423, 120351, 261111, 109045, 143161, -9007, -124523, -274638, -212714, -67087, 33135, -11801, 80492, 38339, 340037, 6523, 91018, 204027, -24967, 269931, 449941, -56928, -111517, 283165, -120156, 357066, 302906, 185224, 13323, 292805, 291297, 524442, 341905, 25893, 120855, 289093, 371351, 420156, 109215, 127366, 206693, 228430, -114187, -159619, 214516, -100890, 216656, -43853]
15028B3032R9472L64318m4291E988M09728f009C33116A15625M1292J11208b10683
15016F4010Q4666O4070K39824A21312K13132j01878F2472L09281n5660k1454I1962
15004C12341H558N1363M14693A89563q3356K3945N7111H4735D0765J7546A0064
14992C6835n874Q6202J26746J36185A83256E973J41228J88631j13202q7560k8303
14981A06767R9931H1793b38138C13879o0182K32093d0001B18631K9605A22164
14970A96822O5953K5115b03070B40971h844G5879K38033j32100J04875j35815
14960A50872J39472j3998h4430C65341A43222K04334A6201L28463o3008n255k4278
14949B52123L39231k04216j4412p7748a8941C34347j18338H5810Q5119M8830E4863
$$ y = [23032, 122504, 486822, 442531, 5988, 415716, -6009, 333116, 115625, 156917, 268125, -210683, 64010, 148676, 212746, 452570, 121312, 334444, 232566, 62472, 371753, 316093, 294639, 91962, 312341, 8558, 59921, 474614, 189563, 106207, 130152, 187263, 84735, 40765, 58311, 10064, 36835, 30961, 117163, 243909, 380094, 183256, 5973, 147201, 335832, 222630, 135070, 106767, 206698, 81793, -238138, 313879, 253697, 485790, -40001, 218631, 248236, 122164, 196822, 262775, 287890, -203070, 240971, -8844, 75879, 313912, 181812, 286687, 150872, 290344, 276346, -84430, 365341, 143222, 347556, 16201, 344664, 281656, 276401, 252123, 591354, 387138, 372726, 294978, -18941, 334347, 216009, 85810, 170929, 219759, 54863]
14937B03011k4431L7235j8161L13106B26537K46480A89647k8353J56801K0562
14927C38657j02613J02831N9076A59338J24265I9430L60109o3500l4346A65654
14916A33689K95859j86284p4970J137k6670J15345q125J56888O1761m6776j75934
14905B45920K28851h5688B15101K44165n4976A54597M16058k39322A00867O0665
14895A61532J55085A42175m3962a4279A70345l0449I846a56482C70922j51284
14885B19638a36226D87520B16464J20994j7440k2052j9769p5150p5940K80334
14875D07441j80469A10899N16862a04567C39880J5765J22285K9342n4487J8278
14865D71063k9j4815k16090J5628M3023O4650A44771L5648K87581J64666k92992
$$ y = [203011, 178580, 215815, 197654, 510760, 226537, 473017, 189647, 161294, 318095, 338657, 236044, 338875, 397951, 159338, 283603, 99430, 459539, 396039, 361693, 165654, 133689, 429548, 243264, 168294, 169431, 142761, 258106, 249981, 406869, 468630, 421854, 245920, 474771, -85688, 215101, 459266, 404290, 154597, 570655, 331333, 100867, 161532, 316617, 142175, 98213, -14279, 170345, 139896, 9846, -156482, 370922, 219638, -136226, 487520, 216464, 337458, 320018, 297966, 278197, 203047, 127107, 407441, 226972, 110899, 627761, -104567, 339880, 355645, 477930, 507272, 452785, 471063, 471034, 456219, 240129, 255757, 298780, 363430, 144771, 180419, 468000, 632666, 339674]
14854C39674L46833B32212I4265K58455R5508R8173k38809o6712K64606N6434
14844E61920k51630L34274l03548A11293K55226o3100F6920M60918j76369A55614
14833F27280B09247a37436B17885M1966P8012O3467J45304o0427J21040J96867
14823H04114k22557j2183j45106A70649K07738l3963K6297m030l5293L96435l27176
14812D00657M42927j55958A36536L74016O4810o3819j14636K77941A83328D4099
14801C99811j11954K26467j11334J14512k23969K82695j99702J64837K72226j30655
14791F82934j68947l4940J13177B10032K34594A58508L48093L75796j65609k26106
14781D90682J56532k1965J34714l39052N5627J30914j99402K4211K37413k87705
$$ y = [339674, 686507, 232212, 94265, 352720, 448228, 546401, 307592, 240880, 505486, 561920, 310290, 644564, 341016, 111293, 366519, 303419, 66920, 527838, 351469, 155614, 627280, 209247, -137436, 217885, 259851, 337863, 401330, 546634, 486207, 607247, 804114, 581557, 569374, 424268, 170649, 378387, 344424, 370721, 366691, 331398, 727833, 400657, 843584, 687626, 136536, 510552, 575362, 511543, 396907, 674848, 183328, 44099, 399811, 287857, 514324, 402990, 517502, 293533, 576228, 376526, 541363, 813589, 682934, 513987, 479047, 592224, 210032, 444626, 158508, 506601, 882397, 716788, 490682, 647214, 625249, 759963, 420911, 476538, 607452, 408050, 432261, 669674, 381969]
14771C81969J92663J17273k54805L33665j72634q4882J37255k35983j32277A40778
14760E53729M1716N1688B11448M99692R5875k56792Q8840k0164j5807J00321o5893
14749F37520o5299K91536l13355R6104k70781J46604Q2011j02349K82187P2068
14739H56246L0097R0082o0889l88153L09268k32878J42055j42780J49668P6252
14729H28968J76384k75268q4923P5609L79741l25255q87J98927j81193M8362l92357
14718D48108m1587K44238J56894k88000J94925K01763j12186j00382K51815m59129
14708D96459M11721N8206j014j73136K29750l04119n7023K94719l3419j64779
14698G57365j1974N0882K8457J85274r6966l5886N9656r6619N4280M0774N8552
$$ y = [381969, 574632, 691905, 437100, 770765, 598131, 513249, 650504, 414521, 282244, 140778, 553729, 595445, 647133, 211448, 711140, 807015, 550223, 639063, 618899, 603092, 703413, 637520, 572221, 863757, 550402, 646506, 375725, 522329, 604340, 501991, 784178, 856246, 886343, 976425, 915536, 527383, 836651, 603773, 745828, 603048, 752716, 828968, 1005352, 730084, 645161, 720770, 1100511, 775256, 774369, 973296, 792103, 840465, 448108, 406521, 650759, 807653, 519653, 714578, 916341, 804155, 703773, 955588, 496459, 908180, 966386, 965372, 792236, 1021986, 717867, 660844, 955563, 922144, 757365, 745391, 796273, 824730, 1010004, 913038, 877152, 936808, 840189, 894469, 935243, 993795]
14687I93795j07804K65765l63689K52489p0756K38471l83020j8571J28342N420
14677I40442J94216k33602L13175n46303M07723K1692k35249J15677J83414m3501
14667A117684N9435L47652p46784J86678j70268L32099j29873K40374r4589r9130
14657A043278L1965J68156o6037n3354K20460l42621j05734K19867m43852K62977
14647I35105J11320K44497q7782J82349m05703K60414O1972J35578k89614K87487
14637A435623l34897K39626j27492M38799l08433J55713l56819R5327J94659r4980
14627A337126K7105j1737j7814R1384k47080J12892J17332N2432R3440k5066k18849
14616A311165r820J27887n2889K10877j9619J4682j66332K59005l66148K5271
$$ y = [993795, 885991, 1151756, 788067, 1040556, 969800, 1208271, 825251, 806680, 935022, 940442, 1134658, 901056, 1214231, 667928, 1075651, 1097343, 862094, 977771, 1161185, 1117684, 1177119, 1524771, 777987, 964665, 794397, 1126496, 996623, 1236997, 1142408, 1043278, 1075243, 1243399, 1177362, 1124008, 1344468, 1001847, 896113, 1115980, 672128, 935105, 1046425, 1290922, 1203140, 1385489, 979786, 1240200, 1302172, 1437750, 1148136, 1435623, 1100726, 1340352, 1212860, 1651659, 1343226, 1498939, 1142120, 1237447, 1432106, 1337126, 1364231, 1352494, 1334680, 1426064, 1178984, 1291876, 1409208, 1461640, 1555080, 1530014, 1311165, 1301345, 1429232, 1376343, 1587220, 1567601, 1582283, 1415951, 1674956, 1308808, 1334079]
14606A334079Q923K59727O8711r6562j72956j80495J67378N26304l84414j51259
14596A379436L51314m62214M37587k22616J51268l11971P62952l23982L4462N41520
14586B337756o72282J49489J50774k36762N89662m21072J39728k62806r1758L99279
14576B082008l09315N8459J52589j2825J12131j09949P811K07100j35242K74923
14566B327690r1732k2162J50859P6055K33063l96014K25707K44181P6920M0884
14556B865451L69668o5558m2828L84754M14398M55197Q22601J589824L187648
14547I981155P713036K0383585J0155933B2455882j0154222n922884k539886j333590
14539B505300k58177r3488l25171k0938K86738k12439J52291k6978J88910j22983
$$ y = [1334079, 1343002, 1602729, 1671440, 1574878, 1401922, 1221427, 1388805, 1915109, 1530695, 1379436, 1730750, 1268536, 1706123, 1483507, 1634775, 1322804, 2085756, 1761774, 1796236, 2337756, 1665474, 1814963, 1965737, 1728975, 2318637, 1897565, 2037293, 1774487, 1682729, 2082008, 1772693, 1831152, 1983741, 1970916, 2083047, 1973098, 1980909, 2188009, 2052767, 2327690, 2235958, 2213796, 2364655, 2440710, 2673773, 2277759, 2503466, 2747647, 2824567, 2865451, 3235119, 3169561, 3126733, 3511487, 3925885, 4381082, 5203683, 6793507, 9981155, 17694191, 38077776, 48233709, 22455882, 12301660, 6378776, 3838890, 2505300, 2247123, 2153635, 1828464, 1807526, 2094264, 1881825, 2034116, 2007138, 2196048, 2073065]
14529B073065J37791K59619j42713J85248m59781J2570N3795M71981j07423j92427
14519B291725L33447K2454J74105k62564J2242j1759j68707K36098K01064l51787
14509B476318N08334k67082O3185j68618L78247J65230k40722L06339l19016M07708
14499C309923j89159J22505n7020j25962J99265K45535m30922M59377l54570L00341
14489C479313p6526J98424k11833N8782m29213L46673M41090k18187K16394J7593
14479C822510L041p8687K99680O6384j28530q251n6792P1429M30487l32940K22629
14468D310960j65397K41638k03318K32754R8679J34643K63685j79377m4591L98788
14458E088464o80047L63067q6516O78051m63399N9228N65033l03311J79932j07364
$$ y = [2073065, 2210856, 2470475, 2327762, 2513010, 2053229, 2065799, 2119594, 2591575, 2484152, 2291725, 2625172, 2647626, 2821731, 2559167, 2571409, 2559650, 2390943, 2627041, 2828105, 2476318, 2984652, 2717570, 2780755, 2612137, 2990384, 3155614, 2914892, 3221231, 2902215, 3309923, 3120764, 3243269, 3186249, 3060287, 3259552, 3505087, 3074165, 3533542, 3178972, 3479313, 3402787, 3601211, 3389378, 3448160, 3018947, 3365620, 3806710, 3588523, 3804917, 3822510, 3825551, 3746864, 4046544, 4112928, 3984398, 3976147, 3919355, 3990784, 4421271, 4088331, 4310960, 4145563, 4387201, 4183883, 4416637, 4515316, 4649959, 4913644, 4734267, 4689676, 5088464, 4408417, 4771484, 4684968, 5363019, 4899620, 4958848, 5523881, 5220570, 5400502, 5293138]
14448E293138J41658Q6471J88587R847K61111l79771K33017K28004j25696K06526
14438F142892k00858L35833Q8791J56071k9834K90447K9013k39017M71493J9764
14428G064595J0901j08466K09588k26066L96069K67986J92934m1778k89499O24224
14418H100488J19138J90885j30365n7685O96859r5241m05498Q36252J10164P7625
14408I442622J41957m23254L35958K37278L30933K05565m06448K39826L24678
14399A0429115J15658J38793O11224k7571k62849Q20844n0880k83964O38805M71358
14389A2600533J23510J68108J91297K93871K06990J97641K90354K40997K86496
14380A4599797K15614Q1461M52925L93597M7508O86789m9702M03125K57884N63390
$$ y = [5293138, 5434796, 5521267, 5709854, 5719701, 5980812, 5601041, 5834058, 6062062, 5936366, 6142892, 5942034, 6277867, 6366658, 6522729, 6492895, 6783342, 6812355, 6573338, 7044831, 7064595, 7075496, 6967030, 7176618, 6950552, 7346621, 7614607, 7807541, 7765763, 7476264, 8100488, 8219626, 8410511, 8280146, 8222461, 8919320, 8824079, 8418581, 9254833, 9364997, 9442622, 9584579, 9161325, 9497283, 9734561, 10065494, 10271059, 9864611, 10104437, 10429115, 10544773, 10683566, 11294790, 11267219, 11004370, 11825214, 11774334, 11490370, 12129175, 12600533, 12724043, 12892151, 13083448, 13377319, 13584309, 13781950, 14072304, 14313301, 14599797, 14815411, 14896872, 15349797, 15743394, 15790902, 16477691, 16427989, 16831114, 17088998, 17652388]
14370A7652388Q1980K13681O08541L49756M22238N77660L40380K00152M93588
14361B0940364J15729J074986J74379N30599N50177O07852L69932M56183N80473
14352B5400674P46844O84155L96842Q50429O25738O04807J024296M11180J137984
14343C1882949M65183J045687Q22953O72613J048036J011600R94564J198018J535472
14334D0677075N87380J140833J525533J601687J073978J249717J581435J672175
14326E1109813J554122J488632K182911J736305K038600J861738K450906J805146
14318F6228173K878656K554026K462024K572451L027744K905141L507416K918488
14310H9054119L752241L827400L852609M545610M246918M867072M835009N227410
$$ y = [17652388, 17734368, 17948049, 18556590, 18906346, 19328584, 19906244, 20246624, 20446776, 20940364, 21056093, 22131079, 22305458, 22836057, 23386234, 23994086, 24364018, 24820201, 25400674, 26147518, 26831673, 27228515, 28078944, 28704682, 29309489, 30333785, 30744965, 31882949, 32348132, 33393819, 34216772, 34889385, 35937421, 36949021, 37943585, 39141603, 40677075, 41264455, 42405288, 43930821, 45532508, 46606486, 47856203, 49437638, 51109813, 52663935, 54152567, 56335478, 58071783, 60110383, 61972121, 64423027, 66228173, 69106829, 71660855, 74122879, 76695330, 79723074, 82628215, 86135631, 89054119, 92806360, 96633760, 100486369, 105031979, 109278897, 114145969, 118980978, 124208388]
14302A24208388N520031O236030O435811O359354P501617P430906P852609Q631550
14294A80176296Q987428R287338J0083476J0596189J1374738J1315932J2598389
14287B54419786J2878449J3058710J3956522J4057480J4383752J5002448J5030334
14280C52787481J4629772J4530544J3921750J3488880J2309110J1581609R288525
14273D42537671P431475M278590K154322J413211k689908l481203j945766m557933
14265D45140459o956472q128906j0666166j1739989j2810604j3809960j4411215
14258C66617147j4565337j4615723j5213378j4765728j3895685j2534384j3408215
14251B67618697j3141623j2267524j1812155j1106877j0470434r991469r439686
$$ y = [124208388, 129728419, 135964449, 142400260, 148759614, 156261231, 163692137, 171544746, 180176296, 189163724, 198451062, 208534538, 219130727, 230505465, 241821397, 254419786, 267298235, 280356945, 294313467, 308370947, 322754699, 337757147, 352787481, 367417253, 381947797, 395869547, 409358427, 421667537, 433249146, 442537671, 449969146, 454247736, 456402058, 457815269, 455125361, 451644158, 449698392, 445140459, 438183987, 430055081, 419388915, 407648926, 394838322, 381028362, 366617147, 352051810, 337436087, 322222709, 307456981, 293561296, 281026912, 267618697, 254477074, 242209550, 230397395, 219290518, 208820084, 198828615, 189388929]
14244A89388929q500459q691649q123722p692285p210066o823180n718174n773948
14236A30855446n768983n651330n163910m666980m104580l969053m187644m043353
14228I3299613l702354l725859k998996l082523l239048k326969k642991k567583
14220F9013290j942171k582960k481840j741236k063821k075863j167816j874162
14212E3083421j547728j799498j461325j395240j646850m91111j272551j600804
14204D1868314j073377j481530p93348r96504p97560j333707m05074j053976j450974
14195C2482264m57062n94410o49566r95812p04539o04393j075828n18469n17150
14186B6365035o27582m56796q24945k92864j077619m041o75962o71164r4066p82775
$$ y = [189388929, 180888470, 172196821, 164073099, 156380814, 149170748, 142347568, 136629394, 130855446, 125086463, 119435133, 114271223, 109604243, 105499663, 101530610, 97342966, 93299613, 89597259, 85871400, 82872404, 79789881, 76550833, 74223864, 71580873, 69013290, 67071119, 64488159, 62006319, 60265083, 58201262, 56125399, 54957583, 53083421, 51535693, 49736195, 48274870, 46879630, 45232780, 44741669, 43469118, 41868314, 40794937, 39313407, 38520059, 37523555, 36725995, 35392288, 34987214, 33933238, 32482264, 32025202, 31430792, 30781226, 29785414, 29080875, 28476482, 27400654, 26882185, 26365035, 25737453, 25280657, 24455712, 24162848, 23085229, 23081188, 22405226, 21734062, 21639996, 20857221]
14176B0857221j75651p35942J46904j63809q60514j53110n88098l58965l12083
14167A7655953k81377j13584m99314l55009l14242m81704P2987m83599j13329
14158A5086782q55954K14447k61797k03950K4008q04735J60665K3821m23689k32064
14148A2727534l18198k41672J42494l41889j62033k75688L3414j80257l73465
14139A1010240m00338K09767l20450L3456k53140j49690K6761n42289J6002j01788
14129I528531m7387k01188L8018k05997n90512P4155j6170m7054j66408j84954
14119H181034J48870l18639q472k05194m726j40567R8155l96677J79088j58821
14109G374051m3741L2247l56040j62198k6169r1401j90331r023J30585k91082
$$ y = [20857221, 20681570, 19945628, 20092532, 19928723, 19068209, 18915099, 18327001, 17968036, 17655953, 17374576, 17260992, 16761678, 16406669, 16092427, 15610723, 15683710, 15200111, 15086782, 14230828, 14445275, 14183478, 13979528, 14003536, 13198801, 13359466, 13383287, 12959598, 12727534, 12409336, 12167664, 12310158, 11968269, 11806236, 11530548, 11563962, 11383705, 11010240, 10609902, 10819669, 10499219, 10532675, 10279535, 10129845, 10156606, 9614317, 9630319, 9528531, 9481144, 9279956, 9317974, 9111977, 8521465, 8595620, 8579450, 8532396, 8365988, 8181034, 8329904, 8011265, 8002793, 7797599, 7792873, 7652306, 7750461, 7353784, 7532872, 7374051, 7330310, 7362557, 7006517, 6844319, 6818150, 6726749, 6536418, 6527395, 6657980, 6366898]
14099F366898J75327k50908J01898p2772k68204J46777l53675j57616J3943J77614
14089E879282k99757j502m6719M7916M45796m71660q0365k48986k09610K83806
14079E298201J27212l76863k83852K26012K95424k87191k4673j61796k05815M6215
14069D652874J61036k95857J48919j92367J93043k65643j71916o9414r143L79185
14059D530717k40560j7754l85159Q53242o94257q9648K33522k14673J9628j06052
14049C889006K57038k07017j25375j61266j07434p3422K23698n4176m3060j00418
14039C497574J18461j72613l58801J85056J1333o3323k08401L56805j34893K7086
14029C258284O8936k74175K23677m14162m9513j29296R0942J17073P2034j06968
$$ y = [6366898, 6542225, 6291317, 6393215, 6320443, 6052239, 6199016, 5845341, 5687725, 5701668, 5879282, 5579525, 5578023, 5531304, 5579220, 6025016, 5553356, 5472991, 5224005, 5014395, 5298201, 5425413, 5048550, 4764698, 4990710, 5286134, 4998943, 4974270, 4812474, 4606659, 4652874, 4813910, 4518053, 4666972, 4474605, 4667648, 4402005, 4230089, 4160675, 4151532, 4530717, 4290157, 4272403, 3887244, 4740486, 4046229, 3956581, 4190103, 3975430, 3995058, 3889006, 4146044, 3939027, 3813652, 3652386, 3544952, 3471530, 3695228, 3641052, 3597992, 3497574, 3616035, 3443422, 3084621, 3269677, 3281010, 3217687, 3009286, 3366091, 3231198, 3258284, 3327220, 3053045, 3276722, 2862560, 2813047, 2683751, 2774693, 2891766, 2963800, 2856832]
14019B856832R682k54035k44065J81804K04633k17860j8485K89839l44311K35615
14009B699649m3813j12905K57140m67536K36433m3376r6988K12857m30978n8247
13999B152236N3490n8592p9310J88216J10347k49962K10184k75454L21125P8116
13989B450396Q60454J803605N849711J9416663K0108852k1861314j3477580n665524
13981I485263k792851j428391r15847k46808k88471o54916N2295m41940M06042
13972C174376m99413L00619l49442L23721j85080k85783k6297L02716l78267J06112
13962B483262k6372k79517L1883J36875k72739L60861p6390l43859L51050l2722
13952B332332l64141N435N21191r685l52152n4472p2304j79854M55712l34463
$$ y = [2856832, 2866514, 2612479, 2368414, 2550218, 2754851, 2536991, 2518506, 2808345, 2464034, 2699649, 2655836, 2542931, 2800071, 2332535, 2568968, 2525592, 2428604, 2641461, 2210483, 2152236, 2205726, 2147134, 2067824, 2256040, 2366387, 2116425, 2326609, 2051155, 2372280, 2450396, 3310850, 5114455, 10964166, 30380829, 50489681, 28628367, 15150787, 9485263, 6692412, 5264021, 4348174, 4101366, 3812895, 3157979, 3210274, 2768334, 3174376, 2674963, 2975582, 2626140, 2949861, 2764781, 2478998, 2452701, 2755417, 2377150, 2483262, 2456890, 2177373, 2209256, 2346131, 2073392, 2434253, 2357863, 2014004, 2365054, 2332332, 1968191, 1973626, 2494817, 2485132, 2132980, 2078508, 2006204, 1826350, 2282062, 1947599]
13942A947599J66979n91842N79801k99070j29723K75954p7796j02874L27541n54769
13932A541800L34460j5845n41232M57548m2306K99414l65363j08345M01274j24709
13922A836696k78271P6848J35962k91115K99636j76625K84132l85119j89535L11490
13912A624099m3977n2648l07781K29483L29914l60010p6073K96943j89929L0963
13902A480984k3879R4429N5113j05308J59921j05385o4810o02192O94773j47828
13892A435818J60589m17438J21005K03708N6219m96578O8229K75781j06687j2139
13882A288507k38103R8907K65293k86552L90701j98244k19652K53042K22998l79327
13872A197570k4303J33673o4750k26663k4147J68984R6913R3614j17842n6829
$$ y = [1947599, 2114578, 1522736, 2102537, 1803467, 1673744, 1949698, 1871902, 1769028, 2096569, 1541800, 1876260, 1860415, 1319183, 1776731, 1734425, 2033839, 1668476, 1560131, 1961405, 1836696, 1558425, 1635273, 1771235, 1480120, 1779756, 1603131, 1887263, 1502144, 1312609, 1624099, 1580122, 1527474, 1219693, 1449176, 1779090, 1419080, 1343007, 1639950, 1450021, 1480984, 1457105, 1551534, 1606647, 1501339, 1661260, 1555875, 1491065, 888873, 1583646, 1435818, 1596407, 1178969, 1299974, 1503682, 1559901, 1063323, 1131552, 1407333, 1300646, 1288507, 1050404, 1149311, 1414604, 1128052, 1518753, 1320509, 1100857, 1353899, 1576897, 1197570, 1173267, 1306940, 1242190, 1015527, 991380, 1160364, 1257277, 1350891, 1233049, 1176220]
13862A176220J79576m31322K06666k36632N25406k90583q9160L20136j68842j20921
13852A070544K000Q3690J52559j64727l225L12224m03464l26205L73813P4990
13842A172199k1390j52305j3799q2571l8872L18128L54661m30486K04544j74275
13832A135834M7619k78793K63067l17276j36094M75927r7863l01177j47611J45772
13822G89405J23895L17917k56592j19971N4939N45754m42098l7571C54817L92510
13812G47327N96285n40277M78705k30762J10235m70890p9245Q3559M63112m47783
13802G10266J69804p6846K36370j64130k96842O53970k05363l36762K5695k6378
13792F89784J86320p0668J56692l60506J97857L0492J44773k2959k34481J72076
$$ y = [1176220, 1355796, 924474, 1131140, 894508, 1419914, 1129331, 1040171, 1360307, 1191465, 1070544, 1072544, 1156234, 1308793, 1144066, 1140841, 1453065, 1049601, 723396, 1097209, 1172199, 1150809, 998504, 984705, 902134, 863262, 1181390, 1536051, 1105565, 1310109, 1135834, 1183453, 904660, 1167727, 850451, 714357, 1190284, 1092421, 791244, 643633, 789405, 913300, 1231217, 974625, 854654, 909593, 1455347, 1013249, 975678, 354817, 747327, 1343612, 803335, 1282040, 1051278, 1161513, 690623, 611378, 694937, 1158049, 710266, 880070, 803224, 1039594, 875464, 578622, 1232592, 1027229, 690467, 716162, 689784, 876104, 805436, 962128, 601622, 799479, 829971, 974744, 951785, 717304, 889380]
13782H89380C62421L04037L777L2353j58540N44740J1552E46666J57304K79898
13772I83868k89627L23726l67384J24873J74597k96753N67049k58482p314j92037
13762G62516k51518K28876k41741J22078Q070r1001K05335J68463O9695j39224
13752H41549k50007L10693j44282K1972n4669r8601p4077K51747k61071B57167
13741H83463C67543L31062k57425K9282M99890C73583M65232k11853M68428m41722
13731F53668j17403K81022j59373J93616k70757J09254k23152L3520M28737k00804
13721G28328p3129R683J30962k35106j0088M86497m54495l6834J19203o1490k59797
13710C43734O58956m76477L33752m20547k917Q906P6496j51014K65140o4372n2952
$$ y = [889380, 362421, 666458, 670235, 702588, 544048, 1088788, 1100340, 546666, 703970, 983868, 694241, 1017967, 650583, 775456, 950053, 653300, 1220349, 961867, 954553, 762516, 510998, 739874, 498133, 620211, 628281, 537280, 742615, 911078, 980773, 841549, 591542, 902235, 757953, 779925, 725256, 626655, 552578, 804325, 543254, 257167, 883463, 367543, 698605, 441180, 470462, 970352, 373583, 838815, 626962, 1095390, 653668, 536265, 817287, 657914, 851530, 580773, 690027, 466875, 500395, 929132, 728328, 655199, 664882, 795844, 560738, 550650, 1037147, 582652, 545818, 665021, 603531, 343734, 1002690, 526213, 859965, 439418, 436501, 445407, 521903, 370889, 636029, 571657, 518705]
13699E18705L19694N4953B80496K67505o917R8803j46505M20653m41136j89239
13689B83660J49636k15633M08650k98444K64640l3062q8529K25766q0167j29195
13679D87322n6452o3298L02851j59505j19023L54800k18793K46051k41143j11918
13669D20892j39781J59540M4571L10189j68009k92221K26578k52724M30347B21693
13658G10674C07199J12583J26373N2175k63712O8509o3162L90720l10474K84696
13648G04907k46635P5241k6313Q3679k85468L90027k80342K05460k25969J74945
13638E69532B81026L18560k13336N43397C85765N2799L6011k24448K67337j26960
13628C90504N3746l679J00188j38096L38258k33444p0012o9075A64360M45268
$$ y = [518705, 838399, 893352, 280496, 548001, 541084, 639887, 493382, 914035, 472899, 283660, 433296, 217663, 626313, 327869, 592509, 559447, 470918, 696684, 616517, 487322, 430870, 367572, 670423, 510918, 391895, 746695, 527902, 773953, 532810, 420892, 281111, 440651, 485222, 795411, 627402, 335181, 561759, 309035, 739382, 221693, 710674, 307199, 419782, 546155, 598330, 334618, 403127, 339965, 730685, 420211, 704907, 458272, 533513, 507200, 590879, 305411, 695438, 415096, 620556, 394587, 569532, 281026, 599586, 386250, 929647, 385765, 438564, 474575, 250127, 517464, 390504, 444250, 440571, 540759, 402663, 740921, 507477, 437465, 368390, 164360, 609628]
13618F09628B75528M6806q509K65727A16449K56558P069o9970l193P582K28917
13607E43412J02909l10412J33634O17j91582K46342l1749k12547j10087K14137
13597C84674k9631a30071A60166M01191k09834A66896K55472p7135K21858j66780
13587D00311K09173j61773j49448K08805j62133p3721P4374j05690K87482j00311
13577D27069l4668R9846A16353J13830r8679L79450n5937L27125C32532L23414
13567F55946C18873J14399o9823A31631K10294K90910k77949l9263m7640L5623
13557C03606K86670d3607C08098F6044N08489k82812J12046j6796M45137l46957
13547D85151j43328n8208j5059I2154K88525j8188Q0396N3651J61124A67514P8168
$$ y = [609628, 275528, 322334, 313825, 579552, 116449, 373007, 380076, 310106, 306913, 314495, 543412, 646321, 335909, 469543, 470160, 278578, 524920, 493171, 280624, 170537, 384674, 355043, -130071, 160166, 561357, 351523, 166896, 422368, 345233, 567091, 400311, 609484, 447711, 298263, 507068, 344935, 271214, 345588, 239898, 527380, 427069, 392401, 492247, 116353, 230183, 131504, 510954, 455017, 782142, 332532, 655946, 318873, 433272, 363449, 131631, 341925, 632835, 354886, 315623, 267983, 303606, 590276, -43607, 308098, 66044, 574533, 291721, 403767, 386971, 832108, 485151, 341823, 283615, 268556, 92154, 380679, 362491, 442887, 496538, 657662, 167514, 245682]
13536B45682J62978J2684N6307j16790O4518J29275B75223L54520C1433K35427
13526B66860j11539M13894B11727H3724K45256R0722o8946D5260L90393A19864
13515D17316j25577L02344A19069N14689k02758A56381J19808J18055o4312L372
13505C33304b4805D10674j64908a76113D20012p5622q7746K93816A63848K51844
13495D15692p917o3084G8099L73951j07708k937a2426B67791P2853A17543J30172
13484B47715A11696R0007l6776R0727J15688l6862A33444L18054c6901l5731G7485
13472a31408B48173k4376I5646K12164K0966J15999j43563j24505J3824h3071
13461F4465K33000K4028A17628M63503k21149A65697R2951B9008L16596K4380
$$ y = [245682, 408660, 421344, 477651, 360861, 425379, 554654, 275223, 629743, 31433, 266860, 155321, 569215, 211727, 83724, 328980, 419702, 350756, 45260, 435653, 119864, 417316, 291739, 594083, 119069, 633758, 431000, 156381, 276189, 394244, 329932, 333304, -24805, 410674, 245766, -176113, 420012, 344390, 256644, 550460, 163848, 415692, 407775, 344691, 78099, 452050, 344342, 341405, -12426, 267791, 340644, 117543, 247715, 111696, 201703, 164927, 255654, 371342, 334480, 133444, 451498, -36901, -72632, 77485, -131408, 248173, 223797, 95646, 307810, 328776, 444775, 301212, 176707, 190531, -83071, 64465, 297465, 321493, 117628, 581131, 359982, 165697, 258648, 29008, 345604, 369984]
13451C69984j51071J58353A8448N30942A45717K16757O0915a45573A89473P6152
13441B65625D4117M07922I7742J09777L0251L5136h7015E41864A89742l6358d9394
13429B48199K93620F9338k5183K45829b8941B57273j25989a23745C73763J11344
13419D85107G1225a27252D3948J1044R9810J57255J07573G2445J71315a9150A90857
13407F12588C04296o9472Q1285n3809j29567a0178A28225r370L4260N0778j5275
13396A88618J230F4183M00958B7159a09327B91577A16222J88093J79869C7208
13385H2150K36173q1446G1928N3388K06313A00192K14395K08930A25439J55539
13375B80978J47385Q8465A06804J18229J46655A01050L58889B24499C6605J80994
$$ y = [369984, 218913, 377266, 18448, 549390, 145717, 362474, 423389, -145573, 189473, 265625, 44117, 452039, 97742, 207519, 237770, 272906, -87015, 541864, 189742, 153384, -49394, 248199, 541819, 69338, 44155, 289984, -28941, 257273, 131284, -123745, 373763, 485107, 71225, -127252, 43948, 54992, 154802, 312057, 419630, 72445, 243760, -19150, 190857, 612588, 304296, 234824, 316109, 262300, 132733, -10178, 128225, 118855, 153115, 203893, 188618, 189848, 64183, 465141, 27159, -109327, 291577, 116222, 304315, 484184, 37208, 82150, 318323, 236877, 71928, 125316, 331629, 100192, 314587, 523517, 125439, 280978, 428363, 516828, 106804, 225033, 371688, 101050, 459939, 224499, 36605, 217599]
13365B17599N03761A49161K10064A13716K10166J1037J23525A67664M04748j28454
13355D43958D9997K22088A33638J18325I4734M2312K00818J15613J7617A28868
13344E00405B26812L36042A15230K91697A45472L35785j23965j45822N3921J46413
13334D11804A18882B439M49697e1846B94399A3233O92861a90264C39558A68408
13323E27898j95716F1258K59768J000j49333L29078B3835K44098A16644L81028
13313D97672F182L84892A43394N59056h3459C64612A38811F7289J71115D4496
13302D3454K45171n3572m8802l6017b87177C04670K62614g1548B21456j02196
13292A19260J46108J73731q0202A157J86233a20585r3460C31869B0850J74029
$$ y = [217599, 721360, 149161, 359225, 113716, 323882, 334919, 458444, 167664, 572412, 443958, 49997, 272085, 133638, 251963, 94734, 137046, 337864, 453477, 471094, 128868, 500405, 226812, 562854, 115230, 406927, 145472, 481257, 357292, 211470, 265391, 411804, 118882, 2439, 452136, -51846, 294399, 13233, 706094, -190264, 339558, 168408, 527898, 332182, 61258, 321026, 322026, 172693, 501771, 23835, 267933, 116644, 497672, 6182, 391074, 143394, 702450, -83459, 364612, 138811, 67289, 238404, 44496, 43454, 288625, 235053, 186251, 150234, -287177, 304670, 567284, -71548, 221456, 119260, 265368, 439099, 358897, 1157, 187390, -120585, -214045, 331869, 20850, 194879]
13282A94879n4598A055M06246j79467J52285b20144A3071J37850a87452B27113
13271C68669F8785J29770E4292M69141a38230A34659J89172J42834J888I7522
13260A70038E0856i7609B15274o9404M29144D902g9436C09568D1652M23591A53805
13248e981C21728l8633j8067k6095A09811N4100P4164j01718D5321a9369B22046
13236A25780J61438A08775O1524m5372e6437C5724K72589R1047j56300R9509g0725
13224f1119A60659O9937m0130L1550J1467L579a56369E02653q0242A52710J46601
13213B99311i4486F510J86014q1202o383c9602B25766o7952O8174d2136A49223
13201A49914m3106a02762b7108B5819K28634r6238D0501A8120i7251K19F3576
$$ y = [194879, 140281, 1055, 407301, 227834, 380119, -220144, 13071, 150921, -187452, 227113, 368669, 68785, 198555, 54292, 523433, -138230, 134659, 323831, 466665, 468553, 97522, 170038, 50856, -97609, 215274, 145870, 575014, 4902, -79436, 309568, 41652, 465243, 153805, -5981, 321728, 283095, 265028, 238933, 109811, 163911, 238075, 136357, 45321, -19369, 222046, 125780, 287218, 108775, 170299, 124927, -56437, 35724, 308313, 399360, 243060, 342569, -70725, -61119, 160659, 230596, 190466, 222016, 233483, 237062, -156369, 502653, 422411, 152710, 299311, -94486, 6510, 192524, 111322, 104939, -39602, 225766, 157814, 225988, -42136, 149223, 149914, 106808, -102762, -27108, 25819, 254453, 158215, 40501, 18120, -97251, -97032, 63576]
13189C72423A07028B001K34737r4064f3342A40381M3744E0868K58491l5599d3638
13177B00180K22536q9973i2673C07379r1350L4487k0626q9075J86970a5713A52609
13165f2878B61047a6045A18801q017J16745H1696K34679k4909a38469B45153j15980
13154A29173a39563f3378E6082K3682P671C7365L09704j18448J0704g0393A52150
13142B47078r691a72634C14274A34897i2599B03322b3419B00566a2363B20495
13131D2224g6773F391K26599A10961L30618f4685k47117F9600J22057e1134f594
13119A29265B9918b4302j4901A7861J89837a17752C5835J29044a28684B80515
13108B40550j15672i8305C0850J14499J40970n3519J1374k0312j11220l9951K20904
$$ y = [372423, 107028, 2001, 236738, 142674, -63342, 140381, 184125, 50868, 309359, 273760, -43638, 200180, 422716, 332743, -92673, 307379, 216029, 250516, 229890, 140815, 327785, -15713, 152609, -62878, 261047, -16045, 118801, 110784, 227529, 81696, 316375, 291466, -138469, 245153, 129173, -139563, -63378, 56082, 79764, 87435, 37365, 347069, 228621, 239325, -70393, 152150, 247078, 237387, -172634, 314274, 134897, -92599, 203322, -23419, 200566, -12363, 220495, 42224, -76773, 6391, 232990, 110961, 441579, -64685, -311802, 69600, 191657, -51134, -6594, 129265, 29918, -24302, -39203, 17861, 207698, -117752, 35835, 164879, -128684, 280515, 240550, 124878, -98305, 30850, 145349, 286319, 232800, 244174, 223862, 112642, 72691, 293595]
13097B93595a27461A44064E2042P9362J96788E8636J1069J76503K6269E8439f684
13085b3816B1286J62844a44421B21158I67L33181H3168J89245F808J91535m5891
13074A52452a01613d1002A76846a66006F9929k9325J89449q9821K4404N8534J42222
13063C65392I3308L15931A35800F7808J72473b08876B83597H5851a30528a5316
13052A20077E3449J67963p4079a16020B82303E8450K93652a50433F7243J27782
13042A95025F1489J61058F8829L4745d2953n0772A57018l0912K67085G0335L50263
13031D20598C9428K6000K99821l5972j18454J7813G4030J16052O9046f1367A13666
13019g788r4648A37299k634E0862j9166C362K27636a5600A95300k5206n3997H00
$$ y = [293595, -127461, 144064, 52042, 131404, 328192, 58636, 69705, 246208, 272477, 58439, -6684, -23816, 21286, 184130, -144421, 221158, 967, 334148, 83168, 272413, 6808, 198343, 152452, -101613, -41002, 176846, -166006, 69929, 40604, 230053, 140232, 164636, 223170, 365392, 93308, 409239, 135800, 67808, 240281, -208876, 283597, 85851, -130528, -15316, 120077, 53449, 221412, 147333, -116020, 282303, 58450, 352102, -150433, 67243, 195025, 61489, 222547, 68829, 103574, -42953, -93725, 157018, 126106, 393191, 70335, 420598, 39428, 65428, 365249, 329277, 210823, 228636, 74030, 190082, 259128, -61367, 113666, -7788, -102436, 137299, 134665, 50862, 31696, 3362, 230998, -15600, 195300, 170094, 116097, 800]
13006A68757D1368Q2047b85935D22338j38524h7106C37989j35159c17739A68451
12995G5785J12784L1435E1038M0047M1784J39130l1761j10106e5627k3220H4294
12983c6094B07223J16170K34157A77035a82063j30552D01556F5305J93008m2919
12973B15394P0751B3837c52625C02532A7272J47791d2864G4830N9433d521E9857
12961B84901B2439j0871L00930A0242J68610J13702E7619a85749B68703L134a65079
12949A06078Q8906d2755C57413g9596c9419C75578f1903m7423A47770M3673M6385
12938B37828q9525L20937b05490G9499N7635a59662o2604E9426K04119c105B50136
12926h816C21487j08266o4073N199a49283C6518a47213A92672B3963K82816b10649
$$ y = [168757, 41368, 123415, -285935, 422338, 283814, -87106, 337989, 202830, -317739, 168451, 75785, 188569, 220004, 51038, 91085, 132869, 271999, 240238, 130132, -55627, -78847, 84294, -36094, 207223, 323393, 557550, 177035, -182063, -312615, 401556, 65305, 258313, 215394, 286145, 23837, -352625, 302532, 17272, 165063, -42864, 74830, 134263, -4521, 59857, 284901, 22439, 11568, 312498, 10242, 178852, 292554, 57619, -185749, 268703, 271837, -165079, 106078, 194984, -42755, 357413, -79596, -39419, 375578, -61903, -109326, 147770, 191443, 237828, 148303, 469240, -205490, 79499, 137134, -159662, -222266, 59426, 263545, -3105, 250136, -8816, 321487, 213221, 149148, 154347, -149283, 36518, -147213, 192672, 23963, 306779, -210649]
12914C00520f0279A37501a08380I240a77392B21573a61218m3317B69978j16354
12904A53624Q1667b41488A04411B4664R089L1120K52369f1831D6024O702L16792
12893C69518j73870H7693K1395m4818Q0133o5752J28958E8717a8610o1553j17863
12882a98026A27507J03245d8990q6965A0155M4872N5041c3632K825E9492J19111
12871A78603E7650J95991B1212e9314j899j46684C602J6037e6934k7414A47395
12859D9880c11049G3544N5876a32847b6986H9264g2369q6473G7605a03996b4225
12847B7156K1706b42603F1317J77564K04532b16086A73720d173j85304B05837
12836a04476c7246a2529H0362c2040B4310N7511L75198J13564b26405b77C8013
$$ y = [300520, -60279, 137501, -108380, 9240, -177392, 221573, -161218, -204535, 269978, 153624, 235291, -241488, 104411, 24664, 33753, 64873, 317242, -61831, 46024, 52726, 369518, 195648, 87693, 109088, 64270, 144403, 78651, 207609, 58717, -18610, -80163, -198026, 127507, 230752, -48990, -135955, 10155, 55027, 110068, -33632, -30807, 59492, 178603, 57650, 253641, 21212, -59314, -61213, -207897, 3602, 19639, -56934, -84348, 147395, 49880, -311049, 73544, 129420, -132847, -26986, 89264, -72369, -158842, 77605, -103996, -24225, 27156, 48862, -242603, 61317, 238881, 443413, -216086, 173720, -4173, -189477, 205837, -104476, -37246, -12529, 80362, -32040, 24310, 81821, 457019, 570583, -226405, -277, 38013]
12824I633a16738J2027k145k81457A70913l445J26643c0313A6196c47505a4666
12812D25783c5316k445D30200A43740K0561P1491o8619J06385H4528b5283j16687
12801a41970j1942G5435K24859n8678a16567C51230C3013J30560a60057B33819
12790C09035M9671C8704L52433A89710L8447n8731c0179A78840c02839A99873
12779g7312A24056D1802a8802C09897A43944b14388A88141a27910A10011B9222
12768A00734e1072k3240b4003A35138E4681L15453m6908m1725M3638m5379m8455
12757B31305p5027d7545j26954A24950g9329K2386G0534L5911c8226j16949E4861
12745e838n8490A4538P8272k8228A9950L65123e42443A29080C7410L595b263H3500
$$ y = [9633, -116738, -104711, -106856, -388313, 170913, 167468, 294111, -30313, 16196, -347505, -14666, 425783, -35316, -37761, 430200, 143740, 164301, 235792, 167173, 273558, 84528, -25283, -141970, -153912, 75435, 300294, 241616, -116567, 351230, 33013, 163573, -160057, 233819, 309035, 358706, 38704, 391137, 189710, 228157, 169426, -30179, 178840, -302839, 199873, -77312, 124056, 41802, -18802, 309897, 143944, -214388, 188141, -127910, 110011, 29222, 100734, -51072, -74312, -24003, 135138, 54681, 370134, 323226, 281501, 325139, 279760, 231305, 156278, -47545, -174499, 124950, -79329, -56943, 70534, 106445, -38226, -155175, 54861, -5838, -64328, 14538, 92810, 64582, 19950, 385073, -542443, 129080, 37410, 41005, -2263, 83500]
12732a74125B53040a4758o6093A28177b08664i6437A35616J16742d7222B28585
12721A33208J09980j13380b31699D8596J16741G0497O5819g6983D6003b20322
12710D7848Q6430K1344M989o1190J31318E6708R7928C2536M68014g2235B66820
12698C39811D2566K2159j1197f5010A88684a05551l22702E2695R7818K5033B3169
12686G5255a99523D8806c742A82783G7789B5442J41576D1751L34626J33058k7985
12675D81450a09566A9454h506A74343A7272f2473q294J8515A65330O7982l2567
12664B00745n5197D7936L8403j2683j8751K38454p0160J90560p1561j877j21127
12653B19194F6292J74161J8873h8252E086M43376g040j1362C38911B5750b46974
$$ y = [-174125, 253040, -14758, -80851, 128177, -208664, -96437, 135616, 252358, -47222, 228585, 133208, 243188, 129808, -231699, 48596, 165337, 70497, 136316, -76983, 46003, -220322, 47848, 134278, 155622, 160611, 99421, 230739, 56708, 154636, 32536, 500550, -72235, 266820, 339811, 42566, 64725, 53528, -65010, 188684, -105551, -428253, 52695, 150513, 175546, 23169, 75255, -199523, 48806, -3742, 182783, 77789, 25442, 167018, 41751, 376377, 509435, 481450, -109566, 19454, -8506, 174343, 17272, -62473, -70767, -52252, 165330, 233312, 200745, 145548, 47936, 86339, 73656, 54905, 293359, 223199, 413759, 342198, 340321, 219194, 66292, 240453, 259326, -88252, 5086, 448462, -7040, -18402, 338911, 25750, -246974]
12641f8460F1185J4533B048J95338A3781L4862P4738K5180a5196F42951G8408
12629H5284J50776J3205N3563j1395b8461B91278r6108k4638J23678m1263A05586
12617B85162a5356C70243c7538C14158a38402A23015k345c18422A93027i762k35962
12606b45724e0288C56824j42705H6271d6400j3301B62487j13351b57747A19152
12595c79956A23941O0162k9990K69872A85179B0633J51543J42437f73C9530a57282
12583a13866r8968A08977K45630f7453B37261r0576c57749A15421C2187J52711
12573A84898a3254k33990f2274m17b1643A76246b9446c456j1650l4070B50102
12561b8460A67643b7095B57590I4574M0929A0833a78778M0125I7990N2760a97043
$$ y = [-68460, 61185, 75718, 2048, 197386, 13781, 48643, 123381, 148561, -15196, 642951, 78408, 85284, 236060, 249265, 302828, 291433, -28461, 291278, 195170, 170532, 294210, 252947, 105586, 285162, -15356, 370243, -37538, 314158, -138402, 123015, 120670, -318422, 193027, -9762, -245724, -50288, 356824, 214119, 86271, -46400, -59701, 262487, 149136, -257747, 119152, -379956, 123941, 184103, 154113, 423985, 185179, 20633, 172176, 314613, -673, 39530, -157282, -113866, -212834, 108977, 354607, -67453, 237261, 146685, -357749, 115421, 32187, 184898, -13254, -247244, -62274, -62691, -21643, 176246, -29446, -3456, -15106, -49176, 250102, -28460, 167643, -27095, 257590, 94574, 135503, 10833, -178778, -138653, 97990, 150750, -197043]
12549i4141A61780J14682h0771A42984d9650B4079c5172F4374D811J85193L1996
12538B22000m7129a5229A13046L9268J98831c259H0785K34914a35900B7283O9071
12527I6354N9432N2704l8421g572k87712A91816a9262k23442I9926J6601C686
12515F3453k1484Q977O4094q719M3881c49856B89889G6316k0385B4590L05343
12504C29933b1608C5197c8042A11066a02097B61222b53119F6525M967P1025J19032
12493B61549m3435b77248G9325J7515J52657R1662L5385h3142D7960J06147m7726
12482A06381c6B72561A29256a19549A84863b68071L1940C1738P6019l8248a13206
12470A08965b86786D1703b2268j58757B77890g7920k9458c2263j44056A56478
$$ y = [-94141, 161780, 276462, -80771, 142984, -49650, 24079, -35172, 64374, 4811, 190004, 222000, 174871, -15229, 113046, 152314, 351145, -3259, 80785, 315699, -135900, 27283, 96354, 155786, 208490, 170069, -7572, -295284, 191816, -19262, -242704, 99926, 116527, 3686, 63453, 41969, 50946, 115040, 106321, 150202, -349856, 289889, 76316, 55931, 24590, 329933, -21608, 35197, -38042, 111066, -102097, 261222, -253119, 66525, 71492, 142517, 261549, 218114, -277248, 79325, 96840, 249497, 341159, 376544, -83142, 47960, 154107, 106381, -36, 272561, 129256, -119549, 184863, -268071, -236131, 31738, 107757, 69509, -113206, 108965, -286786, 41703, -22268, -181025, 277890, -77920, -107378, -32263, -176319, 156478]
12459a36858D41206j71225b9310B93230a1381H7417b20564b4855j03042E8207
12448A76514D3945c587q760C5737K5541J0222f2109K1645C32024f8249G1737C1475
12435I1432J72630a6668j7223I0381c1747j07154A79059G4509J91520f0433D3256
12423I5977A6724f2782c14j6720j49347F6078f8263j41149D4250L26982j57141
12412B14091N9004b2254D2752K50714i6782M1559I7361h1723C44464G715a70451
12400a38342B9464h2779d920k42272b6966o2564A20701b85958c7897q6002o5070
12389a88969L9026E1359B4651N9230d82427i303r0823k4821a4616A216J34947
12378A36163b66215f3611B10022d8564l4425D3919J55939i8986l275o4444B79289
$$ y = [-136858, 441206, 269981, -29310, 293230, -11381, 87417, -220564, -24855, -127897, 58207, 176514, 43945, -3587, -12347, 35737, 61278, 71500, -62109, -40464, 332024, -68249, 71737, 31475, 91432, 264062, -16668, -33891, 90381, -31747, -138901, 179059, 74509, 266029, -60433, 43256, 95977, 16724, -62782, -314, -17034, -166381, 66078, -68263, -209412, 44250, 371232, 214091, 273095, -22254, 42752, 293466, -96782, -55223, 97361, -81723, 344464, 7715, -170451, -138342, 29464, -82779, -4920, -247192, -26966, -89530, 120701, -285958, -37897, -123899, -188969, -149943, 51359, 24651, 83881, -482427, -9303, -100126, -124947, -14616, 1216, 136163, -266215, -63611, 210022, -48564, -82989, 43919, 199858, -98986, -102261, -166705, 279289]
12366a3080G6745B3918c10894J55394M3898E0725L6641o763P2411E8280a13626
12354D466j132J35945f3669A61J02090c24434J34058B97391a7815k30904A47018
12342b8836j92940E50496A79980c23503a31106M2942k4732J4252B28615a38253
12331A46805a68178f9824j89860O3827A83992a03516o0115A17214b39115d0649
12320H52K0694L6706J59445I8603J03043K9658A11141A8357L1250j9743G548L83889
12308C91437I5021L1061J42794q1699E4633b17265C71767A13080M0339e3553n2658
12297a06211d3994j7053k28309A11240J31911j9806j5509a01502L5061F8375h4478
12285B31465d60245C39466A09003b85015C31575j43170D3066b2681A67783A2993
$$ y = [-13080, 76745, 23918, -310894, -155500, -111602, 50725, 87366, 80603, 153014, 58280, -113626, 4466, 3334, 139279, -63669, 161, 102251, -324434, -190376, 297391, -17815, -248719, 147018, -28836, -221776, 550496, 179980, -323503, -131106, -88164, -112896, -98644, 228615, -138253, 146805, -168178, -69824, -259684, -195857, 183992, -103516, -163631, 117214, -239115, -40649, 852, 21546, 58252, 217697, 98603, 201646, 231304, 111141, 18357, 49607, 29864, 7548, 391437, 95021, 126082, 268876, 187177, 54633, -217265, 371767, 113080, 153419, -53553, -106211, -43994, -61047, -289356, 111240, 243151, 223345, 207836, -101502, -66441, 68375, -84478, 231465, -460245, 339466, 109003, -285015, 331575, 188405, 43066, -22681, 167783, 12993]
12274a5310p2554B68727I7244L84774A27704A6274P3941b7282j93779B67138M0712
12263C07850a95611e7663K7069A21735K81454a5538A7647J48649P6613O2864m0551
12252B65222a36083e5965H6137J8495J26456H4054g753C7122J47413B9159L19709
12241C48868c23089C2654K89054A15899D5052J74963D2059J80175q3524b68453
12230I1633b27610A59901J46657N3026A76337J09546d96k7300F82454C27117j40283
12219A86834F3204L03933p4755A9688L6668K88160B6177J5032J07316K02153g2845
12207A15913m8266C0376K17156L55964B33437K03261k1102R337A13411R3659K93848
12196E00918F5812K73171j54650G4034L64177k7792j88116J36649a06751B12401
$$ y = [-15310, -87864, 268727, 97244, 482018, 127704, 16274, 90215, -27282, -221061, 267138, 307850, -195611, -57663, -30594, 121735, 403189, -15538, 17647, 166296, 242909, 305773, 265222, -136083, -55965, 86137, 104632, 231088, 84054, -7753, 37122, 184535, 29159, 348868, -323089, 32654, 321708, 115899, 45052, 220015, 42059, 222234, 138710, -268453, 91633, -227610, 159901, 306558, 359584, 176337, 285883, -496, -27796, 682454, 327117, 186834, 63204, 367137, 292382, 19688, 56356, 344516, 26177, 41209, 148525, 350678, -72845, 115913, 67647, 30376, 247532, 603496, 233437, 436698, 415596, 424933, 113411, 207070, 500918, 65812, 338983, 184333, 74034, 438211, 410419, 222303, 358952, -106751, 212401]
12185a1236n3436A02692m9997i853F69388H4573K18479j32283H1807J71164L4667
12174B87638h2922B99794C720K01382p9305L3711k5544h8962E9321K45348C9559
12162A50104a63854f8314b9547A38570g2031B51224I4323a0793G949N3547h7837
12150A73095J04551j28392J22715B1276K6890J46117P9692M6401A00827J5718
12140A16545j5403j7309O687N8024d7682j35682L1566C16838F7549a51523A34584
12128A16719L8706f06504I0759O6502B6227g1417A87058L3193G6729j017J6886
12117I2598c258G0256J29263c0205B25953d0248q4192B22455c57009D9156a97005
12105B34550a86322N8207b1767l3615A10619a13549c9764B10795J25447A7265
$$ y = [-11236, -64672, 102692, 52695, -9853, 669388, 84573, 303052, 170769, 81807, 252971, 287638, -82922, 299794, 3720, 205102, 125797, 159508, 133964, -88962, 59321, 304669, 39559, 150104, -163854, -68314, -29547, 138570, -72031, 251224, 94323, -10793, 7949, 61496, -87837, 173095, 277646, 149254, 271969, 21276, 48166, 194283, 273975, 320376, 100827, 116545, 101142, 83833, 90520, 148544, -47682, -183364, -151798, 316838, 67549, -151523, 134584, 116719, 155425, -606504, 90759, 157261, 26227, -71417, 187058, 220251, 76729, 75712, 92598, -3258, 70256, 199519, -30205, 225953, -40248, -124440, 222455, -357009, 49156, -197005, 234550, -186322, -128115, -21767, -55382, 110619, -113549, -39764, 210795, 336242, 17265]
12094A97620J37972i010m4843j00067A18510a75138B84172j17676a14398A50048
12083E8591b24321J02917n0447h12A20939J144C3078J94419j5159J08253B5727
12071a39949h904j04376k02922H1570g1564B7601c26039a49308B10452j4515r6510
12060I9427a10191d5428E4109B6443b25977A61724K81080N70501J055448I65440
12049F2233d9886A44212K69762j95529a1313j46011j82048J59296C16980e5993
12038A32680b34766B13908E4713a16297o7985N528k2711e6069A0976J43129D1592
12026C82814F4325m515a23495C45654d8573l44152D5598K9064b92767B62789b01339
12014B4927R7854R8860p7712d5846l2664i516D0592d6034D432a5923C7220b99890
$$ y = [197620, 335592, -9010, -53853, -153920, 118510, -175138, 284172, 166496, -114398, 150048, 58591, -224321, -121404, -171851, -812, 120939, 122083, 33078, 227497, 212338, 320591, 25727, -139949, -8904, -113280, -316202, 81570, -71564, 27601, -326039, -149308, 210452, 195937, 99427, -110191, -45428, 54109, 26443, -225977, 161724, 442804, 1013305, 2068753, 965440, 62233, -49886, 144212, 413974, 218445, -11313, -157324, -339372, -180076, 316980, -55993, 132680, -234766, 213908, 54713, -116297, -184282, -178754, -201465, -56069, 10976, 154105, 41592, 382814, 64325, 59810, -123495, 345654, -48573, -392725, 45598, 74662, -292767, 262789, -201339, 24927, 122781, 221641, 143929, -45846, -78510, -9516, 40592, -46034, 4432, -15923, 37220, -299890]
12001b99427C3293a80065A39951f1101A22871P5119a656j10386A33248c1663A10223
11989E9262J56711d20753F6974K6249O258Q6107p9830C9372a90956B9618b34244
11977B63085A6793P507K31721E7856c03397G7423M3655E757K29781q2424j5949
11966A37165K8038E9409J8825Q1708J8328i3444D6021b8631k25610P6581e0862
11954g4342A06089C5666a0886A26306a09654A72277h6510K9679A31525N6634l818
11943A84341k1797p8254d04051I3863C6M02791c0790j8069G9679a16587D7937
11931A25723E6418a2999A92881a05632A65370N6990b94158a36616B11642O3871
11921B75513c4110J1561l2457p0179H8634a41152B26064p7609F1976L2652L22713
$$ y = [-299427, 33293, -180065, 139951, -61101, 122871, 197990, -1656, -112042, 133248, -31663, 110223, 59262, 215973, -420753, 66974, 93223, 99481, 185588, 105758, 39372, -190956, 29618, -234244, 263085, 16793, 24300, 256021, 57856, -303397, 77423, 121078, 5757, 235538, 153114, 137165, 165203, 59409, 78234, 159942, 178270, -93444, 46021, -28631, -254241, -177660, -50862, -74342, 106089, 35666, -10886, 126306, -109654, 172277, -86510, -56831, 131525, 188159, 184341, 162544, 84290, -404051, 93863, 36, 402827, -30790, -48859, 79679, -116587, 47937, 125723, 56418, -12999, 192881, -105632, 165370, 222360, -294158, -136616, 211642, 275513, -34110, -22549, -55006, -125185, 88634, -141152, 226064, 148455, 61976, 94628, 417341]
11910D17341d7517L624B04150I4237e7229B04103D7241N473a90443A98264a35871
11898G4732J85531l6637h7083G5113j9318b21769p8796k776q790B62250o5226
11887A97024g6987J8454A12632c27448i5136B8507a59755K1965M9857G9269b1044
11875a37159F5086O9288L54362b24765k4832A36224H688e5680j89218J8950D5546
11863b18249c5368F9940l1145m731J65476H9367a20337E577b87441B49177p1026
11852A78151E4773J30965p3054b9756j39634k18357B70025e8170B26279a31524
11841b59512a22347c7063A53908l735a0764D7703b72936P1498a074D3069a18550
11829H0295a05309q4383O9001N2502n9964p3050N2450A8655b27099j49431G6985
$$ y = [417341, -47517, -43893, 204150, 94237, -57229, 204103, 47241, 52714, -190443, 198264, -135871, 74732, 260263, 223626, -87083, 75113, 55795, -221769, -300565, -303341, -312131, 262250, 197024, -76987, -58533, 112632, -327448, -95136, 28507, -159755, -137790, -87933, 79269, -21044, -137159, 65086, 134374, 488736, -224765, -249597, 136224, 8688, -55680, -244898, -225948, 45546, -218249, -35368, 69940, 38795, 34064, 199540, 89367, -120337, 5577, -287441, 249177, 178151, 54773, 185738, 112684, -29756, -169390, -387747, 270025, -58170, 226279, -131524, -259512, -122347, -37063, 153908, 150173, -10764, 47703, -272936, -201438, -1074, 43069, -118550, 80295, -105309, -189692, -120691, -68189, -128153, -201203, -148753, 18655, -227099, -376530, 76985]
11817B70391a35374A91605i1530I411J33255a81511k48436d6810j85548I0828
11806H8778b20066D1525a08267B17450h0866C8105Q1768k166b55154J16847A89531
11794a79417A92188o5987b0239j07509C8772b21184A01118h1597l2738j02770
11784b17105f5912I0771N9260d0726A73724g9960o2569A73429G6211j2451c04369
11772b0069K930B2794N4160a22522k95238f9416b7182k82680b4675B3815J51816
11761A75631j5579a10023N4050A21042a98926C738K1559g2318q4085J6512a8521
11749a4685D4422P9948E3815b51322A41277a06177B69367A23958i3938C09591
11738A4068J22400Q871J78860b21433B13486p4659E0638O4363a1887B2652K74925
$$ y = [270391, -135374, 191605, -91530, 9411, 142666, -181511, -429947, -46810, -232358, 90828, 88778, -220066, 41525, -108267, 217450, -80866, 38105, 119873, 117707, -255154, -138307, 189531, -179417, 192188, 126201, -20239, -127748, 38772, -221184, 101118, -81597, -114335, -217105, -65912, 90771, 150031, -40726, 173724, -79960, -142529, 173429, 76211, 63760, -304369, -20069, -17139, 22794, 76954, -122522, -417760, -69416, -27182, -309862, -24675, 23815, 175631, 160052, -110023, -55973, 121042, -198926, 3738, 25297, -72318, -156403, -139891, -18521, -14685, 44422, 124370, 53815, -251322, 141277, -106177, 269367, 123958, -93938, 309591, 14068, 136468, 145339, 324199, -221433, 213486, 138827, 50638, 115001, -11887, 22652, 297577]
11727B97577e1221j60646A18823P7168D6554M3867F883J72982R8007J7419A19126
11715I2818c22560A86329b28259G8910l7532a104H0466d2964A63460o6389a87196
11703a90604F7141i3211c8246A52781B9854K44163a32873p466O3527B21126C8350
11691A80843p2392L38518C2378J05181b0292C59898p8020O4653d952B33465P8835
11680C12300D1913b19094G6968L34224o7792f474B8395Q2617d13850H5875Q9832
11669A75707a95623A68506d3599J4154B0301M5158j1365b7182A72752o1343J61448
11658B72857e7927A8761O0294g700D47215b38790G337Q2266J7367R2412k6155
11647A73227a68556f5340K370j00651o6314A26161a92127C88013j68506d2918
$$ y = [297577, -51221, -211867, 118823, 195991, 46554, 90421, 6883, 179865, 277872, 295291, 119126, 92818, -322560, 186329, -228259, 78910, 41378, -1104, 80466, -42964, 163460, 97071, -187196, -190604, 67141, -93211, -38246, 152781, 29854, 274017, -132873, -140339, -76812, 221126, 38350, 180843, 108451, 446969, 32378, 137559, -20292, 359898, 281878, 346531, -4952, 233465, 312300, 41913, -219094, 76968, 411192, 343400, -6474, 28395, 111012, -413850, 85875, 175707, -195623, 168506, -43599, -29445, 20301, 65459, 54094, -27182, 172752, 111409, 272857, -57927, 18761, 79055, -7700, 447215, -238790, 7337, 89603, 106970, 199382, 173227, -168556, -65340, -62970, -163621, -229935, 126161, -192127, 388013, 219507, -42918]
11636a4534A46419D9513H935K03020K29658a06897R841o0627M5869j21830h840
11624B47195e1560j28514C3773a94322B27108g185B9950K07699e1121G2054J4768
11613H6822a28516f2699m0472B39927a80616j15508e4862F4046n648a80579N9196
11602a21383A16041E5926a25924j05561c1936m7768A73631h3038k67746h726B14693
11590B3541a2513j2309Q250C33535j16793J07445j27290k560q470Q296p7025f2693
11577A68398p7241e9292C1471a35773A3012b1470A76378B2014M9939b90264I482
11565b6444E6464M07768c06946M3073C6255K87513A28997J24766F3374J73797
11555B37171b89970e4632K4493B22030G4450R6199b1042F0099K40431q8279L173
$$ y = [-14534, 146419, 49513, 8935, 211955, 441613, -106897, -97056, -157683, -111814, -233644, -8840, 247195, -51560, -180074, 33773, -194322, 227108, -7185, 29950, 237649, -51121, 72054, 86822, -128516, -62699, -103171, 239927, -180616, -296124, -54862, 64046, 58398, -180579, -121383, 116041, 55926, -125924, -231485, -31936, -79704, 173631, -83038, -350784, -8726, 214693, 23541, -12513, -24822, -16572, 333535, 216742, 324187, 196897, 194337, 185867, 194163, 117138, -62693, 168398, 91157, -59292, 31471, -135773, 13012, -21470, 176378, 22014, 71953, -290264, 9482, -26444, 56464, 464232, -306946, -263873, 36255, 323768, 128997, 253763, 63374, 237171, -289970, -54632, -30139, 222030, 74450, 170649, -21042, 60099, 300530, 212251, 215424]
11544B15424a8982B99806j02923o3180E9520J2626L09805b45978C49803d786A38297
11532B73246b225H6692q554l5896A3219L19347A14222k7341C5443J99889m2772
11521A92560P2019l9072o8238m4460g5840A78310K11463a09261B58518K1852A32674
11509C21429j24464I53J32256J31461j23628b0931B72753R901A23644a74350h5699
11497B97785A08669J55592m2338A7773J74164B0852J76198a40625A08054b24688
11486A70570a5742E27480j99215P6545l1083a96952F5997J496K48669A16753a6985
11474B10613O0729m5462J14656A36942n1925J026O5115K21481G7461g613A26732
11462B43895j2682F1577h6901E7109a2192j00950E4468q696J22813P5823M3509
$$ y = [215424, -18982, 299806, 196883, 133703, 59520, 72146, 381951, -245978, 349803, -4786, 138297, 273246, -2225, 86692, 78138, 42242, 13219, 332566, 114222, 86881, 35443, 235332, 192560, 264579, 225507, 157269, 112809, -75840, 178310, 389773, -109261, 258518, 280370, 132674, 321429, 196965, 953, 133209, 264670, 141042, -20931, 272753, 282654, 123644, -174350, -85699, 297785, 108669, 264261, 221923, 17773, 191937, 20852, 197050, -140625, 108054, -224688, 170570, -15742, 527480, 328265, 404810, 373727, -196952, 65997, 67493, 316162, 116753, -16985, 210613, 271342, 225880, 340536, 136942, 85017, 86043, 151158, 372639, 77461, -7613, 126732, 243895, 231213, 61577, -86901, 57109, -12192, -113142, 54468, 45772, 168585, 244408, 287917]
11451B87917D0481K34184D0626b43738B2392i7919L568j33855B99285m5254a06451
11439e394o4160A97397A5170M18193G0505a01137F2334J1451K37467g8216A75728
11427e9742a5425j48855A90472O1523E3138J20620F3365c3045A281K50372j14460
11416A37193F3140a66231A66945G6242O4915d3304A07047a47790j29272d6639
11405d6496B1313J44529C4369K90824k2413r7972A1508P7787q867a1852j04095
11394a15947j09201b0184j39331D5573g7928B6892R8685j8704a631k05243C25267
11382A10401a01289G3332c20389A5858M2658d9998A16056b46910B409K75290r1827
11371A85872c58236D5247A3485b98829A26100l7152b0624C206K50997a00112F53
$$ y = [287917, 40481, 274665, 40626, -243738, 22392, -97919, -94351, -228206, 299285, 254031, -106451, -5394, -69554, 197397, 15170, 433363, 70505, -101137, 62334, 73785, 311252, -78216, 175728, -59742, -15425, -164280, 190472, 251995, 53138, 173758, 63365, -33045, 1281, 251653, 137193, 63140, -166231, 166945, 76242, 141157, -43304, 107047, -147790, -277062, -46639, -46496, 21313, 165842, 34369, 325193, 302780, 204808, 11508, 89295, 80428, -11852, -115947, -225148, -20184, -159515, 45573, -77928, 26892, 125577, 106873, -1631, -206874, 325267, 110401, -101289, 73332, -320389, 15858, 58516, -49998, 116056, -246910, 2409, 277699, 185872, -358236, 45247, 13485, -298829, 126100, 88948, -20624, 3206, 254203, -100112, 653]
11359A37546a93223d473j69253g2634q2155k4687M0932a8574f943k25911i8161
11347a33173B26638g125G4750c07404C02534d0026A37706K31972g8004H5885a79608
11335H2950C7086J35378n4588c78390Q8618a33977n0142C25881j57287a20147
11324a08453l5304A07482l6932b19751B02450F1792J16160b03039B7982Q0678
11314A08660O8417N1643b84905e4227B51500g819B25634i1556k25449G9921f9413
11302a07372D9893a27805N2664b0081a867A9585b78339p9237J72229B98113I8289
11290B94523h9900p299J5629A58191G1124i064E3529J07481a69662A45956f8487
11278b73124a4164B2302R0247b2958j21526P1486j8901C05684j0684g9618j74447
$$ y = [137546, -193223, -4473, -173726, -72634, -154789, -179476, -138544, -18574, -6943, -232854, -98161, -133173, 226638, -7125, 74750, -307404, 302534, -40026, 137706, 369678, -78004, 85885, -179608, 82950, 37086, 172464, 117876, -378390, -289772, -133977, -184119, 325881, 168594, -120147, -108453, -143757, 107482, 70550, -219751, 202450, 61792, 177952, -203039, 27982, 108660, 177077, 228720, -284905, -54227, 251500, -7819, 225634, -91556, -317005, 79921, -69413, -107372, 49893, -127805, -75141, -20081, -1867, 19585, -278339, -357576, -185347, 298113, 98289, 294523, -89900, -97199, -81570, 158191, 71124, -9064, 53529, 161010, -169662, 145956, -68487, -273124, -14164, 22302, 112549, -22958, -144484, -72998, -91899, 305684, 295000, -79618, -254065]
11267b54065J06992o2396j49654a70732i934o3824k74906a26798o367D5273a22667
11255a78940e5461p0925j92665e3244k26624A10941P5336a64842l472C04481F4734
11243b10697C3699l836N9075Q1955c49405i9968J895K4300C581a75919e015o7125
11231g2140A71543I621a49885K9589b9690A45026c47383A41828a0439j94673K3301
11220a81811B5165f4856b7858j48435H078O5025K47856j09019a33314K7316B91544
11208A02527b33147K9890A38586k6384a5005k31361D9726c29665e3558H9929a29656
11196D4355A948b89845a4461G6793a54465B47481a50448B05979i1562k324j62670
11185b56556A63327A8529b50109N0951p3459K8223G5300d08412d53o7818h202
$$ y = [-254065, -147073, -209469, -359123, -170732, -9934, -73758, -348664, -126798, -133165, 45273, -122667, -178940, -55461, -126386, -319051, -53244, -279868, 110941, 186277, -164842, -168314, 304481, 64734, -210697, 33699, 29863, 88938, 170893, -349405, -99968, -98073, -73773, 3581, -175919, -5015, -72140, 171543, 9621, -149885, -120296, -29690, 145026, -347383, 141828, -10439, -205112, -181811, 25165, -64856, -27858, -176293, 8078, 73103, 320959, 211940, -133314, -105998, 291544, 102527, -233147, -203257, 138586, 112202, -15005, -246366, 49726, -329665, -53558, 89929, -129656, 44355, 1948, -289845, -14461, 76793, -154465, 247481, -150448, 205979, -91562, -93886, -256556, 163327, 18529, -250109, -199158, -272617, -244394, 75300, -408412, -453, -68271, -8202]
11173f8912F9649i1708B71361a17298j41583B34303O0880G2707a06321B06829
11162E6569J84311k3049j8888a48318c0526j61400A64786A9688a59067l4268B35419
11150E3442K35391A12123b0220o0671k70614E4951J71822e2125o520A50132n307
11139A44825b89386e6520B0621K9380J97017d7665j06286N7164A6598c49433F3214
11127A73304g2474A8276J26797J6098c0399I3748a44955L9986a9866B98350b2403
11115g2224H6151L0672b42726F5340b98637a07541A8099g7646B14529o5913J35325
11104B83941A31436R5738j9403J9139e8750J0624j12960O8390A6717K2329K80197
11093C19243j22203e9271D03710A30144k423R3952N404J24340j57812K64284a16590
$$ y = [-68912, 69649, -91708, 271361, -117298, -258881, 234303, 295183, 72707, -106321, 206829, 56569, 240880, 217831, 198943, -148318, -30526, -191926, 164786, 19688, -159067, -193335, 235419, 53442, 288833, 112123, -20220, -80891, -351505, 54951, 226773, -52125, -58645, 150132, 144825, -289386, -56520, 20621, 50001, 247018, -47665, -153951, -96787, 16598, -349433, 63214, 173304, -72474, 18276, 145073, 161171, -30399, 93748, -144955, -104969, -19866, 298350, -22403, -72224, 86151, 116823, -242726, 65340, -298637, -107541, 18099, -77646, 214529, 148616, 283941, 131436, 227174, 207771, 226910, -58750, -48126, -161086, -92696, 16717, 39046, 319243, 197040, -59271, 403710, 130144, 127721, 221673, 227077, 351417, 193605, 457889, -116590]
11081E10726B35124R0520K52928A28577L79410J23803k58655j13843n7118O4555
11071B66729m604K33235j84391K47814k58451K59408m8040p7256A04089L10269
11061D14358J76633K19170F5690O47668k01226J37361k79479O86010l08839j62893
11051E84292L46459k49204K08567m725j32947K7696j42096J00168j23278K70259
11041H85191j65020n5748M5496o8921L3160l9600j45967N65980k28876k92448
11031E33247O7343J75738r9712Q740K51103k23363k2017O821p1090n2192l2803
11020E41815J05107k31263M58318j55297P0142M544k949k74768N10318k3785D15367
11008G18844l00394N62114l68867L0059R9669p0768J93025l04031K64883L43973
$$ y = [510726, 235124, 325644, 578572, 128577, 507987, 631790, 373135, 259292, 202174, 266729, 262125, 495360, 310969, 558783, 300332, 559740, 511700, 434444, 104089, 414358, 590991, 810161, 65690, 713358, 512132, 649493, 370014, 1056024, 747185, 584292, 930751, 681547, 890114, 885389, 752442, 780138, 638042, 738210, 614932, 885191, 720171, 664423, 709919, 640998, 674158, 634558, 488591, 1054571, 825695, 533247, 600590, 776328, 676616, 685356, 936459, 713096, 691079, 697900, 626810, 574618, 541815, 646922, 415659, 873977, 718680, 788822, 793366, 790417, 515649, 1025967, 1002182, 415367, 718844, 418450, 980564, 611697, 641756, 741425, 670657, 863682, 559651, 824534, 1168507]
10998A168507k43191m53751K66111k2737J48349j77037J30142q1489j29656J57411
10988G62659K44202m1117R0691J353K6111M8650n4238L11P3759J69165J77809
10977A499355J69158J30997M71801K77850L65300K31965J7124L90113m72487k30094
10967B851082r231k39790J1375m38382m65115j91108N219L57782k79320L76401
10957A978913j49864j81056j7586l2170l60916K35399m63240n5355k01066J9595
10947G72654C32748j3967J78411j12875A19772K38099r5570F1266p705R2951i1835
10935C72446K20147A49280a19792k9087C27770B0761O3205K3237J4097F368a65271
10923f8463A87308b6229A43811A2289P8700m0189R4795b609k57931G7493J60680
$$ y = [1168507, 925316, 471565, 737676, 714939, 863288, 686251, 816393, 734904, 605248, 762659, 1006861, 965744, 1056435, 1057788, 1083899, 1132549, 1078311, 1078622, 1152381, 1321546, 1499355, 1668513, 1799510, 2271311, 2549161, 2914461, 3146426, 3163550, 3553663, 3081176, 2851082, 2841851, 2602061, 2613436, 2175054, 1709939, 1518831, 1524050, 1881832, 1602512, 1978913, 1829049, 1647993, 1630407, 1598237, 1237321, 1472720, 1009480, 954125, 753059, 772654, 332748, 318781, 497192, 384317, 119772, 357871, 262301, 61266, 53561, 146512, -91835, 372446, 592593, 149280, -119792, -148879, 327770, 20761, 83966, 107203, 121300, 6368, -165271, -68463, 187308, -26229, 143811, 12289, 90989, 50800, 145595, -2609, -260540, 77493, 238173]
10912B38173o4316f286A19038a0286C50493h3786b8416C1545b4255k00927Q7105
10901a38077M2932A39711c09942J26931g1641d962C26109A17006K75704a83647
10890b57049C4547M9336b0699j0126j89939M4333N4317n4754g2173k09627A3783
10878A06980c8844j79648C508J69671p7967b06151p4067F4027c6830H0332e2667
10866d8023p9292j92605a25927b6586A3966a09072j27677M178J02208F2147f7876
10854B4401d74122B2211p465K14194a1910r3556C38411c80615r0955A17720j1547
10843A06173i5806l6632o4777B56775d866l04313G6640g7425n3394m4933P0025
10832a05727H1698g92l5831B50052n1427n2955c01588A52156h8594j14050C14519
$$ y = [238173, 173857, -6286, 119038, -10286, 350493, -83786, -28416, 31545, -24255, -225182, -138077, -95145, 139711, -309942, -183011, -71641, -4962, 326109, 117006, 392710, -183647, -257049, 34547, 83883, -20699, -30825, -220764, -176431, -122114, -176868, -72173, -281800, 13783, 106980, -38844, -218492, 3508, 173179, 95212, -206151, -280218, 64027, -36830, 80332, -52667, -48023, -127315, -319920, -125927, -26586, 13966, -109072, -236749, -232571, -130363, 62147, -67876, 24401, -474122, 22211, 14746, 228940, -11910, -105466, 338411, -380615, -471570, 117720, 106173, -95806, -132438, -197215, 256775, -4866, -309179, 76640, -77425, -130819, -175752, -105727, 81698, -792, -36623, 250052, 198625, 145670, -301588, 152156, -88594, -202644, 314519]
10820H971J2277b70462J20986N4631B21401C1402b24018E5318M2732J98619h6400
10808a20648k2884L4493C12403I0229C3436j5461a71845A37269b86380f6674D9349
10796b44j33620B2694K01122j11598b53777j51063C19333c0458C6622a18591n9955
10785a78546C31452c6826M134l99192A44254d5017d769A339a13233q155q2677
10774b04065D7167e1241D1923J22077J3710l3084b27284A22579O2953b59599l007
10763b62606k096j24705J43589B02028g4855o3476A75430c39208a15562L9188
10753g6374j90561A19749b9593C94509G0193c40298e7253K5897H2043O5035f5657
10741A95750a57234A12634b37185A04033J59143a48471B11566h7334K3577B51377
$$ y = [8971, 21248, -270462, -149476, -94845, 221401, 31402, -224018, 55318, 98050, 296669, -86400, -120648, -143532, -109039, 312403, 90229, 33436, 17975, -171845, 137269, -286380, -66674, 49349, -244, -133864, 22694, 223816, 112218, -253777, -404840, 319333, -30458, 36622, -118591, -178546, 331452, -36826, -32692, -431884, 144254, -45017, -4769, 1339, -113233, -121388, -204065, 47167, -51241, 41923, 164000, 177710, 144626, -227284, 122579, 185532, -259599, -262606, -264702, -389407, -245818, 202028, -74855, -138331, 175430, -339208, -115562, -76374, -266935, 119749, -29593, 394509, 70193, -340298, -57253, -31356, 82043, 147078, -65657, 195750, -157234, 112634, -237185, 104033, 263176, -148471, 211566, -87334, -63757, 251377]
10730B50643C6562a89056A29107a33895k9138B80673G3356L4315E0341K78839
10720C29180a89546l1569Q4173e5466j20209j75935e9503j1654K3677F8473a34402
10708A53555f3125A47544a52057A28604E2037b09k27628g8522h068j4781j12440
10697a35289m7869j15663c6510B12911E3618i8699C4241K1729h4087n0844e6577
10685a41636c8208n8107A17606a37088R261H4871B7670P5825j4664J46156A16814
10673b68165i9351f548o2576K2609E6938i109j24025A86147i2056G955K4808b34172
10660H7334b21939a4573j71006f3915l3292F6342a40098G2585A7294a8730j11654
10649a30384L6528k27657r6347a59961j26500O7227J6909A51586C1862j4816h5443
$$ y = [250643, 36562, -189056, 129107, -133895, -163033, 280673, 73356, 107671, 50341, 329180, -189546, -221115, -136942, -55466, -175675, -351610, -59503, -71157, -47480, 68473, -134402, 153555, -63125, 147544, -152057, 128604, 52037, -209, -227837, -78522, -8068, -22849, -135289, -183158, -298821, -36510, 212911, 53618, -98699, 34241, 55970, -84087, -134931, -56577, -141636, -38208, -96315, 117606, -137088, -127827, 84871, 27670, 103495, 88831, 234987, 116814, -268165, -99351, -6548, -69124, -46515, 56938, -9109, -133134, 186147, -92056, 7955, 32763, -234172, 87334, -221939, -14573, -185579, -63915, -97207, 66342, -140098, 72585, 17294, -18730, -130384, -93856, -321513, -417860, -159961, -286461, -219234, -202325, 151586, 31862, 17046, -85443]
10637a03165L6412B0620Q980K72955j09505b21589D2864c02483h1272H8279B7744
10625a84244N022p0721O5035k46239B91066b53716b8392k4373j18964C88370A55473
10613A04b4526r8709d1380m33251h6297d979B90436j08863m9816b286j13737o2640
10601a78663d0036D00328A44905b67425k6814B7023a63350A00209L5598j5755
10591A20052b12603j36734A16557O1721b92269b1587j82885A86391k3852c66847
10580A33289b55647b5260B15439i9564b652A62753h1125q0396P104A77405a77539
10568a20864m45682E1374K966J61087J78950i4887F3480a14089j62073A97783
10557b9546j69308D3914d9658j36764A21262B4732d07668E8936L66697a17025
$$ y = [-103165, -66753, 20620, 29600, 302555, 193050, -221589, 42864, -302483, -81272, 88279, 27744, -184244, -179222, -249943, -184908, -431147, 291066, -253716, -28392, -52765, -171729, 388370, 155473, 104, -24526, -123235, -41380, -474631, -86297, -4979, 290436, 181573, 131757, -2286, -116023, -178663, -40036, 400328, 144905, -267425, -294239, 27023, -163350, 100209, 135807, 120052, -212603, -349337, 116557, 178278, -292269, -21587, -204472, 186391, 162539, -366847, 133289, -255647, -25260, 215439, -99564, -2652, 162753, -81125, -161521, -154417, 177405, -177539, -120864, -566546, 51374, 54340, 215427, 394377, -94887, 63480, -114089, -276162, 197783, -29546, -198854, 43914, -49658, -186422, 121262, 24732, -407668, 58936, 425633, -117025]
10546B00504b5295r7892B2100b26504C2599A2793g31894b71277A34793b29979
10535d4579j53250B28762e4967B01580q2473m7660b18775j30300g3095j29719
10525b02814A65938K2082c27088l7432B85963a7656j29007d0827j19876p7697
10515b38400d1270k02494I5140b69771A67669l4294R3706L594B9934e1196D8165
10503f3060B24508a68090p2793H9071r532C5895b12707a1866A43801e4657B97288
10491a35352G9557a45948O8701A00180J6411J8633a62036E6775k073J72834I3440
10479C22408j0395J32362o8067j9704j08475a52358B71555j26331C7934a29990
10468b09102P5370C22041p3247H2623C6790a52748J9718m0648h6057L2210k8494
$$ y = [200504, -25295, -123187, 22100, -226504, 32599, 12793, -731894, -271277, 134793, -229979, -44579, -197829, 228762, -54967, 201580, 119107, 71447, -218775, -349075, -73095, -202814, 165938, 188020, -327088, -364520, 285963, -17656, -146663, -40827, -160703, -238400, -41270, -243764, 95140, -269771, 167669, 133375, 227081, 230675, 29934, -51196, 48165, -63060, 224508, -168090, -240883, 89071, 79539, 35895, -212707, -11866, 143801, -54657, 297288, -135352, 79557, -145948, -77247, 100180, 116591, 135224, -162036, 56775, 54702, 227536, 93440, 322408, 312013, 444375, 376308, 356604, 248129, -152358, 271555, 145224, 37934, -129990, -209102, -133732, 322041, 248794, 82623, 36790, -152748, -133030, -173678, -86057, -53847, -82341]
10457h2341A53905g6687J5645A60375E2065b46938J13567A09164c4580j33767
10447a68347B08390D6786B2160B417J79862D0888a9140E3971b96502J3273A65050
10435a24523M8694C6310J61990D607J15284C6129a38382A75478E6997c16543E0711
10423a46525J7217B67617e9065A25211n1235a29309j29683O9833m7684G758A60
10411A33333a85187I7608a60595F8515a90174K908B2570O0265a32596k1845I0191
10399B48985a36917A19298c4824B29797C3979J63847A7451J34687f8244B59455
10388e2474I7240J16427I9184A8024M37062j41381a58756H2189B6811J9546J32328
10377A78685L2265J33250M1276b8101D7408K88700a07268B68561R0054A16665
$$ y = [-82341, 153905, -76687, -61042, 160375, 52065, -246938, -133371, 109164, -34580, -168347, 208390, 46786, 22160, 2417, 182279, 40888, -19140, 53971, -296502, -283229, 165050, -124523, -75829, 36310, 198300, 4607, 119891, 36129, -138382, 175478, 56997, -316543, 50711, -146525, -129308, 267617, -59065, 125211, 73976, -129309, -258992, -189159, -236843, 7758, 160, 133333, -185187, 97608, -160595, 68515, -190174, -187266, 22570, 82835, -132596, -154441, 90191, 248985, -136917, 119298, -34824, 229797, 33979, 197826, 17451, 152138, -68244, 259455, -52474, 97240, 213667, 99184, 18024, 455086, 313705, -158756, 82189, 26811, 46357, 178685, 210950, 344200, 385476, -28101, 47408, 336108, -107268, 268561, 358615, 116665]
10366D65941r9015l9525L40249F9836R9451K20073J01656A31810K0051r728Q3695
10355B25828J51792q3390P3792K3938p2651J09736J82284j74447R7852B37842
10344C47431l0436J82389A74002M18437G2361K95117l1030J88920k37819j35687
10334A51862n2421l2292f2326C48556B3060a04987q0564C42157j9158A28375Q3079
10323B11454J25300C0385K10276b7948B08117G9305J02680P6578j19352c1760
10312a03747A9191g8492B32787A15961a0463n0198C683I3J98551a15159A10030
10300g0522B7737Q2326J37210i4869A64467M2253d39483d7096j61437C951c7925
10288b31163H930A443a44366N5631I7448h5435k6332C08729A23808R2419e7619
$$ y = [465941, 366926, 327401, 667650, 69836, 169287, 389360, 491016, 131810, 151861, 142133, 225828, 377620, 294230, 368022, 391960, 319309, 429045, 611329, 436882, 534734, 237842, 347431, 316995, 499384, 174002, 592439, 72361, 367478, 336448, 525368, 287549, 151862, 99441, 67149, -62326, 348556, 23060, -104987, -185551, 342157, 322999, 128375, 211454, 336754, 30385, 240661, -27948, 208117, 79305, 181985, 258563, 139211, -31760, -103747, 19191, -78492, 232787, 115961, -10463, -60661, 3683, 93, 198644, -115159, 110030, -70522, 27737, 110063, 247273, -94869, 164467, 206720, -439483, -47096, -208533, 3951, -37925, -231163, 8930, 1443, -144366, -88735, 97448, -85435, -111767, 308729, 123808, 216227, -57619]
10276b7004B63905a18736B10620D2486J8786E717a75175g1160j63819R0419O8621
10265g5939b3289j64910c0367a4603C43552k1330q4567j17187O7372D469M9008
10254E3477a36784A12121N5243f1160A27770L4582B8958e08883a5976C277a07155
10242E4287a49514e7816a6326n5605C25248a58754b0067P877r9336b939k17238
10231b20177A19983a8693l21860a23191j69328R7712a6083l00478e5404d411j36532
10220a40943L5421e1700j16148A74610b12724j21059A97223G1471A1826A88J6734
10209A6922P2842K0080C1700a58392I2801k1381N4943J56540a45801G7886a99126
10197b26929Q8759j62626k4611J41662O4656K5327B16659a72704A45660C7625
$$ y = [-27004, 263905, -118736, 210620, 42486, 61272, 5717, -175175, -71160, -234979, -144560, -75939, -23289, -188199, -30367, -14603, 343552, 322222, 237655, 120468, 187840, 4469, 53477, -136784, 112121, 167364, -61160, 127770, 162352, 28958, -508883, -15976, 3277, -107155, 54287, -149514, -57816, -16326, -71931, 325248, -158754, -20067, -12190, -111526, -2939, -220177, 119983, -18693, -340553, -123191, -292519, -194807, -16083, -316561, -55404, -4411, -140943, -105522, -51700, -167848, 174610, -212724, -333783, 197223, 71471, 11826, 188, 16922, 89764, 109844, 31700, -158392, 92801, 71420, 126363, 282903, -145801, 77886, -199126, -226929, -138170, -300796, -325407, -183745, -119089, -93762, 216659, -172704, 145660, 37625]
10186f127j47965e5821j00791C1477f7342A19476P9629k6565C6346K00629H5028
10174b1504j07062c3437j03417F5394e7561D9212a81997M8846C141d05004J8241
10163c86763a19101d5051k40937I8384b3268j14190d9216n8382j06294o8999p667
10152b90558H9577B9951a06110A4097b62464P6295A20779a89531F8981B3704f2467
10140a68368j29425K6126H9974a1339I2449b5104r3854K5408A20085J13744d6415
10128c0115D1840b22577P2675O3036r588L349d1029k64184J22996d9240k03993
10117b53233B7551i9694k04689A53063n5385C9117a67396g5981m0663K6496F1118
10105a54696q9177k899R4637A11402R0095a61227b8710A04689b60249J07666A36889
$$ y = [-6127, -154092, -55821, -156612, 31477, -67342, 119476, 199105, 172540, 36346, 236975, 85028, -21504, -128566, -33437, -136854, 65394, -57561, 49212, -181997, -133151, 3141, -405004, -386763, -119101, -45051, -285988, 98384, -23268, -137458, -49216, -107598, -213892, -282891, -290558, 89577, 29951, -106110, 14097, -262464, -186169, 120779, -189531, 68981, 23704, -62467, -168368, -297793, -271667, 89974, -11339, 92449, -25104, -118958, -93550, 120085, 233829, -46415, -30115, 41840, -222577, -149902, -86866, -96454, -93105, -41029, -305213, -182217, -49240, -253233, 27551, -99694, -304383, 153063, 97678, 39117, -167396, -75981, -116644, -90148, 61118, -154696, -243873, -246772, -152135, 111402, 201497, -161227, -28710, 104689, -260249, -152583, 136889]
10093B07333c14223A19126g5357j57885H1303B2997J25820o7677b46182C9911
10082E9737B4443e9912j05993H4959b08829O3490j55111j12471L8641P6804B35539
10070a85119g045q253j85352e6361B06349c3179A5839c1187j78448c6588l5825
10059g2413k9942B8405f9810j59110A13514a89218A36819a46865I8034a05522
10048C6381R7451i2472b0719n4692f16k39587R6316b8450j7939n0541B00014h7477
10035d4115k1205J3212A17091B183d625j32569O5114l2092A3217J23343c14653
10023i7942c1187k95125E9936b6341E2828c94148J73143Q2511a9718A15166a23263
10011A68702n8106E0474M9248J22259A01346c8660j3014k27521h2644F4981b16455
$$ y = [207333, -314223, 119126, -75357, -233242, 81303, 22997, 148817, 81140, -246182, 39911, 59737, 24443, -59912, -165905, 84959, -208829, -145339, -300450, -412921, -374280, -297476, 235539, -185119, -7045, -15298, -200650, -56361, 206349, -33179, 15839, -31187, -209635, -36588, -72413, -102355, 28405, -69810, -228920, 113514, -189218, 136819, -146865, 98034, -105522, 36381, 133832, -92472, -20719, -75411, -616, -240203, -143887, -28450, -46389, -96930, 200014, -87477, -44115, -65320, -52108, 117091, 2183, -4625, -137194, -72080, -104172, 13217, 136560, -314653, -97942, -31187, -326312, 59936, -26341, 52828, -394148, -221005, -138494, -19718, 115166, -123263, 168702, 110596, 50474, 99722, 221981, 101346, -38660, -51674, -279195, -82644, 64981, -216455]
9999I9363b86464b1369A79831e7902k64936Q0048N7885a9129A78866b43692C986
9987F9243k6945Q6129b26582I3993N5129e3330J1290k0163B37671a84252p2737
9976b56989j22870R7770J18344D5627J81005h2207n196K6469j4116n50145a02570
9964c00996A06048b44813e5045j95082d7583C3363c9140C03854b10394a03891
9953I2644b42215K2399p34E0019j3925F495L2742L35371c36145f3932A21955J46943
9941B68898A04566b53020A37703m7730e6420a4803r1819J4800j12046B40648e52703
9929b1561A21021A2428J71618a5256o12656C1761b8549k13822D2361J88459b53088
9917b49305j39047B2881a81125C67915d4760n8927j0594k98162i5027l24413E8272
$$ y = [99363, -286464, -21369, 179831, -57902, -322838, -242790, -184905, -19129, 178866, -243692, 3986, 69243, 42298, 128427, -226582, 93993, 149122, -53330, -42040, -62203, 237671, -184252, -256989, -379859, -282089, -163745, 45627, 226632, -82207, -87403, -60934, -75050, -625195, -102570, -300996, 106048, -244813, -55045, -250127, -47583, 33363, -39140, 303854, -210394, -103891, 92644, -242215, -219816, -220550, 50019, 36094, 6495, 39237, 374608, -336145, -63932, 121955, 268898, 104566, -253020, 137703, 89973, -56420, -14803, -106622, -91822, -203868, 240648, -552703, -21561, 121021, 12428, 184046, -15256, -627912, 31761, -28549, -242371, 42361, 230820, -253088, -249305, -388352, 22881, -181125, 367915, -44760, -103687, -114281, -412443, -95027, -419440, 58272]
9905a73255k6971b4732j4886n9419E57647b48020A48534m0471j7075c56467a24736
9893A43400a53028N5153r1558k11432a67266f7970q8843k7867N7987j26279R9099
9882a53873A42970P1166B8820L6551g8446j36251O3969k93955J29478G7308a53649
9870C4731d7874l10712B41683c83327D7097j2622b860C2434J08319L941h313B05910
9857B792b73621k4050Q7890R4435h227l02249a13455c2062L893K399E5976f4108
9844a68357o1286a4702C6048b72633C2994b20379i7446j50029H6577a10952d207
9832a93017F5289J07897q2981a3404o02p5717B22450R1280b76027l5186H6526
9820b04095Q935m096j0444b1842k49422k78155F1494a37278j23508B15799b74584
$$ y = [-173255, -200226, -24732, -39618, -99037, 557647, -248020, 148534, 108063, 90988, -356467, -124736, 143400, -153028, -97875, -189433, -400865, -167266, -67970, -156813, -184680, -126693, -252972, -153873, 142970, 214136, 28820, 65371, -78446, -214697, -150728, -444683, -315205, 77308, -153649, 34731, -47874, -358586, 241683, -383327, 47097, 34475, -2860, 32434, 140753, 144694, -8313, 205910, 2792, -273621, -297671, -209781, -115346, -8227, -310476, -113455, -32062, -28169, -25770, 55976, -64108, -168357, -229643, -14702, 36048, -272633, 32994, -220379, -97446, -247475, 86577, -110952, -4207, -193017, 65289, 173186, 90205, -13404, -14006, -89723, 222450, 313730, -276027, -311213, 86526, -204095, -195160, -199256, -209700, -21842, -271264, -549419, 61494, -137278, -260786, 215799, -274584]
9808a86545P2822A10459d788A23812a96655j13567Q8433A69623E2632c37441B11689
9796D2121b06824R1710I4954b04203P9419c6292m85113b1011m3801p2014a2502
9784g3277c210p515o0579l42709a44506n9039i033k63790e485o6997k79144B81994
9771a18088B42384a3342A81195a40220g844l22284e4702A50626n6249c73205a36261
9759a88001j09379R3641O8725e6946A15247b27050a1587q8242b6936A50236E3331
9747e2181C0362c06328A94077b55574G4455C466a54259A05324H617J28504b60575
9735C5259b00449M1435A2900a944j09151k00410a32720N4263j08640A08856a27496
9723f0808r2094k08658E7822a43992A98929H7934a96879f134G6009a26413B22606
$$ y = [-186545, -113723, 110459, -4788, 123812, -196655, -310222, -221789, 169623, 52632, -337441, 211689, 42121, -206824, -115114, 94954, -204203, -124784, -36292, -521405, -21011, -64812, -136826, -12502, -73277, -3210, -10725, -71304, -414013, -144506, -203545, -9033, -272823, -5485, -72482, -351626, 281994, -118088, 242384, -13342, 181195, -140220, -7844, -330128, -54702, 150626, 94377, -373205, -136261, -188001, -297380, -203739, -135014, -56946, 115247, -227050, -11587, -99829, -26936, 150236, 53331, -52181, 30362, -306328, 194077, -255574, 74455, 3466, -154259, 105324, 8617, 137121, -260575, 35259, -200449, -159014, 12900, -1944, -111095, -311505, -132720, -78457, -187097, 108856, -127496, -60808, -152902, -361560, 57822, -143992, 198929, 87934, -196879, -6134, 76009, -126413, 222606]
9711a10843B16337b28527j04033A30143J61941q3336C7813f5249j41689M6519
9701a60419j1267N1909k29034a21650L5822B28242a91033B6338f8862E303J10818
9690A16121b96267F6646P8142h8701l9105A4791E472L22329D1373d6225j23912
9679a70137P2593k89581G6143b039j0046H4148j5242e8889n1988A07925J00993
9668B08918e1605P667m11447a17891A4493b78519H0507R8235a5286m38082a19877
9656c79012e7371m2496K6088n7560A30725h6122M0228A71224i3581A80263e1192
9644I3531a35360C8455J28346C123J98283b8573D2010a67901k1054P3178K9892
9633h5885j38767D7118h6839a3273G6379b24829A23323c79783B19114D644c26212
$$ y = [-110843, 216337, -228527, -332560, 130143, 292084, 208748, 37813, -65249, -206938, -160419, -171686, -119777, -348811, -121650, -85828, 228242, -191033, 26338, -68862, 5303, 116121, -296267, 66646, 144788, -88701, -127806, 14791, 5472, 327801, 41373, -46225, -170137, -97544, -387125, 76143, -2039, -12085, 84148, 68906, -58889, -110877, 107925, 208918, -51605, -43938, -455385, -117891, 14493, -278519, 80507, 178742, -15286, -453368, -119877, -379012, -57371, -99867, -73779, -131339, 130725, -86122, -45894, 171224, -93581, 180263, -51192, 93531, -135360, 38455, 166801, 3123, 201406, -28573, 42010, -167901, -188955, -115777, -85885, -224652, 47118, -86839, -13273, 76379, -224829, 123323, -379783, 219114, 4644, -326212]
9621c09506c0704B37177a47628q7593j23242B10824F2534i0062A42414f0633D595
9609b87770A37705c1620J1135k59853A83899D921L2710a12252m4796j24469J16349
9598a65168j3714K4089N9302p9467O8205r1542k4096o7619j9394H0032a98862
9586a42103A42122L039d65627A05235m0075G028a16472I633K30039c32532D254
9574d03752J61707Q0885A78803H5783a0242l03158A6220L65336I205J10244M549
9563A23998f0738k36458H2579a83820k211H8225c65977K7432a17840A17823f1672
9551B03124G2471e5286A00469d02223c8354j00758L1220k21506A84147G7975a65273
9539a50660C0555J13057g3417c3239k13891A62581i6591d6984J7879j64053a0695
$$ y = [-309506, -30704, 237177, -147628, -235221, -358463, 210824, 62534, -90062, 142414, -60633, 4595, -287770, 137705, -31620, -20485, -280338, 183899, 4921, 37631, -112252, -157048, -281517, -165168, -178882, -154793, -95491, -174958, -106753, -198295, -222391, -290010, -309404, 80032, -198862, -142103, 142122, 145161, -465627, 105235, 65160, 7028, -116472, 9633, 239672, -332532, 4254, -403752, -242045, -161160, 178803, 85783, -10242, -313400, 16220, 381556, 9205, 119449, 123998, -60738, -297196, 82579, -183820, -186031, 88225, -365977, -338545, -117840, 117823, -61672, 203124, 72471, -55286, 100469, -402223, -38354, -139112, -107892, -329398, 184147, 77975, -165273, -150660, 30555, 143612, -73417, -33239, -247130, 162581, -96591, -46984, -29105, -193158, -10695]
9527e5138A8288L5061a5654k31579a5014k25019A93625J37553h383j17426j3987
9516a39796H9028K69945b31314j30765A48396d1841k11677B78069I0601b14797
9505e6089B69138i4135C0067P5582b57363J07605g2760k64238A23787Q0095a69231
9493C9227a14545n4361N1683B53431b86519A03990a4982B5975K2377d9947j71678
9482b21625J02157j79988M4854b1690B06321q7880h5284A20082b23300P180a8712
9470B00098H9725f2307k28098B40422a2348A1733R319i1517m1579A10864a63237
9458a0227B2117J367g1324A53229o6563f3704A3544a61138M0010m4723I9840l3178
9446F6662d0865k5642A65467a38358r2089c4346G8700g0918l24824B21798a46746
$$ y = [-55138, 18288, 53349, -15654, -247233, -15014, -240033, 193625, 331178, -8383, -125809, -139796, 89028, 358973, -231314, -362079, 148396, -41841, -253518, 278069, 90601, -214797, -56089, 269138, -94135, 30067, 105649, -257363, -149758, -72760, -336998, 123787, 203882, -169231, 39227, -114545, -168906, -117223, 253431, -286519, 103990, -14982, 25975, 48352, -49947, -221625, -119468, -299456, -254602, -21690, 206321, 118441, -85284, 120082, -223300, -216120, -18712, 200098, 89725, -62307, -290405, 240422, -12348, 11733, 21052, -91517, -133096, 110864, -163237, -10227, 22117, 23484, -71324, 153229, 86666, -63704, 13544, -161138, -121128, -165851, 99840, 66662, -40865, -66507, 165467, -138358, -230447, -34346, 78700, -70918, -395742, 221798, -146746]
9434d41537g309C7159d6551I0621f9781l9700A64505N2262G1074d9380k28398
9423b77778B6353M1256J38816e3985A96079b36586a18180j73392a32807d4821
9412A28113E2710b6378p1768l33483J53755Q0751o7789Q3885M8517G0370A2599
9400H6560b81220e1725q713o6001H6193g680n9311b3321j04322A37740K41034
9389C78774a62621c5065q1404j6767Q17m7307A15097P6476b57518C05579r1165
9378B14414a06529k02576a08418B56545b48236J16633K0371o6711o0181A37228
9367a58466A05349a74902A11625f1588j13616A3734P7656d21430a63760D3975
9356f7454j4025l68292a02598H7248i5075A87744d51185a99093j0451k4359n090
$$ y = [-441537, -7309, 37159, -46551, 90621, -69781, -109481, 164505, 216767, 71074, -49380, -277778, 26353, 67609, 206425, -53985, 196079, -236586, -118180, -291572, -132807, -44821, 128113, 52710, -26378, -98146, -431629, -277874, -197123, -264912, -181027, -132510, 70370, 12599, 86560, -281220, -51725, -60438, -126439, 86193, -7680, -66991, -23321, -127643, 137740, 378774, -162621, -35065, -116469, -133236, -132419, -179726, 115097, 191573, -257518, 305579, 214414, -106529, -309105, -108418, 256545, -248236, -131603, -111232, -177943, -238124, 137228, -158466, 105349, -174902, 111625, -61588, -175204, 13734, 91390, -421430, -163760, 43975, -67454, -81479, -449771, -102598, 87248, -95075, 187744, -451185, -199093, -209544, -233903, -238993]
9345b38993A19978J50313I4794R9979r3969M7606a07862A32647e4618A41755a51263
9333d3282j82245K9680A50518b56023L654A32707L30695a40643k8834B01460a87495
9321a70006k563A67032c08424a06422E7226b57443D9911L8813l673f7797k48768
9310c16565K5370e8742A42560N7651d1072B9438b28093d4423H5603j1128b16626
9298I4535a99748a7594A22692b73126j07117A42581D4967c05846a15247K5928
9288h9319G6755O8339n3418b9462k97267Q0767H2154K8095a18289A55635b83723
9276h0502o3262M1690B14028b29655e543k3501k11630A03450a25467L6667A41343
9264F3289a97617E1690a2551l84100J47975m5290A8457O6647L05220b0273r05
$$ y = [-238993, 119978, 270291, 94794, 194773, 100804, 148410, -107862, 132647, -54618, 141755, -151263, -43282, -225527, -195847, 150518, -256023, -252369, 132707, 463402, -140643, -169477, 201460, -187495, -170006, -172569, 167032, -308424, -106422, 57226, -257443, 49911, 88724, 85051, -67797, -316565, -291195, -58742, 142560, 200211, -41072, 29438, -228093, -44423, 85603, 74475, -216626, 94535, -199748, -17594, 122692, -273126, -380243, 142581, 44967, -305846, -115247, -89319, 76755, 145094, 91676, -29462, -326729, -245962, 82154, 110249, -118289, 155635, -283723, -80502, -143764, -102074, 214028, -229655, -5543, -29044, -240674, 103450, -125467, -88800, 141343, 63289, -197617, 51690, -12551, -396651, -248676, -293966, 18457, 85104, 390324, -20273, -21178]
9253b1178j80037A78487a16939J692n1667a3104n03075D7343c53091A20884h2332
9241a71534A42434o835E5639b13496H2662b54281B32654c70405h3920j70348g2598
9229A92309h4177D24828a66306O4737E4685c83386d7552k1486E5166D048K28954
9218B33002c00026O9456G4969a9762n8877m28850B3803b60778M0319D2932K74964
9207C17896c04253A75294a13575j41427n6335L9263a19122j16341Q9590j212e5971
9195A97842b8922j2944j54805e0595j46654h1968I9975j426g2978C92568a18817
9183d1763A02398b12346J00374a4754G875j967Q3332C9355a51683D9645A9901
9171f0944l1944k9873k07421A81401E9135d88676a59140E9860O3269a45988L0509
$$ y = [-21178, -201215, 178487, -116939, -115247, -166914, -13104, -516179, 47343, -353091, 120884, -82332, -171534, 142434, 135599, 55639, -213496, 82662, -254281, 232654, -370405, -83920, -254268, -72598, 192309, -84177, 424828, -166306, -101569, 54685, -383386, -47552, -69038, 55166, 4048, 233002, -300026, -230570, 74969, -19762, -78639, -507489, 23803, -260778, -220459, 42932, 317896, -304253, 175294, -113575, -255002, -311337, -272074, -119122, -235463, -145873, -147085, -55971, 197842, -28922, -41866, -196671, -50595, -197249, -81968, 99975, 98549, -72978, 392568, -118817, -41763, 102398, -212346, -111972, -14754, 7875, 5908, 89240, 39355, -151683, 49645, 19901, -60944, -92888, -122761, -330182, 181401, 59135, -488676, -159140, 59860, 123129, -145988, -115479]
9160a15479k72030A60617E3733c76190D38957h9639j30910G6311c2646j04576
9150a37222o4136J7811A52652a82322C7626c43199B4890M2907a58080k0302C862
9138A10418J33405k3020e4320j11718A18428d09694b4687G1853b06284c5626a0227
9126f0215B50440E9662J68917m0448p1708f8023j14840f4584B503a71423j03048
9115b74471B0851K51881a07529o0420p5675E3006K3793A1217b54900A42728e6719
9103a3352k61376C1706c27679B1230M9635a38718n7476k11319A06099J2256b54180
9091c06021J32212e9727j11555a4707B7024N1998B6025M7725a41604O8964G989
9079E1603a17499J9325c2073l32863J73365g3289F1974e4827k1390C22682a93056
$$ y = [-115479, -387509, 160617, 53733, -376190, 438957, -89639, -220549, 76311, -32646, -137222, -201358, -183547, 152652, -182322, 37626, -343199, 24890, 67797, -158080, -178382, 3862, 110418, 243823, 220803, -54320, -166038, 118428, -409694, -24687, 71853, -206284, -35626, -10227, -60215, 250440, 59662, 228579, 188131, 116423, -68023, -182863, -64584, 2503, -171423, -274471, 20851, 272732, -107529, -167949, -243624, 53006, 76799, 11217, -254900, 142728, -56719, -13352, -274728, 31706, -327679, 21230, 70865, -138718, -196194, -407513, 106099, 118355, -254180, -306021, -173809, -59727, -171282, -14707, 27024, 79022, 26025, 73750, -141604, -72640, 7989, 51603, -117499, -98174, -32073, -364936, -191571, -73289, 61974, -54827, -76217, 322682, -193056]
9067a14275j49682R7828H817L4909a2376j53802B17975k0418a09228b8083n500
9056c3583j13330B06051B5849N2381A658e1398B09563I3760A4326h0377c4989
9044b77968j6726b8985N646k10225f0066A87333C1606o494c1462j28151j28051
9033b87664J28510A33240M1289c7920H4861b49568B52608A10343b8374n9482k390
9022i0246k43970J29571i1486c4532o1370C9258b58312a8772j2117A50588a7692
9010a62682P7841m3826j16395g0178A20150b42396D66O3335K2752B2864a26205
8998a00249j29264B3920J03511m9606c4626C7549g9865k73680J06611m5180C11725
8986a8619k49138h9823E2240N0466a38456G4156P6308J04756c04694O3379g0875
$$ y = [-114275, -263957, -166129, 8817, 43726, -12376, -166178, 217975, 197557, -109228, -28083, -33583, -146913, 206051, 25849, 78230, 1658, -51398, 209563, 93760, 14326, -80377, -34989, -277968, -294694, -28985, -23339, -233564, -60066, 187333, 31606, 25112, -31462, -159613, -287664, -159154, 133240, 174529, -37920, 84861, -249568, 252608, 110343, -28374, -87856, -90246, -334216, -204645, -91486, -34532, -95902, 39258, -258312, -18772, -30889, 150588, -17692, -162682, -84841, -128667, -245062, -70178, 120150, -242396, 466, 63801, 86553, 22864, -126205, -100249, -229513, 23920, 127431, 77825, -34626, 37549, -79865, -353545, -246934, -292114, 311725, -18619, -267757, -89823, 52240, 102706, -138456, 74156, 150464, 255220, -304694, -241315, -70875]
8974a43731G2660P9946e1882g063k25073i9955d5258j68733A03632m9799b248
8962a30309A99657B5993a31129H1205B442b10399C5959b247l15880J24990k19162
8951d12299a66203F5803O2208b23516h9928D7926M65490A46919O249d4258k16583
8940b60841D0657h0560L0443J925M839L529B63273H3639a524C1194j4234L975
8928B0935c4734A66916D3356P3008c8809E66967P85029M0154D83285b85418B37105
8916g6824A76987a92262g6178k81490d3113j83946D75383H6723b10179f8002k4755
8905i2757m7635C9861P0687b21980A5635L8161J4303b00133f1622l17091J69619
8894b09094I3896e6075j66381e8431A7596L6790c29523b4902k52787a06687A80904
$$ y = [-143731, 72660, 152606, -51882, -7063, -232136, -99955, -45258, -213991, 103632, 53833, -2248, -130309, 199657, 25993, -131129, 81205, 2442, -210399, 35959, -2247, -318127, -193137, -412299, -166203, 65803, 128011, -223516, -89928, 47926, 513416, 146919, 153168, -44258, -260841, 40657, -80560, -50117, -48192, -43353, -39824, 263273, 83639, -1524, 31194, 16960, 20935, -34734, 166916, 43356, 116364, -38809, 566967, 1351996, 1392150, 483285, -285418, 237105, -76824, 176987, -192262, -76178, -357668, -43113, -227059, 475383, 86723, -210179, -68002, -92757, -140392, 39861, 110548, -221980, 15635, 53796, 68099, -200133, -61622, -378713, -209094, 93896, -56075, -222456, -58431, 17596, 54386, -329523, -24902, -277689, -106687, 180904]
8882D4502J02333l184a98428K3726A70919a52878F6748K6729c00074m0440A32697
8870G5995a42267A46887b36579Q3564A92943I3570B2529a57718O6815M4487a4001
8858A59673c09086a35711I243e5559k04445F306d18659J47764b0795j807g930
8846a62833k1945F6448R4251b5694j84945A36558d9473K1231D42423k00312a33716
$$ y = [44502, 146835, 143651, -198428, -174702, 170919, -152878, 66748, 93477, -300074, -340514, 132697, 75995, -142267, 146887, -236579, -153015, 192943, 93570, 22529, -157718, -90903, -46416, -14001, 159673, -309086, -135711, 9243, -55559, -260004, 6306, -418659, -270895, -20795, -22602, -7930, -162833, -184778, 66448, 160699, -25694, -210639, 136558, -49473, -28242, 442423, 242111, -133716]
$$ [...]
##END NTUPLES=NMR SPECTRUM
##END=
