##TITLE=AC1452_NESTRI271_7818727_KS3ssZnEED
##JCAMPDX= 6.0         $$ Bruker NMR JCAMP-DX V2.0
##DATA TYPE= NMR SPECTRUM
##DATA CLASS= NTUPLES
##ORIGIN= BRUKER
##OWNER= Administrator
$$ 1.72 TOPSPIN		Version 2.1
$$ 2013-04-30 16:35:37.367 -0700  Administrator@X
$$ Compression mode = diff/dup
##.OBSERVE FREQUENCY= 400.02188249412
##.OBSERVE NUCLEUS= ^1H
##.ACQUISITION MODE= SIMULTANEOUS (DQD)
##.ACQUISITION SCHEME= undefined
##.AVERAGES= 64
##.DIGITISER RES= 22
##SPECTROMETER/DATA SYSTEM= spect
##.PULSE SEQUENCE= noesygpps1d.comp
##.SOLVENT NAME= COFFEE_meoh
##.SHIFT REFERENCE= INTERNAL, COFFEE_meoh, 1, 14.96091
##AUDIT TRAIL= $$ (NUMBER, WHEN, WHO, WHERE, PROCESS, VERSION, WHAT)
$$ ##TITLE= Audit trail, TOPSPIN		Version 2.1
$$ ##JCAMPDX= 5.01
$$ ##ORIGIN= Bruker BioSpin GmbH
$$ ##OWNER= Administrator
$$ $$ E:\/data/COFFEE/nmr/AC1452_NESTRI271_7818727_KS3ssZnEED/12/pdata/1/auditp.txt
$$ ##AUDIT TRAIL=  $$ (NUMBER, WHEN, WHO, WHERE, PROCESS, VERSION, WHAT)
(   1,<2013-04-30 16:35:32.528 -0700>,<Administrator>,<X>,<go>,<TOPSPIN 2.1>,
      <created by zg
	started at 2013-04-30 16:24:02.807 -0700,
	POWCHK enabled, PULCHK disabled,
       configuration hash MD5:
       F7 49 AB AC A2 8D 51 76 73 8D C1 9A A6 38 9F DE
       data hash MD5: 64K
       C8 CD DF EC 12 2A BB 57 97 05 73 B9 E4 6E 9D 78>)
(   2,<2013-04-30 16:35:35.284 -0700>,<Administrator>,<X>,<proc1d>,<TOPSPIN 2.1>,
      <Start of raw data processing
       efp LB = 0.3 FT_mod = 6 PKNL = 1 PHC0 = 0 PHC1 = 0 SI = 128K 
       data hash MD5: 128K
       23 CB 9D D5 47 8F 1B 4C 00 D6 B1 CA E2 22 EF AF>)
(   3,<2013-04-30 16:35:36.279 -0700>,<Administrator>,<X>,<proc1d>,<TOPSPIN 2.1>,
      <pk PHC0 = -78.28308 PHC1 = 0 
       data hash MD5: 128K
       B6 0A 4A EA E0 1E 83 C2 CB 3C AE 32 1E 89 AD E8>)
(   4,<2013-04-30 16:35:36.785 -0700>,<Administrator>,<X>,<proc1d>,<TOPSPIN 2.1>,
      <abs ABSG = 1 
       data hash MD5: 128K
       E3 F9 A2 0E AC B3 A6 44 E8 62 5C AA 80 EE FB D6>)
(   5,<2013-04-30 16:35:36.877 -0700>,<Administrator>,<X>,<proc1d>,<TOPSPIN 2.1>,
      <abs ABSG = 2 
       data hash MD5: 128K
       51 0D 77 D1 A3 BE 43 E1 1E 88 6B 39 C4 C5 14 91>)
(   6,<2013-04-30 16:35:36.969 -0700>,<Administrator>,<X>,<proc1d>,<TOPSPIN 2.1>,
      <abs ABSG = 3 
       data hash MD5: 128K
       E1 24 77 59 0B EF 3C 88 B1 5C 8E 74 5C 55 61 BF>)
(   7,<2013-04-30 16:35:37.061 -0700>,<Administrator>,<X>,<proc1d>,<TOPSPIN 2.1>,
      <abs ABSG = 4 
       data hash MD5: 128K
       7F 34 6A B0 D1 4A 7E D9 15 57 2D 30 73 2F DD 8A>)
(   8,<2013-04-30 16:35:37.168 -0700>,<Administrator>,<X>,<proc1d>,<TOPSPIN 2.1>,
      <abs ABSG = 5 
       data hash MD5: 128K
       E8 BA AC BC 44 01 DE B3 6C 94 F3 1E 37 10 15 DE>)
$$ ##END=
$$ 
$$ $$ hash MD5
$$ $$ 2F 88 4B C4 DF 4E 46 66 BF D5 40 41 F4 93 E7 51
##$RELAX= 
##$RELAX= 
##$RELAX= 
##$RELAX= 
##$RELAX= 
##$RELAX= 
##$RELAX= 
##$RELAX= 
$$ Bruker specific parameters
$$ --------------------------
##$DU= <E:\>
##$EXPNO= 12
$$ [...]
##$TP07= 0
##$TPNAME0= <>
##$TPNAME1= <>
##$TPNAME2= <>
##$TPNAME3= <>
##$TPNAME4= <>
##$TPNAME5= <>
##$TPNAME6= <>
##$TPNAME7= <>
##$TPOAL= (0..7)
0.5 0.5 0.5 0.5 0.5 0.5 0.5 0.5
##$TPOFFS= (0..7)
0 0 0 0 0 0 0 0
##$TUNHIN= 0
##$TUNHOUT= 0
##$TUNXOUT= 0
##$USERA1= <user>
##$USERA2= <user>
##$USERA3= <user>
##$USERA4= <user>
##$USERA5= <user>
##$V9= 5
##$VALIST= <valist>
##$VCLIST= <CCCCCCCCCCCCCCC>
##$VD= 0
##$VDLIST= <DDDDDDDDDDDDDDD>
##$VPLIST= <PPPPPPPPPPPPPPP>
##$VTLIST= <TTTTTTTTTTTTTTT>
##$WBST= 1024
##$WBSW= 4
##$XGAIN= (0..3)
0 0 0 0
##$XL= 0
##$YL= 0
##$YMAX_a= 6131762
##$YMIN_a= -13476917
##$ZGOPTNS= <>
##$ZL1= 120
##$ZL2= 120
##$ZL3= 120
##$ZL4= 120
##$ABSF1= 14.96091
##$ABSF2= -5.597272
##$ABSG= 5
##$ABSL= 3
##$ALPHA= 0
##$AQORDER= 0
##$ASSFAC= 0
##$ASSFACI= 0
##$ASSFACX= 0
##$ASSWID= 0
##$AUNMP= <proc_prof1d_extract.lims>
##$AXLEFT= 0
##$AXNAME= <>
##$AXNUC= <1H>
##$AXRIGHT= 0
##$AXTYPE= 0
##$AXUNIT= <>
##$AZFE= 0.1
##$AZFW= 0.1
##$BCFW= 0
##$BC_mod= 0
##$BYTORDP= 0
##$COROFFS= 0
##$CY= 15
##$DATMOD= 1
##$DC= 0
##$DFILT= <>
##$DTYPP= 0
##$F1P= 0
##$F2P= 0
##$FCOR= 0.5
##$FTSIZE= 131072
##$FT_mod= 6
##$GAMMA= 0
##$GB= 0
##$INTBC= 1
##$INTSCL= 1
##$ISEN= 128
##$LB= 0.3
##$LEV0= 0
##$LPBIN= 0
##$MAXI= 10000
##$MC2= 0
##$MEAN= 0
##$ME_mod= 0
##$MI= 0
##$NCOEF= 0
##$NC_proc= -2
##$NLEV= 6
##$NOISF1= 0
##$NOISF2= 0
##$NSP= 0
##$NTH_PI= 0
##$NZP= 0
##$OFFSET= 14.96091
##$PC= 1
##$PHC0= -78.28308
##$PHC1= 0
##$PH_mod= 1
##$PKNL= yes
##$PPARMOD= 0
##$PPDIAG= 0
##$PPIPTYP= 0
##$PPMPNUM= 2147483647
##$PPRESOL= 1
##$PSCAL= 4
##$PSIGN= 0
##$PYNMP= <proc.py>
##$REVERSE= no
##$SF= 400.020009671046
##$SI= 131072
##$SIGF1= 0
##$SIGF2= 0
##$SINO= 400
##$SIOLD= 131072
##$SPECTYP= <>
##$SREGLST= <1H.CDCl3>
##$SSB= 0
##$STSI= 131072
##$STSR= 0
##$SW_p= 8223.68421052631
##$SYMM= 0
##$S_DEV= 0
##$TDeff= 65536
##$TDoff= 0
##$TI= <>
##$TILT= no
##$TM1= 0
##$TM2= 0
##$TOPLEV= 0
##$USERP1= <user>
##$USERP2= <user>
##$USERP3= <user>
##$USERP4= <user>
##$USERP5= <user>
##$WDW= 1
##$XDIM= 131072
##$YMAX_p= 448020709
##$YMIN_p= -11348
##$CURPLOT= <Network HP LaserJet P1505>
##$CURPRIN= <$Network HP LaserJet P1505>
##$DFORMAT= <normdp>
##$LAYOUT= <+/1D_H.xwp>
##$LFORMAT= <normlp>
##$PFORMAT= <normpl>
##$SURQMSG= 1
$$ End of Bruker specific parameters
$$ ---------------------------------
##NTUPLES= NMR SPECTRUM
##VAR_NAME=  FREQUENCY,     SPECTRUM/REAL,   SPECTRUM/IMAG
##SYMBOL=    X,             R,               I
##VAR_TYPE=  INDEPENDENT,   DEPENDENT,       DEPENDENT
##VAR_FORM=  AFFN,          ASDF,            ASDF
##VAR_DIM=   131072,        131072,          131072
##UNITS=     HZ,            ARBITRARY UNITS, ARBITRARY UNITS
##FACTOR=    0.0627417313425164, 1,          1
##FIRST=     8223.62146879497, -157,         -57791
##LAST=      0,             2259,            -58119
##MIN=       0,             -11348,          0
##MAX=       8223.62146879497, 448020709,    0
$$ Real data points
##PAGE= N=1
##DATA TABLE= (X++(R..R)), XYDATA
$$ [...]
67713 65991 65197 64552 64027 63644 63315 63102 63404 64492 65986 67156 67682 67784 67703 67452 67047 66598 66127 65570
67695 65570 64957 64362 63768 63286 63343 64197 65307 65724 65211 64489 64203 64109 63595 62636 61858 61800 62397 63121 63485 63530
67675 63530 63824 64821 66183 67017 66860 66152 65644 65650 65977 66245 66095 65384 64453 63973 64318 65249 66349 67425 68343
67656 68343 68868 68994 69063 69203 68966 67947 66487 65325 64767 64667 65008 65840 66724 66903 66205 65304 64823 64632
67638 64632 64268 63712 63435 63842 64948 66478 68030 69202 69787 69915 69974 70385 71433 73195 75500 77930 79911
67621 79911 80947 80932 80264 79465 78698 77844 77076 76919 77480 77991 77579 76360 75310 75131 75708 76622 77660 78645
67603 78645 79265 79351 79101 78810 78588 78460 78422 78235 77471 76007 74296 72918 72023 71374 70743 70063 69390 68917 68856
67584 68856 69067 68945 67928 66115 64204 62946 62727 63488 64741 65788 66141 65747 64761 63335 61882 61234
67568 61234 62083 64185 66488 68082 68779 68762 68062 66627 64648 62551 60768 59644 59422 60026 60929 61522 61701
67551 61701 61896 62391 62823 62577 61623 60696 60549 61220 62145 62790 63040 63088 63172 63353 63365 62755 61433 60005 59262
67532 59262 59350 59752 60122 60692 61708 62817 63313 62807 61442 59680 58100 57212 57138 57581 58267 59237 60480 61529
67514 61529 61784 61119 59901 58558 57455 57003 57437 58491 59624 60507 60959 60591 59132 57127 55710 55415
67498 55415 55620 55419 54655 53843 53485 53813 54836 56179 57075 56967 56111 55253 54800 54623 54589 54861 55530 56298 56731
67479 56731 56737 56653 56904 57665 58836 60251 61783 63201 64076 64083 63419 62668 62175 61751 61143 60481 60064 59933 59967 60192
67459 60192 60628 60925 60569 59556 58516 58122 58548 59535 60710 61742 62457 62907 63216 63338 63177 62910 62877 63064
67441 63064 63066 62732 62467 62625 62893 62726 62203 61986 62483 63468 64572 65694 66828 67858 68743 69597 70279 70196 68889
67422 68889 66661 64294 62234 60491 59235 58903 59449 59944 59419 57935 56446 55698 55642 55854 56072 56179 56101
67405 56101 56024 56421 57511 58801 59444 59012 57758 56260 55102 54740 55227 56007 56361 56273 56508 57578 58897
67388 58897 59316 58410 56896 55768 55363 55384 55517 55747 56159 56661 56988 56931 56551 56187 56148 56346 56339 55862 55231 55006
67368 55006 55278 55524 55290 54795 54652 55144 56068 57227 58622 59979 60443 59270 56870 54756 54239 55279 56734
67351 56734 57592 57738 57665 57738 57843 57581 56650 55145 53587 52644 52680 53549 54810 56072 57139 57943 58543 59122
67333 59122 59832 60607 61234 61584 61601 61061 59647 57501 55496 54681 55440 57332 59679 61984 63810 64699 64547
67316 64547 63922 63638 63954 64351 64130 63075 61480 59737 58093 56742 55869 55514 55523 55804 56543 57963 59871
67299 59871 61716 63171 64418 65624 66413 66218 65082 63726 62805 62487 62821 64051 66190 68574 70249 70836
67283 70836 70716 70439 70185 69804 69135 68228 67371 66943 67043 67231 66796 65401 63472 61922 61519 62348 63739 64698
67265 64698 64611 63644 62541 62059 62535 63763 65092 65845 65903 65857 66381 67421 68200 68002 66791 65137 63814 63429
67247 63429 64143 65555 67022 68182 69080 69808 70248 70224 69689 68687 67323 65851 64597 63709 63149 62970 63337
67230 63337 64175 65105 65921 66838 68049 69222 69800 69638 69056 68380 67757 67367 67458 68014 68618 68844 68719 68719 69262
67211 69262 70244 71114 71520 71783 72505 73701 74652 74751 74202 73620 73262 72973 72668 72429 72218 71921 71597 71246 70469
67192 70469 68856 66819 65508 65639 66785 68010 68813 69240 69434 69454 69333 69027 68514 68153 68642 70282 72457
67175 72457 74249 75392 76252 76975 77177 76554 75372 74140 73112 72352 72070 72573 73868 75456 76609 76880
67159 76880 76347 75368 74176 72877 71866 71905 73361 75484 76915 77064 76656 76734 77460 78223 78616 78754 78652 77900
67141 77900 76318 74598 73804 74320 75653 77232 78921 80594 81763 82148 82355 83329 85135 86827 87704 88124
67125 88124 88754 89531 89906 89759 89418 88875 87742 86078 84680 84187 84370 84666 85066 86022 87679 89630 91431
67108 91431 92943 94126 94820 94916 94592 94224 94109 94370 95052 96176 97595 98854 99404 99081 98285 97562 97111 96871
67090 96871 96895 97277 97773 97997 98111 98803 100275 101701 102163 101795 101463 101556 101731 101751 101893 102397 103073 103689 104276
67071 104276 104869 105385 106015 107259 109260 111476 113394 115163 117098 118881 119822 119795 119453 119566 120511 122248
67055 122248 124302 125862 126416 126379 126693 127754 129124 130274 131075 131490 131426 131173 131453 132622 134186 135529 136796
67038 136796 138569 140934 143368 145428 147089 148421 149384 150033 150629 151466 152776 154734 157249 159836 162033
67023 162033 163996 166358 169461 172992 176357 179090 180923 181888 182464 183269 184484 185898 187544 189760 192445
67008 192445 194852 196524 197978 199981 202477 204837 206859 208878 210997 212934 214728 216979 220102 223801
66994 223801 227509 231012 234363 237538 240498 243383 246363 249354 252091 254417 256448 258556 261214 264674
66980 264674 268710 272847 276840 280748 284610 288445 292575 297436 302907 308253 313024 317541 322235 326998
66966 326998 331695 336845 343113 350322 357638 364591 371335 377943 384163 389965 395763 401933 408587 415918
66952 415918 424251 433534 443211 452753 461947 470662 478866 487014 495783 505167 514480 523587 533426 544710
66938 544710 556735 568256 579190 590646 603449 617375 631822 646507 661361 676286 691277
66927 691277 706549 722433 739338 757528 776587 795354 813042 830362 848879 869188 890412
66916 890412 911619 932975 955098 977984 1001226 1024928 1049741 1076075 1103730 1132263 1161313
66905 1161313 1190656 1220347 1250906 1283003 1316772 1351594 1386732 1422150 1458552 1496551 1535874
66894 1535874 1575599 1615122 1654617 1694355 1733946 1772740 1810865 1849280 1888749 1929210 1970231
66883 1970231 2011479 2052467 2092326 2130326 2166405 2200917 2234109 2266141 2297229 2327362 2356057
66872 2356057 2382819 2407680 2430915 2452357 2471288 2486906 2498658 2506407 2510661 2512367 2511962 2508758
66860 2508758 2501786 2491110 2477784 2462513 2444987 2424576 2401129 2374854 2346009 2315104 2283038
66849 2283038 2250572 2217766 2184155 2149303 2113054 2075474 2036831 1997454 1957413 1916456 1874494
66838 1874494 1832064 1790116 1749403 1710160 1672196 1635043 1598118 1561075 1524132 1487929 1452934
66827 1452934 1419027 1385723 1352749 1320336 1288867 1258345 1228411 1198881 1170017 1142072 1114807
66816 1114807 1087764 1060970 1034992 1010237 986450 963002 939509 916156 893613 872648 853499
66805 853499 835532 817757 799735 781769 764233 747174 730722 715374 701438 688406 675325
66794 675325 661659 647515 633213 619038 605366 592524 580407 568535 556623 544883 533665
66783 533665 523054 512972 503481 494768 486844 479400 471975 464289 456477 449002 442238 436061 429902 423247
66769 423247 416035 408608 401380 394558 388019 381401 374475 367563 361449 356641 352716 348615 343607 337847
66755 337847 331960 326355 321086 316175 311745 307855 304369 301005 297419 293374 289054 285077 281817 278815
66741 278815 275337 271565 268535 266575 264453 260808 256071 252094 249871 248449 246311 243106 239597 236401
66727 236401 233423 230299 226834 222996 218880 214821 211339 208826 207273 206274 205287 204065 202922 202367 202325
66712 202325 201866 200022 196922 193902 192306 192199 192326 191370 189141 186465 184088 182038 180064 178237 176785
66697 176785 175673 174749 174006 173239 171740 169048 165909 163696 162764 162177 161219 160271 159690 158786 156785 154229
66681 154229 152421 151735 151389 150744 149886 148834 147155 144764 142436 140931 139980 138637 136490 134178 132702
66666 132702 132493 133090 133608 133402 132387 130878 129302 128069 127453 127408 127655 128019 128483 128765 128221 126538 124286
66649 124286 122421 121303 120517 119511 118074 116354 114753 113707 113223 112820 112201 111752 111929 112494 112898 113178
66633 113178 113755 114470 114632 114079 113397 112924 112282 111174 109938 108899 107799 106333 104809 103769 103246 102749
66617 102749 101803 100266 98446 96988 96251 95665 94297 92264 90914 91177 92334 92972 92671 92142 92064 92456 92947
66600 92947 93054 92395 91129 90017 89626 89707 89804 90082 90871 91695 91592 90401 89017 88251 88042 87865 87411 86645
66582 86645 85688 84822 84362 84384 84778 85530 86567 87449 87647 87188 86654 86508 86667 86709 86199 84973 83474 82593 82727
66563 82727 83162 82950 82191 81741 81813 81756 81345 81259 81930 82698 82716 82075 81456 81156 81027 80981 80971 80747 80200 79727 79818
66542 79818 80404 81065 81609 82041 82171 81776 81054 80500 80290 80150 79813 79307 78800 78413 78162 77930 77551 77081 76820
66523 76820 76952 77377 78028 78943 79812 79917 79029 77971 77679 77977 77973 77501 77384 78190 79414 80130 79867 78633 76649
66504 76649 74435 72763 72109 72279 72732 73022 72843 72078 71045 70352 70237 70349 70380 70522 70976 71397 71331 70923 70672
66485 70672 70641 70514 70368 70777 71963 73321 74058 73968 73322 72381 71389 70749 70713 70977 71036 70954 71310 72275 73226 73631
66465 73631 73894 74702 75765 75898 74564 72716 71706 71771 72106 72158 72149 72292 72176 71352 70184 69612 70083 71044 71597
66446 71597 71510 71382 71902 73037 74103 74557 74515 74461 74654 75018 75429 75837 76168 76358 76481 76589 76441 75762 74814
66427 74814 74362 74886 76034 77032 77373 76959 75887 74465 73269 72813 73134 73837 74503 74918 75047 75045 75157 75407
66409 75407 75452 75019 74401 74194 74600 75268 75825 76198 76314 75871 74670 72994 71453 70506 70210 70288 70291 69841 68890
66390 68890 67751 66792 66152 65798 65727 65949 66272 66279 65635 64507 63646 63858 65193 66802 67834 68356 69030 69948
66372 69948 70421 70135 69884 70582 71984 73071 73507 73854 74393 74561 73933 72996 72378 71861 70815 69298 68029
66355 68029 67455 67551 68449 70425 73062 75121 75728 75253 74639 74263 73903 73423 72904 72273 71364 70378 69765 69608
66337 69608 69543 69363 69271 69402 69540 69539 69671 70205 70896 71232 71091 70836 70801 70955 71102 71212 71489 72116 72928 73336 72785
66316 72785 71409 70075 69626 70184 71318 72593 73704 74290 74100 73361 72633 72271 72286 72695 73573 74666 75396
66299 75396 75572 75741 76493 77613 78278 77961 76805 75205 73464 71953 71225 71665 73095 74870 76304 76996
66283 76996 76936 76446 75948 75620 75266 74622 73795 73284 73513 74350 75108 75097 74268 73359 73350 74646 76756 78748 79982
66264 79982 80440 80505 80587 80912 81462 81977 82137 81876 81484 81295 81261 80963 80039 78553 76914 75526 74574 74063 73921
66245 73921 74054 74378 74873 75604 76615 77773 78791 79508 80120 81003 82193 83188 83434 82902 82015 81095 80157 79267
66227 79267 78768 78936 79628 80416 80991 81294 81433 81597 81979 82645 83562 84769 86221 87455 87805 87257 86688 86798
66209 86798 87167 86975 86383 86363 87134 87630 86871 85185 83576 82446 81504 80555 79731 79081 78503 78024 77731 77518
66191 77518 77307 77461 78480 80298 82244 83729 84604 84868 84491 83626 82612 81605 80507 79377 78613 78553 79160
66174 79160 80197 81468 82802 84032 85060 85761 85840 85188 84333 83989 84089 83892 83333 83483 85107 87373 88803
66157 88803 89088 89130 89537 90083 90576 91184 91661 91264 89949 88795 88537 88436 87457 86044 85654 86727 88146 88842
66139 88842 88997 89292 89782 90083 90222 90621 91412 92297 93049 93790 94752 95977 97291 98367 98879 98790 98471 98418 98827
66120 98827 99524 100209 100672 100845 100793 100632 100401 100113 99936 100119 100602 100937 100852 100672 100915 101565 102082 102047 101498 100637
66100 100637 99581 98487 97628 97196 97178 97512 98183 99172 100491 102247 104425 106618 108246 109079 109308 109118 108568
66083 108568 107942 107739 108107 108599 108779 108763 108897 109171 109289 109073 108468 107342 105687 103920 102618 101950 101680 101730
66065 101730 102416 104026 106239 108109 108661 107680 106022 104939 104984 105700 106436 107104 107902 108666 109011 108951 108911 109101
66047 109101 109279 109165 108767 108195 107435 106425 105244 104190 103688 103960 104683 105228 105475 106123 107830 110271 112476
66030 112476 113922 114812 115440 115867 116180 116470 116500 115940 115015 114401 114360 114527 114694 115189 116202 117342 118237 119105
66012 119105 120272 121528 122385 122765 123064 123707 124884 126476 128062 129315 130515 132304 134713 136939 138370
65997 138370 139374 140706 142654 145224 148648 153007 157718 162080 166124 170244 174190 177134 178761 179693
65983 179693 180807 182584 184992 187414 188768 188326 186528 184452 182492 180133 177010 173454 169862 166220
65969 166220 162518 158988 155586 151869 147791 144130 141635 140184 139260 138800 138938 139208 138772 137535 136485
65954 136485 136716 138327 140367 141740 142180 142467 143632 145850 148290 150181 151755 153852 156832 160344 164067
65939 164067 168130 172622 177075 180791 183523 185620 187559 189549 191553 193469 195121 196214 196577 196539 196850
65924 196850 197980 199574 200878 201743 202900 205089 208186 211453 214486 217526 220901 224557 228313 232286
65910 232286 236774 241795 247011 252106 257002 261569 265313 267640 268451 268284 267803 267281 266695 266118 265786 265814
65894 265814 266066 266355 266582 266567 265891 264137 261286 257764 253950 249693 244521 238432 232343 227464 224166 221677
65878 221677 218920 215439 211479 207531 204035 201213 198834 196283 193247 190208 188002 187027 187146 188158 189846
65863 189846 191679 193058 193950 194749 195359 195042 193465 191407 189865 188799 187332 185140 183045 182031 182048 182161
65847 182161 181753 181198 181185 181661 181876 181465 180957 180931 181133 180945 180463 180385 180886 181362 181431 181521 182078 182761 182937 182633
65827 182633 182568 183402 185300 188038 191250 194783 199052 204766 212057 220109 227922 235146 241863 247951 253123
65812 253123 257348 260733 263104 264137 263754 262010 258804 254187 248823 243603 238912 234781 231579 229857
65798 229857 229478 229688 230234 231693 234279 236966 238432 238587 238549 239252 240588 241905 242912 243860 245139 246998
65782 246998 249632 253362 258633 265808 275022 286208 299192 313730 329583 346675 365141 385100
65770 385100 406314 428001 448816 467034 481008 489713 492856 490450 482528 469394 451920 431416
65758 431416 409454 387910 368704 352968 340670 331450 325560 323488 324969 329149 335693 345005 357293
65745 357293 372169 389494 409857 433706 460467 488999 518521 548536 578056 605424 628933
65734 628933 647413 660377 667863 669986 666399 656433 640021 618288 592916 565154 535769 505691
65722 505691 476153 448107 421807 397064 373718 351901 332003 314346 298800 284865 272265
65711 272265 261191 251751 243525 236097 229725 224884 221199 217492 213048 208342 204259 201064 198467 196319
65697 196319 194779 193902 193497 193431 193736 194344 194901 195016 194684 194340 194458 195114 195946 196598 197206 198408 200847 204632
65679 204632 209241 213978 218596 223509 229398 236653 245269 255191 266494 279289 293772 310575 330677
65666 330677 354587 381746 411147 442462 476129 512260 549774 586687 621013 651396 677359
65655 677359 699240 717600 732358 742636 747753 748347 746331 743774 741890 740878 740426 740369 741093 743298
65641 743298 747201 751902 755669 756893 754758 749070 739648 725940 707187 683054 654201 622164 588385
65628 588385 553427 517354 480849 445530 412960 383641 357257 333537 312474 293862 277244
65617 277244 262457 249802 239461 231044 223937 217855 212747 208428 204617 201282 198544 196292 194177
65604 194177 191965 189636 187181 184679 182637 181767 182116 182706 182374 180899 179064 177780 177424 177896 178903 180117
65588 180117 181365 182840 184976 187966 191512 195148 198763 202717 207453 213067 219287 225927 233407 242806
65574 242806 255250 271196 290296 311886 335544 361247 389126 419124 450787 483314 515859
65563 515859 547712 578035 605389 627811 643681 652594 655267 652503 644376 630466 610772 586193
65551 586193 558108 527714 495903 463564 431706 401179 372517 346160 322654 302389 285210
65540 285210 270525 257873 247253 238795 232247 226981 222489 218726 215886 213998 212970 212933 214146 216344
65526 216344 218489 219540 219321 218223 216183 212647 207695 202510 198209 194663 191048 187221 183759 180784
65512 180784 177666 174165 171128 169533 169263 169365 169320 169552 170728 172899 175390 177333 178297 178510 178462 178274 177607
65495 177607 176217 174395 172720 171641 171490 172554 174756 177439 179883 182092 184797 188691 193882 199981
65481 199981 206382 212454 217765 222211 225776 228258 229448 229518 228866 227636 225749 223360 220825 218133 214857
65466 214857 210870 206668 202750 199048 195258 191339 187316 183014 178480 174470 171932 171029 171029 171032 170471 169080
65450 169080 166942 164647 162975 162269 162377 163092 164256 165479 166379 167244 168877 171499 174276 176315 177760
65435 177760 179446 181762 184349 186729 188779 190613 192522 195054 198744 203517 208543 212786 215571 216662
65421 216662 216080 214061 211094 207790 204672 202045 200008 198556 197688 197394 197612 198284 199444 201065 202746
65406 202746 203816 203939 203496 203132 203050 202943 202509 201775 200984 200422 200317 200709 201476 202666 204650 207608 211054
65389 211054 214287 217284 220580 224136 226896 227832 227034 225387 223474 221294 218874 216568 214628 212872 210968
65374 210968 208877 206840 205052 203471 201959 200597 199823 200155 201678 203847 205940 207673 209294 211170 213473
65359 213473 216228 219516 223551 228619 234936 242482 250955 260042 269704 280065 291000 301967 312351
65346 312351 321810 330178 337151 342305 345465 346867 346888 345704 343270 339579 334804 329231 323189 316987 310735
65331 310735 304200 296954 288745 279656 269991 260244 251172 243560 237666 233140 229712 227666 227274 228000 228756
65316 228756 228906 228600 228102 227273 225817 223610 220650 217076 213424 210414 208204 206187 203787 201117 198596
65301 198596 196331 194270 192624 191637 191179 191026 191314 192261 193634 195047 196675 199101 202468 206291 210022
65286 210022 213228 215260 215449 213887 211445 208856 206304 204003 202420 201548 200626 199177 197826 197503 198246
65271 198246 199399 200628 202009 203377 204408 205324 206768 208842 210877 212368 213584 215061 216977 219286
65257 219286 222042 225300 228978 233052 237605 242505 247318 251679 255372 257897 258388 256255 251615 244909
65243 244909 236587 227524 219120 212296 206662 201322 196242 192162 189328 187146 185168 183678 183074 183297 184165
65228 184165 185668 187608 189430 190829 192096 193497 194650 194960 194392 193410 192390 191416 190427 189229 187675
65213 187675 186119 185345 185634 186265 186492 186649 187641 189607 191847 193957 196194 198668 200948 202730 204201 205447
65197 205447 206062 205689 204438 202480 199767 196523 193494 191241 189574 188087 186896 186347 186397 186819 187756 189457
65181 189457 191587 193380 194541 195566 197121 199369 201926 204229 205976 207383 208881 210356 210966 210042 207918
65166 207918 205427 202818 199745 196304 193458 192166 192431 193352 193900 193637 192992 192897 193885 195442 196490 196537 196111
65149 196111 196054 196744 198038 199664 201497 203655 206442 210064 214449 219550 225719 233346 242129 251126 259662
65134 259662 267854 276082 284411 292798 301508 310896 320839 330722 339950 348389 356326 364148 372036 379897
65120 379897 387585 395125 402555 409551 415367 419205 420588 419544 416607 412486 407352 400514 391162 379434
65106 379434 366371 352793 338758 324235 309784 296197 283874 272899 263416 255477 248657 242252
65094 242252 235836 229463 223378 217800 212914 208901 205885 203794 202223 200610 198874 197787 198229 200088
65080 200088 202381 204458 206399 208008 208363 207026 205042 203823 203418 202804 201687 201006 201518 202755 203747 204173
65064 204173 204391 204749 205285 205846 206236 206425 206773 207848 209833 212282 214538 216228 217312 217915 218209 218285 218044
65047 218044 217385 216465 215555 214614 213358 211742 210053 208426 206650 204617 202619 200956 199547 198201 197069
65032 197069 196530 196680 197047 196787 195140 191989 188094 184506 181635 179131 176763 174903 173794 172844 171285
65017 171285 169413 168489 169281 171177 172985 174240 175436 177206 179639 182419 185328 188414 191683 194844 197646
65002 197646 200506 204525 210558 218266 226266 233182 238490 242479 245721 248563 250846 252009 251700 250398
64988 250398 249220 249040 249928 251536 253744 256747 260780 266033 272698 280671 289183 296946 302807 306201 307009
64973 307009 305256 300992 294403 286002 276773 267930 260215 253438 247000 240879 235760 232064 229291 226557
64959 226557 223474 220189 216885 213766 211284 209792 208925 207845 206232 204625 203652 203320 203280 203388 203670 203971
64943 203971 203974 203504 202623 201596 200851 200717 201000 201114 200892 200975 202037 203884 205739 207238 208625 210074 211365
64926 211365 212280 212832 212947 212417 211367 210367 209735 209042 207672 205724 203994 203112 202966 202996 202808 202414 202007
64909 202007 201666 201365 201258 201794 203405 206103 209555 213546 218175 223572 229671 236387 243834 252172 261338
64894 261338 271067 281150 291609 302627 314287 326345 338318 349952 361520 373467 385790 398139
64882 398139 410502 423334 436662 449326 459391 465212 465996 461735 453072 441216 427604 413448
64870 413448 399576 386520 374633 364307 356157 350686 347548 345515 343582 341771 340404 338923 336243
64857 336243 332069 327026 321329 314211 305058 294415 283386 272622 262481 253613 246537 240808 235299
64844 235299 229409 223565 218658 215370 213861 213559 213323 212407 211208 210559 210421 210028 209240 208778 208852 208537 207139
64827 207139 205404 204531 204507 204383 203928 204027 205363 207538 209760 211839 214198 217308 221329 225994 230647 234673
64811 234673 238082 241507 245612 250737 257016 264405 272502 280755 289040 297655 306599 315200 322591 328105
64797 328105 331091 330984 328044 323556 318663 313224 306406 298244 290007 283061 277900 274351 272089 270692
64783 270692 269694 269008 269111 270432 272652 274860 276443 277589 278856 280398 281802 282724 283578 285420 289085
64768 289085 294525 300998 307803 314860 322744 332215 343501 355889 368143 379439 389783 399470 408500
64755 408500 416814 424864 433467 443014 453096 463015 472589 482459 493657 506713 520962 534716 546188
64742 546188 554109 557536 555626 548117 535791 519933 501406 480771 459234 438808 421208 406930
64730 406930 395586 386793 380399 376098 373224 370995 368922 366996 365404 363985 362165 359703 357357 356381
64716 356381 357425 360343 365050 371939 381251 392549 405189 418799 432883 446308 457746 466464 472213
64703 472213 474409 471989 464274 451785 436068 418784 400971 383066 365494 349046 334506 322024
64691 322024 311198 301749 293701 286856 280647 274900 270247 267294 265663 264433 263357 263029 263876 265564
64677 265564 267586 270006 273315 277787 283206 289156 295441 302220 309723 317872 326343 335025 344046 353078
64663 353078 360978 366571 369570 370204 368164 362815 354584 345368 336997 329785 323008 316374 310396 305621
64649 305621 302161 300016 299187 299320 299765 300285 301371 303563 306707 310285 314291 319369 326021 334056 343033
64634 343033 352996 364526 378171 394102 412199 432097 452907 473138 491248 506345 518280 527014
64622 527014 531951 531989 526260 514930 499308 481135 461729 441814 422015 403175 386063 370982
64610 370982 357934 347002 338251 331267 325145 319177 313431 308499 304766 302036 299801 297692 295563 293289
64596 293289 290647 287570 284430 281963 280795 281001 282109 283489 284846 286526 289342 293908 300045 306979
64582 306979 314232 322197 331747 343473 357504 373817 392271 412261 432675 452457 471143 488808
64570 488808 505551 521066 534587 545192 552263 555728 555788 552427 545275 534018 518947 501120 482058
64557 482058 463188 445372 428855 413692 400155 388606 379067 371167 364577 359277 355279 352359 350298
64544 350298 349262 349616 351282 353525 355549 357236 359156 361906 365491 369265 372270 373574 372482 368665
64530 368665 362224 353612 343515 332795 322443 313357 305992 300158 295188 290422 285747 281729 279120
64517 279120 278108 278135 278549 279228 280342 281726 282964 284060 285508 287511 289586 291206 292451 293674 294920
64502 294920 296224 298230 301886 307483 314488 322374 331175 341080 351929 363297 374664 385250 393997
64489 393997 400107 403535 404780 404328 402532 399929 397354 395663 395384 396662 399473 403846 409752 416639 423226
64474 423226 428065 430409 430310 427920 423171 416362 408579 401029 394141 387771 382161 378149 376412 377031 379977
64459 379977 385406 392995 401336 408679 414247 418341 421063 421604 419203 414473 409157 404611 400889 397371
64445 397371 393830 390727 388823 388802 390990 395070 400179 405632 411563 418731 427822 439179 453002 469381
64431 469381 488139 509072 532452 558995 589236 623349 661788 705783 756975 816899 887162
64420 887162 969900 1067711 1183364 1319787 1479694 1663832 1868654 2085626 2303383 2511535
64410 2511535 2703958 2879940 3042374 3193638 3331729 3449731 3538919 3592575 3607809 3585692
64400 3585692 3531118 3451693 3354285 3240788 3107314 2948395 2762648 2555136 2335574 2115001
64390 2115001 1903190 1707081 1530122 1372878 1234544 1114055 1010147 921109 845014 780159
64380 780159 725119 678512 638922 605126 576375 552496 533522 518956 507444 497517 488681 481370
64368 481370 475737 470865 465358 458320 449502 438974 427154 414905 403050 391760 380769 370071
64356 370071 360055 350961 342613 334784 327528 321058 315562 311298 308754 308525 310940 315630 321484 327223
64342 327223 332177 336389 339944 342526 343741 343485 341725 338335 333544 328171 322991 318171 313787 310380
64328 310380 308282 306830 305236 304057 304706 307390 310666 313337 315718 318413 320848 322024 322160 322614 324381
64313 324381 327467 331567 336589 342349 348293 353632 357516 359098 357828 353751 347338 339109 329543 319159
64299 319159 308417 297707 287642 278984 271948 265812 259717 253645 248261 243982 240752 238549 237496
64286 237496 237396 237683 237997 238422 239132 240206 241916 244730 248777 253566 258506 263489 268834 274784 281260
64271 281260 287985 294777 301783 309376 317659 326056 333542 339280 342914 344394 343895 341993 339596 337480
64257 337480 336029 335462 336053 337891 340504 342954 344346 344187 342280 338407 332359 324284 314894 305052 295220
64242 295220 285501 276161 267727 260488 254279 248962 244728 241635 239260 237213 235718 235231 235734 236876 238550
64227 238550 240763 243140 245235 247259 249765 252562 254698 255749 256439 257639 259352 261088 262674 264081
64213 264081 264841 264329 262577 260312 258158 256147 254023 251708 249378 247293 245660 244624 244267 244548 245200
64198 245200 245849 246399 247169 248438 249986 251468 253118 255562 258906 262580 266331 270813 276902 284841 294402
64183 294402 305457 317938 331546 345907 360668 375003 387355 396245 401163 402266 399549 392983
64171 392983 383280 371776 359513 347033 335091 324707 316155 308443 300277 291346 282395 274334 267505
64158 267505 261630 256248 251320 247428 245125 244081 243289 242246 241504 241824 243237 245311 247977 251572 256259
64143 256259 261831 268000 274490 280957 287145 293041 298465 302678 304911 305275 304570 303130 300464 296313 291480
64128 291480 287082 283382 279915 276556 273856 272323 271902 272277 273298 274884 276853 279047 281484 284312 287829
64113 287829 292604 299206 307543 316719 325829 334784 344084 353959 363927 373111 380693 386208 389778 392089
64099 392089 393865 395309 396266 396981 398447 401894 407962 416291 425657 434550 441915 447478 451240 452740 451121
64084 451121 445952 437721 427480 416309 405179 394859 385570 376926 368457 360070 351926 344203 337260
64071 337260 331688 327711 324641 321389 317572 313849 311195 310139 310751 312904 316259 320122 323573 325864
64057 325864 326747 326573 326098 326139 327326 330002 334102 338985 343644 347411 350486 353644 357429 361725 365958
64042 365958 369470 371875 373396 374900 377262 380561 384107 387299 390185 393046 395711 397612 398434 398375 397663
64027 397663 396080 393281 389568 386028 383625 382355 381672 381674 383308 387126 392360 397643 402295 406293 409258
64012 409258 410214 408497 404303 398217 390719 382419 374280 367171 361382 356743 352957 349615 346241 342666
63998 342666 339090 335577 331804 327687 323980 321761 321395 322286 323572 324813 326126 327981 330809 334513 338408
63983 338408 341850 344846 347864 351276 355268 360055 365681 371687 377478 383054 388919 395238 401574 407580
63969 407580 413399 419032 423781 426889 428672 430563 433944 439103 445402 452240 459720 468464 478914 490986
63955 490986 504356 518925 534906 552700 572893 596290 623639 655402 692038 734478 783990
63944 783990 841604 907992 983931 1070442 1168297 1277665 1398277 1529554 1670482 1819825
63934 1819825 1976628 2140000 2308019 2477237 2643607 2803426 2952892 3087377 3202245
63925 3202245 3294593 3363637 3409332 3431199 3428572 3401172 3348934 3271787 3170404 3047327 2907062
63914 2907062 2754956 2595882 2433585 2270801 2109748 1952615 1801647 1658864 1525824
63905 1525824 1403735 1293653 1196319 1111712 1038881 976365 922929 877839 840400 809456 783666
63894 783666 762293 745323 732550 722896 714946 707933 701762 696288 691131 686169 681624 677499 673480
63881 673480 669657 666927 666314 668142 672186 678380 687029 698497 713008 730705 751690 776071 804077
63868 804077 835959 871612 910585 952811 999161 1050851 1108244 1170425 1235962 1303848 1373732
63857 1373732 1445464 1518551 1591974 1664478 1734985 1802556 1865910 1923299 1973187 2014987 2048834
63846 2048834 2074647 2091675 2098892 2095622 2081773 2057719 2024084 1981543 1930776 1872684 1808477 1739375
63834 1739375 1666301 1590157 1512335 1434647 1358642 1285108 1214264 1146203 1081208 1019867 962878
63823 962878 910476 862031 816557 773749 734267 698864 667543 639738 614983 593150 574271
63812 574271 558509 546103 536968 530379 525391 521548 518813 516776 514370 510490 504577 496408 485771
63799 485771 472825 458545 444254 430640 417573 404911 393022 382319 372690 363702 355125 346946
63787 346946 339165 331943 325719 320699 316375 312064 307843 304397 301935 299880 297779 295861 294391 293096
63773 293096 291676 290376 289537 288915 288025 286853 285654 284330 282647 280895 279649 278895 278058 276958 276107 275877
63757 275877 275921 275706 275172 274606 274134 273589 272720 271469 270263 269910 270826 272349 273348 273535 273738 274721 276326 278002
63739 278002 279582 281164 282631 283821 284913 286247 287936 289897 292146 294829 298088 301935 305986 309374
63725 309374 311451 312779 314829 318413 322924 327462 332060 337229 342907 348657 354516 360717 366690 371188
63711 371188 373524 374064 373498 372213 370466 368457 366035 362806 358754 354387 350190 346387 343296 341334 340418
63696 340418 339888 339295 338892 339076 339762 340726 342202 344666 348116 351934 355502 358779 362204 366043 369803 372482
63680 372482 373599 373836 374280 375117 375659 375670 375996 377519 380075 382896 385676 388621 391691 394469 396792 398985
63664 398985 401348 403749 405831 407408 408553 409446 410129 410277 409247 406560 402371 397397 392416 387812 383399
63649 383399 378558 372851 366760 361582 358281 356619 355829 355886 357533 361120 366084 371801 378366 386126 394858
63634 394858 403909 412939 422088 431473 440909 450133 458966 467161 474395 480609 486268 492061 498298 504729
63620 504729 511076 517778 526028 536829 550013 564447 579297 594890 612207 631870 653957 678583
63608 678583 706140 736861 770474 806462 844434 884204 925685 968719 1012619 1055609 1094907
63597 1094907 1127631 1151653 1165796 1169887 1165106 1153991 1139443 1123613 1107856 1093276 1080488 1068729
63585 1068729 1055905 1039950 1019926 995752 967519 935664 901448 866603 832442 799611 768593
63574 768593 739954 714046 690884 670516 653205 639068 627778 618867 612222 608093 606642 607619 610466
63561 610466 614602 619579 625112 631131 637899 645966 655797 667412 680556 695215 711777 730556 751510
63548 751510 774793 801453 833237 871654 917533 971532 1034773 1108457 1192203 1281919 1368775
63537 1368775 1441002 1488549 1507708 1502065 1479208 1446555 1409652 1372736 1339177 1310835 1287608
63526 1287608 1268194 1251205 1235362 1218927 1199533 1174887 1143692 1105995 1062960 1016464 968743
63515 968743 921959 877732 836908 799724 766082 735693 708133 683036 660325 640224 622935
63504 622935 608264 595443 583303 570800 557640 544441 532094 520851 510106 499091 487723
63493 487723 476761 467240 459746 454099 449548 445283 440903 436556 432724 429850 427999 426801 425855 425294
63479 425294 425783 427736 430644 433547 436192 439392 444047 450101 456622 462692 467897 472141 475461 478131
63465 478131 480610 483107 485265 486503 486720 486582 487064 488743 491539 495065 499043 503299 507418 510664 512448
63450 512448 512887 512811 513087 513975 515179 516505 518282 521077 525150 530438 536998 545183 555328 567543 582004
63435 582004 599354 620666 647237 680672 723098 776869 843390 921266 1004719 1083857 1147855
63424 1147855 1189573 1208105 1207400 1193057 1170616 1145656 1123473 1107775 1100192 1101505 1112767 1134672
63412 1134672 1166365 1205635 1250199 1298228 1347508 1394528 1434751 1463994 1479989 1483103 1475759 1461081
63400 1461081 1441936 1420821 1399868 1380383 1362449 1345135 1326903 1305768 1279644 1247232 1208627
63389 1208627 1164850 1117034 1066456 1015099 965355 918885 876022 836421 799952 766877 737500
63378 737500 711927 690016 671405 655695 642685 632383 624763 619710 617228 617551 620974 627592 637156
63365 637156 649078 662733 678008 695532 716149 740209 767571 798233 832535 870746 912834
63354 912834 958750 1008611 1062329 1119283 1178487 1238774 1298518 1355307 1406161 1448186 1479147
63343 1479147 1497878 1504556 1500664 1488553 1470990 1450882 1430844 1412523 1396172 1380933 1365331 1347485
63331 1347485 1325299 1297101 1262316 1221462 1175700 1126704 1076780 1028374 983066 941268 903209
63320 903209 870049 843726 825923 817642 819611 831945 852209 873668 886509 882296 858361 818571
63308 818571 770241 720160 672527 629229 591026 558340 531252 509147 490775 474937 461149
63297 461149 449435 439585 430966 423158 416331 410677 405801 401055 396281 391787 387620 383331 378541 373426
63283 373426 368527 364265 360749 357810 355152 352659 350615 349363 348694 347887 346568 345273 344940 345999 348175
63268 348175 350991 354075 357063 359568 361435 362897 364409 366358 368859 371708 374556 377238 379931 382927
63254 382927 386387 390433 395314 401252 408109 415373 422433 428762 434061 438567 443125 448586 455103 462315
63240 462315 470149 478953 488804 499289 510262 522324 536055 551165 566881 582990 599934 618002
63228 618002 637016 656858 677720 699547 721632 743081 763608 783660 803902 824656 845750
63217 845750 866786 887619 908629 930432 953324 977059 1001005 1024232 1045434 1063145 1076270
63206 1076270 1084283 1086861 1083545 1073970 1058292 1037199 1011622 982630 951473 919375 887119 855021
63194 855021 823513 793687 766976 744147 724858 708494 695277 686056 680994 679155 679779 683432 691205
63181 691205 703032 717555 733593 751032 770128 790628 811874 833185 853743 872602 889283
63170 889283 904137 917770 930455 942337 953755 964769 974621 982200 986859 988394 986435 980490 970468
63157 970468 956593 938750 916503 889935 860060 828220 795428 762435 730089 699285 670653
63146 670653 644420 620476 598572 578709 561372 547086 535589 525666 516136 506916 498930 492937
63134 492937 488627 484977 481406 478321 476375 475379 474375 472817 471249 470568 471006 472209 473908 475915 477674
63119 477674 478594 478980 480008 482499 486158 490257 494549 499084 503490 507106 509824 512370 515563 519473 523387
63104 523387 526512 528628 530139 531586 533207 535015 537110 539720 542940 546707 551028 556020 561748 568312
63090 568312 576176 585979 597690 610133 621585 630755 636972 639749 638742 634276 627510 619761 611771
63077 611771 603831 596471 590662 587181 585960 586311 587721 590195 593850 598545 604124 610726 618540 627398
63063 627398 637039 647685 659965 674157 689887 706767 725029 745304 768012 793214 820944 851467
63051 851467 885180 922374 963028 1006833 1053565 1103412 1156615 1212688 1270278 1328028 1385321
63040 1385321 1441982 1497640 1551940 1605254 1658561 1712450 1766671 1820887 1875430 1930878 1987052
63029 1987052 2042815 2096753 2147519 2193397 2231953 2260621 2277561 2281705 2272186 2248294 2210247 2159728
63017 2159728 2099322 2031537 1958505 1882351 1805322 1729432 1656228 1586984 1522947 1465328 1415171
63006 1415171 1373264 1339997 1315262 1298600 1289503 1287507 1292098 1302660 1318433 1338304 1360753 1384325
62994 1384325 1408179 1431957 1455156 1477081 1497480 1516886 1536190 1556204 1577629 1600834 1625218
62983 1625218 1649134 1670936 1689902 1705803 1717890 1724806 1725350 1718738 1704177 1680866 1648706 1608667
62971 1608667 1562232 1510771 1455615 1398324 1340491 1283420 1228253 1176170 1128057 1083973 1043318
62960 1043318 1005655 971132 939999 911978 886419 862932 841502 821913 803379 785013 766581
62949 766581 748563 731494 715419 699971 684829 670027 655959 643137 631805 621630 611791 601497
62937 601497 590564 579598 569602 561231 554292 548056 542113 536742 532237 528158 523708 518768 514111 510512
62923 510512 508134 506924 507048 508489 510518 512089 512681 512410 511502 510124 508767 508299 509325 511639 514488
62908 514488 517346 520384 524134 528640 532912 535422 535369 533348 530616 527827 524794 521374 518118 515821 514748
62893 514748 514611 515128 516243 517751 519027 519374 518541 516746 514208 510927 506984 502920 499556 497531 497107
62878 497107 498292 500773 503765 506284 507823 508610 509076 509241 508784 507557 505762 503685 501427 498848 495753
62863 495753 492172 488498 485180 482221 479221 476050 473230 471413 470658 470493 470529 470700 471023 471535 472472 474116
62847 474116 476330 478484 480046 481094 482136 483510 485173 486977 488973 491249 493522 495139 495733 495743 495924
62832 495924 496286 495967 494439 492477 491521 492289 494427 497291 500517 503862 507182 510811 515384 520885 526232
62817 526232 530299 533153 535810 538854 541827 544107 545897 548006 550874 554213 557552 560777 564036 567467
62803 567467 571218 575508 580403 585698 591317 597739 605596 614845 624706 634560 644587 655415 667408
62790 667408 680516 694551 709391 725206 742695 762889 786513 813821 845255 881858 924596
62779 924596 973588 1028451 1089166 1156067 1229128 1307890 1392028 1481332 1574950 1671165 1768053
62768 1768053 1863849 1956430 2043005 2120750 2187538 2241759 2281799 2306128 2313818 2304745 2279441 2239043
62756 2239043 2185228 2119854 2044654 1961443 1872536 1780655 1688273 1597141 1508389 1422958 1341776
62745 1341776 1265542 1194471 1128451 1067520 1011943 961656 915872 873681 835015 800557 770569
62734 770569 744253 720574 699380 681254 666357 653837 642469 631620 621454 612350 604372 597386
62722 597386 591478 586972 583874 581616 579721 578592 579194 581883 585945 590455 595175 600362 606156 612641
62708 612641 620325 629994 642147 656969 674805 696096 720733 748020 777718 810676 847901 889118
62696 889118 932905 978371 1026161 1077454 1132428 1190271 1250429 1313037 1377916 1443712 1508360
62685 1508360 1569928 1626496 1675583 1714487 1741328 1755398 1756518 1744544 1719739 1683214 1636703
62674 1636703 1582049 1521071 1455715 1388036 1319921 1252769 1187345 1124067 1063599 1007095 955566
62663 955566 909062 866826 828235 793120 761180 731677 704128 678880 656554 637097 619798
62652 619798 604155 590397 579084 570312 563223 556274 548266 539308 530521 522651 515318 507906 500697
62639 500697 494528 489588 485351 481717 479502 479441 481188 483660 486077 488250 490073 491145 491019 489630 487440
62624 487440 485152 483217 481560 479897 478305 477238 476899 476882 476743 476736 477585 479575 482240 485120 488472 492954
62608 492954 498727 505183 511563 517644 523774 530368 537529 545154 553373 562769 574044 587490 602992
62595 602992 620657 641190 665357 693270 724568 759170 797399 839259 884136 931320 980274
62584 980274 1029926 1078080 1122092 1160082 1191174 1214809 1230323 1237145 1235003 1223975 1204719 1178572
62572 1178572 1146956 1110682 1070215 1026614 981676 937053 893653 851967 812517 775714 741679
62561 741679 710482 682289 657070 634452 614122 596162 580805 568046 557626 549127 541885 535099
62549 535099 528214 521094 513722 506032 498189 490809 484670 480297 477796 476777 476446 476175 476129 477027 479186
62534 479186 482167 485387 488475 490887 491890 491437 490547 490309 490878 491965 493892 497504 503250 510895 519992
62519 519992 530190 541335 553758 568247 585205 604049 624019 645427 669524 697236 728610
62508 728610 763370 801257 841714 883799 926614 969374 1011026 1050205 1085663 1116358 1141275
62497 1141275 1159661 1171520 1177305 1177135 1170922 1159428 1144641 1128916 1114173 1101924 1093337 1088862
62485 1088862 1088293 1091603 1099365 1112170 1130088 1153024 1181134 1214501 1252720 1294916 1339453 1383056
62473 1383056 1420892 1448747 1465540 1473398 1475115 1471454 1460508 1439136 1405244 1359371 1304501 1244311
62461 1244311 1181442 1117226 1052501 988259 925683 865935 809977 758469 711891 670864 636005
62450 636005 607241 583572 563881 547796 535319 525857 518217 511652 506386 502912 501157 500545 500613 501303
62436 501303 502807 505224 508268 511231 513461 514976 516415 518194 519910 520705 520073 518077 514942 510782 505787
62421 505787 500422 495234 490483 486061 481733 477419 473284 469603 466501 463743 460847 457498 453872 450450
62407 450450 447535 445106 443095 441487 440018 438105 435486 432801 431056 430452 430191 429613 429136 429794 432124
62392 432124 435931 440888 446861 453535 460170 466021 470870 474962 478571 481792 484718 487587 490691 494271
62378 494271 498624 504211 511440 520299 530273 540748 551404 562199 573129 584153 595255 606411
62366 606411 617645 629389 642668 658583 677525 699189 723422 750730 781826 817145 857149
62355 857149 902877 955690 1016374 1084641 1159320 1238772 1321068 1403983 1484805 1560132 1626208
62344 1626208 1680011 1720228 1747117 1761616 1764809 1757981 1742441 1718904 1687349 1647722 1600630 1547325
62332 1547325 1489369 1428557 1366836 1305890 1246906 1190946 1139229 1092576 1050720 1012679 977820
62321 977820 946058 916981 889472 862587 836346 811121 786541 761734 736603 712238 689812
62310 689812 669518 650897 633800 618507 605067 593064 582175 572596 564662 558255 552846 548061
62298 548061 543981 540821 538497 536604 534757 532832 530920 529172 527727 526734 526328 526564 527298 528239 529233 530627
62282 530627 533128 537083 541989 547021 551955 557141 562497 567135 570334 572459 574439 576689 579141 582075
62268 582075 586152 591641 598294 606143 615769 627642 641773 658313 677942 701399 729203 762132
62256 762132 801342 847499 900317 959471 1025426 1098676 1178516 1263200 1350820 1439076 1524345
62245 1524345 1601984 1667923 1719665 1756060 1777078 1783966 1778754 1763035 1737452 1702395 1658580 1606722
62233 1606722 1547228 1480625 1408115 1331635 1253790 1177723 1106302 1040905 981205 926441 876595
62222 876595 832222 793590 760318 731526 706066 682949 661859 643050 626554 611821 598340
62211 598340 586144 575381 565796 557051 549218 542454 536418 530539 524763 519637 515619 512685 510596 509286
62197 509286 508907 509672 511655 514658 518315 522314 526389 530211 533717 537651 543266 551113 560428 570056 579711
62182 579711 589949 601199 613267 625625 637689 648882 658840 667637 675497 682301 687699 691783 695523
62169 695523 700530 708515 720831 738289 761314 790198 825042 865526 911168 961967 1018304 1079796
62157 1079796 1144481 1209352 1271363 1327580 1374986 1411094 1434999 1447522 1450318 1444983 1432601 1413508
62145 1413508 1387485 1354535 1315479 1271575 1223919 1173685 1122620 1072647 1025111 981010 941674
62134 941674 908309 880845 858140 839587 825731 817049 812904 812247 814701 820377 829111 840591 854984
62121 854984 872821 894295 919026 946316 975278 1004916 1034600 1064450 1094913 1125941 1156733
62110 1156733 1186033 1212205 1233108 1246488 1250965 1246844 1236155 1222090 1208010 1196204 1187019 1179149
62098 1179149 1170934 1161492 1150880 1139632 1128529 1118677 1111286 1107004 1105478 1105793 1107301 1109845 1113199
62085 1113199 1116693 1119676 1122145 1124597 1127392 1130567 1134242 1138814 1144732 1152389 1162381 1175562 1192588
62072 1192588 1213428 1237328 1263074 1289316 1314989 1339697 1363608 1386929 1409628 1431819 1454260
62061 1454260 1478284 1505162 1535471 1568909 1604595 1641488 1678370 1713390 1744020 1768063 1784834
62050 1784834 1795156 1800169 1800397 1795860 1786389 1771447 1750036 1721213 1684663 1640638 1589659 1532636
62038 1532636 1471076 1406741 1341120 1275408 1210878 1148860 1090288 1035428 984147 936365 892371
62027 892371 852843 818444 789171 764128 742143 722605 705546 690878 677802 665074 651866
62016 651866 638299 625091 612648 600563 588218 575783 564307 554743 547192 541245 536650 533274
62004 533274 530810 529034 528265 529024 531285 534579 538864 544632 551906 559651 566683 572792 578413 583354 586458
61989 586458 586682 584096 579638 574196 568110 561284 553436 544323 534070 523352 513073 503742 495251 487232
61975 487232 479498 472127 465354 459498 454791 451027 447519 443688 439748 436535 434558 433445 432427 431157
61961 431157 429837 428741 427966 427634 427898 428548 428890 428405 427454 427047 427902 430030 433225 437582 443266 450068
61945 450068 457581 465672 474500 484216 495054 507659 522763 540328 559443 579253 599701 621136
61933 621136 643607 666836 690543 714361 737661 759961 781374 802167 821972 839863 855246
61922 855246 868210 878941 887122 892054 893132 890176 883670 874728 864625 854284 844445 836142 830544
61909 830544 828281 829373 833869 842063 853879 868544 885154 903154 921911 940158 956250 968778
61897 968778 976756 979652 977685 971860 963178 951865 937663 920654 901362 880203 857334 833106
61885 833106 808251 783537 759625 737269 717185 699432 683205 667554 652202 637490 623681
61874 623681 610574 597805 585297 573341 562361 552721 544718 538612 534575 532589 532411 533569 535427
61861 535427 537466 539716 542825 547522 554020 562128 571868 583698 598114 615358 635646 659376 686853
61848 686853 717923 751953 788046 825264 863015 901406 940869 981064 1020344 1056612 1088525
61837 1088525 1115538 1137027 1151961 1159605 1160224 1155030 1145679 1133911 1121332 1109273 1098808 1090893
61825 1090893 1086352 1085751 1089476 1097905 1111236 1128977 1149751 1171712 1193039 1211923 1226331 1234159
61813 1234159 1233823 1224728 1207134 1181727 1149410 1111464 1069668 1026060 982460 940125 899749 861708
61801 861708 826417 794529 766677 742888 722391 704179 687714 672891 659509 647189 635816
61790 635816 625700 617148 610204 604946 601638 600262 600058 599880 599022 597603 596170 595053 594061 592806 591305
61775 591305 590075 589383 588554 586462 582759 578182 573582 569137 564655 560121 555629 551215 547119 543820 541447
61760 541447 539505 537560 535797 534481 533339 532039 530914 530492 530569 530455 530070 530069 530864 532122 533309 534166 534555
61743 534555 534360 533667 532623 531090 528919 526582 524972 524452 524589 524957 525628 526716 528076 529752 532165 535389
61727 535389 538661 541175 543114 545420 548607 552237 555598 558574 561763 565856 571034 576966 583276 589787
61713 589787 596232 602014 606641 610238 613291 615956 618017 619398 620224 620385 619595 617975 616094 614350 612798
61698 612798 611717 611712 613004 615125 617642 620658 624280 628061 631399 634083 636059 637082 637063 636438 635698 634756
61682 634756 633201 630923 628105 624831 621099 617025 612679 607962 602980 598148 593527 588444 582343 575741
61668 575741 569722 564731 560484 556786 553667 550817 547724 544519 541932 540235 538894 537498 536365 535913
61654 535913 536008 536357 536995 537909 538593 538605 538366 538830 540332 542179 543422 543810 543909 544533 546102 548405 550888 553164
61636 553164 555215 557137 558827 559986 560349 559811 558382 556060 552793 548618 543925 539399 535501 532018 528391
61621 528391 524510 521003 518631 517600 517464 517517 517214 516482 515768 515637 516225 517169 517984 518256 517467 515081 511135
61604 511135 506462 501994 497930 493819 489375 484886 480826 477380 474416 471788 469492 467537 465701 463458
61590 463458 460266 456034 451311 446916 443340 440479 437853 435044 431918 428543 424932 420953 416456 411435
61576 411435 406058 400696 395975 392465 389978 387340 383362 378147 373078 369318 366692 364201 361310 358322
61562 358322 355769 353882 352627 351855 351343 350877 350358 349755 349024 348180 347344 346549 345660 344705 344110 344283 345060 345925
61544 345925 346654 347369 347997 348237 348186 348495 349612 351253 352934 354660 356712 359055 361447 364004 367069 370469
61528 370469 373332 374832 374819 373599 371451 368584 365322 361969 358511 354717 350621 346775 343923 342388 341760
61513 341760 341187 340076 338554 337260 336724 336981 337675 338307 338393 337639 336172 334478 333001 331895 331226 331165 331729
61496 331729 332472 332737 332265 331334 330359 329555 328976 328584 328228 327794 327479 327650 328315 328960 329079 328691 328175 327827 327838
61477 327838 328475 329921 331987 334227 336309 338091 339478 340595 341976 344068 346472 348128 348430 347815 347028
61462 347028 346276 345545 345292 346107 347684 348796 348552 347300 346020 345174 344548 344029 343966 344614 345527 345903 345495 344921
61444 344921 344899 345368 345616 345237 344670 344656 345438 346758 348493 350886 354107 357903 361851 365739 369513 372979
61428 372979 375783 377687 378765 379303 379533 379502 379234 379024 379395 380615 382383 384261 386334 389129 392846 397033
61412 397033 401112 404797 407797 409549 409740 408861 407753 406699 405363 403535 401396 398984 395894 391805 386976
61397 386976 382021 377399 373295 369741 366615 363665 360746 357994 355630 353720 352160 350747 349224 347524
61383 347524 346088 345660 346524 348101 349508 350322 350632 350668 350765 351467 353088 355144 356654 357201 357341 357814 358693
61366 358693 359606 360502 361726 363379 365039 366330 367516 369212 371636 374410 377137 379872 382880 386168 389548
61351 389548 393085 397202 402293 408435 415546 423650 432927 443582 455631 468614 481589 493675 504672
61338 504672 514908 524500 533109 540565 547326 553942 560215 565195 567959 568285 566709 564064 560846 556961
61324 556961 552190 546825 541451 536109 530325 524202 518875 515305 513153 511478 510120 509615 510046 510973 512423
61309 512423 515003 518797 523074 527409 532345 538493 545639 553322 561782 571693 583269 596074 609426
61296 609426 622478 634173 643625 650412 654188 654376 650866 644701 637355 629330 620164 609846 599418
61283 599418 589816 580891 572230 564431 558645 554860 551576 547600 543585 541211 541166 542660 544758 547383 550781
61268 550781 554811 559369 564978 572140 580266 587967 594446 600025 605261 610217 614863 619658 625402 632819
61254 632819 642520 654981 670177 687363 705363 722901 738646 751351 760304 765547 767630 767332 765484
61241 765484 762498 757965 751199 742356 732524 722625 712826 703282 694673 687517 681530 676271 671847 668394
61227 668394 665380 662316 659828 659178 660871 664457 669550 676203 684241 693019 702051 711274 720519 729201
61213 729201 736754 743073 748522 753828 759810 766601 773164 778123 781168 783085 784435 784914 784239 782999 782232
61198 782232 782626 784527 788310 794335 802784 813843 827895 845313 866245 890686 918452 948888 980844
61185 980844 1013042 1044222 1072874 1097359 1116736 1131421 1142913 1152910 1162590 1172302 1181623 1189887
61173 1189887 1196779 1202305 1206309 1208317 1207880 1204711 1198454 1188748 1175722 1160097 1142594 1123410 1102368
61160 1102368 1079427 1055020 1030040 1005269 980481 954507 926827 898913 873197 850742 830845
61149 830845 812930 797643 785571 776079 768320 762649 760007 760355 762580 765512 768109 768964 766828 761828
61135 761828 755374 748713 742128 735631 729685 725000 722109 721396 723130 727265 733483 741569 751597 763791
61121 763791 778578 796723 818849 844688 873229 903835 936851 972877 1011727 1052476 1094342
61110 1094342 1137149 1180898 1225204 1269363 1312842 1355417 1396719 1435846 1471678 1503593 1531708
61099 1531708 1556497 1578309 1597064 1611960 1621529 1624442 1620378 1609754 1592668 1568766 1538285 1502521
61087 1502521 1462928 1420391 1375782 1330492 1285730 1241763 1198479 1156219 1115417 1075947 1037661
61076 1037661 1001210 967471 936506 907932 882039 859437 839726 821593 804426 788873 775615
61065 775615 764560 755497 748633 743986 740928 738797 737445 736894 737041 738049 740439 744422 749604 755645
61051 755645 762710 771018 780490 791151 803380 817460 833439 851635 872652 896457 922064 948645
61039 948645 976505 1006445 1038623 1072504 1107561 1143532 1180252 1217665 1255794 1294475 1333439
61028 1333439 1372817 1413148 1454687 1497215 1540625 1585026 1630015 1674570 1718068 1760658 1802342
61017 1802342 1842634 1881929 1922492 1967419 2019179 2079701 2150759 2233185 2326228 2428775 2541077
61006 2541077 2665279 2805851 2970766 3171196 3418588 3722871 4094723 4548526 5102382
60997 5102382 5778666 6608811 7636917 8916150 10503627 12457310 14813081 17516357
60989 17516357 20339640 22882429 24717313 25609882 25643416 25151154 24533436 24115655 24104781
60980 24104781 24571124 25393087 26226385 26604358 26156964 24793884 22712768 20251274 17720418
60971 17720418 15325345 13171186 11296255 9698052 8352225 7228001 6295752 5527004
60963 5527004 4894172 4372906 3943215 3587799 3290881 3039092 2822159 2632342 2464097
60954 2464097 2314179 2180701 2061563 1954365 1857619 1770977 1694235 1626934 1568749 1518976
60944 1518976 1475189 1433350 1389901 1343557 1295199 1246708 1199931 1155908 1114570 1075365 1038102
60933 1038102 1002814 969098 936361 904752 875138 848050 823239 800264 778850 758619 739246
60922 739246 721031 704609 689877 675969 662531 650285 639859 630749 622012 613476 605672 598965
60910 598965 593349 588859 585563 583191 581217 579396 577964 577239 577158 577189 576679 575413 573831 572577 571785 570964
60894 570964 569588 567587 565321 563323 562039 561513 561269 560765 559992 559362 559086 558992 558882 558599 557731 555809 552969
60877 552969 550005 547556 545592 543769 541831 539424 536020 531388 525856 519881 513708 507697 502556 498793
60863 498793 496134 493925 492030 491038 491577 493618 496503 499640 503163 507640 512953 517787 520765 521934 522489
60848 522489 523192 523901 524752 526753 530653 535997 541879 547900 553612 557750 559152 558264 556759 555657 554561
60833 554561 552763 550298 547700 545423 543789 543007 542819 542496 541538 540239 539302 539064 539302 539686 540140 540712 541310
60816 541310 541762 542063 542317 542356 541670 539947 537435 534483 530909 526327 520965 515541 510358 505167 499976 495163
60800 495163 490583 485430 479552 474081 470041 466917 463438 459323 455387 452244 449804 447892 446501 445409
60786 445409 444280 443206 442596 442525 442746 443237 444113 445060 445527 445521 445589 446012 446641 447542 449103 451351 453839 456421
60768 456421 459625 464041 469782 476597 484029 491440 498488 505674 513789 522745 531554 539576 547087 554483
60754 554483 561681 568512 574886 580229 583593 584895 585343 586071 586964 587461 587800 588634 589873 590862 591466 592053
60738 592053 592440 591672 589025 584673 579243 573235 567091 561379 556550 552535 548662 544015 538094 531384 525148
60723 525148 520356 516840 513699 510449 507513 505585 504763 504440 504019 503748 504634 507316 511138 514764 517723
60708 517723 520797 524774 529519 534678 540606 547811 555898 563963 571931 580629 590435 600709 610894 621536
60694 621536 633612 647181 661217 674676 687334 699580 711825 724291 737206 750824 765179
60683 765179 779953 794821 809867 825485 841837 858667 875809 893671 913011 934291 957308
60672 957308 981338 1005494 1029080 1051816 1073729 1094824 1114942 1133847 1151166 1166177 1178007
60661 1178007 1186251 1191156 1192961 1191343 1185786 1176276 1163290 1147307 1128746 1108281 1086753 1064676
60649 1064676 1042091 1018984 995687 972869 951350 931814 914390 898387 882615 866087 848454
60638 848454 829955 811227 793045 775944 759907 744587 729893 716299 704482 694763 686888 680292
60626 680292 674510 669360 664836 660931 657634 654986 652996 651564 650613 650118 649764 648722 646231 642460 638388
60611 638388 634721 631275 627483 623049 617896 611997 605614 599312 593321 587184 580426 573243 566170 559348
60597 559348 552596 545923 539467 533099 526638 520343 514695 509719 505014 500435 496311 492955 490348 488347
60583 488347 486830 485569 484262 482788 481162 479274 476949 474251 471520 469149 467540 467115 467997 469745 471775
60568 471775 474036 476992 481020 486186 492541 500276 509558 520408 532608 545386 557442 567759 576243
60555 576243 583084 587710 589048 586830 581981 575676 568704 561861 556143 552070 549328 547499 546714 547239 548829
60540 548829 551038 553893 557888 563434 570536 578750 587186 594793 600989 605866 609573 611714 611640 609190 604939
60525 604939 599898 595162 591596 589507 588655 588661 589293 590235 590966 591161 590983 590710 590261 589458 588603 588333 588905 589948
60507 589948 591017 592075 593261 594421 595226 595785 596970 599888 605067 612349 621663 633659 649372 669458
60493 669458 694021 723022 756366 793536 833505 875000 916399 955229 988246 1012382 1025526
60482 1025526 1026421 1014499 990410 956488 916142 872587 828193 784684 743376 705157 670563 640062
60470 640062 614082 592686 575325 561024 548816 538065 528515 520091 512658 505953 499746 493965 488617
60457 488617 483618 478752 473814 468829 464127 460094 456755 453769 450959 448676 447322 446598 445593 443684
60443 443684 441005 437978 434800 431673 429260 428395 429247 430986 432419 432915 432626 431949 430967 429598 428042 426729
60427 426729 425749 424735 423475 422261 421379 420624 419731 418932 418594 418667 419044 420174 422479 425270 427099 427385 426941
60410 426941 426727 426836 427018 427487 428650 430508 432740 434967 436613 437037 436307 435431 435349 435955 436493 436553 436282 436028
60392 436028 436256 437477 439717 442311 444658 446897 449364 451731 453318 454102 454765 455769 456954 458106 459395
60377 459395 461099 463237 465626 468067 470407 472554 474441 475948 477006 477813 478712 479721 480486 480881 481262
60362 481262 481883 482527 483048 483815 485106 486467 487240 487429 487509 487695 487990 488682 490086 492038 494305 497251 501308
60345 501308 505997 510427 514721 520006 526879 534882 543654 553501 564241 574485 582907 589635 595531 600456
60331 600456 603052 602098 597500 590074 581034 571687 563011 555213 547942 541011 534759 529672 525904 523246
60317 523246 521423 520306 519863 519952 520248 520490 520815 521680 523446 526156 529770 534399 540259 547607 556826 568458
60301 568458 583106 601380 623764 649919 677894 704427 726572 743009 753609 758007 755150 744376
60289 744376 726661 704690 681815 660836 643308 629625 619688 613562 611460 613086 617189 621999 626129
60276 626129 628878 629674 627593 621831 612629 601386 589682 578304 567232 556267 545532 535562 527130
60263 527130 520761 516136 512108 507631 502627 497766 493633 490458 488451 487744 487857 487755 486805 485428 484502
60248 484502 484356 484669 485183 486044 487343 488672 489412 489405 489135 489199 489747 490455 490943 491086 491039 491153 491827 493255 495303
60229 495303 497891 501452 506646 513399 520571 526858 531795 535642 538599 540632 541986 543358 545353 547982
60215 547982 550812 553443 555834 558318 561316 565025 569448 574717 581119 588555 596285 603532 610215 616729
60201 616729 623209 629462 635509 641607 647606 652765 656451 658769 660350 661771 663321 665035 666703 667979
60187 667979 668578 668358 667256 665334 662866 660113 656969 653015 647961 641911 635280 628689 622813 617962 613776
60172 613776 609627 605413 601684 599026 597545 596933 596671 596190 595206 594073 593514 593925 595156 596889 598853 600673
60156 600673 602038 603114 604367 605806 606926 607626 608651 610713 613554 616331 618717 621155 624176 627903
60142 627903 632215 637049 642405 648230 654403 660811 667473 674649 682747 692067 702625 714106 725889
60129 725889 737145 747084 755065 760378 762246 760469 755962 750214 744202 738236 732726 728423 725718 724286
60115 724286 723723 724053 725324 727229 729493 732207 735256 737766 738715 738032 736685 735683 735176 734374 732152 727901
60099 727901 722069 715721 709452 703019 696195 689547 683979 679796 676655 674248 672605 671898 672329 674142 677428
60084 677428 681983 687573 694122 701445 709063 716640 724294 732070 739386 745447 749946 752803 753476 751282
60070 751282 746337 739502 731332 721791 711144 700361 690227 680641 671298 662622 655367 649453 643876
60057 643876 637820 631422 625231 619247 612925 606066 599367 593870 589973 587245 585128 583456 582260 581587
60043 581587 581879 584142 589043 595903 603204 610181 617348 625259 633368 640670 647078 653468 660350 667078
60029 667078 672486 675928 677463 677388 675925 673226 669289 663767 656056 645781 633281 619639 606177 593693
60015 593693 582066 570676 559384 548943 540254 533343 527468 522137 517574 514041 511216 508627 506346
60002 506346 504828 504238 504320 504828 505737 507123 509112 511763 514729 517278 519059 520580 522547 525060 528029
59987 528029 531958 537346 543480 548890 553202 557526 562649 567787 571717 574280 576053 577190 577421 576746 575293
59972 575293 572707 568457 562658 556161 549977 544922 541472 539372 537707 535928 534573 534452 535478 536921
59958 536921 538519 540511 542717 544407 545154 545177 544820 544290 543895 543880 543919 543391 542285 541290 540864 540760 540616 540477
59940 540477 540504 540648 540821 540960 540727 539507 536926 533114 528447 523381 518563 514540 511222 508081 505082 502928
59924 502928 502140 502327 502670 502821 503041 503714 504943 506484 507926 509100 510251 511567 512731 513469 514438 516828
59908 516828 520903 525611 529917 533864 537953 542142 546006 549418 552445 554973 557015 559067 561560 564159
59894 564159 566220 567748 569330 571225 573219 575420 578573 583372 589797 597289 605285 613508 622022 631133
59880 631133 640991 651260 661376 671173 680974 691052 701234 711020 719734 726430 730020 729856 726223
59867 726223 720132 712633 704267 694993 684609 673309 661849 650983 640827 631048 621695 613481 607045
59854 607045 602215 598292 594908 592256 590618 590074 590771 593091 597316 603315 610825 619914 630877 643609
59840 643609 657148 669762 679483 684916 686034 684322 681894 680314 680313 682412 687196 694607 703186 710452
59826 710452 714192 713569 709313 703029 696004 688306 678979 667217 653205 637864 622173 607054 593439
59813 593439 581837 571939 563168 555598 549847 546009 543250 540673 538201 536307 535168 534390 533452 532221
59799 532221 531034 530342 530182 529992 529111 527399 525170 522582 519459 515808 512139 509032 506582 504481 502514
59784 502514 500825 499777 499615 500180 500915 501308 501373 501524 501992 502603 503137 503554 503761 503474 502600 501578 501071 501396
59766 501396 502379 503671 505003 506232 507308 508283 509286 510511 512144 514259 516836 519978 523923 528588 533273
59751 533273 537267 540802 545015 550772 557821 565230 572323 578968 585301 591490 597620 603515 608764 613067
59737 613067 616422 618755 619665 618892 616905 614686 612853 611256 609467 607403 605341 603482 601770 600183 599027
59722 599027 598712 599192 599868 600266 600666 601766 603754 606015 607815 608983 609820 610618 611494 612528 613839 615534
59706 615534 617621 619914 622096 624017 625915 628108 630463 632409 633475 633570 632787 631373 629987 629556 630533
59691 630533 632454 634422 635828 636513 636501 635823 634455 632335 629637 627048 625407 624965 625314 626148 627577 629460
59675 629460 630990 631408 630809 629765 628488 626851 624906 622753 620034 616250 611605 606960 602782 598636 593934
59660 593934 588783 583796 579386 575555 572243 569564 567634 566324 565339 564625 564660 566178 569510 574252 579635
59645 579635 584977 589644 592906 594267 593935 592651 590996 589079 586923 584836 583187 581941 580659 579087
59631 579087 577628 577053 577670 578955 580213 581390 582814 584259 584876 584282 583156 582364 581963 581611 581527 582288 583743
59614 583743 584799 584394 582280 578881 575021 571898 570695 571812 574776 579071 584609 591144 597742 603361
59600 603361 607748 611225 613761 614818 614114 612069 609311 606124 602620 599144 596114 593559 591104 588425
59586 588425 585519 582609 579943 577684 575764 573830 571578 569137 566826 564494 561488 557475 552967 548761
59572 548761 545195 542254 540030 538527 537269 535780 534460 534416 536269 539519 543087 546079 548054 549144 550061
59557 550061 551466 553179 554440 554991 555326 555825 556438 557410 559395 562339 565033 566550 567499 569121 571631 574280
59541 574280 576693 579343 582992 588428 596442 607297 620553 636315 656119 681035 708523 732483
59529 732483 747295 751583 748122 741207 734553 730503 729808 732083 736971 744715 755301 767508 779498
59516 779498 790109 798992 805627 809020 808573 804702 798153 788967 776569 760855 742916 724454 706654
59503 706654 689814 674013 659705 647420 637146 628369 620639 613829 607970 603166 599644 597474 596246
59490 596246 595306 594366 593546 592825 591903 590756 589984 590334 592127 595297 599748 605418 612094 619393 626970 634789
59474 634789 643239 652857 663723 675196 686452 697076 706803 714922 720579 723712 725117 725372 724330
59461 724330 721982 719322 717855 718541 721626 727225 735587 746806 760703 777011 795519 816079 838593
59448 838593 862884 888458 914585 940760 966781 992072 1014956 1032774 1042602 1042007 1029820 1006952
59436 1006952 976506 942639 908974 877814 850283 826573 806082 787796 770888 755112 740858
59425 740858 728984 720409 715533 714110 715758 720438 728324 739575 754512 773630 796865 823069 850748
59412 850748 879198 908431 938405 969216 1001728 1036206 1069233 1092989 1099354 1085469 1055342 1016616
59400 1016616 976410 939550 908944 886535 874007 872545 881028 894001 902460 898285 878800 847349
59388 847349 809996 772058 736947 706534 681470 661334 645170 632109 621576 613123 606311 600732
59376 600732 596049 592094 588925 586656 585188 584261 583747 583655 583867 584132 584357 584673 585195 586050 587620 590310 593945
59359 593945 597895 602011 606874 612822 619361 626137 634000 644346 657640 673372 691290 711744 734710
59346 734710 759410 785309 812746 842032 872489 902978 933038 962794 991841 1018830 1042245
59335 1042245 1061095 1074738 1082512 1083992 1079481 1069893 1056043 1038176 1016195 990246 961051 929864
59323 929864 898291 867997 840251 815510 793501 773806 756332 741236 728478 717611 707939 698948
59311 698948 690665 683576 678034 673794 670307 667361 665045 663168 661270 659468 658814 660393 664262 669627
59297 669627 675856 683081 692086 703990 719746 739415 761678 783925 802566 813628 814303 804904 788987
59284 788987 770831 752949 736247 721678 710530 703340 699690 699170 701665 706708 713518 721941 732565
59271 732565 745786 761598 780344 802596 827842 854217 879987 904485 927138 946632 961816
59260 961816 972622 979197 980763 976327 966090 951239 932767 911435 888594 865902 844165 823394
59248 823394 803972 786836 772306 759666 748302 738581 731133 725937 722673 721551 723053 727036 732661
59235 732661 739261 746879 755892 766495 778605 791860 805344 817468 826612 831986 833730 832138 827107
59222 827107 818492 806636 792142 775333 756417 736154 715835 696495 678501 662050 647573 635337
59210 635337 624995 615949 608017 601410 596103 591563 587136 582611 578380 575041 572809 571285 569960 568874
59196 568874 568543 569205 570388 571319 571591 571388 571225 571556 572416 573470 574568 576131 578730 582456 587133 592951
59180 592951 600228 608531 616848 624910 633639 643798 654855 665742 676343 687540 700014 713534
59168 713534 727280 740458 752776 764808 777767 792531 808884 825868 842591 858405 872650
59157 872650 884728 894316 901148 904703 904446 900220 892102 880182 864887 847332 828834 810136 791434
59144 791434 773072 755760 740127 726287 713750 701566 688877 675828 663718 653851 646333 640373
59132 640373 635433 631480 628279 625211 621997 619101 617167 616416 616705 617855 619797 622666 626928 633156 641566
59117 641566 651858 663498 676027 689136 702695 716707 731106 745600 759807 773423 786138
59106 786138 797677 808071 817632 826361 833732 839415 843887 847838 851188 853254 853725 852882 850967 847944
59092 847944 843952 839409 834550 829413 824377 820192 817239 815185 813532 812021 810221 807156 801759 793587
59078 793587 782955 770643 757654 744872 732560 720266 707544 694728 682809 672516 663720 655788
59066 655788 648431 642070 637334 634306 632417 631022 629815 628651 627276 625484 623355 621115 618867 616568
59052 616568 614079 611027 606936 601783 596261 591236 587183 584315 582853 582674 582979 582872 582165 581258 580450 579927
59036 579927 580199 581803 584552 587657 590689 593866 597331 600766 603997 607500 612045 618161 626089 635909
59022 635909 647402 660060 673413 687315 701862 717218 733374 749792 765318 778742 789321
59011 789321 796492 799464 797890 792927 786826 781226 776387 772235 769352 768482 769642 772377 776632 782870
58997 782870 791470 802411 815440 830140 845780 861335 875822 888820 900829 912948 925716 938170
58985 938170 948319 954606 956558 954133 947201 936027 921779 906087 890385 875924 863933 855135
58973 855135 849304 845797 844466 845686 849645 856049 864572 875201 888089 903266 920550 939549 959775
58960 959775 980910 1002872 1025334 1047159 1066613 1082291 1093634 1100368 1101646 1096146 1083193 1063611
58948 1063611 1039314 1012102 983083 953111 923359 895154 869470 846819 827449 811361 798240
58937 798240 787663 779367 773124 768497 765031 762576 761057 759913 758126 754964 750494 745388 740388 735890
58923 735890 731754 727520 723016 718724 715261 712601 710154 707586 705223 703643 703194 703867 705304 706968 708797
58908 708797 711652 716574 723473 731162 738929 747548 758339 771722 787258 804717 824408 846446 870221
58895 870221 894768 919298 943203 965875 986986 1007061 1027620 1050612 1077628 1109614 1147019
58884 1147019 1189831 1237270 1287562 1338080 1385702 1427310 1460612 1484903 1500876 1509411 1510594 1503834
58872 1503834 1488360 1463401 1428550 1384767 1334871 1282486 1230505 1180796 1134856 1093897 1058338
58861 1058338 1027863 1002031 980281 961483 944254 927902 912499 897960 883670 869216 854924
58850 854924 841395 828905 817415 806784 796832 787531 779215 772195 766148 760331 754365 748296 741959
58837 741959 735009 727657 720581 713805 706422 697888 688965 680817 673592 666549 659383 652840 647979 645137
58823 645137 643731 642990 642822 643824 646359 649918 653726 657761 662686 668912 676226 684159 692097 699164 704741
58808 704741 709161 713190 716820 719283 720351 720744 721000 720775 719587 717527 714860 711593 707871 704162 700642
58793 700642 696936 692868 688812 684973 680932 676429 672022 668563 666564 666445 668710 673333 679529 686649
58779 686649 694732 703703 712727 721084 729032 736994 744335 749811 752917 753849 752338 747497 739088 728374
58765 728374 717444 707920 700306 694203 688932 684020 679251 674617 670579 668210 668443 671103 675171 680036
58751 680036 685897 692879 700513 708247 715682 722065 726534 729452 732653 737662 744303 751561 759084 767060
58737 767060 775261 783116 790422 797287 803703 809783 816071 823072 830796 839181 848476 858726 869431 880174
58723 880174 890925 901133 909325 914504 917385 919421 921100 922116 922778 924203 927310 932395 939405 947857
58709 947857 956772 965414 973754 981534 987417 989998 989299 986298 981285 973618 962767 948529 930488 908494
58695 908494 883718 858195 833184 808852 785533 764238 745710 729869 716491 705614 696967 689683
58683 689683 682975 676589 670342 663679 656047 647485 638712 630755 624407 619780 616506 614505 614192 615744
58669 615744 618713 622852 628771 637160 647894 660646 675894 694525 716681 741552 767664 792428
58657 792428 812116 823807 827546 825803 820975 814236 806358 798161 789961 781586 773185 765138 757145 748429
58643 748429 739007 729894 721803 714532 707887 702386 698697 697052 697492 700144 705050 712114 721154 731428
58629 731428 741184 748365 751782 751160 746458 738116 727789 717742 709306 702638 697918 695765 696484 699987
58615 699987 706722 717713 733369 753061 776059 801971 829884 857868 883778 906000 923279 934680
58603 934680 940175 940744 937649 931956 924623 916236 906536 895025 882181 869286 856892 844321 831048
58590 831048 817825 806088 796915 790877 788256 788947 792559 798851 807752 818918 831745 845827 860858
58577 860858 876184 890981 904813 917405 928101 936359 942682 948191 953400 958325 963666 970789 980419
58564 980419 992408 1006923 1024783 1046307 1070801 1097524 1126258 1156534 1187080 1216358 1242949
58553 1242949 1265290 1281945 1292459 1297304 1296922 1291698 1282889 1272466 1261623 1250272 1238192 1225729
58541 1225729 1213068 1199754 1185259 1169223 1150970 1129782 1105982 1080874 1055406 1029837 1004839
58530 1004839 981736 961321 943516 928579 917515 910731 907301 906130 906990 909936 914614 920594 927563
58517 927563 934870 941744 948229 954871 961203 965710 967754 968409 968886 969302 969594 970418 972315 974856 977345
58502 977345 979599 981572 983044 984153 985248 985774 984376 980619 975489 969627 962312 952960 942544 932605
58488 932605 923702 915623 908324 901948 896619 892790 891088 891543 893922 899013 908296 921885 938038 955231
58474 955231 973344 992251 1010698 1027326 1041339 1051429 1055619 1053305 1046124 1035863 1022884 1007604
58462 1007604 991912 977649 964985 953573 944067 937115 932123 928524 927162 928985 933511 940027 949097
58449 949097 961082 974128 985367 993448 998340 999549 996407 989606 980736 970676 959827 949347 940566
58436 940566 933579 927858 923846 922523 923870 927151 932242 939209 947024 954282 961026 968491 977314 987303
58422 987303 998739 1012505 1028845 1046909 1065287 1082161 1095495 1104238 1109044 1110942 1109977 1106120 1100642
58409 1100642 1095109 1089558 1083021 1075289 1066766 1057107 1045527 1032331 1018839 1006050 994444 984701 977318
58396 977318 971826 967459 964257 962554 961987 962067 962981 964540 965142 963333 959815 956388 953358 949559 944600
58381 944600 939508 935254 931993 929618 927892 926214 924370 923186 923540 925325 928314 933185 940400 948900
58367 948900 957384 966193 976467 988247 1001039 1015494 1032719 1052359 1073109 1094657 1117485 1141125
58355 1141125 1164213 1185864 1205366 1221011 1231011 1235413 1235713 1232981 1227851 1221694 1216005 1210990 1206381
58342 1206381 1203140 1202642 1204621 1207805 1212244 1219240 1229199 1241281 1254948 1270272 1286937 1304428 1322910
58329 1322910 1342584 1362667 1382333 1401874 1421375 1439152 1453242 1463625 1471310 1476314 1478575 1479751
58317 1479751 1481762 1484355 1486387 1488617 1492745 1498436 1503966 1509292 1515900 1524130 1533226 1543625 1556520
58304 1556520 1571414 1586654 1602151 1619115 1637445 1655891 1674489 1694252 1714727 1734373 1753062
58293 1753062 1771713 1789871 1806292 1821619 1837884 1855761 1874766 1895517 1919003 1944261 1969703
58282 1969703 1996117 2025381 2056946 2088850 2121515 2157058 2195336 2234215 2273307 2313815 2355033
58271 2355033 2394777 2433095 2471927 2511380 2550174 2589511 2632535 2680022 2730427 2783828 2841686
58260 2841686 2902987 2965060 3028146 3094802 3164805 3235173 3305074 3375956 3446942 3515322 3581939
58249 3581939 3650999 3723973 3798735 3875083 3955812 4041756 4131222 4225176 4327598 4439805 4559619
58238 4559619 4686738 4823519 4969979 5123835 5286056 5460462 5647364 5843832 6050625
58229 6050625 6272222 6509669 6760631 7026979 7314567 7624702 7953924 8303263 8679335
58220 8679335 9085324 9520008 9987145 10496417 11053363 11658272 12317060 13043164 13846870
58211 13846870 14733703 15715621 16812474 18040496 19412095 20950034 22689628 24665985
58203 24665985 26915261 29493210 32479586 35964869 40052582 44878622 50611000 57433351
58195 57433351 65559696 75280364 86987668 101181458 118500464 139749313 165840796
58188 165840796 197668429 235913729 280523674 329601734 378267682 418910395 443679725
58181 443679725 448020709 432694045 402841135 365163782 325468730 287720760 254101657
58174 254101657 225241053 200509916 178634907 158494546 139606480 122068640 106190327
58167 106190327 92180520 80049087 69659415 60815641 53315739 46965796 41584425
58160 41584425 37013026 33120302 29794250 26936396 24466455 22323568 20456824 18819347
58152 18819347 17373272 16091572 14949820 13922321 12989297 12140142 11365151 10650886 9987725
58143 9987725 9375033 8813877 8300212 7829084 7399247 7008872 6651941 6323494 6023780
58134 6023780 5752975 5505920 5275700 5058373 4850979 4649422 4452220 4262726 4084241
58125 4084241 3916122 3757072 3608209 3469954 3339747 3215807 3099683 2992349 2891312
58116 2891312 2794309 2702420 2616789 2535587 2456862 2381232 2309227 2239169 2170202 2104405 2043384
58105 2043384 1985681 1929775 1876485 1826103 1776291 1725364 1674761 1625919 1577625 1528955 1481923
58094 1481923 1438682 1398823 1361859 1329553 1303024 1280054 1257964 1236955 1218194 1200980 1184351
58083 1184351 1169225 1156254 1143491 1128731 1112473 1096342 1080337 1063720 1046814 1029770 1011365
58072 1011365 991116 970852 952272 934676 917000 900103 885050 871035 857134 844329 833695
58061 833695 824283 814829 805846 798025 790295 781520 772396 763625 753981 742438 730583 720589 712201 703958
58047 703958 695966 689168 683130 676916 671166 667081 664147 660810 656609 651971 646952 641881 638109 636305
58033 636305 635042 632705 629596 626444 622185 615307 606297 596763 587080 576796 566388 556561 546687 535957
58019 535957 525369 516640 509798 503699 498248 494207 491250 488125 484499 481106 478308 475834 473590 471579
58005 471579 469532 467628 466860 467608 468777 469445 470244 471830 473219 473252 472622 472731 473469 473861 474099 475164 477130
57988 477130 479548 482801 487370 492403 496665 500358 504346 508204 510751 512019 513025 514037 514655 515076 515617
57973 515617 515497 513826 511426 509987 509671 509171 507848 506163 504170 501255 497388 493208 488839 483888 478629
57958 478629 474008 470556 468165 466626 465361 463143 459226 454276 449113 443253 436037 428504 422554 418691
57944 418691 416103 414489 414221 415112 416689 419452 424258 430618 437161 443665 451145 460097 470171 481414
57930 481414 494149 507604 520198 531318 541439 550508 557683 562754 566295 568183 567389 563518 557291
57917 557291 549253 539293 527743 515664 503603 491121 477973 464812 452441 441219 431456 423552
57905 423552 417453 412533 408095 403481 397990 391473 384735 378487 372275 365342 358143 351854 346750 342332
57891 342332 338746 336693 336031 335876 336046 337079 338722 339784 339732 339298 339298 339954 341435 343819 346327 347773 348069
57874 348069 348222 348665 348691 347813 346519 345348 344271 343418 343447 344641 346300 347456 347717 347280 346675 346564 347242
57857 347242 348398 349837 352091 355625 359916 364287 369175 375383 382387 388716 393907 398772 403775 408444
57843 408444 412412 415731 418016 418589 417734 416602 415578 413833 410664 406266 401038 395294 389824 385519 382176
57828 382176 378753 375002 371694 369083 366471 363646 361531 360995 362057 364518 368224 372410 376042 379204
57814 379204 382951 387446 391548 394757 398148 402590 407154 410081 410318 407422 401064 391668 380834 370290
57800 370290 360830 352682 346110 341051 336875 333040 329415 325552 320448 313648 305977 298725 292559 287447
57786 287447 282903 278090 272504 266923 262926 261177 260964 261547 262946 265081 267280 269182 271198 273598 276008
57771 276008 278248 280724 283562 286338 289116 292615 296780 300269 302076 302696 302898 302391 300578 297757 294640
57756 294640 291379 287934 284734 282109 279690 277148 274996 273945 273957 274570 275564 276705 277465 277556 277095 275648
57740 275648 271959 265474 257500 250066 244176 239855 237097 235822 235359 234963 234595 234561 234742 234811 234786 234762 234555
57723 234555 234236 234521 235931 237936 239576 240508 240894 240742 239996 238913 237713 236230 234408 232733 231618 230787
57707 230787 229734 228322 226538 224155 221216 218293 215777 213511 211610 210926 212046 214433 217261 220471
57693 220471 224238 228012 230928 232777 233870 234379 234508 234755 235267 235372 234580 233631 233770 235395 238117 241798
57677 241798 246731 253172 261504 272571 287165 305520 328029 356208 392231 437836 494348 563124
57665 563124 644411 734736 825181 902268 951585 963253 936502 879761 805737 725703 647269
57654 647269 575084 511506 456739 409855 370301 338102 312870 293355 277999 265507 255100
57643 255100 246612 240040 234721 229491 224091 219627 216984 215497 214036 212633 211938 211692 211013 209864 209010
57628 209010 208664 208385 208287 209184 211281 213594 214903 214618 212694 209463 205711 202299 199551 197401 195940 195251
57612 195251 194888 194231 193277 192461 191765 190713 189214 187732 186585 185649 184835 184330 184278 184605 185148 185694 185974 185890
57594 185890 185521 184757 183310 181311 179335 177482 175108 171919 168607 165824 163285 160608 158260 156763 155706
57579 155706 154558 153724 153649 153495 152064 149595 147313 145542 143691 141853 140911 140969 141037 140533 139954 139802 139889 139927
57561 139927 139877 139513 138547 137328 136577 136409 136467 136975 138620 141327 144144 146503 148677 150946 153242 155670
57545 155670 158353 160692 161708 161204 159630 156920 152628 147209 141887 137134 132600 128620 126157 124811
57531 124811 122596 118547 114172 111339 109943 108727 107329 106247 105557 104937 104519 104605 104862 104712 104333 104453
57515 104453 105394 106990 109184 111954 114777 116824 117763 117901 117631 117177 116863 117247 118790 121494 124858 128236
57499 128236 131351 134394 137434 139907 141034 140591 138896 136294 133161 130213 128050 126467 124880 123410
57485 123410 122709 122762 122711 122067 121283 120936 121165 122114 124075 126784 129258 130764 131381 131375 130650 129063 126672 123517
57467 123517 119862 116671 114952 114412 113753 112568 111873 112342 113160 113289 112841 112327 111509 110012 108351 107298
57451 107298 106717 106028 105418 105591 106478 107094 106657 105251 103494 102124 101745 102386 103351 103966 104340 105037 106139
57434 106139 107102 107429 107107 106466 105909 105728 105931 106290 106615 106860 107028 107219 107709 108621 109570 110109 110404 110911 111453
57415 111453 111328 110403 109307 108445 107651 107015 107109 108024 109045 109741 110574 111928 113318 114096 114238 113949 113256 112564
57397 112564 112792 114208 115815 116578 116672 116878 117484 118490 120119 122246 123967 124777 125653 127916 131431 134975
57381 134975 138091 141433 145300 148896 151279 152290 152294 151489 149710 146688 142535 138104 134606 132595 131604
57366 131604 130971 130520 130158 129506 128526 127904 128110 128538 128278 127355 126501 126111 126216 127075 128905 131134 132770 133520
57348 133520 133993 134872 136391 138409 140450 141836 142322 142394 142513 142430 141787 140939 140486 140331 139977 139473 139278 139366
57330 139366 139283 138969 138729 138473 137709 136330 134779 133443 132417 131741 131294 130579 129227 127604 126430 125916 125821
57313 125821 126094 126811 127712 128487 129314 130375 131083 130685 129539 128913 129419 130440 131174 131487 131559 131426 131159 130943
57295 130943 130812 130746 131057 132051 133237 133551 132607 131239 130575 131009 132199 133594 134713 135231 135029 133996 131817
57278 131817 128280 123770 119102 114825 110988 107460 104089 100544 96436 91759 87031 82998 80220 78703
57264 78703 77743 76505 75092 74671 76146 79102 82500 85979 89801 93917 97894 101582 105143 108488 111432
57249 111432 114309 117761 121897 126219 130302 133946 136809 138657 140015 141863 144535 147468 150124 152615
57235 152615 155293 158190 161002 163305 164771 165504 166058 166838 167688 168364 169049 169900 170496 170487 170443 171246 172819 174290
57217 174290 175297 176283 177523 178753 179874 181211 182820 184263 185276 186150 187225 188524 189965 191498 192936
57202 192936 194142 195338 196789 198245 199221 199686 199919 199809 199048 197948 197356 197638 198329 198845 199016 198961 199016 199728
57184 199728 201323 203227 204682 205713 206984 208961 211909 216349 222591 229937 237358 244869 253317 262835
57170 262835 272602 282251 292392 303380 314569 325313 335902 346980 358543 369969 380644 390341
57158 390341 399353 408358 417771 427323 436726 446605 458074 471567 486844 503983 523405 544790 566801
57145 566801 588061 607875 626099 643094 659686 676393 692801 708518 724416 741773 760431
57134 760431 779141 797760 817691 839902 863868 888936 915481 944141 974887 1007437 1041755
57123 1041755 1077752 1115379 1155308 1198602 1245385 1294822 1346775 1402533 1463570 1530648 1604570
57112 1604570 1686880 1779297 1883218 2000107 2131610 2279059 2443679 2627516 2833504 3064859
57102 3064859 3325555 3621513 3960522 4351481 4805112 5335178 5957503 6687986 7542865
57093 7542865 8539977 9697395 11031102 12555883 14286717 16234616 18399710 20770020
57085 20770020 23323573 26023412 28808474 31597647 34309007 36869510 39197787 41181086
57077 41181086 42681817 43576624 43796196 43339761 42266330 40675519 38683983 36402486
57069 36402486 33923639 31324369 28674140 26038485 23477429 21043078 18776994 16706965
57061 16706965 14846137 13196025 11749906 10493766 9407305 8467717 7653833 6947495
57053 6947495 6333155 5797864 5330792 4921504 4559139 4234038 3939478 3671176 3425986
57044 3425986 3201803 2997659 2812609 2644828 2492405 2354425 2230489 2119638 2020338 1930983
57034 1930983 1849871 1775293 1706173 1642209 1583162 1528875 1480317 1439573 1408239 1386821 1376285
57023 1376285 1378979 1397277 1432774 1487719 1564339 1658448 1753049 1821949 1843595 1813114 1742046
57012 1742046 1648182 1546179 1445133 1350500 1265457 1190690 1124760 1065809 1012916 965810 923855
57001 923855 885975 851422 820025 791622 765627 741191 717529 694128 671085 649311 629973
56990 629973 613589 600003 589287 582183 579406 580830 585692 593298 603243 614854 626503 635482 638779
56977 638779 634530 623069 606570 587643 568170 549083 530720 513238 496875 481939 468570 456820
56965 456820 447102 440186 436418 435237 436072 439496 446950 459374 476627 497986 522208 546686 567127
56952 567127 578891 579011 567340 546352 519960 492011 465175 440691 418741 398987 381256 366143
56940 366143 354808 347901 344970 345272 348788 356020 367194 382387 402138 427128 457071 490176 523205
56927 523205 551415 569127 572066 559991 536690 507271 475786 444880 416195 390260 366645 344940
56915 344940 325426 308604 294504 282727 272799 264257 256691 249931 243976 238760 234264 230788 228622
56902 228622 227471 226672 226026 225949 226846 228844 232067 236560 241950 247831 254573 263100 273800 286335 300625
56887 300625 317236 336506 357919 380454 402682 422090 435207 439345 434243 421861 404975 386154
56875 386154 367387 349967 334651 322053 312644 306390 302911 302262 305185 312502 324695 342227 365710
56862 365710 395512 431693 474622 524972 582210 642666 699026 742034 763873 761670 738696 702046
56850 702046 658798 614000 571134 532853 500766 475397 456903 445441 440848 442809 451728 468726
56838 468726 494573 529479 574333 631164 701746 786196 882700 986454 1087154 1168875 1215659
56827 1215659 1219505 1183764 1119649 1040067 955554 873230 797299 729989 672362 624612 586178
56816 586178 556321 534831 521995 517918 522315 535162 557190 589548 633267 689175 757390 835135
56804 835135 914033 980265 1019574 1024112 995605 942643 875545 803143 731995 666158 607194 555368
56792 555368 511172 475297 447456 426353 411034 401448 397559 398911 405441 417947 437309 463861
56780 463861 497548 537281 579067 615464 638259 642249 626898 595566 554017 508763 465000 425154
56768 425154 389367 357159 328386 303040 280977 262030 245959 232268 220403 210225 201922 195300
56756 195300 189381 182967 175721 168598 163073 159822 158203 157059 155775 154404 153042 151547 149780 147839
56742 147839 146108 145178 145388 146142 146189 145109 144106 144602 146448 148311 149493 150335 151020 151148 150669 150184 150083
56725 150083 150269 150882 152326 154303 155827 156561 157281 158630 160297 161742 162839 163396 162970 161681 160337 159286
56709 159286 157953 156008 154053 152600 151301 149878 148912 148946 149578 150220 151010 152198 153309 153807 154044 154763
56693 154763 156089 157636 159084 160055 160118 159577 159630 160955 162761 163880 164177 164062 163434 162106 160700 160064 160140
56676 160140 160328 160564 161166 161987 162663 163331 164229 164937 164971 164848 165555 167148 168752 169829 170567 171152 171474 171601
56658 171601 171821 172251 172877 173798 174962 175984 176823 178228 180762 183773 186084 187396 188198 188617 188273 187199
56642 187199 186080 185573 185998 187494 189872 192511 195007 197681 200807 203780 205823 207179 208712 210550 212026
56627 212026 212764 212926 212549 211587 210559 210235 210607 210979 211096 211327 211666 211474 210499 209434 209090 209419 209633 208974
56609 208974 207286 205101 203169 201718 200345 198789 197426 196659 196271 195841 195398 195127 194829 194228 193404 192399
56593 192399 190898 188945 187364 186721 186367 185407 184137 183565 183852 184249 184293 184152 183994 183939 184409 185583 186767
56576 186767 187270 187658 189071 191406 193262 193742 193347 193090 193614 195234 197926 201131 204255 207416 211180 215864
56560 215864 221833 230066 241395 255314 270359 285308 299016 309581 315218 316120 314327 311672 308877
56547 308877 306438 304850 303671 301643 298260 294256 290260 285987 281075 275788 270552 265634 261513 258612
56533 258612 256457 254026 251139 248564 246527 244186 240943 237342 234197 231677 229566 227608 225302 222258
56519 222258 219077 217014 216432 216429 216235 215970 215708 214927 213498 212273 211984 212304 212567 212715 212942 213072 212924 212778
56501 212778 212884 212968 212670 212065 211426 210896 210617 210681 210695 209956 208337 206554 205417 205279 206185 207792 209111 209175
56483 209175 208264 207763 208542 210157 211749 212898 213356 212874 211694 210578 209994 209926 210560 212251 214552 216259
56467 216259 216898 217372 218672 220730 222938 224939 226346 226527 225379 223830 222947 222874 222992 222783 222273 222064 223001
56450 223001 225264 227719 228899 228696 228283 228339 228345 227878 227426 227419 227483 227306 227387 228232 229540 230864 232383 234350 236353
56431 236353 237812 238742 239472 240084 240682 241721 243506 245686 247750 249694 251775 253910 255670 256640 256584 255563
56415 255563 254032 252533 251226 250010 249014 248477 248277 248149 248279 249032 250179 251056 251460 251706 252018 252545 253709
56398 253709 255702 257922 259866 262149 265514 269237 271965 273796 275808 277583 277077 273285 267359 260687
56384 260687 253675 247029 242368 240453 240108 239880 239685 240103 241302 243440 246925 251421 255727 259354 263066
56369 263066 267204 270765 272953 274366 275774 276987 277806 278762 279916 280290 279597 279239 280342 281996 282778 282912
56353 282912 283513 284642 285594 286347 287278 288086 288340 288609 289740 291340 292109 291469 290074 289061 289430 291609 294918
56336 294918 298049 300584 303315 306704 310164 313493 317651 323138 328834 333648 338167 343422 349084 354231
56322 354231 358871 363186 366108 366341 364326 361731 359269 356331 352520 348394 344801 342305 341007 340289 339238
56307 339238 337868 337249 337861 338837 339487 340361 341923 343435 344429 346092 349733 354779 359662 363793 367292 369708
56291 369708 370647 371037 372278 374628 377655 381522 386439 391595 396131 400561 405774 411280 415969 420055 424678
56276 424678 430002 435230 440170 445380 451066 457129 463930 471777 480146 488615 498021 509344 522037 534883
56262 534883 547982 562462 578697 596302 615433 636635 659820 684888 713049 746070 784425
56251 784425 827496 875238 928422 987636 1053330 1126370 1207188 1294735 1387559 1485422 1588601
56240 1588601 1696202 1806490 1918162 2029685 2137871 2238696 2329201 2407332 2470616 2516590
56230 2516590 2544101 2552722 2541651 2510844 2462637 2400487 2326630 2242615 2151281 2056054 1958626
56219 1958626 1859377 1759815 1662622 1569421 1480450 1396293 1318068 1245904 1179041 1117429 1061537
56208 1061537 1010795 964020 921278 883514 850431 820509 793072 768544 746771 726897 708911
56197 708911 693515 680394 668339 657106 647451 639341 631831 624727 618732 613929 609714 606133 603645
56184 603645 601702 599255 596494 594388 592762 590643 588284 586887 586467 585943 585240 585279 586011 586472 586758 587898
56168 587898 589751 591093 591865 593264 595574 597969 600499 604142 608754 613170 617536 623427 631342 640123
56154 640123 649047 658389 667823 676544 685292 695966 708853 722467 736559 752971 772923 795699
56142 795699 820786 849249 882106 919117 959919 1004746 1053684 1107025 1166954 1237102 1319712
56131 1319712 1414234 1518195 1627233 1734371 1832007 1915978 1986740 2046945 2099854 2149635 2199972
56120 2199972 2250916 2298429 2337369 2363734 2374959 2370981 2355551 2334191 2310181 2283779 2254330
56109 2254330 2220191 2176922 2119128 2045284 1958714 1863913 1764638 1665547 1572095 1487479 1412006
56098 1412006 1345953 1290442 1245001 1207159 1175262 1149263 1128361 1110744 1096206 1086114 1080096
56087 1080096 1075678 1071884 1070218 1071283 1073486 1076015 1080145 1086489 1093763 1101306 1110089 1120367 1130952
56074 1130952 1141559 1153081 1164991 1175533 1185057 1195910 1208286 1219619 1228990 1238738 1250644 1263932
56062 1263932 1278089 1294204 1312256 1330441 1348364 1367662 1388480 1408769 1428013 1447915 1468373
56051 1468373 1486711 1502141 1517067 1532673 1547283 1560550 1575097 1592365 1610845 1630046 1652005
56040 1652005 1677074 1702542 1727388 1754215 1784458 1815866 1846730 1878309 1911003 1942609 1972629
56029 1972629 2003970 2038082 2072721 2106725 2142436 2181116 2220691 2260507 2303471 2350776 2399155
56018 2399155 2446173 2493652 2543336 2594043 2645779 2701724 2763329 2828331 2896164 2969987 3050778
56007 3050778 3134996 3220838 3310947 3406166 3503010 3600658 3703977 3816036 3934027 4056148
55997 4056148 4185668 4324347 4468929 4618427 4777734 4949579 5130228 5317734 5517003
55988 5517003 5732007 5960803 6203099 6464540 6748217 7050411 7370186 7714417 8087854
55979 8087854 8487826 8914838 9378524 9886746 10439444 11040251 11703116 12440063 13254167
55970 13254167 14152568 15154200 16276633 17529166 18928683 20508917 22305704 24350137
55962 24350137 26688558 29394842 32554843 36260216 40631705 45829897 52034360 59443215
55954 59443215 68318568 79022815 92020015 107896675 127404290 151431555 180885100
55947 180885100 216518754 258519042 305517264 353348681 394886375 422083162 429468467
55940 429468467 416643104 387934386 349802381 308174418 267205037 229314725 195652034
55933 195652034 166517142 141722072 120867935 103474658 89021142 77000925 66981409
55926 66981409 58605023 51560700 45587959 40494247 36136784 32390741 29149214 26336498
55918 26336498 23895407 21766586 19894745 18243800 16787976 15495491 14335475 13292268
55910 13292268 12357932 11517232 10752640 10056890 9427640 8855535 8328832 7843954 7400672
55901 7400672 6992345 6611001 6256651 5931911 5632369 5351238 5088422 4846235 4621110
55892 4621110 4408156 4209178 4027721 3860457 3701553 3551415 3413235 3284877 3161900
55883 3161900 3045055 2937384 2837348 2742023 2653928 2577705 2512644 2454501 2401283 2351000 2297293
55872 2297293 2234434 2164342 2092641 2020458 1946034 1871372 1800613 1733874 1668872 1606779 1550627
55861 1550627 1499576 1450385 1403059 1359792 1319812 1280473 1242213 1207692 1177264 1149675 1125645
55850 1125645 1106237 1089103 1070668 1050724 1030972 1010818 988798 966355 945849 926322 905426
55839 905426 883980 864412 846216 827248 808195 791498 776970 762560 748391 736153 725590
55828 725590 715429 706608 700735 696390 690783 683986 677774 671436 662701 651922 641316 630797 618480
55815 618480 604850 592541 582225 572256 562252 553709 547197 541978 538144 536243 535183 533332 531246
55802 531246 530621 531320 532346 534881 541104 550420 559940 568289 575967 582545 586662 588552 589471 588759 584506
55787 584506 577081 569118 561906 554519 546574 539230 533221 528132 523567 518841 511851 500730 486532 472111
55773 472111 458668 445723 434005 425531 420753 418081 416431 416098 417073 418559 420172 421664 421705 419011
55759 419011 414518 410396 407117 403412 398652 393085 386109 376741 365777 355325 346191 337627 329378 321887
55745 321887 314702 306895 298989 292413 287174 282062 276942 272687 269118 265272 261716 260289 261348 263285
55731 263285 264875 266194 267122 266999 265970 264894 263725 261589 258373 254550 249704 243145 235866 229846 225426
55716 225426 221310 217149 214164 213116 213527 214975 217352 219854 221586 223282 226601 231649 236920 241537
55702 241537 245613 248494 248834 246636 243273 239263 233944 227579 221700 216928 212316 207374 203061 200286
55688 200286 198989 199041 200510 202679 204331 205364 206793 208984 211295 213519 216139 219116 221989 225102 229017
55673 229017 232633 233764 231906 228735 225662 222544 219065 215634 212463 209303 206465 204701 203916 203423 203498
55658 203498 204978 207275 208667 208901 209714 212356 216272 220593 225197 229785 233569 236505 239408 242385 244503
55643 244503 245271 245014 243609 240455 235914 231144 226261 220386 213738 207756 202762 197468 191437 186091 182524
55628 182524 180069 177875 176180 175109 173863 172139 170914 170831 171097 170897 170649 170972 171523 171682 171361 170512 168912
55611 168912 166984 165711 165270 164873 164289 164110 164174 163333 161397 159707 159060 158600 157547 156466 155850 154916 152899
55594 152899 150296 147878 145664 143807 143138 143800 144501 144187 143357 142751 141898 140211 138461 137856 138411 139366 140532
55577 140532 142109 143762 144924 145684 146584 147892 149666 152080 155128 158421 161630 164699 167452 169644 171489
55562 171489 173339 174793 175138 174758 174893 175741 176046 174868 172489 169251 164956 160002 155654 152455 149563
55547 149563 146283 142972 139834 136276 132299 129146 127546 126564 125190 123879 123470 123748 124114 124625 125278 125299
55531 125299 124284 123163 122940 123297 123441 123421 123580 123563 123051 122802 123870 126284 129290 132268 134688 135997 136404
55514 136404 137023 138497 140235 141695 143393 145755 148045 149430 150188 150766 150523 148586 145192 141061 136175
55499 136175 130340 124331 119284 115460 112595 110935 110871 112027 113630 115337 116907 117734 117621 117426 117939 118661
55483 118661 118555 117452 115861 114026 112095 110642 110080 109998 109877 109880 110213 110439 110206 109902 109750 109070 107396 105452
55465 105452 104048 102887 101583 100916 101685 103049 103505 103022 102837 103518 104573 105676 106959 108239 109104 109646
55449 109646 110232 110789 111182 111822 113024 114270 115087 115994 117490 118727 118491 117000 115465 114299 113149 112212
55433 112212 112026 112138 111561 110432 109876 110233 110792 111248 112068 113257 114102 114331 114415 114543 114426 114257 114747 115970
55415 115970 117185 118023 118896 119999 120861 121089 120749 119934 118788 117972 118122 118776 118877 118441 118592 119712 120646
55398 120646 120221 118688 117187 116495 116691 117400 117966 117863 117209 116475 115764 114945 114396 114752 115872 116889 117385
55381 117385 117719 118021 117777 116698 115254 114020 113175 112899 113557 115127 117079 119074 121215 123355 124872 125506
55365 125506 125824 126398 126969 126819 125664 123836 121885 120244 119031 118018 116969 116014 115411 115051 114656 114356
55349 114356 114521 115002 115169 114830 114521 114666 114914 114651 113812 112929 112637 113273 114777 116795 118908 120749 121863
55332 121863 121775 120478 118618 116870 115388 114197 113667 113996 114576 114586 114098 113854 114026 113957 113194 112162 111646 112087
55314 112087 113392 114958 115885 115773 115323 115593 116598 117260 116872 116036 115894 116891 118519 119960 120748 121081 121546
55297 121546 122376 123038 122881 122059 121353 121145 121091 120837 120511 120323 120117 119624 118910 118356 118321 118957 120261 122152 124380
55278 124380 126363 127348 127114 126427 126339 126974 127553 127657 127797 128471 129361 129929 130137 130073 129498 128414 127533 127481 127941
55259 127941 128234 128284 128381 128482 128424 128376 128414 128194 127787 128206 130062 132181 132666 131120 128836 126988 125658 124522
55241 124522 123543 122891 122829 123563 124648 124975 124132 123275 123698 125000 125780 125713 125633 125828 125668 124976 124434 124442 124641 124709
55221 124709 124564 123771 121950 119848 118825 119055 119400 119248 119265 120053 121263 122459 123723 124966 125687 125905 126390
55204 126390 127500 128676 129466 130072 130573 130597 130209 130089 130337 130094 128863 127297 126173 125528 125253 125502 125955
55187 125955 125777 124969 124687 125473 126231 125899 125109 125075 125663 125830 125419 125254 125681 126141 126160 125913 125761 125846 126134 126450
55167 126450 126608 126790 127535 129020 130737 132169 133320 134220 134497 134044 133618 134111 135503 137027 138073 138453
55151 138453 138182 137552 137166 137362 137759 137706 137030 136110 135492 135612 136481 137388 137410 136446 135330 134715 134451 134266 134271 134346
55131 134346 133820 132405 130827 129882 129482 129259 129472 130471 131685 132092 131492 130647 130301 130659 131580 132734 133694
55114 133694 134429 135411 136808 137947 138175 137925 138227 139328 140439 140739 140122 139106 138535 139154 140914 142758
55098 142758 143646 143695 143867 144650 145549 145814 145202 144069 143111 143014 144029 145845 148018 150276 152260 153396 153461
55081 153461 153018 152765 152684 152261 151380 150465 149860 149510 149203 148745 147976 146990 146315 146512 147574 148919 149896 150142
55063 150142 149619 148620 147617 146901 146439 146160 146082 146030 145645 144958 144546 144736 145000 144619 143710 143088 143251 143991 144924
55044 144924 145944 147026 147918 148219 147750 146799 145941 145482 145203 144826 144514 144488 144377 143591 142331 141473 141305 141172
55026 141172 140707 140518 141173 142159 142577 142294 141747 141070 140105 138941 137746 136355 134657 133184 132678 133198 134176
55009 134176 135182 136156 137085 137986 139088 140529 142022 143179 144009 144729 145349 145821 146314 146869 147114 146875 146828
54992 146828 147907 150166 152726 154759 156049 156670 156651 156041 155048 154023 153357 153144 152878 151908 150394 149300
54976 149300 149158 149447 149620 150063 151259 152551 152711 151591 150373 150129 150816 151723 152410 153083 154310 156314 158414
54959 158414 159494 159323 158919 159213 159938 160438 160897 161851 162932 163204 162623 162144 162332 162760 162873 162641 162221 161689
54941 161689 161278 161264 161440 161277 160714 160220 160029 159906 159750 159829 160326 161198 162566 164572 166756 168257 168896 169451
54923 169451 170591 172134 173768 175973 179656 185129 191864 199188 206854 214890 223043 230533 236447 240390
54909 240390 242521 242827 240764 235998 229279 222059 215296 209005 202913 197103 191954 187818 184770 182489
54895 182489 180450 178410 176492 174593 172146 168908 165686 163635 163012 163204 163787 164889 166535 168291 169757
54880 169757 171011 172551 175031 178869 183720 188637 193284 198671 205996 214987 224106 232187 238959 244070
54866 244070 246644 246177 243121 238231 231922 224544 216714 209076 202094 196148 191383 187391 183578 179852
54852 179852 176432 173121 169567 166237 164140 163307 162448 160573 158165 156218 154872 153635 152390 151469 151026
54837 151026 150932 151047 151225 151278 151348 151946 153237 154544 154987 154410 153427 152774 152865 153637 154519 154888 154882 155380 156821 158414
54817 158414 159039 158647 158190 158323 158744 158815 158281 157329 156326 155761 156131 157583 159683 161635 162765 162832 162029 160824
54799 160824 159810 159541 160232 161531 162781 163610 164139 164542 164730 164627 164380 163942 162817 160815 158792 157981 158610
54782 158610 159810 160914 162142 163894 166038 168233 170337 172090 172940 172748 172410 173222 175677 179161 182804
54767 182804 186378 190337 195201 200959 207116 213325 219785 226857 234448 242038 249119 255184 259457 261177
54753 261177 260252 257221 252554 246416 239091 231106 222863 214664 207161 201135 196602 192726 188902 185400
54739 185400 182661 180547 178732 177336 176647 176494 176424 176316 176423 176956 177883 178987 179911 180441 180990 182414 185063
54722 185063 188371 191808 195856 201454 208720 216855 225188 233613 241773 248450 252177 252310 249280 244022
54708 244022 237483 230550 223984 218152 212912 207970 203286 199015 195121 191345 187591 184100 181119 178694
54694 178694 176890 175891 175603 175477 175031 174340 173692 173083 172456 172070 172070 171954 171150 170030 169635 170373 171573 172396
54676 172396 172574 172168 171291 170310 169776 169791 169847 169513 168902 168287 167689 167056 166495 166132 166058 166456 167399 168437 168885
54657 168885 168648 168291 168140 167836 167015 165939 165152 164856 164887 164963 164795 164277 163796 163995 165111 166805 168609 170105
54639 170105 170732 170165 169025 168516 169033 169680 169496 168519 167340 166237 165225 164458 164009 163589 162838 161642 160006
54622 160006 158107 156710 156883 158780 161215 162935 163925 165036 166736 168711 170352 171200 171190 170811 170696 170848
54606 170848 170700 170135 169778 169924 169898 169100 168043 167610 167765 167746 167162 166250 165358 164847 165156 166280 167429 167827
54588 167827 167575 167136 166409 165149 163954 163889 165142 166798 167938 168279 167795 166576 165201 164524 164781 165381 165720
54571 165720 165756 165655 165425 165147 165171 165765 166774 167789 168546 169116 169819 170912 172291 173551 174429 174954 175144 174931
54553 174931 174587 174769 175747 176924 177506 177346 176773 175999 175162 174536 174132 173484 172429 171723 172086 172902 172795 171488
54535 171488 170188 170033 170930 172191 173562 175131 176671 177614 177645 177118 176870 177562 179065 180616 181665 182329
54519 182329 182846 183035 182721 182327 182418 182889 183169 183082 182866 182514 181760 180747 180042 179858 179720 179051 177720 176079
54501 176079 174830 174712 175796 177184 177958 178301 179016 180056 180396 179501 178190 177651 178126 178858 178958 178104 176777
54484 176777 175949 176245 177299 178246 178735 179008 179163 179057 178923 179328 180287 181152 181616 182165 183216 184495 185656
54467 185656 186820 188027 188794 188874 188980 190008 191748 193042 193142 192446 191883 191971 192526 192922 192645 191740 190740
54450 190740 190067 189598 188951 187997 186987 186331 186374 187127 188059 188373 187742 186619 185701 185310 185418 185972 186793 187374
54432 187374 187190 186308 185438 185269 185818 186420 186343 185429 184220 183394 183146 183183 183284 183596 184338 185438 186622 187724
54414 187724 188741 189675 190438 190957 191316 191773 192504 193269 193490 192847 191705 190735 190236 190026 189880 189689 189251 188378
54396 188378 187326 186800 187301 188660 190345 192016 193615 195156 196634 198150 199953 202323 205304 208441 210824
54381 210824 211624 210694 208616 206242 204269 203081 202670 202642 202462 201808 200661 199212 197824 196930 196694 196848 197046
54364 197046 197335 197992 199025 200094 200868 201226 201125 200608 199961 199643 199996 201025 202363 203380 203669 203549 203759
54347 203759 204371 204438 203176 201084 199327 198351 197807 197519 197606 197722 197170 195964 194946 194520 194086 193106 192058
54330 192058 191770 192329 193220 194120 195005 195745 196100 195992 195480 194700 194120 194509 196157 198300 199781 200246 200315 200602
54312 200602 201010 201130 201061 201473 202827 204693 206097 206598 206752 207332 208345 209216 209754 210398 211488 212862 214435
54295 214435 216703 220283 225192 230882 236816 242754 248534 253849 258280 261420 262978 262749 260587 256580
54281 256580 251343 245870 240868 236366 232165 228357 225152 222496 220279 218644 217545 216398 214826 213500
54267 213500 213336 213972 213975 212655 210739 209100 207804 206830 206648 207380 208131 207988 207205 206710 206914 207645 208799 210242
54249 210242 211338 211413 210664 209979 209854 210009 210044 209950 209959 210265 210944 211755 212053 211236 209388 207317 205951 205756 206516
54230 206516 207424 207608 206897 205959 205455 205261 204834 204167 203907 204512 205612 206334 206140 205319 204701 204860 205599 206312
54212 206312 206712 206853 206548 205374 203480 201788 200942 200530 199898 199291 199445 200225 200502 199592 198216 197718 198666
54195 198666 200521 202451 204059 205327 206174 206401 206089 205750 205799 206031 205915 205330 204608 203884 202985 202072 201804 202463
54177 202463 203407 203854 203835 203876 204034 203871 203288 202739 202535 202408 201969 201307 200887 201001 201468 201832 201753 201204 200386 199607
54157 199607 199241 199550 200293 200762 200587 200371 200972 202280 203315 203612 203747 204257 204807 204949 205045 205771 207092 208391
54139 208391 209378 210254 211197 212156 213036 213607 213496 212748 212158 212465 213373 213965 213950 213852 213988 213940 213273 212264 211623
54120 211623 211809 212783 214206 215709 217099 218331 219259 219578 219261 218871 219115 220103 221303 222137 222392 222158 221690
54103 221690 221307 221128 220974 220685 220446 220527 220846 221047 220921 220477 219746 218769 217716 216683 215505 214017 212444
54086 212444 211224 210529 210207 210091 210137 210384 210948 211921 213074 213918 214329 214802 215739 216795 217395 217674 218354 219772
54068 219772 221521 222965 223697 223514 222496 221125 219958 219113 218363 217717 217488 217776 218229 218482 218587 218938 219878
54051 219878 221362 222951 224270 225439 226814 228249 229202 229736 230749 232724 234910 236486 237935 240364 243802
54036 243802 247273 250372 253730 257839 262443 267309 272610 278173 283208 287244 290722 294251 297816 301086
54022 301086 303868 305929 307002 307475 308501 310816 313755 315897 316335 315005 312294 308937 305881 303519 301222
54007 301222 298152 294419 290893 288073 285741 283627 281724 279836 277467 274462 271317 268524 266001 263532
53993 263532 261451 260349 260161 260127 259730 259248 259104 259135 258979 258850 259290 260176 260677 260368 259784 259550 259449 258831 257525
53974 257525 255840 254012 252303 251406 252076 254226 256872 258997 260196 260578 260549 260685 261402 262693 264554 267442
53958 267442 271738 276888 281866 286643 292555 300892 311758 324720 340045 358760 381787 409397 441021
53945 441021 474653 506196 530140 541790 539536 525389 503539 478277 452801 429237 408992 392729
53933 392729 380238 370710 363247 357182 352224 348489 346120 344650 343075 340885 338652 337167 336341 335579
53919 335579 334952 335225 336736 338996 341528 344426 347882 351721 355719 359940 364496 369324 374366 379650 385048
53904 385048 390254 395019 399089 401880 402739 401642 399242 396135 392512 388570 384696 381035 377367 373596
53890 373596 369943 366474 362900 359070 355196 351393 347363 342753 337501 331722 325746 320339 316302 313590
53876 313590 311333 308953 306713 304974 303530 302052 300598 299198 297505 295362 293264 291686 290348 288657
53862 288657 286573 284481 282538 280657 278931 277508 276190 274665 273024 271600 270401 269151 267848 266845
53848 266845 266334 266081 265748 265292 264933 264796 264658 264161 263364 262869 263079 263628 263931 264056 264326 264238 262788 260090
53830 260090 257673 256739 256891 257121 257252 257706 258544 259545 260695 261868 262471 262210 261806 262179 263277 264374 265135
53813 265135 265610 265652 265263 265136 265893 267077 267886 268621 270247 272702 274967 276913 279742 284141 289200 293716
53797 293716 297647 301595 305655 309503 313029 316249 319039 321541 324335 327649 330878 333487 335973 339270
53783 339270 343520 348027 352157 355646 358251 359902 361182 363004 365670 368763 372134 376542 383159 392861
53769 392861 406258 424108 447466 477511 515000 558821 604089 641989 663029 662036 640786 606082
53757 606082 565406 524007 484768 449281 418428 392512 371444 354860 342029 331987 324037 317823
53745 317823 312739 307770 302403 297302 293461 290905 288934 287451 287128 288013 288853 288411 286975 285989 286461 288178
53729 288178 290266 291958 292926 293372 293894 294906 296120 296868 297004 297126 297840 299137 300756 302821 305688 309165
53713 309165 312334 314392 315500 316541 318167 320290 322480 324559 326696 329130 332069 335797 340646 346780
53699 346780 354087 362365 371590 381893 393207 404973 416376 427010 437244 447770 458817 469968
53687 469968 480628 490405 498891 505305 508543 507599 502075 492566 480621 468007 455750 443924 432377
53674 432377 421401 411571 403265 396564 391417 387598 384647 382112 379779 377501 374978 371997 368781 365801
53660 365801 363210 360691 357887 354864 352107 350160 349205 348940 348924 349016 349312 349643 349515 348689 347525 346518 345792
53643 345792 345361 345505 346389 347566 348418 349051 350188 352099 354142 355591 356521 357605 359291 361437 363682 365902
53627 365902 368263 370918 373746 376480 379060 381713 384612 387708 391037 394920 399557 404602 409483 413995
53613 413995 418189 421881 424810 427325 430354 434431 439130 443689 447944 452392 457519 463267 468977 473724
53599 473724 476937 478899 480476 482205 483764 484500 484287 483608 482937 482323 481598 480700 479664 478419 476700 474188
53583 474188 470794 466918 463365 460802 459145 457633 455599 453072 450477 447890 444974 441694 438690 436599
53569 436599 435236 433805 431860 429705 427853 426421 425145 423755 422284 421164 420922 421517 422077 421753 420837
53554 420837 420585 421817 424187 426950 429777 432521 434755 436218 437347 438760 440389 441702 442739 444368
53540 444368 447451 452096 457814 464130 470926 478346 486417 494817 503185 511680 520894 531104 541918 552866
53526 552866 563931 575228 586679 598443 611192 625380 640557 656047 671991 689087 707529
53515 707529 726962 747362 769145 792361 816551 841634 868247 896960 927662 959940 993573
53504 993573 1028360 1063845 1099550 1135228 1170720 1205849 1240577 1274954 1308734 1341200 1371428
53493 1371428 1398601 1422273 1442714 1460858 1477443 1492330 1505213 1516860 1528863 1542029 1555799
53482 1555799 1569514 1583475 1598244 1613529 1628412 1642342 1655372 1667701 1679411 1690413 1700110
53471 1700110 1707280 1710827 1710663 1707594 1702412 1695348 1686257 1674934 1661225 1645206 1627382 1608622 1589698
53458 1589698 1570824 1551593 1531423 1510126 1487986 1465203 1441477 1416445 1390391 1364140 1338296
53447 1338296 1313003 1288444 1265007 1242803 1221495 1200912 1181427 1163457 1147047 1132347 1120085
53436 1120085 1110929 1104440 1099200 1094133 1089494 1086528 1086290 1088857 1093501 1099485 1106632 1115110 1124880 1135667
53422 1135667 1147464 1160731 1175979 1193331 1212567 1233362 1255423 1278623 1303121 1329119 1356506
53411 1356506 1385056 1415014 1447132 1481907 1519061 1557909 1597974 1639185 1681844 1726585 1774018
53400 1774018 1824160 1876491 1930751 1987273 2046318 2107506 2170251 2234350 2299737 2365909 2432192
53389 2432192 2498408 2564878 2631727 2698508 2764377 2828366 2889562 2947381 3001623 3052074 3098192
53378 3098192 3139486 3176049 3208311 3236284 3259389 3277063 3289285 3296454 3298948 3296824 3289717 3276992
53366 3276992 3258091 3232663 3200262 3160130 3111735 3055604 2993444 2927309 2858756 2788711 2717877
53355 2717877 2647069 2577196 2508952 2442541 2377812 2314781 2253941 2195963 2141112 2089062 2039124
53344 2039124 1990421 1941929 1892792 1842964 1793542 1746207 1702147 1661408 1623266 1587145 1553171
53333 1553171 1521962 1494122 1469971 1449467 1432096 1416942 1403148 1390317 1378337 1366902 1355490
53322 1355490 1343777 1331790 1319718 1307916 1297145 1288286 1281490 1275796 1269977 1263730 1257891 1253546 1251131
53309 1251131 1250413 1251171 1253637 1258187 1264726 1272645 1281498 1291428 1302823 1315850 1330588 1347333 1366376
53296 1366376 1387645 1410960 1436466 1464319 1494114 1525138 1557151 1590390 1624760 1659524 1693760
53285 1693760 1726589 1757030 1784337 1808669 1830781 1850857 1868204 1882249 1893121 1900938 1905245 1905584
53273 1905584 1902031 1894727 1883544 1868780 1851641 1833255 1813554 1791718 1767428 1741049 1712936 1683273
53261 1683273 1652503 1621203 1589473 1556924 1523263 1488543 1452945 1416727 1380355 1344300 1308794
53250 1308794 1274086 1240719 1209084 1178771 1148845 1118796 1088911 1059787 1031811 1005106 979586
53239 979586 955002 931144 907999 885598 863884 842907 822976 804341 786988 771018 756892
53228 756892 744887 734502 724881 715693 707117 699058 690840 681736 671433 660018 647860 635509 623295
53215 623295 610938 597823 583705 569017 554574 541232 529658 520053 512022 504935 498341 491897
53203 491897 485162 477908 470535 463743 457673 451721 445206 438052 430707 423594 416711 409757 402711 396199
53189 396199 390971 386972 383307 379323 375276 371675 368450 365261 362255 359893 358226 356852 355478 354065
53175 354065 352584 351144 350213 350172 350731 351211 351362 351435 351572 351626 351530 351395 351303 351417 352156 353757 355719 357234 358097
53156 358097 358688 359168 359296 359055 358810 358730 358566 358092 357342 356421 355571 355393 356349 357987 359306 360037 360919 362542
53138 362542 364553 366299 367651 368772 369553 369760 369453 368874 368152 367373 366731 366340 366070 365717 365164 364341 363341
53121 363341 362622 362713 363556 364446 364792 364656 364448 364390 364382 364120 363285 361892 360435 359322 358224 356487 354151 351884
53103 351884 349778 346977 342863 338062 333787 330650 328514 327036 325815 324425 322840 321626 321176 321000 320313
53088 320313 319095 318038 317509 317180 316697 316202 316032 316266 316738 317216 317433 317198 316639 316144 315920 315739 315264 314465
53070 314465 313557 312638 311604 310390 309097 307772 306308 304737 303500 303115 303539 304104 304165 303658 303010 302760 303291
53053 303291 304616 306292 307816 309242 311042 313267 315350 317029 318861 321284 323647 324897 324899 324351 323662
53038 323662 322726 321664 320956 320727 320684 320874 321756 323362 325071 326444 327621 328644 329076 328646 327678 326530 325152
53021 325152 323575 322321 321805 321768 321718 321612 321723 322144 322807 323727 324885 326126 327414 328852 330224 330877 330399
53004 330399 329119 327670 326380 325323 324550 323921 323075 321939 320976 320589 320641 320883 321432 322358 323151 323184 322508 321710
52986 321710 321156 320833 320773 321142 321946 323032 324341 325785 326968 327433 327289 327293 328204 330111 332340 333954 334459
52969 334459 334208 334072 334686 336095 338042 340229 342295 343905 345117 346356 347862 349496 351152 352928 354673
52954 354673 355816 355996 355502 354824 354099 353220 352009 350002 346668 342316 338254 335446 333409 331123 328608
52939 328608 326798 326045 325631 324826 323685 322649 321953 321679 321884 322433 323027 323518 323951 324207 323895 322786 321136
52922 321136 319495 318318 317759 317613 317462 317043 316533 316368 316777 317605 318477 319042 319129 318789 318125 317097 315665 314114
52904 314114 312954 312394 312255 312408 312851 313226 312925 312035 311562 312132 312979 312909 311910 311008 310819 311092 311598 312513 313655
52885 313655 314227 313810 313106 313164 314090 314935 314774 313593 312113 311047 310650 310886 311721 312950 313976 314224 313933
52868 313933 314036 315027 316367 317329 317987 318887 320160 321550 323058 324926 327111 329379 331768 334384 336782
52853 336782 338168 338322 337862 337589 337939 338969 340337 341300 341182 339883 337524 333825 328531 322398 316950 313006
52837 313006 310027 307119 304096 301300 299000 297377 296600 296517 296626 296696 297125 298344 300217 302322 304489 306631
52821 306631 308295 308822 307894 305673 302606 299374 296799 295443 295253 295810 296781 297921 298853 299285 299496 300310
52805 300310 302448 306056 310887 316636 322722 327799 330026 328432 324037 319175 315405 312413 309155 305577
52791 305577 302530 300299 298125 295423 292713 290841 289769 288775 287599 286811 286949 287764 288508 288729 288568 288377
52775 288377 288272 288112 287814 287568 287692 288294 289127 289744 289836 289487 289118 289092 289406 289839 290364 291117 292006 292682 293070
52756 293070 293582 294583 295900 297160 298269 299234 299774 299583 298828 297942 297008 295821 294517 293680 293771 294792 296503
52739 296503 298594 300607 302117 303117 303965 304898 305879 306841 307708 308159 307843 306906 305989 305620 305960 307056 308810
52722 308810 310583 311416 310954 309764 308517 307293 305958 304761 304021 303537 302792 301616 300229 298721 296975
52707 296975 295100 293581 292831 292831 293309 294100 295202 296560 297967 299160 299945 300235 300044 299509 298902 298533 298633
52690 298633 299298 300424 301622 302333 302314 301966 301880 302108 302260 302409 303352 305620 308633 311268 313040 314280 315334
52673 315334 316110 316367 316105 315589 315236 315372 315932 316633 317670 319803 323253 326842 328890 328871 327681 326431 325598
52656 325598 325241 325277 325370 325171 324837 324951 325900 327772 330725 334696 338701 341193 341400 339799 337127 333629 329568
52639 329568 325680 322581 320178 318199 316838 316378 316447 316243 315406 314330 313722 314074 315466 317686 320613 324422
52623 324422 329111 333865 337381 339021 339254 338849 338065 336847 335274 333459 331379 329132 327134 325761 325054
52608 325054 324895 325105 325266 324941 324339 324225 324818 325301 324855 323745 322896 322745 323058 323571 324220 324903 325494 326102
52590 326102 326960 328111 329473 330994 332482 333518 333887 333981 334414 335396 336712 338201 339923 341919 344046 345998
52574 345998 347389 348022 348189 348410 348798 348997 348881 348853 349195 349548 349372 348552 347211 345358 343135 341087 339717
52557 339717 339022 338838 339274 340354 341570 342295 342397 342010 341089 339751 338696 338576 339145 339730 340343 341522 343156
52540 343156 344371 344782 345043 345827 346840 347362 347302 347178 347295 347412 347238 346867 346609 346577 346651 346810 347195 347704 347773
52521 347773 346960 345690 344947 345182 345971 346873 348047 349727 351700 353794 356382 359793 363573 366997 370057
52506 370057 373337 377069 380906 384431 387204 388450 387486 384561 380669 376402 371633 366437 361674 358223
52492 358223 356017 354203 352095 349750 347789 346751 346565 346652 346649 346797 347372 348060 348420 348791 350074 352579 355710
52475 355710 358897 362179 365603 368714 371152 373388 376313 380192 384432 388249 391282 393598 395459 397210
52461 397210 399182 401465 403699 405198 405412 404332 402333 399644 396208 392076 387601 383050 378323 373405
52447 373405 368813 365195 362562 360276 357786 355028 352227 349626 347386 345494 343847 342660 342540 343760
52433 343760 345612 346938 347251 346932 346477 346050 345681 345291 344515 343100 341561 340912 341545 342838 344007 344888 345706
52416 345706 346567 347451 348367 349249 349993 350767 351994 353941 356622 360170 364913 370982 378370 387573 399666
52401 399666 415316 433958 453997 473359 489670 500628 504932 502780 495244 483570 469403 454970
52389 454970 442142 431304 421772 413226 406127 400718 396450 392766 389922 388473 388212 388157 387618 386884 386732
52374 386732 387607 389528 392533 396772 402091 407925 413873 420159 427153 434436 440674 444544 445680 444746 442760
52359 442760 440460 438115 435743 433409 431280 429410 427652 425955 424635 424115 424408 425061 425662 426273 427288
52344 427288 428919 430882 432630 433981 435460 437748 440778 443681 445822 447628 450164 454216 460036 467551
52330 467551 476315 485491 494526 503795 514157 525963 538936 552841 567685 583283 599303 615760
52318 615760 632815 649943 665977 680286 693356 705998 718607 731536 745543 761186 778144
52307 778144 795683 813554 831965 850896 870026 889248 908704 928225 947198 965211 982547
52296 982547 999785 1016935 1033111 1047129 1058340 1066718 1072153 1074053 1072093 1067175 1061048 1054829 1048356
52283 1048356 1041161 1033537 1026184 1019270 1012470 1005822 999994 995558 992401 990030 988222 987119 986766 986890
52269 986890 987283 988209 990150 993197 997123 1002198 1009434 1019565 1032112 1045977 1060683 1076293 1092275
52256 1092275 1107456 1121437 1135264 1150112 1165903 1181816 1197657 1213895 1230406 1245875 1258615
52245 1258615 1267657 1273038 1275401 1275472 1273712 1270251 1265134 1258621 1251264 1243727 1236399 1229033 1220840 1211286
52231 1211286 1200812 1190462 1180729 1171154 1161189 1151016 1141213 1131950 1123008 1114401 1106550 1099759 1093769
52218 1093769 1087971 1082056 1076442 1071946 1068903 1066774 1064886 1063411 1063211 1064776 1067838 1072003 1077081 1082641
52204 1082641 1087996 1093121 1098914 1105903 1113094 1118869 1122830 1126088 1129815 1134157 1138698 1143413 1148831 1155480
52190 1155480 1163396 1172082 1180836 1189139 1196725 1203408 1209057 1213747 1217568 1220172 1220809 1218986 1214814 1208584
52176 1208584 1200438 1190708 1180127 1169290 1158246 1146997 1136066 1126113 1117277 1109403 1102673 1097498 1093981
52163 1093981 1092074 1092072 1094310 1098355 1103168 1108208 1113861 1120519 1127619 1133858 1138172 1140344 1140819 1140136 1138539
52148 1138539 1136217 1133835 1132491 1132910 1134892 1137802 1141322 1145399 1149754 1153917 1157561 1160342 1161617 1160910
52134 1160910 1158662 1155957 1153477 1151221 1149260 1148202 1148799 1151538 1156749 1164611 1174906 1187253 1201754
52121 1201754 1218975 1239074 1261392 1285239 1310626 1337826 1366506 1395776 1424946 1453827 1482216
52110 1482216 1509422 1534488 1556880 1576920 1595435 1612907 1629040 1643339 1655947 1667640 1679193
52099 1679193 1691168 1704263 1719121 1735428 1751654 1766189 1778501 1788942 1797741 1804570 1808795 1809522
52087 1809522 1805478 1795562 1779874 1759951 1737815 1714928 1692141 1670250 1650202 1632808 1618537 1607522
52075 1607522 1599502 1593709 1589115 1585071 1581693 1579560 1579141 1580678 1584459 1590850 1599905 1611108 1623635 1636812
52061 1636812 1650271 1663829 1677404 1690968 1704483 1717825 1730841 1743469 1755795 1767986 1780014
52050 1780014 1791322 1800879 1807941 1812742 1816099 1818200 1818170 1815098 1809138 1801248 1792114 1781800 1770322 1758059
52036 1758059 1745515 1733084 1721111 1709838 1699134 1688576 1678007 1667811 1658469 1649976 1641907 1633922
52024 1633922 1625993 1618113 1610065 1601702 1593408 1585980 1579785 1574163 1567987 1560918 1553857 1548053 1544083 1541850
52010 1541850 1541203 1542029 1543767 1545278 1545468 1543895 1540635 1535577 1527935 1516479 1500311 1479400 1454364 1425918
51996 1425918 1394774 1361990 1328971 1296866 1266237 1237398 1210803 1186868 1165675 1146978 1130190
51985 1130190 1114169 1097539 1079797 1061876 1045098 1029704 1014840 999851 984931 970424 955946
51974 955946 940547 923522 904983 885821 867234 850222 835420 823270 814076 807846 804388 803733
51962 803733 806107 811276 818341 826602 836193 847390 859529 871187 881175 888790 893263 893683 889548 880969
51948 880969 868507 853340 837433 822747 810141 799569 791300 786236 784977 787299 792755 801079 811751
51935 811751 823830 836548 849521 862149 873525 883256 891656 898537 902400 901478 895259 884438 869781
51922 869781 851729 830892 808250 784787 761372 738907 718176 699477 682700 667797 654997
51911 654997 644564 636411 629902 624045 618239 612993 609641 609166 611636 616827 624860 635846 649411 665092
51897 665092 682821 702473 723123 743213 761096 774903 782306 781441 772320 756819 737261 715460
51885 715460 693011 671608 652600 636644 624060 615140 609863 607746 608410 612048 619083 629588 643388
51872 643388 660448 680701 703493 727512 751284 773475 792718 807518 816599 819299 815569 805800
51860 805800 790842 772137 751581 731080 712233 696336 684336 676545 672410 670877 671178 673295 677623
51847 677623 684267 692594 701465 709877 717507 724649 731682 738733 745944 753718 762251 770705 777144 779481
51833 779481 776539 768488 756726 743384 730458 719059 709634 702791 699248 698548 698380 695979 690241 682030
51819 682030 672633 662604 652194 642049 632920 625085 618612 614056 612348 613886 618065 623820 630388
51806 630388 637377 644248 649978 653289 653247 649719 643330 634936 625130 614372 603495 593807 586392 581396
51792 581396 578263 576518 575946 575949 575284 572886 568844 564256 560264 557523 556392 557017 558970 561231 562934 564016
51776 564016 564835 565287 564699 562691 559816 557143 555373 554731 555586 558654 564278 571863 580559 590458 602613
51761 602613 617702 634897 652105 667007 677816 683606 684405 680861 673567 662905 649630 635176
51749 635176 620975 607725 595613 584907 575802 567980 561015 555170 551247 549670 550196 552530 556660
51736 556660 562623 570480 580654 593753 609916 628642 649239 670748 691308 708324 719851 725614
51724 725614 726585 724123 719961 716492 716109 719712 725727 730616 730791 724794 714091 701788 690597 682035
51710 682035 676807 674839 674695 673941 670750 664993 657690 650107 643788 640711 642573 649908 662005 677114
51696 677114 692271 703717 708759 707560 702799 697567 693874 692870 695642 703183 715410 730150 743256
51683 743256 750349 749099 740097 725735 708632 691023 674823 661476 651786 646126 644600 646821 651881
51670 651881 658784 666621 674272 680602 685441 689926 695580 703526 714796 730241 749117 768345 784241
51657 784241 794735 799082 796160 784734 765665 742586 719792 700086 684806 674795 670597 672141
51645 672141 678725 688929 700211 709178 712834 709658 699612 683721 663904 642549 621637 602290
51633 602290 585149 570695 558908 549125 540685 533471 527531 522557 518180 514539 512107 511018 510921 511392
51619 511392 512145 512869 513201 512995 512492 512157 512379 513273 514609 515931 516777 516884 516206 514776 512532 509314 505191
51602 505191 500770 496895 493952 491788 490469 490660 492848 496620 501369 507489 516083 527516 541004 555710
51588 555710 571373 587436 602211 613551 620163 622116 620603 617582 615120 614379 615309 617641 621947 629401
51574 629401 640893 656931 678257 705846 740035 779782 822855 866804 910387 954633 1002205
51563 1002205 1054807 1110852 1165983 1216225 1260790 1302479 1346213 1397032 1458201 1529971 1609879
51552 1609879 1694185 1778421 1856280 1919121 1958458 1969860 1954270 1915580 1857701 1784105 1698839
51541 1698839 1606483 1510995 1415290 1321957 1233540 1151889 1077884 1012105 955252 907506 867993
51530 867993 835299 808199 785541 765909 748090 731745 717085 704069 692390 682088 673403 665923
51518 665923 658489 650269 641552 633247 625893 619405 613516 608184 603619 600125 597838 596458 595218 593115
51504 593115 589301 583497 576293 568901 562312 556569 551031 545310 539773 535181 532037 530326 529652 529554 529835
51489 529835 530664 532346 535047 538768 543393 548542 553472 557305 559351 559238 557022 553354 549240 545359 541736
51474 541736 538239 535024 532167 529209 525601 521362 516866 512197 507282 502433 498176 494595 491433 488788
51460 488788 487091 486426 486478 487165 488715 491029 493580 496030 498444 500940 503782 507803 513908 521936 530754
51445 530754 539683 549129 559584 570965 583472 598330 617145 641012 670367 704422 739651 769750
51433 769750 788833 795228 791994 784276 776818 773013 774158 778472 781506 778565 767370 748918 726417
51420 726417 703487 682710 665210 651124 640140 631565 624407 617961 612239 607608 604221 602143 601692
51407 601692 603164 606345 610695 615747 620891 625105 627684 629175 630908 633541 636688 640042 644111 649537
51393 649537 656248 663727 671745 680480 690263 701495 714564 729499 745922 763813 784273 809300
51381 809300 840814 880065 927893 985216 1053026 1131863 1221346 1320352 1427620 1541847 1660588
51370 1660588 1778804 1888706 1981577 2050364 2091338 2104077 2090258 2052285 1992612 1914039 1820367
51359 1820367 1716430 1607209 1496797 1388122 1283467 1185046 1094972 1014770 944971 885251
51349 885251 834914 793267 759613 733008 712081 695153 680621 667310 654442 641406 627927
51338 627927 614566 602561 592567 583726 574571 564818 555665 548193 542177 536705 531285 525858 520368 515083
51324 515083 510960 508826 508277 508033 507439 506976 507194 507751 507790 506906 505434 504000 502993 502363 501886 501640 502125
51307 502125 503781 506503 509888 513747 518063 522628 527144 531571 535928 539830 542733 544626 545890 546407
51293 546407 545445 542690 538854 534914 531156 527364 523524 519872 516491 513332 510552 508442 507109 506586 507154
51278 507154 509157 512470 516511 520848 525515 530532 535298 538643 539624 538341 535994 533987 532853 532126 531364
51263 531364 531135 532751 537027 543453 550491 556493 560444 562269 562729 562924 563701 565359 567729 570335 572553
51248 572553 573888 574185 573410 571211 567040 560927 553823 546860 540452 534473 529087 524743 521278 517710 513353
51233 513353 508709 504747 501594 498533 495128 491743 488930 486908 485809 485857 486925 488301 489308 489911 490404
51218 490404 490786 490879 490903 491441 492771 494579 496467 498479 500996 504234 507990 511825 515427 518810 522089 525156
51202 525156 527767 530047 532703 536441 541191 546074 550125 552975 554951 556742 558921 561533 564092 566164
51188 566164 567968 570216 573201 576230 578198 578742 578614 578788 579362 579523 578541 576472 573847 571033 568119 565086
51172 565086 561709 557513 552399 547209 543076 540138 537451 534332 531242 529051 527979 527744 528363 530283 533892
51157 533892 539271 546187 553886 561057 566484 569789 571396 571894 571667 570802 568998 565769 561154 556051 551378
51142 551378 547049 542212 536395 529998 523760 518192 513502 509605 506223 503348 501493 501025 501385 501546 501234
51127 501234 501059 501437 502120 503007 504649 507468 511021 514629 518371 522906 528477 534596 540621 546170 550975
51112 550975 554763 557460 559276 560434 560928 560679 559945 559397 559648 560645 561719 562429 563223 565042 568295 572522
51096 572522 577039 581614 586417 591570 596797 601334 604148 604585 602898 599914 596105 591356 585790 580289
51082 580289 575775 572256 569070 565971 563405 561643 560139 558149 555743 553821 553087 553336 553894 554501 555483
51067 555483 557189 559657 562878 566943 571706 576712 581904 588222 597028 609002 623986 641752 662090
51054 662090 683723 703652 718380 726125 727875 726554 725450 727179 733187 743264 755442 767140 777230
51041 777230 786959 798283 811275 823735 833544 840747 846927 853303 860264 868182 877188 885690 890131
51028 890131 887165 876031 858533 837086 813286 788145 762909 739101 717772 699049 682632 668616
51016 668616 657562 649776 644962 642740 643073 645816 650252 655656 662086 670031 679351 689156 698732 708090
51002 708090 717629 727722 738612 750078 761134 770674 778604 785808 792901 799554 805204 809777 813542
50989 813542 816969 821172 827779 837741 850539 864993 880595 897802 917485 940417 966752 995503
50977 995503 1024947 1054061 1083180 1112754 1141927 1169072 1193436 1215530 1236079 1255454 1274355
50966 1274355 1294322 1317089 1343521 1373250 1405218 1438593 1473492 1510955 1552159 1597730 1647708
50955 1647708 1701743 1758970 1817899 1876741 1933745 1987107 2035034 2076450 2111409 2140387 2163339
50944 2163339 2179947 2190611 2196578 2199117 2199262 2198535 2199152 2202599 2207703 2210253 2205036 2189018 2163241 2131837
50930 2131837 2099043 2067005 2035944 2005490 1975236 1944465 1912266 1878024 1841407 1801990 1759446
50919 1759446 1714042 1666362 1616569 1564643 1511449 1458818 1408136 1359493 1312710 1268752 1229364
50908 1229364 1195407 1166137 1140167 1116746 1095950 1077953 1062361 1048218 1034565 1021002 1007763
50897 1007763 995265 983684 972979 963219 954663 947494 941626 936897 933402 931423 930901 931115 931171 930875
50883 930875 930915 932097 934528 937653 940854 943845 946687 949699 953330 957846 963126 968900 975196 982341 990507
50868 990507 999447 1008762 1018409 1028874 1040852 1054742 1070492 1087949 1107251 1128711 1152475 1178667
50856 1178667 1207889 1241083 1278696 1320432 1366285 1417479 1475884 1542618 1617715 1701088 1793211
50845 1793211 1894708 2005732 2126071 2255562 2394004 2540658 2694051 2852323 3013624
50836 3013624 3175989 3336631 3491352 3634855 3761925 3868525 3952086 4011347 4046245 4057726
50826 4057726 4047382 4017381 3970895 3912195 3845808 3775674 3705465 3639387 3581788 3535614 3501511
50815 3501511 3478373 3464114 3455629 3448619 3438359 3420972 3394015 3356071 3306132 3243414 3167613 3079261
50803 3079261 2979752 2870942 2754783 2633506 2510106 2388251 2271419 2162036 2061417 1970316
50793 1970316 1889306 1818659 1758024 1706394 1662575 1625896 1596492 1574807 1560778 1553556 1551890 1554483
50781 1554483 1559973 1566839 1573666 1579508 1583926 1586728 1587805 1587145 1584833 1580924 1575365 1568095 1559171 1548697
50767 1548697 1536562 1522400 1505926 1487218 1466538 1443971 1419491 1393369 1366275 1338986 1312208
50756 1312208 1286645 1262852 1240919 1220666 1202287 1186426 1173403 1162785 1154046 1147288 1142929 1141068
50744 1141068 1141661 1145102 1152055 1162796 1177164 1195041 1216420 1241154 1269282 1301636 1339437 1383095
50732 1383095 1431854 1484805 1541777 1603018 1668488 1737843 1810754 1886815 1965340 2045595 2127230
50721 2127230 2210169 2294097 2378149 2461060 2541375 2617442 2687082 2747236 2794115 2824110 2834960
50710 2834960 2826307 2799535 2757502 2704356 2644980 2583971 2524917 2470418 2422351 2381794 2348931
50699 2348931 2323427 2305048 2293674 2288585 2287785 2288200 2286584 2280209 2266783 2244185 2210855 2166667 2113205
50686 2113205 2053081 1989053 1923685 1859210 1797321 1739259 1686295 1639790 1600502 1568236 1542689
50675 1542689 1524423 1514577 1513828 1522128 1539135 1564244 1596251 1633754 1675985 1722657 1772759 1823980
50663 1823980 1873560 1919442 1960612 1996899 2028698 2056544 2080821 2102112 2121703 2141086 2160734
50652 2160734 2179907 2197848 2214626 2230563 2245553 2259606 2273662 2289205 2307204 2328012 2352260
50641 2352260 2381260 2416242 2457445 2504278 2556313 2613815 2677056 2745255 2816566 2889166 2961913
50630 2961913 3033769 3103322 3169613 3233070 3294902 3355966 3417051 3479313 3541799 3597216 3631662
50619 3631662 3631159 3589859 3512787 3411983 3300790 3190251 3087940 2998130 2922810 2862856 2818475
50608 2818475 2789023 2773042 2768643 2773537 2784676 2798248 2810235 2816959 2815170 2801938 2774743 2732044
50596 2732044 2674146 2603506 2523690 2437687 2347391 2254644 2162037 2072169 1986519 1905618 1829942
50585 1829942 1760034 1695971 1637463 1584485 1537335 1496052 1460277 1429665 1403940 1382517 1364597
50574 1364597 1349822 1338502 1331097 1327853 1329007 1334960 1345914 1361435 1380434 1401500 1423330 1445130
50562 1445130 1466636 1487585 1507244 1524753 1539919 1553498 1566700 1580750 1596874 1616295 1640007
50551 1640007 1668645 1702540 1741605 1785068 1831448 1878916 1925626 1969886 2010444 2046837 2079447
50540 2079447 2109219 2137438 2165789 2196344 2231191 2271807 2318621 2371330 2429919 2495447 2569487
50529 2569487 2652739 2744642 2844722 2953966 3074360 3207214 3352305 3508385 3673840 3846812
50519 3846812 4025258 4207163 4390343 4571817 4747507 4912677 5062592 5192867 5299676
50510 5299676 5379867 5430894 5450740 5438240 5393593 5318429 5215466 5088377 4941919 4781795
50500 4781795 4614167 4445369 4281932 4130305 3996101 3883536 3795623 3734720 3702659 3700152
50490 3700152 3725906 3776208 3845420 3926785 4012616 4093884 4160516 4202929 4213657 4187911 4123728
50479 4123728 4022758 3890842 3736680 3569058 3394958 3219602 3047195 2881113 2723770
50470 2723770 2576809 2441444 2318572 2208692 2111628 2026081 1949691 1880078 1815964 1756967
50460 1756967 1702511 1651625 1603894 1559906 1520442 1485749 1455867 1430985 1410883 1394454 1380400
50449 1380400 1368293 1358500 1351230 1346129 1342708 1340736 1340118 1340717 1342412 1345245 1349483 1355465 1363177 1371881
50435 1371881 1380402 1387955 1394540 1400466 1405849 1410796 1415771 1421445 1428365 1436971 1447604 1460115 1473710
50422 1473710 1487677 1502191 1518118 1536165 1556635 1579849 1606262 1636201 1669962 1708354 1752721
50411 1752721 1804269 1863622 1931032 2006546 2089708 2179464 2274694 2374513 2477775 2582549 2686609
50400 2686609 2788338 2886816 2981028 3069483 3150677 3223389 3286112 3336370 3370972 3387011 3382575
50389 3382575 3356906 3310526 3245418 3164809 3072438 2971976 2866934 2760780 2656904 2558641
50379 2558641 2469353 2392118 2329030 2280971 2248242 2231117 2229323 2241028 2262690 2289861 2317915
50368 2317915 2342339 2359109 2365183 2358488 2337448 2301099 2249973 2186512 2114229 2036466 1955906 1874704
50356 1874704 1794569 1716830 1642704 1573357 1509371 1450273 1395021 1342963 1294157 1248896 1207347
50345 1207347 1169722 1136336 1107275 1082262 1061072 1043880 1030896 1021699 1015222 1010505 1007265 1005574
50333 1005574 1005084 1004811 1003769 1001664 998849 995690 992208 988339 984307 980532 977224 974278 971618 969522
50319 969522 968427 968461 969302 970551 972104 974037 976319 978883 981868 985424 989238 992688 995604 998507 1001885
50304 1001885 1005632 1009548 1013966 1019206 1024673 1029222 1032491 1035312 1038687 1042926 1047940 1053803 1060628 1068290
50290 1068290 1076613 1085485 1094507 1102817 1109656 1114930 1119076 1122752 1127077 1133981 1145932 1165131 1192565
50277 1192565 1226768 1262734 1292602 1308989 1308886 1294987 1273657 1251646 1233838 1222652 1218645 1221547
50265 1221547 1230903 1245801 1264196 1282709 1297223 1303900 1300387 1286812 1265823 1241275 1216554 1193877
50253 1193877 1174505 1158882 1146422 1135682 1125168 1114134 1102819 1092136 1083030 1075778 1069962 1065288
50241 1065288 1062183 1061170 1061894 1063438 1065638 1069393 1075397 1083065 1091016 1098128 1103807 1107651 1109402 1109126
50227 1109126 1107099 1103628 1099104 1093862 1087684 1079790 1069739 1058151 1046093 1033971 1021515 1008654
50215 1008654 995819 983338 971131 959186 947888 937624 928433 920277 913343 907797 903419 899778
50203 899778 896624 893886 891498 889506 888240 887989 888470 888923 888929 889015 890293 893528 898679 905299 913214 922705
50187 922705 934140 947700 963561 982142 1003911 1028989 1057228 1088640 1123412 1161293 1201166
50176 1201166 1241444 1280779 1318355 1353813 1387371 1419990 1453049 1487590 1523866 1561504 1599784
50165 1599784 1637526 1672754 1702659 1724117 1734494 1732282 1717239 1690185 1652849 1607830 1558262
50154 1558262 1507176 1457166 1410665 1370098 1337352 1313211 1297548 1289870 1289246 1293912 1301582 1310182
50142 1310182 1317732 1321453 1317773 1303769 1278508 1243070 1200002 1153084 1106729 1064505 1028051 997632
50130 997632 973333 955227 942834 935195 931396 930357 930290 929263 926525 922762 918958 915589 912845 910726
50116 910726 908594 905415 901075 896885 894232 893124 892620 892296 892620 894066 896558 899786 903579 907846 912508
50101 912508 917520 922697 927604 931987 936266 941223 947053 952915 957464 959745 959799 958772 958389 959931 963656
50086 963656 969282 976788 986324 997590 1009970 1023397 1038448 1055351 1073398 1091738 1110278 1129423
50074 1129423 1149313 1169940 1191778 1215634 1241861 1270314 1301266 1335884 1375484 1420650 1471358
50063 1471358 1527571 1589112 1654897 1722738 1790122 1855160 1916892 1975191 2030775 2085235 2140643
50052 2140643 2198885 2261159 2327723 2397534 2467833 2534215 2591455 2634618 2659868 2665017 2649922
50041 2649922 2616506 2568057 2508159 2440050 2366580 2290207 2212752 2135429 2059487 1986872 1919996
50030 1919996 1860768 1809870 1766920 1731148 1701940 1679060 1662412 1651316 1643820 1637032 1628526 1617449
50018 1617449 1604161 1589165 1572888 1556350 1541162 1528253 1516709 1503983 1487112 1463891 1433764
50007 1433764 1398403 1361228 1325614 1293109 1263279 1234910 1207058 1179471 1152920 1129379 1111290
49996 1111290 1100195 1096237 1098965 1108067 1122930 1141796 1161785 1179859 1193872 1203164 1208562 1211677
49984 1211677 1213804 1215291 1215658 1213968 1208998 1199650 1185795 1168708 1150404 1132503 1115750 1100336 1086304
49971 1086304 1073709 1062732 1053749 1047142 1043006 1041051 1040665 1041073 1041742 1042878 1045404 1050099 1056767 1064445
49957 1064445 1072353 1080514 1089653 1100828 1115140 1133401 1155933 1182822 1214417 1251362 1294056 1342206
49945 1342206 1394899 1450895 1508735 1566785 1623486 1677652 1728551 1775793 1819179 1858596 1893740
49934 1893740 1923875 1948069 1965998 1978598 1987636 1994475 1999370 2001887 2001288 1995848 1982206 1956535 1916868
49921 1916868 1863926 1799741 1726445 1646886 1565438 1486859 1414264 1348746 1290658 1240298 1197283
49910 1197283 1160216 1127603 1098875 1074360 1054612 1039959 1030333 1025376 1024877 1029033 1037779 1049962
49898 1049962 1063984 1079620 1098498 1122061 1149288 1176827 1201063 1219675 1231833 1237884 1238973 1236207
49886 1236207 1229788 1219206 1204276 1185526 1163515 1138398 1110558 1081191 1051764 1022984 994611
49875 994611 966160 937475 908878 881216 855744 833538 814878 799384 786671 776495 768286 761150
49863 761150 754739 749787 747324 747584 750021 754238 760343 768414 778200 789646 803339 820168 840683
49850 840683 864939 892577 922647 953407 982642 1008308 1028994 1044110 1054084 1060307 1064416 1067214
49838 1067214 1068137 1065688 1058405 1045628 1027732 1005866 981473 955948 930547 906465 884890 866923
49826 866923 853228 843518 836514 830808 826021 822967 822676 825570 831635 840887 853234 868245 885615
49813 885615 905741 929253 955850 983921 1011442 1036993 1059918 1079943 1096964 1111053 1122438
49802 1122438 1131490 1138640 1144000 1146976 1146477 1141911 1134031 1124664 1115389 1106267 1095713 1081635 1062867
49789 1062867 1039723 1013488 985736 958157 932501 910154 891704 877194 866625 859861 856072 853733
49777 853733 851388 848306 844500 840504 837212 835457 835413 836658 839088 843593 851387 862684 876355 891017
49763 891017 906226 922314 939102 955077 968162 977307 983122 987017 990101 993050 996335 999733 1001436
49750 1001436 998352 987901 969711 945670 918620 891029 864488 839986 818426 800706 787168
49739 787168 777084 769098 762339 756880 752996 750374 748441 747200 747235 748757 751086 753338 755402 757897
49725 757897 761157 764677 767798 770798 774923 781359 790558 802725 818424 838090 860977 885157 908699
49712 908699 930541 950031 966025 976957 981912 981510 977622 972172 966050 958982 950227 939235 925764
49699 925764 909938 892625 875522 860275 847334 835907 824951 813884 802468 790791 779694
49688 779694 770666 764671 761238 759174 758076 758649 761548 766458 772603 779854 788843 800073 813288 827902
49674 827902 843823 861625 882027 905381 931400 958770 984892 1006650 1022120 1031590 1036707 1038871
49662 1038871 1038798 1037253 1035432 1034481 1035162 1038032 1043255 1049674 1054281 1053101 1042886 1022454 993148 958356
49648 958356 922132 887673 856773 830341 808760 791572 777443 765081 754202 745338 738859 734415
49636 734415 731160 728332 725789 724099 723844 724659 725245 724581 722786 720513 717817 714062 708722 701916 694318
49621 694318 686871 680339 674745 669424 663990 658956 654980 651845 648869 646080 644156 643157 642187 640615 638976
49606 638976 638224 638588 639598 640869 642405 644314 646595 649070 651304 652828 653637 654224 654838 654979 653973 651839
49590 651839 649255 646891 645100 644052 643702 643663 643564 643520 643895 644655 645429 646245 647638 649824 652246 654288 656152
49573 656152 658646 662312 667087 672654 678822 685703 693834 704044 716896 732317 749908 769372 790141
49560 790141 810739 829069 843512 853536 859235 860718 858083 851672 842200 830869 819265 808733
49548 808733 799740 792172 786237 782524 781035 780807 780844 780948 781358 782114 783175 784559 785847 786139 785160 783918
49532 783918 783553 783998 784694 786198 790007 796823 806003 816684 828470 840928 853606 866978 882433
49519 882433 900735 921112 942157 962784 981810 997571 1008899 1016186 1020910 1024558 1028534 1034599
49507 1034599 1044555 1059555 1079898 1104784 1131493 1155313 1171292 1176371 1169713 1151816 1124416 1091055
49495 1091055 1056370 1024033 995432 970277 947940 928148 911018 896796 885420 876194 868150 860764
49483 860764 854190 848827 844939 842613 841749 841970 842704 843419 843704 843371 842673 842246 842506 843256 844143 845373 847614
49466 847614 851374 856868 864361 874053 885552 897894 910376 923094 936473 950381 963848 975593
49454 975593 984747 991099 994721 995519 993198 987515 978380 965955 951034 935202 920080 906302 893612
49441 893612 881856 871232 861654 852768 844886 839063 835892 835036 836245 839864 845803 853154 861703 872853
49427 872853 888008 906900 928547 953069 981590 1015415 1056570 1108064 1172261 1250599 1346378
49416 1346378 1463963 1598599 1726209 1810067 1824081 1770601 1675143 1566303 1462091 1370389
49406 1370389 1294494 1235355 1191792 1161687 1142929 1132953 1128828 1128865 1133217 1142113 1154222 1167466 1180800
49393 1180800 1194390 1208397 1222308 1235383 1247151 1257240 1264858 1268724 1267817 1262288 1253272 1241560
49381 1241560 1226823 1208543 1187369 1164999 1143021 1122497 1104485 1090081 1079772 1073217 1069772 1068885
49369 1068885 1070126 1073482 1079647 1089307 1101928 1115601 1128141 1138015 1144417 1147197 1146855 1143910 1138146
49356 1138146 1129146 1117724 1106055 1095905 1087312 1079409 1072010 1065832 1061599 1059517 1059323 1060232 1060937 1060227
49342 1060227 1057687 1053635 1048554 1042799 1036567 1029734 1021920 1013136 1004188 995938 988248 980180 971351 962603
49328 962603 955165 949575 945718 943524 943082 944092 945662 946978 948068 949675 952389 956144 960619 965811
49314 965811 971826 978203 983885 988095 991047 993675 996785 1000584 1004746 1008709 1012123 1015304 1019091 1023935
49300 1023935 1029187 1033633 1036760 1039170 1041720 1044664 1047854 1051447 1055966 1061678 1068204 1074778 1080721 1085661
49286 1085661 1089540 1092565 1095023 1096983 1098110 1097809 1095576 1091355 1085729 1079777 1074533 1070445 1067469 1065670
49272 1065670 1065449 1066991 1069811 1073283 1077442 1082752 1089157 1096043 1103334 1111979 1122855 1135643 1149277
49259 1149277 1163032 1176536 1189220 1200964 1213376 1229486 1251855 1281834 1320751 1370251 1430201
49248 1430201 1497207 1566781 1636547 1705452 1769450 1820056 1848906 1853523 1837833 1807789 1767768
49237 1767768 1720756 1669954 1618779 1569649 1523567 1480912 1442323 1409033 1382723 1365008 1356622
49226 1356622 1356938 1364361 1377234 1394196 1413638 1432948 1448647 1457643 1458711 1452909 1442616 1430157
49214 1430157 1417165 1404712 1393558 1384276 1377380 1373247 1371594 1371220 1370960 1371180 1373921 1381282 1393955 1411558
49200 1411558 1433777 1460578 1491523 1525436 1560606 1594770 1625044 1648738 1664776 1674161 1678902 1680634
49188 1680634 1680207 1678092 1674754 1670622 1665869 1660380 1654193 1648198 1644222 1644060 1648445 1657358 1671232 1691349
49174 1691349 1718763 1753239 1793546 1838700 1888952 1946108 2013178 2093039 2185861 2286368 2382940
49163 2382940 2460020 2503558 2507022 2474270 2417170 2349704 2282923 2223501 2174833 2138155 2112892
49152 2112892 2097146 2088655 2085552 2086510 2090630 2097386 2106494 2117598 2129951 2142418 2153855 2163628 2171832
49139 2171832 2178908 2185070 2190134 2193834 2196113 2197237 2197964 2199574 2203211 2208971 2215967 2223504 2231756 2241030
49125 2241030 2250819 2260173 2268750 2277002 2285452 2294346 2304009 2314981 2327641 2342070 2358460 2377264 2398816
49112 2398816 2423055 2449909 2479782 2513713 2553365 2601123 2660105 2734112 2827589 2944694 3086079
49101 3086079 3244606 3404937 3550980 3677619 3795962 3924036 4067769 4208435 4309834
49092 4309834 4341676 4300452 4210467 4104947 4003847 3905807 3797520 3669293 3523447 3371587
49082 3371587 3226670 3097386 2987308 2896478 2823004 2764170 2717365 2680501 2651765 2629339 2611499
49071 2611499 2596698 2583339 2569820 2555299 2540294 2526034 2513143 2501234 2489786 2478956 2469409
49060 2469409 2461588 2455418 2450517 2446497 2443176 2440627 2438956 2437997 2437404 2437153 2437632 2438962 2440409 2440920 2440265
49045 2440265 2439285 2438841 2438884 2438884 2438945 2440032 2443057 2448160 2455075 2463900 2475190 2489426 2506731 2527062 2550428
49030 2550428 2576919 2606835 2640753 2678936 2720067 2760474 2794948 2818859 2830033 2829186 2818927 2802401
49018 2802401 2782520 2761840 2742461 2725684 2711867 2700912 2692849 2687810 2685587 2685606 2687423 2690967 2696228
49005 2696228 2702947 2710810 2719699 2729598 2740347 2751664 2763291 2774975 2786349 2796884 2805885 2812569
48993 2812569 2816382 2817361 2816010 2812694 2807350 2799905 2790727 2780418 2769313 2757483 2745205 2733145 2721955
48980 2721955 2711765 2702102 2692323 2682202 2672111 2662591 2653758 2645289 2636971 2629029 2621759 2615066 2608578
48967 2608578 2602081 2595648 2589398 2583433 2578111 2574197 2572517 2573297 2575898 2579361 2583280 2588091 2594525 2603093
48953 2603093 2614224 2628463 2646050 2666518 2689207 2714064 2741326 2770508 2800376 2830149 2860092
48942 2860092 2890713 2921946 2953417 2984905 3016145 3046871 3077643 3110127 3145815 3184710 3225941
48931 3225941 3269383 3315955 3366456 3420711 3477831 3536643 3595833 3654373 3712194 3770187 3829483
48920 3829483 3890966 3955380 4023401 4095420 4171418 4250828 4331954 4411539 4485614 4551493 4609094
48909 4609094 4660446 4708153 4754184 4799478 4844099 4887623 4929422 4968789 5005126 5038349 5069003
48898 5069003 5097720 5124649 5149711 5173257 5195912 5217629 5237221 5253080 5264301 5271152 5274608 5275455
48886 5275455 5273638 5268465 5259542 5247374 5232885 5216518 5198125 5177646 5155502 5132267 5108133 5082735
48874 5082735 5055263 5024679 4989873 4949548 4902074 4846024 4781279 4709381 4632500 4552325 4470298
48863 4470298 4388381 4308758 4232750 4160588 4092171 4027539 3966707 3909786 3857365 3810166 3768112
48852 3768112 3730260 3695762 3664384 3635981 3610130 3586574 3565533 3547211 3531509 3518540 3508997
48841 3508997 3503505 3501823 3503097 3506806 3513147 3522533 3534783 3548852 3563505 3578448 3594555 3612628
48829 3612628 3632180 3652095 3672373 3694341 3718872 3745175 3771767 3798090 3824600 3851849 3880079
48818 3880079 3909441 3939916 3971117 4002608 4034371 4066588 4099021 4130961 4161866 4191874 4221731
48807 4221731 4252309 4284028 4316621 4349577 4382758 4416298 4449989 4483323 4516445 4550589 4587108
48796 4587108 4626380 4667938 4711236 4755661 4800049 4842855 4882905 4919591 4952317 4980258 5002927
48785 5002927 5020738 5034828 5046308 5055628 5062375 5065472 5063526 5055090 5038927 5014414 4981924 4942695
$$ [...]
##END NTUPLES=NMR SPECTRUM
##END=
