##TITLE=AC1452_NESTRI271_7818727_KS3ssZnEED
##JCAMPDX= 6.0         $$ Bruker NMR JCAMP-DX V2.0
##DATA TYPE= NMR SPECTRUM
##DATA CLASS= NTUPLES
##ORIGIN= BRUKER
##OWNER= Administrator
$$ 1.72 TOPSPIN		Version 2.1
$$ 2013-04-30 17:37:22.800 -0700  Administrator@X
$$ Compression mode = diff/dup
##.OBSERVE FREQUENCY= 400.02188249412
##.OBSERVE NUCLEUS= ^1H
##.ACQUISITION MODE= SIMULTANEOUS (DQD)
##.ACQUISITION SCHEME= undefined
##.AVERAGES= 8
##.DIGITISER RES= 22
##SPECTROMETER/DATA SYSTEM= spect
##.PULSE SEQUENCE= zg30
##.SOLVENT NAME= COFFEE_meoh
##.SHIFT REFERENCE= INTERNAL, COFFEE_meoh, 1, 14.98509
##AUDIT TRAIL= $$ (NUMBER, WHEN, WHO, WHERE, PROCESS, VERSION, WHAT)
$$ ##TITLE= Audit trail, TOPSPIN		Version 2.1
$$ ##JCAMPDX= 5.01
$$ ##ORIGIN= Bruker BioSpin GmbH
$$ ##OWNER= Administrator
$$ $$ E:\/data/COFFEE/nmr/AC1452_NESTRI271_7818727_KS3ssZnEED/20/pdata/1/auditp.txt
$$ ##AUDIT TRAIL=  $$ (NUMBER, WHEN, WHO, WHERE, PROCESS, VERSION, WHAT)
(   1,<2013-04-30 17:37:16.003 -0700>,<Administrator>,<X>,<go>,<TOPSPIN 2.1>,
      <created by zg
	started at 2013-04-30 17:36:09.488 -0700,
	POWCHK enabled, PULCHK disabled,
       configuration hash MD5:
       F7 49 AB AC A2 8D 51 76 73 8D C1 9A A6 38 9F DE
       data hash MD5: 64K
       AD 5C 26 37 DD DF 15 95 F9 56 42 FF 55 D6 B9 9B>)
(   2,<2013-04-30 17:37:19.035 -0700>,<Administrator>,<X>,<proc1d>,<TOPSPIN 2.1>,
      <Start of raw data processing
       efp LB = 0 FT_mod = 6 PKNL = 1 PHC0 = 0 PHC1 = 0 SI = 32K 
       data hash MD5: 32K
       A4 EE 27 C6 8E 74 6D D6 2B FF A6 13 BB 53 F5 80>)
(   3,<2013-04-30 17:37:19.488 -0700>,<Administrator>,<X>,<proc1d>,<TOPSPIN 2.1>,
      <pk PHC0 = 99.18457 PHC1 = 0 
       data hash MD5: 32K
       8A 61 9D 13 1C D1 AF AA 21 2A 72 82 25 73 AF C2>)
(   4,<2013-04-30 17:37:19.628 -0700>,<Administrator>,<X>,<proc1d>,<TOPSPIN 2.1>,
      <abs ABSG = 1 
       data hash MD5: 32K
       F2 AE 26 D5 62 12 1C 25 05 ED 78 2F C1 66 9E 03>)
(   5,<2013-04-30 17:37:19.691 -0700>,<Administrator>,<X>,<proc1d>,<TOPSPIN 2.1>,
      <abs ABSG = 2 
       data hash MD5: 32K
       73 37 87 41 36 B4 BD 0F CB A4 55 05 94 39 F3 C2>)
(   6,<2013-04-30 17:37:19.738 -0700>,<Administrator>,<X>,<proc1d>,<TOPSPIN 2.1>,
      <abs ABSG = 3 
       data hash MD5: 32K
       47 76 67 2A F4 11 27 7A 6E 62 37 FC D6 3C E7 E9>)
(   7,<2013-04-30 17:37:19.800 -0700>,<Administrator>,<X>,<proc1d>,<TOPSPIN 2.1>,
      <abs ABSG = 4 
       data hash MD5: 32K
       D1 D0 AA C5 65 D9 19 B1 73 D1 70 FC 27 AC 4C 97>)
(   8,<2013-04-30 17:37:19.847 -0700>,<Administrator>,<X>,<proc1d>,<TOPSPIN 2.1>,
      <abs ABSG = 5 
       data hash MD5: 32K
       A9 D8 C1 6A B2 97 A8 C5 9A 71 68 DC BE 22 A3 CA>)
$$ ##END=
$$ 
$$ $$ hash MD5
$$ $$ AD 81 12 59 A4 0B C6 4A BB 09 2B 8B 3C 1F FA 03
##$RELAX= 
##$RELAX= 
##$RELAX= 
##$RELAX= 
##$RELAX= 
##$RELAX= 
##$RELAX= 
$$ Bruker specific parameters
$$ --------------------------
##$DU= <E:\>
##$EXPNO= 20
##$NAME= <AC1452_NESTRI271_7818727_KS3ssZnEED>
$$ [...]
##$TP= (0..7)
150 150 150 150 150 150 150 150
##$TP07= 0
##$TPNAME0= <>
##$TPNAME1= <>
##$TPNAME2= <>
##$TPNAME3= <>
##$TPNAME4= <>
##$TPNAME5= <>
##$TPNAME6= <>
##$TPNAME7= <>
##$TPOAL= (0..7)
0.5 0.5 0.5 0.5 0.5 0.5 0.5 0.5
##$TPOFFS= (0..7)
0 0 0 0 0 0 0 0
##$TUNHIN= 0
##$TUNHOUT= 0
##$TUNXOUT= 0
##$USERA1= <user>
##$USERA2= <user>
##$USERA3= <user>
##$USERA4= <user>
##$USERA5= <user>
##$V9= 5
##$VALIST= <valist>
##$VCLIST= <CCCCCCCCCCCCCCC>
##$VD= 0
##$VDLIST= <DDDDDDDDDDDDDDD>
##$VPLIST= <PPPPPPPPPPPPPPP>
##$VTLIST= <TTTTTTTTTTTTTTT>
##$WBST= 1024
##$WBSW= 4
##$XGAIN= (0..3)
0 0 0 0
##$XL= 0
##$YL= 0
##$YMAX_a= 594745
##$YMIN_a= -506541
##$ZGOPTNS= <>
##$ZL1= 120
##$ZL2= 120
##$ZL3= 120
##$ZL4= 120
##$ABSF1= 14.98509
##$ABSF2= -5.573092
##$ABSG= 5
##$ABSL= 3
##$ALPHA= 0
##$AQORDER= 0
##$ASSFAC= 0
##$ASSFACI= 0
##$ASSFACX= 0
##$ASSWID= 0
##$AUNMP= <proc_prof1d_extract_pilot.lims>
##$AXLEFT= 0
##$AXNAME= <>
##$AXNUC= <1H>
##$AXRIGHT= 0
##$AXTYPE= 0
##$AXUNIT= <>
##$AZFE= 0.1
##$AZFW= 0.1
##$BCFW= 0
##$BC_mod= 0
##$BYTORDP= 0
##$COROFFS= 0
##$CY= 15
##$DATMOD= 1
##$DC= 0
##$DFILT= <>
##$DTYPP= 0
##$F1P= 0
##$F2P= 0
##$FCOR= 0.5
##$FTSIZE= 32768
##$FT_mod= 6
##$GAMMA= 0
##$GB= 0
##$INTBC= 1
##$INTSCL= 1
##$ISEN= 128
##$LB= 0
##$LEV0= 0
##$LPBIN= 0
##$MAXI= 10000
##$MC2= 0
##$MEAN= 0
##$ME_mod= 0
##$MI= 0
##$NCOEF= 0
##$NC_proc= -8
##$NLEV= 6
##$NOISF1= 0
##$NOISF2= 0
##$NSP= 0
##$NTH_PI= 0
##$NZP= 0
##$OFFSET= 14.98509
##$PC= 1
##$PHC0= 99.18457
##$PHC1= 0
##$PH_mod= 1
##$PKNL= yes
##$PPARMOD= 0
##$PPDIAG= 0
##$PPIPTYP= 0
##$PPMPNUM= 2147483647
##$PPRESOL= 1
##$PSCAL= 4
##$PSIGN= 0
##$PYNMP= <proc.py>
##$REVERSE= no
##$SF= 400.02
##$SI= 32768
##$SIGF1= 0
##$SIGF2= 0
##$SINO= 400
##$SIOLD= 32768
##$SPECTYP= <>
##$SREGLST= <1H.CDCl3>
##$SSB= 0
##$STSI= 32768
##$STSR= 0
##$SW_p= 8223.68421052631
##$SYMM= 0
##$S_DEV= 0
##$TDeff= 65536
##$TDoff= 0
##$TI= <>
##$TILT= no
##$TM1= 0
##$TM2= 0
##$TOPLEV= 0
##$USERP1= <user>
##$USERP2= <user>
##$USERP3= <user>
##$USERP4= <user>
##$USERP5= <user>
##$WDW= 1
##$XDIM= 32768
##$YMAX_p= 453938271
##$YMIN_p= -742330
##$CURPLOT= <Network HP LaserJet P1505>
##$CURPRIN= <$Network HP LaserJet P1505>
##$DFORMAT= <normdp>
##$LAYOUT= <+/1D_H.xwp>
##$LFORMAT= <normlp>
##$PFORMAT= <normpl>
##$SURQMSG= 1
$$ End of Bruker specific parameters
$$ ---------------------------------
##NTUPLES= NMR SPECTRUM
##VAR_NAME=  FREQUENCY,     SPECTRUM/REAL,   SPECTRUM/IMAG
##SYMBOL=    X,             R,               I
##VAR_TYPE=  INDEPENDENT,   DEPENDENT,       DEPENDENT
##VAR_FORM=  AFFN,          ASDF,            ASDF
##VAR_DIM=   32768,         32768,           32768
##UNITS=     HZ,            ARBITRARY UNITS, ARBITRARY UNITS
##FACTOR=    0.250966925370066, 1,           1
##FIRST=     8223.43324360094, -153284,      -63477
##LAST=      0,             -99350,          153457
##MIN=       0,             -742330,         0
##MAX=       8223.43324360094, 453938271,    0
$$ Real data points
##PAGE= N=1
##DATA TABLE= (X++(R..R)), XYDATA
$$ [...]
19548A7484b75235J10984C77596b05455J0382B44909a04349q488o2508C21222
$$ 17484 -275235 -164251 377596 -205455 -195073 244909 -104349 -112837 -175345 321222
19537d9077k035B43296f4928n8239b1760A02756f4328F7698K08895r2292c37918
$$ -49077 -51112 243296 -64928 -123167 -21760 102756 -64328 67698 276593 184301 -337918
19525a36957a8872l46783c2290r9735j24321J27702B102a95000N3185o3371N1668
$$ -136957 -18872 -365655 -32290 -132025 -256346 -128644 2102 -195000 -141815 -205186 -153518
19514a53518A10752L3244J16556a32782B79373a99388K3866A54508f9098n810
$$ -153518 110752 143996 260552 -132782 279373 -199388 -175522 154508 -69098 -74908
19504g4908K0569D720b16198A58358a10944A85646c73910e3897o7427k52593c5107
$$ -74908 -54339 4720 -216198 158358 -110944 185646 -373910 -53897 -121324 -373917 -35107
19492A4828b19598e4478j54210A52181P3120j05009n8995a08519A49070B2262
$$ 14828 -219598 -54478 -208688 152181 225301 120292 61297 -108519 149070 22262
19481b13359B3636K40100g0678j01778F1877h7922A64289J32523b69254B35283
$$ -213359 23636 263736 -70678 -172456 61877 -87922 164289 296812 -269254 235283
19470b75920e0669A91170A9593Q376a7074j58440A03591K47584C5262B958J59316
$$ -275920 -50669 191170 19593 27969 -17074 -175514 103591 351175 35262 2958 162274
19459A62274a95156N229l2284d79C9302P6753e9477j4789h826A79602a7744l82948
$$ 162274 -195156 -189927 -222211 -479 39302 116055 -59477 -74266 -8826 179602 -17744 -400692
19447d00692J59686i0883H2087b17974A95520J30902b4396j23448l9538Q6405
$$ -400692 -241006 -90883 82087 -217974 195520 326422 -24396 -147844 -187382 -100977
19437a00977c5665j27098c4119h565k58907J15185E4199a02527N233B26892a62795
$$ -100977 -35665 -162763 -34119 -8565 -267472 -152287 54199 -102527 -97294 226892 -162795
19425a4137F5142b08233h2261E48234i033A55317E4441h8990a8886D4016d6697
$$ -14137 65142 -208233 -82261 548234 -9033 155317 54441 -88990 -18886 44016 -46697
19413b30790A3878K16339A6752K00373a25659F4477L5644a94370l2743Q1830A00542
$$ -230790 13878 230217 16752 217125 -125659 64477 100121 -194370 -227113 -145283 100542
19401c17219m225E3971e4361l86046A85166a44402B52538q2420h6326j44493J6343
$$ -317219 -321444 53971 -54361 -440407 185166 -144402 252538 170118 -86326 -230819 -214476
19390b14476J4959p5811h8922B28005b28577F4116b27329h6993A14629a98893
$$ -214476 -199517 -275328 -88922 228005 -228577 64116 -227329 -86993 114629 -198893
19379A79804c20574J53253j839M0501O2075j91780B48294c07144A19256B4547
$$ 179804 -320574 -167321 -169160 -128659 -66584 -258364 248294 -307144 119256 24547
19368d7223j12410K2389j45906B03491b19402P1785B81833k2274H2841b99914
$$ -47223 -159633 -137244 -283150 203491 -219402 -147617 281833 259559 82841 -299914
19357C44100A28545C671d5538k63712b3368m8088L4771D11390b85466E4592a47744
$$ 344100 128545 3671 -45538 -309250 -23368 -71456 -36685 411390 -285466 54592 -147744
19345C7736a08284d8411j30085k5841h5186j65438Q5390E57a70223D0367i368
$$ 37736 -108284 -48411 -178496 -204337 -85186 -250624 -165234 557 -170223 40367 -9368
19333A7518h4468k5773j80690e0209k19909R6485j87432b9150l3264j40017M2731
$$ 17518 -84468 -110241 -290931 -50209 -270118 -173633 -361065 -29150 -62414 -202431 -159700
19322a59700g9183K9009B08536a99458k10189A24538D6580a88215K1040j11054
$$ -159700 -79183 -50174 208536 -199458 -409647 124538 46580 -188215 -167175 -278229
19312b78229R5871B99387b56002A13a0180a699j43406A61768c55364a58682q4546
$$ -278229 -182358 299387 -256002 113 -10180 -1699 -145105 161768 -355364 -158682 -243228
19301b43228P2165G9966J60407b94253A81197e2518J4349A45014C594J7047J04045
$$ -243228 -171063 79966 240373 -294253 181197 -52518 -38169 145014 3594 20641 124686
19290A24686k8789K19859p7723c23850A39540e9964A82780c0689C7973a89581
$$ 124686 95897 315756 238033 -323850 139540 -59964 182780 -30689 37973 -189581
19279a60227E8938a66626L5324A43298b7219p9899f90r7499A50045L9358E8606
$$ -160227 58938 -166626 -131302 143298 -27219 -107118 -690 -98189 150045 189403 58606
19267b32802d5539j48625H4078b51559b0797A01302M8406b2967A19416c55932
$$ -232802 -45539 -194164 84078 -251559 -20797 101302 149708 -22967 119416 -355932
19256e2217A43119a85326A39483e4486r3840j56763h1945A77139a91264A89935
$$ -52217 143119 -185326 139483 -54486 -148326 -305089 -81945 177139 -191264 189935
19245E9263c76376g4727A8308M65037a47359E88345b63133D9351a50290C12534
$$ 59263 -376376 -74727 18308 483345 -147359 588345 -263133 49351 -150290 312534
19234H3410A1053e9135p5376E9023a16109A15092l0215O28e7313k77770a66213
$$ 83410 11053 -59135 -134511 59023 -116109 115092 84877 85505 -57313 -335083 -166213
19222B9577P5398i6381r0285l8088i8672o5855D5810K58718a70655b8715E2354
$$ 29577 104975 -96381 -186666 -224754 -98672 -164527 45810 304528 -170655 -28715 52354
19210a06139B9116e2129m1971j86102a7701A34534i4322K5544I4801a82406f0472
$$ -106139 29116 -52129 -94100 -280202 -17701 134534 -94322 -68778 94801 -182406 -60472
19198b83227a39188b0164k48944b9890q6831A6333J66412J21548a5309H8953B847
$$ -283227 -139188 -20164 -269108 -29890 -116721 16333 182745 304293 -15309 88953 2847
19186G7836b63809G7924c24430B02738b00282B28023C6489a19781K2236L6646
$$ 77836 -263809 77924 -324430 202738 -200282 228023 36489 -119781 -97545 -60899
19176f0899k62201J25864i0302H2474j5146J50553m0285f1015k97754D4471c7312
$$ -60899 -323100 -197236 -90302 82474 67328 217881 177596 -61015 -358769 44471 -37312
19164a17168A54122a72939B25907C5722K35550A17477e9972k13180a29130R45
$$ -117168 154122 -172939 225907 35722 271272 117477 -59972 -273152 -129130 -128185
19154a28185N8846o7372A51186N4725D0468b56320h281j31078L1133b3152j71120
$$ -128185 -69339 -136711 151186 205911 40468 -256320 -8281 -139359 -108226 -23152 -194272
19143a94272B9234L5583B37P8323b29415D7455a8860j34347f8561J9285n5251
$$ -194272 29234 64817 237 78560 -229415 47455 -18860 -153207 -68561 -49276 -104527
19132a04527j28076J07205N2038K2839A38880d6810j93871j31845a84179N6023
$$ -104527 -232603 -125398 -73360 -50521 138880 -46810 -240681 -372526 -184179 -128156
19122a28156H5710i5537c1403B09901e7774j46637l17835A46621P5061f897k13696
$$ -128156 85710 -95537 -31403 209901 -57774 -204411 -522246 146621 221682 -6897 -220593
19111b20593A06702i0812k84903G4912b12481A52788b1081A09030g5217B84730
$$ -220593 106702 -90812 -375715 74912 -212481 152788 -21081 109030 -75217 284730
19100A0044i6554K28o46004D7435F373K42901a15622d3480D3036O4334h9102G5979
$$ 10044 -96554 -96326 -742330 47435 6373 249274 -115622 -43480 43036 107370 -89102 75979
19087B55258b19766D2666a85491n9791A82122b92078a6233m52H1821g9687m6662
$$ 255258 -219766 42666 -185491 -245282 182122 -292078 -16233 -16685 81821 -79687 -126349
19076a26349O2029A03817a8052A8425g1854m90310A65393b89069J17169A56581
$$ -126349 -64320 103817 -18052 18425 -71854 -562164 165393 -289069 -171900 156581
19065d7251b2531k30176a10766d1963j25527A53146J2070f0891n4059A26050f5754
$$ -47251 -22531 -252707 -110766 -41963 -167490 153146 165216 -60891 -114950 126050 -65754
19053a3256l17542C5303J76331a42048j84028J40475C57679i6469h982B26578
$$ -13256 -330798 35303 211634 -142048 -326076 -185601 357679 -96469 -8982 226578
19042b81750R0908K8048j13355I7294L8357c08910I5381a71532f8019B60034g8182
$$ -281750 -190842 -162794 -276149 97294 135651 -308910 95381 -171532 -68019 260034 -78182
19030A10750J66418c33587d4188J4694k74206A38138J45611h2564D2787K4339
$$ 110750 277168 -333587 -44188 -29494 -303700 138138 283749 -82564 42787 67126
19020F7126a21987A90694a52046j70056c8224r5546j04679A0021b63055A4598
$$ 67126 -121987 190694 -152046 -322102 -38224 -133770 -238449 10021 -263055 14598
19009i8548K1786j42663O8708B80059a14197B12429a8566j87969A6388K6171a21306
$$ -98548 -76762 -219425 -150717 280059 -114197 212429 -18566 -206535 16388 42559 -121306
18997I8817L1776c1247C52159E7626Q3076m5011e6294j03701A1942a20896A53659
$$ 98817 130593 -31247 352159 57626 140702 95691 -56294 -159995 11942 -120896 153659
18985b91968c3134E0383a4096k38638e2036A43513K68352a7606n4580j82723c7093
$$ -291968 -33134 50383 -14096 -252734 -52036 143513 411865 -17606 -72186 -254909 -37093
18973c14731m118B4915h4299j85211a5040j36414l5972j75373a02685A34436b70610
$$ -314731 -318849 24915 -84299 -269510 -15040 -151454 -187426 -362799 -102685 134436 -270610
18961a25970k92600b4781I602c45677J35266Q4033a5871o6774F539f8099j45063
$$ -125970 -418570 -24781 9602 -345677 -210411 -126378 -15871 -82645 6539 -68099 -213162
18950b13162A17351C3407L0632a16796N0603j3797B00801B9511j4161g3933j3303
$$ -213162 117351 33407 64039 -116796 -66193 -79990 200801 29511 15350 -73933 -87236
18939h7236n6291E7076K06260a84829B7620a12725j6389b5071k48070B70911a6924
$$ -87236 -143527 57076 263336 -184829 27620 -112725 -129114 -25071 -273141 270911 -16924
18927G0253b84778H211J71474h7324k1805A65340P3983G7832i9170r3404N2661
$$ 70253 -284778 8211 179685 -87324 -109129 165340 239323 77832 -99170 -192574 -139913
18916a39913G5253J52431J06648a41642N7739E1897b8520E2675b46680A20598
$$ -139913 75253 227684 334332 -141642 -83903 51897 -28520 52675 -246680 120598
18905g7083B58369b52165a07393J6567F9752N3568e30663a4560A96125a59671
$$ -77083 258369 -252165 -107393 -90826 69752 123320 -530663 -14560 196125 -159671
18894F6579K11504b97111a8748B26750C077J14452j6963b27436D6183L36065a10429
$$ 66579 278083 -297111 -18748 226750 3077 117529 100566 -227436 46183 382248 -110429
18882a37721n2467h7777C4246c5973A43012a63554p9853r8364D1793a58405B23671
$$ -137721 -190188 -87777 34246 -35973 143012 -163554 -243407 -341771 41793 -158405 223671
18870a72167n7056L7575D7117b47784i1772A79768P132q6309h3563B14041H6213
$$ -172167 -229223 -191648 47117 -247784 -91772 179768 186900 100591 -83563 214041 86213
18858G0391b04694M0800d2953A72770b00322b8376I6850k0854d2953C28640o8082
$$ 70391 -204694 -163894 -42953 172770 -200322 -28376 96850 75996 -42953 328640 260558
18847B60558I562J53704A0247f366k1535o5086b5078l67138g8499k2656l3431
$$ 260558 9562 163266 10247 -6366 -27901 -92987 -25078 -392216 -78499 -101155 -134586
18836a34586j58064P0285E0552g1335m3238a2568C20367a15008D7050a60115j8596
$$ -134586 -292650 -222365 50552 -71335 -114573 -12568 320367 -115008 47050 -160115 -178711
18825a78711Q0833k99853J55206a04094F0192i1491C8377L97481d3673k47347
$$ -178711 -97878 -397731 -242525 -104094 60192 -91491 38377 435858 -43673 -291020
18815b91020a01554A12177b39226P4992M2441A22332a31741A34793b31956B10713
$$ -291020 -101554 112177 -239226 -164234 -121793 122332 -131741 134793 -231956 210713
18804a92088B62371a55947D7519K3474R9538E9490d9184a5405n2341E778K82636
$$ -192088 262371 -155947 47519 70993 170531 59490 -49184 -15405 -67746 5778 288414
18793B88414d46758J03875D3829b09872e9185I7621b14941e125p6922B16856c52279
$$ 288414 -446758 -342883 43829 -209872 -59185 97621 -214941 -5125 -82047 216856 -352279
18781c15568C05446c62623a35789j4356I6748d4732J8684p3759B46379a91539
$$ -315568 305446 -362623 -135789 -150145 96748 -44732 -26048 -99807 246379 -191539
18770A52223q703p0877k6272K4911a65350E9738a01456A09311g1785D1615Q8219
$$ 152223 143520 72643 46371 71282 -165350 59738 -101456 109311 -71785 41615 129834
18759A29834a3793j60528r1522c7266C2246c7436j94662H9206l2517c09064A02414
$$ 129834 -13793 -174321 -265843 -37266 32246 -37436 -232098 89206 56689 -309064 102414
18747A15012b03031R1854A98500G4059K93053g2474K1376k01588A48996i6574
$$ 115012 -203031 -111177 198500 74059 367112 -72474 -51098 -252686 148996 -96574
18736b02636i3676r031l3666O0561j10730P7164A03759a37607L4899k10117B28474
$$ -202636 -93676 -102707 -136373 -75812 -186542 -109378 103759 -137607 -102708 -312825 228474
18724B11601j5071m1224p1838N0117a19349B1042e4378A5340J1781e1045C0913
$$ 211601 196530 155306 83468 133585 -119349 21042 -54378 15340 27121 -51045 30913
18712b02876K0613m2128A19244a56954H1685K2112l2271a38547p5701j69949J07069
$$ -202876 -182263 -224391 119244 -156954 81685 103797 71526 -138547 -214248 -384197 -277128
18701b77128D8842Q1817a55330O9519j11299e5247C74256c7240k0291j55540A35585
$$ -277128 48842 130659 -155330 -85811 -197110 -55247 374256 -37240 -57531 -213071 135585
18689b98469J6490B5450a39482q175F3108g4801J0244q9382k23870R6584C46953
$$ -298469 -281979 25450 -139482 -147657 63108 -74801 -64557 -153939 -377809 -281225 346953
18677A969L236L045a93573o89C9247b9460j04647H4820b14592B26968H2292a20080
$$ 1969 5205 8250 -193573 -194262 39247 -29460 -134107 84820 -214592 226968 82292 -120080
18664a01823j59495R4401L207o3397P1758C59989F6194a2549E2796e4471A01904
$$ -101823 -261318 -166917 -163710 -227107 -155349 359989 66194 -12549 52796 -54471 101904
18652a7530l4403B7662J10771a2322m23795a93174R3782L0935l13318C9297a44587
$$ -17530 -51933 27662 138433 -12322 -436117 -193174 -99392 -68457 -381775 39297 -144587
18640A47338a8085D6456j0579j758e6590j66430o1357g3468c0945q7289N8188
$$ 147338 -18085 46456 35877 34119 -56590 -223020 -284377 -73468 -30945 -118234 -60046
18629f0046l64325G3688N5472d86357I5852L4031a94263R1921A93333a18488J5694
$$ -60046 -424371 73688 129160 -486357 95852 129883 -194263 -102342 193333 -118488 -102794
18618a02794j8683m9941j30931g8409H9471l595c9745k67250E9423K7246J98577
$$ -102794 -121477 -171418 -302349 -78409 89471 85876 -39745 -306995 59423 86669 285246
18607B85246H1717J23126n5272b5821m1076j91066L7134A41754d4090j52953m7712
$$ 285246 81717 204843 149571 -25821 -66897 -257963 -220829 141754 -44090 -197043 -244755
18596b44755B49519e3534j11562j50388f6586R978m4467j44529A34255o5054d01889
$$ -244755 249519 -53534 -165096 -315484 -66586 -56608 -101075 -245604 134255 69201 -401889
18584b06187A80895b2662l24690J68949B7991b40495c1505B23376b10843g038
$$ -206187 180895 -22662 -347352 -178403 27991 -240495 -31505 223376 -210843 -7038
18573c96822C46112a09944n7608n5619A00652b94514B23809A1955b10105M4168
$$ -396822 346112 -109944 -167552 -223171 100652 -294514 223809 11955 -210105 -165937
18563a65937p1417P2965l2413J6619c7631p9378A02913b04978a0750B6085a6519
$$ -165937 -237354 -164389 -196802 -180183 -37631 -117009 102913 -204978 -10750 26085 -16519
18551f0719H0136b16709R0671d5992j04558H773J25494i6975G3090J1074h4575
$$ -60719 80136 -216709 -126038 -45992 -150550 8773 134267 -96975 73090 84164 -84575
18539A36807l7779c8273k0998a5994k1665k57751g8536B2589a96145B77088F0613
$$ 136807 99028 -38273 -59271 -15994 -37659 -295410 -78536 22589 -196145 277088 60613
18527A43573D4911a41458a7045k35577J11421M8277p3773P4965q6338Q623N2257
$$ 143573 44911 -141458 -17045 -252622 -141201 -92924 -166697 -91732 -178070 -169447 -117190
18516a17190r5271M6178A00930J48777L2833b1639k55525A86977b22302k04662
$$ -117190 -212461 -166283 100930 249707 282540 -21639 -277164 186977 -222302 -426964
18506d26964c9572D0482b55451a01909q1984p6392A68482f7058H8919N0095a45556
$$ -426964 -39572 40482 -255451 -101909 -183893 -260285 168482 -67058 88919 139014 -145556
18494B5773a34968a5629o713j9845r3662p222C03667a62244j76212J21677H9573
$$ 25773 -134968 -15629 -22342 -42187 -135849 -143071 303667 -162244 -338456 -216779 89573
18482a21235r8102j4239A24213C8322N6859a82819A1220B691a60277j68286J55513
$$ -121235 -219337 -233576 124213 38322 95181 -182819 11220 2691 -160277 -328563 -173050
18471a73050B42031b38385G9200l205b09112j01850f3243G2924b97178J30249
$$ -173050 242031 -238385 79200 75995 -209112 -310962 -63243 72924 -297178 -166929
18461a66929B15280c52746e2793q1203L4433C2610b39612D7715a14047B25928
$$ -166929 215280 -352746 -52793 -133996 -99563 32610 -239612 47715 -114047 225928
18450a04307F8891d8087C44262j16421C3311J95119H5011c66033b7444A85650
$$ -104307 68891 -48087 344262 227841 33311 228430 85011 -366033 -27444 185650
18439B9216k870a20365k43789C26796c50627d8998j21637L3573j33873R7296A29461
$$ 29216 26346 -120365 -364154 326796 -350627 -48998 -170635 -137062 -270935 -173639 129461
18427B54044A25141j0736e11556A23583h5979A10558i2872a4696j96246A93992
$$ 254044 125141 114405 -511556 123583 -85979 110558 -92872 -14696 -210942 193992
18416d1550p0808F2145a90895h2517A55663b07317K890A59826B7516b2132H712
$$ -41550 -112358 62145 -190895 -82517 155663 -207317 -204427 159826 27516 -22132 8712
18404c6715b53B37808G5752Q3263c3572G8777b18105A97029I4443J74481a4121
$$ -36715 -253 237808 75752 159015 -33572 78777 -218105 197029 94443 268924 -14121
18392b67034A6058K9036d5586A79168a00685B19975b23579k26303a12094J4172
$$ -267034 16058 45094 -45586 179168 -100685 219975 -223579 -449882 -112094 -97922
18382i7922o4803B6696c81976A84717a64222B32480a60969A07941f3241B29552
$$ -97922 -162725 26696 -381976 184717 -164222 232480 -160969 107941 -63241 229552
18371H2506N0464n3142O8599a67282P8836k92555E206b3666D5366g6575k58218
$$ 82506 132970 79828 148427 -167282 -88446 -381001 5206 -23666 45366 -76575 -334793
18360c34793J26929O5140k45397i484j2311I7965P5989b22117A17524n6536K33588
$$ -334793 -207864 -142724 -388121 -9484 -21795 97965 173954 -222117 117524 60988 294576
18349B94576a29181L4093A5622a17932A9807b76471h3523A91367a79424m7411
$$ 294576 -129181 -95088 15622 -117932 19807 -276471 -83523 191367 -179424 -226835
18339b26835G5318d2708j12037C66122b13258B8369L7388a12613h763j83657b9339
$$ -226835 75318 -42708 -154745 366122 -213258 28369 65757 -112613 -8763 -192420 -29339
18327a46663p5463G9988a21461M1715j27896K6477H2978a90231l862B44480d38305
$$ -146663 -222126 79988 -121461 -79746 -207642 -181165 82978 -190231 -194093 244480 -438305
18315h9328h599j12226l1908A14031a65582Q1239A65343l0874n6659b42959i0945
$$ -89328 -8599 -120825 -152733 114031 -165582 -84343 165343 134469 77810 -242959 -90945
18303A99351J98729D0476a8238B6869a38673b3690k67216J5724a22036k29719
$$ 199351 398080 40476 -18238 26869 -138673 -23690 -290906 -275182 -122036 -351755
18293c51755a52444M9139m4054P2064c7477j06067A61324a28425Q506J0425o8485
$$ -351755 -152444 -103305 -147359 -75295 -37477 -143544 161324 -128425 -119919 -109494 -177979
18282a77979k60402D79473b549q9429D4853b10045a8382D5691b44198h2475L3517
$$ -177979 -438381 479473 -2549 -91978 44853 -210045 -18382 45691 -244198 -82475 -48958
18271d8958j76736G7232Q4620a31436o1510A11756E902L1690L1743j796a83384
$$ -48958 -225694 77232 161852 -131436 -192946 111756 5902 37592 69335 67539 -183384
18259G4553b47613J07785A27215f8813k16114N5232R2466B56737i2285A10730
$$ 74553 -247613 -139828 127215 -68813 -284927 -229695 -137229 256737 -92285 110730
18248A06441a45103F9404J17158b65485A03719A8588a07684n6896F7183b42353
$$ 106441 -145103 69404 186562 -265485 103719 18588 -107684 -164580 67183 -242353
18237c27111C3888J3071h9155A3774M2928a09533j77872A34090f7544B02784a16866
$$ -327111 33888 46959 -89155 13774 56702 -109533 -287405 134090 -67544 202784 -116866
18225B46899a39040q4637F8391b0574n2144I938e4617j05228f6209j33304h2517
$$ 246899 -139040 -223677 68391 -20574 -72718 9938 -54617 -159845 -66209 -199513 -82517
18213A82582o5355M3821a99693k4042B1009J13346l512a58911j1932a8020B65345
$$ 182582 117227 161048 -199693 -223735 21009 134355 130843 -158911 -170843 -18020 265345
18201e1120D3113K0031J03101d17569B75518j27506a68922a1581j62956K083o1054
$$ -51120 43113 63144 166245 -417569 275518 148012 -168922 -11581 -174537 -172454 -233508
18190b33508J12508F9757a68710A46171d38385d2107j14383B59771B860N5784
$$ -233508 -121000 69757 -168710 146171 -438385 -42107 -156490 259771 2860 58644
18180E8644P0203E8841a36067r2484Q6429e2844o4880B23434c38589A40332a19399
$$ 58644 128847 58841 -136067 -228551 -142122 -52844 -117724 223434 -338589 140332 -119399
18168h3851A10153a43923c6720C39816A69234i5300A08447b57962h3593j49815
$$ -83851 110153 -143923 -36720 339816 169234 -95300 108447 -257962 -83593 -233408
18158b33408A17716c2610n3706n6922o1770j60099C9838J95113D612d1403m1187
$$ -233408 117716 -32610 -86316 -143238 -205008 -365107 39838 234951 4612 -41403 -82590
18147h2590A03347b83722C4719a60208b3199p5208A79686L9545c35771D9492a32932
$$ -82590 103347 -283722 34719 -160208 -23199 -98407 179686 219231 -335771 49492 -132932
18135a55098F8091a03569l7548j00961A12540a85774M6556q564m2486N8489J6497
$$ -155098 68091 -103569 -141117 -242078 112540 -185774 -139218 -147782 -190268 -131779 -115282
18124a15282c654G8758J2292i7334o3782m7557A91934c4895B2401R0438A6816
$$ -115282 -3654 78758 91050 -97334 -161116 -208673 191934 -34895 22401 112839 16816
18112C98505c3161F251J31581J37325b78840i7094A27813N1587e8174k93191A20903
$$ 398505 -33161 6251 137832 275157 -278840 -97094 127813 179400 -58174 -351365 120903
18100a98833q3100A2599Q4025B5050a80268c7558F3909J09878i9623k24118g581
$$ -198833 -281933 12599 96624 25050 -180268 -37558 63909 173787 -99623 -323741 -7581
18088b96673J32523f0427k23477B00824a23121c894G5604h9514B12759A00058
$$ -296673 -164150 -60427 -283904 200824 -123121 -3894 75604 -89514 212759 100058
18077A52558A2269A234b35193D942L4435b55785A56310b3777p1773l80848a28433
$$ 152558 12269 1234 -235193 4942 39377 -255785 156310 -23777 -95550 -476398 -128433
18065A18290d6106A1503e0705A36853B5139a41573j24318j62478J40069A50133
$$ 118290 -46106 11503 -50705 136853 25139 -141573 -265891 -428369 -288300 150133
18054a8102j23219A31087b69675Q4547F8585c06623D1599b44555f7732j34745
$$ -18102 -141321 131087 -269675 -185128 68585 -306623 41599 -244555 -67732 -202477
18044b02477D560K464b41771A21856a5907j24194o7055h8882k23031C9088C736
$$ -202477 4560 7024 -241771 121856 -15907 -140101 -207156 -88882 -311913 39088 3736
18032A67800k1377g1516B3585M2848d4396A8573a32404B85991a22483k54k08367
$$ 167800 146423 -71516 23585 66433 -44396 18573 -132404 285991 -122483 -122737 -331104
18021c31104a44566o3510B05928b5947m5315R41J0112r6314c0229H9589c8115
$$ -331104 -144566 -208076 205928 -25947 -71262 -70321 -60209 -156523 -30229 89589 -38115
18009g3501E5870N1946I888a28617B07780l5290g1702A51036n8800M104a30281
$$ -73501 55870 107816 9888 -128617 207780 172490 -71702 151036 92236 96340 -130281
17997A85396G5083a61368M0839k10461E0747a16536j71362J18282N6651j18522
$$ 185396 75083 -161368 -120529 -330990 50747 -116536 -287898 -169616 -112965 -231487
17987b31487j01035J46761N0967A9327e0374K1801j81646h3537K87r4126A527
$$ -231487 -332522 -185761 -134794 19327 -50374 -28573 -210219 -83537 -83250 -177376 1527
17975F5341K48112J27431j93565r5679d7201B21519l2283G5840b01201A0449a76753
$$ 65341 313453 440884 247319 151640 -47201 221519 189236 75840 -201201 10449 -176753
17963A51303h2686F585J34584N0055d11596E8611B8989P6570f0264E6838B557
$$ 151303 -82686 6585 141169 191224 -411596 58611 28989 105559 -60264 56838 2557
17951B44711O5912A23124N498R6718H9135a57324j20182c0092G0954c13294D4298
$$ 244711 310623 123124 128622 225340 89135 -157324 -277506 -30092 70954 -313294 44298
17939b43431I664a09003B0653a91708Q097C27103A2687R4554h4023b9901p8438
$$ -243431 9664 -109003 20653 -191708 -183611 327103 12687 107241 -84023 -29901 -108339
17928a08339K8412A1991K07564a52356j84757A79548D2487i8972j5812a8870J727
$$ -108339 -79927 11991 219555 -152356 -337113 179548 42487 -98972 -114784 -18870 -17143
17917a7143A54212l1777b53823O831o6074A34705a12401F4387a99965o6103b2867
$$ -17143 154212 122435 -253823 -246992 -313066 134705 -112401 64387 -199965 -266068 -22867
17905b95528p9093J45239C92996b93733A140b28902P0694D0029J98823B7386b12822
$$ -295528 -374621 -229382 392996 -293733 1140 -228902 -158208 40029 238852 27386 -212822
17893a66149A60787a41511l76321A84307m2372o6264d4771J3291k75888F9027
$$ -166149 160787 -141511 -517832 184307 141935 75671 -44771 -31480 -307368 69027
17882B2754a63299o013p2819q8296b7144p0329m0799J6596I5986R4701a01638
$$ 22754 -163299 -169312 -242131 -330427 -27144 -97473 -138272 -121676 95986 190687 -101638
17870H5763h6528K0534f478k02164B78468A4314K60859a61766A71603a57487A57442
$$ 85763 -86528 -65994 -6478 -208642 278468 14314 275173 -161766 171603 -157487 157442
17858A244L82054I7872K16372A13011b98196A08801c2568j23448b5635l79D41219
$$ 1244 383298 97872 314244 113011 -298196 108801 -32568 -156016 -25635 -26014 441219
17846B38399C6527d32549B94081b926E8696i0848B44441n0936J17990c3053m0493
$$ 238399 36527 -432549 294081 -2926 58696 -90848 244441 193505 311495 -33053 -73546
17835g3546A45057B36i0374D5194a08992M2102A96898I5463d07362a88771D60937
$$ -73546 145057 236 -90374 45194 -108992 -66890 196898 95463 -407362 -188771 460937
17823G0859L7767c44223a10168I4707b9252l2945A22286D8811N3300c31083A21018
$$ 70859 108626 -344223 -110168 94707 -29252 -62197 122286 48811 102111 -331083 121018
17811B14839b48303B7225a2265A46677b4787I4544A9814b00409c5625B8518F396
$$ 214839 -248303 27225 -12265 146677 -24787 94544 19814 -200409 -35625 28518 6396
17799b59757A4379M8251K2857a49469j3677A347g6321E7437b23908B20261a51643
$$ -259757 14379 62630 85487 -149469 -163146 1347 -76321 57437 -223908 220261 -151643
17787a74428h6790J4134c5105r8282m8073l644a2341F3052j1553J91819h1220
$$ -174428 -86790 -72656 -35105 -133387 -181460 -185104 -12341 63052 51499 243318 -81220
17775E642K14406E9130K82795D4031a34412j11453A51870a03981j70074A1632
$$ 5642 220048 59130 341925 44031 -134412 -245865 151870 -103981 -274055 11632
17764c167k88338A49099c11784Q2245K7795M1070j5815A57455c449k07012H5108
$$ -3167 -291505 149099 -311784 -229539 -201744 -160674 -176489 157455 -3449 -210461 85108
17752a13152A0541a43043E2353P1227f5463B69778g9920B27946a35628j50435
$$ -113152 10541 -143043 52353 123580 -65463 269778 -79920 227946 -135628 -286063
17742b86063f8423k7187K3434K3058j57426E3938b66914a18405A97467h00A37692
$$ -286063 -68423 -95610 -72176 -49118 -206544 53938 -266914 -118405 197467 -800 137692
17730b7476j72852A57191b7604j18972a6371j06296C28572a34335d4356J9092
$$ -27476 -200328 157191 -27604 -146576 -16371 -122667 328572 -134335 -44356 -25264
17720b5264m2743o8520f0968A69375G7217R0008D9063d9248k98830B16754i1794
$$ -25264 -68007 -136527 -60968 169375 77217 167225 49063 -49248 -348078 216754 -91794
17708A76262a2157j78969D0806K74275L340A0066a69998I2329d65521A46428J02262
$$ 176262 -12157 -191126 40806 315081 318421 10066 -169998 92329 -465521 146428 248690
17697B48690c46015a52513c7828j04793A2633f6737b8394e470A33890L8577b23908
$$ 248690 -346015 -152513 -37828 -142621 12633 -66737 -28394 -5470 133890 172467 -223908
17685F5355G694h681j82315M0918O6955D6676O8988a89891A57574N2002r3971
$$ 65355 7694 -8681 -190996 -150078 -83123 46676 115664 -189891 157574 209576 115605
17674A15605L3120a06291L4655k50351P6690J20939k27956A70202E2517N2818
$$ 115605 148725 -106291 -71636 -321987 -245297 -124358 -352314 170202 52517 105335
17664A05335J64922c68197J78592a7259A05299b3102B74609I4933J66724A16375
$$ 105335 270257 -368197 -189605 -17259 105299 -23102 274609 94933 261657 116375
17653a86363A65326m8326c018j49027A7677R5469l1162J87771c6544n9431q2544
$$ -186363 165326 117000 -3018 -152045 17677 113146 81984 269755 -36544 -95975 -178519
17642a78519F8360f7427j57136f8282B40677A5676b6741A91915A6310O9217J18046
$$ -178519 68360 -67427 -224563 -68282 240677 15676 -26741 191915 16310 85527 203573
17631B03573d179j35236k2148J0177I2017R4236e7856C7000b9560A9374J53109
$$ 203573 -4179 -139415 -161563 -151386 92017 186253 -57856 37000 -29560 19374 172483
17620A72483F3115a66820K0455B74905J79454E4793J37422h0304A00864G915L40860
$$ 172483 63115 -166820 -146365 274905 454359 54793 192215 -80304 100864 7915 348775
17609C48775e0896K1792G7936L56663A32411B1654c13092C08158C1047a3660k16533
$$ 348775 -50896 -29104 77936 434599 132411 21654 -313092 308158 31047 -13660 -230193
17598b30193B74824g9971A02626D4274b0788q6687A32403J07619m32p0255D551
$$ -230193 274824 -79971 102626 44274 -20788 -107475 132403 240022 239590 169335 4551
17586i1160H2747J0007A1475a53516A28819a02537A02667d38508B20964A02475
$$ -91160 82747 92754 11475 -153516 128819 -102537 102667 -438508 220964 102475
17575a30811N1255j08751B50336o3145d3575G4702K18397f2263A10868J34948
$$ -130811 -79556 -188307 250336 187191 -43575 74702 293099 -62263 110868 245816
17565B45816h6026E3264e8247B32605E3093a78576B21673r8664J00934H9506K04337
$$ 245816 -86026 53264 -58247 232605 53093 -178576 221673 123009 223943 89506 293843
17554B93843B4681c53122B37243F841i2141k6458H9322Q5584A5137i5078M4525
$$ 293843 24681 -353122 237243 6841 -92141 -118599 89322 174906 15137 -95078 -50553
17543e0553B5830R9200a59286B85592A00328a70409G1809b79466O8699k85C57366
$$ -50553 25830 125030 -159286 285592 100328 -170409 71809 -279466 -210767 -211052 357366
17531e6898B56986b08943I8728A9810J43782a04303J0623A04899i4889p8422f807
$$ -56898 256986 -208943 98728 19810 163592 -104303 -93680 104899 -94889 -173311 -6807
17519B38307J02843f157k84120a7225A35780K06584c3639G3095A8995J55472E8948
$$ 238307 341150 -6157 -290277 -17225 135780 342364 -33639 73095 18995 174467 58948
17507i3696B31804D7220a86331a288j98422A42596b75010e9022E68469B72252
$$ -93696 231804 47220 -186331 -1288 -199710 142596 -275010 -59022 568469 272252
17496C54237H8540l0677O0754J485R7050p9513K9416n9628b95795D5796K68584
$$ 354237 88540 57863 118617 120102 217152 137639 167055 107427 -295795 45796 314380
17485C14380r8694l9751j0821E425b0905A15489g8189A27488R0254L37097D4494
$$ 314380 215686 175935 165114 5425 -20905 115489 -78189 127488 217742 554839 44494
17473D39107e203A84344D860L1072K37707j29248n6377J04617D2725J33096L6299
$$ 439107 -5203 184344 4860 35932 273639 144391 88014 192631 42725 175821 212120
17462B12120p8484K43312e0647E09959L6461A45582F5920k62N8842D5663L67617
$$ 212120 133636 376948 -50647 509959 546420 145582 65920 65658 124500 45663 413280
17451D13280F3119M26182p7136j52683j2449j21149D4644J87550K82617j22954
$$ 413280 63119 489301 412165 259482 247033 125884 44644 232194 514811 391857
17441C91857G8182P362J21102O2009J31373m8028A22460Q0788K3354o4616l7609
$$ 391857 78182 85544 206646 268655 400028 352000 122460 203248 226602 161986 124377
17430A24377J96253A47934K35862A49940j823J2709F6501J25304J30109A26918
$$ 124377 320630 147934 383796 149940 148117 160826 66501 191805 321914 126918
17419E71810A41080l1272K81086J6423H3134J60896k2996j04843L9977B0224K8477
$$ 571810 141080 109808 390894 407317 83134 244030 221034 116191 156168 20224 48701
17408D8701J54061F8946c45978d0792i756H9667K23416o9965q8575J15505A07120
$$ 48701 202762 68946 -345978 -40792 -9756 89667 313083 243118 154543 270048 107120
17396B42440A12473L29929A28523D3689L1447g8204B97308M9100b9316A34076
$$ 242440 112473 442402 128523 43689 75136 -78204 297308 346408 -29316 134076
17385B96673k5915h083B16758A1946a458q0515B00496O3612D1080K23429j04873
$$ 296673 270758 -8083 216758 11946 -1458 -81973 200496 264108 41080 264509 159636
17374A59636J21915J67039m7035b97218B19563L7423g1237A82584C3616A4884
$$ 159636 281551 448590 401555 -297218 219563 256986 -71237 182584 33616 14884
17363A9762Q988b3305A2811J00713M583J99741a00674I2581o043K43926h0404
$$ 19762 28750 -23305 12811 113524 118107 317848 -100674 92581 86538 330464 -80404
17351B38541Q8194E9878J13784J1099K18420A34269B9652J17004Q1080j07848
$$ 238541 326735 59878 173662 184761 403181 134269 29652 146656 227736 119888
17341A19888n2826b95721c844B82000C4260J69826L23677b36146a6357o1103D14415
$$ 119888 67062 -295721 -3844 282000 34260 204086 527763 -236146 -16357 -77460 414415
17329a01556J9824C10094G6560a0387A06754g6656A71030a56164L3177q0056d4198
$$ -101556 -81732 310094 76560 -10387 106754 -76656 171030 -156164 -122987 -203043 -44198
17317h0073j1223k75434A34541b6642C04469A22054b8632C76501A63746i7269
$$ -80073 -91296 -366730 134541 -26642 304469 122054 -28632 376501 163746 -97269
17306A63980K4015a04694A21369h9653E37150A05234G99L06729A39395l3891M5077
$$ 163980 187995 -104694 121369 -89653 537150 105234 799 307528 139395 105504 150581
17295A50581J58838A22771k9950B1089B913f0263C30334P9041o6301b39128e011
$$ 150581 309419 122771 92821 21089 2913 -60263 330334 409375 343074 -239128 -5011
17283B60234g9458A53137J75630A52376f0022A62931J06484j30237B4322J19025
$$ 260234 -79458 153137 328767 152376 -60022 162931 269415 139178 24322 143347
17273A43347c0056F5736J29180J14681l2320D9020J76052E6857J19188p7938a22653
$$ 143347 -30056 65736 194916 309597 277277 49020 225072 56857 176045 98107 -122653
17261B39910B2853K1730J98992A02523a73715F6917N5803K6960J06995I1706L05122
$$ 239910 22853 44583 243575 102523 -173715 66917 122720 149680 256675 91706 396828
17250C96828e5805B01894k8777L85618C015M69050j95145a77C87400A34506j3695
$$ 396828 -55805 201894 173117 558735 3015 472065 276920 -177 387400 134506 120811
17239A20811E9293J00748q982M7229K14670j90562J67092I3043N4802J49008j31721
$$ 120811 59293 160041 151059 198288 412958 222396 389488 93043 147845 296853 165132
17228A65132G4223e304C87396j43349J72077G1474J16748D7741e1194C35376k7795
$$ 165132 74223 -5304 387396 244047 416124 71474 188222 47741 -51194 335376 307581
17217C07581I4117m6714h8424F41035A37947C0408L18346j51571B4595K90255
$$ 307581 94117 47403 -88424 641035 137947 30408 348754 197183 24595 314850
17207C14850q9971J22785c1472r3645B12602K39282j29958h7554B37017o8221
$$ 314850 224879 347664 -31472 -125117 212602 451884 321926 -87554 237017 168796
17197A68796j0285E3653j8198h0073b689B52572J9121J79714A39138M27968I6504
$$ 168796 158511 53653 35455 -80073 -2689 252572 271693 451407 139138 567106 96504
17185c427C93832H1349J26830L12954F5783K39589N578L4059C1094a75118B96586
$$ -3427 393832 81349 208179 521133 65783 305372 310950 345009 31094 -175118 296586
17173A08061K86369b35089C7105K66712M3416C432M59314j34317g7398A89048
$$ 108061 394430 -235089 37105 303817 347233 3432 462746 328429 -77398 189048
17162A77730c6143D41437j31358J438P7262J75053A08040b0342I0979J08299q661
$$ 177730 -36143 441437 310079 311517 388779 563832 108040 -20342 90979 199278 190617
17151A90617R5627j40940o7920M95906k55269j32474B7415K57640q175L2134o7357
$$ 190617 286244 145304 77384 573290 318021 185547 27415 285055 276880 309014 241657
17140B41657P4447J38573k20591R8920n4569A14118K57508Q3270j53252A10216
$$ 241657 316104 454677 234086 333006 278437 114118 371626 454896 301644 110216
17129B13543K17092A65333B5877f1083B83928Q3664J15717E362N6329J2816J89321
$$ 213543 430635 165333 25877 -61083 283928 367592 483309 5362 61691 74507 263828
17118B63828P1506R678A44008g3347C20365o7589L18372k1796k74457K05988m4506
$$ 263828 335334 345012 144008 -73347 320365 252776 571148 549352 274895 480883 436377
17107D36377j90506o4374K68068A34081J36398d6286B62902K22212j40567J96745
$$ 436377 245871 181497 449565 134081 270479 -46286 262902 485114 344547 541292
17097E41292k44298J16801L02998B02579p4154n2188L31450r9664j06011L71518
$$ 541292 296994 413795 716793 202579 128425 76237 407687 308023 202012 573530
17087E73530k40454J68641A75652J63714L3288j9652J83816J04658q8739j96853
$$ 573530 333076 501717 175652 339366 372654 353002 536818 641476 552737 355884
17077C55884j2400R0702p7293A54032L06027q3836J69822L8233B60898J56528
$$ 355884 343484 434186 356893 154032 460059 376223 546045 584278 260898 417426
17067D17426k0505J73436B82132J59703J27780A89011M71069j27839j51463J96558
$$ 417426 396921 570357 282132 441835 569615 189011 660080 532241 380778 577336
17057E77336J49567l21929J73085A39810K31908q7845J09521D0783M62179J20031
$$ 577336 726903 404974 578059 139810 371718 283873 393394 40783 502962 622993
17047F22993A36410M52101j72751j39109J33839K16868q4746B63772L54944r3871
$$ 622993 136410 588511 415760 276651 410490 627358 542612 263772 618716 524845
17037E24845J59334k30582J92226k45540J36686R4511k66604Q8173K00514p9530
$$ 524845 684179 453597 645823 400283 536969 631480 364876 453049 653563 574033
17027E74033L29985k78687k55436J16061K9236B32484M93888P9043k03493k0132
$$ 574033 904018 625331 369895 485956 515192 232484 726372 805415 601922 581790
17017E81790o0134J77926r7980G2649L78847J80440k7900K54292l85038J55103
$$ 581790 521656 699582 601602 72649 451496 631936 604036 858328 473290 628393
17007F28393j90867M62691l79486J90910n0610M248J75229D01308M48784k07058
$$ 628393 437526 900217 520731 711641 661031 665279 840508 401308 850092 643034
16997F43034K20334k61509M0044K29847l33488l8155L11220C90818J84243J05279
$$ 643034 863368 601859 641903 871750 538262 500107 811327 390818 575061 680340
16987F80340N00168m94402M32764l57530M2248J42473l46436K16787r6115n4128
$$ 680340 1180508 686106 1118870 761340 803588 946061 599625 816412 720297 666169
16977F66169j3535j17752M52509m45824L97402J3223l85783N9774K01753J64852
$$ 666169 652634 534882 987391 541567 938969 952192 566409 626183 827936 992788
16967I92788j46592D06359L32422J72563r6980j05900M68843m83784L12646r2787
$$ 992788 846196 406359 738781 911344 814364 708464 1177307 693523 1006169 913382
16957I13382P4382K7939l25669M45261k29846j84000k5008J91909J75548k71108
$$ 913382 987764 1015703 690034 1135295 905449 721449 696441 888350 1063898 792790
16947G92790j03774N4042K14046j56887K26506J88191j66740J11365l44413K10754
$$ 792790 689016 743058 957104 800217 1026723 1214914 1048174 1159539 815126 1025880
16937A025880j11610Q4592P4697k69249M87850r189k41428J58383k19243k88454
$$ 1025880 914270 998862 1073559 804310 1292160 1282971 1041543 1199926 980683 692229
16927F92229N21788k14225K19102m8572j32870J23528O6987N4406j95417j5026
$$ 692229 1214017 999792 1218894 1170322 1037452 1160980 1227967 1282373 1086956 1071930
16917A071930M17199k50060m3882J99068m07673K65662Q3181j19785q3217K92120
$$ 1071930 1489129 1239069 1195187 1394255 986582 1252244 1335425 1215640 1132423 1424543
16907A424543m25868K79818P9332K92094j38710k56249L51516l05664J68475k6055
$$ 1424543 998675 1278493 1357825 1649919 1511209 1254960 1606476 1300812 1469287 1443232
16897A443232l1350M05213j94770j20201J7350K86257j23486j41412M3145J72123
$$ 1443232 1411882 1817095 1622325 1502124 1519474 1805731 1682245 1540833 1583978 1756101
16887A756101j48778M9125J29451k23437J96899M28941l68340K98164l72159J42723
$$ 1756101 1607323 1656448 1785899 1562462 1759361 2188302 1819962 2118126 1745967 1888690
16877A888690k09960N64981l63446M50071n49227K86891l0771J06180O0208l458
$$ 1888690 1678730 2243711 1880265 2330336 1781109 2068000 2037229 2143409 2203617 2200159
16867B200159j59633p6894o0743N3381J88804L47640m1703m64964J98522M07283
$$ 2200159 2040526 1963632 1902889 1956270 2145074 2492714 2451011 1986047 2184569 2591852
16857B591852n3268j34229K36916M2675J66631k28174M262M52131k20861j14868
$$ 2591852 2538584 2404355 2641271 2683946 2850577 2622403 2626665 3078796 2857935 2743067
16847B743067K83806l834K87595k80984p1379J17455k5061J54759M81953n61153
$$ 2743067 3026873 3023039 3310634 3029650 2958271 3075726 3050665 3205424 3687377 3126224
16837C126224K55371N4936L55868k01457K74205k47397J54391P2641J44784j79095
$$ 3126224 3381595 3436531 3792399 3590942 3865147 3617750 3772141 3844782 3989566 3810471
16827C810471M191n208O64738l99724J49634m1563O23480m54091L64310j40027
$$ 3810471 3814662 3809454 4474192 4074468 4224102 4182539 4806019 4351928 4716238 4576211
16817D576211J87394M77356j92328K99776j88490K31439j9407J7366L47817j93133
$$ 4576211 4763605 5240961 5048633 5348409 5159919 5391358 5371951 5389317 5737134 5544001
16807E544001L15661K84665k51079L84962k78787J91077M48777K12909K34648
$$ 5544001 5859662 6144327 5893248 6278210 5999423 6190500 6639277 6852186 7086834
16798G086834k8570n4530K20404L59178l6308O88785n1268p7409P04621j60434
$$ 7086834 7058264 7003734 7224138 7583316 7547008 8235793 8184525 8107116 8811737 8651303
16788H651303N15202J03533O6718L27635J49022O40046M6267L60276N02477L95749
$$ 8651303 9166505 9270038 9336756 9664391 9813413 10453459 10499726 10860002 11362479 11758228
16778A1758228P74L40342L40273J24467O96737N72026N68943J25189Q41116J09513
$$ 11758228 11759002 12099344 12439617 12564084 13260821 13832847 14401790 14526979 15368095 15477608
16768A5477608O18375N22364N83462L96901R15659N63392R85780R2976J161879
$$ 15477608 16095983 16618347 17201809 17598710 18514369 19077761 20063541 20156517 21318396
16759B1318396J385697M20049J122984J164293O36071J515581J118479J539660
$$ 21318396 22704093 23124142 24247126 25411419 26047490 27563071 28681550 30221210
16751C0221210J198406J317612J653904J838701J537147J897088K408933K219644
$$ 30221210 31419616 32737228 34391132 36229833 37766980 39664068 42073001 44292645
16743D4292645K349640K420298K914023K892379L439595L338667L517536M219680
$$ 44292645 46642285 49062583 51976606 54868985 58308580 61647247 65164783 69384463
16735F9384463M148819M706100M913695N328842N435334N960703O609047O482001
$$ 69384463 73533282 78239382 83153077 88481919 93917253 99877956 106487003 112969004
16727A12969004O596292P169954P368984P498666P304456P006692O676278N945980
$$ 112969004 119565296 126735250 134104234 141602900 148907356 155914048 162590326 168536306
16719A68536306N026438M557092K625868J530524O26727r84108k561100l187522
$$ 168536306 173562744 178119836 180745704 182276228 182902955 181918847 179357747 176170225
16711A76170225m540296n675738o107416o684899p284902p414842p287999p157233
$$ 176170225 171629929 165954191 159846775 153161876 145876974 138462132 131174133 124016900
16703A24016900p638353o572060o398717o060305o019871n548511n310961m753817
$$ 124016900 116378547 109806487 103407770 97347465 91327594 85779083 80468122 75714305
16695G5714305m223692m173569l523568m025909l388533l035686l159204k371058
$$ 75714305 71490613 67317044 63793476 59767567 56379034 53343348 50184144 47813086
16687D7813086k935091k263565j539578k364757k243330j608559j378239j735595
$$ 47813086 44877995 42614430 41074852 38710095 36466765 34858206 33479967 31744372
16679C1744372j063689j896717j174619j088524j301766p81672q95583j010165
$$ 31744372 30680683 28783966 27609347 26520823 25219057 24437385 23541802 22531637
16671B2531637r83486j144368n16507j044835K22050j454847q11895l51141n68893
$$ 22531637 21548151 20403783 19887276 18842441 19064491 17609644 16797749 16446608 15877715
16662A5877715m11089l50953o78268o42204l63624m90104l79600m92061n08107
$$ 15877715 15466626 15115673 14437405 13795201 13431577 12941473 12561873 12069812 11561705
16653A1561705m48298l25415j7999l1177j004768P3501m63617l21195R3485m68327
$$ 11561705 11113407 10787992 10769993 10738816 9734048 9807549 9343932 9022737 9116222 8647895
16643H647895m48607j30394j35918j19295k42712k81937l35219q7877M1039l35573
$$ 8647895 8199288 8068894 7932976 7813681 7570969 7289032 6953813 6865936 6906975 6571402
16633F571402J6260l38726O07651p32326l1446N6849k93632k98121j97252R168
$$ 6571402 6587662 6248936 6856587 6124261 6092815 6149664 5856032 5557911 5360659 5369827
16623E369827Q3501n68027j00940K94513m96294J09598O7030m24177k6980K25324
$$ 5369827 5453328 4885301 4784361 5078874 4582580 4692178 4759208 4335031 4308051 4533375
16613D533375k55535K9998j23716j95026J4443j18125P7987j55320m76322L47407
$$ 4533375 4277840 4307838 4184122 3989096 4003539 3885414 3963401 3808081 3331759 3679166
16603C679166k85252k14729j14806M98684n96547K46306j73516r8669R9676O795
$$ 3679166 3393914 3179185 3064379 3563063 2966516 3212822 3039306 2940637 3040313 3047108
16593C047108l24825P166K6821J19505L58356n97463N7475Q4304l30528K40345
$$ 3047108 2722283 2729449 2756270 2875775 3234131 2636668 2694143 2778447 2447919 2688264
16583B688264m24715K99687P9055k12074j85482l9742L34000M0710o05980J99152
$$ 2688264 2263549 2563236 2642291 2430217 2244735 2204993 2538993 2579703 1973723 2172875
16573B172875r3445j15771O7817M0775K27936j50833l61330J23722n4012o2129
$$ 2172875 2079430 1963659 2031476 2072251 2300187 2149354 1788024 1911746 1857734 1795605
16563A795605n7238K50325k99899K21394j87246m5446M7777k13943J5062J48279
$$ 1795605 1738367 1988692 1688793 1910187 1722941 1677495 1725272 1511329 1526391 1674670
16553A674670K78781n70190J86244n26625M63519O6708r4369k6403N5163q3835
$$ 1674670 1953451 1383261 1569505 1042880 1506399 1573107 1478738 1452335 1507498 1423663
16543A423663m6705J58669j87186p2587J64345r6719o230n7286K9054k6444J15655
$$ 1423663 1376958 1535627 1348441 1275854 1440199 1343480 1337250 1279964 1309018 1282574 1398229
16532A398229q6245l16293J37536k36934O02950k24829M5642J14582r2781n1699
$$ 1398229 1311984 995691 1133227 896293 1499243 1274414 1320056 1434638 1341857 1290158
16522A290158J24799l57125j57220J07466k45599M77850j28845M2296k10393K05001
$$ 1290158 1414957 1057832 900612 1008078 762479 1240329 1111484 1153780 943387 1148388
16512A148388j58856J15414l04483J7536L5332P1369m2236K56374O4378m09583
$$ 1148388 989532 1104946 800463 817999 853331 924700 882464 1138838 1203216 793633
16502G93633J9534K65502E19006L00891j30166L08735j37400J61829k65605j52907
$$ 793633 813167 1078669 519006 819897 689731 998466 861066 1022895 757290 604383
16492F04383L4781K21790p473l05127K16034l769j43579Q946K96570j59847r4668
$$ 604383 639164 860954 853481 548354 764388 760619 617040 625986 922556 762709 668041
16481F68041R4361k08909N1131J50370r0330o367k2099P0636k46315K9189q9238
$$ 668041 762402 553493 604624 754994 664664 658297 636198 706834 460519 489708 400470
16470D00470P7065j1192K78067J2433k12945m1254M53757D28219K26202K95688
$$ 400470 477535 466343 744410 756843 543898 502644 956401 428219 654421 950109
16460I50109m25648L36572m07897K41114j09372B63581J22379N2553M26126A87292
$$ 950109 524461 861033 453136 694250 584878 263581 385960 438513 864639 187292
16449H54054B22396N4848K57604k5818p6236K38162l05168R9363j26651L02223
$$ 854054 222396 277244 534848 509030 432794 670956 365788 465151 338500 640723
16439F40723B08383L43053l9597J40727j22689K28329k62012j9083M30683j93335
$$ 640723 208383 551436 511839 652566 529877 758206 496194 477111 907794 714459
16429G14459k13464j50361L6787o0532J07329j10195K68796H2783K08197J99534
$$ 714459 500995 350634 387421 326889 434218 324023 592819 82783 290980 490514
16419D90514j71856K4000q2747n5519J12951J77265o1622J03898M843m6247B01501
$$ 490514 318658 342658 259911 204392 317343 494608 432986 536884 541727 495480 201501
16407D14530N3110j72527o6622J72467J40567B22960E2368J20391J73495J0946
$$ 414530 467640 295113 228491 400958 541525 222960 52368 172759 346254 357200
16397C57200p8252l0242J62569J35682k37328K84794j54431D7219M33515K84198
$$ 357200 278948 248706 411275 546957 309629 594423 439992 47219 480734 764932
16387G64932B40078K75482A30189K38351j54491L43497J1413P2307E4385M05263
$$ 764932 240078 515560 130189 368540 214049 557546 568959 641266 54385 459648
16377D59648D3583L07700j42492d3856E17269k55219R846n7244K96947a29830
$$ 459648 43583 351283 208791 -43856 517269 262050 271896 214652 511599 -129830
16366B87617J12585k5030J6514K09887Q2145D3553L02156l4970A30399L31964
$$ 287617 400202 375172 391686 601573 683718 43553 345709 310739 130399 462363
16356D62363j48008o9615p5956B6082J27512a50017E06035j80840K9149F0904
$$ 462363 314355 244740 168784 26082 153594 -150017 506035 325195 354344 60904
16345B60760K3796J0779k1914m3423Q3429h1D4504m922J12213g6191D04850c2399
$$ 260760 284556 295335 273421 229998 313427 -81 44504 39582 151795 -76191 404850 -32399
16332D34989q7973a13699C43683M1515l2961j46222g0303q7597f39B75305C2919
$$ 434989 347016 -113699 343683 385198 352237 206015 -70303 -157900 -639 275305 32919
16320a6543A85137J01769M48097A89487a05688B51425J11581M5057K22474B81861
$$ -16543 185137 286906 735003 189487 -105688 251425 363006 408063 630537 281861
16309A85028P0494i0324A72551M2929k3827J05987L025e1200j52661E5404Q4947
$$ 185028 255522 -90324 172551 215480 191653 297640 300665 -51200 -203861 55404 140351
16298A40351j7836J76266n2030G2369j1371J58593N8632J02424A54019K12061
$$ 140351 122515 298781 246751 72369 60998 219591 278223 380647 154019 366080
16288C66080E0745J63433I1537a39773B19955j010o4164f8402C49017K38561b6262
$$ 366080 50745 214178 91537 -139773 219955 218945 154781 -68402 349017 587578 -26262
16276E5257L43242h9674D0963L5187e8262F4943A7188K3311c5626C0292J6787
$$ 55257 398499 -89674 40963 76150 -58262 64943 17188 40499 -35626 30292 47079
16265D7079b44951G9580J240L32029F370K53899J602a75230C95698q2573K25191
$$ 47079 -244951 79580 80820 412849 6370 260269 261871 -175230 395698 313125 538316
16254E38316d2261G9643L5519a10360l67141A62894K97276A23818N9894q4620
$$ 538316 -42261 79643 115162 -110360 -477501 162894 460170 123818 183712 99092
16244I9092d6340E7166a41214F3408f1692k7463p7374B05495C5631h1789F181
$$ 99092 -46340 57166 -141214 63408 -61692 -89155 -166529 205495 35631 -81789 6181
16232A44777k7286k3111K3544f1243I9398J65935c5770F32116B14495c3097F5426
$$ 144777 117491 94380 117924 -61243 99398 265333 -35770 632116 214495 -33097 65426
16220D1138J30574D2849a580C97193a8419A33500M2399b3782C99211b6422I3838
$$ 41138 171712 42849 -1580 397193 -18419 133500 175899 -23782 399211 -26422 93838
16208i261A46917C4806D267K48310f3087a3476B6018i1483A62435a60829B38612
$$ -9261 146917 34806 4267 252577 -63087 -13476 26018 -91483 162435 -160829 238612
16196G5097k1883e0653A11960b3915j82549C47610i7953r5252h8500C3825g1082
$$ 75097 53214 -50653 111960 -23915 -206464 347610 -97953 -193205 -88500 33825 -71082
16184a71928f183j51187C9319J14625A6391a79461n8862B65110P3633j62383H0418
$$ -171928 -6183 -157370 39319 153944 16391 -179461 -238323 265110 338743 176360 80418
16172A62581a18618A43230M9610j0436N3511m5236b38197B50623L7758d33183
$$ 162581 -118618 143230 192840 182404 235915 190679 -238197 250623 288381 -433183
16161A24596a09792C6117A0274J65972Q4141a43613D659K15854I8443l5668J49833
$$ 124596 -109792 36117 10274 176246 260387 -143613 4659 220513 98443 62775 212608
16150B12608k4953r645b74938A4835b74744a02839C12560b127I1365a80649c5470
$$ 212608 187655 178010 -274938 14835 -274744 -102839 312560 -2127 91365 -180649 -35470
16138E3173e9430b5762C01275c9378B36897b46208H5325a33080k0161B80214F0277
$$ 53173 -59430 -25762 301275 -39378 236897 -246208 85325 -133080 -153241 280214 60277
16126g3250B41265A00370L27802k09743c16198E11182A27831Q1335b93299c1942
$$ -73250 241265 100370 428172 218429 -316198 511182 127831 209166 -293299 -31942
16115C7213a28213A61013g400j41088E367L8145i2189a864j27545O4252L621B90060
$$ 37213 -128213 161013 -7400 -148488 5367 43512 -92189 -1864 -129409 -65157 -61536 290060
16102B3663K24524N7572A20158a95491B01901K0683b15977j13353B273b07598
$$ 23663 248187 305759 120158 -195491 201901 222584 -215977 -329330 2273 -207598
16091f7008C25999a17336a3646H4537c1758A2896b3084B11826C268Q0965J34683
$$ -67008 325999 -117336 -13646 84537 -31758 12896 -23084 211826 3268 84233 218916
16080B18916h8492A86501b48883A9112b03814C5806O738c09408b7773k74312J37904
$$ 218916 -88492 186501 -248883 19112 -203814 35806 42544 -309408 -27773 -302085 -164181
16069a64181p2904g4222C25808c10449a15600A03225D1024h3265A35435d1220
$$ -164181 -237085 -74222 325808 -310449 -115600 103225 41024 -83265 135435 -41220
16058d44p7951k1539A1006J94801e1033j73159f5251A5301J02231B6836e455A27184
$$ -444 -78395 -99934 11006 205807 -51033 -224192 -65251 15301 117532 26836 -5455 127184
16045f6423A05588i8175d4450j95348J4305e739I1558J2526B512O446a42351M7048
$$ -66423 105588 -98175 -44450 -239798 -225493 -5739 91558 104084 2512 8958 -142351 -95303
16033i5303M6084j96483l8838A3901a40104F453a75195A23434a62693a0053n3296
$$ -95303 -49219 -245702 -284540 13901 -140104 6453 -175195 123434 -162693 -10053 -63349
16022f3349I1582e0726E8225O0463m3617c1354A20553n3594e3884B54867a43969
$$ -63349 91582 -50726 58225 118688 75071 -31354 120553 66959 -53884 254867 -143969
16010b33481O2598C519b67056A49497a43385A09779J60504n2250a14574F9633
$$ -233481 -170883 3519 -267056 149497 -143385 109779 270283 218033 -114574 69633
15999a73317j57178i5436o4371E6343b13981j1486A41068E8697K9962a31001C8032
$$ -173317 -330495 -95436 -159807 56343 -213981 -225467 141068 58697 88659 -131001 38032
15987C3451g4064j0696p115A45473K4885A7257a05718A42241O1193m8764i6410
$$ 33451 -74064 -84760 -91875 145473 170358 17257 -105718 142241 203434 154670 -96410
15975A88901D0493a81235D775b47009D086J61281a32817m4113h0075c6862m3296
$$ 188901 40493 -181235 4775 -247009 4086 165367 -132817 -176930 -80075 -36862 -80158
15964h0158I1954J26294o7939g734C7584A1062c12171B68943p0243b11435I5832
$$ -80158 91954 218248 150309 -7734 37584 11062 -312171 268943 198700 -211435 95832
15952a45634C01419a11097A83098p609a40826M2333B2986a9185A16824h2649b5920
$$ -145634 301419 -111097 183098 175489 -140826 -98493 22986 -19185 116824 -82649 -25920
15940c5016j22458j02706F9544a35098I4725b09097l47178b68177a08722j94066
$$ -35016 -157474 -260180 69544 -135098 94725 -209097 -556275 -268177 -108722 -302788
15930c02788f023C88657a80646A8448N4280K7509D7548e455m154k10204E7018
$$ -302788 -6023 388657 -180646 18448 72728 100237 47548 -5455 -9609 -219813 57018
15918a87361h0472A75744a30561r1762q0208J44317A91046C6583P771a70641D8093
$$ -187361 -80472 175744 -130561 -222323 -302531 -158214 191046 36583 44354 -170641 48093
15906a79910g1739A19165Q999K19738h9639A75184D9131K1649J11897c0790G3049
$$ -179910 -71739 119165 128164 347902 -89639 175184 49131 70780 182677 -30790 73049
15894c0741k14103B62027a82069A19639b99723g5294j05149D5403c3151A01571
$$ -30741 -244844 262027 -182069 119639 -299723 -75294 -180443 45403 -33151 101571
15883A46148P3289P0797j25348G2657j8116h7479j10495A66773m3405f5496A71109
$$ 146148 219437 290234 164886 72657 54541 -87479 -197974 166773 123368 -65496 171109
15871F0101a54749b421k95437J12596j7399A27384J12493l965c8331m1372o639
$$ 60101 -154749 -2421 -297858 -185262 -202661 127384 239877 235912 -38331 -79703 -86342
15860h6342j31618p5689g3956E08884B35979g3704r7113A08759b01278l8081f9954
$$ -86342 -217960 -293649 -73956 508884 235979 -73704 -170817 108759 -201278 -239359 -69954
15848D2436a61851k32539a40742C77290A19072g4881j02615C91897P3919c26358
$$ 42436 -161851 -394390 -140742 377290 119072 -74881 -177496 391897 465816 -326358
15837a08350j88850a22072A28934a95728Q0969k19568J9008F7256d5360A03137
$$ -108350 -297200 -122072 128934 -195728 -114759 -334327 -315319 67256 -45360 103137
15826A06480a64988e2402k29277e0305k75046G2644a84437c1371C05297A31572
$$ 106480 -164988 -52402 -281679 -50305 -325351 72644 -184437 -31371 305297 131572
15815a8014m3243j58931J9026B14373P7433b5899l06310A16874a558F1142A7327
$$ -18014 -61257 -220188 -201162 214373 291806 -25899 -332209 116874 -1558 61142 17327
15803c34394J54243F438d2183l9032A23789q028d1773J8726j47992B97173A40799
$$ -334394 -180151 6438 -42183 -81215 123789 115761 -41773 -23047 -171039 297173 140799
15791c98069Q3599b994j60298c4723B06995a29202A29730b20723b5700A90741
$$ -398069 -314470 -2994 -163292 -34723 206995 -129202 129730 -220723 -25700 190741
15780A1533J62371O8788a26746E4348c00265e6227E55b85489i8377j5610B37894
$$ 11533 173904 242692 -126746 54348 -300265 -56227 555 -285489 -98377 -113987 237894
15768b61442A03470D6656b51328j30330e6835I5167l7379g162A98295A4072J89602
$$ -261442 103470 46656 -251328 -381658 -56835 95167 57788 -7162 198295 14072 203674
15757B03674I7763L8067J64994A37517k8514a75434o8540A94311i7286l375J3979
$$ 203674 97763 135830 300824 137517 109003 -175434 -243974 194311 -97286 -100661 -86682
15746h6682j0757b5215I3607e5167m8839A47007e0911k43336a41780B5714b91534
$$ -86682 -97439 -25215 93607 -55167 -104006 147007 -50911 -294247 -141780 25714 -291534
15734D168P0898b62524B6490J19450q074a49149f3073j98858F9375b84777R7378
$$ 4168 75066 -262524 26490 145940 137866 -149149 -63073 -261931 69375 -284777 -187399
15723a87399B39021a59357A45288H905d45685j11984d6946Q996G5661a9540D6646
$$ -187399 239021 -159357 145288 8905 -445685 -557669 -46946 -37950 75661 -19540 46646
15711A84083J3767k967E6933J38394c25356B20704a18195M5151B39833c13260
$$ 184083 197850 194883 56933 195327 -325356 220704 -118195 -73044 239833 -313260
15700a44184D302f5260A42515b50253E7327J58756b04343C67367A63943a11189
$$ -144184 4302 -65260 142515 -250253 57327 216083 -204343 367367 163943 -111189
15689b68096A39562F9460K1232c5114A31690A243R6398J12834j0856a5862j97576
$$ -268096 139562 69460 90692 -35114 131690 1243 97641 210475 199619 -15862 -213438
15678b13438N4724L1964O1507l05386A34701c5557f128D6525M6762a80073Q4509
$$ -213438 -158714 -126750 -65243 -370629 134701 -35557 -6128 46525 93287 -180073 -95564
15667i5564c8776A70969f3084o5153p0405b8506q621m4190F1638J80518e9934
$$ -95564 -38776 170969 -63084 -128237 -198642 -28506 -37127 -81317 61638 242156 -59934
15655h4847k93052J29111d6362j53422D2078K20197G4646K7086m868i64k2702
$$ -84847 -377899 -248788 -46362 -199784 42078 262275 74646 101732 96864 -964 -23666
15644b3666k35767l8572B29445g818l5697m8055j68583D6001J24465a12481j1245
$$ -23666 -259433 -298005 229445 -7818 -43515 -91570 -260153 46001 170466 -112481 -123726
15633a23726O1192l49728C56214G6798J24720c49877a62775J9212j51136B90846
$$ -123726 -62534 -412262 356214 76798 201518 -349877 -162775 -143563 -294699 290846
15622C13834A13675j0427m3870A3429K52322c43093i4343n5433p1971j4795J05039
$$ 313834 113675 103248 59378 13429 265751 -343093 -94343 -149776 -221747 -236542 -131503
15611a31503b7454A4761J21275d45820F9136B6502a13542m8344j55441A77014
$$ -131503 -27454 14761 136036 -445820 69136 26502 -113542 -161886 -317327 177014
15600A50188J1502a56599B39609a81101q100D2121a41011F6030J30524c5487k77883
$$ 150188 161690 -156599 239609 -181101 -189201 42121 -141011 66030 196554 -35487 -313370
15589c13370b2217A15034a10718i020n2622J2691p2255c5719A27070B0472J10924
$$ -313370 -22217 115034 -110718 -9020 -61642 -48951 -121206 -35719 127070 20472 131396
15578A31396b33383c6459k73059A3676b0524l68788J33865D2562B595R2468J12289
$$ 131396 -233383 -36459 -309518 13676 -20524 -389312 -255447 42562 2595 95063 207352
15567B07352K12137a43829j22250F7579a38429F6764i998B38388n9096K5131H5099
$$ 207352 419489 -143829 -266079 67579 -138429 66764 -9998 238388 179292 204423 85099
15555d0900F7881c321p3450J4916A36302J46241d6444k9127k774q0796K9231d7747
$$ -40900 67881 -3321 -76771 -61855 136302 282543 -46444 -75571 -78345 -159141 -129910 -47747
15542A67456n489h5767B1223e9341B19211o0174K8719a90396q8162A87761b93504
$$ 167456 161967 -85767 21223 -59341 219211 159037 187756 -190396 -278558 187761 -293504
15530B8698a06771A8324M03850E7432P0255c74852H2190a34458k02306a3365A87013
$$ 28698 -106771 18324 422174 57432 127687 -374852 82190 -134458 -336764 -13365 187013
15518B66904F3231K8349C4117B103L9713L373J39542a85231B34245B5407c6797
$$ 266904 63231 91580 34117 2103 41816 45189 184731 -185231 234245 25407 -36797
15506C6516c1602j1198m3598j76243A04831k4036b67273A36166c20491a19848
$$ 36516 -31602 -42800 -86398 -262641 104831 80795 -267273 136166 -320491 -119848
15495A57009d652o8372k68899J13486B6341a03758q8809d9675A79082K4784p6025
$$ 157009 -4652 -73024 -341923 -228437 26341 -103758 -192567 -49675 179082 203866 127841
15484A27841a27495e6472J1070a3269I681K6895n288b17950C6532P5248a56714
$$ 127841 -127495 -56472 -45402 -13269 9681 36576 31288 -217950 36532 111780 -156714
15472B15846e058C07997d5521A58121D2967h6075A21276C5408a32609O2930a9824
$$ 215846 -5058 307997 -45521 158121 42967 -86075 121276 35408 -132609 -69679 -19824
15460H6251e9375n7730A76974b67699F4095C0480c5532A71974e2563F4803M8890
$$ 86251 -59375 -117105 176974 -267699 64095 30480 -35532 171974 -52563 64803 113693
15449A13693Q924J26233G7062e7892i169k4018m0757A17356n7218f0833G6634
$$ 113693 122617 248850 77062 -57892 -9169 -33187 -73944 117356 60138 -60833 76634
15437A32210E9225d9067j38480G2262B6432a50168q3378A32966B0629b08366b9813
$$ 132210 59225 -49067 -187547 72262 26432 -150168 -233546 132966 20629 -208366 -29813
15425D170a8500E4322O8454J76982a72418A88065b76040E4989a99302J7390f5673
$$ 4170 -18500 54322 122776 299758 -172418 188065 -276040 54989 -199302 -181912 -65673
15413b02009G7300I045N240a47365j63834a46967A89958a30863K9714A36542a60766
$$ -202009 77300 9045 14285 -147365 -311199 -146967 189958 -130863 -101149 136542 -160766
15401G4991a29590A25591L9834c2752a0394G5319c6807B27885e2283l03207A35527
$$ 74991 -129590 125591 165425 -32752 -10394 75319 -36807 227885 -52283 -355490 135527
15389a58267E8491M0234b59709b0648b404H9523L8034A6791i3556k04682g8372
$$ -158267 58491 98725 -259709 -20648 -2404 89523 127557 16791 -93556 -298238 -78372
15377a4903j19521m6860A1264a92600k00708G5586b08272A2528b42792a17500
$$ -14903 -134424 -181284 11264 -192600 -393308 75586 -208272 12528 -242792 -117500
15366a53310G0370J9877d9385A80448K34316I7567C5719a23338A06504h2919A13047
$$ -153310 70370 90247 -49385 180448 414764 97567 35719 -123338 106504 -82919 113047
15354i2177A23460j3343l5070a46667N7284j22657e5401C08908A12707a9966A95103
$$ -92177 123460 110117 75047 -146667 -89383 -212040 -55401 308908 112707 -19966 195103
15342a41450B48479c00723B05172E0176P8461M3793c22110O9587B68038H5187
$$ -141450 248479 -300723 205172 50176 128637 172430 -322110 -252523 268038 85187
15331A03092a81511F6887J20728C0111a32536l4289A6301a08322A28596Q0426
$$ 103092 -181511 66887 187615 30111 -132536 -166825 16301 -108322 128596 209022
15321B09022f703j55109A3165a31627B62946B6797g9072I3675a14137H4734c44569
$$ 209022 -6703 -161812 13165 -131627 262946 26797 -79072 93675 -114137 84734 -344569
15309E1353a14889K9589j40259B77835j07029G618a83872b0482j33180A17950
$$ 51353 -114889 -85300 -225559 277835 170806 7618 -183872 -20482 -153662 117950
15298a56719A52987c68516A10299J08523R3783D8618a09194A09516J81568A44436
$$ -156719 152987 -368516 110299 218822 312605 48618 -109194 109516 291084 144436
15287a21958k7905B31335J56864H8566l6980e6355A40029a46334e8220A33421
$$ -121958 -149863 231335 388199 88566 51586 -56355 140029 -146334 -58220 133421
15276i2875B65228J51411B4859m912a10721J452D3844a24134K5637A02093g0075
$$ -92875 265228 416639 24859 19947 -110721 -109269 43844 -124134 -98497 102093 -70075
15264a64190g9886L0162A54373n9064J97604a17088n9055G152f60m7906F2660
$$ -164190 -79886 -49724 154373 95309 292913 -117088 -176143 7152 -660 -48566 62660
15252C31123b19254H682K17012K68412J54613M54923N5214K51418m14892l65605
$$ 331123 -219254 8682 225694 494106 648719 1103642 1158856 1410274 995382 629777
15242F29777N5775A13097k0322a10294d6095E5809J79877B1876c4210k6037D01498
$$ 629777 685552 113097 92775 -110294 -46095 55809 235686 21876 -34210 -60247 401498
15230c3902D06997j66865G1347k0110J60112P3582o2987b91374A05244M6105e0044
$$ -33902 406997 240132 71347 51237 211349 284931 221944 -291374 105244 151349 -50044
15218a5098k76758I0990L88194G3302a65501P737A4178a7240A51354P0059a91791
$$ -15098 -291856 90990 479184 73302 -165501 -157764 14178 -17240 151354 221413 -191791
15206f8603j02311c7800A51438e4081J8157j34472a1632m0584l2242p3192B34896
$$ -68603 -170914 -37800 151438 -54081 -35924 -170396 -11632 -52216 -84458 -157650 234896
15194d81706A42014N522C4734f8220m9571A27629A7782R0952a32150n0501b2812
$$ -481706 142014 147536 34734 -68220 -117791 127629 17782 108734 -132150 -182651 -22812
15182b06572E9527a35230D8855K12147g5098K0096B15050G227a23230B84351j41729
$$ -206572 59527 -135230 48855 261002 -75098 -55002 215050 7227 -123230 284351 142622
15171A42622D8801K62473A45674l0521M0810O1694N5649i960B91718F1877B5581
$$ 142622 48801 311274 145674 115153 155963 217657 273306 -9960 291718 61877 25581
15159B72571q2196F4917K70431J72708A66894a14612A60797e7467C13527b79255
$$ 272571 190375 64917 335348 508056 166894 -114612 160797 -57467 313527 -279255
15148D13294j77573B19Q9442J4304m7831K02119J79962A38715m9235J78653E487
$$ 413294 235721 219 89661 103965 56134 258253 438215 138715 89480 268133 5487
15136H7152K33718P4794h2204F9250b21879B53529A24129E5477b69889A99400
$$ 87152 320870 395664 -82204 69250 -221879 253529 124129 55477 -269889 199400
15125I3984J46898d772B42756K0552b12940g771m610I6830L06480p7115l6037
$$ 93984 240882 -4772 242756 263308 -212940 -7771 -12381 96830 403310 326195 290158
15114B90158l7708C8133L06157a14197G0662a42868M9967C2587h1685B56009a48248
$$ 290158 252450 38133 344290 -114197 70662 -142868 -92901 32587 -81685 256009 -148248
15102B47079a23571c9817C19123a02983G7528K80029B0571L1057e5332A79032
$$ 247079 -123571 -39817 319123 -102983 77528 357557 20571 51628 -55332 179032
15091B61280a60291E006J27158A8793M04553g5698a7403j21976E72058a52675
$$ 261280 -160291 5006 132164 18793 423346 -75698 -17403 -139379 572058 -152675
15080A74531L44196A04924B9825K44087j31196J566a42084A40040o0395M38226
$$ 174531 518727 104924 29825 273912 142716 144282 -142084 140040 79645 517871
15070E17871D9850Q6580o3328N01213B37603m3671o8691a59378I3815M1212n6081
$$ 517871 49850 136430 73102 574315 237603 193932 125241 -159378 93815 135027 78946
15059G8946O8697j0988K58250p1867F7192J25633a5076A58123M6097K96539m8106
$$ 78946 147643 136655 394905 323038 67192 192825 -15076 158123 204220 500759 452653
15048D52653A30635l7533N1666F2742K15157g1731l09749G9567d9432C66196j72222
$$ 452653 130635 93102 144768 62742 277899 -71731 -381480 79567 -49432 366196 193974
15037A93974r4475o86J12571i7133B96963M7779A6046K6580b78997C33147n9162
$$ 193974 99499 98813 211384 -97133 296963 344742 16046 42626 -278997 333147 273985
15026B73985J82671k6760B2903J2157K8663M1432K13267l6744R9433A85891J10466
$$ 273985 456656 429896 22903 35060 63723 105155 318422 281678 381111 185891 296357
15015B96357M649f0182B02163l545J31873G9222J2865J25642G4823R3965l0066
$$ 296357 301006 -60182 202163 198618 330491 79222 92087 217729 74823 168788 138722
15004A38722b21513B44914H2285C180L65338B8485J0407R9850m3921K41000a10673
$$ 138722 -221513 244914 82285 3180 368518 28485 38892 138742 94821 335821 -110673
14992a90525B9095a89928B84411q107I884K93113E5045J69824J07612A53221n5234
$$ -190525 29095 -189928 284411 276304 9884 302997 55045 224869 332481 153221 97987
14981I7987J1060M0697C1910J12929M7742M7909p5677Q3080q3852L44186a50273
$$ 97987 109047 149744 31910 144839 192581 240490 164813 247893 164041 508227 -150273
14969F29215A62937c34439H7831J76077A25767a12922D39922r4100G9795M2370
$$ 629215 162937 -334439 87831 263908 125767 -112922 439922 345822 79795 122165
14959A22165K87438l8970A80617d137A94983J96964j68844o0267L8036N1484K9811
$$ 122165 409603 370633 180617 -4137 194983 391947 223103 162836 200872 252356 282167
14948B82167A39705M1558J11613q4459K3578g5521F4180J35945A1913J57235J531
$$ 282167 139705 181263 292876 208417 231995 -75521 64180 200125 11913 169148 170679
14937A70679M30514k92612M1803r2078K5174j36972N2636j7830d8230O278E67558
$$ 170679 601193 308581 350384 258306 283480 146508 199144 181314 -48230 -41952 567558
14925C39573j55383J05837J73482k25373K41928b03569F13842k38064J89755A72266
$$ 339573 184190 290027 463509 238136 480064 -203569 613842 375778 565533 172266
14914E10590j80761j31384Q9667J27851A44081J07355D6857M65746B47376J16313
$$ 510590 329829 198445 288112 415963 144081 251436 46857 512603 247376 363689
14904C63689n4909j03038L5561J7722M5669j50188J10529R8776J5174E1547L68538
$$ 363689 308780 205742 241303 259025 304694 154506 265035 363811 378985 51547 420085
14893D20085o2270r9091q349A15254K39996r8637O8817A55269f9375D65880J27497
$$ 420085 357815 258724 250375 115254 355250 256613 325430 155269 -69375 465880 593377
14882E93377A36771j5130A7351L01445N0797J77696k0005B06221L30989A06901
$$ 593377 136771 121641 17351 318796 369593 547289 527284 206221 537210 106901
14871B53192K66012j45285g360B16511F2576K62240K7666j8600j66842J54036
$$ 253192 519204 373919 -7360 216511 62576 324816 352482 333882 167040 321076
14861C21076J88995N6681k67042J30758R7471D3413L05201A33057J79486L14402
$$ 321076 510071 566752 299710 430468 527939 43413 348614 133057 312543 626945
14851F26945B43831l885K32238M621k18411J58242j32299J41094r8742A49403
$$ 626945 243831 239946 472184 476805 258394 416636 284337 425431 326689 149403
14840C71376j39131J30212M0353J08385j29406K5858j23395k19K3749K10464M8869
$$ 371376 232245 362457 402810 511195 381789 407647 284252 284033 307782 518246 567115
14829E67115k64479j32624J08092P6900j49064K49322J36991r5634k05654J44540
$$ 567115 302636 170012 278104 355004 205940 455262 592253 496619 290965 435505
14819D35505j29102k864l9392N06682j88779B18735J58018p4827K47194q1958
$$ 435505 306403 303539 264147 770829 582050 218735 376753 301926 549120 467162
14809D67162P0600B61381K95454j46567G7454L10606p7665K0086J20189J29533
$$ 467162 537762 261381 556835 410268 77454 388060 310395 330481 450670 580203
14799E80203K7455A31753M25864P8511l07564P8832K643j14584M8026J26936R4567
$$ 580203 607658 131753 557617 636128 328564 407396 410039 295455 343481 470417 564984
14788E64984j88085K92493k38071l6244L38867p8964A72928L04184B16475J12555
$$ 564984 376899 669392 431321 395077 733944 654980 172928 477112 216475 329030
14778C29030K20692J38166K1361P3820k92122N9120k69880J35451J16272J79298
$$ 329030 549722 687888 709249 783069 490947 550067 280187 415638 531910 711208
14768G11208k8253k90502J11623j08706P2913N9908N2963a70146E25854J011J50240
$$ 711208 682955 392453 504076 395370 468283 528191 581154 -170146 525854 526865 677105
14757F77105k44635j30717M83499j11657k19283J66311k60593K52996q2585n6187
$$ 677105 432470 301753 785252 673595 454312 620623 360030 613026 530441 474254
14747D74254Q5267N7471J23720o9846J92439k47311j47496K63956J3968j62703
$$ 474254 559521 616992 740712 670866 863305 615994 468498 732454 746422 583719
14737E83719H7301O81194j48546k02234L96647j69022J4810B35214L25310K91860
$$ 583719 87301 768495 619949 417715 814362 645340 660150 235214 560524 852384
14727H52384l87405K75052l09598J94204J70191m2990B28213L03643N53253j49440
$$ 852384 464979 740031 430433 624637 794828 751838 228213 531856 1085109 935669
14717I35669l06391O2661j6702J69672C98434J32049N18424k08561J8960l09286
$$ 935669 629278 691939 675237 844909 398434 530483 1048907 840346 859306 550020
14707E50020J67840J6358j29669N70771k04480j14989k03415J14106n7043J07119
$$ 550020 717860 734218 604549 1175320 970840 855851 652436 766542 709499 816618
14697H16618J35021l85528J60175J74326M3193k80552n2784N57993j45730k16965
$$ 816618 951639 566111 726286 900612 943805 663253 610469 1168462 1022732 805767
14687H05767j29081J00032J20391K33495K0588k03935j16682k15689j41796J52280
$$ 805767 676686 776718 897109 1130604 1151192 947257 830575 614886 473090 625370
14677F25370J61180M9041N8386j39333M2286J70823p3022j1193K47293k54842
$$ 625370 786550 835591 893977 754644 796930 967753 894731 883538 1130831 875989
14667H75989O440L78298k56357k04502K6258q4532M7150O9878N1881J23569J13581
$$ 875989 882429 1260727 1004370 799868 826126 741594 788744 858622 910503 1034072 1147653
14656A147653k89902J89267j73647K95916l96008K22886j96651J93051j90047
$$ 1147653 857751 1047018 873371 1169287 773279 996165 799514 992565 802518
14647H02518M35106k87144J7361K35144j91673R0388m4802J67451m33841L66352
$$ 802518 1237624 950480 967841 1202985 1011312 1101700 1056898 1224349 790508 1156860
14637A156860K86077m59258J68841L45543m85166O9525j00249Q8719K79357k92845
$$ 1156860 1442937 983679 1152520 1498063 1012897 1082422 982173 1070892 1350249 1057404
14627A057404J96635q1907j0683R744L45773l94541K53895k69472L57382o0783
$$ 1057404 1254039 1172132 1161449 1171193 1516966 1122425 1376320 1106848 1464230 1403447
14617A403447o4740k07441K11638l12100J78313P7583L04660l72525K39046m07559
$$ 1403447 1338707 1131266 1342904 1030804 1209117 1286700 1591360 1218835 1457881 1050322
14607A050322K98492m980M36462m45319J51480K04299l17968k05744M6872J63377
$$ 1050322 1348814 1343834 1780296 1334977 1486457 1690756 1372788 1167044 1213916 1377293
14597A377293Q8325K03306k06969k1698K01849k41811P8863J49867j80524l8041
$$ 1377293 1465618 1668924 1461955 1440257 1642106 1400295 1479158 1629025 1448501 1410460
14587A410460K82978l43917N40326k14074k0124k23584M30497k47197k82904K07300
$$ 1410460 1693438 1349521 1889847 1675773 1655649 1432065 1862562 1615365 1332461 1539761
14577A539761j5587L19174J59621k694K00086k40164J10641m32957J49116M77425
$$ 1539761 1524174 1843348 2002969 2000275 2200361 1960197 2070838 1637881 1786997 2264422
14567B264422l59818K20457j96838K16942j74731K58362m11654J96222N21280
$$ 2264422 1904604 2125061 1928223 2145165 1970434 2228796 1817142 2013364 2534644
14558B534644Q0764l84004O74409J63387J72859J35710N35635J00916O19867J325086
$$ 2534644 2615408 2231404 2905813 3069200 3242059 3377769 3913404 4014320 4634187 5959273
14548E959273L025848R379669J7045881K546870j8619437p848701n226903k494102
$$ 5959273 8985121 18364790 35410671 37957541 19338104 11489403 6262500 3768398
14540C768398r76497p43947n9435r4686J46941m58539L73466J18787L4934r932
$$ 3768398 2791901 2047954 1988519 1893833 2040774 1582235 1955701 2074488 2109422 2099490
14530B099490J84933k53662r5577l41570M64925k08896K95546p5561j78572J57796
$$ 2099490 2284423 2030761 1935184 1593614 2058539 1849643 2145189 2069628 1891056 2048852
14520B048852J90858j06749J16005k83382M85655J6750J16521K0174p0041l49830
$$ 2048852 2239710 2132961 2248966 1965584 2451239 2467989 2584510 2604684 2534643 2184813
14510B184813J15368K25605k44830L50873j59395J94068j63569j5199L02939j08353
$$ 2184813 2300181 2525786 2280956 2631829 2472434 2666502 2502933 2487734 2790673 2682320
14500B682320O304R9971l38358L84617J73870j32831j86337L09362N4174P1548
$$ 2682320 2688624 2788595 2450237 2834854 3008724 2875893 2689556 2998918 3053092 3124640
14490C124640k65408M49750k81610K17464n5566p8309J37304j75654J77964R2581
$$ 3124640 2859232 3308982 3027372 3244836 3189270 3110961 3248265 3072611 3250575 3343156
14480C343156k47031J77718o7879L54953j86787N04066l28106L8371j49265K63502
$$ 3343156 3096125 3273843 3205964 3560917 3374130 3878196 3550090 3588461 3439196 3702698
14470C702698l08468J21809Q0391K45722K48561k86158M1144N0618L549P9477
$$ 3702698 3394230 3516039 3596430 3842152 4090713 3804555 3845699 3896317 3899866 3979343
14460C979343j52130L19380J07120J51170j85351j97530K00573L78416m06656
$$ 3979343 3827213 4146593 4253713 4404883 4219532 4022002 4222575 4600991 4194335
14451D194335L69807k61195K05201K29245q0210K83251j52903L75530k14330J80343
$$ 4194335 4564142 4302947 4508148 4737393 4657183 4940434 4787531 5163061 4948731 5129074
14441E129074Q6324j82456m2609M1455M20290j95102L76359l22435J88778M77952
$$ 5129074 5215398 5032942 4990333 5031788 5452078 5256976 5633335 5310900 5499678 5977630
14431E977630J48265j36889m7032J03487K24443j18747K84235N0207m8068R2056
$$ 5977630 6125895 5989006 5941974 6045461 6269904 6151157 6435392 6485599 6437531 6529587
14421F529587R0219J48001J25433J97882j42955J08508J55665k70848M22977J36266
$$ 6529587 6619806 6767807 6893240 7091122 6948167 7056675 7212340 6941492 7364469 7500735
14411G500735R0862j37348M71119K37292o0952j35856L03803L63703j1861k00716
$$ 7500735 7591597 7454249 7925368 8162660 8101708 7965852 8269655 8633358 8621497 8420781
14401H420781L68310L04129J41687q8396L52921J39265o6192J16674N20630j13482
$$ 8420781 8789091 9093220 9234907 9146511 9499432 9638697 9572505 9689179 10209809 10096327
14391A0096327L16788K6098M41919L35638q7953K1412M36872R5907J46988L92729
$$ 10096327 10413115 10439213 10881132 11216770 11128817 11150229 11587101 11683008 11829996 12222725
14381A2222725k7629O27382L3985M05792k83492O84995K10013J59934J96189M84055
$$ 12222725 12195096 12822478 12856463 13262255 12978763 13663758 13873771 14033705 14229894 14713949
14371A4713949M22391L0010M20307J88043K56018K74493M45661L92560L82127
$$ 14713949 15136340 15166350 15586657 15774700 16030718 16305211 16750872 17143432 17525559
14362A7525559L86030O12195K59360L54083J22052M31960M87385Q63446J38529
$$ 17525559 17911589 18523784 18783144 19137227 19259279 19691239 20178624 21042070 21180599
14353B1180599N23524P81185N26198K74633Q53274M08611M41277L46802J250242
$$ 21180599 21704123 22485308 23011506 23286139 24139413 24548024 24989301 25336103 26586345
14344B6586345N79263M55750N36558J136577L80204Q56561R54372R24915J259914
$$ 26586345 27165608 27621358 28157916 29294493 29674697 30531258 31485630 32410545 33670459
14335C3670459L60736J143787J099611J029609J006495J418260J074800J132222
$$ 33670459 34031195 35174982 36274593 37304202 38310697 39728957 40803757 41935979
14327D1935979J433529J329909J687443J448211J349428J965367J907829J440372
$$ 41935979 43369508 44699417 46386860 47835071 49184499 51149866 53057695 54498067
14319E4498067K451086J722117K134179K348955K347903K401118K732938L006372
$$ 54498067 56949153 58671270 60805449 63154404 65502307 67903425 70636363 73642735
14311G3642735K903187L045798L284168M109804L526735L801696M341150M259408
$$ 73642735 76545922 79591720 82875888 86985692 90512427 94314123 98655273 102914681
14303A02914681N110178M955849N634286N887363O244291O275943O644581P958445
$$ 102914681 108024859 112980708 118614994 124502357 130746648 137022591 143667172 151625617
14295A51625617P683832Q659327Q904810R702417J0356673J0755028J1657701
$$ 151625617 159309449 167968776 176873586 186576003 196932676 207687704 219345405
14288B19345405J2300885J2560358J3919041J4256239J4724113J5073837J6024343
$$ 219345405 231646290 244206648 258125689 272381928 287106041 302179878 318204221
14281C18204221J6091183J6244498J6146988J6189875J5219773J4535346J3549643
$$ 318204221 334295404 350539902 366686890 382876765 398096538 412631884 426181527
14274D26181527J1621729R426973O206348N01694j411171j365556m466842l523232
$$ 426181527 437803256 447230229 453436577 453938271 452527100 451161544 446694702 443171470
14266D43171470m357685q313170j0303177j3157263j4922299j5855861j5982434
$$ 443171470 438813785 430500615 420197438 407040175 392117876 376262015 360279581
14259C60279581j6110938j6600538j6087847j5339497j5327136j4035166j3101494
$$ 360279581 344168643 327568105 311480258 296140761 280813625 266778459 253676965
14252B53676965j3379074j2446351j1899488j0879725j0749246r925199r362815
$$ 253676965 240297891 227851540 215952052 205072327 194323081 184397882 175035067
14245A75035067q600165q169294p449107p642056o726389o744838n858651m990106
$$ 175035067 166434902 158265608 150816501 143174445 136448056 129703218 123844567 118854461
14237A18854461n407060n081009m792201m370232m235663l792192l757997l514379
$$ 118854461 113447401 108366392 103574191 99203959 94968296 91176104 87418107 83903728
14229H3903728l392313l272242k699874l343557k408952k330892k644534k255525
$$ 83903728 80511415 77239173 74539299 71195742 68786790 66455898 63811364 61555839
14221F1555839k110086j961839j983924k182229j583525j759253j035271j776348
$$ 61555839 59445753 57483914 55499990 53317761 51734236 49974983 48939712 47163364
14213D7163364j567034j078778j784052j241845j276542j148399j79128j486921
$$ 47163364 45596330 44517552 42733500 41491655 40215113 39066714 38887586 37400665
14205C7400665j310482q55447j268245j258490l45664o85220r99865j206536l53514
$$ 37400665 36090183 35234736 33966491 32708001 32362337 31677117 30677252 29470716 29117202
14196B9117202r26694q81762n61574n64762n71501o51721r12787o56488m26419
$$ 29117202 28190508 27308746 26747172 26182410 25610909 24959188 24046401 23389913 22963494
14187B2963494m75967l19869o48620o13384o28056j657o16404j20747l65500o62616
$$ 22963494 22487527 22167658 21519038 20905654 20277598 20275941 19659537 19538790 19173290 18510674
14177A8510674n27555k49187m39993l05451m25919k1264r21332O2940o33928J82481
$$ 18510674 17983119 17733932 17293939 16988488 16562569 16541305 15619973 15682913 15048985 15231466
14167A5231466r0226p87840p7006k57706j24464m65571l54487k43768o8879j92008
$$ 15231466 15141240 14353400 14276394 14018688 13894224 13428653 13074166 12830398 12761519 12569511
14157A2569511m78769q5206k26313O7276n41341K12568m07483n65974L41859k51989
$$ 12569511 12090742 12005536 11779223 11846499 11305158 11517726 11110243 10544269 10886128 10634139
14147A0634139p4933m60903o5056k242l95503j38393J57647n60375J25825o99128
$$ 10634139 10559206 10098303 10033247 10031005 9635502 9497109 9654756 9094381 9220206 8521078
14137H521078N73072j24321p0886m42463k01117J34512m77248L00119p435m34812
$$ 8521078 9094150 8969829 8898943 8456480 8255363 8389875 7912627 8212746 8205311 7770499
14127G770499k03564J38234j25925r4526k6138K7708l44916j45125l50870M49103
$$ 7770499 7566935 7705169 7579244 7484718 7458580 7486288 7141372 6996247 6645377 7094480
14117G094480j57942m56335J24700j93763J26678j34808j59011L49406n30204
$$ 7094480 6936538 6480203 6604903 6411140 6537818 6403010 6243999 6593405 6063201
14108F063201p5111p461K4892p2428p8452j1894k95828J77866j34833k69562L62880
$$ 6063201 5988090 5980629 6005521 5933093 5854641 5842747 5546919 5724785 5589952 5320390 5683270
14097E683270l96771O2218p5582j19607k79786Q2888l4869l7274K35801m12452
$$ 5683270 5286499 5348717 5273135 5153528 4873742 4956630 4921761 4884487 5120288 4707836
14087D707836L34770l89141K33369n05353M91536j21945m31062J34566J4900j25487
$$ 4707836 5042606 4653465 4886834 4381481 4873017 4751072 4320010 4454576 4469476 4343989
14077D343989J01594j60559j34454k23616J72130J76841k13046J9522j26586m1134
$$ 4343989 4445583 4285024 4150570 3926954 4099084 4275925 4062879 4082401 3955815 3914681
14067C914681j18985j52238J96268L68639o80346M973P9848J8338J36010J75175
$$ 3914681 3795696 3643458 3839726 4208365 3528019 3532992 3612840 3631178 3767188 3942363
14057C942363l71606k8370J6163j75238J69839j10429j96459k42396K89784J42866
$$ 3942363 3570757 3542387 3558550 3383312 3553151 3442722 3246263 3003867 3293651 3436517
14047C436517l84577J26053l48934L8207K78362o0201n6175j81437r611l2323
$$ 3436517 3051940 3177993 2829059 2867266 3145628 3085427 3029252 2847815 2838204 2805881
14037B805881l3689l192J12583L4190n10818L14207K68296O1803j93601l32872
$$ 2805881 2772192 2769000 2881583 2915773 2404955 2719162 2987458 3049261 2855660 2522788
14027B522788J57946l04787L20966k57297j71040L38792O7415j88819p8436J17587
$$ 2522788 2680734 2375947 2696913 2439616 2268576 2607368 2674783 2485964 2407528 2525115
14017B525115k64354p0856j47199M46677l15407j65950L30999O0851m58801M1789
$$ 2525115 2260761 2189905 2042706 2489383 2173976 2008026 2339025 2399876 1941075 1982864
14007A982864j35831l7289K26487j74540L13542r3119j59647K39563l29956j72236
$$ 1982864 1847033 1809744 2036231 1861691 2175233 2082114 1922467 2162030 1832074 1659838
13997A659838P8902K52513j24076P2100j0028K81862K51393J75766O78924J856419
$$ 1659838 1738740 1991253 1867177 1939277 1929249 2211111 2462504 2638270 3317194 5173613
13987E173613P415015J7484984J0098968j6888917j0127937n374685k246384j473449
$$ 5173613 12588628 30073612 40172580 23283663 13155726 7781041 5534657 4061208
13979D061208l00505n99929P9030o75013M28536k76365j70757l44971l9309K29463
$$ 4061208 3760703 3160774 3239804 2564791 2993327 2716962 2546205 2201234 2161925 2391388
13969B391388q0577l84115K72514k00056N299j53917L00994j87080k3278r5005
$$ 2391388 2310811 1926696 2199210 1999154 2004453 1850536 2151530 1964450 1941172 1846167
13959A846167P1271j15427l4228l4128Q3145J85364K05873m79837k91384N45466
$$ 1846167 1917438 1802011 1767783 1733655 1816800 2002164 2208037 1728200 1436816 1982282
13949A982282k65639o0915M05413l70671p5448R4768k90674J87712K68647k89847
$$ 1982282 1716643 1655728 2061141 1690470 1615022 1709790 1419116 1606828 1875475 1585628
13939A585628J60664Q8655k85500L2603k32350M05245k01465n2376k3538p6051
$$ 1585628 1746292 1834947 1549447 1582050 1349700 1754945 1553480 1501104 1477566 1401515
13929A401515r6709L0347K14503M2968o9476Q2058k21520k82455L51505j10808
$$ 1401515 1304806 1335153 1549656 1592624 1523148 1605206 1383686 1101231 1452736 1341928
13919A341928J10089K22251j66912k89144L85905N6389l12451k0603k98906L55798
$$ 1341928 1452017 1674268 1507356 1218212 1604117 1660506 1348055 1327452 1028546 1384344
13909A384344m67835K99752J0677o1464K10369j43150K39475k64175J15800J81238
$$ 1384344 916509 1216261 1226938 1165474 1375843 1232693 1472168 1207993 1323793 1505031
13899A505031l20466r4167j17582K47241J26284p6484j51107j3656l9389n5056
$$ 1505031 1184565 1090398 972816 1220057 1346341 1269857 1118750 1105094 1065705 1010649
13889A010649K11756J380N0179l37626M41746l48062J96278J02503m22719J81632
$$ 1010649 1222405 1223785 1273964 936338 1378084 1030022 1226300 1328803 906084 1087716
13879A087716K2073o2718j03472J22283k8357k53363J98164K60403m86003M32195
$$ 1087716 1109789 1047071 943599 1065882 1037525 784162 982326 1242729 756726 1188921
13869A188921k70634L1572M5483k34987O60881m93898L717J73132k01903K1405
$$ 1188921 918287 949859 995342 760355 1421236 927338 931055 1104187 902284 923689
13859I23689k23805K46891k0431l37712L88762k16938J04393k09176J73595K03015
$$ 923689 699884 946775 926344 588632 977394 760456 864849 655673 829268 1032283
13849A032283K7814j52656N2422j03825J55098j89116l4415j65768Q4984K398
$$ 1032283 1060097 907441 959863 856038 1011136 822020 787605 621837 706821 709219
13839G09219Q5660j72494K77787j86121m2224R630J72306J17327j86735K52024
$$ 709219 794879 622385 900172 714051 671827 681457 853763 971090 784355 1036379
13829A036379k49167K05068k93700j22363L34644k51416p814K90304j49610K26898
$$ 1036379 787212 992280 698580 576217 910861 659445 651631 941935 792325 1019223
13819A019223l28264q1238J59738k0309J30165j96384j00950J26998j7117N822
$$ 1019223 690959 609721 769459 749150 879315 682931 581981 708979 691862 697684
13809F97684k91803O49055j64779o1802j4307M1282j26026k09574j93058R4714
$$ 697684 405881 1054936 890157 828355 814048 855330 729304 519730 326672 421386
13799D21386L93618k34330J18447J95804J6188r1919j08454r1631o0991L7332
$$ 421386 815004 580674 699121 894925 911113 819194 710740 619109 558118 595450
13789E95450p9180L97216j93159M2766j81103B80699M73593m6485j22932J28718
$$ 595450 516270 913486 720327 763093 581990 280699 754292 707807 584875 713593
13779G13593l52153M68660l92592M64875k25229j98606J89769B82260M59399J02747
$$ 713593 361440 830100 437508 902383 677154 478548 668317 282260 741659 844406
13769H44406l58052K8738K79006J25703k01775B53910N0161J12792K6697K5170
$$ 844406 486354 515092 794098 919801 718026 253910 304071 416863 443560 468730
13759D68730J32587p9037K38108C01840J85225J64746R1961k70664j71221K86619
$$ 468730 601317 522280 760388 301840 487065 651811 743772 473108 301887 588506
13749E88506k50672K88999m6822R6698N8161j78071q8677l0432R708J65863p7743
$$ 588506 337834 626833 580011 676709 734870 556799 468122 437690 447398 613261 535518
13738E35518J31609C28415L44842j53636J64862p9221J01323q3836k43876M64849
$$ 535518 667127 328415 673257 519621 684483 605262 706585 622749 378873 843722
13728H43722C76813J55198K4331M7010k8053k80181N46595k48459k7717L0642
$$ 843722 376813 532011 556342 603352 575299 295118 841713 593254 565537 596179
13718E96179K66981l17269I8264L38698L29705C37282N623M80171l30440L23370
$$ 596179 863160 545891 98264 436962 766667 337282 342905 823076 492636 816006
13708H16006j69313j46488J56535B92560J78553P6249L15731j94886o2602j63600
$$ 816006 646693 500205 656740 292560 471113 547362 863093 668207 605605 442005
13698D42005k00668j522K9982J45060O0667L5285N9013n7988k13389K50401B15561
$$ 442005 241337 239815 269797 414857 475524 510809 569822 511834 298445 548846 215561
13686C29974J59222k43878J02909I1791M41511J40410k50276L6442J02627B06077
$$ 329974 489196 245318 348227 91791 533302 673712 423436 459878 562505 206077
13675D49737B05487M14877A51186N71107C56316j41239J43404N7901P167B08495
$$ 449737 205487 620364 151186 722293 356316 215077 358481 416382 423549 208495
13664C42765j30585K15089q2252K22138k12228J0904J31640O73Q2404r864J12921
$$ 342765 212180 427269 345017 567155 354927 365831 497471 498144 580548 570684 683605
13653F83605M918C43258J01703j91323J24063K2120j28590L5272J58574j86581
$$ 683605 688523 343258 444961 253638 377701 399821 271231 306503 465077 278496
13643B78496m8416L56358o3735l2589Q1760o3593N6021E8775K15053q3500R9055
$$ 278496 230080 586438 522703 490114 571874 508281 564302 58775 273828 190328 289383
13632B89383J1973L8539E9832L21543A81007K06942B586P24201B46455L62094
$$ 289383 301356 339895 59832 381375 181007 387949 2586 726787 246455 608549
13622F08549h8999F10841k85000j54990A6461N38457l1851B35891L01185k14894
$$ 608549 -88999 610841 325841 170851 16461 554918 523067 235891 537076 322182
13612C22182J86365A29678L76236B9553K21358L01157j37091q0065K8617q6514
$$ 322182 508547 129678 505914 29553 250911 552068 414977 334912 363529 277015
13602B77015M162J44717j56706j32417J55555Q697p7499j05098J80784K48082
$$ 277015 281177 425894 269188 136771 292326 301023 223524 118426 299210 547292
13592E47292j21213A48547L6339M7361Q0444J2097j1366J43056B21371K06052
$$ 547292 426079 148547 184886 232247 312691 324788 313422 456478 221371 427423
13582D27423n8741a92397A93602P6573L4992M76170B99730R0252K5131q698L02127
$$ 427423 368682 -192397 193602 270175 305167 781337 299730 389982 415113 406415 708542
13571G08542a08484B33636q291K36235r4372p5164J059l6969l8099K44658B20173
$$ 708542 -108484 233636 225345 461580 367208 292044 293103 256134 218035 462693 220173
13559A97524J67408m7736J18672j94248K47672J5092j78861n2460K94483o9939
$$ 197524 364932 317196 435868 241620 489292 504384 325523 273063 567546 497607
13549D97607j71399A34271N5679L53330j23233N6463j25276N2443j63092o5105
$$ 497607 326208 134271 189950 543280 420047 476510 351234 403677 240585 175480
13539A75480C6669K42831H0992l3296L82166j03915j62110J2316K51741A28906
$$ 175480 36669 279500 80992 47696 429862 325947 163837 176153 427894 128906
13528A29882L87390r1977j72070K18744q7179A44923L7250K90493n5863J05818
$$ 129882 517272 425295 253225 471969 384790 144923 182173 472666 416803 522621
13518E22621j95667r5960j14793J92720q2057J15415j57454n4882R5434m0786
$$ 522621 326954 230994 116201 308921 226864 342279 184825 129943 225377 184591
13508A84591f1781A93578B8391N080N4967L64376B24933L74959k07717I8798J47528
$$ 184591 -61781 193578 28391 33471 88438 452814 224933 599892 392175 98798 246326
13497B46326l2662p3872M61244f7482j5655a4923A6973M58510A7145M0654Q2824
$$ 246326 213664 139792 601036 -67482 -83137 -14923 16973 475483 17145 57799 140623
13486A40623K51954J0569j93545c5583A28529K10848q3832K44365d1263B09831
$$ 140623 392577 403146 209601 -35583 128529 339377 255545 499910 -41263 209831
13475A04156K11415H0771J02395q6920g6296B89386J10577j35199I9860i0931
$$ 104156 315571 80771 183166 96246 -76296 289386 399963 264764 99860 -90931
13464A20184m1779J65489r6267E7488J57996r4763J52654B2103P4094J90546d1251
$$ 120184 78405 243894 147627 57488 215484 120721 273375 22103 96197 286743 -41251
13452F8540A6985J68696G6029h2682F2454J65601p1006J19365j4531o6808e1191
$$ 68540 16985 185681 76029 -82682 62454 228055 157049 276414 261883 195075 -51191
13440B73680j05145Q9518D4656J56040R6483F2528L12127E0724j2255K41999n8125
$$ 273680 168535 258053 44656 200696 297179 62528 374655 50724 38469 280468 222343
13429B22343G5413L3158M79497g014o759F3370j0668e4501m591H9618K69976Q065
$$ 222343 75413 108571 588068 -7014 -13773 63370 52702 -54501 -59092 89618 359594 367659
13417C67659F8173J03028M0727Q9168n8674A07483b13288B1600K9274L06388g0529
$$ 367659 68173 171201 211928 301096 242422 107483 -213288 21600 50874 357262 -70529
13405A172Q6322a04285C17710Q7241A46010b40572A47219k0939C0607h1939C4991
$$ 1172 87494 -104285 317710 404951 146010 -240572 147219 126280 30607 -81939 34991
13393A19896K39899j41338m947m5953K58376H0644L40654j27524j13488e8523
$$ 119896 359795 218457 213510 167557 425933 80644 421298 293774 180286 -58523
13382A27024O4037g038F29362C7020j2079B978K00430p749L32175k46531b9236
$$ 127024 191061 -7038 629362 37020 24941 2978 203408 195659 527834 281303 -29236
13370A50307m7988K79012A52522N4666p1174J19916J45993A44481M61763k45329
$$ 150307 102319 381331 152522 207188 136014 255930 401923 144481 606244 360915
13360C60915j24707b3545E21494A23896K38707A02263J58146A7308N0007K8521
$$ 360915 236208 -23545 521494 123896 362603 102263 260409 17308 67315 95836
13350I5836Q176K11362r1043K39270p179j83902Q3208l4503J6918C4015L88362
$$ 95836 104012 315374 224331 463601 456422 272520 355728 321225 338143 34015 422377
13339D22377c1366A10033N1179J12635c4412F8267M01738a58891C41915A49029
$$ 422377 -31366 110033 161212 273847 -34412 68267 470005 -158891 341915 149029
13328C23086q0663g3242D06038R351a75285G4769J0808M1610R2415J67973A38339
$$ 323086 242423 -73242 406038 415389 -175285 74769 85577 127187 219602 387575 138339
13316C18998j42534J7228J70893A30807L1777a4666C06115q9342r0943N6348a59801
$$ 318998 176464 193692 364585 130807 162584 -14666 306115 216773 125830 182178 -159801
13304A70449q0778J62374o8816E7378L9521l5455J66108Q0372a66348H6442R0410
$$ 170449 89671 252045 183229 57378 96899 61444 227552 307924 -166348 86442 176852
13293A76852a6833B5391L63426B4254J0388J63971F7867J29686A0566h0834D5012
$$ 176852 -16833 25391 388817 24254 34642 198613 67867 197553 10566 -80834 45012
13281F8678d8997A56880N6880f485E22369k46630l4727b07972A75355c8076A13841
$$ 68678 -48997 156880 213760 -6485 522369 275739 241012 -207972 175355 -38076 113841
13269B62719K0963j21494a03500C66201q650j74322i8649L7579C28107j49657
$$ 262719 283682 162188 -103500 366201 357551 183229 -98649 -61070 328107 178450
13259A78450H5645J9402a5471C18828e6211C30648A31547a81447A45825E313a00870
$$ 178450 85645 105047 -15471 318828 -56211 330648 131547 -181447 145825 5313 -100870
13247G4281R0030E8305b0768A3589K4276i2547c9392A97565H4856c8936B19483
$$ 74281 164311 58305 -20768 13589 37865 -92547 -39392 197565 84856 -38936 219483
13235B96784b2688B93530A18257f011j02803j72935B47791A03120N6147a35317
$$ 296784 -22688 293530 118257 -6011 -108814 -281749 247791 103120 159267 -135317
13224A17093n7373h925C421M15938p7455A6114J67518f5372a2548A41810J12252
$$ 117093 59720 -8925 3421 419359 341904 16114 183632 -65372 -12548 141810 254062
13213B54062J26287a55190B19815p9050l3506a43437H2026O9597Q0118E631M05694
$$ 254062 380349 -155190 219815 140765 107259 -143437 82026 151623 231741 5631 411325
13202D11325j64269b1036E1005M3475J80136A03253M1446P8290j06266R0243F196
$$ 411325 247056 -21036 51005 94480 274616 103253 144699 222989 116723 206966 6196
13190A3423K7529J46404A2171f123A10540l2567J61296A2571a20562F1771J51344
$$ 13423 40952 187356 12171 -6123 110540 77973 239269 12571 -120562 61771 213115
13179B13115q8530E5157a36246B7596a9498k12911D04244C2040A1412b8989E5326
$$ 213115 124585 55157 -136246 27596 -19498 -232409 404244 32040 11412 -28989 55326
13167B88777G9941c01532g9936B93562b6828h105q5378B32577d8418B9734J7433
$$ 288777 79941 -301532 -79936 293562 -26828 -8105 -93483 232577 -48418 29734 47167
13156D7167M5199a504B45092c83199J83673c8689j53353b6136B7907L54695n4268
$$ 47167 92366 -1504 245092 -383199 -199526 -38689 -192042 -26136 27907 382602 328334
13145C28334b10876D09680A03786R2229K7909b0384C41128H6089b04292A89127
$$ 328334 -210876 409680 103786 196015 223924 -20384 341128 86089 -204292 189127
13134G5020B6560K49328h0288C73624j05255a2271k45745A19949d442A21553b52789
$$ 75020 26560 275888 -80288 373624 268369 -12271 -258016 119949 -4442 121553 -252789
13122F0838B001L687R2313J04177p2657J18418d391A01379K8398a79238P6729
$$ 60838 2001 5688 98001 202178 129521 247939 -4391 101379 129777 -179238 -102509
13111a02509A76273B1096P0041L2051A9200a23410I8653r224a5974A31693D3448
$$ -102509 176273 21096 91137 123188 19200 -123410 98653 89429 -15974 131693 43448
13099a9785o7547k9528A81886B6652M41381p3004j68594J06310a3721n5783A23647
$$ -19785 -87332 -116860 181886 26652 468033 395029 226435 332745 -13721 -69504 123647
13087A50528K8677g0969D0507a45610C2638M04599a46007C40801E5235a69163
$$ 150528 179205 -70969 40507 -145610 32638 437237 -146007 340801 55235 -169163
13076c34533G3537J12214j2950F6175f0828B27864C7159b01547F2996a27729A85023
$$ -334533 73537 185751 172801 66175 -60828 227864 37159 -201547 62996 -127729 185023
13064A59632B8983c7450C09170B5434L06064b98042B16145J07917a23324A6648
$$ 159632 28983 -37450 309170 25434 331498 -298042 216145 324062 -123324 16648
13053B00105D6631g8491E9575O7750g5698B67164b66588A68068o1729K27837A02837
$$ 200105 46631 -78491 59575 127325 -75698 267164 -266588 168068 106339 334176 102837
13041b3349a763B83492i739n5186E0613o975P5378a17932c9081j711A04471J58227
$$ -23349 -1763 283492 -9739 -64925 50613 43638 119016 -117932 -39081 -40792 104471 262698
13029B62698q6537O3372a27480A75857E7579L23376j49900k7161I6487J58177
$$ 262698 176161 239533 -127480 175857 57579 380955 231055 203894 96487 254664
13019B54664K4936a65261a9272l8910B02667n9432d8931r8347D65450A93557J63134
$$ 254664 279600 -165261 -19272 -58182 202667 143235 -48931 -147278 465450 193557 356691
13008C56691a76353n8125B91141H8276A7520J30753p0596L54629a2878C0960g8403
$$ 356691 -176353 -234478 291141 88276 17520 148273 77677 432306 -12878 30960 -78403
12996b25777A51299C6797L42700n1341b95474C1297f3280C32795n3899f1881E2672
$$ -225777 151299 36797 379497 328156 -295474 31297 -63280 332795 278896 -61881 52672
12984c09654N2694C14318A14456B7115i555G8485b6949j36707B50234k7567b309
$$ -309654 -256960 314318 114456 27115 -9555 78485 -26949 -163656 250234 222667 -2309
12972B01723a76515H2582N7999c14167B26607A828P0036i7209E661a7650D3415
$$ 201723 -176515 82582 140581 -314167 226607 1828 71864 -97209 5661 -17650 43415
12960A4856b60947c2504B35347c1876L432l6563Q357L353D2084n077K43160d8176
$$ 14856 -260947 -32504 235347 -31876 -28444 -65007 -56650 -53297 42084 37007 280167 -48176
12947A10892a19461A39246J31900N5519A58018n1190L6470L8440O868a34846A93980
$$ 110892 -119461 139246 271146 326665 158018 106828 143298 181738 188606 -134846 193980
12935H5917a88345A12293m8405B5394a17753B44523j15238a13521J5587j50117
$$ 85917 -188345 112293 63888 25394 -117753 244523 129285 -113521 -97934 -248051
12925b48051a3612l3168A11899J1903C9109h9347A33374J7666J13288j17509B6132
$$ -248051 -13612 -46780 111899 123802 39109 -89347 133374 151040 264328 146819 26132
12913B61863A9955i1246a0445B01442H5884h2734G3591a24001B9104b43164O6439
$$ 261863 19955 -91246 -10445 201442 85884 -82734 73591 -124001 29104 -243164 -176725
12902a76725O5797E740J26268b80044K3607B56088M412a32381A70071p2318a44132
$$ -176725 -110928 5740 132008 -280044 -256437 256088 260500 -132381 170071 97753 -144132
12890G864b1859A27641L98730j06089a31177E6571k6991a28594a7895I2402O9485
$$ 7864 -21859 127641 526371 420282 -131177 56571 29580 -128594 -17895 92402 161887
12879A61887b56781D23450A60594B0895K25931j3232I5351a3997C6700M8339J70716
$$ 161887 -256781 423450 160594 20895 246826 233594 95351 -13997 36700 85039 255755
12868B55755d1081B54162G0314d6729o5653P557j14887A44972C5810A658a77667
$$ 255755 -41081 254162 70314 -46729 -112382 -104825 -219712 144972 35810 1658 -177667
12856A81419K87414p1256G8450j0982a32292C74813D5717K72994a40552d0284
$$ 181419 468833 397577 78450 67468 -132292 374813 45717 318711 -140552 -40284
12845F3731K2673P3348m5021b55688B30203a99503A39435k1971Q7857n1771f459
$$ 63731 86404 159752 114731 -255688 230203 -199503 139435 117464 205321 153550 -6459
12833b9647o2320A92734b52247A19772f7619m4122A03450B058b6878l85740A68351
$$ -29647 -91967 192734 -252247 119772 -67619 -111741 103450 2058 -26878 -412618 168351
12821C5883J31088K88844a1746A5787L70586E09a80728d2640l7365m9941k96851
$$ 35883 166971 455815 -11746 15787 386373 509 -180728 -42640 -80005 -129946 -426797
12810d26797J25321B13388a16786B0153a22452H0551a0029j74125A21811b63601
$$ -426797 -301476 213388 -116786 20153 -122452 80551 -10029 -184154 121811 -263601
12799a34402A12505b0916k66121B13541a37355D1865a89966E7080b00061A21949
$$ -134402 112505 -20916 -287037 213541 -137355 41865 -189966 57080 -200061 121949
12788a3980P09A65971G5624j3812h5732A66431i4557A27347J99648b07418E683
$$ -13980 -13271 165971 75624 61812 -85732 166431 -94557 127347 326995 -207418 5683
12776b7983l08937A30614k8071g5646j80511C66845L7654A05383R790a41586h226
$$ -27983 -336920 130614 102543 -75646 -256157 366845 404499 105383 115173 -141586 -8226
12764B3858g667k9837O24C31090A52810b28218i8278P456A97081K5060b85907
$$ 23858 -7667 -37504 -36880 331090 152810 -228218 -98278 -90822 197081 222141 -285907
12752A66025A7955l502c5623H6437a35609C0792a68087L6045A53414d3561A79138
$$ 166025 17955 14453 -35623 86437 -135609 30792 -168087 -132042 153414 -43561 179138
12740B00451a43274C64078a78775A27207j3585J17673J59619h7607j6246B55851
$$ 200451 -143274 364078 -178775 127207 113622 231295 390914 -87607 -103853 255851
12729D08105a7365q3282C5905d6217A64540e2265k1146A60046e3220K5717H7047
$$ 408105 -17365 -100647 35905 -46217 164540 -52265 -73411 160046 -53220 -27503 87047
12717D5613c0841j53188f9692b9141n2081B40019r6866d1791A13100K67577A53369
$$ 45613 -30841 -184029 -69692 -29141 -81222 240019 143153 -41791 113100 380677 153369
12705A77988J79021A3096f7841B30247a78056h896A42610a69872B0504J98887
$$ 177988 357009 13096 -67841 230247 -178056 -8896 142610 -169872 20504 219391
12695B19391r6833b43453B19989J6723n9885O0453J77577h9123J9766n5832H469
$$ 219391 122558 -243453 219989 236712 176827 237280 414857 -89123 -69357 -125189 8469
12683B25890O6469B2625M34880A38307N4214b10657b912E408f3144j1806A74365
$$ 225890 292359 22625 457505 138307 192521 -210657 -2912 5408 -63144 -74950 174365
12671a75781A35787a62189C2596Q7379h8035B45407k612a24504A12403c02737
$$ -175781 135787 -162189 32596 119975 -88035 245407 242795 -124504 112403 -302737
12660B27838O4672o5756C6681K34861K0840k9898J42568j76954R939e593j85934
$$ 227838 292510 226754 36681 271542 292382 262484 405052 228098 238037 -5593 -191527
12649a91527A73497j1884a22032C06555a5512E2363a62785A11579c13203F8015
$$ -191527 173497 161613 -122032 306555 -15512 52363 -162785 111579 -313203 68015
12638b6804B79029c3988j92351i6325A29659R1536o1804p7500a17093H7477J56158
$$ -26804 279029 -33988 -226339 -96325 129659 221195 159391 81891 -117093 87477 243635
12627B43635m1016R2432A19659l6215P6400P1091b1585A47210K23885g5796J0976
$$ 243635 202619 295051 119659 83444 159844 230935 -21585 147210 371095 -75796 -64820
12616f4820A60709n4603d5308B3296J02494n1671O0203B6783K46800b72632A59100
$$ -64820 160709 106106 -45308 23296 125790 74119 134322 26783 273583 -272632 159100
12604A55273h1192A90594H7348M02801G5179b01602f7312J3861k91839a66192
$$ 155273 -81192 190594 87348 490149 75179 -201602 -67312 -53451 -345290 -166192
12593b16294f9947A59150K7677E4718a5806a26I5863a34261c2585E8875f060o8100
$$ -216294 -69947 159150 186827 54718 -15806 -126 95863 -134261 -32585 58875 -6060 -74160
12581g4160L3760G9414g0963q7717H9091R894A6078a36423C52921g2786c2470
$$ -74160 -40400 79414 -70963 -158680 89091 98985 16078 -136423 352921 -72786 -32470
12569A75379a4069A7967a07199C01146E3392J72045b8919C44930F7986N7487b23080
$$ 175379 -14069 17967 -107199 301146 53392 225437 -28919 344930 67986 125473 -223080
12557b266A2578J83114a91903A9696b49273G0233J44751k5925d06288J34107A13227
$$ -2266 12578 195692 -191903 19696 -249273 70233 214984 189059 -406288 -272181 113227
12545B79610K4154g3964n8281D52883h8016A42928R0232m5783L1092l6385n1968
$$ 279610 303764 -73964 -132245 452883 -88016 142928 233160 187377 218469 182084 130116
12534A30116a67350j94809A49945k0876m3983j2889L6286l2447M2082D9766J06908
$$ 130116 -167350 -362159 149945 129069 85086 72197 108483 76036 118118 49766 156674
12523A56674M6514m5322O3217n7310K7330a69161a5788B37043G0879J24824b35060
$$ 156674 203188 157866 221083 163773 191103 -169161 -15788 237043 70879 195703 -235060
12511A48452L11718C7472A748J81601d303B73597G205d6129A72072b33963G8483
$$ 148452 460170 37472 1748 183349 -4303 273597 7205 -46129 172072 -233963 78483
12499C88002b52335f1344l1545B36977q0037J8403C0410a70292D68812B27766
$$ 388002 -252335 -61344 -92889 236977 156940 175343 30410 -170292 468812 227766
12488b5443C10072E7962b12517A91447q3135a04580A85856n9129a95665a0483
$$ -25443 310072 57962 -212517 191447 108312 -104580 185856 126727 -195665 -10483
12477a56463O2567n863C12304j00314I4949a06185B12495Q9546D5974b26130D5040
$$ -156463 -93896 -99759 312304 211990 94949 -106185 212495 302041 45974 -226130 45040
12465a74954N9910n1165E4853c9033O826C14802A40377m474D5880a80853n5052
$$ -174954 -115044 -166209 54853 -39033 -32207 314802 140377 135903 45880 -180853 -235905
12454b35905F6277b1909k97134A74016a54828k3450O8508d0937A71269b8771I4664
$$ -235905 66277 -21909 -319043 174016 -154828 -178278 -109770 -40937 171269 -28771 94664
12442A10891i0867B47323H455g3954B80840p1107f9659k15455g8769C01122A19674
$$ 110891 -90867 247323 8455 -73954 280840 209733 -69659 -285114 -78769 301122 119674
12430a53775B8600a56150C01785Q7018A30266k3161i0684A10455m2380J05623
$$ -153775 28600 -156150 301785 388803 130266 107105 -90684 110455 68075 173698
12420A73698k2236g3382D6935O0370J2936a08244B26111b02153A7570d7902A89402
$$ 173698 151462 -73382 46935 107305 120241 -108244 226111 -202153 17570 -47902 189402
12408h68l62067a12966A19239f0654C1605a37165H62K7596K08681f2607K0364
$$ -868 -362935 -112966 119239 -60654 31605 -137165 862 28458 237139 -62607 -42243
12397d2243j03482F337K550b30159D6061e2608A24119f1168I2779Q7175b92338
$$ -42243 -145725 6337 8887 -230159 46061 -52608 124119 -61168 92779 179954 -292338
12385B86504G1092b34268C3271j1346a49504G9881M5135K03789i4358C5683N1229
$$ 286504 71092 -234268 33271 21925 -149504 79881 125016 328805 -94358 35683 86912
12374H6912b94057r740a5859H0739J45601m8280M0731a79080A05971f1634H0935
$$ 86912 -294057 -303797 -15859 80739 226340 178060 218791 -179080 105971 -61634 80935
12362A06606c9349B58934I2747K17355a33893e8233l670K5175B49715a63321A50582
$$ 106606 -39349 258934 92747 310102 -133893 -58233 -61903 -36728 249715 -163321 150582
12350A34601E7421c13855B05551o059f0222j70933B09007c65993a72536k1182
$$ 134601 57421 -313855 205551 199492 -60222 -231155 209007 -365993 -172536 -193718
12340a93718a2035m9751I9776L15947a92417A01764b8455k87139A29419E4996
$$ -193718 -12035 -61786 99776 415723 -192417 101764 -28455 -315594 129419 54996
12329E45345a5619j32999q0528A83287a76798C9756J63032H9253d3647A05616
$$ 545345 -15619 -148618 -229146 183287 -176798 39756 202788 89253 -43647 105616
12318B58053e7266b0154f18C46248A32067a31486E0206A838d4471g792j37714
$$ 258053 -57266 -20154 -618 346248 132067 -131486 50206 1838 -44471 -7792 -145506
12307a45506k22386J60818A28803b52348G4387a35705b6820B47044d72542a99830
$$ -145506 -367892 -207074 128803 -252348 74387 -135705 -26820 247044 -472542 -199830
12296A57838a0642p7595E2615J0388d5976j64953p2288f5423A10685J1568a8261
$$ 157838 -10642 -88237 52615 63003 -45976 -210929 -283217 -65423 110685 122253 -18261
12284c3338n3683k7410C09435c3953A87325a22285E9871a36188d3280B66395J17241
$$ -33338 -87021 -114431 309435 -33953 187325 -122285 59871 -136188 -43280 266395 383636
12273C83636a44166A2902J94941N5485a60973C1877g3765j677B5854J02516h7298
$$ 383636 -144166 12902 207843 263328 -160973 31877 -73765 -75442 25854 128370 -87298
12261e7483p9642B6245H891a89546A1084J9647J87198I3061J0504f947E74867
$$ -57483 -137125 26245 8891 -189546 11084 30731 217929 93061 103565 -6947 574867
12249a86487H0953P8998K5781N4882P2849B2864L96596B5537a78575j0971G7607
$$ -186487 80953 159951 185732 240614 313463 22864 419460 25537 -178575 -189546 77607
12237A77580b64140A60552f9764K816H5884j2504J55179j00533D0609b4608m454
$$ 177580 -264140 160552 -69764 -66948 85884 73380 228559 128026 40609 -24608 -29062
12226b9062C3754K87529j28995a9833G8305R1256Q5300k1263Q4828A08207Q536
$$ -29062 33754 321283 192288 -19833 78305 169561 254861 233598 318426 108207 116743
12215A16743B9399O1746C0660f0737C1188K01100I6318J88250a5552C36395j48428
$$ 116743 29399 91145 30660 -60737 31188 232288 96318 284568 -15552 336395 187967
12204A87967C5627L65448j76888k129F7758M19842A34395p92J38522k0790J38556
$$ 187967 35627 401075 224187 222058 67758 487600 134395 133603 272125 251335 389891
12193C89891j94423E0446K17945e7112F1550J67677F1495J04552j423R849j5285
$$ 389891 195468 50446 268391 -57112 61550 229227 61495 166047 164624 174473 159188
12182A59188f8309G3516K6278N0257D8027K54514g6059k41002A05488J00940J51991
$$ 159188 -68309 73516 99794 150051 48027 302541 -76059 -317061 105488 206428 358419
12171C58419p3733E6250K44781B8236L7909B0524h2396A83131b20800G9661b29407
$$ 358419 284686 56250 301031 28236 66145 20524 -82396 183131 -220800 79661 -229407
12159F4685a02480D790L74896B4915d2338C34368h052B27802a70303B36559F7061
$$ 64685 -102480 4790 379686 24915 -42338 334368 -8052 227802 -170303 236559 67061
12147A57078K19121a96865C16225F408K20048i1691A72185n3667a01517j65944
$$ 157078 376199 -196865 316225 6408 226456 -91691 172185 118518 -101517 -267461
12137b67461E6039d11569J97122J01277C46293b35814m5625F9160k7188d5027
$$ -267461 56039 -411569 -214447 -113170 346293 -235814 -281439 69160 41972 -45027
12126B2173J54761b68627B91429b55299B4347Q8247K5983b59570D15730B0048
$$ 22173 176934 -268627 291429 -255299 24347 112594 138577 -259570 415730 20048
12115b524B46539b43176F5963J21980P8076B5010R9004h5888A06354J64177b32257
$$ -2524 246539 -243176 65963 187943 266019 25010 124014 -85888 106354 270531 -232257
12103A56281a11260A66380D3612O7976C7530a83049A99514b501C13909a6364j97532
$$ 156281 -111260 166380 43612 111588 37530 -183049 199514 -2501 313909 -16364 -213896
12092b13896J01564m7132D6853G638L6525K61217E5025a71342A39503m7412Q7158
$$ -213896 -112332 -159464 46853 7638 44163 305380 55025 -171342 139503 92091 179249
12081A79249a62344B47672o1854c7166j8351j39396F3589b98445A70795e9754
$$ 179249 -162344 247672 185818 -37166 -55517 -194913 63589 -298445 170795 -59754
12070A9372J9762b9168n4081j37771P4251A19891j7768J13258b60481B59005F342
$$ 19372 39134 -29168 -83249 -221020 -146769 119891 102123 215381 -260481 259005 6342
12058b48771C32091a36072B63338R1829J016880O38450H38452C42820j56317a27691
$$ -248771 332091 -136072 263338 355167 1372047 2010497 838452 342820 186503 -127691
12047a49205A30051J23530j06154k7347c22162A51994K20146D3313b29271B41521
$$ -149205 130051 253581 147427 120080 -322162 151994 372140 43313 -229271 241521
12036b30012B72896a70958p3561A00443a62650H9191Q092C3171b1000o4466A57052
$$ -230012 272896 -170958 -244519 100443 -162650 89191 97283 33171 -21000 -85466 157052
12024A12849b62885a31396E8098o930c12318f059j33137A34590E9309j4759K25177
$$ 112849 -262885 -131396 58098 51168 -312318 -6059 -139196 134590 59309 44550 269727
12013B69727I2106a97684i1711a3560j09029H546b8887D1700j9349L1548a40019
$$ 269727 92106 -197684 -91711 -13560 -122589 8546 -28887 41700 22351 53899 -140019
12001B83400a44366l4766B68647q813C696a14565B4313f4363n7793A47548J41056
$$ 283400 -144366 -179132 268647 259834 3696 -114565 24313 -64363 -122156 147548 288604
11990B88604E1345a9199k7145j10835F5096R4685e2851A8837b90839A03689J6519
$$ 288604 51345 -19199 -46344 -157179 65096 159781 -52851 18837 -290839 103689 120208
11979A20208a83341k4912L0723j96030A052R7181I373c9428b927o8352c0458j1129
$$ 120208 -183341 -208253 -177530 -373560 1052 98233 9373 -39428 -2927 -71279 -30458 -41587
11967d1587D59465A41433E2380M761d78327g5048A43423b0994r3405m8504e4081
$$ -41587 459465 141433 52380 57141 -478327 -75048 143423 -20994 -114399 -162903 -54081
11955a9561B23217e6803E503b5133o126C1878A3549N0022Q9552D4236K78802a41543
$$ -19561 223217 -56803 5503 -25133 -31259 31878 13549 63571 153123 44236 323038 -141543
11942A39594l481E4740A1909J58249a42522B13693J5641a27195L8320c3996a287
$$ 139594 136113 54740 11909 170158 -142522 213693 229334 -127195 -88875 -33996 -1287
11930H4114L6669a13236G5196a45514j40937F9207g3539A65079a25229q0306B47466
$$ 84114 120783 -113236 75196 -145514 -286451 69207 -73539 165079 -125229 -205535 247466
11918b43046f0654r2112A74649c9912B41076a42170j0960A051f9653n932k10774
$$ -243046 -60654 -152766 174649 -39912 241076 -142170 -153130 1051 -69653 -75585 -286359
11907b86359M9710A6495c30015C7819d3800l2945A44385a63698q6685A6501e067
$$ -286359 -236649 16495 -330015 37819 -43800 -76745 144385 -163698 -250383 16501 -5067
11895G539K7406b17930B26109h0017A98107a36952A1235a55498a8425A83921a33292
$$ 7539 34945 -217930 226109 -80017 198107 -136952 11235 -155498 -18425 183921 -133292
11883a8144j23365B74069h1011B21389J31404A00338b7290k77406d8382B3064
$$ -18144 -141509 274069 -81011 221389 352793 100338 -27290 -304696 -48382 23064
11872A74213a24833H959J29997J24542a44412C41959a62384K0477A15246b11240
$$ 174213 -124833 8959 138956 263498 -144412 341959 -162384 -141907 115246 -211240
11861F6892N0716i3366D1649h754k97393A21003a13029l33602G2775c01548B1412
$$ 66892 117608 -93366 41649 -8754 -306147 121003 -113029 -446631 72775 -301548 21412
11849i3494J3759L6930C8169K42072O3052j58822a16697A4247a51301B58313j29006
$$ -93494 -79735 -42805 38169 280241 343293 184471 -116697 14247 -151301 258313 129307
11838A29307E2783J95858D9397e1983O689j6601A17893a00665C6908e4878j1276
$$ 129307 52783 248641 49397 -51983 -45294 -61895 117893 -100665 36908 -54878 -66154
11827f6154l8251B10071a59872A84821e5236A55832E0883E4a46182D25369b58815
$$ -66154 -104405 210071 -159872 184821 -55236 155832 50883 54 -146182 425369 -258815
11815b21192G3890J45101k1649H9162j3651L1386J26011a02003F455Q7830c05980
$$ -221192 73890 218991 197342 89162 75511 106897 232908 -102003 6455 94285 -305980
11803f271A06574a83897E1048K13466f1688j40309I7766f9986A73481p6176J85094
$$ -6271 106574 -183897 51048 264514 -61688 -201997 97766 -69986 173481 97305 282399
11792B82399d8411C77399F6489N7000K289a60094H7918a02997A56333D5511a28827
$$ 282399 -48411 377399 66489 123489 125778 -160094 87918 -102997 156333 45511 -128827
11780h3463j55761A7056L8592b09184C81886f8274I8434a02546j06350N0218o0067
$$ -83463 -239224 17056 55648 -209184 381886 -68274 98434 -102546 -208896 -158678 -218745
11769b18745A02109B5858a1688H4984b71204a7854o6176F3362a58724d6618A12641
$$ -218745 102109 25858 -11688 84984 -271204 -17854 -84030 63362 -158724 -46618 112641
11757C0296b19990A02325j4210j1615J75329r8548b3309j53896c6232H0363b36758
$$ 30296 -219990 102325 88115 76500 251829 153281 -23309 -177205 -36232 80363 -236758
11745A75623h8236j53826a18958J3032d7473C35017h3761L2833A27608M1085c7253
$$ 175623 -88236 -242062 -118958 -105926 -47473 335017 -83761 -50928 127608 168693 -37253
11733E5092a62639A43141c1210j9789j24843c361H7717b6968D4204b3695B1751
$$ 55092 -162639 143141 -31210 -50999 -175842 -3361 87717 -26968 44204 -23695 21751
11721b95440A69041G5277e174j44389j74462B82165j1125j22331h211A05742i7143
$$ -295440 169041 75277 -5174 -149563 -324025 282165 271040 148709 -8211 105742 -97143
11709e2658A92627l7151D7298B2430j0223J81757a99755B8103P4370O4025e6996
$$ -52658 192627 155476 47298 22430 12207 193964 -199755 28103 102473 166498 -56996
11697D25714A01855f3719h173p2779D4536a86275A05763O6408a21919o7141F8277
$$ 425714 101855 -63719 -8173 -80952 44536 -186275 105763 172171 -121919 -189060 68277
11685i6230G9241a31527R2j14500A8359J38395h7814d1623A6563a14365l9900
$$ -96230 79241 -131527 -131435 -245935 18359 156754 -87814 -41623 16563 -114365 -154265
11674a54265l58676C08474j20870n6529r486a24470H2574p519c5257k36872g1926
$$ -154265 -512941 308474 187604 131075 121589 -124470 82574 75055 -35257 -272129 -71926
11662B36856a75204d2027j34024A6213A94e9167r3139f8424G6178A6188K94927
$$ 236856 -175204 -42027 -176051 16213 194 -59167 -152306 -68424 76178 16188 311115
11651C11115A50088i8938A28374F878P9555R9910a2842r4735j17740Q3889d5850
$$ 311115 150088 -98938 128374 6878 86433 186343 -12842 -107577 -225317 -141428 -45850
11639c2262j39132m5032k2333B45382N9864f999A04954E2052h216j77692N0181
$$ -32262 -171394 -216426 -238759 245382 305246 -6999 104954 52052 -8216 -185908 -135727
11628a35727B1901f1750C3593N5782g3798G6004n019k6576O846P9740a9379p7688
$$ -135727 21901 -61750 33593 89375 -73798 76004 70985 44409 51255 130995 -19379 -97067
11616i7067N017B61556b67009D5794j5115K46807d0254j7491k7014B36938C8209
$$ -97067 -92050 261556 -267009 45794 30679 277486 -40254 -57745 -84759 236938 38209
11604A59160g4779r0276G9186n60a14841j4680A79837c7164C78849E1838K18445
$$ 159160 -74779 -165055 79186 78626 -114841 -129521 179837 -37164 378849 51838 270283
11593B70283h1425j43182B76597j0435h121D4856a06638C07468F0170K2524R7402
$$ 270283 -81425 -224607 276597 266162 -8121 44856 -106638 307468 60170 82694 180096
11582A80096C0890b2998A47577j4903l1910i4665D9259a3017j3266A60335R289
$$ 180096 30890 -22998 147577 132674 100764 -94665 49259 -13017 -26283 160335 169624
11571A69624Q309k4940l2812c4014A77984o8372a06676D47398a68273B29757M4405
$$ 169624 177933 152993 120181 -34014 177984 109612 -106676 447398 -168273 229757 274162
11560B74162I2919M2880g08B27682b59484F5848M7374e503E06519G3438g5742
$$ 274162 92919 135799 -708 227682 -259484 65848 113222 -5503 506519 73438 -75742
11548B27165a21825B25848K120c51032b5617A14194c6179j58623G646N1105J55972
$$ 227165 -121825 225848 227968 -351032 -25617 114194 -36179 -194802 7646 58751 214723
11537B14723C77K79316r4945L5251q664a73846k43674C03791j34617i1604A57914
$$ 214723 377 279693 184748 219999 211335 -173846 -417520 303791 169174 -91604 157914
11525H3895l6442b52853b5852G7463J68886q5015J38314h017B58293p9869q6702
$$ 83895 47453 -252853 -25852 77463 246349 161334 299648 -8017 258293 178424 91722
11514I1722N5452D8146a17129H637K47601B7320J57751l0069F4746M0288O2273
$$ 91722 147174 48146 -117129 8637 256238 27320 185071 155002 64746 105034 167307
11503A67307N2331a93110F212J95376O2139H0576a05327m8861e8921A45119J26389
$$ 167307 219638 -193110 6212 201588 263727 80576 -105327 -154188 -58921 145119 271508
11492B71508f5667C62427r0994j07354K5267L85n6741D514L58286b17249C16475
$$ 271508 -65667 362427 271433 164079 189346 189731 132990 4514 362800 -217249 316475
11480A3942J98786J65042C7381J87533C3813Q4888N9439C8774K60130r1097J45231
$$ 13942 212728 377770 37381 224914 33813 118701 178140 38774 298904 207807 353038
11469C53038r0789k0605M51181G0654M88778k25525N2282D1446J9807i7461D1775
$$ 353038 262249 241644 692825 70654 559432 333907 386189 41446 61253 -97461 41775
11457b77662B58206p5068o1576J47384M5242j29717K05344d4203l06942c716B12146
$$ -277662 258206 183138 121562 268946 314188 184471 389815 -44203 -351145 -3716 212146
11445B35172a16861H1208j4675J86991a30894a5177H6921D163K3893R5261h2687
$$ 235172 -116861 81208 66533 253524 -130894 -15177 86921 4163 28056 123317 -82687
11433h594p1768A68002a60672B76393b58300A38888e1056p0594L4343b8354A78036
$$ -8594 -80362 168002 -160672 276393 -258300 138888 -51056 -121650 -87307 -28354 178036
11421e7082k04997H3387j9950b6700n5454m037m7291k71324H505J9614O5741J42757
$$ -57082 -262079 83387 63437 -26700 -82154 -86191 -133482 -404806 8505 28119 93860 236617
11409B36617K8051c3246J4706C8755a1673C81539H3135l3261J40785a89263D7225
$$ 236617 264668 -33246 -18540 38755 -11673 381539 83135 49874 190659 -189263 47225
11397a01532A18542g2144r1022A70234e5991E312K13005A8326J36968n1001f9625
$$ -101532 118542 -72144 -163166 170234 -55991 5312 218317 18326 155294 104293 -69625
11385a50756H8769J50192k6382b47680A7118a73434A31092O3923B2572J09282
$$ -150756 88769 238961 212579 -247680 17118 -173434 131092 195015 22572 131854
11375A31854j5529J1052f96C00017r8262p5428M9212i613E0661d4939j57739r3653
$$ 131854 116325 127377 -696 300017 201755 126327 175539 -9613 50661 -44939 -202678 -296331
11363b96331A67568l8355J04838b24336F6947b82469j72357R1875J32933i7511
$$ -296331 167568 129213 234051 -224336 66947 -282469 -454826 -362951 -230018 -97511
11352c1337B40804H771K65323e4751a778n8922A98758a12577j3119E50680I8990
$$ -31337 240804 8771 274094 -54751 -1778 -60700 198758 -112577 -125696 550680 98990
11340F1339a69802k19853a91805R098F8639a05951I3130J17412a07950k19532
$$ 61339 -169802 -389655 -191805 -182707 68639 -105951 93130 210542 -107950 -327482
11330c27482a34269G5141b3614k58769a27233c5081j9369G9692J06562b05533
$$ -327482 -134269 75141 -23614 -282383 -127233 -35081 -54450 79692 186254 -205533
11319B75069K9176A42578f2631B7474d88111B3219c0554j3047j44933A10780e2852
$$ 275069 304245 142578 -62631 27474 -488111 23219 -30554 -43601 -188534 110780 -52852
11307A46273a07239A15177a07849A63077f3192I5311P8544c3926D10158a36148
$$ 146273 -107239 115177 -107849 163077 -63192 95311 173855 -33926 410158 -136148
11296e19880a70096H3010N3827F8193a50230B54759J44058A92204e7299C0673
$$ -519880 -170096 83010 136837 68193 -150230 254759 398817 192204 -57299 30673
11285b40107a17132A44291J7071b80223b0865j72863A65645g5048I2087O4092
$$ -240107 -117132 144291 161362 -280223 -20865 -193728 165645 -75048 92087 156179
11275A56179G6046f7374A56217A3380K73554d2502o1267A0110b46040J12769n3096
$$ 156179 76046 -67374 156217 13380 286934 -42502 -103769 10110 -246040 -133271 -186367
11264a86367A37062L8112G014K28478H2451J40784b95840a32578n1159N26a9341
$$ -186367 137062 175174 7014 235492 82451 223235 -295840 -132578 -183737 -183211 -19341
11252A27665b3133C3528a0130C72242a93936F1165H437K39034B0627K92e1932
$$ 127665 -23133 33528 -10130 372242 -193936 61165 8437 247471 20627 20919 -51932
11240b78883B6248M17788F0447j7592d1815K58l97757J46584J14658B35696a39353
$$ -278883 26248 444036 60447 42855 -41815 -41557 -439314 -292730 -178072 235696 -139353
11228B04075b45118c9944j51410L3724d7879j34478j84034a8898q8391l6101K651
$$ 204075 -245118 -39944 -191354 -157630 -47879 -182357 -366391 -18898 -107289 -143390 -140739
11217a40739a0229j74718A69713a59294b5317C2254a60249H0182d03577F591b5500
$$ -140739 -10229 -184947 169713 -159294 -25317 32254 -160249 80182 -403577 6591 -25500
11205b73720f0738B32697D9356a55834C7635a07352B41033m1461q8169l0116b86569
$$ -273720 -60738 232697 49356 -155834 37635 -107352 241033 199572 111403 81287 -286569
11193a11334c4026A6975L8934j1548c14872a26207B02426b23955l4694A17623
$$ -111334 -34026 16975 55909 44361 -314872 -126207 202426 -223955 -258649 117623
11182F1304b37748h5454k70545j00783K10756A93093a51214A00316f9754a6703
$$ 61304 -237748 -85454 -355999 -456782 -246026 193093 -151214 100316 -69754 -16703
11171I5195N1209a41734B7632h173j51924p4114P6778f9693E3535L9556a82693
$$ 95195 146404 -141734 27632 -8173 -160097 -234211 -157433 -69693 53535 93091 -182693
11159F9010a28239B60189b66391A99597C1305A1474i8198j50999A48312J83573
$$ 69010 -128239 260189 -266391 199597 31305 11474 -98198 -249197 148312 331885
11149C31885b6797b776l0889D6991c61772I6519Q7319o4641a58946k5118A97448
$$ 331885 -26797 -2776 -33665 46991 -361772 96519 183838 119197 -158946 -184064 197448
11137A05894b20329A81635J4420d8353j63636Q2314C4638K38654j12872f6364
$$ 105894 -220329 181635 196055 -48353 -211989 -129675 34638 273292 160420 -66364
11126a40986A18756e2417B74269E4744a526C4997R9318C0351J03434L04695c4725
$$ -140986 118756 -52417 274269 54744 -1526 34997 134315 30351 133785 438480 -34725
11114A13123L06495A0490L24172p8413j25771M9153M40513A49281e25E1227J92052
$$ 113123 419618 10490 334662 256249 130478 179631 620144 149281 -525 51227 243279
11103B43279J857Q4733J232L4957A4404L4052b2331j84260G2638R5384J46576
$$ 243279 245136 329869 331101 366058 14404 48456 -22331 -206591 72638 168022 314598
11092C14598o29o1160o8185e1144H1394J8330K20772L29245B31960N9647J982
$$ 314598 313969 252809 184624 -51144 81394 99724 320496 649741 231960 291607 293589
11081B93589R8309m3465A57388g9152C37382j10652J00582j45229K53685j96203
$$ 293589 391898 348433 157388 -79152 337382 226730 327312 182083 435768 239565
11071B39565L25855k78879M0147J5431n1788J50755j09945J50658Q1742L1060
$$ 239565 565420 286541 326688 342119 290331 441086 331141 481799 563541 594601
11061E94601j66533J5534O6706r147o4548K99451C10191K33299L41122O4071n3909
$$ 594601 428068 443602 510308 501161 436613 736064 310191 543490 884612 948683 894774
11050H94774k68445j8076R5411k28235k3326N90376k27113Q1697j73208j77920
$$ 894774 626329 608253 703664 475429 452103 1042479 815366 897063 723855 545935
11040E45935K77580J81315j48901J53268q3225j71664J16293k15537n1662k45140
$$ 545935 823515 1004830 855929 1009197 925972 754308 870601 655064 603402 358262
11030C58262J96908K31747k14037N8418L44555j84416l7873k07996J47944M4765
$$ 358262 555170 786917 572880 631298 975853 791437 753564 545568 693512 738277
11020G38277J69875m38964K30563C22602M3151L99366l0898j89154K03152k78796
$$ 738277 908152 469188 699751 322602 365753 765119 734221 545067 748219 469423
11010D69423j00450J43000J83387j34690P730R1568J53485j64156o9423M7883
$$ 469423 368973 511973 695360 560670 568400 659968 813453 649297 579874 627757
11000F27757O9786j83125J42672O2672J00420O5903m0356j46263J15832l04503
$$ 627757 697543 514418 657090 719762 820182 886085 845729 699466 815298 510795
10990E10795K09388J68861q0306K35572l03542K13709K5486K56839R0006l4800
$$ 510795 720183 889044 808738 1044310 740768 954477 979963 1236802 1326808 1292008
10980A292008J00884J87441J1551n765K71834M65012r1406Q17636j39079k74310
$$ 1292008 1392892 1580333 1591884 1586119 1857953 2322965 2231559 3049195 2910116 2635806
10970B635806P01482m00511l05225L4357m46576k56709o03376J49594J41328J31895
$$ 2635806 3337288 2936777 2631552 2665909 2219333 1962624 1359248 1508842 1650170 1782065
10960A782065l49416O32818m13590k16330n3653K77655j71608l14456Q3183k63252
$$ 1782065 1432649 2065467 1651877 1435547 1381894 1659549 1487941 1173485 1256668 993416
10950I93416J63372E49178O4136p5720A53576J10810J45728b1285A31535a48043
$$ 993416 1156788 549178 613314 537594 153576 264386 410114 -21285 131535 -148043
10939H8254K5764n4637f591k6941B21419G0497J41866G5482J53738A6071P2793
$$ 88254 114018 59381 -6591 -33532 221419 70497 212363 75482 229220 16071 88864
10928H8864K08936G002e6992D18696L0414h4658l365B27358J5242a42721b2290
$$ 88864 297800 7002 -56992 418696 449110 -84658 -88023 227358 242600 -142721 -22290
10916H8193l6950J30569A1446J7104N6016B5118J65810c05542B49191I3114i4398
$$ 88193 51243 181812 11446 28550 84566 25118 190928 -305542 249191 93114 -94398
10904c4391l2C096a9193C3554a45787c5271k16916H5270a46311A33102a31789
$$ -34391 -34423 3096 -19193 33554 -145787 -35271 -252187 85270 -146311 133102 -131789
10892e4034j87690J1995B96807j16273F032J5723i70G1334O0571k3684h8742B6019
$$ -54034 -241724 -229729 296807 180534 6032 21755 -970 71334 131905 108221 -88742 26019
10879C3441J45547g9640C8326b0693k33467A16610a89318N6808A72840g1744A72135
$$ 33441 178988 -79640 38326 -20693 -254160 116610 -189318 -132510 172840 -71744 172135
10867e0048A62786f0816p2405m12089e5301k5013B0513a57353F2999J61729C9323
$$ -50048 162786 -60816 -133221 -545310 -55301 -80314 20513 -157353 62999 224728 39323
10855B89887F8233e2106C11140n0054m72C5892e8635A43843o5071a21619B86994
$$ 289887 68233 -52106 311140 261086 260614 35892 -58635 143843 78772 -121619 286994
10843i4291A37948H061c85686J63489B7969J30547b05180E1172L10241A10573
$$ -94291 137948 8061 -385686 -222197 27969 158516 -205180 51172 361413 110573
10832B18609a66856M3668A67265b88273C38469b35388c6538B19174a32100A06945
$$ 218609 -166856 -123188 167265 -288273 338469 -235388 -36538 219174 -132100 106945
10821A4767a41985N3697M2517h150k1244j61367f344I9002I01d9904j39862O6740
$$ 14767 -141985 -88288 -45771 -8150 -29394 -190761 -6344 99002 901 -49904 -189766 -123026
10809a23026j02946e6021b0920q2848L6875k96216i3769F6274J10963E7796a87077
$$ -123026 -225972 -56021 -20920 -103768 -66893 -363109 -93769 66274 177237 57796 -187077
10797a6933A11285K04317A44831a44308K3236j10123A14178g0471a2816l29252
$$ -16933 111285 315602 144831 -144308 -121072 -231195 114178 -70471 -12816 -342068
10787c42068a09970l1128r1021Q4074j49947D82620G8897e6045p257l29983a12741
$$ -342068 -109970 -141098 -232119 -148045 -297992 482620 78897 -56045 -63302 -393285 -112741
10775d7619n4780A8495a31960A40295a9269B30887c07548L5586b016l3433q7518
$$ -47619 -102399 18495 -131960 140295 -19269 230887 -307548 -271962 -2016 -35449 -122967
10764a22967r7148M8420d0815k51108C01475e0785A30361a22900d2801C3222J837
$$ -122967 -220115 -171695 -40815 -291923 301475 -50785 130361 -122900 -42801 33222 35059
10753C5059a11220A68494c476j438k57374H5134h2328f039m1023G5558b12885
$$ 35059 -111220 168494 -3476 -4914 -262288 85134 -82328 -6039 -47062 75558 -212885
10741c18414A29449a89938k4104B4900i577m3873j2815B0506f7635C53013H5515
$$ -318414 129449 -189938 -214042 24900 -9577 -53450 -66265 20506 -67635 353013 85515
10729f376j31936H2549c91951f7530c1659D5898d249l12420G6157a46084k76783
$$ -6376 -138312 82549 -391951 -67530 -31659 45898 -4249 -316669 76157 -146084 -422867
10718d22867J68058P6781f7007q6122b5507q28A28391d5861k00827A01569A3640
$$ -422867 -254809 -178028 -67007 -153129 -25507 -26335 128391 -45861 -246688 101569 13640
10706e4451G1315I70P2446F328d83620E6351O524K32208j31235m3346d78496I2805
$$ -54451 71315 970 73416 6328 -483620 56351 62875 295083 163848 120502 -478496 92805
10693h5987I7320c3102B1010f5990k21210e7033k31234c1242o373D4882b05665
$$ -85987 97320 -33102 21010 -65990 -287200 -57033 -288267 -31242 -37615 44882 -205665
10681A56540b99334J28881E1439e8713B18188b68032J03805N3012m7475A79393
$$ 156540 -299334 -170453 51439 -58713 218188 -268032 -164227 -111215 -158690 179393
10670B28768a34705A23170c67440D8198d4868j13411A863O7033J95523c7981C07737
$$ 228768 -134705 123170 -367440 48198 -44868 -158279 1863 68896 264419 -37981 307737
10658d3073j09864p4250D5767a06980e1690o6482I5339a87717c0742p8870b6201
$$ -43073 -152937 -227187 45767 -106980 -51690 -118172 95339 -187717 -30742 -109612 -26201
10646b75524O4416B5039h8202c091n5565F6987B8390b08651B8183d9200E5570
$$ -275524 -211108 25039 -88202 -3091 -58656 66987 28390 -208651 28183 -49200 55570
10634b03407r5863B20394H2655J7133h3411l27509F4479a66429B12482b4773A0181
$$ -203407 -299270 220394 82655 99788 -83411 -410920 64479 -166429 212482 -24773 10181
10622A43870M3858b05085M1550N7811o3533L7990r4738P5992B40169a68017f369
$$ 143870 187728 -205085 -163535 -105724 -169257 -131267 -226005 -150013 240169 -168017 -6369
10610h8408J8906j60630F9205f7512j58809j29490C5101Q6781f3540j21896H1833
$$ -88408 -69502 -230132 69205 -67512 -226321 -355811 35101 121882 -63540 -185436 81833
10598a25040k46089D3287i278G0754N7637B478g3819o0294J943I5018h497l06039
$$ -125040 -371129 43287 -9278 70754 128391 2478 -73819 -134113 -132170 95018 -8497 -314536
10586c14536C33274b01428a7796G8629d09705B4133g9071A9678r191g3249J0310
$$ -314536 333274 -201428 -17796 78629 -409705 24133 -79071 19678 10487 -73249 -62939
10575f2939n70146a35090f2613H51J44412d0280j12307j45601c9950A9943a52916
$$ -62939 -633085 -135090 -62613 851 145263 -40280 -152587 -298188 -39950 19943 -152916
10563C63656M6088C4136J14221I852O4976h4602j26200K4798r1689F4682a2757
$$ 363656 409744 34136 148357 9852 74828 -84602 -210802 -186004 -277693 64682 -12757
10551A11783i7238B52232r2590a94553j36200B4789K7104K14472g0502C9849a61158
$$ 111783 -97238 252232 159642 -194553 -330753 24789 51893 266365 -70502 39849 -161158
10539G5036a13828k17850J49257j26089A80874m8213j6232L6677b01929A50420
$$ 75036 -113828 -331678 -182421 -308510 180874 132661 116429 153106 -201929 150420
10528b22148J05871C06574d6975j06075F4898a81395O8706b5439C5604J08131
$$ -222148 -116277 306574 -46975 -153050 64898 -181395 -112689 -25439 35604 143735
10518A43735c31996a41134j6582f9527h249l6076E7762g9332m9699B28928a81472
$$ 143735 -331996 -141134 -157716 -69527 -8249 -44325 57762 -79332 -129031 228928 -181472
10506b96915J13459g7136l76995h0984k74185a51959A24001b40401B20790O5342
$$ -296915 -183456 -77136 -454131 -80984 -355169 -151959 124001 -240401 220790 286132
10496B86132a92037o3228A13808a14576B92359l9951a16403l14323A21388B0305
$$ 286132 -192037 -255265 113808 -114576 292359 252408 -116403 -430726 121388 20305
10485A43128F1617g594A24018P0041J96912m1187j40405J28641D2303R6690E3410
$$ 143128 61617 -7594 124018 194059 390971 349784 209379 338020 42303 138993 53410
10473i896A87710O6846G8010i3412b5588j84765g7334j60976g7438l1515k63919
$$ -9896 187710 254556 78010 -93412 -25588 -210353 -77334 -238310 -77438 -108953 -372872
10462c72872a10199A42890g3854B715a15499Q392C035a21156k9035B38363j12663
$$ -372872 -110199 142890 -73854 2715 -115499 -107107 3035 -121156 -150191 238363 125700
10451A25700K6716a12464m1094B28461o1779e9084G1451B7184a81035B73387r7415
$$ 125700 152416 -112464 -153558 228461 166682 -59084 71451 27184 -181035 273387 175972
10440A75972J15703A28624a88021A99861b24531e2956j17459j2890A61135b9656
$$ 175972 291675 128624 -188021 199861 -224531 -52956 -170415 -183305 161135 -29656
10429B00244j9937E5213f5617H3491a76768c8585l6793f370A05817b33348R7560
$$ 200244 180307 55213 -65617 83491 -176768 -38585 -75378 -6370 105817 -233348 -135788
10418a35788F5874b91277I7640h2257m748d2229k35198J15831B59920a11184j88793
$$ -135788 65874 -291277 97640 -82257 -87005 -42229 -277427 -161596 259920 -111184 -299977
10407b99977o7578F9401c0797m4618J5425B7738b38944c6977C28079A05627o523
$$ -299977 -367555 69401 -30797 -75415 -59990 27738 -238944 -36977 328079 105627 99104
10396I9104K1699a36414A39032K29693j29769b83982B15600b7275E4937O9655
$$ 99104 120803 -136414 139032 368725 238956 -283982 215600 -27275 54937 124592
10386A24592l6062J18829K9638l4628m7444e8075E7729J76002Q8482A10751J79769
$$ 124592 88530 207359 236997 202369 154925 -58075 57729 233731 322213 110751 290520
10375B90520G4298k4286L05743j10442I8314J61684m9726L45810j01503B01440
$$ 290520 74298 50012 355755 245313 98314 259998 210272 556082 454579 201440
10364F54795A42985O7800P0925J02405j68236M17164B44315J38199j04366d2329
$$ 654795 142985 210785 281710 384115 215879 633043 244315 382514 278148 -42329
10353B57266p4764M20005K34285B16312J10594A51606K60719J1887A17777L37352
$$ 257266 182502 602507 836792 216312 326906 151606 412325 424212 117777 455129
10343D55129B02622j0147c644A67912M8870j2549A6014O6787l5855K46099J06677
$$ 455129 202622 192475 -3644 167912 216782 204233 16014 82801 46946 293045 399722
10332C99722G5405c2743A44931K9268J17794H9828g0637L0789C21107P4153L1252
$$ 399722 75405 -32743 144931 174199 291993 89828 -70637 -39848 321107 395260 426512
10321D26512a3709A0505J83604a569A35704A9395J05789K54130j38154H6893C7659
$$ 426512 -13709 10505 194109 -1569 135704 19395 125184 379314 241160 86893 37659
10309A77177C1682e1475A6625J51661f2530A96037C7836a16172j06294H1455K87096
$$ 177177 31682 -51475 16625 168286 -62530 196037 37836 -116172 -222466 81455 368551
10298C68551J98134D7342a32182C24380b8531A30338a14135J2682J8201b7909
$$ 368551 566685 47342 -132182 324380 -28531 130338 -114135 -101453 -83252 -27909
10287B06094d9402o5608j9133c5157d847N13A01140r983Q9572a28497b3595n1662
$$ 206094 -49402 -115010 -134143 -35157 -4847 -4334 101140 91157 180729 -128497 -23595 -75257
10275g5257C25356A21910Q3780C3106a73506D0070a87548j01407H9354p033b2245
$$ -75257 325356 121910 205690 33106 -173506 40070 -187548 -288955 89354 82321 -22245
10263h7290R567K0066B02196n7949J17650M991A03083b1596A54761D6905K1257
$$ -87290 -77723 -57657 202196 144247 261897 266888 103083 -21596 154761 46905 68162
10252F8162K92090a62281E9755n814M0918e2288H0990a86637B7056M258h3783
$$ 68162 360252 -162281 59755 53941 94859 -52288 80990 -186637 27056 31314 -83783
10240A74311j8605Q2428c56736d6377B7653a17314j03785Q4317D2096b35422D2441
$$ 174311 155706 238134 -356736 -46377 27653 -117314 -221099 -136782 42096 -235422 42441
10228b58249A76116J41453A20137a57339O6266p9972A84951b20316a4554k90707
$$ -258249 176116 317569 120137 -157339 -91073 -171045 184951 -220316 -14554 -305261
10218c05261A87277D4012a76821O3197L84F5996L355O143f4378j37564p2544h0583
$$ -305261 187277 44012 -176821 -113624 -113240 65996 69351 75494 -64378 -201942 -274486 -80583
10205a38151J2316l41336E6535b98177J2971G169h4311j74832k19694B45470d5439
$$ -138151 -125835 -467171 56535 -298177 -285206 7169 -84311 -259143 -478837 245470 -45439
10193I7393m4447a9169k17707g0642j7267j80527A28390J15441j21707b47778
$$ 97393 52946 -19169 -236876 -70642 -87909 -268436 128390 243831 122124 -247778
10182A06865b38998K0807l9666A7366b00559P089A06082A0565a34709L2552D3906
$$ 106865 -238998 -218191 -257857 17366 -200559 -193470 106082 10565 -134709 -102157 43906
10170a25281d0167j80700e3406m7821j8697C4461a23106A00042c62029a68502
$$ -125281 -40167 -220867 -53406 -101227 -119924 34461 -123106 100042 -362029 -168502
10159c97088A39856b78184O4170N7013a9588j17104O4877A24399b16890J05195
$$ -397088 139856 -278184 -214014 -157001 -19588 -136692 -71815 124399 -216890 -111695
10149a11695A61211D237b20738A29889n4466e440D5939J06419n9818c66752J28298
$$ -111695 161211 4237 -220738 129889 75423 -5440 45939 152358 92540 -366752 -238454
10138b38454J09138d8834B79725b01552A6782J67507E2687c47833J11068b3821
$$ -238454 -129316 -48834 279725 -201552 16782 184289 52687 -347833 -236765 -23821
10127a35966C6446a50223A49501a52987k11721B7645J26137o6095h7795l97389
$$ -135966 36446 -150223 149501 -152987 -364708 27645 153782 87687 -87795 -485184
10117d85184J96287A0309c64026l40518H043l482b64597K2295a790l82360F3368
$$ -485184 -288897 10309 -364026 -704544 8043 4561 -264597 -242302 -1790 -384150 63368
10105D2287L24486A5327c17742b7172p2673b9767I5675a32214o2656k1635C4367
$$ 42287 366773 15327 -317742 -27172 -99845 -29767 95675 -132214 -194870 -216505 34367
10093a72765a1282j25230f0127m52952A18084d976A35222a84034M9386J4316d3917
$$ -172765 -11282 -136512 -60127 -513079 118084 -4976 135222 -184034 -134648 -120332 -43917
10081A34247a46940A833a88307b6466m6212I9910b3613k15490E3028a32334L8169
$$ 134247 -146940 1833 -188307 -26466 -72678 99910 -23613 -239103 53028 -132334 -94165
10070i4165o6166B7322K29503A24859b46525R7065A2442a2748A223M13671k05999
$$ -94165 -160331 27322 256825 124859 -246525 -149460 12442 -12748 1223 414894 208895
10059B08895G7360o543a87020A42852f8475L0370l7838q0783F8406a68299M9551
$$ 208895 77360 70817 -187020 142852 -68475 -38105 -75943 -156726 68406 -168299 -118748
10048a18748M9028r4651j02752j06828e9349J0495k16313B89561C0053N771b34035
$$ -118748 -69720 -164371 -267123 -373951 -59349 -48854 -265167 289561 30053 35824 -234035
10036E9679h1854K8739A64976q1727b18428B9491a87568A96876j0968N0274c05071
$$ 59679 -81854 -53115 164976 83249 -218428 29491 -187568 196876 185908 236182 -305071
10024C64604b08834a04228C71379D2875c0328l35533a55775r1843a3665o4448
$$ 364604 -208834 -104228 371379 42875 -30328 -365861 -155775 -247618 -13665 -78113
10014g8113C8361a74845A06832C9597a31373a147n8404B7107g7871G7039K09488
$$ -78113 38361 -174845 106832 39597 -131373 -1147 -59551 27107 -77871 77039 286527
10003B86527a58584B53046a62755c1540n83797D6141c534j4814m24766F6962a47126
$$ 286527 -158584 253046 -162755 -31540 -615337 46141 -3534 -18348 -443114 66962 -147126
9991b84026O3752a06830M8288m1075C7080g2293j99135e0862k3891a3433A2851
$$ -284026 -220274 -106830 -58542 -99617 37080 -72293 -271428 -50862 -74753 -13433 12851
9979c98409B78907e1150j4517h695j14933N0411n0285j3454B21490c6870F6364
$$ -398409 278907 -51150 -65667 -8695 -123628 -73217 -123502 -136956 221490 -36870 66364
9967F4237f6194k84778i3657A63327H402b29205A10549E4936N0182K82692A6120
$$ 64237 -66194 -350972 -93657 163327 8402 -229205 110549 54936 105118 387810 16120
9955a19756G4334n834h0157a440j01987j89226E6384M8279E0182A5509R2882j2560
$$ -119756 74334 68500 -80157 -1440 -103427 -292653 56384 104663 50182 15509 108391 95831
9943I5831B4846N6647i8078D8543j2285P22c2325j1482h08j13525j9728c4432
$$ 95831 24846 81493 -98078 48543 36258 36980 -32325 -43807 -808 -114333 -134061 -34432
9930a02388q9058E7048j0038d20957P2145L1019J01490K0112M4302K7177C9293
$$ -102388 -191446 57048 47010 -420957 -348812 -317793 -216303 -196191 -151889 -124712 39293
9918B1535J04124l2601b38040A22115b29492F2077a49473P2664j41678b9071A87338
$$ 21535 125659 93058 -238040 122115 -229492 62077 -149473 -76809 -218487 -29071 187338
9906b21668C4419a14601A95584b60468R0026m8873E009c2810A35483b72024a3433
$$ -221668 34419 -114601 195584 -260468 -170442 -219315 5009 -32810 135483 -272024 -13433
9894d5583j30574B5918m33c15472H3451b51549A13857c44823J41435n1480O9071
$$ -45583 -176157 25918 25485 -315472 83451 -251549 113857 -344823 -203388 -254868 -185797
9883a85797j55579q7936A47576a2410A25110h2661j91651A2710b83441C0698a78267
$$ -185797 -341376 -429312 147576 -12410 125110 -82661 -274312 12710 -283441 30698 -178267
9871a41491L0970j87006h5588j17846D6796b85280Q1899f1958I6630c52905J54362
$$ -141491 -110521 -297527 -85588 -203434 46796 -285280 -203381 -61958 96630 -352905 -198543
9860a98543g7361k4126L9200H7284F09a3615D6164a46815q6541B20031i6479k49610
$$ -198543 -77361 -101487 -62287 87284 609 -13615 46164 -146815 -233356 220031 -96479 -346089
9848c46089H0202f0149m079A15134d80519i2491D0897a60980k67100g8016k71698
$$ -346089 80202 -60149 -64228 115134 -480519 -92491 40897 -160980 -428080 -78016 -349714
9837c49714H0223a01159A5089b00544i1027I4213M3775J1965c02448A39793o5077
$$ -349714 80223 -101159 15089 -200544 -91027 94213 137988 149953 -302448 139793 74716
9826G4716a59116A82000K630b41935B32993E1071f276n4281C68233A3036O4215
$$ 74716 -159116 182000 184630 -241935 232993 51071 -6276 -60557 368233 13036 77251
9815G7251k1849b30876A49932c07143b4997A55785A4193b8896m9162G419K4890
$$ 77251 55402 -230876 149932 -307143 -24997 155785 14193 -28896 -78058 7419 32309
9804C2309e627A50977F4328a22404A4935K26723g4579j3720d2623d45o8560p7962
$$ 32309 -5627 150977 64328 -122404 14935 241658 -74579 -88299 -42623 -445 -69005 -146967
9792a46967b6476B29576I8555e8807B72617C4251A722K8868h2850J0311K6035
$$ -146967 -26476 229576 98555 -58807 272617 34251 1722 30590 -82850 -72539 -46504
9781d6504q3296j3921L1203j04405j81236E2529B2498R6247J1582b44021M5197
$$ -46504 -129800 -143721 -112518 -216923 -398159 52529 22498 118745 130327 -244021 -198824
9770a98824d1761A20483a79300A3846P2300a55099L6k7189e0320m8909j96917
$$ -198824 -41761 120483 -179300 13846 86146 -155099 -155063 -182252 -50320 -99229 -296146
9759b96146A6883J41185E5463c0013k11253a7472A43789B984R770h3239D4594
$$ -296146 16883 158068 55463 -30013 -241266 -17472 143789 2984 12754 -83239 44594
9747i0418A21009e1168j81422c6579m708A67251N0114a98235N1243D4727K4827
$$ -90418 121009 -51168 -232590 -36579 -41287 167251 217365 -198235 -146992 44727 69554
9736F9554a20030r2658P6374k60629a77654e6034l73399e695F0821a27349A92354
$$ 69554 -120030 -212688 -136314 -396943 -177654 -56034 -429433 -5695 60821 -127349 192354
9724F9652a43179H7820B9825b08393j02962A24899b00580N4980J4773j27796F8241
$$ 69652 -143179 87820 29825 -208393 -311355 124899 -200580 -145600 -130827 -258623 68241
9712D3232g0469j01041q4662a7625j73461c1749D380c82757e7176k60562b9282
$$ 43232 -70469 -171510 -256172 -17625 -191086 -31749 4380 -382757 -57176 -317738 -29282
9700c69638A94964g8633m5288A35930a37234E942a39157k85j75478J49499l674
$$ -369638 194964 -78633 -123921 135930 -137234 5942 -139157 -139442 -314920 -165421 -169095
9689a69095q489b6123A00915b4787l57184f7033B09281b0831j74286G8590c7491
$$ -169095 -177584 -26123 100915 -24787 -381971 -67033 209281 -20831 -195117 78590 -37491
9677G6360a84030A1976e6278D58630f7218a2703a606j05286A12321D761b39492
$$ 76360 -184030 11976 -56278 458630 -67218 -12703 -1606 -106892 112321 4761 -239492
9665a09681A40408F1179A9a12877p5149M646A24401g0667b543j86338b7038F653
$$ -109681 140408 61179 19 -112877 -188026 -183380 124401 -70667 -2543 -188881 -27038 6653
9652a44024O8292K0247j81584J01230C7446a01813M8654n195l02571J19849i8657
$$ -144024 -75732 -55485 -237069 -135839 37446 -101813 -53159 -58354 -360925 -241076 -98657
9640a17432q9406i0019A76903a57019o5554a8163j32847J5592J9336d843A52296
$$ -117432 -206838 -90019 176903 -157019 -222573 -18163 -151010 -135418 -116082 -4843 152296
9628B42040b59475J06902L5984B7772c51190E5363b03132d5408A01137a19435
$$ 242040 -259475 -152573 -116589 27772 -351190 55363 -203132 -45408 101137 -119435
9617a59743D5629c00395E0114l972b93350A55477f6233A64653d0560G2616f1035
$$ -159743 45629 -300395 50114 46142 -293350 155477 -66233 164653 -40560 72616 -61035
9605E2176c23241a46690A37271J28842A5045J12111q730C8317b38759B72741I7523
$$ 52176 -323241 -146690 137271 266113 15045 127156 118426 38317 -238759 272741 97523
9593f2779j69033h5954L2983K4700q4390j95741j43736K18202K4158b7760H9861
$$ -62779 -231812 -85954 -52971 -28271 -112661 -308402 -452138 -233936 -209778 -27760 89861
9581D023c85037q074e9592B15989l5806b24406K4574j17344D614c1052n1384I5448
$$ 4023 -385037 -393111 -59592 215989 180183 -224406 -199832 -317176 4614 -31052 -82436 95448
9568B22828a25944A03365C311a64329H0446c30527H5687a5284A90234f8833l8591
$$ 222828 -125944 103365 3311 -164329 80446 -330527 85687 -15284 190234 -68833 -107424
9557a07424D870L3748f371j02996N1204j38720M4782K4771G6905N0655i0931l3894
$$ -107424 4870 38618 -6371 -109367 -58163 -196883 -152101 -127330 76905 127560 -90931 -124825
9545a24825H8582R9087b13942A63873e329A27528c17596a41731m2295D1410a92258
$$ -124825 88582 187669 -213942 163873 -5329 127528 -317596 -141731 -184026 41410 -192258
9533c52044h8640k91963J32783a09547e0862A75400k0841a98655A66300A9214
$$ -352044 -88640 -380603 -247820 -109547 -50862 175400 154559 -198655 166300 19214
9522A75155a18799r1816I7056a89530e0753r0245a4589A5733L9053i5615A2329
$$ 175155 -118799 -210615 97056 -189530 -50753 -140998 -14589 15733 54786 -95615 12329
9510A2976g5662k21893a6334H0364A0256b62573A43571a72698C04807C1005b74052
$$ 12976 -75662 -297555 -16334 80364 10256 -262573 143571 -172698 304807 31005 -274052
9498a25072L0129j2385A42957A0688K25599b68991g5780D916Q4943h6306k51810
$$ -125072 -94943 -107328 142957 10688 236287 -268991 -75780 4916 89859 -86306 -338116
9487c38116B02574c46639A3424b6581j42238k4275h4904B647g7327A87246a20093
$$ -338116 202574 -346639 13424 -26581 -168819 -193094 -84904 2647 -77327 187246 -120093
9475a43252A8584a21198A13333b15347O6104k462B49597D8949a04196C20065a22639
$$ -143252 18584 -121198 113333 -215347 -149243 -151705 249597 48949 -104196 320065 -122639
9463A46306a43942b9282j57929q5179i0227a2728k6743k69387A64930f6388b6669
$$ 146306 -143942 -29282 -187211 -272390 -90227 -12728 -39471 -308858 164930 -66388 -26669
9451a35443j43937B75127M7516b82913A1405h4502j70463q6025a06788L2720m770
$$ -135443 -279380 275127 322643 -282913 11405 -84502 -254965 -340990 -106788 -74068 -78838
9440g8838L8064B10647F1836e46188b57608C7943f1146k6927o9814j57396E6295
$$ -78838 -40774 210647 61836 -546188 -257608 37943 -61146 -88073 -157887 -315283 56295
9428g8704j00546A03798d31034G7663L1603b75120g1927I1073a60785o0694d2360
$$ -78704 -179250 103798 -431034 77663 109266 -275120 -71927 91073 -160785 -221479 -42360
9416D6310a25423B1178b38125M0560C94717j72417e4636k30367J19617C8833a07458
$$ 46310 -125423 21178 -238125 -197565 394717 222300 -54636 -285003 -165386 38833 -107458
9404f9517j2425I1937b72932H5780d00641D8319b44642B2368a24277A8093Q2068
$$ -69517 -81942 91937 -272932 85780 -400641 48319 -244642 22368 -124277 18093 100161
9393A00161J37680J0625e3262j65444J7453G150a09758a1446A73886b99170f8406
$$ 100161 237841 248466 -53262 -218706 -201253 7150 -109758 -11446 173886 -299170 -68406
9381a15007A79451g9966r3550d5658j98239Q8560O4363B42845b09568F4635A2437
$$ -115007 179451 -79966 -173516 -45658 -243897 -155337 -90974 242845 -209568 64635 12437
9369b5475h037n7729E8934a80453r6764A14989j2131B6668a51197M7576d6553
$$ -25475 -8037 -65766 58934 -180453 -277217 114989 102858 26668 -151197 -103621 -46553
9357C1382a09583A13904i4419B9416N8198A0397L59665b06075L4127f9959j0044
$$ 31382 -109583 113904 -94419 29416 87614 10397 370062 -206075 -171948 -69959 -80003
9346h0003c3553B4184a42664F9279i4792k96547D4458R3768I087C703a66821D5937
$$ -80003 -33553 24184 -142664 69279 -94792 -391339 44458 138226 9087 3703 -166821 45937
9333b8449k80144R5645A4673g4301o7030C4165a98608D2968M2059h2880A62901
$$ -28449 -308593 -212948 14673 -74301 -141331 34165 -198608 42968 85027 -82880 162901
9321A1203a16419A85055b09443R3144B70050b18174E3160a29936b1400o2011E4746
$$ 11203 -116419 185055 -209443 -116299 270050 -218174 53160 -129936 -21400 -83411 54746
9309A30553a59024E3059j7940K5730b22121b412l08461M1654a11140b4141B07147
$$ 130553 -159024 53059 35119 60849 -222121 -2412 -310873 -269219 -111140 -24141 207147
9297a94851e3020n8932c648j04896D23916a85244P6370k31927h5802k519L4413
$$ -194851 -53020 -111952 -3648 -108544 423916 -185244 -108874 -340801 -85802 -88321 -53908
9286e3908k7799C33877c88j69848p7403e5306m4114o3820M5715D2486b54330J3279
$$ -53908 -81707 333877 -388 -170236 -247639 -55306 -99420 -163240 -117525 42486 -254330 -241051
9274b41051B50809b26290f4005m21545a20818M1602b5280k18510B44626F4680
$$ -241051 250809 -226290 -64005 -485550 -120818 -79216 -25280 -243790 244626 64680
9263b8554A00230b88021a11315Q353C67135b06266l531r5912N8558K6138Q5909
$$ -28554 100230 -288021 -111315 -102962 367135 -206266 -209797 -305709 -247151 -221013 -135104
9252a35104o5558K9430k1904C01714j29154b70725I6317J49913m5003p7121m4928
$$ -135104 -200662 -171232 -193136 301714 172560 -270725 96317 246230 201227 124106 79178
9241G9178l1126k0748N1456a571j54410j58712b6746l80862b0381A41704b96635
$$ 79178 48052 27304 78760 -1571 -155981 -314693 -26746 -407608 -20381 141704 -296635
9229a1903j71562H1525a25953n7394F2845i8803l94542b42216G3762N607e7079
$$ -11903 -183465 81525 -125953 -183347 62845 -98803 -493345 -242216 73762 79369 -57079
9217b22528B0281L2881L26397a27558n9549r9339a26768o3139A3470i4399A60618
$$ -222528 20281 53162 379559 -127558 -187107 -286446 -126768 -189907 13470 -94399 160618
9205b14196b5770C7406A0393b23957R1858a3514l76551a85326D5042a53480I8746
$$ -214196 -25770 37406 10393 -223957 -132099 -13514 -390065 -185326 45042 -153480 98746
9193a76857b9056k16091L6241D8455A8838d4087B39114E9869b8901m4077j42522
$$ -176857 -29056 -245147 -208906 48455 18838 -44087 239114 59869 -28901 -72978 -215500
9182b15500K6467q3848E0905j8670e7668k12243F4338K2027a65329B3701L03636
$$ -215500 -189033 -272881 50905 32235 -57668 -269911 64338 86365 -165329 23701 327337
9171C27337D072J9040J30302j6895l1539a15158K8678E0520K3738a99208B7485
$$ 327337 4072 23112 153414 136519 104980 -115158 -86480 50520 74258 -199208 27485
9159a39774r3087g1216B5841J91356P466C7563f8052b0754r1513A76146b76326
$$ -139774 -232861 -71216 25841 217197 224663 37563 -68052 -20754 -112267 176146 -276326
9147I5392J11154a98824c517j40847A87427d2238k82600C0813c96870P1489D5932
$$ 95392 206546 -198824 -3517 -144364 187427 -42238 -324838 30813 -396870 -325381 45932
9135a43228I0125a18226n5329P0532j03524B18857Q1806g9090l01358a17220M5377
$$ -143228 90125 -118226 -173555 -103023 -206547 218857 300663 -79090 -380448 -117220 -71843
9124g1843A66348c6783a959k94741b894C0980a12711B74251a42117c7259o9767
$$ -71843 166348 -36783 -1959 -296700 -2894 30980 -112711 274251 -142117 -37259 -107026
9113a07026B45631B5178d79938a75525I2475a86698M7103E246a17839i379j50868
$$ -107026 245631 25178 -479938 -175525 92475 -186698 -139595 5246 -117839 -9379 -160247
9102a60247n4046f1973r8615m9593J8543A56936n3384d36272A21042a46907D63906
$$ -160247 -214293 -61973 -160588 -210181 -191638 156936 103552 -436272 121042 -146907 463906
9090A88921h6395B33378a01222G8899b09381c0010n9688l27571F5165i4818J7495
$$ 188921 -86395 233378 -101222 78899 -209381 -30010 -89698 -417269 65165 -94818 -77323
9079g7323m2607N3354B3045a78326l288G6899J26790b8549k4495B02315P7313
$$ -77323 -119930 -66576 23045 -178326 -181614 76899 203689 -28549 -53044 202315 279628
9068B79628c03119O4548A52941i2453K73A03908c10685A08999b05647A8085f87
$$ 279628 -303119 -238571 152941 -92453 -92180 103908 -310685 108999 -205647 18085 -687
9056d6883E00684i1811O930b4713j73675A45123J58370G8644c660k18926D33151
$$ -46883 500684 -91811 -84881 -24713 -198388 145123 303493 78644 -3660 -222586 433151
9044A30477b80972A08934R8168f5597J1313G5818c20824h6832m2288m0858h3149
$$ 130477 -280972 108934 207102 -65597 -54284 75818 -320824 -86832 -129120 -169978 -83149
9032a19078c7787j00512L498A0284b06100j25026a49902G6199P2458e8632k7991
$$ -119078 -37787 -138299 -134801 10284 -206100 -331126 -149902 76199 148657 -58632 -86623
9021h6623A40633c26863i3346k76299A01540c03159f9964k68754J58708j1130
$$ -86623 140633 -326863 -93346 -369645 101540 -303159 -69964 -338718 -180010 -191140
9011a91140a0917j93617B10843H6353n251i9920I0463d774A61799J66432i8533
$$ -191140 -10917 -204534 210843 86353 81102 -99920 90463 -4774 161799 328231 -98533
8999i9749j3645O659n1738B8848r884a42461B4712a38077G395M4214a61804E3420
$$ -99749 -113394 -106735 -158473 28848 18964 -142461 24712 -138077 7395 51609 -161804 53420
8986A15422i0628M3291m4130A62693e305I8546D1508g1536m18720b09858D6466
$$ 115422 -90628 -47337 -91467 162693 -5305 98546 41508 -71536 -490256 -209858 46466
8974A69594b61587A5636f7821k84178A67976D8422a3194l9806D9174J76456a26691
$$ 169594 -261587 15636 -67821 -351999 167976 48422 -13194 -53000 49174 225630 -126691
8962e1900j27025r5126a00121d6881J395l50804B3584J1008b91824a36671j10052
$$ -51900 -178925 -274051 -100121 -46881 -45486 -396290 23584 34592 -291824 -136671 -246723
8951b46723d1555B00170b81426c6780j4045A20238d05649f3514A85299e1033a4464
$$ -246723 -41555 200170 -281426 -36780 -50825 120238 -405649 -63514 185299 -51033 -14464
8939A64890E5433d6465j34500P8471B9485J88351c70414a63826g8375a9635l1452
$$ 164890 55433 -46465 -180965 -102494 29485 217836 -370414 -163826 -78375 -19635 -51087
8928e1087D29286A22359i8759O664I704N54002J609119A068312n12027A77457
$$ -51087 429286 122359 -98759 -92095 9704 563706 2172825 1068312 556285 177457
8917A10837c08261A55671h9356n9128O5530B09023a33064r6783A2921a32267A22664
$$ 110837 -308261 155671 -89356 -148484 -82954 209023 -133064 -229847 12921 -132267 122664
8905f5117B11938I3936d5930b2323k9994j74894K4927B742L578L85598e8596m8764
$$ -65117 211938 93936 -45930 -22323 -52317 -227211 -202284 2742 6320 391918 -58596 -107360
8893a07360L408k1221A49441J04590A08849a65559A7107a70688k01869a09998
$$ -107360 -103952 -125173 149441 254031 108849 -165559 17107 -170688 -372557 -109998
8882D3460a01051B0598b65174d9911m07292H1550O0264i6815k38266A53463c27196
$$ 43460 -101051 20598 -265174 -49911 -457203 81550 141814 -96815 -335081 153463 -327196
8870d3066E3935K07752c78681e5399B24216f2594J1354j14937g3536A34413E8328
$$ -43066 53935 261687 -378681 -55399 224216 -62594 -51240 -166177 -73536 134413 58328
8858a83811G8198M609a76596p4861F5468a52211B52715c30219E6625J81893a98352
$$ -183811 78198 82807 -176596 -251457 65468 -152211 252715 -330219 56625 238518 -198352
8846E9627b40953B70128a33348q9119j18305j24721C16418b0446B0985K25082
$$ 59627 -240953 270128 -133348 -222467 -340772 -465493 316418 -20446 20985 246067
8836B46067E6039p368e0519j36064A49915i0954l59706G7664b07919A36958n8812
$$ 246067 56039 48671 -50519 -186583 149915 -90954 -450660 77664 -207919 136958 78146
8825G8146K80512A5442a07964B22220J79940I434n36J84673a54082g3158j32122
$$ 78146 358658 15442 -107964 222220 402160 9434 8898 193571 -154082 -73158 -205280
$$ [...]
##END NTUPLES=NMR SPECTRUM
##END=
