##TITLE=AC1452_NESTRI271_7818727_KS3ssZnEED
##JCAMPDX= 6.0         $$ Bruker NMR JCAMP-DX V2.0
##DATA TYPE= NMR SPECTRUM
##DATA CLASS= NTUPLES
##ORIGIN= BRUKER
##OWNER= Administrator
$$ 1.72 TOPSPIN		Version 2.1
$$ 2013-04-30 17:50:23.665 -0700  Administrator@X
$$ Compression mode = diff/dup
##.OBSERVE FREQUENCY= 400.02188249412
##.OBSERVE NUCLEUS= ^1H
##.ACQUISITION MODE= SIMULTANEOUS (DQD)
##.ACQUISITION SCHEME= undefined
##.AVERAGES= 64
##.DIGITISER RES= 22
##SPECTROMETER/DATA SYSTEM= spect
##.PULSE SEQUENCE= noesygpps1d.comp
##.SOLVENT NAME= COFFEE_meoh
##.SHIFT REFERENCE= INTERNAL, COFFEE_meoh, 1, 14.96066
##AUDIT TRAIL= $$ (NUMBER, WHEN, WHO, WHERE, PROCESS, VERSION, WHAT)
$$ ##TITLE= Audit trail, TOPSPIN		Version 2.1
$$ ##JCAMPDX= 5.01
$$ ##ORIGIN= Bruker BioSpin GmbH
$$ ##OWNER= Administrator
$$ $$ E:\/data/COFFEE/nmr/AC1452_NESTRI271_7818727_KS3ssZnEED/22/pdata/1/auditp.txt
$$ ##AUDIT TRAIL=  $$ (NUMBER, WHEN, WHO, WHERE, PROCESS, VERSION, WHAT)
(   1,<2013-04-30 17:50:18.292 -0700>,<Administrator>,<X>,<go>,<TOPSPIN 2.1>,
      <created by zg
	started at 2013-04-30 17:38:48.938 -0700,
	POWCHK enabled, PULCHK disabled,
       configuration hash MD5:
       F7 49 AB AC A2 8D 51 76 73 8D C1 9A A6 38 9F DE
       data hash MD5: 64K
       25 71 E8 FF 24 A4 70 86 23 99 CE A2 25 F0 C2 04>)
(   2,<2013-04-30 17:50:21.558 -0700>,<Administrator>,<X>,<proc1d>,<TOPSPIN 2.1>,
      <Start of raw data processing
       efp LB = 0.3 FT_mod = 6 PKNL = 1 PHC0 = 0 PHC1 = 0 SI = 128K 
       data hash MD5: 128K
       41 E1 CB 0C 87 8F A5 1C E3 B2 66 5E 72 41 47 33>)
(   3,<2013-04-30 17:50:22.680 -0700>,<Administrator>,<X>,<proc1d>,<TOPSPIN 2.1>,
      <pk PHC0 = -78.77747 PHC1 = 0 
       data hash MD5: 128K
       A1 9E 19 99 2B E1 89 98 CE C0 41 76 13 8B CB 6D>)
(   4,<2013-04-30 17:50:23.089 -0700>,<Administrator>,<X>,<proc1d>,<TOPSPIN 2.1>,
      <abs ABSG = 1 
       data hash MD5: 128K
       62 DB 14 22 D4 6B 7F F1 F2 80 22 3F 58 59 D6 0D>)
(   5,<2013-04-30 17:50:23.195 -0700>,<Administrator>,<X>,<proc1d>,<TOPSPIN 2.1>,
      <abs ABSG = 2 
       data hash MD5: 128K
       DD C6 6D 7C 4A 62 FC C9 75 57 41 7E 03 B4 53 61>)
(   6,<2013-04-30 17:50:23.271 -0700>,<Administrator>,<X>,<proc1d>,<TOPSPIN 2.1>,
      <abs ABSG = 3 
       data hash MD5: 128K
       28 95 BF 22 80 52 F6 BB 73 6B 1E 5A B8 F8 23 02>)
(   7,<2013-04-30 17:50:23.377 -0700>,<Administrator>,<X>,<proc1d>,<TOPSPIN 2.1>,
      <abs ABSG = 4 
       data hash MD5: 128K
       06 F3 19 B5 DD 3F 4D 46 20 FF 29 F4 54 19 D4 27>)
(   8,<2013-04-30 17:50:23.468 -0700>,<Administrator>,<X>,<proc1d>,<TOPSPIN 2.1>,
      <abs ABSG = 5 
       data hash MD5: 128K
       DB 0E 42 19 A4 27 1E 9D 54 08 69 2E F7 82 E1 BC>)
$$ ##END=
$$ 
$$ $$ hash MD5
$$ $$ CA 89 D4 AF 25 C0 04 AB 96 A9 9B 70 D1 D6 71 2D
##$RELAX= 
##$RELAX= 
##$RELAX= 
##$RELAX= 
##$RELAX= 
##$RELAX= 
##$RELAX= 
##$RELAX= 
$$ Bruker specific parameters
$$ --------------------------
##$DU= <E:\>
##$EXPNO= 22
$$ [...]
##$TP07= 0
##$TPNAME0= <>
##$TPNAME1= <>
##$TPNAME2= <>
##$TPNAME3= <>
##$TPNAME4= <>
##$TPNAME5= <>
##$TPNAME6= <>
##$TPNAME7= <>
##$TPOAL= (0..7)
0.5 0.5 0.5 0.5 0.5 0.5 0.5 0.5
##$TPOFFS= (0..7)
0 0 0 0 0 0 0 0
##$TUNHIN= 0
##$TUNHOUT= 0
##$TUNXOUT= 0
##$USERA1= <user>
##$USERA2= <user>
##$USERA3= <user>
##$USERA4= <user>
##$USERA5= <user>
##$V9= 5
##$VALIST= <valist>
##$VCLIST= <CCCCCCCCCCCCCCC>
##$VD= 0
##$VDLIST= <DDDDDDDDDDDDDDD>
##$VPLIST= <PPPPPPPPPPPPPPP>
##$VTLIST= <TTTTTTTTTTTTTTT>
##$WBST= 1024
##$WBSW= 4
##$XGAIN= (0..3)
0 0 0 0
##$XL= 0
##$YL= 0
##$YMAX_a= 5725923
##$YMIN_a= -12873514
##$ZGOPTNS= <>
##$ZL1= 120
##$ZL2= 120
##$ZL3= 120
##$ZL4= 120
##$ABSF1= 14.96066
##$ABSF2= -5.597522
##$ABSG= 5
##$ABSL= 3
##$ALPHA= 0
##$AQORDER= 0
##$ASSFAC= 0
##$ASSFACI= 0
##$ASSFACX= 0
##$ASSWID= 0
##$AUNMP= <proc_prof1d_extract.lims>
##$AXLEFT= 0
##$AXNAME= <>
##$AXNUC= <1H>
##$AXRIGHT= 0
##$AXTYPE= 0
##$AXUNIT= <>
##$AZFE= 0.1
##$AZFW= 0.1
##$BCFW= 0
##$BC_mod= 0
##$BYTORDP= 0
##$COROFFS= 0
##$CY= 15
##$DATMOD= 1
##$DC= 0
##$DFILT= <>
##$DTYPP= 0
##$F1P= 0
##$F2P= 0
##$FCOR= 0.5
##$FTSIZE= 131072
##$FT_mod= 6
##$GAMMA= 0
##$GB= 0
##$INTBC= 1
##$INTSCL= 1
##$ISEN= 128
##$LB= 0.3
##$LEV0= 0
##$LPBIN= 0
##$MAXI= 10000
##$MC2= 0
##$MEAN= 0
##$ME_mod= 0
##$MI= 0
##$NCOEF= 0
##$NC_proc= -2
##$NLEV= 6
##$NOISF1= 0
##$NOISF2= 0
##$NSP= 0
##$NTH_PI= 0
##$NZP= 0
##$OFFSET= 14.96066
##$PC= 1
##$PHC0= -78.77747
##$PHC1= 0
##$PH_mod= 1
##$PKNL= yes
##$PPARMOD= 0
##$PPDIAG= 0
##$PPIPTYP= 0
##$PPMPNUM= 2147483647
##$PPRESOL= 1
##$PSCAL= 4
##$PSIGN= 0
##$PYNMP= <proc.py>
##$REVERSE= no
##$SF= 400.020009772511
##$SI= 131072
##$SIGF1= 0
##$SIGF2= 0
##$SINO= 400
##$SIOLD= 131072
##$SPECTYP= <>
##$SREGLST= <1H.CDCl3>
##$SSB= 0
##$STSI= 131072
##$STSR= 0
##$SW_p= 8223.68421052631
##$SYMM= 0
##$S_DEV= 0
##$TDeff= 65536
##$TDoff= 0
##$TI= <>
##$TILT= no
##$TM1= 0
##$TM2= 0
##$TOPLEV= 0
##$USERP1= <user>
##$USERP2= <user>
##$USERP3= <user>
##$USERP4= <user>
##$USERP5= <user>
##$WDW= 1
##$XDIM= 131072
##$YMAX_p= 346046007
##$YMIN_p= -12555
##$CURPLOT= <Network HP LaserJet P1505>
##$CURPRIN= <$Network HP LaserJet P1505>
##$DFORMAT= <normdp>
##$LAYOUT= <+/1D_H.xwp>
##$LFORMAT= <normlp>
##$PFORMAT= <normpl>
##$SURQMSG= 1
$$ End of Bruker specific parameters
$$ ---------------------------------
##NTUPLES= NMR SPECTRUM
##VAR_NAME=  FREQUENCY,     SPECTRUM/REAL,   SPECTRUM/IMAG
##SYMBOL=    X,             R,               I
##VAR_TYPE=  INDEPENDENT,   DEPENDENT,       DEPENDENT
##VAR_FORM=  AFFN,          ASDF,            ASDF
##VAR_DIM=   131072,        131072,          131072
##UNITS=     HZ,            ARBITRARY UNITS, ARBITRARY UNITS
##FACTOR=    0.0627417313425164, 1,          1
##FIRST=     8223.62146879497, 783,          -57452
##LAST=      0,             1969,            -57902
##MIN=       0,             -12555,          0
##MAX=       8223.62146879497, 346046007,    0
$$ Real data points
##PAGE= N=1
##DATA TABLE= (X++(R..R)), XYDATA
$$ [...]
63816G00647k0928j8514j6353j4148j1324q058n390m161m209m819n656o929q779
$$ 700647 679719 661205 644852 630704 619380 611322 605932 601771 597562 592743 587087 580158 571379
63803E71379j0907j2785j4005j4373j3879j2832j1823j1380j1536j1817j1615
$$ 571379 560472 547687 533682 519309 505430 492598 480775 469395 457859 446042 434427
63792D34427j0671r297q175p751p787p647p049o266n612n058m535m185m022l708
$$ 434427 423756 414459 406284 398533 390746 383099 376050 369784 364172 359114 354579 350394 346372 342664
63778C42664l069k508k414k457k112j571j511j983k347k291k111j894j329n58
$$ 342664 339595 337087 334673 332216 330104 328533 327022 325039 322692 320401 318290 316396 315067 314509
63764C14509l41r05j415j263j022j438k112k149j659j483j673j378l28N78N16
$$ 314509 314168 313263 311848 310585 309563 308125 306013 303864 302205 300722 299049 297671 297343 297921 298437
63749B98437k00o85n33N5P37J210J240Q80N67P54J484K327K678K254J496J250
$$ 298437 298237 297552 297019 297074 297811 299021 300261 301141 301708 302462 303946 306273 308951 311205 312701 313951
63733C13951J823K568K788K689K877L211K959K067J412J639K489L405M157M588
$$ 313951 315774 318342 321130 323819 326696 329907 332866 334933 336345 337984 340473 343878 348035 352623
63719C52623M483M021L711L594L138K256J586J340P33p86k465l225l073k728k410
$$ 352623 357106 361127 364838 368432 371570 373826 375412 376752 377485 376699 374234 371009 367936 365208 362798
63704C62798j977j782k257k843k467j097J82O80P91R88J155J176J364J796K033
$$ 362798 360821 359039 356782 353939 351472 350375 350557 351237 352028 353016 354171 355347 356711 358507 360540
63689C60540J879J805K163K504K260J548Q52L21j04k24J53P30J080J231J467J728
$$ 360540 362419 364224 366387 368891 371151 372699 373551 373872 373768 373544 373697 374427 375507 376738 378205 379933
63673C79933J736J592J670J971K109K022K129K620K947K418J078l01j049j226
$$ 379933 381669 383261 384931 386902 389011 391033 393162 395782 398729 401147 402225 401924 400875 399649
63659C99649j431k112l161m078m436m165l538k931k571k359j992j321m64M48J480
$$ 399649 398218 396106 392945 388867 384431 380266 376728 373797 371226 368867 366875 365554 365090 365538 367018
63644C67018K608L457L708L755M450O043P752Q643Q616Q266Q051P940P727P359
$$ 367018 369626 373083 376791 380546 384996 391039 398791 407434 416050 424316 432367 440307 448034 455393
63630D55393O916O549O423O624P124P839Q626R181R210Q912R009J0025J1673J3243
$$ 455393 462309 468858 475281 481905 489029 496868 505494 514675 523885 532797 541806 551831 563504 576747
63616E76747J4508J5925J7931K0415K3013K5600K8299L1085L3696L5966L8019
$$ 576747 591255 607180 625111 645526 668539 694139 722438 753523 787219 823185 861204
63605H61204L9886M0984M0259L7100L1955K5824J9357J2738O328Q17l419o622
$$ 861204 901090 942074 982333 1019433 1051388 1077212 1096569 1109307 1115635 1116452 1113033 1106411
63593A106411r054j0593j1188j1460j2238j3781j5820j8274k1353k4932k8266
$$ 1106411 1097357 1086764 1075576 1064116 1051878 1038097 1022277 1004003 982650 957718 929452
63582I29452l0534l1429l1162l0081k8487k6611k4535k2204j9506j6407j3055
$$ 929452 898918 867489 836327 806246 777759 751148 726613 704409 684903 668496 655441
63571F55441r798p005m776k958j481m84R2P52J977L594M975N837O529P474Q688
$$ 655441 645643 638638 633862 630904 629423 628939 629031 629783 631760 635354 640329 646166 652695 660169 668857
63556F68857R960J1331J3238J6209K0350K5102K9620L3676L8064M3827N1052N8663
$$ 668857 678817 690148 703386 719595 739945 765047 794667 828343 866407 910234 961286 1019949
63544A019949O5307O9979P1620O8593N9276M3624K4142N055r904j9309k3952k5282
$$ 1019949 1085256 1155235 1226855 1295448 1354724 1398348 1422490 1427545 1417641 1398332 1374380 1349098
63532A349098k4283k1810j9229j7955j8370j9848k1812k4352k7707l1741l6076
$$ 1349098 1324815 1303005 1283776 1265821 1247451 1227603 1205791 1181439 1153732 1121991 1085915
63521A085915m0225m3310m4273m2883m0236l7676l5455l2959l0027k7255k4975
$$ 1085915 1045690 1002380 958107 915224 874988 837312 801857 768898 738871 711616 686641
63510F86641k2746k0167j7667j5889j4656j3257j1656j0738j1123j2237j2881
$$ 686641 663895 643728 626061 610172 595516 582259 570603 559865 548742 536505 523624
63499E23624j2433j1124r475q000p202p219p342o528m703l011k449k668k638k050
$$ 523624 511191 500067 490592 482592 475390 468171 460829 454301 449598 446587 444138 441470 438832 436782
63485D36782j440j108p14M6J002J933K890L857M584M978N266N501N315M458L277
$$ 436782 435342 434234 433520 433566 434568 436501 439391 443248 447832 452810 458076 463577 468892 473350 476627
63470D76627K292J603J048O62O33Q75J096J174J214J389J886K806L831M226L626
$$ 476627 478919 480522 481570 482232 482865 483740 484836 486010 487224 488613 490499 493305 497136 501362 504988
63455E04988K587J893J520R31K86M80J794L249L851L891M371N451O323O522O740
$$ 504988 507575 509468 510988 511919 512205 512685 514479 517728 521579 525470 529841 535292 541615 548137 554877
63440E54877Q113J1185J5692K1027K6688L2637L9380M7380N6009O3241O6624O4536
$$ 554877 562990 574175 589867 610894 637582 670219 709599 756979 812988 876229 942853 1007389
63428A007389N6690M4068K8884J4213K713m572q045q309n638n78N711J2238J8856
$$ 1007389 1064079 1108147 1137031 1151244 1153957 1149385 1141340 1133031 1127393 1126815 1132526 1144764 1163620
63415A163620K5676L2044L6638L8448L7288L3427K7290J9549J1123K891m354r752
$$ 1163620 1189296 1221340 1257978 1296426 1333714 1367141 1394431 1413980 1425103 1427994 1423640 1413888
63403A413888j2676j3454j3441j4021j5632j7924k0638k3963k8052l2528l6635
$$ 1413888 1401212 1387758 1374317 1360296 1344664 1326740 1306102 1282139 1254087 1221559 1184924
63392A184924l9758m1746m2742m2859m2094m0600l8755l6874l4881l2476k9595
$$ 1184924 1145166 1103420 1060678 1017819 975725 935125 896370 859496 824615 792139 762544
63381G62544k6448k3172j9679j5949j2229q811n815l312j369J67J810M056O889
$$ 762544 736096 712924 693245 677296 665067 656256 650441 647129 645760 645927 647737 651793 658682
63368F58682R829J2386J4392J6061J7847K0220K3334K6983L0882L4960L9215M3473
$$ 658682 668511 680897 695289 711350 729197 749417 772751 799734 830616 865576 904791 948264
63356I48264M7483N1121N4226N6279N6491N4298M9692M3065L4924K5769J6148
$$ 948264 995747 1046868 1101094 1157373 1213864 1268162 1317854 1360919 1395843 1421612 1437760
63345A437760O752j517p758j1568j3313j3771j3639j3568j4364j6598j9983k3651
$$ 1437760 1444512 1442995 1435237 1423669 1410356 1396585 1382946 1369378 1355014 1338416 1318433 1294782
63333A294782k7286l1431l6354m1089m4158m5001m4180m2339l9555l5714l0848
$$ 1294782 1267496 1236065 1199711 1158622 1114464 1069463 1025283 982944 943389 907675 876827
63322H76827k4926j7846r902j960M915R583J0468O003l757j6234k7696l5577l9344
$$ 876827 851901 834055 824153 822193 827108 836691 847159 853162 849405 833171 805475 769898 730554
63309G30554l9665l7544l4107l0322k6591k2956j9696j7188j5272j3408j1623
$$ 730554 690889 653345 619238 588916 562325 539369 519673 502485 487213 473805 462182
63298D62182j0496j0044r365p879o215n297n103m977m661m329l963l487l272l701
$$ 462182 451686 441642 432277 424398 418183 412886 407783 402806 398145 393816 389853 386366 383094 379393
63284C79393m367m419l660k627j656o62J89M11K4l06j54K10N12Q76J272J305R70
$$ 379393 375026 370607 366947 364320 362664 362002 362191 362602 362626 362320 362166 362376 362888 363764 365036 366341 367311
63267C67311R31J489J929J552Q61R25J855K778L144L272L601M073M489M873N222
$$ 367311 368242 369731 371660 373212 374073 374998 376853 379631 382775 386047 389648 393721 398210 403083 408305
63252D08305N329N092M747M584M669M939N359N850O302O716P174P660Q118Q738
$$ 408305 413634 418726 423473 428057 432726 437665 443024 448874 455176 461892 469066 476726 484844 493582
63238D93582R864J1444J2963J4088J5103J6396J7731J8493J8585J8596J8984J9430
$$ 493582 503446 514890 527853 541941 557044 573440 591171 609664 628249 646845 665829 685259
63226F85259J9358J8754J8126J7775J7593J7533J7860J8690J9707K0614K1516
$$ 685259 704617 723371 741497 759272 776865 794398 812258 830948 850655 871269 892785
63215H92785K2505K3125K2744K1266J8989J5884J1666O562J363l535q436j3475
$$ 892785 915290 938415 961159 982425 1001414 1017298 1028964 1035526 1036889 1033354 1024918 1011443
63203A011443j8022k1490k4137k6423k8008k8232k7344k6338k5506k3979k1095
$$ 1011443 993421 971931 947794 921371 893363 865131 837787 811449 785943 761964 740869
63192G40869j7448j4121j1335q501n398k503j44K127M931Q157J1029J3034J4416
$$ 740869 723421 709300 697965 689464 684066 681563 681419 683546 688477 696634 707663 720697 735113
63179G35113J5617J6581J6917J6603J6098J5711J5228J4402J3422J2602J1789
$$ 735113 750730 767311 784228 800831 816929 832640 847868 862270 875692 888294 900083
63168I00083J0578Q954P265N527L305M34k586n249p782j0781j4327j7924k1197
$$ 900083 910661 919615 926880 932407 935712 936146 933560 928311 920529 909748 895421 877497 856300
63155H56300k4096k6409k7569k7351k6370k5449k4686k3472k1414j8803j6231
$$ 856300 832204 805795 778226 750875 724505 699056 674370 650898 629484 610681 594450
63144E94450j4069j2475j1530j1145j0980j0606r718q187o208m374l264k822k470
$$ 594450 580381 567906 556376 545231 534251 523645 513927 505740 499532 495158 491894 489072 486602
63131D86602j921j489j376j228p54k72j17J21R93K161K783K821L066L771M142
$$ 486602 484681 483192 481816 480588 479834 479562 479445 479566 480559 482720 485503 488324 491390 495161 499303
63116D99303L574K612K228K602L095L116K656K190K261K833L098K329J024M94
$$ 499303 502877 505489 507717 510319 513414 516530 519186 521376 523637 526470 529568 531897 532921 533415
63102E33415J119J815J671J314J956L627N215N898N868N773O220P513R205J0027
$$ 533415 534534 536349 538020 539334 541290 544917 550132 556030 561898 567671 573891 581404 590609 600636
63088F00636Q955O384L638J482l02j943l172l799m129m466m656m353l370j691
$$ 600636 609591 615975 619613 621095 620793 618850 615678 611879 607750 603284 598628 594275 590905 589214
63074E89214M45K421L622M156M736N720O708P269P627Q293R390J0646J1822J2931
$$ 589214 589659 592080 595702 599858 604594 610314 617022 624291 631918 640211 649601 660247 672069 685000
63060F85000J4167J5839J8138K0886K3722K6576K9726L3205L6512L9124M1087
$$ 685000 699167 715006 733144 754030 777752 804328 834054 867259 903771 942895 983982
63049I83982M2861M4706M6455M7811M8732M9490N0359N1134N1200N0281M9062
$$ 983982 1026843 1071549 1118004 1165815 1214547 1264037 1314396 1365530 1416730 1467011 1516073
63038A516073M8627M9227N0040N0302N0198N0304N0483M9789M7365M3035L7064
$$ 1516073 1564700 1613927 1663967 1714269 1764467 1814771 1865254 1915043 1962408 2005443 2042507
63027B042507K9741K1371J2337K914p008j7672k8882l9696m8951n6061o1149o4459
$$ 2042507 2072248 2093619 2105956 2108870 2101862 2084190 2055308 2015612 1966661 1910600 1849451 1784992
63015A784992o5949o5583o3688o0631n6420n0945m4524l7772l0999k4101j7095
$$ 1784992 1719043 1653460 1589772 1529141 1472721 1421776 1377252 1339480 1308481 1284380 1267285
63004A267285j0323m068J711P042J1608J5014J7157J8331J8994J9548K0162K0712
$$ 1267285 1256962 1252894 1254605 1261647 1273255 1288269 1305426 1323757 1342751 1362299 1382461 1403173
62992A403173K1053K1235K1473K1829K2144K2205K1765K0547J8448J5695J2533
$$ 1403173 1424226 1445461 1466934 1488763 1510907 1533112 1554877 1575424 1593872 1609567 1622100
62981A622100Q820M216j300p406j3849k0476k6919l2683l7607m1882m5482m7992
$$ 1622100 1630920 1635136 1633836 1626430 1612581 1592105 1565186 1532503 1494896 1453014 1407532 1359540
62969A359540m9103m8971m7950m6263m4109m1716l9171l6429l3602l0978k8669
$$ 1359540 1310437 1261466 1213516 1167253 1123144 1081428 1042257 1005828 972226 941248 912579
62958I12579k6521k4467k2636k1061j9603j8379j7786j7893j8102j7730j6714
$$ 912579 886058 861591 838955 817894 798291 779912 762126 744233 726131 708401 691687
62947F91687j5534j4592j3872j3049j1818j0239q862q270q434q725q592p982p121
$$ 691687 676153 661561 647689 634640 622822 612583 603721 595451 587017 578292 569700 561718 554597
62934E54597o275n792n890o175n835m557k944j816j386j390j532j560j255p52
$$ 554597 548322 542530 536640 530465 524630 520073 517129 515313 513927 512537 511005 509445 508190 507438
62920E07438n80r75j414j213l83N00J036J271J378J448J611J950K301K309J704
$$ 507438 506858 505883 504469 503256 502873 503373 504409 505680 507058 508506 510117 512067 514368 516677 518381
62905E18381M46j199k578k905j957l79Q95J464J520J341R66K73q28k150l068k969
$$ 518381 518827 517628 515050 512145 510188 509809 510704 512168 513688 515029 515995 516268 515440 513290 510222 507253
62889E07253k016j171j084j301r89j58M69O20Q26J480K127K071J325N26Q0k84
$$ 507253 505237 504066 502982 501681 500692 500534 501003 501623 502449 503929 506056 508127 509452 509978 510058 509774
62873E09774j038k191l233l697l568l146k704k367k163k033j890j851k188k773
$$ 509774 508736 506545 503312 499615 496047 492901 490197 487830 485667 483634 481744 479893 477705 474932
62859D74932k849j802j07J058J118N65J28M9K97Q41J438J702J621J531J434R40
$$ 474932 472083 470281 470174 471232 472350 472915 473043 473092 473389 474230 475668 477370 478991 480522 481956 482896
62843D82896J56j71J65L40j86o44q7J017J424R66O36R17J123O98K15N90J806K960
$$ 482896 483052 482881 483046 483386 483200 482556 482469 483486 484910 485876 486512 487429 488552 489250 489465 490055 491861 494821
62825D94821L339L128L105L784M843N490N382M893M445L997L478L108K908K395
$$ 494821 498160 501288 504393 508177 513020 518510 523892 528785 533230 537227 540705 543813 546721 549116
62811E49116J401P12J113K213L016L375L886M627N045N150N697O935Q171Q840
$$ 549116 550517 551229 552342 554555 557571 560946 564832 569459 574504 579654 585351 592286 600457 609297
62797F09297R186R487R554R445R897J1340J3200J4786J6385J8765K1948K5219
$$ 609297 618483 627970 637524 646969 656866 668206 681406 696192 712577 731342 753290 778509
62785G78509K8153L1076L4580L8981M4119M9450N4445N9174O4292P0102P5893
$$ 778509 806662 837738 872318 911299 955418 1004868 1059313 1118487 1182779 1252881 1328774
62774A328774Q0490Q3323Q4636Q4738Q3396P9976P4081O6089N6893M6978L5868
$$ 1328774 1409264 1492587 1577223 1661961 1745357 1825333 1899414 1965503 2022396 2069374 2105242
62763B105242K2902Q479o024j9582l2138m3753n3944o2355o9351p5300p9627q1389
$$ 2105242 2128144 2136623 2130599 2111017 2078879 2035126 1981182 1918827 1849476 1774176 1694549 1613160
62751A613160q0609p8378p5711p2822o9463o5431o0787n5961n1629m8081m4727
$$ 1613160 1532551 1454173 1378462 1305640 1236177 1170746 1109959 1053998 1002369 954288 909561
62740I09561m0724l6085l1697k8190k5306k2504j9740j7271j5095j3000j1102
$$ 909561 868837 832752 801055 772865 747559 725055 705315 688044 672949 659949 648847
62729F48847r876r512r453q790p214n372m130l516k738j282L37J264J432J581
$$ 648847 638971 629459 620006 611216 604002 598630 594500 590984 588246 586964 587301 588565 589997 591578
62715E91578K250L233M186N294O916Q865J0517J1765J3408J6233J9875K3108K5348
$$ 591578 593828 597061 601247 606541 613457 622322 632839 644604 658012 674245 694120 717228 742576
62702G42576K7412L0404L4163L7491L9802M1902M4789M8310N1508N3880N5684
$$ 742576 769988 800392 834555 872046 911848 953750 998539 1046849 1098357 1152237 1207921
62691A207921N7099N7745N7129N5074N1508M6186L8956L0068K0079R519j144j1444
$$ 1207921 1265020 1322765 1379894 1434968 1486476 1532662 1571618 1601686 1621765 1631284 1630140 1618696
62679A618696k1036k9845l7866m4842n0354n4225n6629n7799n7824n6851n5185
$$ 1618696 1597660 1567815 1529949 1485107 1434753 1380528 1323899 1266100 1208276 1151425 1096240
62668A096240n3002n0167m6593m2734l9289l6469l3892l1266k8707k6245k3567
$$ 1096240 1043238 993071 946478 903744 864455 827986 794094 762828 734121 707876 684309
62657F84309k0607j7974j6190j4871j3238j1336r994r580r510r141q527q004p566
$$ 684309 663702 645728 629538 614667 601429 590093 580099 570519 561009 551868 543341 535337 527771
62644E27771p058o575o212n773n018l997k796j344K19J271J309O18r9n66r80j400
$$ 527771 520713 514138 507926 502153 497135 493138 490342 488998 489217 490488 491797 492415 492316 491750 490770 489370
62628D89370j658j801k034k236j997j287n85k22m4J11J04l5J84J103K293L057
$$ 489370 487712 485911 483877 481641 479644 478357 477772 477550 477506 477617 477721 477686 477870 478973 481266 484323
62612D84323L321L584M102M648N085N621O303O803O961P241Q209R810J1564J3266
$$ 484323 487644 491228 495330 499978 505063 510684 516987 523790 530751 537992 546201 556011 567575 580841
62598E80841J5134J7291J9622K2127K5000K8234L1479L4440L7090L9356M0929
$$ 580841 595975 613266 632888 655015 680015 708249 739728 774168 811258 850614 891543
62587H91543M1630M1588M0727L8408L3944K7418J9710J1888M750j423p011j2776
$$ 891543 933173 974761 1015488 1053896 1087840 1115258 1134968 1146856 1151606 1150183 1143172 1130396
62575A130396j8956k4802k9355l2480l4665l6092l6577l6335l5927l5320l3762
$$ 1130396 1111440 1086638 1057283 1024803 990138 954046 917469 881134 845207 809887 776125
62564G76125l0971k7837k5495k4112k2937k1271j8954j6250j3628j1538j0054
$$ 776125 745154 717317 691822 667710 644773 623502 604548 588298 574670 563132 553078
62553E53078q928q083p764p959q049p445o298n222m460l709k643j252K28J400
$$ 553078 544150 536067 528303 520344 512295 504850 498552 493330 488870 485161 482518 481266 481494 482894
62539D82894J884J684J242R04N02j91q54r36m59N4M23J053K188L461M405N091
$$ 482894 484778 486462 487704 488608 489110 488919 488065 487129 486670 486724 487147 488200 490388 493849 498254 503345
62523E03345N911O999Q176R363J0748J2516J4664J7065J9609K2210K4751K7138
$$ 503345 509256 516255 524431 533794 544542 557058 571722 588787 608396 630606 655357 682495
62511F82495K9421L1751L4155L6358L7869L8295L7548L5806L3329L0242K6457
$$ 682495 711916 743667 777822 814180 852049 890344 927892 963698 997027 1027269 1053726
62500A053726K1818J6461J0920N723J012l270o860r177r911r280p650n184k047
$$ 1053726 1075544 1092005 1102925 1108648 1109660 1106390 1099530 1090353 1080442 1071162 1063512 1058328 1056281
62487A056281J405M969Q912J3595J8850K3998K8502L2331L5572L7800L7967L5083
$$ 1056281 1057686 1062655 1071567 1085162 1104012 1128010 1156512 1188843 1224415 1262215 1300182 1335265
62475A335265K9210K1748J4460Q081J910n225j3837k3547l3395m2146m8682n2668
$$ 1335265 1364475 1386223 1400683 1408764 1410674 1405449 1391612 1368065 1334670 1292524 1243842 1191174
62463A191174n4826n6180n7063n7014n5531n2601m8589m4054l9663l5896l2617
$$ 1191174 1136348 1080168 1023105 966091 910560 857959 809370 765316 725653 689757 657140
62452F57140k9158k5090k0775j7045j4326j2300j0319q073n769l808k410j566
$$ 657140 627982 602892 582117 565072 550746 538446 528127 520054 514285 510477 508067 506501
62440E06501j089o91j01O74J379J858K249K608K547J653J60j185j974k457k969
$$ 506501 505412 504721 504620 505294 506673 508531 510780 513388 515935 517588 517748 516563 514589 512132 509163
62425E09163l437l673l783m013m398m760m885m593l860k950k236j858j746j881
$$ 509163 505726 502053 498270 494257 489859 485099 480214 475621 471761 468811 466575 464717 462971 461090
62411D61090k167k207j755j405k031l369l988l081j547p20o82o16k55M0L15J155
$$ 461090 458923 456716 454961 453556 451525 448156 444168 441087 439540 438820 438138 437522 437267 437307 437622 438777
62395D38777K695M264N186N328M835L931L072K764L003L324L527L885M510N005
$$ 438777 441472 445736 450922 456250 461085 465016 468088 470852 473855 477179 480706 484591 489101 494106
62381D94106N051N003N568O974Q637R661R684R288R423J0409J1620J2388J2801
$$ 494106 499157 504160 509728 516702 525339 535000 544684 553972 563395 573804 585424 597812 610613
62368F10613J3375J4270J5412J7062J9592K2778K6008K9274L3283L8438M4285
$$ 610613 623988 638258 653670 670732 690324 713102 739110 768384 801667 840105 884390
62357H84390N0225N6163O2098O7535P1751P4274P4746P2600O7453N9711N0365
$$ 884390 934615 990778 1052876 1120411 1192162 1266436 1341182 1413782 1481235 1540946 1591311
62346A591311M0168K9346J8140P260k435j0676j7971k4997l1954l8536m4381m9196
$$ 1591311 1631479 1660825 1678965 1686225 1683790 1673114 1655143 1630146 1598192 1559656 1515275 1466079
62334A466079n2517n3816n3126n1242m9040m6796m4425m2019l9696l7199l4253
$$ 1466079 1413562 1359746 1306620 1255378 1206338 1159542 1115117 1073098 1033402 996203 961950
62323I61950l1224k8887k7486k6580k5796k5227k4910k4448k3415k1850k0116
$$ 961950 930726 901839 874353 847773 821977 796750 771840 747392 723977 702127 682011
62312F82011j8502j7132j5930j4594j2789j0687q979q191q045p702o577m912l532
$$ 682011 663509 646377 630447 615853 603064 592377 583398 575207 567162 559460 552883 547971 544439
62299E44439l070l305l363k661j480m53J71M92N03K20N6N08J447K251K664L011
$$ 544439 541369 538064 534701 532040 530560 530107 530278 530770 531273 531493 531549 532057 533504 535755 538419 541430
62283E41430L502L888M014M081M194M115L733L348L136K849K385K255K994M389
$$ 541430 544932 548820 552834 556915 561109 565224 568957 572305 575441 578290 580675 582930 585924 590313
62269E90313N862P340R270J1814J4576J7177J9724K2598K6082L0411L5851M2382
$$ 590313 596175 603515 612785 624599 639175 656352 676076 698674 724756 755167 791018 833400
62257H33400M9389N6028O1964O7476P2616P6556P8113P6784P2882O6731N8358
$$ 833400 882789 938817 1000781 1068257 1140873 1217429 1295542 1372326 1445208 1511939 1570297
62246A570297M8100L6881K5547J4325L286p204j6908k6141l5257m4074n2194n9379
$$ 1570297 1618397 1655278 1680825 1695150 1698436 1691232 1674324 1648183 1612926 1568852 1516658 1457279
62234A457279o5062o8203o8434o6865o4729o1753n7014n1075m5826m2159l9121
$$ 1457279 1392217 1324014 1255580 1188715 1123986 1062233 1005219 954144 908318 866159 827038
62223H27038l5633l1815k8168k4690k1403j8793j7141j6091j5290j4646j3679
$$ 827038 791405 759590 731422 706732 685329 666536 649395 633304 618014 603368 589689
62212E89689j1705r134p428p102o910n803m482l990l906l298k530k500k704j794
$$ 589689 577984 568850 561422 554320 547410 541607 537125 533135 529229 525931 523401 520901 518197 516403
62198E16403J43J556J761J860K915M531N758O366O680O869P057P526Q313R038
$$ 516403 516546 518102 519863 521723 524638 529169 534927 541293 547973 554842 561899 569425 577738 586776
62184E86776R415R568R661R615R416R153Q672P689O460N827O288P478Q854J0486
$$ 586776 596191 605759 615420 625035 634451 643604 652276 659965 666425 672252 678540 686018 694872 705358
62170G05358J2866J6301K0855K6523L3043L9739M5866N1026N5064N7678N8424
$$ 705358 718224 734525 755380 781903 814946 854685 900551 951577 1006641 1064319 1122743
62159A122743N7045N3562M8134M0989L2566K3606J4891O858n67p638j4381k0645
$$ 1122743 1179788 1233350 1281484 1322473 1355039 1378645 1393536 1400394 1399827 1392189 1377808 1357163
62147A357163k6441l1905l6851m0681m3018m4048m4029m2826m0284l6787l2951
$$ 1357163 1330722 1298817 1261966 1221285 1178267 1134219 1090190 1047364 1007080 970293 937342
62136I37342k8981k4785k0539j6633j3121r729o381l273n01K069M595P327J0683
$$ 937342 908361 883576 863037 846404 833283 823554 817173 813900 813399 815468 820063 827390 838073
62123H38073J4768J8856K1972K4036K5842K7871K9626L0366K9950K8683K6735
$$ 838073 852841 871697 893669 917705 943547 971418 1001044 1031410 1061360 1090043 1116778
62112A116778K4032K0440J5868J0406M588p77n197q684j1351j3143j4100j4491
$$ 1116778 1140810 1161250 1177118 1187524 1192112 1191335 1186138 1177454 1166103 1152960 1138860 1124369
62100A124369j4445j3720j2108r919p817o212m894l202o73K328M752N931O320
$$ 1124369 1109924 1096204 1084096 1074177 1066360 1060148 1055254 1052052 1051379 1053707 1058459 1064390 1070710
62087A070710O763P239P023O069N356N528O032O236O717Q508J1426J4135J5932
$$ 1070710 1077473 1084712 1091735 1097804 1103160 1108688 1114720 1120956 1127673 1136181 1147607 1161742 1177674
62074A177674J7533J9758K2196K3757K4132K4134K4616K5685K6970K8308K9856
$$ 1177674 1195207 1214965 1237161 1260918 1285050 1309184 1333800 1359485 1386455 1414763 1444619
62063A444619L1663L3388L4403L4173L2602L0004K6711K2724J7955J2732P672
$$ 1444619 1476282 1509670 1544073 1578246 1610848 1640852 1667563 1690287 1708242 1720974 1728646
62052A728646K949j872o924j1538j5199j8721k3537k9816l6158m1291m5238m8392
$$ 1728646 1731595 1729723 1722799 1711261 1696062 1677341 1653804 1623988 1587830 1546539 1501301 1452909
62040A452909n0513n1370n1678n2324n3013n2646n0956m8776m6659m4157m0763
$$ 1452909 1402396 1351026 1299348 1247024 1194011 1141365 1090409 1041633 994974 950817 910054
62029I10054l6844l3159k9965k7036k4286k1973k0366j9391j8587j7416j5785
$$ 910054 873210 840051 810086 783050 758764 736791 716425 697034 678447 661031 645246
62018F45246j4156j2962j2113j1323j0668j0349j0074r271p863o274m712l050
$$ 645246 631090 618128 606015 594692 584024 573675 563601 554330 546467 540193 535481 532431
62006E32431j450l21M51J511K966M053M291M254M573M818M115K535J061K04m89
$$ 532431 530981 530660 531111 532622 535588 539641 543932 548186 552759 557577 561692 564227 565288 565492 565003
61991E65003j526k745l779m750o032p544q734r205r118q839q482p938p255o571
$$ 565003 563477 560732 556953 552203 546171 538627 529893 520688 511570 502731 494249 486311 479056 472485
61977D72485n781m662l511l174l967m942m822l543k233j696j610j389j104j095
$$ 472485 466704 462042 458531 455357 451390 446448 441626 438083 435850 434154 432544 431155 430051 428956
61963D28956j220j061n86j29K01O12J213J806K160K281K342K519K887L405L965
$$ 428956 427736 426675 426089 425960 426161 426773 427986 429792 431952 434233 436575 439094 441981 445386 449351
61948D49351M467M888N375O339Q177J0749J3272J5096J6407J7761J9126J9987
$$ 449351 453818 458706 464081 470420 478597 489346 502618 517714 534121 551882 571008 590995
61936E90995K0309K0735K1599K2406K2546K2065K1292K0241J8826J7272J5781
$$ 590995 611304 632039 653638 676044 698590 720655 741947 762188 781014 798286 814067
61925H14067J4045J1552Q320M868J657j149l453n131o155o597o511n961m970l335
$$ 814067 828112 839664 847984 852852 854509 853360 849907 844776 838621 832024 825513 819552 814582 811247
61911H11247p60K637O196R328J1954J4052J5205J5095J4121J2937J1440Q919N248
$$ 811247 810487 813124 819320 828648 840602 854654 869859 884954 899075 912012 923452 932371 937619
61898I37619J297k139n315q982j3084j6559j8503j9143j9459k0064k0772k1161
$$ 937619 938916 936777 931462 922480 909396 892837 874334 855191 835732 815668 794896 773735
61886G73735k1093k0545j9364j7622j5975j5117j4903j4492j3421j2108j1138
$$ 773735 752642 732097 712733 695111 679136 664019 649116 634624 621203 609095 597957
61875E97957j0542r945r113q073o993o103n423m493k816o86R10J512J780K553
$$ 597957 587415 577470 568357 560284 553291 547188 541765 537272 534456 533770 534680 536192 537972 540525
61861E40525L870N334O946Q927J1103J3142J5208J7757K0761K3708K6312K8749
$$ 540525 544395 549729 556675 565602 576705 589847 605055 622812 643573 667281 693593 722342
61849G22342L1243L3789L6143L7727L7789L6201L3856L1707K9504K6183K1378
$$ 722342 753585 787374 823517 861244 899033 935234 969090 1000797 1030301 1056484 1077862
61838A077862J5811J0216M706m93m600p091q369q999q670o591k763J776N960R443
$$ 1077862 1093673 1103889 1108595 1108102 1103502 1096411 1088042 1079043 1070373 1063782 1061019 1062795 1068755 1078198
61824A078198J2324J4580J6016J6429J5534J2936Q515K852l064q726j4487k0802
$$ 1078198 1090522 1105102 1121118 1137547 1153081 1166017 1174532 1177384 1174320 1165594 1151107 1130305
61812A130305k7235l2495l5518l6327l5825l4929l3968l2720l0855k8448k5984
$$ 1130305 1103070 1070575 1035057 998730 962905 927976 894008 861288 830433 801985 776001
61801G76001k3801k1698j9410j7241j5714j4631j3169j1011q761p017n706m644
$$ 776001 752200 730502 711092 693851 678137 663506 650337 639326 630565 623548 617842 613198
61789F13198m016l705k944j359J36L84m75j343j722j964k216k203k029k171k504
$$ 613198 609182 605477 602533 601174 601310 601694 601219 599876 598154 596190 593974 591771 589742 587571 585067
61774E85067k380j831j768k553l301l183k646k675l429m231m525m176l232j975
$$ 585067 582687 580856 579088 576535 573234 570051 567405 564730 561301 557070 552545 548369 545137 543162
61760E43162r73n05j36O17J392J351L59p27r99l60O14J306J422R92K17o64j432
$$ 543162 542189 541684 541548 542165 543557 544908 545267 544540 543541 543181 543795 545101 546523 547515 547732 547068 545636
61743E45636j914k097k117j976j416l78N05M38m36r78m17P41J510J673J798K294
$$ 545636 543722 541625 539508 537532 536116 535738 536243 536681 536245 535267 534850 535591 537101 538774 540572 542866
61727E42866L052L765M202M242M034M016M361M669M550M347M674N413N753N263
$$ 542866 545918 549683 553885 558127 562161 566177 570538 575207 579757 584104 588778 594191 599944 605207
61713F05207M322L333K125M91j161k152k334k204k264k555k757k541j801p02M27
$$ 605207 609529 612862 614987 615478 614317 612165 609831 607627 605363 602808 600051 597510 595709 595007 595434
61698E95434J335J973K409K577K304J656J094J022J125N60r66k552l034k418j827
$$ 595434 596769 598742 601151 603728 606032 607688 608782 609804 610929 611489 610523 607971 604937 602519 600692
61683F00692j968k383k414k319k772l685m258m074l554l295l441l764l946l715
$$ 600692 598724 596341 593927 591608 588836 585151 580893 576819 573265 569970 566529 562765 558819 555104
61669E55104l025k252j876j987k238k258j916j324q50r87j776k491k376j550p12
$$ 555104 552079 549827 547951 545964 543726 541468 539552 538228 537378 536391 534615 532124 529748 528198 527486
61654E27486j24M10O66M9j246k006j488l86K45M26Q87J724K284K188J735J297
$$ 527486 527362 527772 528438 528487 527241 525235 523747 523361 523606 524032 524919 526643 528927 531115 532850 534147
61638E34147R42O76N88N95M06k10j240k435l343l593l406l417l742l693k856j945
$$ 534147 535089 535765 536353 536948 537354 537144 535904 533469 530126 526533 523127 519710 515968 512275 509419 507474
61622E07474j827k206k077j199j36R18K149L032K541P25j114k207l132m277m785
$$ 507474 505647 503441 501364 500165 500029 500947 503096 506128 508669 509394 508280 506073 502941 498664 493879
61607D93879m046l118l395m537n023m367l479l023k745k456k554l163l712l798
$$ 493879 489833 486715 483320 478783 473760 469393 465914 462891 460146 457690 455136 451973 448261 444463
61593D44463l779m147m850n497n789n542m762l886l466l529l640l649l839m240
$$ 444463 440684 436537 431687 426190 420401 414859 410097 406211 402745 399216 395576 391927 388088 383848
61579C83848m425m155l624k919j956j176j487k993m401m401l189j984j452j298
$$ 383848 379423 375268 371644 368725 366769 365593 364106 361113 356712 352311 349122 347138 345686 344388
61565C44388j115q37m59l6J7o95j653j626j68J532J869P05n19o39o4Q9l23m16
$$ 344388 343273 342436 341977 341941 341958 341263 339610 337984 337816 339348 341217 341922 341403 340764 340700 340789 340466 340050
61547C40050J95P25L94l84o94m45j96QO74J824K847L480M008M347L843K404R42
$$ 340050 340245 340970 341364 340980 340286 339841 339645 339653 340327 342151 344998 348478 352486 356833 360676 363080 364022
61530C64022J72k51q75j440j498j331j474j788j840j779j973k127j675q37l99
$$ 364022 364194 363943 363068 361628 360130 358799 357325 355537 353697 351918 349945 347818 346143 345306 344907
61515C44907m91n35l92n96j327j987k133k049k019j735r83l32m87j253j738j463
$$ 344907 344416 343881 343489 342893 341566 339579 337446 335397 333378 331643 330660 330328 329841 328588 326850 325387
61499C25387p99l33k32l38n67q85j080q12m5P30R54N98J42QJ37K44J89Q3J67O69
$$ 325387 324588 324255 324023 323685 323118 322233 321153 320341 320296 321026 321980 322578 322720 322728 322865 323109 323298 323381 323548 324217
61479C24217J488K109K069J563J162R98P31L54L67Q84J271J051N87L69K54n9l72
$$ 324217 325705 327814 329883 331446 332608 333606 334337 334691 335058 335942 337213 338264 338851 339220 339474 339415 339043
61462C39043m05l79m83l22L86J020Q54K29P6N56J084J371J482J154J89o53l59
$$ 339043 338638 338259 337776 337454 337840 338860 339714 339943 340019 340575 341659 343030 344512 345666 345855 345202 344843
61445C44843P30J165L77o64j014p56k13P64K127L203L529L364K954K097Q91R8
$$ 344843 345573 346738 347115 346451 345437 344681 344468 345232 347359 350562 354091 357455 360409 362506 363397 363495
61429C63495J47N54P89R81J267J272R25R66J857K845K946K326J892J993K332K749
$$ 363495 363642 364196 364985 365966 367233 368505 369430 370396 372253 375098 378044 380370 382262 384255 386587 389336
61413C89336L210L318K613J259j59j308k073k299k159k355l190l898l663k956
$$ 389336 392546 395864 398477 399736 399577 398269 396196 393897 391738 389383 386193 382295 378632 375676
61399C75676k846l333l386k591j635j082o79k37j90p91j433j398q51n04o22p82
$$ 375676 372830 369497 366111 363520 361885 360803 360124 359887 359697 358906 357473 356075 355224 354720 354098 353316
61383C53316n31J46Q80J230R54J82o36j030p90j04N20O62M91O37J354K082K131
$$ 353316 352785 352931 353811 355041 355995 356177 355541 354511 353721 353617 354137 354799 355290 355927 357281 359363 361494
61366C61494J601J211J332J657J825J820J752J685J802K292K886K957K414K153
$$ 361494 363095 364306 365638 367295 369120 370940 372692 374377 376179 378471 381357 384314 386728 388881
61352C88881L210N505P797Q919Q767Q121P765Q042Q971J0365J1717J2326J1896
$$ 388881 392091 397596 405393 414312 423079 431200 438965 447007 455978 466343 478060 490386 502282
61339E02282J0821R687Q660P652O771O109N236L579J307p64k223l372m368m854
$$ 502282 513103 522790 531450 539102 545873 551982 557218 560797 562104 561340 559117 555745 551377 546523
61325E46523m789m826n306n551m879l719k950k583j997j147n86l93L3R91K125
$$ 546523 541734 536908 531602 526051 521172 517453 514503 511920 509923 508776 508190 507797 507830 508821 510946
61310E10946L133M125N100N776O182O841Q035R359J0265J0623J0586J0166R306
$$ 510946 514079 518204 523304 529080 535262 542103 550138 559497 569762 580385 590971 601137 610443
61297F10443Q031O384M369K188K25j280k455l586m831o131p213p748p735p556
$$ 610443 618474 624858 629227 631415 631640 630360 627905 624319 619488 613357 606144 598396 590661 583105
61283E83105p449p082o034m567l443k997k804k287j294rJ284K323L035L565L960
$$ 583105 575656 568574 562540 557973 554530 551533 548729 546442 545148 545139 546423 548746 551781 555346 559306
61268E59306L944L427K972L259M147M920N368N961O946P953Q767R697J0908J1967
$$ 559306 563250 566677 569649 572908 577055 581975 587343 593304 600250 608203 616970 626667 637575 649542
61254F49542J2533J2962J3714J4422J4125J2345R630P025N115L505J284j845n009
$$ 649542 662075 675037 688751 703173 717298 729643 739273 746298 751413 754918 756202 754357 749348
61241G49348p074p927q365q805q843q197p281o520n754m815m018l565k939j567
$$ 749348 742274 734347 725982 717177 708334 700137 692856 686336 680582 675767 671749 668184 665245 663678
61227F63678K65J781K713L385M000M521N119O084P255Q015Q020P562P153P024
$$ 663678 663943 665724 668437 671822 675822 680343 685462 691546 698801 706816 714836 722398 729551 736575
61213G36575P013O719N827M518L457L077K989K499J623J160J646K735L777M642
$$ 736575 743588 750307 756134 760652 764109 767186 770175 772674 774297 775457 777103 779838 783615 788257
61199G88257N681P122Q858J0744J2795J5029J7308J9489K1625K3753K5517K6254
$$ 788257 793938 801060 809918 820662 833457 848486 865794 885283 906908 930661 956178 982432
61187I82432K5654K4141K2326K0317J7868J5136J2714J0846R195P501N972M697
$$ 982432 1008086 1032227 1054553 1074870 1092738 1107874 1120588 1131434 1140629 1148130 1154102 1158799
61175A158799L304J622J60p18j706l814o927r863j1922j3530j5240j6973j8604
$$ 1158799 1162103 1163725 1163885 1163167 1161461 1157647 1150720 1140857 1128935 1115405 1100165 1083192 1064588
61162A064588k0481k2694k4379k4620k3721k2838k2386k1657k0111j8209j6535
$$ 1064588 1044107 1021413 997034 972414 948693 925855 903469 881812 861701 843492 826957
61151H26957j4791j2346r500p282o069n102l667k181j524j706j829j373r08j277
$$ 826957 812166 799820 790320 783038 776969 771867 768200 766019 764495 762789 760960 759587 758679 757402
61137G57402k438l539l920l628k906j625M13K845M878O196P362R077J1328J3642
$$ 757402 754964 751425 747505 743877 740971 739346 739759 742604 747482 753678 761040 770117 781445 795087
61123G95087J5962J8638K1621K4315K6525K8852L1668L4294L5924L6976L8556
$$ 795087 811049 829687 851308 875623 902148 931000 962668 996962 1032886 1069862 1108418
61112A108418M0685M2035M1726M0422L9177L7862L5593L2246K8745K5812K3145
$$ 1108418 1149103 1191138 1232864 1273286 1312463 1350325 1385918 1418164 1446909 1472721 1495866
61101A495866K0014J6211J2115Q101M091m01n898j2474j9452k5647l0088l2697
$$ 1495866 1515880 1532091 1544206 1552307 1556398 1555997 1550099 1537625 1518173 1492526 1462438 1429741
61089A429741l4280l5842l7757l9563m0499m0228l9063l7626l6335l5142l3665
$$ 1429741 1395461 1359619 1321862 1282299 1241800 1201572 1162509 1124883 1088548 1053406 1019741
61078A019741l1609k9140k6799k4903k3118k0798j7743j4475j1771r994q854p653
$$ 1019741 988132 958992 932193 907290 884172 863374 845631 831156 819385 809391 800537 792884
61066G92884n911l857k272j639j538j095Q6J739L445M991O247P113P710Q338R181
$$ 792884 786973 783116 780844 779205 777667 776572 776658 778397 781842 786833 793080 800193 807903 816241 825422
61051H25422J0313J1939J4206J6757J8932K0586K2238K4278K6470K8440L0173
$$ 825422 835735 847674 861880 878637 897569 918155 940393 964671 991141 1019581 1049754
61040A049754L1661L2596L2889L3182L4246L5947L7283L7545L7040L6683L7028
$$ 1049754 1081415 1114011 1146900 1180082 1214328 1250275 1287558 1325103 1362143 1398826 1435854
61029A435854L7842L8475L8594L8554L8961L9876M0782M1330M1761M2423M3304
$$ 1435854 1473696 1512171 1550765 1589319 1628280 1668156 1708938 1750268 1792029 1834452 1877756
61018A877756M4396M6184M9264N3679N9046O5346P3042Q2405R3126J04856J17943
$$ 1877756 1922152 1968336 2017600 2071279 2130325 2195671 2268713 2351118 2444244 2549100 2667043
61007B667043J33571J53318J78640K10629K50234K98826L58618M32730N25019
$$ 2667043 2800614 2953932 3132572 3343201 3593435 3892261 4250879 4683609 5208628
60998E208628O39793P80705R48405J137824J336510J524389J674245J753719J731881
$$ 5208628 5848421 6629126 7577531 8715355 10051865 11576254 13250499 15004218 16736099
60989A6736099J592166J346806J041415P41172N03600L55121K85523K58516K25863
$$ 16736099 18328265 19675071 20716486 21457658 21961258 22316379 22601902 22860418 23086281
60980B3086281J38645l9906l17759o64005j018286j317414j520885j619370j626627
$$ 23086281 23224926 23185020 22867261 22203256 21184970 19867556 18346671 16727301 15100674
60971A5100674j566352j462807j336333j201710j068225r40949q22370p13745
$$ 15100674 13534322 12071515 10735182 9533472 8465247 7524298 6701928 5988183
60963E988183o15957n29714m55056l91026l36254k89819k51217k19467j92821
$$ 5988183 5372226 4842512 4387456 3996430 3660176 3370357 3119140 2899673 2706852
60954B706852j69691j49526j32394j17900j05091r3499q3602p5893o9922o4833
$$ 2706852 2537161 2387635 2255241 2137341 2032250 1938751 1855149 1779256 1709334 1644501
60944A644501o0541n7655n6176n5058n3373n1280m9365m7499m5063m2004l8979
$$ 1644501 1583960 1526305 1470129 1415071 1361698 1310418 1261053 1213554 1168491 1126487 1087508
60933A087508l6483l4376l2393l0504k8701k6847k5026k3619k2762k1965k0619
$$ 1087508 1051025 1016649 984256 953752 925051 898204 873178 849559 826797 804832 784213
60922G84213j8705j6784j5374j4503j3810j2921j1680j0169q532o923n585m816
$$ 784213 765508 748724 733350 718847 705037 692116 680436 670267 661735 654812 649227 644411
60910F44411m668m754m552l842k771j653q70p49j206j634j591j387j584k039k099
$$ 644411 639743 634989 630437 626595 623824 622171 621301 620552 619346 617712 616121 614734 613150 611111 609012
60895F09012j760j801k520l111k865k248k074k148j672p04k11o53j512k326l252
$$ 609012 607252 605451 602931 599820 596955 594707 592633 590485 588813 588109 587898 587245 585733 583407 580155
60880E80155m271m745m458m302n103o289o583n756m769m307m159m069m244m721
$$ 580155 575884 571139 566681 562379 557276 550987 544404 538648 533879 529572 525413 521344 517100 512379
60866E12379m966m584l813k984k004q05K48R12J575K700M030M866M828L982K610
$$ 512379 507413 502829 499016 496032 494028 493223 493471 494383 495958 498658 502688 507554 512382 516364 518974
60851E18974J335J027J955L350M392N181O087O645O103M731L532K733J686K94
$$ 518974 520309 521336 523291 526641 531033 536214 542301 548946 555049 559780 563312 566045 567731 568025
60837E68025p12j113j635k564l113k762k186k083k009j359o49p40j334j405q27
$$ 568025 567313 566200 564565 562001 558888 556126 553940 551857 549848 548489 547840 547100 545766 544361 543534
60822E43534m85q73j532j962k237k538k777k839k837k933l312m193n475o449o353
$$ 543534 543049 542176 540644 538682 536445 533907 531130 528291 525454 522521 519209 515016 509541 503092 496739
60807D96739n285m180l858m315m865m770l886k886k601k926k852j892r33j054
$$ 496739 491454 487274 483416 479101 474236 469466 465580 462694 460093 457167 454315 452423 451490 450436
60793D50436k029k700k424j503m63K54K18n11j067p75j63j04k56M18J695K132
$$ 450436 448407 445707 443283 441780 441317 441571 441789 441278 440211 439436 439273 439169 438913 439331 441026 443158
60777D43158J283N23J088K427L282L441L585M091M846N776O807P600P913P964
$$ 443158 444441 444964 446052 448479 451761 455202 458787 462878 467724 473500 480307 487907 495820 503784
60763E03784Q014P869P327O684O337O172N810N206M551L850K989K071J285O81
$$ 503784 511798 519667 526994 533678 540015 546187 551997 557203 561754 565604 568593 570664 571949 572630
60749E72630K83K30N20R15J312J778K099J721N41p31j475k008l023m482n624n890
$$ 572630 572913 573143 573663 574578 575890 577668 579767 581488 582029 581298 579823 577815 574792 570310 564686 558796
60733E58796n437m802m430m380m283l741k929k495k628k754k324j512p26MP62
$$ 558796 553359 548557 544127 539747 535464 531723 528794 526299 523671 520917 518593 517081 516355 516359 517121
60718E17121J394J876K592L668M573M980N455O550P795Q444Q773R528J0466J0636
$$ 517121 518515 520391 522983 526651 531224 536204 541659 548209 556004 564448 573221 582749 593215 603851
60704F03851J0071R975J0952J2234J3060J3783J5055J6665J7822J8147J7811J7162
$$ 603851 613922 623897 634849 647083 660143 673926 688981 705646 723468 741615 759426 776588
60692G76588J6628J6634J7167J7724J7971J8088J8334J8638J8935J9361J9809
$$ 776588 793216 809850 827017 844741 862712 880800 899134 917772 936707 956068 975877
60681I75877J9760J9007J8054J7404J6820J5732J3953J1586Q707N604K878O64
$$ 975877 995637 1014644 1032698 1050102 1066922 1082654 1096607 1108193 1116900 1122504 1125382 1126046
60669A126046j811n139q607j1029j2497j4222j6678j8951k0295k1195k2325k3250
$$ 1126046 1124235 1119096 1110489 1099460 1086963 1072741 1056063 1037112 1016817 995622 973297 950047
60657I50047k3120k2106k1232k0895k0401j9086j7230j5593j4507j3774j3109
$$ 950047 926927 904821 883589 862694 842293 823207 805977 790384 775877 762103 748994
60646G48994j2419j1731j1082j0458r786r025q305p892p910q167q295q036p427
$$ 748994 736575 724844 713762 703304 693518 684493 676188 668296 660386 652219 643924 635888 628461
60633F28461o757o262n859n217m160k900j741q21k13j00m57q04o80l13l50r16
$$ 628461 621704 615442 609583 604366 600206 597306 595565 594744 594531 594431 593974 593170 592490 592177 591827 590911
60617E90911j516j895k449l452m441m811m596m263m014l842l926m432n071n362
$$ 590911 589395 587500 585051 581599 577158 572347 567751 563488 559474 555632 551706 547274 542203 536841
60603E36841n333n424n793o094n944n258m262l544l766m785n340m422k762k046
$$ 536841 531508 526084 520291 514197 508253 502995 498733 495189 491423 486638 481298 476876 474114 472068
60589D72068k638l123k414j230q26j195j416j194j003j040r68o99o01q19j021
$$ 472068 469430 466307 463893 462663 461837 460642 459226 458032 457029 455989 455021 454322 453721 452902 451881
60574D51881q82l68M99J633K636L103L308M058N689P624R136J0096J0699J0870
$$ 451881 450999 450631 451130 452763 455399 458502 461810 465868 471557 479181 488317 498413 509112 519982
60560E19982J0395R388Q211O958N325L066L52k293m284n199m983m047l067k511
$$ 519982 530377 539765 547976 554934 560259 563325 563677 561384 557100 551901 546918 542871 539804 537293
60546E37293k307k010j254p0J247K436L425M275N072N837O387O372N571M235K926
$$ 537293 534986 532976 531722 531652 532899 535335 538760 543035 548107 553944 560331 566703 572274 576509 579435
60531E79435J992J255L87n87j268j402j183j020j094j236j269j232j263j329j330
$$ 579435 581427 582682 583069 582482 581214 579812 578629 577609 576515 575279 574010 572778 571515 570186 568856
60516E68856j302j309j157n80K66Q72J109J428K050K486K286J806J710K066K632
$$ 568856 567554 566245 565088 564508 564774 565646 566755 568183 570233 572719 575005 576811 578521 580587 583219
60501E83219L700N713Q283J0527J2429J4929J8457K2364K6009K9411L2364L3849
$$ 583219 586919 592632 600915 611442 623871 638800 657257 679621 705630 735041 767405 801254
60489H01254L3049L0221K6009K0532J3744O035k198j0871j9396k6319l0576l2527
$$ 801254 834303 864524 890533 911065 924809 930844 928646 917775 898379 872060 841484 808957
60477H08957l2962l1909k9490k6981k5526k4306k1690j7990j5289j4398j3844
$$ 808957 775995 744086 714596 687615 662089 637783 616093 598103 582814 568416 554572
60466E54572j2375j0711r908r476q453p256o983p481p536o749n983n878n955n466
$$ 554572 542197 531486 521578 512102 503649 496393 489410 481929 474393 467644 461661 455783 449828 444362
60452D44362m434l501l131l184l091k420j379o47n98r11j088j016p16n2Q30J200
$$ 444362 439928 436427 433296 430112 427021 424601 423222 422575 421977 421066 419978 418962 418246 418194 419024 420224
60436D20224N31n57r51n17k19o43j241j311j006q13o56k01K26r6j131j864j549
$$ 420224 420755 420198 419247 418730 418511 417868 416627 415316 414310 413497 412841 412640 412866 412770 411639 409775 408226
60419D08226o27o5j23k18J89R99J707J857J344N97L49Q58J475J409Q85Q66J574
$$ 408226 407599 407534 407411 407193 407382 408381 410088 411945 413289 413886 414235 415093 416568 417977 418862 419728 421302
60402D21302K031J480M69l8m0j52l56r3N67Q70N72L77Q47J634K099K135K027J924
$$ 421302 423333 424813 425282 425244 425204 425052 424696 424603 425170 426040 426612 426989 427836 429470 431569 433704 435731 437655
60384D37655J852J901K103K337K527K644K520K053J619J704K039J761O92k68l91
$$ 437655 439507 441408 443511 445848 448375 451019 453539 455592 457211 458915 460954 462715 463407 463139 462748
60369D62748o3Jj18K7L02L02K86Q83J919K413J868R03L98N01P78Q97R13J096J647
$$ 462748 462685 462686 462568 462595 462897 463199 463485 464368 466287 468700 470568 471471 471869 472370 473148 474045 474958 476054 477701
60350D77701K465L163L499L715M218M997N710O281O977P799Q314Q218P781P333
$$ 477701 480166 483329 486828 490543 494761 499758 505468 511749 518726 526525 534839 543057 550838 558171
60336E58171O629N118K782L24j627l202m887o541p285o611n287m633m948n200
$$ 558171 564800 569918 572700 573024 571397 568195 563308 556767 549482 542871 537584 532951 528003 522803
60322E22803m460l107k255k329k714k609j756m48P31J234J059R37J607K901L982
$$ 522803 518343 515236 512981 510652 507938 505329 503573 503125 503856 505090 506149 507086 508693 511594 515576
60307E15576M525N214O855R455J2461J5523J8547K1161K2632K2372K0277J6548
$$ 515576 520101 525315 532170 541625 554086 569609 588156 609317 631949 654321 674598 691146
60295F91146J1482N605k34n193q947j1672j3542j4384j3902j2127r410o188k931
$$ 691146 702628 708233 707999 702806 693859 682187 668645 654261 640359 628232 618822 612634 609703
60282F09703k86J103J018j94j980l896n631p063q305r450j0175r974q943p923
$$ 609703 609417 610520 611538 611344 609364 605468 599837 592774 584469 575019 564844 554870 545927 538004
60268E38004p599p756p730p272o623n973n285m514l628k554j368m28oN2j7k83
$$ 538004 530405 522649 514919 507647 501024 495051 489766 485252 481624 479070 477702 477274 477268 477320 477303 477020
60252D77020p74j077p50l9L95K77j98r16j771k208j605j98J044J616J829J917
$$ 477020 476246 475169 474419 474380 474775 475052 474854 473938 472167 469959 468354 468156 469200 470816 472645 474562
60236D74562J613R71P79J549K668L156K872K454K397K662K954K981K674K474K992
$$ 474562 476175 477146 477925 479474 482142 485298 488170 490624 493021 495683 498637 501618 504292 506766 509758
60221E09758M047M508L658K253J655K208L157L859M315M644M840N037N432N890
$$ 509758 513805 518313 521971 524224 525879 528087 531244 535103 539418 544062 548902 553939 559371 565261
60207E65261O140O300O663P031O936O422N937N469M550L276K461K478K692K437
$$ 565261 571401 577701 584364 591395 598331 604753 610690 616159 620709 623985 626446 628924 631616 634053
60193F34053J884J484J130M36n82j589k372k823k836k623k689l152l513l541l802
$$ 634053 635937 637421 638551 638987 638405 636816 634444 631621 628785 626162 623473 620321 616808 613267 609465
60178F09465m747n747n779m753l458k423j632j124j078j188q27L9P10P41M63L54
$$ 609465 604718 598971 593192 588439 584981 582558 580926 579802 578724 577536 576709 576748 577458 578199 578662 579016
60162E79016M61P10J234J987K463K180J289M56K94R42J983K716K769K446K169
$$ 579016 579477 580187 581421 583408 585871 588051 589340 589796 590090 591032 593015 595731 598500 600946 603115
60147F03115J813J068L58O42K111L822M911N535O223O984P585Q194R056R853J0037
$$ 603115 604928 605996 606354 606996 609107 612929 617840 623375 629598 636582 644167 652361 661417 671270 681307
60132F81307R547Q695P590O188M725L462K169M61j387k571k736k357k074k074
$$ 681307 690854 699549 707139 713327 718052 721514 723683 724144 722757 720186 717450 715093 713019 710945
60118G10945k194k248k016j322l02N98J077J211J113N84o46k349l664l786k937
$$ 710945 708751 706503 704487 703165 702863 703461 704538 705749 706862 707446 706800 704451 700787 697001 694064
60103F94064k338k990m548n809o227o257o256n818m686l443k644j826l21J446
$$ 694064 691726 688736 684188 678379 672152 665895 659639 653821 649135 645692 643048 641222 640901 642347
60089F42347K408K426K418K995L868M667N462O258O747O796O569O041N048L894
$$ 642347 644755 647181 649599 652594 656462 661129 666591 672849 679596 686392 692961 699002 704050 707944
60075G07944L102K363O92k037m566n897o547p534q773r382r088q508q190q086
$$ 707944 711046 713409 714101 712064 707498 701601 695054 687520 678747 669365 660277 651769 643579 635493
60061F35493p894p354o371n308m904n435o179o242n679n202m974m377k954j030
$$ 635493 627599 620245 613874 608566 603662 598227 592048 585806 580127 574925 569951 565574 562620 561590
60047E61590O66J601J711J487J828L307N577P746R204R775R365Q071O575N627
$$ 561590 562256 563857 565568 567055 568883 572190 577767 585513 594717 604492 613857 621928 628503 634130
60033F34130N061L950J933k09j567k162k634l350m281n359o510p476q143q868
$$ 634130 639191 643141 645074 644865 643298 641136 638502 635152 630871 625512 619002 611526 603383 594515
60019E94515j0023j1206j1432j0257q369o888o286o193n999n343m236l026k263
$$ 594515 584492 573286 561854 551597 543228 536340 530054 523861 517862 512519 508283 505257 502994
60006E02994k204k427k242j550r33p41n89q7M59O18P28J414K412K786K399K248
$$ 502994 500790 498363 496121 494571 493638 492897 492308 492221 492680 493298 494026 495440 497852 500638 503037 505285
59990E05285L035M205M866N043N366O081O892P371O993N313K687L84p60j364k516
$$ 505285 508320 512525 517391 522434 527800 533881 540773 548144 555137 560450 563137 563521 562761 561397 558881
59975E58881m153n258n382m994m568m237m231m613m592l223r35P00J008R22J277
$$ 558881 554728 549470 544088 539094 534526 530289 526058 521445 516853 513630 512695 513395 514403 515325 516602
59960E16602J635J406J052J170J288O69k65m79M7L80J15k40k97k29n7M64J043
$$ 516602 518237 519643 520695 521865 523153 523822 523557 523078 523125 523505 523620 523380 523083 522854 522797 523261 524304
59943E24304Q49k58j252j257p28p73j702k832l531l830m066m312m331l897l069
$$ 524304 525153 524895 523643 522386 521658 520885 519183 516351 512820 508990 504924 500612 496281 492384 489315
59928D89315k168j433p65oO61Q47N39K02J74L14L92M95P82J191J637K210K840
$$ 489315 487147 485714 484949 484943 485604 486451 486990 487192 487366 487680 488072 488567 489349 490540 492177 494387 497227
59911D97227L109K787K324K356K900L428L633L595L347K830K287K143K361K383
$$ 497227 500336 503123 505447 507803 510703 514131 517764 521359 524706 527536 529823 531966 534327 536710
59897E36710J902J290J055J380K286L716N191N849N385M589M550N457O630P427
$$ 536710 538612 539902 540957 542337 544623 548339 553530 559379 564764 569353 573903 579360 585990 593417
59883E93417P763P872Q063Q623R551J0364J0460R646Q167O359M537K903J258r80
$$ 593417 601180 609052 617115 625738 635289 645653 656113 665759 673926 680285 684822 687725 688983 688003
59869F88003l985o969q856r363r061q559q187q234q756r192q856p808o688n683
$$ 688003 684018 677049 668193 658830 649769 641210 633023 624789 616033 606841 597985 590177 583489 577806
59855E77806m507l321k799k924k631j154R75K796M167N480O682P349P460P442
$$ 577806 573299 569978 567179 564255 561624 560470 561445 564241 568408 573888 580570 587919 595379 602821
59841F02821P554P635P414O686N430M044L164K967K991K934L152L897M532M154
$$ 602821 610375 618010 625424 632110 637540 641584 644748 647715 650706 653640 656792 660689 665221 669375
59827F69375K653N23j988m809p361q873r429r989j1144j2403j2844j2116j0591
$$ 669375 672028 672551 670563 665754 658393 649520 640091 630102 618958 606555 593711 581595 571004
59814E71004q995p875p228o565n601m654m088l659k956k145j628j147j64R64J149
$$ 571004 562009 554134 546906 540341 534740 530086 525998 522339 519383 517238 515610 514463 514299 515263 516412
59799E16412J75p78p28j94l22j314k419l099l427l489l171k579k092j850j544
$$ 516412 516587 515809 515081 514887 514565 513251 510832 507733 504306 500817 497646 495067 492975 491125 489581
59784D89581r47l57k29n13o48k69L24N69L72J76L01N63O18M09O0l84q41j003o60
$$ 489581 488634 488277 488048 487535 486887 486618 486942 487511 487883 488059 488360 488923 489541 489950 490010 489626 488785 487782 487122
59765D87122n9L48M66N96J035J864K961L946M311L959L459L449L922M487N044
$$ 487122 487063 487411 487877 488473 489508 491372 494333 498279 502590 506549 510008 513457 517379 521866 526910
59750E26910N740O403O626O375N995N637N187M669M232L780L116K429K034J683
$$ 526910 532650 539053 545679 552054 558049 563686 568873 573542 577774 581554 584670 587099 589133 590816
59736E90816Q17m77j440j693j677j870k191k336k137j461l57N56N69m1j69O06
$$ 590816 591633 591156 589716 588023 586346 584476 582285 579949 577812 576351 575994 576550 577119 577078 576909 577515
59720E77515J402J365Q06N09O08P51Q81J193J669K173K666K898K487J660J321
$$ 577515 578917 580282 581088 581597 582205 582956 583837 585030 586699 588872 591538 594436 596923 598583 599904
59705E99904J846K437K306J855J838K018J648Q43M01M70N31N91J291K575L288
$$ 599904 601750 604187 606493 608348 610186 612204 613852 614695 615096 615566 616097 616688 617979 620554 623842
59690F23842K485M97j595k996l546l493l210k744j730j08J269J435O38Lm1j48
$$ 623842 626327 626824 625229 622233 618687 615194 611984 609240 607510 607402 608671 610106 610744 610747 610706 610558
59674F10558o64r53n96k57o81j592k380l215m511n791o143n594n040m768m149
$$ 610558 609894 608941 608345 608088 607407 605815 603435 600220 595709 589918 583775 578181 573141 568373 564224
59659E64224k951k034k135k722k679j702l48R82K307L432L827L425K981L151L515
$$ 564224 561273 559239 557104 554382 551703 550001 549653 550635 552942 556374 560201 563626 566607 569758 573273
59644E73273L073J541k52j404j895k346l044l583l385k362j007K4M27M49O32J245
$$ 573273 576346 577887 577635 576231 574336 571990 568946 565363 561978 559616 558609 558633 559060 559509 560141 561386
59628E61386J963K113J315j25j425k012j956j755j641j341o12J46J97n71j416
$$ 561386 563349 565462 566777 566652 565227 563215 561259 559504 557863 556522 555910 556056 556253 555682 554266
59613E54266j645j380j133q76j14J286K822M080N174O190O589N740L859J986Q78
$$ 554266 552621 551241 550108 549232 549118 550404 553226 557306 562480 568670 575259 580999 584858 586844 587722
59598E87722L34k63j078j814k308k708l042l033k513j853j660k112k715k857k536
$$ 587722 588056 587793 586715 584901 582593 579885 576843 573810 571297 569444 567784 565672 562957 560100 557564
59583E57564k450l170m246m502l415j911j333j830k340k159j756j849k312k474
$$ 557564 555114 551944 547698 543196 539781 537870 536537 534707 532367 530208 528452 526603 524291 521817
59569E21817j975r01N03J758K255J983J721J977K204J758J142J300K004K048J081
$$ 521817 519842 518941 519444 521202 523457 525440 527161 529138 531342 533100 534242 535542 537546 539594 540675
59554E40675J25P2N91R78J118J191J071O96M83R01J814K715L347L992N326P947
$$ 540675 540800 540872 541463 542441 543559 544750 545821 546517 547000 547901 549715 552430 555777 559769 565095 573042
59538E73042J1619J5085J7167J7927J7996J7000J3844Q749L727N14q92j116k7
$$ 573042 584661 599746 616913 634840 652836 669836 683680 692429 696156 696670 695778 694662 694635
59525F94635K539N659Q054R422J0136J0276R792Q996P948N940K637r07l516n622
$$ 694635 697174 702833 710887 720309 730445 740721 750513 759509 767457 773397 776034 775127 771611 765989
59511G65989q396j1638j3969j4940j5466j6008j5871j4602j2853j1334r924q407
$$ 765989 757593 745955 731986 717046 701580 685572 669701 655099 642246 630912 620988 612581
59499F12581p141o386n722m732l647k831k139j288m48%m1l10l74K29J591L148
$$ 612581 605440 599054 593332 588600 584953 582122 579983 578695 578247 578247 578206 577896 577522 577751 579342 582490
59483E82490M252N036O054P155P550P205P272Q636J0776J2526J3291J3046J1715
$$ 582490 586742 591778 597832 604987 612537 619742 627014 635650 646426 658952 672243 685289 697004
59470F97004R336O511M039K270J101L43j87n75n70K59J903L819N745P997J0727
$$ 697004 706340 712851 716890 719160 720261 720604 720417 719842 719272 719531 721434 725253 730998 738995 749722
59455G49722J3436J5674J7674J9855K2088K4032K5707K7143K7889K7379K5430
$$ 749722 763158 778832 796506 816361 838449 862481 888188 915331 943220 970599 996029
59444I96029K1715J5365O044m748j4423k1478k6147k8976k9783k8437k5812k3253
$$ 996029 1017744 1033109 1039153 1034405 1019982 998504 972357 943381 913598 885161 859349 836096
59432H36096k1375j9944j8560j6958j4835j2052r023o406m195j565K112O368J0178
$$ 836096 814721 794777 776217 759259 744424 732372 723349 716943 712748 711183 713295 719663 729841
59419G29841J3210J6029J9069K1976K4170K5657K6805K7614K7615K6200K2689
$$ 729841 743051 759080 778149 800125 824295 849952 876757 904371 931986 958186 980875
59408I80875J6318O934m178j4660k2410k6420k6654k3799j9151j3981q844m117
$$ 980875 997193 1004127 999949 985289 962879 936459 909805 886006 866855 852874 844030 839913
59396H39913j177j988o941j3871j9879k3669k5517k5728k4221k1372j8255j5735
$$ 839913 838736 836748 829807 815936 796057 772388 746871 721143 696922 675550 657295 641560
59384F41560j3924j2531j1252r756p874n996m783m346m052l262j954m90P33J375
$$ 641560 627636 615105 603853 594097 586223 580227 575444 571098 567046 563784 561830 561340 562073 563448
59370E63448J265P27M46P16J109J118R31J218K284L749N044N925O465O862P423
$$ 563448 564713 565440 565886 566602 567711 568829 569760 570978 573262 577011 582055 587980 594445 601307 608730
59355F08730Q551J0439J2772J4913J6551J8002J9777K1913K4015K5818K7412K8756
$$ 608730 617281 627720 640492 655405 671956 689958 709735 731648 755663 781481 808893 837649
59343H37649K9375K8869K7508K5932K4256K1876J8243J3488Q080K217m042j0113
$$ 837649 867024 895893 923401 949333 973589 995465 1013708 1027196 1035276 1037493 1033451 1023338
59331A023338j4967j8126k0274k2525k5151k7326k8072k7191k5212k2833k0549
$$ 1023338 1008371 990245 969971 947446 922295 894969 866897 839706 814494 791661 771112
59320G71112j8572j6750j4786j2681j0887r807r264q660p556n952m241l040k866
$$ 771112 752540 735790 721004 708323 697436 687629 678365 669705 662149 656197 651956 648916 646050
59307F46050l557m191l926k855j717r07k09O25J603K917N035Q054J1315J4012
$$ 646050 642493 638302 634376 631521 629804 628897 628688 629313 630916 633833 638868 646922 658237 672249
59293F72249J5873J6956J6968J5226J1369N975L21m372p577r419j0113r662q123
$$ 672249 688122 705078 722046 737272 748641 754616 754937 750565 742988 733569 723456 713794 705671
59280G05671n900l468r44J845M883P896J0714J3384J5884J7986J9491K0410K0888
$$ 705671 699771 696303 695359 697204 702087 709983 720697 734081 749965 767951 787442 807852 828740
59267H28740K0949K0330J8528J5247J0954O625K733j099n149q835j1550j3695
$$ 828740 849689 870019 888547 903794 914748 921373 924106 923007 917858 909023 897473 883778
59255H83778j6026j8222j9187j8763j8050j7795j7421j6111j4022j1860r897p995
$$ 883778 867752 849530 830343 811580 793530 775735 758314 742203 728181 716321 706424 698429
59243F98429o105m242k298k07K043M693P942J1174J3178J3509J2957J2211J0890
$$ 698429 692324 688082 685784 685577 687620 692313 700255 711429 724607 738116 751073 763284 774174
59230G74174Q532N734L388J274j548n167q595j1118j3017j4853j6575j7599j7468
$$ 774174 782706 788440 791828 793102 791554 786387 777792 766674 753657 738804 722229 704630 687162
59217F87162j6336j4936j3898j3025j1576r520p868p358p378o857n747m758m071
$$ 687162 670826 655890 641992 628967 617391 607871 600003 592645 585267 578410 572663 567905 563834
59204E63834l249k260j610j376j051n03k70o11r47o41J71R41J421J691J807J815
$$ 563834 560585 558325 556715 555339 554288 553785 553515 552904 551957 551316 551487 552428 553849 555540 557347 559162
59188E59162J897K295L115M250N354N966N966N866O367P517Q697R375R593R660
$$ 559162 561059 563354 566469 570719 576073 582039 588005 593871 600238 607755 616452 625827 635420 645080
59174F45080R731R808R876R938J0108J0652J1717J3009J4104J4974J5876J6657
$$ 645080 654811 664619 674495 684433 694541 705193 716910 729919 744023 758997 774873 791530
59162G91530J6624J5233J2696R748P000M516J850j489n418r171j2061j4133j5713
$$ 791530 808154 823387 836083 845831 852831 857347 859197 857708 852290 843119 831058 816925 801212
59149H01212j6610j6353j5229j4326j4288j4564j4199j2984j1497j0355r821r820
$$ 801212 784602 768249 753020 738694 724406 709842 695643 682659 671162 660807 650986 641166
59137F41166r934r493q086n985l926k495j781j488j218p34p6O70J661L102M680
$$ 641166 631232 621739 613653 607668 603742 601247 599466 597978 596760 596026 595950 596620 598281 601383 606063
59122F06063N617N627N504O284P951R500J0287J0716J1388J2119J2304J1879J1291
$$ 606063 611680 617307 622811 629095 637046 646546 656833 667549 678937 691056 703360 715239 726530
59109G26530J0668R732Q554P705P345O837N704M379L396K446R88o09j493j677
$$ 726530 737198 746930 755484 763189 770534 777371 783075 787454 790850 793296 794284 793675 792182 790505
59095G90505j911k362k461k193k216k453j851k66O88l31k477l991m614n402o733
$$ 790505 788594 786232 783771 781578 779362 776909 775058 774792 775480 775149 772672 768681 764067 758665 751932
59080G51932p968q911j0119j1558j2240j1622j0432r673r534r628r579r038p786
$$ 751932 743964 735053 724934 713376 701136 689514 679082 669409 659875 650247 640668 631630 623844
59067F23844o195n053m608m267l551k787k516k669k756k549k227k033k033k060
$$ 623844 617649 612596 607988 603721 600170 597383 594867 592198 589442 586893 584666 582633 580600 578540
59053E78540j843j439j373j924k432k019r66n69j339k223k063j070k37J41N32
$$ 578540 576697 575258 573885 571961 569529 567510 566544 565975 564636 562413 560350 559280 559043 559184 559716
59038E59716J125J569J655J617J727K043K615L468M346M844M951N170N996P435
$$ 559716 560841 562410 564065 565682 567409 569452 572067 575535 579881 584725 589676 594846 600842 608277
59024F08277R103J0607J1712J2388J2799J3192J3568J3425J2064R373O205L698
$$ 608277 617380 627987 639699 652087 664886 678078 691646 705071 717135 726508 732713 736411
59012G36411K173R87m08j720k349k299j970j389k24J495L311N046O937Q982J0683
$$ 736411 738584 739571 739163 737443 735094 732795 730825 729436 729212 730707 734018 739064 746001 754983 765666
58997G65666J1693J2166J2288J1992J1442J1252J1758J2433J2426J1405R440O447
$$ 765666 777359 789525 801813 813805 825247 836499 848257 860690 873116 884521 893961 900408
58985I00408K405k038n772q135r293r750r800r512q870p749o004l717j212J214
$$ 900408 902813 900775 895003 886868 877575 867825 858025 848513 839643 831894 825890 822173 820961 822175
58971H22175L463N535P390R068J0767J2654J4613J6319J7524J8146J8089J7204
$$ 822175 825638 831173 838563 847631 858398 871052 885665 901984 919508 937654 955743 972947
58959I72947J5569J3603J1623R326O020J399m109r772j5029j9432k2540k4095
$$ 972947 988516 1002119 1013742 1023068 1029088 1030487 1026378 1016606 1001577 982145 959605 935510
58947I35510k4195k3182k1537j9939j8881j8009j6341j3566j0698q862p825o429
$$ 935510 911315 888133 866596 846657 827776 809767 793426 779860 769162 760300 752475 746046
58935G46046m332k516k007k714l747m391m514m370m264m304m399m495m657m751
$$ 746046 741714 739198 737191 734477 730730 726339 721825 717455 713191 708887 704488 699993 695336 690585
58921F90585m361l407k494k144j931j065L24J250J321J397K482M491O409P408
$$ 690585 686224 682817 680323 678179 676248 675183 675507 676757 678078 679475 681957 686448 692857 700265
58907G00265P544P616Q403R878J1287J2216J3300J5271J7666J9201J9423J9087
$$ 700265 707809 715425 723828 733706 744993 757209 770509 785780 803446 822647 842070 861157
58895H61157J8907J8780J8577J8875K0339K2974K6415L0487L4968L9167M2237
$$ 861157 880064 898844 917421 936296 956635 979609 1006024 1036511 1071479 1110646 1152883
58884A152883M3733M3632M1952L8595L3395K6372J8163R979K575m605j2585k1173
$$ 1152883 1196616 1240248 1282200 1320795 1354190 1380562 1398725 1408704 1411279 1406674 1394089 1372916
58872A372916k8965l5000l9465m2480m3350m1757l8775l5816l3120l0143k6928
$$ 1372916 1343951 1308951 1269486 1227006 1183656 1141899 1103124 1067308 1034188 1004045 977117
58861I77117k4181k2216k0638j9053j7462j5999j4774j3875j3160j2252j1114
$$ 977117 952936 930720 910082 891029 873567 857568 842794 828919 815759 803507 792393
58850G92393j0270j0029r819q958p762p173p372p581p276o863o863p045o915o626
$$ 792393 782123 772094 762275 753317 745555 738382 731010 723429 716153 709290 702427 695382 688467 681841
58836F81841o826p596q093p545o331n578n670n676m633k929j791j630j595q44
$$ 681841 675015 667419 659326 651781 645450 639872 634202 628526 623893 620964 619173 617543 615948 615104
58822F15104N07J878L016L898M415M570M653M865N075N096M889M305L164J819
$$ 615104 615611 617489 620505 624403 628818 633388 638041 642906 647981 653077 657966 662271 665435 667254
58808F67254J041J022J008L78n42j134j430j747j949j793j647k097k986l580l578
$$ 667254 668295 669317 670325 670703 670161 669027 667597 665850 663901 662108 660461 658364 655378 651798 648220
58793F48220l402l431l530l329k663j666o83Q7R98K686N056O958P404O788O248
$$ 648220 644818 641387 637857 634528 631865 630199 629516 629603 630601 633287 638343 645301 652705 659493 665741
58778F65741O141N903N265M753M720M632L678J717p05k935m515n231n247n068
$$ 665741 671882 677785 683050 687803 692523 697155 700833 702550 701845 698910 694395 689164 683917 678849
58764F78849n064n054m602l745l082k952k808j771K12K281L695M498M921M817
$$ 678849 673785 668731 664129 660384 657302 654350 651542 649771 649983 652264 655959 660457 665378 670195
58750F70195M211L804M179M844M933M554M581N248N981O580P378Q169Q116P152
$$ 670195 674406 678210 682389 687233 692166 696720 701301 706549 712530 719110 726488 734657 742773 749925
58736G49925O307O193O255O081O291P383Q671R348R705J0264J0506R617P904O349
$$ 749925 756232 762425 768680 774761 781052 788435 797106 806454 816159 826423 836929 846546 854450 860799
58722H60799N142L767K302J513J694K375L190M215N407O400O917O934O431N351
$$ 860799 865941 869708 872010 873523 875217 877592 880782 884997 890404 896804 903721 910655 917086 922437
58708I22437L693J400j502m415o382p280q190j0069j2635j5165j7632k0149k2011
$$ 922437 926130 927530 926028 921613 915231 907951 899761 889692 877057 861892 844260 824111 802100
58695H02100k2396k1567k0361j8913j6909j4687j2860j1230r284p496o848p143
$$ 802100 779704 758137 737776 718863 701954 687267 674407 663177 653893 646397 639549 632406
58683F32406p191o641o290o413o233n402m708m656m517l497j915m80Q77K630M738
$$ 632406 625215 618574 612284 605871 599638 594236 589528 584872 580355 576858 574943 574463 575340 577970 582708
58668E82708O770Q607J0476J2596J5086J7856K0235K1163K0103J7471J3963R942
$$ 582708 589478 598085 608561 621157 636243 654099 674334 695497 715600 733071 747034 756976
58656G56976N747J976r70l306n387p120q186q615q766q924r112r188q850p780
$$ 756976 762723 764699 763729 760423 755036 747916 739730 731115 722349 713425 704313 695125 686275 678495
58642F78495o040m189k812j947j187k32Q25J797K729L730M543M649L970L139K611
$$ 678495 672455 668266 665454 663507 662320 662088 662913 664710 667439 671169 675712 680361 684331 687470 690081
58627F90081J906L15j772l124l207k546j469M15L072N639P811J0527J4269J7774
$$ 690081 691987 692302 690530 687406 684199 681653 680184 680599 683671 689310 697121 707648 721917 739691
58613G39691J9627K0274K0997K1525K0296J6809J2195P496K835j550m869o810
$$ 739691 759318 779592 800589 822114 842410 859219 871414 878910 881745 880195 875326 868516
58601H68516p987q951r641j0019j0425j0954j1186j0745r547p574n081k826j289
$$ 868516 860529 851578 841937 831918 821493 810539 799353 788608 779061 771487 766406 763580 762291
58588G62291K65K897O307R095J0663J1692J2595J2796J1947J0688R667Q797P892
$$ 762291 762556 765453 771760 780855 791518 803210 815805 828601 840548 851236 860903 869700 877592
58575H77592P152O487N340L789K953L615N156O514P605R160J1606J4736J8135
$$ 877592 884744 891231 896571 900360 903313 906928 912084 918598 926203 935363 946969 961705 979840
58562I79840K1343K3833K5234K5581K5106K3938K1957J8778J4094Q442L357R2
$$ 979840 1001183 1025016 1050250 1075831 1100937 1124875 1146832 1165610 1179704 1188146 1191503 1191595
58550A191595j663l200n146p091q591r575r920r636r570j0836j3389j6070j8153
$$ 1191595 1189932 1186732 1181586 1174495 1165904 1156329 1146409 1136773 1127203 1116367 1102978 1086908 1068755
58537A068755j9859k1260k1830k1437k0744k0120j9028j6990j4357j1705r226
$$ 1068755 1048896 1027636 1005806 984369 963625 943505 924477 907487 893130 881425 872199
58526H72199p009n198l509j351J260L621N357O739P767P877O912N533M386L548
$$ 872199 865190 859992 856483 855132 856392 860013 865370 872109 879876 887753 894665 900198 904584 908132
58512I08132L062L092L285K953K112J467J163O45J4K04J284J884R66q96k729m536
$$ 908132 911194 914286 917571 920524 922636 924103 925266 925911 925925 926129 927413 929297 930263 929367 926638 922102
58496I22102o523q000q169p395o743o681o795o459n242l274j531j094j630j446
$$ 922102 915579 907579 899410 892015 885272 878591 871796 865337 860095 856821 855290 854196 852566 851120
58482H51120N54L725O947R992J2955J5313J6464J6610J6195J5040J2681R138M749
$$ 851120 851674 855399 862346 872338 885293 900606 917070 933680 949875 964915 977596 986734 991483
58469I91483k04n170r233j1837j3171j3554j3034j1942j0960j0135q622n946k757
$$ 991483 991279 986109 976876 965039 951868 938314 925280 913338 902378 892243 883621 877675 874918
58456H74918J14K615M952O978Q553R738J0145Q967O206K995K14k320m782o585
$$ 874918 875032 877647 882599 889577 898130 907868 918013 926980 933186 936181 936395 934075 929293 922708
58442I22708p435q048q902r193p964n564l104j159K60J188J904K981M421N475
$$ 922708 915273 907225 898323 889130 881166 875602 872498 871339 871599 872787 874691 877672 882093 887568
58428H87568N950O836Q878J1356J3122J4004J4387J4197J3217J1727R968P640
$$ 887568 893518 900354 909232 920588 933710 947714 962101 976298 989515 1001242 1011210 1018850
58416A018850M698J963J37j070k197l142l824m925p022r575j1529j2401j2223
$$ 1018850 1023548 1025511 1025648 1024578 1022381 1019239 1015415 1010490 1003468 993893 982364 969963 957740
58403I57740j1183r924r333r367q900p377n684m725m085k977j550l97L94Q78P29
$$ 957740 946557 936633 927300 917933 909033 901656 895972 891247 887162 884185 882635 882238 882632 883510 884239
58388H84239q6r27j434k057k995l561l234k383j434l46N87Q01Q87K450N697Q680
$$ 884239 884153 883226 881792 879735 876740 873179 869945 867562 866128 865782 866369 867170 868057 870507 876204 884884
58372H84884R891J0051J0363J0602J0307J0262J1247J2619J3552J4475J5878J6952
$$ 884884 894775 904826 915189 925791 936098 946360 957607 970226 983778 998253 1014131 1031083
58360A031083J6937J6551J6656J6613J5442J3404J1025P815L541m73k953m384
$$ 1031083 1048020 1064571 1081227 1097840 1113282 1126686 1137711 1145526 1149067 1148594 1145641 1141257
58348A141257n587n890m453k293j037o12J64J579L157M907O874Q467R552J1120
$$ 1141257 1135670 1129780 1125327 1123034 1121997 1121385 1121549 1123128 1126285 1131192 1138066 1146533 1156085 1167205
58334A167205J3533J5473J6026J6252J7128J7635J6659J5068J3870J2123Q959
$$ 1167205 1180738 1196211 1212237 1228489 1245617 1263252 1279911 1294979 1308849 1320972 1329931
58323A329931N960M912M718L200P27n94k24Q86K555M886O576O434N743O558Q556
$$ 1329931 1335891 1340803 1345521 1348721 1349448 1348854 1348630 1349516 1352071 1356957 1363533 1369967 1375710 1382268 1390824
58308A390824J0034J1001J2545J4144J4390J3650J3407J3697J3695J3878J5024
$$ 1390824 1400858 1411859 1424404 1438548 1452938 1466588 1479995 1493692 1507387 1521265 1536289
58297A536289J6036J5501J4406J4615J5693J6054J6091J7169J8604J8764J8256
$$ 1536289 1552325 1567826 1582232 1596847 1612540 1628594 1644685 1661854 1680458 1699222 1717478
58286A717478J8862K0249K0847K0992K1993K3153K2984K2352K3051K4390K4703
$$ 1717478 1736340 1756589 1777436 1798428 1820421 1843574 1866558 1888910 1911961 1936351 1961054
58275A961054K5025K7507L1213L3433L4179L5464L7163L7797L8395M1201M5319
$$ 1961054 1986079 2013586 2044799 2078232 2112411 2147875 2185038 2222835 2261230 2302431 2347750
58264B347750M8013M9585N2526N6581N9335O0945O3364O5547O4540O0995N8502
$$ 2347750 2395763 2445348 2497874 2554455 2613790 2674735 2738099 2803646 2868186 2929181 2987683
58253B987683N7654N6011N3695N3585N5954N8236O0326O4690P1117P6736Q1347
$$ 2987683 3045337 3101348 3155043 3208628 3264582 3322818 3383144 3447834 3518951 3595687 3677034
58242C677034Q7394R4628J00380J05045J11438J18925J24379J28769J36179J46302
$$ 3677034 3764428 3859056 3959436 4064481 4175919 4294844 4419223 4547992 4684171 4830473
58232D830473J54846J61618J70999J83917J96773K08921K23684K41230K58234
$$ 4830473 4985319 5146937 5317936 5501853 5698626 5907547 6131231 6372461 6630695
58223F630695K75385K97115L23120L48623L73812M04147M40376M77841N16802
$$ 6630695 6906080 7203195 7526315 7874938 8248750 8652897 9093273 9571114 10087916
58214A0087916N63407O19057O79302P44924Q23081R15779J018842J134151J270703
$$ 10087916 10651323 11270380 11949682 12694606 13517687 14433466 15452308 16586459 17857162
58205A7857162J432221J617548J835149K102554K430109K822489L299131L895886
$$ 17857162 19289383 20906931 22742080 24844634 27274743 30097232 33396363 37292249
58197C7292249M646839N589618O796187Q378880J0463559J3172127J6599275K0721007
$$ 37292249 41939088 47528706 54324893 62703773 73167332 86339459 102938734 123659741
58189A23659741K5278136K9766012L3511440L5657338L5089158L0685090K2070853
$$ 123659741 148937877 178703889 212215329 247872667 282961825 313646915 335717768
58182C35717768J0328239k174545j2905419k0341906k4301092k5456009k4727170
$$ 335717768 346046007 343871462 330966043 310624137 286323045 260867036 236139866
58175B36139866k2991485k0992990j9231384j7864367j6763708j5702305j4522377
$$ 236139866 213148381 192155391 172924007 155059640 138295932 122593627 108071250
58168A08071250j3194115j1782671j0380796r057158p846315o765345n821748
$$ 108071250 94877135 83094464 72713668 63656510 55810195 49044850 43223102
58161D3223102n007259m301615l689345l164899k721005k343825k022347j752135
$$ 43223102 38215843 33914228 30224883 27059984 24338979 21995154 19972807 18220672
58153A8220672j526832j335633j171929j035591r23990q29155p46236o76426o18907
$$ 18220672 16693840 15358207 14186278 13150687 12226697 11397542 10651306 9974880 9355973
58144I355973n67754n19469m76071m38235m02429l67297l35895l09056k83227
$$ 9355973 8788219 8268750 7792679 7354444 6952015 6584718 6248823 5939767 5656540
58135E656540k57332k35337k19302k06126j93701j84186j78351j72444j63798
$$ 5656540 5399208 5163871 4944569 4738443 4544742 4360556 4182205 4009761 3845963
58126C845963j54432j46290j37865j28307j20111j14762j09978j03913r7963r3124
$$ 3845963 3691531 3545241 3407376 3279069 3158958 3044196 2934218 2830305 2732342 2639218
58116B639218q7690q1052p5716p2993p0469o6165o1619n8472n5582n2026m9517
$$ 2639218 2551528 2470476 2394760 2321767 2251298 2185133 2123514 2065042 2009460 1957434 1907917
58105A907917m9291m9504m8170m5964m4115m2158l9806l8311l8038l7207l4833
$$ 1907917 1858626 1809122 1760952 1714988 1670873 1628715 1588909 1550598 1512560 1475353 1440520
58094A440520l2427l1197l0089k8221k6634k6004k5167k3424k1912k1163j9914
$$ 1440520 1408093 1376896 1346807 1318586 1291952 1265948 1240781 1217357 1195445 1174282 1154368
58083A154368j7796j6676j7610j8923j8981j8549j8795j9237j9239j9408j9821
$$ 1154368 1136572 1119896 1102286 1083363 1064382 1045833 1027038 1007801 988562 969154 949333
58072I49333j9127j6882j4844j4431j4835j4940j4987j5017j3923j1515r546r116
$$ 949333 930206 913324 898480 884049 869214 854274 839287 824270 810347 798832 789286 780170
58060G80170r004p925o553o027o287p122q835j0732j1026r537q326q391q083o208
$$ 780170 771166 763241 756688 750661 744374 737252 728417 717685 706659 697122 688796 680405 672322 666114
58046F66114m359m286n057m806l631k818k756l250m477o083o805o348o152p006
$$ 666114 661755 657469 652412 647606 643975 641157 638401 635151 630674 624591 617786 611438 605286 598280
58032E98280p651p105o552p275q471q839q746r047r257q687q010q048q142p383
$$ 598280 590629 583524 576972 569697 561226 552387 543641 534594 525337 516650 508640 500592 492450 485067
58018D85067o211n429m840m266m431n391n551l921j957j446j900j758r92n67l95
$$ 485067 478856 473427 468587 464321 459890 454499 448948 445027 443070 441624 439724 437966 436974 436407 436012
58003D36012K63J172J633J932K783L969M859N459N741N004L177J695J593J857
$$ 436012 436275 437447 439080 441012 443795 447764 452623 458082 463823 468827 472004 473699 475292 477149
57989D77149J188K37L79J258J465Q96N69O26L41k59l83Q8N80R38J290J147k5j633
$$ 477149 478337 478574 478953 480211 481676 482572 483141 483767 484108 483849 483466 483554 484134 485072 486362 487509 487484 485851
57971D85851k544k600k509k603k687k802l162l625l982m326m537m010k715j700
$$ 485851 483307 480707 478198 475595 472908 470106 466944 463319 459337 455011 450474 446464 443749 442049
57957D42049j795k520l017l233l395l332l189l718m891n299m025k079q59k73L78
$$ 442049 440254 437734 434717 431484 428089 424757 421568 417850 412959 407660 403635 401556 400697 400424 400802
57942D00802Q86Q41Q33J527K514L406M927P445R603J0087R695R818R937Q764O851
$$ 400802 401688 402529 403362 404889 407403 410809 415736 423181 432784 442871 452566 462384 472321 481085 487936
57927D87936N812N408L895J096j194k051k598l949n748p182q038q350q275q476
$$ 487936 493748 499156 503051 504147 502953 500902 498304 494355 488607 481425 473387 465037 456762 448286
57913D48286r480j0546j0487r470q683q210o911m593k791k745l913n043n695o110
$$ 448286 438806 428260 417773 408303 399620 391410 384499 379906 377115 374370 370457 365414 359719 353609
57899C53609o421o538o329n664m675l924l761l720l163k238j480r28m28l57r36
$$ 353609 347188 340650 334321 328657 323982 320058 316297 312577 309414 307176 305696 304768 304340 303983 303047
57884C03047j361p66K82N50J34J94Q95J096K58p59j119r66o27oP72J125Q51M40
$$ 303047 301686 300920 301202 301752 301886 302080 302975 304071 304329 303570 302451 301485 300858 300852 301624 302749 303600 304040
57866C04040K74K19J44J11J5j95k8R56K168K664K663L226M396M990M488L873M078
$$ 304040 304314 304533 304677 304788 304803 304608 304580 305536 307704 310368 313031 316257 320653 325643 330131 334004 338082
57849C38082M690M820M272L339K190J107N94P16Q37M08m24j298k159k996l607
$$ 338082 342772 347592 351864 355203 357393 358500 359094 359810 360647 361055 360631 359333 357174 354178 350571
57834C50571l914m006l765k951j864j310j610k178k269j740r15j28L85N68O46
$$ 350571 346657 342651 338886 335935 334071 332761 331151 328973 326704 324964 324049 323921 324306 324874 325520
57819C25520Q13Q66N25K7r9K63Q14J480K436L494M017L490J866n23k907m388m794
$$ 325520 326333 327199 327724 327751 327652 327915 328729 330209 332645 336139 340156 343646 345512 344989 342082 337694 332900
57802C32900n074o077p297p541o568n153l812k454j232o85r28j585k568m089n845
$$ 332900 327826 321749 314452 306911 300343 295190 291378 288924 287692 287007 286079 284494 281926 277837 271992
57787B71992p071p580p850p979p376n765l687j767j10J390K738L967N021N465
$$ 271992 264921 257341 249491 241512 234136 228371 224684 222917 222807 224197 226935 230902 235923 241388
57773B41388M964L991L362L109K564J514M75k64r87j910k892l877m920n753o050
$$ 241388 246352 250343 253705 256814 259378 260892 261367 261103 260116 258206 255314 251437 246517 240764 234714
57758B34714o050o179o189n571m598l904l235j805J15J300J421J404J712J686
$$ 234714 228664 222485 216296 210725 206127 202223 198988 197183 197298 198598 200019 201423 203135 204821
57744B04821J063P22J199J645J103p3r89j441j659j503q00J06P47J072J101O81
$$ 204821 205884 206606 207805 209450 210553 210480 209491 208050 206391 204888 204088 204194 204941 206013 207114 207795
57728B07795m3n25n88o06o19j26Q31J320Q73K50J55J06n57j363j391p40k79k84
$$ 207795 207752 207227 206639 206033 205414 205288 206119 207439 208312 208562 208717 208823 208266 206903 205512 204772 204493 204209
57710B04209k85n6N8k68r43j645j980j724j094n44r6N76J247J117R3p37n37J34
$$ 204209 203924 203868 203926 203658 202715 201070 199090 197366 196272 195728 195632 196208 197455 198572 198665 197928 197391 197525
57692A97525L02J2r1j2k25o26o82l71r8K93J453L402N293O468P275Q569J0858
$$ 197525 197827 197839 197748 197736 197511 196885 196203 195832 195734 196027 197480 200882 206175 212643 219918 228487 239345
57675B39345J4149J8379K3728L0513L8719M7714N6520O4299P0028P1737O6760
$$ 239345 253494 271873 295601 326114 364833 412547 469067 533366 603394 675131 741891
57664G41891N3440L2644P638j7172l7560n0761n6522n6852n4286n0321m5469m0125
$$ 741891 795331 827975 835613 818441 780881 730120 673598 616746 562460 512139 466670 426545
57652D26545l4860l0115k6111k2821j9938j7179j4750j3099j2063j0873r234p732
$$ 426545 391685 361570 335459 312638 292700 275521 260771 247672 235609 224736 215502 207770
57640B07770o820o077m982l760k866k219j583j212j387j739j723j443j363j464
$$ 207770 200950 194873 189891 186131 183265 181046 179463 178251 176864 175125 173402 171959 170596 169132
57626A69132j383j129j054j274j607j933k114j897j392j229j697k055j437j24
$$ 169132 167749 166620 165566 164292 162685 160752 158638 156741 155349 154120 152423 150368 148931 148807
57612A48807Q25R63P50O37O14O27P47Q24O09K36O3k4n32j532k415k664k441k254
$$ 148807 149632 150595 151345 151982 152596 153223 153970 154794 155403 155639 155702 155678 155146 153614 151199 148535 146094 143840
57594A43840k379k765l176l292k902k107j268p27o50r74j419j675j764j962k324
$$ 143840 141461 138696 135520 132228 129326 127219 125951 125224 124574 123600 122181 120506 118742 116780 114456
57579A14456k494k240j813j544j398j216j100j216j460j640j787j961k021j809
$$ 114456 111962 109722 107909 106365 104967 103751 102651 101435 99975 98335 96548 94587 92566 90757
57565I0757j350o94O6N50L96K4L28J216J382J66j190j178j78K77q8o6R22J973
$$ 90757 89407 88713 88779 89329 89725 89749 90077 91293 92675 92841 91651 90473 90295 90572 90484 90418 91340 93313
57547I3313K291K253K271J788L25j267j667q30K1L4m46o87n05j25L31P99R80O23
$$ 93313 95604 97857 100128 101916 102241 100974 99307 98477 98498 98532 98086 97399 96894 96769 97100 97899 98879 99502
57529I9502k0m42o08j008j743k101j481m08M8k47m13O9O76Q93J012J416J733J409
$$ 99502 99482 99040 98432 97424 95681 93580 92099 91691 91739 91492 91079 91148 91824 92717 93729 95145 96878 98287
57511I8287P07L94O98J171J384J241P84K30pK25N05M23Q9k86r09j855k454k055
$$ 98287 98994 99388 100086 101257 102641 103882 104666 104896 104889 105114 105619 106042 106131 105845 104936 103081 100627 98572
57493I8572j179j026j902k961l485l588l534l203k556j938j535j089m65l1j49
$$ 98572 97393 96367 94465 91504 88019 84431 80897 77694 75138 73200 71665 70576 70111 70080 69931
57478F9931o34j047j176j006n94k59m62j211j807j565o86o5k98j080j580j266
$$ 69931 69297 68250 67074 66068 65474 65215 64753 63542 61735 60170 59484 59419 59121 58041 56461 55195
57462E5195l14O57J180J207R18N19K77M52R78J397J367J108J016J016P28J79r9
$$ 55195 54881 55538 56718 57925 58843 59362 59639 60091 61069 62466 63833 64941 65957 66973 67701 67880 67781
57445F7781J70N61M94J8k78o1L00K50k10n52n31n06p73r04l49N61R30N70J98J89
$$ 67781 67951 68512 69006 69024 68746 68685 68985 69235 69025 68473 67942 67436 66663 65759 65410 65971 66901 67471 67669 67858
57425F7858qp33j191m69J001J814J282Q8o87o44j37K14N4m11o71n35l45l85m75
$$ 67858 67850 67117 65926 65457 66458 68272 69554 69642 68955 68311 68174 68388 68442 68031 67360 66825 66480 66095 65620
57406F5620m37m82p88j051r85q46r76j160j025p47p07o83j99N63Q58M91Q7K01
$$ 65620 65183 64701 63913 62862 61877 61031 60055 58895 57870 57123 56416 55733 55534 56097 56955 57446 57533 57734
57388E7734O67R90R82Q88J173K111L301L821L200K041J207P17k3j101j930k133
$$ 57734 58401 59391 60373 61261 62434 64545 67846 71667 74867 76908 78115 78832 78809 77708 75778 73645
57372G3645j942j716j574j486j338r02k00K70J24l01m46m12o62j001p32J42P15
$$ 73645 71703 69987 68413 66927 65589 64687 64487 64757 64881 64580 64134 63722 63060 62059 61327 61469 62184
57355F2184M71J7J58Q16J251J072N90L36N00P70O73R0o78j323j842k250k422k378
$$ 62184 62655 62672 62830 63646 64897 65969 66559 66895 67395 68165 68838 68928 68250 66927 65085 62835 60413 58035
57337E8035k278j908p87P69J410L82j218j716r68j92m0l4J59J80j50m27m30m74
$$ 58035 55757 53849 53062 53831 55241 55623 54405 52689 51721 51529 51489 51455 51614 51794 51644 51217 50787 50313
57319E0313p05q20p04o12n65k98K9j29p24j044q23o43q64j061q92p16p88o34J60
$$ 50313 49608 48788 48084 47472 46907 46609 46638 46509 45785 44741 43918 43275 42411 41350 40458 39742 38954 38320 38480
57300C8480J113J450J076L84n06j640k681l086k804k395k378k674k737k169j256
$$ 38480 39593 41043 42119 42503 41997 40357 37676 34590 31786 29391 27013 24339 21602 19433 18177
57285A8177p70j039j487j406q78m35n5P93K151L403M176M755N531O612Q070R868
$$ 18177 17407 16368 14881 13475 12597 12162 12107 12900 15051 18454 22630 27385 32916 39528 47598 57466
57269E7466J1462J2133J1851J1167J0319R156P948P261O861N785L834K032J105
$$ 57466 68928 81061 92912 104079 114398 123554 131502 138763 145624 151409 155243 157275 158380
57256A58380N02m69j400j562j220j258j896k587k967l201l427l477l227k834k597
$$ 158380 158882 158413 157013 155451 154231 152973 151077 148490 145523 142322 138895 135418 132191 129357 126760
57241A26760k658k795k605k050j640j701j691r55P8K80n45j389j559j490j661
$$ 126760 124102 121307 118702 116652 115012 113311 111620 110665 110743 111023 110478 109089 107530 106040 104379
57226A04379j653r61N9P37R93J067Q78L59n5J00O53J148J535K024K537K784K708
$$ 104379 102726 101765 101824 102561 103554 104621 105499 105858 105803 105903 106556 107704 109239 111263 113800 116584 119292
57209A19292K478K269K286K634K981K800K234K134K911L816L903L167K275J574
$$ 119292 121770 124039 126325 128959 131940 134740 136974 139108 142019 145835 149738 152905 155180 156754
57195A56754R59M15Q8o5k14l20j31N10J476K352K584J926P84j28n15n31k56L73
$$ 156754 157713 158128 158216 158151 157937 157617 157486 157996 159472 161824 164408 166334 167118 166990 166475 165944 165688 166061
57177A66061J122J600J841K211K708L018L268L985N243O593P911R479J1195J2595
$$ 166061 167183 168783 170624 172835 175543 178561 181829 185814 191057 197650 205561 215040 226235 238830
57163B38830J3808J5426J7211J8080J7747J7268J7392J7483J6876J6188J6325
$$ 238830 252638 268064 285275 303355 321102 338370 355762 373245 390121 406309 422634
57152D22634J7001J7341J7338J7628J8200J8386J8028J7819J8375J9546K0780
$$ 422634 439635 456976 474314 491942 510142 528528 546556 564375 582750 602296 623076
57141F23076K1818K2922K4486K6393K8016K9130L0498L2924L5917L8132L9078
$$ 623076 644894 667816 692302 718695 746711 775841 806339 839263 875180 913312 952390
57130I52390L9540M0328M1524M3131M5439M8392N1372N3994N6461N9011O1688
$$ 952390 991930 1032258 1073782 1116913 1162352 1210744 1262116 1316110 1372571 1431582 1493270
57119A493270O4651O7963P1143P3732P6239P9702Q4541R0658R8233J07321J17201
$$ 1493270 1557921 1625884 1697027 1770759 1846998 1926700 2011241 2101899 2200132 2307453 2424654
57108B424654J27469J39235J53616J69716J86084K03895K26860K58435L01189
$$ 2424654 2552123 2691358 2844974 3014690 3200774 3404669 3631529 3889964 4191153
57099D191153L58120M31967N23652O34296P68676R33943J135419J376260J659294
$$ 4191153 4549273 4981240 5504892 6139188 6907864 7841807 8977226 10353486 12012780
57090A2012780J983845K340155K710667L075460L411411L689097L881228L976144
$$ 12012780 13996625 16336780 19047447 22122907 25534318 29223415 33104643 37080787
57082C7080787L973724L866959L642103L304259K885767K409591J851048J158681
$$ 37080787 41054511 44921470 48563573 51867832 54753599 57163190 59014238 60172919
57074F0172919L20651n99431j494767k273219k885530l319603l587104l712952
$$ 60172919 60493570 59894139 58399372 56126153 53240623 49921020 46333916 42620964
57066D2620964l724119l642236l485942l275355l029361k761365k482215k204961
$$ 42620964 38896845 35254609 31768667 28493312 25463951 22702586 20220371 18015410
57058A8015410j942353j701289j483484j290016j121623r76255q50323p41900
$$ 18015410 16073057 14371768 12888284 11598268 10476645 9500390 8650067 7908167
57050G908167o49959n71552n02879m42461l90676l46791l08855k75813k47461
$$ 7908167 7258208 6686656 6183777 5741316 5350640 5003849 4694994 4419181 4171720
57041D171720k22845k00731j81099j64358j49845j36674j25103j15407j06461
$$ 4171720 3948875 3748144 3567045 3402687 3252842 3116168 2991065 2875658 2769197
57032B769197r7227q8501q1263p4415o6117n6429m6573l6460k4971j1948J904
$$ 2769197 2671970 2583469 2502206 2427791 2361674 2305245 2258672 2222212 2197241 2185293 2187197
57021B187197J6134K9374L7809L7058K5730N975j8563m3638o4596p8245q4750
$$ 2187197 2203331 2232705 2270514 2307572 2333302 2339277 2320714 2277076 2212480 2134235 2049485
57010B049485q6206q3905p8537p1943o6318o1877n7239n1920m6728m2061l7663
$$ 2049485 1963279 1879374 1800837 1728894 1662576 1600699 1543460 1491540 1444812 1402751 1365088
56999A365088l3837l1049k8645k5620k2453k0397j9237j7635j5459j3822j2885
$$ 1365088 1331251 1300202 1271557 1245937 1223484 1203087 1183850 1166215 1150756 1136934 1124049
56988A124049j1531r310o906m496j592J209K110L02l225p397j2136j7172k1264
$$ 1124049 1112518 1103208 1096302 1091806 1090214 1091423 1093533 1093835 1090610 1083213 1071077 1053905 1032641
56975A032641k3298k3290k1932k0045j8588j8065j7770j6516j4196j1650r182
$$ 1032641 1009343 986053 964121 944076 925488 907423 889653 873137 858941 847291 838109
56964H38109o420l471q12J941N623R847J3225J5398J7143J8027J5820R222r3r108
$$ 838109 831689 828218 827406 829347 834970 844817 858042 873440 890583 908610 924430 933652 933559 924451
56950I24451j6027k0496k2446k2025k0188j8229j6798j5672j4251j2037r091o175
$$ 924451 908424 887928 865482 843457 823269 805040 788242 772570 758319 746282 737191 731016
56938G31016l981k115N37M366Q654J2756J6821K0936K4271K5416K3252J7370Q398
$$ 731016 727035 724920 725457 729823 738477 751233 768054 788990 813261 838677 861929 879299 887697
56925H87697j906j1373j8651k3538k6253k6968k6141k4581k2966k1506k0092j8421
$$ 887697 885791 874418 855767 832229 805976 779008 752867 728286 705320 683814 663722 645301
56913F45301j6178j3564j1426j0303r641q602p269o314n775n050l971k948k113
$$ 645301 629123 615559 604133 593830 584189 575587 568318 562004 556229 551179 547208 544260 542147
56900E42147j227l15M48J426L116N135O576P421Q565J0377J2249J3802J5572J8018
$$ 542147 540920 540605 541053 542479 545595 550730 557306 564727 573292 583669 595918 609720 625292 643310
56886F43310K0659K2442K2418J9882J4581P176r47q454j4394j8095j9508j9498
$$ 643310 663969 686411 708829 728711 743292 750468 749521 741067 726673 708578 689070 669572
56874F69572j8983j7890j5650j2505r319o234k568J899O706J1834J8008K5463
$$ 669572 650589 632699 617049 604544 595225 588991 586423 588322 595028 606862 624870 650333
56862F50333L3390M0893M7594N2825N4945N2083M3295K9155J1853n290j9348k9263
$$ 650333 683723 724616 772210 825035 879980 932063 975358 1004513 1016366 1011076 991728 962465
56850I62465l5519l8594l8488l5573l0838k5166j9048j3001p257j094O619J6108
$$ 962465 926946 888352 849864 814291 783453 758287 739239 726238 718981 717887 724506 740614
56838G40614K6794L8541N1651O5469P8093Q7522R1889Q8550P4836N0804K0463
$$ 740614 767408 805949 857600 923069 1001162 1088684 1180573 1269123 1343959 1394763 1415226
56827A415226j0400l7059n6730o8333p2640p1941o8474o3313n6861m9644m2033
$$ 1415226 1404826 1367767 1311037 1242704 1170064 1098123 1029649 966336 909475 859831 817798
56816H17798l3839k4838j5276n526M386J4684K5607L7250M8934N8734O4193O3532
$$ 817798 783959 759121 743845 738319 742705 757389 782996 820246 869180 927914 992107 1055639
56804A055639N5714M0114J7713p409k9534m5096n4249n8666n9335n6948n2752
$$ 1055639 1111353 1151467 1169180 1161771 1132237 1087141 1032892 974226 914891 857943 805191
56793H05191m7713m1819l5067k8357k2502j7130j1400n198J135P597J4316K1033
$$ 805191 757478 715659 680592 652235 629733 612603 601203 596005 597140 604737 619053 640086
56781F40086K7212L2012L3793L0619K2058R899l374j5990k6455l3163l5638l5425
$$ 640086 667298 699310 733103 763722 785780 795679 792305 776315 749860 716697 681059 645634
56769F45634l4587l3676l1966k9132k5747k2518j9848j7861j6249j4396j2157
$$ 645634 611047 577371 545405 516273 490526 468008 448160 430299 414050 399654 387497
56758C87497j0125q773p894p249p057p252p037n883m342l231k623k271k301k703
$$ 387497 377372 368599 360705 353456 346399 339147 332110 326227 321885 318654 316031 313760 311459 308756
56744C08756k824k214j415j135j192j067q91j017j162q76m46m60q42j167j500
$$ 308756 305932 303718 302303 301168 299976 298909 298018 297001 295839 294963 294517 294057 293215 292048 290548
56729B90548k032k258j539k14P14Q91P56N53J00m47m84J64Q68R08K38n36o92K1
$$ 290548 288516 286258 284719 284505 285219 286110 286866 287419 287519 287072 286588 286752 287620 288528 288766 288230 287538 287559
56711B87559J152J971K236K225K023J356L30k96j7P52J255J219P12j20q42r06
$$ 287559 288711 290682 292918 295143 297166 298522 298852 298556 298539 299291 300546 301765 302477 302357 301515 300609
56695C00609n08n83j440k154j924j292j215j672k009k149k469k915l097k975k742
$$ 300609 300101 299518 298078 295924 294000 292708 291493 289821 287812 285663 283194 280279 277182 274207 271465
56680B71465k341j800j591j941k229j811j028n13k1J075K435K981K458J830K005
$$ 271465 269124 267324 265733 263792 261563 259752 258724 258211 258190 259265 261700 264681 267139 268969 270974
56665B70974K856L567L460K475J296Q80J446K142K096J506J170J356J621J555
$$ 270974 273830 277397 280857 283332 284628 285508 286954 289096 291192 292698 293868 295224 296845 298400
56651B98400J096L86k64m70k91k98p86j327j493j504j640j654j324j061j297j679
$$ 298400 299496 299882 299618 299148 298857 298559 297773 296446 294953 293449 291809 290155 288831 287770 286473 284794
56635B84794j547q03K42J352K144J974Q04l48n16R1O97J055J223R41J34m79k27
$$ 284794 283247 282444 282686 284038 286182 288156 288960 288612 288096 288187 288884 289939 291162 292103 292237 291758 291531
56618B91531M82Q40Q84J104J382J286J016J010R92M51k71m50k06k50o57r50j189
$$ 291531 292013 292853 293737 294841 296223 297509 298525 299535 300527 300978 300707 300257 300051 299801 299144 298194 297005
56601B97005j787k436k334j500q28q23j147j438j593j353n33L14L54l28q36p66
$$ 297005 295218 292782 290448 288948 288120 287297 286150 284712 283119 281766 281233 281547 281901 281573 280737 279971
56585B79971o13p93j027r14m68J3J72k09q57j060n70l3PM6P83J892K514K606K838
$$ 279971 279358 278565 277538 276624 276156 276169 276341 276132 275275 274215 273645 273612 273619 273665 274448 276340 278854 281460 284298
56566B84298L419L941M224M524N138O435Q729J1396J2721J1646R102O637M457
$$ 284298 287717 291658 295882 300406 305544 311979 320708 332104 344825 356471 365573 372210 376667
56553C76667J993l43j573j807j942k016j500r08j350k612l430l615m186n234n629
$$ 376667 378660 378317 376744 374937 372995 370979 369479 368571 367221 364609 361179 357564 353378 348144 342515
56538C42515n092m668m684m090k624j726k277l075k796k055k135k748k649j738
$$ 342515 337423 332755 328071 323981 321357 319631 317354 314279 311483 309428 307293 304545 301896 300158
56524C00158j160j548k329k713k552k194k013k089k097j675r62m25j67J11M87
$$ 300158 298998 297450 295121 292408 289856 287662 285649 283560 281463 279788 278826 278401 278234 278345 278832
56509B78832P38Q89J168J371J025K43l10l63k05J31R05J790J943J209L51j64o74
$$ 278832 279570 280459 281627 282998 284023 284266 283956 283593 283388 283519 284424 286214 288157 289366 289717 289553 288879
56492B88879j321j527r74k70p1k21k00J45O42R92P28l69j644k036j376m77J33
$$ 288879 287558 286031 285057 284787 284716 284495 284295 284440 285082 286074 286802 286433 284789 282753 281377 280900 281033
56475B81033O94J292J435Q90K02p6P7N58J346K084K217J810J439J215P28P3j33
$$ 281033 281727 283019 284454 285344 285546 285470 285547 286105 287451 289535 291752 293562 295001 296216 296944 297017 296884
56458B96884O2j49r03j224n44M12P58N33J30l81q23o76P3O30M55l5l04m25m93
$$ 296884 296946 296797 295894 294670 294126 294538 295296 295829 295959 295578 294755 294079 294152 294782 295237 295202 294898 294473 293980
56439B93980k02L79N00j57q07p02k63l14p15o00L61J532K023J540O18J76N27R49
$$ 293980 293778 294157 294657 294500 293693 292991 292728 292414 291699 291099 291460 292992 295015 296555 297173 297349 297876 298825
56421B98825O84R8J38Q33J291J103P29M49O4k97j71J93J1o61q49l39m7m26p55
$$ 298825 299509 299607 299745 300578 301869 302972 303701 304150 304214 303917 303746 303939 303950 303289 302440 302101 302054 301628 300873
56402C00873n56l56m63k85L42M84l34j030m82P78J370R35K58J30P56J768K349
$$ 300873 300317 299961 299498 299213 299555 300039 299705 298675 298193 298971 300341 301276 301534 301664 302420 304188 306537
56385C06537J921R92O20Q81R31O55Q70J555J541N86J51J114K234K152J438J291
$$ 306537 308458 309450 310070 310951 311882 312537 313407 314962 316503 317089 317240 318354 320588 322740 324178 325469
56369C25469J407P65l68q22l05N62J473K440K992K594J607Q21L57q1l34%P78J579
$$ 325469 326876 327641 327273 326451 326146 326708 328181 330621 333613 336207 337814 338635 338992 338911 338577 338577 339355 340934
56351C40934K304K928L186L099L232L735L854L022J720O47j39o09l65L75M41n79
$$ 340934 343238 346166 349352 352451 355683 359418 363272 366294 368014 368661 368522 367913 367548 367923 368364 367785
56335C67785j293l24J650K920L047K879K913K887K646K327J928J509J401J572
$$ 367785 366492 366168 367818 370738 373785 376664 379577 382464 385110 387437 389365 390874 392275 393847
56321C93847J418R12R51J767K028P65q51j068j24L26k22p60o81n23p16q71n03
$$ 393847 395265 396177 397128 398895 400923 401688 400837 399769 399645 399971 399749 398989 398308 397785 397069 396198 395695
56304C95695M73J949L585M704M915M613M279L665K470J296J038J604K091J996
$$ 395695 396168 398117 401702 406406 411321 415934 420213 423878 426348 427644 428682 430286 432377 434373
56290D34373J610J428J741K476L049K814K064J842K491L244L708M556O056P183
$$ 434373 435983 437411 439152 441628 444677 447491 449555 451397 453888 457132 460840 465396 471452 478635
56276D78635P157O765P119Q040Q805R452J0246J0724J0555J0537J1503J2999J4160
$$ 478635 485792 492557 499676 507716 516521 525973 536219 546943 557498 568035 579538 592537 606697
56263F06697J5131J6452J7926J9316K1331K4582K8317L1459L4259L7702M2039
$$ 606697 621828 638280 656206 675522 696853 721435 749752 781211 815470 853172 895211
56252H95211M7043N2912N9611O6159P1857P7342Q3194Q8441R1893R4008R5801
$$ 895211 942254 995166 1054777 1120936 1192793 1270135 1353329 1441770 1533663 1627671 1723472
56241A723472R6760R5505R1849Q6484P9251O9349N6839M2595K7192J1087m828
$$ 1723472 1820232 1915737 2007586 2094070 2173321 2242670 2299509 2342104 2369296 2380383 2375555
56230B375555k0017l4730m8428n9159o6071p1185p6710q1782q4157q3934q2998
$$ 2375555 2355538 2320808 2272380 2213221 2147150 2075965 1999255 1917473 1833316 1749382 1666384
56219A666384q1606p8356p3354o8626o5140o1763n7509n2876m8587m4730m1352
$$ 1666384 1584778 1506422 1433068 1364442 1299302 1237539 1180030 1127154 1078567 1033837 992485
56208I92485l8424l5231l1286k7596k5472k4473k3137k1298j9751j8145j5367
$$ 992485 954061 918830 887544 859948 834476 810003 786866 765568 745817 727672 712305
56197G12305j1796r111p860p180o707o808o994o213m719l717l238k393j553k030
$$ 712305 700509 691398 683538 676358 669651 662843 655849 649636 644917 641200 637962 635569 634016 631986
56183F31986l535m208l376k244j593r32j49N4k23K3Q63J301J199J489K245K495
$$ 631986 628451 624243 620867 618623 617030 616098 615949 616003 615780 615803 616666 617967 619166 620655 622900 625395
56167F25395K157K222K764K775K285K648M295O078P212Q077Q833R116R322J0325
$$ 625395 627552 629774 632538 635313 637598 640246 644541 650619 657831 665908 674741 683857 693179 703504
56153G03504J1699J2241J2344J3723J6458J8643J9427K0275K2476K5528K8679
$$ 703504 715203 727444 739788 753511 769969 788612 808039 828314 850790 876318 904997
56142I04997L2115L5789L9019M2038M6289N2345N9125O5623P1806P7246Q0530
$$ 904997 937112 972901 1011920 1053958 1100247 1152592 1211717 1277340 1349146 1426392 1506922
56131A506922Q0823P8629P4657O9233O3094N7408N2708M8946M6173M3660L9042
$$ 1506922 1587745 1666374 1741031 1810264 1873358 1930766 1983474 2032420 2078593 2122253 2161295
56120B161295L0504J9519R287R09o645j3405j8327k2302k8063l6510m5845n4691
$$ 2161295 2191799 2211318 2220605 2221514 2214869 2201464 2183137 2160835 2132772 2096262 2050417 1995726
56108A995726o3257p0882p5402p6061p4465p1838o7728o2197n6648n1562m5832
$$ 1995726 1932469 1861587 1786185 1710124 1635659 1563821 1496093 1433896 1377248 1325686 1279854
56097A279854l9254l3392k8989k4893k0431j6526j3665j0963q071n833m358k654
$$ 1279854 1240600 1207208 1178219 1153326 1132895 1116369 1102704 1091741 1083670 1077837 1073479 1070825
56085A070825p11L97Q84K277M573O024O246O728P753P776O538N868O511P047O916
$$ 1070825 1070114 1070511 1071395 1073672 1078245 1084269 1090515 1097243 1104996 1112772 1119310 1125178 1131689 1138736 1145652
56070A145652P540R504J1399J2498J3710J5110J5326J4303J3790J4321J4633J4552
$$ 1145652 1153192 1162696 1174095 1186593 1200303 1215413 1230739 1245042 1258832 1273153 1287786 1302338
56058A302338J5296J6337J5552J3232J2207J3174J3672J2765J2595J4084J5175
$$ 1302338 1317634 1333971 1349523 1362755 1374962 1388136 1401808 1414573 1427168 1441252 1456427
56047A456427J4968J5459J7417J8598J7937J7613J8869J9687J8739J7863J8521
$$ 1456427 1471395 1486854 1504271 1522869 1540806 1558419 1577288 1596975 1615714 1633577 1652098
56036A652098J9538K0351K2659K6645K9463K9742K9917L1867L4025L4927L5804
$$ 1652098 1671636 1691987 1714646 1741291 1770754 1800496 1830413 1862280 1896305 1931232 1967036
56025A967036L7499L8605L8825M0179M3015M4912M5381M7191N1043N3831N4295
$$ 1967036 2004535 2043140 2081965 2122144 2165159 2210071 2255452 2302643 2353686 2407517 2461812
56014B461812N5440N8873O1974O3232O5098O8760P1509P2263P4194P8770Q2810
$$ 2461812 2517252 2576125 2638099 2701331 2766429 2835189 2906698 2978961 3053155 3131925 3214735
56003C214735Q4700Q7734R3876J00003J03954J08274J14445J19725J23395J29568
$$ 3214735 3299435 3387169 3481045 3581048 3685002 3793276 3907721 4027446 4150841 4280409
55993D280409J39709J49270J55906J63958J76289J89209K00270K13379K30830
$$ 4280409 4420118 4569388 4725294 4889252 5065541 5254750 5455020 5668399 5899229
55984E899229K48312K63463K81207L04762L29777L53524L81049M15635M52640
$$ 5899229 6147541 6411004 6692211 6996973 7326750 7680274 8061323 8476958 8929598
55975H929598M89676N33056N86665O45050P05705P77077Q65452R65591J074055
$$ 8929598 9419274 9952330 10538995 11184045 11889750 12666827 13532279 14497870 15571925
55966A5571925J199804J351428J527271J729676J975420K280512K650249L097983
$$ 15571925 16771729 18123157 19650428 21380104 23355524 25636036 28286285 31384268
55958C1384268L658219M369557N267056O411196P907661R883718J2461334J5741748
$$ 31384268 35042487 39412044 44679100 51090296 58997957 68881675 81343009 97084757
55950I7084757J9735884K4241651K8802326L2784570L5391181L5544871L2005177
$$ 97084757 116820641 141062292 169864618 202649188 238040369 273585240 305590417
55943C05590417K4063307J2416766p19189j2620923k1393277k6549567k8627515
$$ 305590417 329653724 342070490 341351301 328730378 307337101 280787534 252160019
55936B52160019k8504269k6999519k4770371k2274743j9762597j7345812j5087611
$$ 252160019 223655750 196656231 171885860 149611117 129848520 112502708 97415097
55929I7415097j3028427j1178505r536806q111451o902421n882154n014811m281161
$$ 97415097 84386670 73208165 63671359 55559908 48657487 42775333 37760522 33479361
55921C3479361l668359l152066k708033k329236k014821j752599j527152j334834
$$ 33479361 29811002 26658936 23950903 21621667 19606846 17854247 16327095 14992261
55913A4992261j176417j043670r26192q23610p39031o67651o02714n45621m99740
$$ 14992261 13815844 12772174 11845982 11022372 10283341 9615690 9012976 8467355 7967615
55904G967615m60698m22511l87030l58141l32724l06295k81680k63231k47842
$$ 7967615 7506917 7084406 6697376 6339235 6006511 5700216 5418536 5155305 4907463
55895D907463k30233k12207j98352j87132j74270j60876j50594j42277j32613
$$ 4907463 4677230 4465023 4266671 4079539 3905269 3744393 3593799 3451522 3318909
55886C318909j22649j15128j08631j00465r2095q5901q0016p1981o4112n9693
$$ 3318909 3196260 3081132 2972501 2872036 2779941 2694040 2614024 2542043 2477931 2418238
55876B418238n7316n4444n2997n5662o0017o1963o2117o3224o4218o2394n8906
$$ 2418238 2360922 2306478 2253481 2197819 2137802 2075839 2013722 1950498 1886280 1823886 1764980
55865A764980n6684n5132n1958m8008m5412m3154l9248l5179l3439l2805l0625
$$ 1764980 1708296 1653164 1601206 1553198 1507786 1464632 1425384 1390205 1356766 1323961 1293336
55854A293336k7764k6763k7066k6476k5459k5614k5812k4232k2399k2854k4442
$$ 1293336 1265572 1238809 1211743 1185267 1159808 1134194 1108382 1084150 1061751 1038897 1014455
55843A014455k4267k2683k2112k2375k1445j9580j8537j7832j5850j3565j3247
$$ 1014455 990188 967505 945393 923018 901573 881993 863456 845624 829774 816209 802962
55832H02962j4322j4269j2759j1401j0343q609o968o963p923q093p946r144j1123
$$ 802962 788640 774371 761612 750211 739868 731259 724291 717328 709405 701312 693366 684222 673099
55819F73099j1857j1246j0735j0448r575q680q702q625p053n055m576n070m583
$$ 673099 661242 649996 639261 628813 619238 610558 601856 593231 586178 581123 576547 571477 566894
55806E66894l080j770k61K489N444O820P201Q246R301Q466O089M016K134j040
$$ 566894 563814 562044 561783 564272 569716 576536 583737 591983 601284 609750 615839 619855 621989 620949
55792F20949m935p437q335r133r905r441q190p774p930p014n430n422p380r342
$$ 620949 616014 608577 600242 591109 581204 571763 563573 555799 547869 540855 535425 530003 522623 513281
55778E13281j0282j0982j1514j0688q571o871o296n713m324k637j039N24J387
$$ 513281 502999 492017 480503 469815 461244 454373 448077 442364 438040 435403 434364 434888 436275
55765D36275O26j188k570l304m224n173n215m600m469m767m536l931l917m288
$$ 436275 436901 435713 433143 429839 425615 420442 415227 410627 406158 401391 396855 392924 389007 384719
55751C84719m158m011n020o649p310p104p466q313q167o984o269o214n381l514
$$ 384719 380561 376550 371530 364881 357571 350467 343001 334688 326521 319537 313268 307054 301673 298159
55737B98159k185k069k016j402j078j322j011L10J394J160l7j548l221m561m693
$$ 298159 295974 293905 291889 290487 289409 288087 287076 287386 288780 289940 289903 288355 285134 280573 275880
55722B75880l724k754k258j844j632k192l030k882j791j089j100p20M01J183J122
$$ 275880 272156 269402 267144 265300 263668 261476 258446 255564 253773 252684 251584 250864 251265 252448 253570
55707B53570J186K032K962L305L328L170K269M79j426k885m036m850m976m661
$$ 253570 254756 256788 259750 263055 266383 269553 271822 272301 270875 267990 263954 259104 254128 249467
55693B49467m511m284l235j738j053j401j757j654j525j173J99K121K938K375
$$ 249467 244956 240672 237437 235699 234646 233245 231488 229834 228309 227136 227335 229456 232394 234769
55679B34769K117L156M260M042K932K003J223P2j156j796j867j853j979k184k303
$$ 234769 236886 240042 244302 248344 251276 253279 254502 254574 253418 251622 249755 247902 245923 243739 241436
55664B41436j940r24L2K9n59l56R98K348K773K683K756K873K734K557K570K544
$$ 241436 239496 238572 238604 238633 238074 237718 238716 241064 243837 246520 249276 252149 254883 257440 260010 262554
55648B62554K220J611P08n25j744k552l152l983m849n294n520n889n905m920l579
$$ 262554 264774 266385 267093 266568 264824 262272 259120 255137 250288 244994 239474 233585 227680 222760 219181
55633B19181l166l592l576k736j982j712j238l25K98K69J02o2p17j655j762p77
$$ 219181 216015 212423 208847 206111 204129 202417 201179 200854 201152 201421 201523 201461 200744 199089 197327 196550
55617A96550J34R2m48q70j351k030k353j973j314q22n03m89j051j814k015j820
$$ 196550 196684 196776 196328 195458 194107 192077 189724 187751 186437 185615 185112 184623 183572 181758 179743 177923
55601A77923k154l031l307k498j509j149j146j075r96p65M3J047J142J64p54r40
$$ 177923 175769 172738 169431 166933 165424 164275 163129 162054 161058 160293 160336 161383 162525 162689 161935 160995
55585A60995r79j263j175l65M65P46Q25R19N67j48j58R89K231K585K525K876L463
$$ 160995 160016 158753 157578 157213 157678 158424 159249 160168 160735 160587 160429 161418 163649 166234 168759 171635 175098
55568A75098L762L868L886L278J798L01k92j61pPK3l4j53n8J35j99j189k162k788
$$ 175098 178860 182728 186614 189892 191690 191991 191699 191538 191531 191538 191561 191527 191374 191316 191451 191252 190063 187901 185113
55549A85113l599m898o155o944p423p439o257l854j394K11J163J775J848J651
$$ 185113 181514 176616 170461 163517 156094 148655 142398 138544 137150 137361 138524 140299 142147 143798
55535A43798K112L230L645K758J865K122K641J982M03p35r56p32m42m10j250k894
$$ 143798 145910 149140 152785 155543 157408 159530 162171 164153 164556 163821 162865 162133 161691 161281 160031 157137
55519A57137m032l733k812k435k249j292J7M66P4j9N28Q90O02J05k18m70o40n24
$$ 157137 153105 149372 146560 144125 141876 140584 140601 141067 141141 141122 141650 142540 143142 143247 143029 142559 141919 141395
55501A41395k62j69j08K17N94O83P52J199J601J176M7q53j028p90n34l62l86o40
$$ 141395 141133 140964 140856 141073 141667 142350 143102 144301 145902 147078 147125 146272 145244 144454 143920 143558 143172 142532
55483A42532p91m95J5K54J64Mj91m95o75m97j40R9J95O4n91j610k103j567o66
$$ 142532 141741 141246 141261 141515 141679 141683 141492 140997 140322 139825 139685 139784 139979 140043 139452 137842 135739 134172 133506
55464A33506k01O8O80J193Q28m5k95J79K81n18j359j269m64J21N1k66k52J85N77
$$ 133506 133305 133373 134053 135246 136074 136029 135734 135913 136194 135676 134317 133048 132584 132705 132756 132490 132238 132423 133000
55445A33000M98J20o2Np9l26k25L02N36N4m83l05L96R55J235J332R55rp24l00
$$ 133000 133498 133618 133556 133561 133482 133156 132931 133233 133769 133823 133340 133035 133431 134386 135621 136953 137908 137899 137175 136875
55425A36875Q28J284M55r43j850j769p95M36R66L96n12o86o4M97M79J53o8r3M0
$$ 136875 137703 138987 139442 138499 136649 134880 134085 134521 135487 135883 135371 134685 134621 135118 135597 135750 135682 135589 135629
55406A35629K67L74J93j24l39m94o90q10q49j133j714j926j192N7Q35Q08M61L00
$$ 135629 135896 136270 136463 136339 136000 135506 134816 134006 133157 132024 130310 128384 127192 127249 128084 128892 129353 129653
55388A29653L89N82O73N14L28N91J248J517R50K41K51P49Q37K93l30o11n55j43
$$ 129653 130042 130624 131297 131811 132139 132730 133978 135495 136445 136686 136937 137686 138523 138816 138486 137875 137320 137177
55370A37177N44R22M05o92j402j221m53L93R76J043O00O1k33n08j078j616j529
$$ 137177 137721 138643 139048 138356 136954 135733 135280 135673 136649 137692 138292 138353 138120 137612 136534 134918 133389
55353A33389q40q8M12O61N68O2m85o41n43n82o76n01k25l15p28r13o09l0O00J141
$$ 133389 132549 132461 132873 133534 134102 134164 133679 133038 132495 131913 131237 130736 130511 130196 129468 128555 127946 127916 128516 129657
55333A29657J290Q19O3l75k76J64P69J308J335O97k6k64l36r10j773j929r09O36
$$ 129657 130947 131766 131829 131454 131178 131342 132111 133419 134754 135451 135425 135161 134825 133915 132142 130213 129304 129940
55315A29940J689J699Q10k43n62Q6R82J347J159P14k2r83j428q04J85L38m18j066
$$ 129940 131629 133328 134138 133895 133333 133419 134401 135748 136907 137621 137599 136616 135188 134384 134569 134907 134489 133423
55297A33423j034o85l84k9L61N14M81N88P51N60J40J44O97J150J067P54O33P14
$$ 133423 132389 131704 131320 131291 131652 132166 132647 133235 133986 134546 134686 134830 135527 136677 137744 138498 139131 139845
55279A39845Q61J009R13K80o28j062o47K10R24J278J271Q70J96m45p77p05k93
$$ 139845 140706 141715 142628 142908 142280 141218 140571 140781 141705 142983 144254 145124 145320 144875 144098 143393 143100
55262A43100J76K87nk06N3M53N04L16L20M87M47J74m4j25j37N2M64N99L1q10j098
$$ 143100 143276 143563 143558 143352 143405 143858 144362 144678 144998 145485 145932 146106 146062 145937 145800 145852 146316 146915 146946 146136 145038
55241A45038p54m29n23p73p80m10J69M74Mj036j739j582j008m84J90J014J209
$$ 145038 144284 143855 143332 142559 141779 141369 141538 142012 142016 140980 139241 137659 136651 136167 136357 137371 138580
55224A38580N00kN77J282P75m19q11m19m10p30k62P76P92m54j229m66Q21J465
$$ 138580 139080 139078 139655 140937 141712 141293 140482 140063 139653 138923 138661 139437 140229 139775 138546 138080 138901 140366
55206A40366J644J678J067j67p64QJ091J197N18j30o66j207j237n17J40L8k77
$$ 140366 142010 143688 144755 144588 143824 143832 144923 146120 146638 146508 145842 144635 143398 142881 143021 143059 142782
55189A42782j17P4l22p58m51J16n2o99o97J87J112J498J429R25k4q23p20K6M03
$$ 142782 142665 142739 142417 141659 141208 141324 141272 140573 139876 140063 141175 142673 144102 145027 145003 144180 143460 143486 143889
55170A43889N8l55l03rK24N28J079J684K014J942J570J153R86J125J293J301J264
$$ 143889 143947 143592 143289 143280 143504 144032 145111 146795 148809 150751 152321 153474 154460 155585 156878 158179 159443
55153A59443J216Q61J14m72l98l2j61q77j472j470j171j095j296j386j063m07
$$ 159443 160659 161520 161634 161162 160764 160732 160571 159694 158222 156752 155581 154486 153190 151804 150741 150334
55137A50334K37O50R19J170J213P32j56q63r52n53r2J33O4j61l59n36q66j247
$$ 150334 150571 151221 152140 153310 154523 155255 155099 154236 153284 152731 152639 152772 152836 152675 152316 151780 150914 149667
55119A49667j193n56N6J68K33P02Q74j27j531j606j64J113J230J084J487J662
$$ 149667 148474 147918 147974 148142 148375 149077 149951 149824 148293 146687 146523 147636 148866 149950 151437 153099
55103A53099Q04j97K0J273K317K584K255J347mq89o29J6j14p42o38L07Q64L81
$$ 153099 153903 153706 153726 154999 157316 159900 162155 163502 163498 162609 161980 161996 161882 161140 160502 160809 161673 162054
55085A62054l95o66o34q39j214j247n94O36J811K037J047k86q71o63m63o21p41
$$ 162054 161659 160993 160359 159520 158306 157059 156465 157101 158912 160949 161996 161710 160839 160176 159713 159092 158351
55068A58351n49k82j70j76k68m37m17j5M10L89J04L8M1m06j077j095l20K90K8
$$ 158351 157802 157520 157350 157174 156906 156469 156052 156037 156447 156836 156940 156978 157019 156613 155536 154441 154121 154411 154439
55049A54439o18p76l05L82J008J447J437Q44P0k56J6L87K60l99r53q09k20o3o68
$$ 154439 153821 153045 152740 153122 154130 155577 157014 157858 157928 157672 157688 158075 158335 157936 156983 156174 155954 155891 155223
55030A55223j211p98K57Q15M41j45k08J58M59N11L91J29k19m49m34k64p5J29M00
$$ 155223 154012 153214 153471 154286 154727 154582 154374 154532 154991 155502 155893 156022 155803 155354 154920 154656 154581 154710 155110
55011A55110O99R09Q43L96k55o66n92k17K39P80J240J037k0j068j015L5R38J030
$$ 155110 155809 156718 157561 157957 157702 157036 156444 156227 156466 157246 158486 159523 159503 158435 157420 157455 158393 159423
54993A59423P32N85M93K27J6J46M76O60N37K9q78j765j866r49K38Q11P82P97J128
$$ 159423 160155 160740 161233 161460 161476 161622 162098 162758 163295 163324 162446 160681 158815 157866 158104 158915 159697 160494 161622
54974A61622J389J216P75M60M15M41L14P5oK24N01M15m8m30l82q9Q2J18K70N26
$$ 161622 163011 164227 165002 165462 165877 166318 166632 166707 166701 166925 167426 167841 167793 167363 166981 166892 166974 167092 167362 167888
54954A67888N43J79k01j88R3J44j63l46L9P35J083Q57M43K74M02P61J325J811
$$ 167888 168431 168610 168409 168221 168314 168458 168295 167949 167988 168723 169806 170663 171106 171380 171782 172543 173868 175679
54936A75679J598M38r55j469q29J43N37L80M85J398K775L833M348M936O166P609
$$ 175679 177277 177715 176760 175291 174462 174605 175142 175522 176007 177405 180180 184013 188361 193297 199463 207072
54920B07072Q142P286N832M904M693M387L214J208r39k573l566m304n178o063
$$ 207072 215214 222500 228332 233236 237929 242316 245530 246738 245799 243226 239660 235356 230178 224115
54906B24115o428n991n071m219l675l307k965k661k528k608k650k226j249k89
$$ 224115 217687 211696 206625 202406 198731 195424 192459 189798 187270 184662 182012 179786 178537 178248
54892A78248jk75l61J45R19J575K130K593K721K530K528L045L733M198M677N558
$$ 178248 178247 177972 177611 177756 178675 180250 182380 184973 187694 190224 192752 195797 199530 203728 208405 213963
54876B13963O579P107O970O393N307L371P41j740l342m199n020o173p151p093
$$ 213963 220542 227649 234619 241012 246319 249690 250431 248691 245349 241150 236130 229957 222806 215713
54862B15713n898m534l988m058l741k689j582j069j054j255j661k091k090j706
$$ 215713 209815 205281 201293 197235 193494 190805 189223 188154 187100 185845 184184 182093 180003 178297
54848A78297j640k132k486k166j569j122n44K03K25r43k088j773m38L18Q3j54
$$ 178297 176657 174525 172039 169873 168304 167182 166638 166841 167066 166123 164035 162262 161824 162142 162225 162071
54832A62071O4J33k02l31m4M4l15m07K63J183J631J513J029K83m13n74k30P0J85
$$ 162071 162135 162268 162066 161735 161691 161735 161420 161013 161276 162459 164090 165603 166632 166915 166502 165928 165698 165768 165953
54813A65953N28J079J126M05l70n55l86k65j2N32Q81N78J3j71%J07J59M82R99
$$ 165953 166481 167560 168686 169091 168721 168166 167780 167515 167503 168035 168916 169494 169507 169336 169336 169443 169602 170084 171083
54794A71083J309J294J145R29N44O7k65l13r8K78N64M74J03J4O09J550K033J589
$$ 171083 172392 173686 174831 175760 176304 176371 176106 175793 175695 175973 176537 177011 177114 177128 177737 179287 181320 182909
54776A82909N82k0O21K475M551N822O151O150O214O206O039N914N873N595M932
$$ 182909 183491 183471 184092 186567 191118 196940 203091 209241 215455 221661 227700 233614 239487 245082 250014
54761B50014M144L412K499J099p04k570m109m993n210n278n774o536o832o378
$$ 250014 254158 257570 260069 261168 260464 257894 253785 248792 243582 238304 232530 225994 219162 212784
54747B12784n602m831l869k668j704j319j234j094r63q64m57L46R56Q32L01P0
$$ 212784 207182 202351 198482 195814 194110 192791 191557 190463 189500 188636 188179 188525 189481 190313 190614 190684
54731A90684L02O51R39J318J880K619L594M784N843O365O277N830N325M963M674
$$ 190684 190986 191637 192576 193894 195774 198393 201987 206771 212614 218979 225256 231086 236411 241374 246048
54716B46048L960K287j62k484m028m942n621o086o212o125n963n605m959m234
$$ 246048 250008 252295 252133 249649 245621 240679 235058 228972 222760 216635 210672 205067 200108 195874
54702A95874l596k940k251j771j524j167o44l93n74o29j55M12M94K54J51J63J12
$$ 195874 192278 189338 187087 185316 183792 182625 181981 181588 181014 180385 180230 180642 181136 181390 181541 181704 181816
54685A81816K77Q14J090M45p01j361j386j298j100l71M84M05o25j262o83K47L87
$$ 181816 182093 182907 183997 184442 183741 182380 180994 179696 178596 178225 178709 179114 178489 177227 176544 176791 177178
54668A77178j9K6N45O15n9o30l45M35Q34O16K53L2l67j250k194k310j222M74J763
$$ 177178 177159 177185 177730 178345 178286 177656 177311 177746 178580 179196 179449 179481 179114 177864 175670 173360 172138 172612 174375
54649A74375K090J580P52J48N0K95M46L18J94K98L20k10j154j772j570q63l63
$$ 174375 176465 178045 178797 178945 178995 179290 179736 180054 180248 180546 180866 180656 179502 177730 176160 175297 174934
54632A74934l43l53K04J249J919J498L70k87R7Q20Q91K66l03m05l53m93o69n98
$$ 174934 174591 174238 174442 175691 177610 179108 179478 179191 179288 180108 180999 181265 180962 180557 180204 179711 179042 178444
54614A78444l68k83l53j85N43J542K025J503M30k36j93j36o91j400j244m2J226
$$ 178444 178076 177793 177440 177255 177798 179340 181365 182868 183298 183062 182869 182733 182042 180642 179398 179356 180582
54597A80582J509P63k10o70n46l09m18q66j197j017l97K53N87N09J35k93m93l98
$$ 180582 182091 182854 182644 181974 181428 181119 180701 179835 178638 177621 177224 177477 178064 178573 178708 178415 177922 177524
54579A77524k28k50m41n74n36m05l14k81k17NM36R24J241J272J012M34l99j147
$$ 177524 177296 177046 176605 176031 175495 175090 174776 174495 174278 174283 174719 175643 176884 178156 179168 179602 179203 178056
54561A78056j386j051m31K29P81Q98L58l72m56J26M34k8n15j95N18O91L97N05
$$ 178056 176670 175619 175188 175417 176198 177096 177454 177082 176626 176752 177186 177158 176643 176448 176966 177657 178054 178559
54543A78559J190J687J535J138Q97O42L08K95P10R09M21j93l3Q89J693J788J415
$$ 178559 179749 181436 182971 184109 185006 185648 185956 186251 186961 187870 188291 188098 188065 188954 190647 192435 193850
54526A93850J039P89O26O29Q05Q81N78N0k80l07l99q31j339j479j267j126j224
$$ 193850 194889 195678 196304 196933 197738 198619 199197 199247 198967 198660 198261 197430 196091 194612 193345 192219 190995
54509A90995j250r91o98o36n73r5O92J185J026N06J34L0j37o37j231j278m10R34
$$ 190995 189745 188754 188056 187420 186847 186752 187444 188629 189655 190161 190295 190325 190188 189551 188320 187042 186632 187566
54491A87566J813J703Q95jo63j030r89m92J97P34J048J293J450J335R28M34J2
$$ 187566 189379 191082 191977 191976 191313 190283 189294 188802 188999 189733 190781 192074 193524 194859 195787 196221 196233
54474A96233l56p04r57r77o32N2P19Q34K61m15m25L55J295J751J669J388J149
$$ 196233 195877 195173 194216 193239 192607 192659 193378 194212 194473 194058 193633 193988 195283 197034 198703 200091 201240
54457B01240Q87N23J69rj27n43j278j734j307k09O75Q19M65L3l93p51p59l30J09
$$ 201240 202127 202650 202819 202810 202683 202140 200862 199128 197821 197612 198287 199106 199571 199604 199211 198460 197701 197371 197480
54438A97480J84M9l0k20p24j174j092p85j057j985k541j768J10J886K533K007
$$ 197480 197664 197713 197683 197463 196739 195565 194473 193688 192631 190646 188105 186337 186447 188333 190866 192873
54422A92873J155R04J424K037K015J389P57M99M18K20m0j10P2L20M83O16P96Q38
$$ 192873 194028 194932 196356 198393 200408 201797 202554 203053 203471 203691 203651 203541 203613 203933 204416 205032 205828 206666
54404B06666M72j68n68n41o01j115j482q50M44J126Q04M99J044J844J952J478
$$ 206666 207138 206970 206402 205861 205260 204145 202663 201813 202257 203383 204187 204686 205730 207574 209526 211004
54388B11004J109R24O23M14O27P94J42j058j632j119l32k24p85j285j098k03P25
$$ 211004 212113 213037 213660 214074 214701 215495 215637 214579 212947 211828 211496 211272 210487 209202 208104 207901 208626
54371B08626Q16Kp19n43M3J54rL88J150J134J30o08j56Q82J446J339Q60Pj159
$$ 208626 209442 209444 208725 208182 208225 208379 208370 208758 209908 211042 211172 210564 210408 211290 212736 214075 214935 214942 213783
54352B13783j962j715n61Q02J904K480K181R41o21j720k139k087j667r38k38J16
$$ 213783 211821 210106 209545 210347 212251 214731 216912 217853 217232 215512 213373 211286 209619 208681 208443 208559
54336B08559K57M99O89L85m41j219j399r64l03J94M11M91N97P34Q50R89J132R88
$$ 208559 208816 209315 210004 210389 209948 208729 207330 206366 206063 206257 206668 207159 207756 208490 209340 210329 211461 212449
54318B12449L10n53q96n21L2L15N50J105J800K119J905J461J144J149J477J910
$$ 212449 212759 212206 211310 210789 210821 211136 211686 212791 214591 216710 218615 220076 221220 222369 223846 225756
54302B25756K073J877J729K085K878L589L809L563L146K807K528J996Q74p56k337
$$ 225756 227829 229706 231435 233520 236398 239987 243796 247359 250505 253312 255840 257836 258710 257954 255617
54287B55617l257l338k918k541k531k750k770k385j885j677j787j919j879j672
$$ 255617 252360 249022 246104 243563 241032 238282 235512 233127 231242 229565 227778 225859 223980 222308
54273B22308j325r53q30j034j159p84j02L24L84M70P74J062J130R93O13Mm59m25
$$ 222308 220983 220030 219200 218166 217007 216223 216121 216445 216829 217299 218073 219135 220265 221258 221871 221875 221416 220991
54255B20991k56n82j136r29J89J041O94l35r86j018p74k92N05J086P74k17r20
$$ 220991 220735 220153 219017 218088 218277 219318 220012 219677 218691 217673 216899 216607 217112 218198 218972 218755 217835
54238B17835q39m28k91m72o33n55k72J16N93J201J784J876J088k91j414j690j278
$$ 217835 216996 216568 216277 215805 215172 214617 214345 214461 215054 216255 218039 219915 221003 220712 219298 217608 216330
54221B16330p07l44k79l24n2O54J103M46r85j764j174k04j85j130k050k338k026
$$ 216330 215623 215279 215000 214676 214624 215278 216381 216827 215842 214078 212904 212700 212515 211385 209335 206997 204971
54204B04971j195oQ71Q01J06k22K79J155J793J976J755J314R42P55N31J80R5N20
$$ 204971 203776 203770 204641 205442 205548 205326 205605 206760 208553 210529 212284 213598 214540 215295 215826 216006 216101 216621
54186B16621R29P01J31l9J23j51r48j477j321j012r86r06m79j76m41p87m66L42
$$ 216621 217550 218251 218382 218343 218466 218315 217367 215890 214569 213557 212571 211665 211186 211010 210569 209782 209316 209658
54168B09658P67N04J23J37L78M61M42O16R81J145P96M7o89j067j035p59m49k33
$$ 209658 210425 210929 211052 211189 211567 212028 212470 213086 214067 215212 216008 216055 215366 214299 213264 212505 212056 211823
54150B11823j02L7J97K44J31J33N95J369J836J628J055N90K79j3r8K38O40M67
$$ 211823 211721 211758 211955 212199 212330 212463 213058 214427 216263 217891 218946 219536 219815 219802 219704 219942 220582 221049
54132B21049k80q63p50j83L49P46J071J081M76m96j089p57L62J645K459K443J616
$$ 221049 220769 219906 219156 218973 219322 220068 221139 222220 222696 222200 221111 220354 220716 222361 224820 227263 228879
54115B28879L77o70j097q92l10L89R69J116O31j52m75QP03P72J78l29k45J51L92
$$ 228879 229256 228586 227489 226597 226287 226676 227645 228761 229392 229240 228765 228773 229476 230248 230426 230097 229852 230003 230395
54096B30395L80J49m06j118j340o60K94M31m86j527j755j254p65o10l83L01J090
$$ 230395 230775 230924 230518 229400 228060 227400 227694 228125 227639 226112 224357 223103 222338 221728 221345 221646 222736
54079B22736J246O11j37l53j89j46j90J45Q54J308J149P28M63K99J23J21L30L39
$$ 222736 223982 224593 224456 224103 223914 223768 223578 223723 224577 225885 227034 227762 228225 228524 228647 228768 229098 229437
54061B29437r8n61o07m94o71q37l44O77J313J136P76R25J359J340P38K84O82J746
$$ 229437 229339 228778 228171 227677 227006 226169 225825 226502 227815 228951 229727 230652 232011 233351 234089 234373 235055 236801
54043B36801K606K748K533K531K678K559K378K881M141N112M877L774K845K579
$$ 236801 239407 242155 244688 247219 249897 252456 254834 257715 261856 266968 271845 275619 278464 281043
54029B81043K720K856K722K244J775J866K385K422J673J228K033L162K858J046
$$ 281043 283763 286619 289341 291585 293360 295226 297611 300033 301706 302934 304967 308129 310987 312033
54015C12033o11j098j171j722k331k236j652j350j487j737k077k676l252l285
$$ 312033 311422 310324 309153 307431 305100 302864 301212 299862 298375 296638 294561 291885 288633 285348
54001B85348k786k265j968j653j122n98m01m62l86K8M76M72O1j56J07K69l53j412
$$ 285348 282562 280297 278329 276676 275554 274956 274555 274093 273707 273735 274211 274683 274744 274588 274695 274964 274611 273199
53983B73199j843j317o33m98n98k49N48J248J584J663J561J268J046J311K103
$$ 273199 271356 270039 269406 268908 268310 268061 268609 269857 271441 273104 274665 275933 276979 278290 280393
53968B80393K987L579M012M765O139P973R890J1763J3774J5958J7842J8714J8181
$$ 280393 283380 286959 290971 295736 301875 309848 319738 331501 345275 361233 379075 397789 415970
53955D15970J6233J2912Q326K985k225o518r540j1293j2059j2324j2402j2028
$$ 415970 432203 445115 453441 456426 454201 447683 438143 426850 414791 402467 390065 378037
53943C78037j0738q695o760n567m897m151l119j974q94P4Q50J295J293P98l6p79
$$ 378037 367299 358604 351844 346277 341380 337229 334110 332136 331242 331316 332166 333461 334754 335552 335516 334737
53927C34737j003p08k47J76O73J299J925K526L185L631L286K137J147J317K522
$$ 334737 333734 333026 332779 332955 333628 334927 336852 339378 342563 346194 349480 351617 352764 354081 356603
53912C56603L713M188M176M200M283M049L370K564J956J418O27k81o98l59R1j88
$$ 356603 360316 364504 368680 372880 377163 381212 384582 387146 389102 390520 391147 390866 390168 389809 389900 389712
53896C89712j123j834j880j863k532l725m590m659m301m146m371m623m569m302
$$ 389712 388589 386755 384875 383012 380480 376755 372165 367506 363205 359059 354688 350065 345496 341194
53882C41194m183m325m413m127l531k880k301j943k130k916l601l354k272j350
$$ 341194 337011 332686 328273 324146 320615 317735 315434 313491 311361 308445 304844 301490 299218 297868
53868B97868j242j596j719j454j105r66j142j539j759j424p78n52r57j292q98
$$ 297868 296626 295030 293311 291857 290752 289786 288644 287105 285346 283922 283144 282592 281635 280343 279445
53853B79445j05K66J7l65m58k71Q7M94O33K27n38j131j324j305j126n18N28J375
$$ 279445 279340 279606 279623 279258 278800 278529 278616 279110 279743 279970 279432 278301 276977 275672 274546 274028 274556 275931
53835B75931J353O07m8o4K66K99k40j081j764j940j527p95k37o1N2M21P61N93
$$ 275931 277284 277891 277843 277779 278045 278344 278104 277023 275259 273319 271792 270997 270760 270699 270751 271172 271933 272526
53817B72526J39J05N43O58J57j10O08J720K137J879J867K463L180L728M281M700
$$ 272526 272665 272770 273313 273971 274128 274018 274626 276346 278483 280362 282229 284692 287872 291600 295881 300581
53801C00581M502L821L458L694L866L515L109L278L986M922O029P145P766P742
$$ 300581 305083 308904 312362 316056 319922 323437 326546 329824 333810 338732 344761 351906 359672 367414
53787C67414P668Q122Q909R624J0446J1818J3678J5589J7348J8915K0001K0165
$$ 367414 375082 383204 392113 401737 412183 424001 437679 453268 470616 489531 509532 529697
53775E29697J9110J6465J1646M590l453j0486j5268j8066j9919k1421k2198k1494
$$ 529697 548807 565272 576918 581508 578055 567569 552301 534235 514316 492895 470697 449203
53763D49203j9294j6725j4999j4104j3013j1235r489q566q228p651o468m919l406
$$ 449203 429909 413184 398185 384081 371068 359833 350344 341778 333550 325899 319431 314512 311106
53750C11106k315j911j938j751j138o21o09p48o08l99m65n82m15j87k49l21J13
$$ 311106 308791 306880 304942 303191 302053 301432 300823 300075 299467 299068 298603 298021 297606 297419 297170 296849 296962
53733B96962R60J715K210K531K512K071J664J742J967J814J636K203L390M301
$$ 296962 297922 299637 301847 304378 306890 308961 310625 312367 314334 316148 317784 319987 323377 327678
53719C27678M717N369O549P384P062O071N682O494P878Q740Q580P872P403P195
$$ 327678 332395 337764 344313 351697 358759 364830 370512 377006 384884 393624 402204 410076 417479 424674
53705D24674O405M466J960j04j469k502l230l311k867k531k576k663k549k390
$$ 424674 431079 435545 437505 437401 435932 433430 430200 426889 424022 421491 418915 416252 413703 411313
53691D11313k274k014j590j277j255j518k123k961l424k964j993j461j497j299
$$ 411313 409039 407025 405435 404158 402903 401385 399262 396301 392877 389913 387920 386459 384962 383663
53677C83663n36N3j97q69j166j000q71j040j344j532j444j092q21j024j514j608
$$ 383663 383127 383180 382983 382114 380948 379948 379077 378037 376693 375161 373717 372625 371804 370780 369266 367658
53661C67658j054n03p03j571k367k503j958j167p07q07j056q19n0P38J228J541
$$ 367658 366604 366101 365398 363827 361460 358957 356999 355832 355125 354318 353262 352443 352393 353131 354359 355900
53645C55900J654J256M40j25q4J59K55N41J332K142K308J970J771J845J787J483
$$ 355900 357554 358810 359250 359125 359041 359200 359455 359996 361328 363470 365778 367748 369519 371364 373151 374634
53629C74634J361J786K638L487L860L515K767K321K477K726K578K425K981M056
$$ 374634 375995 377781 380419 383906 387766 391281 394048 396369 398846 401572 404150 406575 409556 413612
53615D13612M674M409L920L927M292M429M174L834L653L641L787M061M225L940
$$ 413612 418286 422695 426615 430542 434834 439263 443437 447271 450924 454565 458352 462413 466638 470578
53601D70578L187K399K050K146K269K101J729J382J049N46n9m33m85n67j011j574
$$ 470578 473765 476164 478214 480360 482629 484730 486459 487841 488890 489436 489377 488944 488459 487892 486881 485307
53585D85307j655j107o11j031k356l503l453k483j834k099k501k214j692j930
$$ 485307 483652 482545 481934 480903 478547 475044 471591 469108 467274 465175 462674 460460 458768 456838
53571D56838k779l089k541k125k451k697j987q58l67l79Q5J101J665J242M91J81
$$ 456838 454059 450970 448429 446304 443853 441156 439169 438311 437944 437565 437650 438751 440416 441658 442149 442330
53555D42330K47L14L97O89J095J378J435J196P33N51J309K850M169M634M736N137
$$ 442330 442577 442891 443288 443977 445072 446450 447885 449081 449814 450365 451674 454524 458693 463327 468063 473200
53539D73200N584N493N144N352O155O794P003P379Q207Q899R061R307J0336J1806
$$ 473200 478784 484277 489421 494773 500928 507722 514725 522104 530311 539210 548271 557578 567914 579720
53525E79720J2949J3820J4962J6101J6276J5406J4811J5639J7508J9175K0095
$$ 579720 592669 606489 621451 637552 653828 669234 684045 699684 717192 736367 756462
53514G56462K0778K1879K3571K5627K7717K9600L1263L2813L4137L4955L5212
$$ 756462 777240 799119 822690 848317 876034 905634 936897 969710 1003847 1038802 1074014
53503A074014L5105L4467L2687K9724K6679K4718K3630K2147J9686J7031J5324
$$ 1074014 1109119 1143586 1176273 1205997 1232676 1257394 1281024 1303171 1322857 1339888 1355212
53492A355212J4961J5645J6835J7887J8218J7798J7208J6998J7221J7614J7879
$$ 1355212 1370173 1385818 1402653 1420540 1438758 1456556 1473764 1490762 1507983 1525597 1543476
53481A543476J7649J6622J5049J3724J3111J2764J1852J0145Q108O179M253J914
$$ 1543476 1561125 1577747 1592796 1606520 1619631 1632395 1644247 1654392 1662500 1668679 1672932 1674846
53469A674846j033m246p054r043j0463j1878j3512j5164j6701j8209j9550k0301
$$ 1674846 1673813 1669567 1662513 1653470 1643007 1631129 1617617 1602453 1585752 1567543 1547993 1527692
53457A527692k0409k0563k1451k2869k3934k4119k3734k3435k3499k3608k3190
$$ 1527692 1507283 1486720 1465269 1442400 1418466 1394347 1370613 1347178 1323679 1300071 1276881
53446A276881k2015k0488j9287j8601j7893j6556j4607j2587j0910r526q092o298
$$ 1276881 1254866 1234378 1215091 1196490 1178597 1162041 1147434 1134847 1123937 1114411 1106319 1100021
53434A100021m108j896j85R28J944L358N022O386P299Q181R414J0920J2456J4025
$$ 1100021 1095913 1094017 1093832 1094760 1096704 1100062 1105084 1111470 1118769 1126950 1136364 1147284 1159740 1173765
53420A173765J5774J7648J9457K1154K2822K4321K5323K5858K6608K8332L0981
$$ 1173765 1189539 1207187 1226644 1247798 1270620 1294941 1320264 1346122 1372730 1401062 1432043
53409A432043L3729L5882L7448L8729L9859M0994M2622M5070M7888N0260N2072
$$ 1432043 1465772 1501654 1539102 1577831 1617690 1658684 1701306 1746376 1794264 1844524 1896596
53398A896596N3940N6158N8116N9168N9610O0356O1812O3447O4433O4428O3697
$$ 1896596 1950536 2006694 2064810 2123978 2183588 2243944 2305756 2369203 2433636 2498064 2561761
53387B561761O2675O1487N9917N7723N4913N1628M7931M3924L9935L6243L2637
$$ 2561761 2624436 2685923 2745840 2803563 2858476 2910104 2958035 3001959 3041894 3078137 3110774
53376C110774K8580K3835J8657J3296P744K068l377q434j3520j9227k5610l2173
$$ 3110774 3139354 3163189 3181846 3195142 3202886 3204954 3201577 3193143 3179623 3160396 3134786 3102613
53364C102613l8502m4581n0456n5769n9872o2431o3753o4410o4672o4525o4125
$$ 3102613 3064111 3019530 2969074 2913305 2853433 2791002 2727249 2662839 2598167 2533642 2469517
53353B469517o3702o2922o1014n7946n4903n2963n1731n0179m8439m7661m8068
$$ 2469517 2405815 2342893 2281879 2223933 2169030 2116067 2064336 2014157 1965718 1918057 1869989
53342A869989m8305m7093m4622m1828l9127l6492l4082l1995k9825k7096k3900
$$ 1869989 1821684 1774591 1729969 1688141 1649014 1612522 1578440 1546445 1516620 1489524 1465624
53331A465624k0654j7636j5177j3853j3820j4333j4506j4276j4051j3741j2865
$$ 1465624 1444970 1427334 1412157 1398304 1384484 1370151 1355645 1341369 1327318 1313577 1300712
53320A300712j1398r821q466p394o758o566o163m721k384k22J135K229L824N781
$$ 1300712 1289314 1279493 1271027 1263633 1256875 1250309 1244146 1239425 1237041 1236819 1237954 1240183 1244007 1249788
53306A249788P313Q083Q597R566J1110J2731J3982J5112J6830J9448K2453K5110
$$ 1249788 1257101 1265184 1273781 1283347 1294457 1307188 1321170 1336282 1353112 1372560 1395013 1420123
53294A420123K7174K8771K9923L0553L0787L0845L0731L0356K9789K8966K7423
$$ 1420123 1447297 1476068 1505991 1536544 1567331 1598176 1628907 1659263 1689052 1718018 1745441
53283A745441K4796K1518J8452J5871J3249J0166O819L570M51k665n744q677j1371
$$ 1745441 1770237 1791755 1810207 1826078 1839327 1849493 1856312 1859882 1860333 1857668 1851924 1843247 1831876
53270A831876j3690j5592j7449j9801k2633k5240k7013k8092k8962k9741l0261
$$ 1831876 1818186 1802594 1785145 1765344 1742711 1717471 1690458 1662366 1633404 1603663 1573402
53259A573402l0687l1527l2912l4223l4685l4288l3818l3880l4129l3704l2353
$$ 1573402 1542715 1511188 1478276 1444053 1409368 1375080 1341262 1307382 1273253 1239549 1207196
53248A207196l0737k9587k8928k8360k7768k7328k7022k6532k5629k4375k3019
$$ 1207196 1176459 1146872 1117944 1089584 1061816 1034488 1007466 980934 955305 930930 907911
53237I07911k1848k1079k0574j9807j8369j6435j4474j2659j0870r207q119p952
$$ 907911 886063 864984 844410 824603 806234 789799 775325 762666 751796 742589 734470 726518
53225G26518q570r453r948r708r097r050j0116j1766j3023j3580j3846j3965j3512
$$ 726518 717948 708495 698547 688839 679742 670692 660576 648810 635787 622207 608361 594396 580884
53212E80884j2262j0717r533q834q361p989p790p784p863p887p748p472p273p328
$$ 580884 568622 557905 548372 539538 531177 523188 515398 507614 499751 491864 484116 476644 469371 462043
53198D62043p460p273o666n922n219m393l430k840l154m104m678m144k920k181
$$ 462043 454583 447310 440644 434722 429503 425110 421680 418840 415686 411582 406904 402760 399840 397659
53184C97659k563l461l757l136k336k152k523k835k682k040j035J5N67L70p6r5
$$ 397659 395096 391635 387878 384742 382406 380254 377731 374896 372214 370174 369139 369154 369721 370091 370015 369920
53168C69920L02N10K56o8k6L99R60J363J252N07l36m44K89J016R22J46n64p55
$$ 369920 370222 370732 370988 370920 370894 371293 372253 373616 374868 375375 375039 374595 374884 375900 376822 376968 376404 375649
53150C75649n62k83k0K89O52Q69P03K24j15M4N32R57J253J563J728J353M09o92
$$ 375649 375087 374804 374784 375073 375725 376594 377297 377521 377406 377450 377982 378939 380192 381755 383483 384836 385245 384553
53132C84553j658k501l101l125k569j947j666j548j223o88k38n3p0q3J15M90O68
$$ 384553 382895 380394 377293 374168 371599 369652 367986 366438 365215 364527 364289 364236 364166 364083 364198 364688 365356
53115C65356L55j73l63j95k30q00j605k259k662k700k180j355r48j199j432j094
$$ 365356 365711 365538 365175 364980 364750 363950 362345 360086 357424 354724 352544 351189 350241 349042 347610 346516
53099C46516p37j259k480l200k739j698j062j004r49n21m3J6k24j55L79O89J02
$$ 346516 345779 344520 342040 338840 336101 334403 333341 332337 331388 330867 330824 330840 330616 330461 330840 331529 331631
53082C31631r94j583j371j077j233j421j039k32M60Q40R12M58n78j543j620q82
$$ 331631 330637 329054 327683 326606 325373 323952 322913 322681 323141 323981 324893 325351 324773 323230 321610 320728
53066C20728k22k00n25o92n77k69K16Q07J167R89L46l04m65K7Q60J495J658J582
$$ 320728 320506 320306 319781 319089 318512 318243 318459 319266 320433 321422 321768 321464 320999 321026 321886 323381 325039 326621
53048C26621J664J987K312K451K393K116J522O16l57r91r64k81O45J231J143M58
$$ 326621 328285 330272 332584 335035 337428 339544 341066 341682 341325 340334 339370 339089 339734 340965 342108 342566
53032C42566m73j249j514j190o13k72k75l49l59m53o35n51m3N50Q54R52J066J096
$$ 342566 342093 340844 339330 338140 337527 337255 336980 336631 336272 335819 335184 334633 334590 335140 335994 336946 338012 339108
53014C39108Q28L68j8l57q05j228j344j164r51q09o98p25j045j514j818j875j795
$$ 339108 339936 340304 340286 339929 339124 337896 336552 335388 334437 333628 332930 332205 331160 329646 327828 325953 324158
52997C24158j475p32K19P94O83J43m09p60q26m88K86J307K171K442J870P42k16
$$ 324158 322683 321951 322170 322964 323647 323790 323381 322621 321795 321307 321593 322900 325071 327513 329383 330125 329909
52980C29909n07l04m1K32O89J164J328J338J726K526L135L140K790K381J767Q58
$$ 329909 329402 329098 329057 329289 329978 331142 332470 333808 335534 338060 341195 344335 347125 349506 351273 352131
52964C52131R7pM63J065J599K051K168J657P21n8m02n71q77j334j783k106k253
$$ 352131 352228 352221 352684 353749 355348 357399 359567 361224 361945 361887 361485 360914 360037 358703 356920 354814 352561
52947C52561k338k629l139l311k570j296o28j048j696j550q60o58j137j345n77
$$ 352561 350223 347594 344455 341144 338574 337278 336650 335602 333906 332356 331496 330838 329701 328356 327779
52932C27779O01J149Q23K43%J79N33O87L41l76q56p10l69n58j253j645j233m55
$$ 327779 328380 329529 330352 330595 330595 330774 331307 331994 332335 331959 331103 330393 330024 329466 328213 326568 325335 324880
52914C24880m6j62l67k03L91J044J193N64m87j271j481j361j212j044q27o50m94
$$ 324880 324834 324672 324305 324102 324493 325537 326730 327294 326807 325536 324055 322694 321482 320438 319611 318961 318467
52897C18467j44L55N70K36l04n81n91n80n11j81K79M78L24J14K5j02l98o72o68
$$ 318467 318323 318678 319248 319484 319180 318599 318008 317428 316917 316736 317015 317493 317817 317931 317956 317854 317456 316784 316116
52878C16116m01j33j3J8N2J7j31j55L49J318K035J884J199Q96J297J812J903J759
$$ 316116 315715 315582 315569 315587 315639 315656 315525 315370 315719 317037 319072 320956 322155 323051 324348 326160 328063 329822
52860C29822J758J753J367O81J59R1L85O85M76n20j738k021j001J48j8j433k727
$$ 329822 331580 333333 334700 335381 335540 335631 336016 336701 337177 336657 334919 332898 331897 332045 332027 330594 327867
52843C27867l031k791k753k912k786k227j576j274j488j898j854j058m3M07K73
$$ 327867 324836 322045 319292 316380 313594 311367 309791 308517 307029 305131 303277 302219 302176 302583 302856
52828C02856K62P05J121J045O94M20K8q27j804k098j390j70Q09J089N66m90j330
$$ 302856 303118 303823 304944 305989 306683 307103 307131 306304 304500 302402 301012 300842 301651 302740 303306 302816 301486
52811C01486j088L99K265L425L678L757M240M699M131K109o75l001m023l642k428
$$ 301486 300398 300797 303062 306487 310165 313922 318162 322861 326992 329101 328426 325425 321402 317760 315332
52796C15332j311j036j611k332k555k305k014j810j489j046q82j257j853k027
$$ 315332 314021 312985 311374 309042 306487 304182 302168 300358 298869 297823 296941 295684 293831 291804
52782B91804j511o34J12O28J160J805K205J954J139K73k68m95n46m77l98m06l81
$$ 291804 290293 289659 289771 290399 291559 293364 295569 297523 298662 298935 298667 298172 297626 297149 296751 296345 295964
52765B95964q5L81O13N02L70L70K38p8j01M12R21Q76O16Q37J424J612J189Q05
$$ 295964 295879 296260 296873 297375 297745 298115 298353 298275 298174 298586 299507 300383 300999 301836 303260 304872 306061 306866
52747C06866R78J475J803J805J554J111N78J34j62l80n04m66l48k85j93M6K47
$$ 306866 307844 309319 311122 312927 314481 315592 316170 316304 316142 315762 315258 314792 314444 314159 313966 314012 314259
52730C14259J66QK10P41J068R07N26K05j59p31j389j876k043j810j175l60K58
$$ 314259 314425 314433 314643 315384 316452 317359 317885 318090 317931 317200 315811 313935 311892 310082 308907 308547 308805
52713C08805M64L12k2k68j28L66P40O57L71J74k07r93j484q36L74N35p70j989
$$ 308805 309269 309581 309559 309291 309163 309529 310269 310926 311297 311471 311264 310271 308787 307951 308325 308860 308090 306101
52695C06101j625j62Q04O41P2j12J27M11N20N58Q67J662K556K808K250J558J261
$$ 306101 304476 304314 305118 305759 305831 305719 305846 306257 306777 307335 308202 309864 312420 315228 317478 319036 320297
52678C20297J047M65j62k41J30M05N87J095J778J911J316P51Q52J295J360Q93
$$ 320297 321344 321809 321647 321406 321536 321941 322528 323623 325401 327312 328628 329379 330231 331526 332886 333779
52662C33779K65k50o25p39m14J83N66M84K75M66J160J952K412K390J910J039K4
$$ 333779 334044 333794 333169 332430 332016 332199 332765 333249 333524 333990 335150 337102 339514 341904 343814 344853 344877
52645C44877p88j295j757k257k450k086j565j441j610j522j054n38oQ19J744K097
$$ 344877 344089 342794 341037 338780 336330 334244 332679 331238 329628 328106 327052 326514 326508 327327 329071 331168
52629C31168J787J586K008K586K722K523K241J580L27q70j226r29p77r95j267
$$ 331168 332955 334541 336549 339135 341857 344380 346621 348201 348528 347658 346432 345503 344726 343731 342464
52614C42464j620k254k665k004n01M50O6q44j094o56l22m07n15l43p7L5O4K28
$$ 342464 340844 338590 335925 333921 333420 333870 333936 333092 331998 331342 331020 330613 330098 329755 329678 329713 329777 330005
52596C30005O24J111J355J145P19O19R78J233Q94L56M70J340K182K416K341K388
$$ 330005 330629 331740 333095 334240 334959 335578 336556 337789 338683 339039 339509 340849 343031 345447 347788 350176
52580C50176K274J515M27j72j44j28l30j13Q21J616J411O83N01Q34O59k83r96
$$ 350176 352450 353965 354392 354220 354076 353948 353618 353505 354326 355942 357353 358036 358537 359371 360030 359747 358751
52563C58751p73k18k36p65j157j175j055r43r47j309j977k324j849r38k86P0N36
$$ 358751 357978 357760 357524 356759 355602 354427 353372 352429 351482 350173 348196 345872 344023 343085 342799 342869 343405
52546C43405J047J146Q66Q03J164J442J207P11M27M33M59K87j15n89q21o11j42
$$ 343405 344452 345598 346464 347267 348431 349873 351080 351791 352218 352651 353110 353397 353282 352693 351872 351261 351119
52529C51119K70N84Q90R35L97l34k90Q44K110K414J943J896K877M178M741M411
$$ 351119 351389 351973 352863 353798 354195 353861 353571 354415 356525 358939 360882 362778 365655 369833 374574 378985
52513C78985L893L757L927M089M156M076L523K156J39j938l645m851n373n016
$$ 378985 382878 386635 390562 394651 398807 402883 406406 408562 408701 406763 403118 398267 392894 387878
52499C87878m147l690m130m816m697l587k298j629j625j807j720j214m43K24N38
$$ 387878 383731 380041 375911 371095 366398 362811 360513 358884 357259 355452 353732 352518 352075 352299 352837
52484C52837N07K54j83p01r43o10J62R13J384J674J931K117K093J885J777K154
$$ 352837 353344 353598 353415 352714 351771 351161 351323 352236 353620 355294 357225 359342 361435 363320 365097 367251
52468C67251L032L816L848L252K830K995L269L102K622K079J152m87k258l150
$$ 367251 370283 374099 377947 381199 384029 387024 390293 393395 396017 398096 399248 398761 396503 393353
52454C93353l035k754k898l165l085k700k312k032j859j843j972k046j841j219
$$ 393353 390318 387564 384666 381501 378416 375716 373404 371372 369513 367670 365698 363652 361811 360592
52440C60592k56O03P32P7n64m67N8K27k5j30L3K3k41l83n02j146k102k227j012
$$ 360592 360336 360939 361671 361748 361184 360717 360775 361002 360977 360847 360880 360903 360662 360279 359777 358631 356529 354302 353290
52421C53290N50J245J048O56L43O8Q5N96J197J449J653K341L364M250N193O728
$$ 353290 353840 355085 356133 356789 357132 357200 357285 357881 359078 360527 362180 364521 367885 372135 377328 384056
52405C84056Q666J0254J1378J2631J3973J4221J2283Q360L569j105n170q372j0532
$$ 384056 392722 402976 414354 426985 440958 455179 467462 475822 479391 478286 473116 464744 454212
52392D54212j1522j1251r883q031o395n105l835k649k141k464k792k252j059j37
$$ 454212 442690 431439 421556 413525 407130 402025 398190 395541 393400 390936 388144 385892 384833 384696
52378C84696J67M24J170K245L219M055M953N783O019N328M023K793J998J345L76
$$ 384696 384863 385287 386457 388702 391921 395976 400929 406712 412731 418059 422082 424875 426873 428218 428594
52363D28594q23j568j370o28k95q76j977k775k723j778l18R80J484J192Q40J074
$$ 428594 427771 426203 424833 424205 423910 423034 421057 418282 415559 413781 413463 414443 415927 417119 417959 419033
52347D19033J644J799J375R97J048J131Q70P30J402K629L413L365L204L716M867
$$ 419033 420677 422476 423851 424848 425896 427027 427897 428627 430029 432658 436071 439436 442640 446356 451223
52332D51223O169P479Q827R861J0095R747R719J0608J2044J3241J3845J3962J3621
$$ 451223 457392 464871 473698 483559 493654 503401 513120 523728 535772 549013 562858 576820 590441
52319E90441J2695J1385J0385J0240J0833J1666J2495J3387J4254J4826J5120
$$ 590441 603136 614521 624906 635146 645979 657645 670140 683527 697781 712607 727727
52308G27727J5574J6477J7560J8350J8711J8792J8692J8457J8259J8233J8224
$$ 727727 743301 759778 777338 795688 814399 833191 851883 870340 888599 906832 925056
52297I25056J7890J6953J5253J2792R978P506N581L644J346n50j052o22r17k580
$$ 925056 942946 959899 975152 987944 997922 1005428 1011009 1014653 1015999 1015449 1014397 1013775 1012858 1010278
52283A010278m231m289l106k474l359m912n712n260m084k913k064j420o93K42
$$ 1010278 1006047 1001758 998652 996178 992819 987907 982195 976935 972851 969938 967874 966454 965761 966003
52269I66003J236K116K936L892N062O359P689Q985J0104J0877J1313J1627J2039
$$ 966003 967239 969355 972291 976183 981245 987604 995293 1004278 1014382 1025259 1036572 1048199 1060238
52256A060238J2622J3311J4033J4725J5236J5238J4364J2568J0312Q251O724N615
$$ 1060238 1072860 1086171 1100204 1114929 1130165 1145403 1159767 1172335 1182647 1190898 1197622 1203237
52244A203237M677L721K554J075m59j556k109k564l282m010m380m622n302o405
$$ 1203237 1207914 1211635 1214189 1215264 1214805 1213249 1211140 1208576 1205294 1201284 1196904 1192282 1186980 1180575
52230A180575p254p515p694q380r360r940r943r805r757r437q516p230n977m763
$$ 1180575 1173321 1165806 1158112 1149732 1140372 1130432 1120489 1110684 1100927 1091490 1082974 1075744 1069767 1065004
52216A065004l440k298j813j896j876j348n59J78J025K287L869N294O033N769
$$ 1065004 1061564 1059266 1057453 1055557 1053681 1052333 1051774 1051952 1052977 1055264 1059133 1064427 1070460 1076229
52202A076229M660L553L356M049M780N193N921P302Q478Q594Q226Q494R152Q886
$$ 1076229 1080889 1084442 1087798 1091847 1096627 1101820 1107741 1115043 1123521 1132115 1140341 1148835 1157987 1166873
52188A166873P321N503M245L238K090J039J09j345l622o034p888r275j0287j0410
$$ 1166873 1174194 1179697 1183942 1187180 1189270 1190309 1190418 1189073 1185451 1179417 1171529 1162254 1151967 1141557
52174A141557r531q661q663q919q316p003n976n384m417k763r58O72K325L828
$$ 1141557 1132026 1123365 1114702 1105783 1097467 1090464 1084488 1079104 1074687 1071924 1070966 1071638 1073963 1077791
52160A077791M523M324L947L755L289K334J577J559J709J135po53j65J038K130
$$ 1077791 1082314 1086638 1090585 1094340 1097629 1099963 1101540 1103099 1104808 1105943 1105936 1105283 1105118 1106156 1108286
52145A108286K761L208L873M686M968M047J988l94k278l293l364k633j579p68
$$ 1108286 1111047 1114255 1118128 1122814 1127782 1131829 1133817 1133423 1131145 1127852 1124488 1121855 1120276 1119508
52131A119508j92P35K306M055N492O841Q621J0755J2745J4468J6259J8175J9768
$$ 1119508 1119316 1120051 1122357 1126412 1131904 1138745 1147366 1158121 1170866 1185334 1201593 1219768 1239536
52118A239536K0756K1404K1955K2194K1889K1323K0903K0469J9550J8220J7145
$$ 1239536 1260292 1281696 1303651 1325845 1347734 1369057 1389960 1410429 1429979 1448199 1465344
52107A465344J6621J6228J5762J5848J7012J8563J9319J9270J9577K0676K1360
$$ 1465344 1481965 1498193 1513955 1529803 1546815 1565378 1584697 1603967 1623544 1644220 1665580
52096A665580K0276J7602J4495J1487Q179M265m6m485q794j2343j4461j5326j5843
$$ 1665580 1685856 1703458 1717953 1729440 1737619 1741884 1741838 1737353 1728559 1716216 1701755 1686429 1670586
52083A670586j6369j6261j4990j3093j1493j0354r206p929o978o614o455n919
$$ 1670586 1654217 1637956 1622966 1609873 1598380 1588026 1578820 1570891 1563913 1557299 1550844 1544925
52071A544925m822l367j737J01K181M265N939P030P805Q631R563J0437J1226J1987
$$ 1544925 1540103 1536736 1534999 1535100 1537281 1541546 1547485 1554515 1562320 1570951 1580514 1590951 1602177 1614164
52057A614164J2529J2568J2297J2332J2844J3122J2356J0640Q768P199N649L732
$$ 1614164 1626693 1639261 1651558 1663890 1676734 1689856 1702212 1712852 1721620 1728819 1734468 1738200
52045A738200J561m40k092l561m968o158o873p039o795o310n741n371n584o519
$$ 1738200 1739761 1739321 1737229 1733668 1728700 1722542 1715669 1708630 1701835 1695525 1689784 1684413 1678829 1672310
52031A672310p821q887r327r164q655q176q137q732r622j0104r740q833q072p728
$$ 1672310 1664489 1655602 1646275 1637111 1628456 1620280 1612143 1603411 1593789 1583685 1573945 1565112 1557040 1549312
52017A549312p303o043l874j661l25K14Q79K090L023K561O07k053m990q514j2787
$$ 1549312 1542009 1535966 1532092 1530431 1530106 1530320 1531199 1533289 1536312 1538873 1539480 1537427 1532437 1523923 1511136
$$ [...]
##END NTUPLES=NMR SPECTRUM
##END=
