##TITLE=AC1453_NESNAP272_7818805_155McSOorp
##JCAMPDX= 6.0         $$ Bruker NMR JCAMP-DX V2.0
##DATA TYPE= NMR SPECTRUM
##DATA CLASS= NTUPLES
##ORIGIN= BRUKER
##OWNER= Administrator
$$ 1.72 TOPSPIN		Version 2.1
$$ 2013-04-30 18:09:34.246 -0700  Administrator@X
$$ Compression mode = diff/dup
##.OBSERVE FREQUENCY= 400.02188249412
##.OBSERVE NUCLEUS= ^1H
##.ACQUISITION MODE= SIMULTANEOUS (DQD)
##.ACQUISITION SCHEME= undefined
##.AVERAGES= 8
##.DIGITISER RES= 22
##SPECTROMETER/DATA SYSTEM= spect
##.PULSE SEQUENCE= zg30
##.SOLVENT NAME= COFFEE_meoh
##.SHIFT REFERENCE= INTERNAL, COFFEE_meoh, 1, 14.98509
##AUDIT TRAIL= $$ (NUMBER, WHEN, WHO, WHERE, PROCESS, VERSION, WHAT)
$$ ##TITLE= Audit trail, TOPSPIN		Version 2.1
$$ ##JCAMPDX= 5.01
$$ ##ORIGIN= Bruker BioSpin GmbH
$$ ##OWNER= Administrator
$$ $$ E:\/data/COFFEE/nmr/AC1453_NESNAP272_7818805_155McSOorp/10/pdata/1/auditp.txt
$$ ##AUDIT TRAIL=  $$ (NUMBER, WHEN, WHO, WHERE, PROCESS, VERSION, WHAT)
(   1,<2013-04-30 18:09:27.590 -0700>,<Administrator>,<X>,<go>,<TOPSPIN 2.1>,
      <created by zg
	started at 2013-04-30 18:08:21.637 -0700,
	POWCHK enabled, PULCHK disabled,
       configuration hash MD5:
       F7 49 AB AC A2 8D 51 76 73 8D C1 9A A6 38 9F DE
       data hash MD5: 64K
       C1 49 64 A3 FE 63 88 85 8A F0 7E E5 9F 0F 03 D9>)
(   2,<2013-04-30 18:09:30.559 -0700>,<Administrator>,<X>,<proc1d>,<TOPSPIN 2.1>,
      <Start of raw data processing
       efp LB = 0 FT_mod = 6 PKNL = 1 PHC0 = 0 PHC1 = 0 SI = 32K 
       data hash MD5: 32K
       ED CA 71 9E 21 6A 0E 55 92 07 62 88 FD C3 C3 D0>)
(   3,<2013-04-30 18:09:30.918 -0700>,<Administrator>,<X>,<proc1d>,<TOPSPIN 2.1>,
      <pk PHC0 = 99.51416 PHC1 = 0 
       data hash MD5: 32K
       1B 3B 67 D9 3B F6 A2 43 87 8E 8A 59 CA 09 0F CD>)
(   4,<2013-04-30 18:09:30.996 -0700>,<Administrator>,<X>,<proc1d>,<TOPSPIN 2.1>,
      <abs ABSG = 1 
       data hash MD5: 32K
       E2 DC 8E 87 8B A2 A6 05 8A 2A 9A 35 57 07 C1 EF>)
(   5,<2013-04-30 18:09:31.074 -0700>,<Administrator>,<X>,<proc1d>,<TOPSPIN 2.1>,
      <abs ABSG = 2 
       data hash MD5: 32K
       8A 0A 37 E9 14 72 DE 76 C7 4E 09 2D 78 EE 91 82>)
(   6,<2013-04-30 18:09:31.137 -0700>,<Administrator>,<X>,<proc1d>,<TOPSPIN 2.1>,
      <abs ABSG = 3 
       data hash MD5: 32K
       4D 2C 90 5E 9A C8 72 16 DA F8 3D D8 6B 6D 8B CC>)
(   7,<2013-04-30 18:09:31.199 -0700>,<Administrator>,<X>,<proc1d>,<TOPSPIN 2.1>,
      <abs ABSG = 4 
       data hash MD5: 32K
       74 12 89 5B DD 7A 87 B7 19 04 FA 9B DC 83 1B 8F>)
(   8,<2013-04-30 18:09:31.230 -0700>,<Administrator>,<X>,<proc1d>,<TOPSPIN 2.1>,
      <abs ABSG = 5 
       data hash MD5: 32K
       9D DB FD 18 60 19 10 50 3D 11 5E BF 22 D3 8D 71>)
$$ ##END=
$$ 
$$ $$ hash MD5
$$ $$ 89 94 0B 80 73 0A 8F B2 6C BD 9E 0A 37 8E 2E 10
##$RELAX= 
##$RELAX= 
##$RELAX= 
##$RELAX= 
##$RELAX= 
##$RELAX= 
##$RELAX= 
$$ Bruker specific parameters
$$ --------------------------
##$DU= <E:\>
##$EXPNO= 10
##$NAME= <AC1453_NESNAP272_7818805_155McSOorp>
$$ [...]
150 150 150 150 150 150 150 150
##$TP07= 0
##$TPNAME0= <>
##$TPNAME1= <>
##$TPNAME2= <>
##$TPNAME3= <>
##$TPNAME4= <>
##$TPNAME5= <>
##$TPNAME6= <>
##$TPNAME7= <>
##$TPOAL= (0..7)
0.5 0.5 0.5 0.5 0.5 0.5 0.5 0.5
##$TPOFFS= (0..7)
0 0 0 0 0 0 0 0
##$TUNHIN= 0
##$TUNHOUT= 0
##$TUNXOUT= 0
##$USERA1= <user>
##$USERA2= <user>
##$USERA3= <user>
##$USERA4= <user>
##$USERA5= <user>
##$V9= 5
##$VALIST= <valist>
##$VCLIST= <CCCCCCCCCCCCCCC>
##$VD= 0
##$VDLIST= <DDDDDDDDDDDDDDD>
##$VPLIST= <PPPPPPPPPPPPPPP>
##$VTLIST= <TTTTTTTTTTTTTTT>
##$WBST= 1024
##$WBSW= 4
##$XGAIN= (0..3)
0 0 0 0
##$XL= 0
##$YL= 0
##$YMAX_a= 656079
##$YMIN_a= -558362
##$ZGOPTNS= <>
##$ZL1= 120
##$ZL2= 120
##$ZL3= 120
##$ZL4= 120
##$ABSF1= 14.98509
##$ABSF2= -5.573092
##$ABSG= 5
##$ABSL= 3
##$ALPHA= 0
##$AQORDER= 0
##$ASSFAC= 0
##$ASSFACI= 0
##$ASSFACX= 0
##$ASSWID= 0
##$AUNMP= <proc_prof1d_extract_pilot.lims>
##$AXLEFT= 0
##$AXNAME= <>
##$AXNUC= <1H>
##$AXRIGHT= 0
##$AXTYPE= 0
##$AXUNIT= <>
##$AZFE= 0.1
##$AZFW= 0.1
##$BCFW= 0
##$BC_mod= 0
##$BYTORDP= 0
##$COROFFS= 0
##$CY= 15
##$DATMOD= 1
##$DC= 0
##$DFILT= <>
##$DTYPP= 0
##$F1P= 0
##$F2P= 0
##$FCOR= 0.5
##$FTSIZE= 32768
##$FT_mod= 6
##$GAMMA= 0
##$GB= 0
##$INTBC= 1
##$INTSCL= 1
##$ISEN= 128
##$LB= 0
##$LEV0= 0
##$LPBIN= 0
##$MAXI= 10000
##$MC2= 0
##$MEAN= 0
##$ME_mod= 0
##$MI= 0
##$NCOEF= 0
##$NC_proc= -8
##$NLEV= 6
##$NOISF1= 0
##$NOISF2= 0
##$NSP= 0
##$NTH_PI= 0
##$NZP= 0
##$OFFSET= 14.98509
##$PC= 1
##$PHC0= 99.51416
##$PHC1= 0
##$PH_mod= 1
##$PKNL= yes
##$PPARMOD= 0
##$PPDIAG= 0
##$PPIPTYP= 0
##$PPMPNUM= 2147483647
##$PPRESOL= 1
##$PSCAL= 4
##$PSIGN= 0
##$PYNMP= <proc.py>
##$REVERSE= no
##$SF= 400.02
##$SI= 32768
##$SIGF1= 0
##$SIGF2= 0
##$SINO= 400
##$SIOLD= 32768
##$SPECTYP= <>
##$SREGLST= <1H.CDCl3>
##$SSB= 0
##$STSI= 32768
##$STSR= 0
##$SW_p= 8223.68421052631
##$SYMM= 0
##$S_DEV= 0
##$TDeff= 65536
##$TDoff= 0
##$TI= <>
##$TILT= no
##$TM1= 0
##$TM2= 0
##$TOPLEV= 0
##$USERP1= <user>
##$USERP2= <user>
##$USERP3= <user>
##$USERP4= <user>
##$USERP5= <user>
##$WDW= 1
##$XDIM= 32768
##$YMAX_p= 455172659
##$YMIN_p= -699242
##$CURPLOT= <Network HP LaserJet P1505>
##$CURPRIN= <$Network HP LaserJet P1505>
##$DFORMAT= <normdp>
##$LAYOUT= <+/1D_H.xwp>
##$LFORMAT= <normlp>
##$PFORMAT= <normpl>
##$SURQMSG= 1
$$ End of Bruker specific parameters
$$ ---------------------------------
##NTUPLES= NMR SPECTRUM
##VAR_NAME=  FREQUENCY,     SPECTRUM/REAL,   SPECTRUM/IMAG
##SYMBOL=    X,             R,               I
##VAR_TYPE=  INDEPENDENT,   DEPENDENT,       DEPENDENT
##VAR_FORM=  AFFN,          ASDF,            ASDF
##VAR_DIM=   32768,         32768,           32768
##UNITS=     HZ,            ARBITRARY UNITS, ARBITRARY UNITS
##FACTOR=    0.250966925370066, 1,           1
##FIRST=     8223.43324360094, -49823,       -13747
##LAST=      0,             47898,           -246770
##MIN=       0,             -699242,         0
##MAX=       8223.43324360094, 455172659,    0
$$ Real data points
##PAGE= N=1
##DATA TABLE= (X++(R..R)), XYDATA
$$ [...]
19544C17406c17196O9144h7176j80885D2887J92037a70569n9387j03342h9590
$$ 317406 -317196 -248052 -87176 -268061 42887 234924 -170569 -229956 -333298 -89590
19533E1204J03294b14263h5902F4908a13910A25189a03448G2356b5095n1692j94017
$$ 51204 154498 -214263 -85902 64908 -113910 125189 -103448 72356 -25095 -76787 -270804
19522b70804A45017c54628A34154J2085A4013R1467J44783c02208b7844Q742B3853
$$ -270804 145017 -354628 134154 146239 14013 105480 250263 -302208 -27844 -19102 23853
19510f1740F2150c46854A40248e4102j31135f0875C21780a7498A43347E3920a97890
$$ -61740 62150 -346854 140248 -54102 -185237 -60875 321780 -17498 143347 53920 -197890
19498b55886l6946m5060a00136j75843N0673B97308a79161A50727b57268a21273
$$ -255886 -292832 -337892 -100136 -275979 -225306 297308 -179161 150727 -257268 -121273
19487c2114k4469A22993a96727l9571l1273e1119G2619a15512H3755g2993A649
$$ -32114 -56583 122993 -196727 -236298 -267571 -51119 72619 -115512 83755 -72993 1649
19475c4503k30327I6944c9968j23729P2907C7845a95196k19970J60867a17172
$$ -34503 -264830 96944 -39968 -163697 -90790 37845 -195196 -415166 -254299 -117172
19464b94575H8513J97764c35346A83679a21799D9527a45386A59351B8471c24285
$$ -294575 88513 286277 -335346 183679 -121799 49527 -145386 159351 28471 -324285
19453I6861a37667A32845c39035J0174C76814A06700c21640B24142a54526e1304
$$ 96861 -137667 132845 -339035 -328861 376814 106700 -321640 224142 -154526 -51304
19442c57878N2915H6964e7252k13436a01944j63924l8544a44057e2918l52266
$$ -357878 -304963 86964 -57252 -270688 -101944 -265868 -304412 -144057 -52918 -405184
19432d05184a07075j52859I3466d9966p0710k0367A5365J19106m5915a10847A20295
$$ -405184 -107075 -259934 93466 -49966 -120676 -141043 15365 134471 88556 -110847 120295
19420B90589i1094B2853J6151n873R9936e4404O974F0077a68046k30056J80611
$$ 290589 -91094 22853 39004 33131 133067 -54404 -47430 60077 -168046 -398102 -217491
19409b17491A21992a94528f6173A85242B0080K26843G0986K35864a53339a5559
$$ -217491 121992 -194528 -66173 185242 20080 246923 70986 306850 -153339 -15559
19398b03967R4715e0842o8958J9924q4301C57153b63180a21501B18116b33272
$$ -203967 -109252 -50842 -119800 -99876 -184177 357153 -263180 -121501 218116 -233272
19387a14506m5072n8206B3034a54528d4049A83904f5250o1345k17751D0009b1158
$$ -114506 -159578 -217784 23034 -154528 -44049 183904 -65250 -126595 -344346 40009 -21158
19375b65871j2563j59246a23238A64660b09345B54899B2096e3077r1629f409m30813
$$ -265871 -278434 -437680 -123238 164660 -209345 254899 22096 -53077 -144706 -6409 -437222
19364d37222a23934m4995Q4443A11294c8377k21346f5466C344a63622j26359J34700
$$ -437222 -123934 -168929 -84486 111294 -38377 -259723 -65466 3344 -163622 -289981 -155281
19353a55281j64506B66352J20843i4105m5731r3867C08853a50572P2705d129A51397
$$ -155281 -319787 266352 387195 -94105 -139836 -233703 308853 -150572 -77867 -4129 151397
19341A06300d08036C75816G2256K21629b10338P2766j3730F5828f2598j21194
$$ 106300 -408036 375816 72256 293885 -210338 -137572 -151302 65828 -62598 -183792
19331a83792k48588a70377K8183C97850a20712r3569O797A57751E7843K10986
$$ -183792 -432380 -170377 -142194 397850 -120712 -214281 -207484 157751 57843 268829
19321B68829b05471j97543E7568p240d3531l2823C3130c29309c4179k41314b2840
$$ 268829 -205471 -403014 57568 50328 -43531 -76354 33130 -329309 -34179 -275493 -22840
19309A40804a36072C50386e2275j94927j65729e9835j63355J00484A06731J72732
$$ 140804 -136072 350386 -52275 -247202 -412931 -59835 -223190 -122706 106731 279463
19299B79463a10811A09751E0724b55093i7112M0308j78333K1253F1669K2718b72443
$$ 279463 -110811 109751 50724 -255093 -97112 -56804 -235137 -213884 61669 84387 -272443
19287b57094A19867C5475J08366E0505b24578I1778h7464j39149A2594a3645C55739
$$ -257094 119867 35475 143841 50505 -224578 91778 -87464 -226613 12594 -13645 355739
19275e1055k02984J25926A7291h4902G8179O9255b9052F7578J26846a36390H6684
$$ -51055 -254039 -128113 17291 -84902 78179 147434 -29052 67578 194424 -136390 86684
19263e731l24469a42487A30728m8694b35703C1796p97a93942b9871k18384L6575
$$ -5731 -330200 -142487 130728 82034 -235703 31796 30999 -193942 -29871 -248255 -211680
19252b11680G4183e6926b449j69877A44072n6196f1072m9290B30506h9994A53196
$$ -211680 74183 -56926 -2449 -172326 144072 87876 -61072 -110362 230506 -89994 153196
19240c01631J22327L3665M6780B94043b54584i9247K8540J2864B71682b18070
$$ -301631 -179304 -145639 -98859 294043 -254584 -99247 -70707 -57843 271682 -218070
19229b07415i8097A24020k912m6562a42880j62911A67728D6601a92790A35289
$$ -207415 -98097 124020 121108 74546 -142880 -305791 167728 46601 -192790 135289
19218G7331k9206b48795B31972b74835c4359A30547a66298I1383F538K20759c22069
$$ 77331 48125 -248795 231972 -274835 -34359 130547 -166298 91383 6538 227297 -322069
19206A71287b16320c356k73079A99714b9661A24046A9618c34750M2833a26526
$$ 171287 -216320 -3356 -276435 199714 -29661 124046 19618 -334750 -291917 -126526
19195b53386h7824B73722b1909j05360F6237b28160D4785a89026h6892k4764j67180
$$ -253386 -87824 273722 -21909 -127269 66237 -228160 44785 -189026 -86892 -111656 -278836
19184b78836c0694k4951k76800a41444F3831j4715c1908f861k29427d7132j18171
$$ -278836 -30694 -55645 -332445 -141444 63831 49116 -31908 -6861 -236288 -47132 -165303
19173a65303p448k4999g3975G032i5811p2362O1982k37788c636k25737R9315c4580
$$ -165303 -172751 -197750 -73975 7032 -95811 -168173 -106191 -343979 -3636 -229373 -130058 -34580
19160a7636Q764B28693j11550e3552E5759a4092A07929b67864h0050l35339F4179
$$ -17636 -8872 228693 117143 -53552 55759 -14092 107929 -267864 -80050 -415389 64179
19148A74995J05207g9334q9808I73e3084k66463A70331c68244D6124a4738B84648
$$ 174995 280202 -79334 -169142 973 -53084 -319547 170331 -368244 46124 -14738 284648
19136c8285H7057i7822c1059j86275O1962B63141D2949a1441E3567d0325A1779
$$ -38285 87057 -97822 -31059 -217334 -155372 263141 42949 -11441 53567 -40325 11779
19124b66467i3189M313j69498A40529b28020j37486J10487M8960p608c9773B49213
$$ -266467 -93189 -88876 -258374 140529 -228020 -365506 -255019 -206059 -213667 -39773 249213
19112b02678h7120B0766a41526j35805R7794h4478D33349c4421j8700j32855r6112
$$ -202678 -87120 20766 -141526 -277331 -179537 -84478 433349 -34421 -53121 -185976 -282088
19101b82088J35750r0717E1661f2424G5388J514b41802B87380A13558n4201M8312
$$ -282088 -146338 -237055 51661 -62424 75388 76902 -241802 287380 113558 59357 107669
19090A07669i5140C71245c70406A71695a5713j69273D4857e1021q9517m2224e9387
$$ 107669 -95140 371245 -370406 171695 -15713 -184986 44857 -51021 -140538 -182762 -59387
19078d0851I9928a9777A16593L7618n0817c0431A95303a23533A55159d74388A3535
$$ -40851 99928 -19777 116593 154211 103394 -30431 195303 -123533 155159 -474388 13535
19066C791b93345A63011a01194G9665a59939A26815e9258M518j71068B24889A1235
$$ 3791 -293345 163011 -101194 79665 -159939 126815 -59258 -54740 -225808 224889 11235
19054b9694A62952a62530m1323C2648A0011N2618c29038c3317k68678A14296h3126
$$ -29694 162952 -162530 -203853 32648 10011 62629 -329038 -33317 -301995 114296 -83126
19042B75976c54475J61550A31000b0410j56415B82046j4941c2467m0042A35448
$$ 275976 -354475 -192925 131000 -20410 -176825 282046 267105 -32467 -72509 135448
19031i885A27245h4048B11922I7933b00768o7391N8658A65811n8687h599j7946
$$ -9885 127245 -84048 211922 97933 -200768 -268159 -209501 165811 107124 -8599 -26545
19020b6545H3128P6767a14951A39756d1308k9749j61249A2890b05867B32576n8941
$$ -26545 83128 159895 -114951 139756 -41308 -71057 -232306 12890 -205867 232576 173635
19009A73635b86773f1968k27799B27360B0613r983N3660j0468b12942e8734j25525
$$ 173635 -286773 -61968 -289767 227360 20613 10630 64290 53822 -212942 -58734 -184259
18998a84259o0868R3133n8489j23004J0918g3147j32704k9205L3346h8094m7317
$$ -184259 -245127 -151994 -210483 -333487 -322569 -73147 -205851 -235056 -201710 -88094 -135411
18987a35411K2296d76r3670A29333a06585a5262m5701m78160a57755O7575B91586
$$ -135411 -113115 -476 -94146 129333 -106585 -15262 -60963 -539123 -157755 -90180 291586
18975A09444J1396c8393q2408A08290e4569m1968b4261r4767j98516c5218A89343
$$ 109444 120840 -38393 -120801 108290 -54569 -96537 -24261 -119028 -317544 -35218 189343
18963G7844P542a56505A1217L09107A39952k5342a68004J3556a3382m78127A16647
$$ 77844 85386 -156505 11217 320324 139952 114610 -168004 -154448 -13382 -491509 116647
18951a32314m8596a1804j13312C01178F9316f0575q3910r6380H5531g6524l5088
$$ -132314 -180910 -11804 -125116 301178 69316 -60575 -144485 -240865 85531 -76524 -111612
18940a11612j3936C9059a19999F492J26399d51029K25459G5206b88796I8641O3447
$$ -111612 -125548 39059 -119999 6492 132891 -451029 -225570 75206 -288796 98641 162088
18929A62088I380c9098C599f4789A27936a34399j7797l87209I3670a02208A44348
$$ 162088 9380 -39098 3599 -64789 127936 -134399 -152196 -539405 93670 -102208 144348
18917H8331g077j16668F9093J03860J66617d8672p9606A8545b10461K0612A78844
$$ 88331 -7077 -123745 69093 172953 339570 -48672 -128278 18545 -210461 -189849 178844
18905G89J22172g2467r0380g5563b4341j15341h630p0422q531j73774C0334L6791
$$ 789 122961 -72467 -162847 -75563 -24341 -139682 -8630 -79052 -87583 -261357 30334 67125
18893F7125a49006A34453c30735a42094b0494A4623b34519D3376a1395G2436a16827
$$ 67125 -149006 134453 -330735 -142094 -20494 14623 -234519 43376 -11395 72436 -116827
18881G4639J20214d5919J9110B08469a94874D8566K26728A298M9037b82844E7273
$$ 74639 194853 -45919 -26809 208469 -194874 48566 275294 1298 50335 -282844 57273
18869g8932j72923A64576i7386A31036a81549G7323b99296c3781p1510C2941e5392
$$ -78932 -251855 164576 -97386 131036 -181549 77323 -299296 -33781 -105291 32941 -55392
18857A00267B6524g6705i732A39706i4548B36766d4034a7392F2801c37401a57474
$$ 100267 26524 -76705 -9732 139706 -94548 236766 -44034 -17392 62801 -337401 -157474
18845a25249A41698a80702C6452a48601p894A39154F6113a21431B41195d4188
$$ -125249 141698 -180702 36452 -148601 -156495 139154 66113 -121431 241195 -44188
18834f93404B47662b48424k5330a18931j02146J5797G010a38935J5111q2327H409
$$ -693404 247662 -248424 -273754 -118931 -221077 -205280 7010 -138935 -123824 -206151 8409
18822a10492k8657O062l1219A43699J71072o7570A22891o63R8207d0742A40658
$$ -110492 -139149 -133087 -164306 143699 314771 247201 122891 122228 220435 -40742 140658
18810d460p7896D98a37079N633I9141c5636p5799A4261a75797d9655q9652a9666
$$ -4460 -82356 498 -137079 -131446 99141 -35636 -111435 14261 -175797 -49655 -139307 -19666
18797b35495b5045B6837e0069A30033b9756M697L088m4324k3570c4739C205d2984
$$ -235495 -25045 26837 -50069 130033 -29756 -25059 -21971 -66295 -89865 -34739 3205 -42984
18784b11124B9604L6360A2240J8386a5603A22066b75239J12358M6403A2980a52814
$$ -211124 29604 65964 12240 30626 -15603 122066 -275239 -162881 -116478 12980 -152814
18772G126R6851c34274J63600B02892k1194n8554a33874e1484A16084b42372H9626
$$ 7126 103977 -334274 -170674 202892 181698 123144 -133874 -51484 116084 -242372 89626
18760a8299m2900B24196c44720f3901k1614A66308c5203m854A70412e8871P857
$$ -18299 -61199 224196 -344720 -63901 -85515 166308 -35203 -40057 170412 -58871 -51014
18749e1014C3299a05802H888J96125F4681h5293k97858c5363m2588m518r2404
$$ -51014 33299 -105802 8888 205013 64681 -85293 -383151 -35363 -77951 -82469 -174873
18738a74873d3706j10135m7557d5458B32b01824j18161d2405j37861k36850a47732
$$ -174873 -43706 -153841 -201398 -45458 232 -201824 -319985 -42405 -180266 -417116 -147732
18726A78664c02586e5001B3666J67745b5750A7749b36957C48143c25014F1854
$$ 178664 -302586 -55001 23666 191411 -25750 17749 -236957 348143 -325014 61854
18715a0336A18137L2481a83693K5264A76007E1531M2401a33245j01098k0668E9340
$$ -10336 118137 150618 -183693 -158429 176007 51531 93932 -133245 -234343 -255011 59340
18703a88310K8574K8838o8158a2969p2729j30425L320d1045k43767R3536e0667
$$ -188310 -159736 -130898 -199056 -12969 -85698 -216123 -212803 -41045 -284812 -191276 -50667
18691A16691b51830f9818m5504j1010A18231P0035h4118n1243a1039m1549j8577
$$ 116691 -251830 -69818 -115322 -126332 118231 188266 -84118 -135361 -11039 -52588 -71165
18680g1165k80151a7179q5091D2822h1389o1734l5045l2319j17062q5734B0884
$$ -71165 -351316 -17179 -102270 42822 -81389 -143123 -178168 -210487 -327549 -413283 20884
18668b80373j3705j11165i227r5535L792a1242j02961B13971f4782p3529A13337
$$ -280373 -294078 -405243 -9227 -104762 -100970 -11242 -114203 213971 -64782 -138311 113337
18656A51209f7095m509b8233B51821a69686L3126G4570J96919q5482c52762B09507
$$ 151209 -67095 -71604 -28233 251821 -169686 -136560 74570 271489 186007 -352762 209507
18644i2925k0420N1659j03590A77499e2175e7k43188a10263c3450B11596a63300
$$ -92925 -113345 -61686 -165276 177499 -52175 -57 -243245 -110263 -33450 211596 -163300
18632b10541m962E8081b83949a07080e2717A43814B2455b70901J25171K7133k17723
$$ -210541 -215503 58081 -283949 -107080 -52717 143814 22455 -270901 -145730 -118597 -336320
18621c36320i331B3692c49526H6305h8914B57877i4584k08981A34530e9273m4419
$$ -336320 -9331 23692 -349526 86305 -88914 257877 -94584 -303565 134530 -59273 -103692
18610a03692A96658b5706B32402b43327C44666C1442i5301j65842K9294g669p2083
$$ -103692 196658 -25706 232402 -243327 344666 31442 -95301 -261143 -231849 -7669 -79752
18599g9752B7580b03432l7412o8238A58608b24981M4471R0070a9259l36109a36697
$$ -79752 27580 -203432 -240844 -309082 158608 -224981 -180510 -90440 -19259 -355368 -136697
18587b65591J19394A1387a84042g2709j58880D483a76042c8748j8146m4526j78525
$$ -265591 -146197 11387 -184042 -72709 -231589 4483 -176042 -38748 -56894 -101420 -279945
18576b79945b8635o7571A93318a00947A80678e4122e714D09688a89374O3573j26131
$$ -279945 -28635 -96206 193318 -100947 180678 -54122 -5714 409688 -189374 -125801 -251932
18565b51932E1089N4714h2162D0346a02805a7021k04412e5090j5992q8746m9746
$$ -251932 51089 105803 -82162 40346 -102805 -17021 -221433 -55090 -71082 -159828 -209574
18554b09574q2825a4633j13261C90301j63928A9997L09313b07350f8914j61397
$$ -209574 -292399 -14633 -127894 390301 226373 19997 329310 -207350 -68914 -230311
18544b30311k92883i7509b8193A76137a05804B81373A1913b68668f6983j30845
$$ -230311 -523194 -97509 -28193 176137 -105804 281373 11913 -268668 -66983 -197828
18534a97828A33693e6030o1689q0207H0810a050C56658b42274H148M0142i0970
$$ -197828 133693 -56030 -117719 -197926 80810 -1050 356658 -242274 8148 48290 -90970
18522a65023f3238j41005D2020K5476d41202A99747N9460J4278i6005k28985L8298
$$ -165023 -63238 -204243 42020 67496 -441202 199747 259207 273485 -96005 -324990 -286692
18511b86692d1647m4033k35095a13689k54017k5483a26950b0136o5618l02930
$$ -286692 -41647 -85680 -320775 -113689 -367706 -393189 -126950 -20136 -85754 -388684
18501c88684f5234O060A8067a06676o8612j72781A65220c99405a3457j51076A14667
$$ -388684 -65234 -59174 18067 -106676 -175288 -348069 165220 -399405 -13457 -164533 114667
18489a49665N8979R081j57992a03283B25441c0534m0071L3586n374H0105a30094
$$ -149665 -90686 -81605 -239597 -103283 225441 -30534 -70605 -37019 -42393 80105 -130094
18477h3239B28366a51295A53770b7914j91306H333b58170B25328C3365b76195
$$ -83239 228366 -151295 153770 -27914 -219220 8333 -258170 225328 33365 -276195
18466F1505a1382A85572c2231A24278i1746K5468r0980B9676d05683F6443a11200
$$ 61505 -11382 185572 -32231 124278 -91746 -66278 -157258 29676 -405683 66443 -111200
18454A47443a33776e7960m8822r1649d8284r1830A44666j377g3165r1492O8721
$$ 147443 -133776 -57960 -106782 -198431 -48284 -140114 144666 143289 -73165 -164657 -95936
18443i5936L2147k48709A07491a72610A16745d7279A2940R1000J65616a46892
$$ -95936 -63789 -312498 107491 -172610 116745 -47279 12940 103940 269556 -146892
18432h3264k1196j09239D3965d39072e8083C7162O8522b90146C29383c30563a9573
$$ -83264 -104460 -213699 43965 -439072 -58083 37162 105684 -290146 329383 -330563 -19573
18420g461k31228J1658L4104F1952a4038G4081l3548a07924K3249A13043P7231
$$ -7461 -238689 -227031 -192927 61952 -14038 74081 40533 -107924 -84675 113043 190274
18409A90274b1067c015A12815a55165B0051c73910b3167j28982I1334N1764b31622
$$ 190274 -21067 -3015 112815 -155165 20051 -373910 -23167 -152149 91334 143098 -231622
18397b42648P3412b2253B39099i9465C33481A62526a93326A74206a37033Q101
$$ -242648 -169236 -22253 239099 -99465 333481 162526 -193326 174206 -137033 -128932
18387a28932P655j45424J27211N7462a407j43045l8355Q8808F4547J06350A3020
$$ -128932 -121277 -266701 -139490 -82028 -1407 -144452 -182807 -93999 64547 170897 13020
18375c768k62640a11845B78899b33129B03257b47766e500A04951b03710A8111
$$ -3768 -266408 -111845 278899 -233129 203257 -247766 -5500 104951 -203710 18111
18364C42852a2922A37373a41613k60367B11764b48348H199J09445b21163C06739
$$ 342852 -12922 137373 -141613 -401980 211764 -248348 8199 117644 -221163 306739
18353b85617f6150b6061k33707D4319a23636A9312O0047h0000j13814C24851a11901
$$ -285617 -66150 -26061 -259768 44319 -123636 19312 79359 -80000 -193814 324851 -111901
18341d21729A2067P4080c3025B23170b06909A35925I280a41279O5735E8974a20188
$$ -421729 12067 86147 -33025 223170 -206909 135925 9280 -141279 -75544 58974 -120188
18329A17760b73384B95362r4985a12744A77297R8053a49310r7773A84807b05227
$$ 117760 -273384 295362 200377 -112744 177297 275350 -149310 -247083 184807 -205227
18318d13165a28440A52073d311F6054a17313A03773f7175c131k8884A91253j8814
$$ -413165 -128440 152073 -4311 66054 -117313 103773 -67175 -3131 -32015 191253 172439
18307A72439j3791A3468O6942e7065G3216c0806j07354A15193l654a88450Q5023
$$ 172439 158648 13468 80410 -57065 73216 -30806 -138160 115193 111539 -188450 -103427
18296a03427l62697A45603b01061C90191b52799d1958m97403g5535C58b21224
$$ -103427 -466124 145603 -201061 390191 -252799 -41958 -539361 -75535 358 -221224
18285b14175g6204k33046A14314L33324a78053O3006f047B0962e3629j96100f4604
$$ -214175 -76204 -309250 114314 447638 -178053 -115047 -6047 20962 -53629 -249729 -64604
18273a82031B5445J22775K2575d7895D96799a03973L8370N31A72548o0589i7225
$$ -182031 25445 148220 170795 -47895 496799 -103973 -65603 -65072 172548 111959 -97225
18261a6091j9351c099o6305q6115A89864i4444k70963G0595a95231R4393k06377
$$ -16091 -35442 -3099 -69404 -155519 189864 -94444 -365407 70595 -195231 -100838 -307215
18250c07215J50047r8783m9551g4084B6022a70228n4190C15980a46087C22631
$$ -307215 -157168 -255951 -305502 -74084 26022 -170228 -224418 315980 -146087 322631
18239A66763f8229A9886g0A17884R5376c46607B65066A14857b06223A49368b43754
$$ 166763 -68229 19886 -70 117884 213260 -346607 265066 114857 -206223 149368 -243754
18227g3571k41388A6417M4813b05343N2480C4321a8622C7886Q10a69576f6110
$$ -73571 -314959 16417 61230 -205343 -152863 34321 -18622 37886 38696 -169576 -66110
18215B5288K61805a34467N9118k12396k524i4543j67737f1680A1422h0857F0074
$$ 25288 287093 -134467 -75349 -287745 -290269 -94543 -262280 -61680 11422 -80857 60074
18203a2450n5042b1111j85080A15977c38990a64251A31977i1832o3988C0868g1685
$$ -12450 -67492 -21111 -206191 115977 -338990 -164251 131977 -91832 -155820 30868 -71685
18191b92646a19770j53191A26675a59199f26D0054K27303A12050l741e4864k09704
$$ -292646 -119770 -272961 126675 -159199 -626 40054 267357 112050 108309 -54864 -264568
18180b64568P7590C36924j59755b76858c6279A48844Q3737h547j26547l5179B81563
$$ -264568 -186978 336924 177169 -276858 -36279 148844 232581 -8547 -135094 -170273 281563
18168b55083n306A50093a22964l9516l4133B62076c9913A47392i2573K8550A8409
$$ -255083 -260389 150093 -122964 -162480 -196613 262076 -39913 147392 -92573 -64023 18409
18156G7327b13301E8510j4859c34090J33067P8091K9267D16931D3358A2748J11643
$$ 77327 -213301 58510 43651 -334090 -201023 -122932 -93665 416931 43358 12748 124391
18145A24391J78275F8865J74811q2198e1568B52742I1319a56173b662k39071G3299
$$ 124391 302666 68865 243676 161478 -51568 252742 91319 -156173 -2662 -241733 73299
18133b5132H3437i8336K2745A7593K3675e0503A34068D6353d4911A6414R5302
$$ -25132 83437 -98336 -75591 17593 41268 -50503 134068 46353 -44911 16414 111716
18122A11716K55144e9698l52250H3429b73718j65395c8116q1764H7648b02576
$$ 111716 366860 -59698 -411948 83429 -273718 -439113 -38116 -119880 87648 -202576
18111B46934l1941I42c91046a01590B04409a85795C69723b4991j20379H3592i9187
$$ 246934 214993 942 -391046 -101590 204409 -185795 369723 -24991 -145370 83592 -99187
18099G853a78083A28040l1628d8425l9847n3012a8107B24747C63P384b1966L804
$$ 7853 -178083 128040 96412 -48425 -88272 -141284 -18107 224747 363 7747 -21966 -18162
18087a8162j62333g5398C9767J52218F6590a48152O5979G4401c1459A10334C0121
$$ -18162 -180495 -75398 39767 191985 66590 -148152 -82173 74401 -31459 110334 30121
18075b82417B39655p1845A9876a96773j4389c2906A92912a38235k28081A0631
$$ -282417 239655 167810 19876 -196773 -211162 -32906 192912 -138235 -366316 10631
18064A10977a28953D7068P0947J49093h0931L6195j28503A03044n300e4894C49327
$$ 110977 -128953 47068 118015 267108 -80931 -44736 -173239 103044 97744 -54894 349327
18052f4874J8464E3704h859n1268o7403A92452e1979k31330f7358k35702G9879
$$ -64874 -46410 53704 -8859 -60127 -127530 192452 -51979 -283309 -67358 -303060 79879
18040i1311a4259j08038N892o8327A49978k1293b30331A13296c56B33584B3953
$$ -91311 -14259 -122297 -116405 -184732 149978 128685 -230331 113296 -356 233584 23953
18028A03799a45754B3452a10270q1184b723C1855K97888f7179C0059Q6779f4975
$$ 103799 -145754 23452 -110270 -191454 -2723 31855 329743 -67179 30059 116838 -64975
18016c01042o7079e0820B2571O2653c75965a69577K2047D903Q3496g0300k18904
$$ -301042 -368121 -50820 22571 85224 -375965 -169577 -147530 4903 88399 -70300 -289204
18005b89204A12826f445n4894j4225K4846A05720b30267j47661B4865J68268b41784
$$ -289204 112826 -6445 -61339 -75564 -50718 105720 -230267 -377928 24865 193133 -241784
17993b5196A67649c05337a18642o6810A14233a63795n1656m8739B09291J06030
$$ -25196 167649 -305337 -118642 -185452 114233 -163795 -215451 -264190 209291 315321
17983C15321b06437A04587b8928I3476J5914A6569i0379F8621a8394j24329c8656
$$ 315321 -206437 104587 -28928 93476 109390 16569 -90379 68621 -18394 -142723 -38656
17971A55144B118g0596b5827j39305M2683k516c3128H7717m1448b64989A27212
$$ 155144 2118 -70596 -25827 -165132 -122449 -124965 -33128 87717 46269 -264989 127212
17959i3290A1054a85842r1677B9912J09287l4150f3088n8304c0033l83083B12522
$$ -93290 11054 -185842 -277519 29912 139199 105049 -63088 -121392 -30033 -413116 212522
17947b83501c9425C9086c5350G878K69939j10401d9041k2016K4088q1826m9807
$$ -283501 -39425 39086 -35350 7878 277817 167416 -49041 -71057 -46969 -128795 -178602
17936a78602A15444F768L2840b23922b4524j89488A6592J00617f9268A74851b49132
$$ -178602 115444 6768 39608 -223922 -24524 -214012 16592 117209 -69268 174851 -249132
17924b71028A50749g2081E0451b77660g7738A91758L1369r8042b22830E398h7902
$$ -271028 150749 -72081 50451 -277660 -77738 191758 223127 125085 -222830 5398 -87902
17912B77584a94996b5138A98876L7424c8542A76582J10522l6610J28718a36762
$$ 277584 -194996 -25138 198876 236300 -38542 176582 287104 250494 379212 -136762
17901h5952L9366A77750D2350j2176j1452a46385k4753N3496B6229i30A32412
$$ -85952 -46586 177750 42350 30174 18722 -146385 -171138 -117642 26229 -930 132412
17889c4224j12082N6661l098k07023a4133C2143f6927C65981h5250j6450I6142
$$ -34224 -146306 -89645 -92743 -299766 -14133 32143 -66927 365981 -85250 -101700 96142
17877C67875c2405C2980f2711H0600c7257C7099R387N2336M0159M1492a46756
$$ 367875 -32405 32980 -62711 80600 -37257 37099 46486 98822 138981 180473 -146756
17865A27248D5918M8083A7882a32053M877d3772b05A20877c75674a85719C2166
$$ 127248 45918 94001 17882 -132053 -127176 -43772 -205 120877 -375674 -185719 32166
17853C18883a0763j14802I868J81068e6559l7032B47489J87834i4834A07250m6731
$$ 318883 -10763 -125565 9868 190936 -56559 -93591 247489 435323 -94834 107250 60519
17842F0519A5393a61270b3319B9969J42971n5913A5985a20115j91567J29484M7635
$$ 60519 15393 -161270 -23319 29969 172940 117027 15985 -120115 -311682 -182198 -134563
17831a34563g239I1302h4490K0185b2966D910h9290I7481A2987a43871d700G1237
$$ -134563 -7239 91302 -84490 -64305 -22966 4910 -89290 97481 12987 -143871 -4700 71237
17818b1574q1210I0149a23481C2709b31756G4317c27365B39955f6625o8665A38271
$$ -21574 -102784 90149 -123481 32709 -231756 74317 -327365 239955 -66625 -135290 138271
17806f8411j4588j85856h3776m455A98222c26025f9406a6569r5807o3715G6667
$$ -68411 -82999 -268855 -83776 -88231 198222 -326025 -69406 -16569 -112376 -176091 76667
17794B83161a97879O4657j7143C80609e4333D5483A7428e7135m03059B18970B4339
$$ 283161 -197879 -133222 -150365 380609 -54333 45483 17428 -57135 -460194 218970 24339
17782c70821D3865d7302f329j13856M0161A39395J61917A40266e6637k6741l48054
$$ -370821 43865 -47302 -6329 -120185 -80024 139395 301312 140266 -56637 -83378 -431432
17771d31432B7804J08243G520L23383a33808a6748q5180a0141p8230A72362I378
$$ -431432 27804 136047 7520 330903 -133808 -16748 -101928 -10141 -88371 172362 9378
17759e3477G1488J09648a98638B20588q2728a56109d5282A54047b2228E4838b43792
$$ -53477 71488 181136 -198638 220588 137860 -156109 -45282 154047 -22228 54838 -243792
17747f4578n6302A23060D398a54347A5893a08486j36278O4060h3547c071A37611
$$ -64578 -120880 123060 4398 -154347 15893 -108486 -244764 -180704 -83547 -3071 137611
17735A53993J12861I6645h2771j04435A09567g8403B7049a69379C3717J14967
$$ 153993 266854 96645 -82771 -187206 109567 -78403 27049 -169379 33717 148684
17725A48684m4912k8568C283J44928B9835e2048j33917Q6492K1336j66730C8625
$$ 148684 103772 75204 3283 148211 29835 -52048 -185965 -99473 -78137 -244867 38625
17713I9761j0148k6176L17587b26893c8590I3104J15217d5590E8575d9903j04150
$$ 99761 89613 63437 381024 -226893 -38590 93104 208321 -45590 58575 -49903 -154053
17702a54053O3419F3453J76340H198k05Q9320M0699R6107a42828E7731e5374o3085
$$ -154053 -90634 63453 239793 8198 7993 97313 138012 234119 -142828 57731 -55374 -118459
17690a18459c6167j97136f9751A30257d036j16643D4329L42230c3998J3038n8478
$$ -118459 -36167 -233303 -69751 130257 -4036 -120679 44329 386559 -33998 -20960 -79438
17679g9438b0134B7804N0491A3955M8882R2403a08063r884B94588r2404a20687
$$ -79438 -20134 27804 78295 13955 62837 155240 -108063 -117947 294588 202184 -120687
17667B3204R1192J28173a42069H6532J09771M8888b81105B03608P9732D9451G921
$$ 23204 114396 242569 -142069 86532 196303 245191 -281105 203608 283340 49451 7921
17655B7638J40224F0047f2419c0514G3869l4653C003J96645D3956J69652h986
$$ 27638 167862 60047 -62419 -30514 73869 39216 3003 199648 43956 213608 -8986
17643E4219L29808G1218Q0864a12629A71028b33085h354I7491B5964j24J48040
$$ 54219 384027 71218 152082 -112629 171028 -233085 -8354 97491 25964 25840 173880
17632A73880f9758B27953H1119C3496b2259p1839b0925C34048d5089A38164m1810
$$ 173880 -69758 227953 81119 33496 -22259 -94098 -20925 334048 -45089 138164 96354
17621I6354C0244O019c8261C39141d6413C5589a9598k12267I1210i57C4863a81759
$$ 96354 30244 36263 -38261 339141 -46413 35589 -19598 -231865 91210 -957 34863 -181759
17608A83130H4329b64017A19840F702a79662K2309C5402b22208P3567A18130L7740
$$ 183130 84329 -264017 119840 6702 -179662 -157353 35402 -222208 -148641 118130 155870
17597A55870N894a13010A28997Q7117c1189k90408a13593A41317b09630K1402
$$ 155870 161764 -113010 128997 216114 -31189 -321597 -113593 141317 -209630 -188228
17587a88228h3990a5759C73152B2389R8981D3942L45211A29760j8856J60067i9870
$$ -188228 -83990 -15759 373152 22389 121370 43942 389153 129760 110904 270971 -99870
17575b66890J27072C84491e5571m3903k11863A58494C4672h5554L7537B00245
$$ -266890 -139818 384491 -55571 -99474 -311337 158494 34672 -85554 -48017 200245
17564b27873A76578a24439B59689j01674b82770C65051h7096B51811a10621l3190
$$ -227873 176578 -124439 259689 158015 -282770 365051 -87096 251811 -110621 -143811
17554a43811e7900H6078b28432J03432j8045q721A67791e5187C24089I4284L49564
$$ -143811 -57900 86078 -228432 -125000 -143045 -151766 167791 -55187 324089 94284 443848
17543D43848a51499B57181j4884D6667P5227A3665N016N5244h8549E08125c1561
$$ 443848 -151499 257181 242297 46667 121894 13665 18681 73925 -88549 508125 -31561
17531I6791d2610q5471e8181J0903k43238c8085l2036B21070p6575L03797A61329
$$ 96791 -42610 -128081 -58181 -47278 -290516 -38085 -70121 221070 144495 448292 161329
17519e447A11536k9903D417J59914h2349B15622J478j07598N7371b93328f6142
$$ -5447 111536 81633 4417 164331 -82349 215622 217100 109502 166873 -293328 -66142
17507F8493P9249J7373a50380A65575J70244A7912L3072j1840K08411G1795m275
$$ 68493 147742 165115 -150380 165575 335819 17912 50984 39144 247555 71795 67520
17496F7520K39248a42228A34212O3859e8680D51656A04326a05342c7992j4193
$$ 67520 306768 -142228 134212 198071 -58680 451656 104326 -105342 -37992 -52185
17486e2185o4076q9289A35920J7398o7093g2228B05214A01080J90642l6162p2876
$$ -52185 -116261 -205550 135920 153318 86225 -72228 205214 101080 291722 255560 182684
17475A82684p6470L21725j80111n9628G4374K85394a11604D4736J22425D2041
$$ 182684 106214 427939 247828 188200 74374 359768 -111604 44736 167161 42041
17464A045J37026L7679L9687D2362K0679M7050i8964H2528c2979C7195J50141
$$ 1045 138071 175750 215437 42362 63041 110091 -98964 82528 -32979 37195 187336
17453A87336b06460D85754B14652J56229H2608N0529L00273r0468Q8159r9851
$$ 187336 -206460 485754 214652 370881 82608 133137 433410 342942 431101 331250
17443C31250A37030R0854a04275D53065j99194r8385L24654k31669d2559A19465
$$ 331250 137030 227884 -104275 453065 253871 155486 480140 248471 -42559 119465
17432E93073k40180A11845n3172d0551d310C93473e9725A1466J96252P9416O1210
$$ 593073 352893 111845 58673 -40551 -4310 393473 -59725 11466 207718 287134 348344
17421C48344j68959e1980C48846b33919D5194K41499J15154J18447B31876j11317
$$ 348344 179385 -51980 348846 -233919 45194 286693 401847 520294 231876 120559
17411A20559J72310j45318R7741O047J17785b2522l1042A89265o8557N2793J37359
$$ 120559 292869 147551 245292 251339 369124 -22522 -53564 189265 120708 173501 310860
17400C10860J27433A61740j1073e083C5710K61739C4697L22578A26349E6924J47689
$$ 310860 438293 161740 150667 -5083 35710 297449 34697 357275 126349 56924 204613
17389B04613a40382j22961C38267I8113a09109A54049B4265L06239I2150J75387
$$ 204613 -140382 -263343 338267 98113 -109109 154049 24265 330504 92150 267537
17379B67537p4776l6856a428B59904C1078b8236A97737J15499A10768N6774N7074
$$ 267537 192761 155905 -1428 259904 31078 -28236 197737 313236 110768 167542 224616
17368B24616J74111a34252f3500o0542A92103n003B6258J6690J20878a20580B56586
$$ 224616 398727 -134252 -63500 -124042 192103 187100 26258 42948 163826 -120580 256586
17356F9038K14151i4125A23789J74283A17326J24554E5163a98927A56782D3478
$$ 69038 283189 -94125 123789 298072 117326 241880 55163 -198927 156782 43478
17345A21755D3228j8313I069K82554f3622A09310a61051d1684A40406a03563B32715
$$ 121755 43228 24915 9069 291623 -63622 109310 -161051 -41684 140406 -103563 232715
17333A7307e1997p845A64524n2859J48542J400C7818f5870C22202j7855l9627
$$ 17307 -51997 -59842 164524 111665 260207 261607 37818 -65870 322202 304347 264720
17322B64720k0018d986A23572a39372A18941J43480j13025F1126A2997f7736A64288
$$ 264720 244702 -4986 123572 -139372 118941 262421 149396 61126 12997 -67736 164288
17310a63714K4987A20163k999K7011c106B78498a31136B10775P2792J68207a02322
$$ -163714 -138727 120163 117164 144175 -3106 278498 -131136 210775 283567 451774 -102322
17298a07124D08960l2842B4055k138L450J32268P8439q929j6123m6426J36321
$$ -107124 408960 376118 24055 21917 25367 157635 236074 227145 211022 164596 300917
17287C00917L69239E0542b1541B87654E3384B5574K57328a00554C50170F4084
$$ 300917 670156 50542 -21541 287654 53384 25574 282902 -100554 350170 64084
17276f842D31539j97990C8066J02666b5061B14802O8820G8685d3620A5381K77609
$$ -6842 431539 233549 38066 140732 -25061 214802 283622 78685 -43620 15381 292990
17265B92990g710F4333M25787j41402a2123K285o0551E0614L6020K45454m3052
$$ 292990 -7710 64333 490120 348718 -12123 -9838 -70389 50614 86634 332088 289036
17254B89036P5539n9931j48002c1942G5673K01536m566m4866a35968A09515M6005
$$ 289036 364575 304644 156642 -31942 75673 277209 272643 227777 -135968 109515 155520
17243A55520a05976D18418j98605d8503B45873A07021K87109A93093O7808I0494
$$ 155520 -105976 418418 219813 -48503 245873 107021 394130 193093 260901 90494
17232A27945j1140n0615K4946o138K39704p8131M9924f5272J2355D49976A88152
$$ 127945 116805 66190 91136 84998 324702 246571 296495 -65272 -52917 449976 188152
17220B61858R3338K83498A27519L00859m5199j12197A24098K33247P8271K3663
$$ 261858 355196 638694 127519 428378 383179 270982 124098 357345 435616 459279
17210D59279b8942B22807I1596J3810K66598N62j74921N2955j7765C4989N0634
$$ 459279 -28942 222807 91596 105406 372004 372566 197645 250600 232835 34989 85623
17199H5623J23609l4840K36297p1669I2763K02738n6699d290H4100b3276B31062
$$ 85623 209232 174392 410689 339020 92763 295501 238802 -4290 84100 -23276 231062
17187C05986M4761a6996C70527F5291M45922B54669o5939J73287g0440E86762
$$ 305986 350747 -16996 370527 65291 511213 254669 188730 362017 -70440 586762
17176B41125q6440J11918j31522M26903B14017p0231j0425H084K48435g90A11527
$$ 241125 154685 266603 135081 561984 214017 143786 133361 8084 256519 -790 111527
17164D91472j74965A56377k0056d1545D10020j70374K3783j09007N4911l6707
$$ 491472 316507 156377 136321 -41545 410020 239646 263429 154422 209333 172626
17154A72626F4876K96405A35715J06114J80550J2307j04911j30622J95075j1961
$$ 172626 64876 361281 135715 241829 422379 434686 329775 199153 394228 382267
17144C82267A21136J38123J9331Q4259P1253j42778K57902k19748J2833n2732
$$ 382267 121136 259259 278590 362849 434102 291324 549226 329478 342311 289579
17134B89579j8795K90826B67209A13998R1893K20926r6189O4517K01190k34091
$$ 289579 270784 561610 267209 113998 205891 426817 330628 395145 596335 362244
17124C62244K79794a4840E08977A68650o2663b6194D97273j78651q8645b8036
$$ 362244 642038 -14840 508977 168650 105987 -26194 497273 318622 229977 -28036
17113E07277k42260J86998j70081A11872O6849K05548R0689R5926B31259J93494
$$ 507277 265017 452015 281934 111872 178721 384269 474958 570884 231259 424753
17103D24753j85329P6619k7349J05003a13169C03228J23178k1506j32870N1132
$$ 424753 239424 316043 288694 393697 -113169 303228 426406 404900 272030 323162
17093C23162K43864k10590K59900j46837o9558n2023L3157O6251K22172L8473
$$ 323162 567026 356436 616336 469499 399941 347918 381075 447326 669498 707971
17083G07971m5535j92295j22453A67379J96302m3478K01027J85940B51317J98114
$$ 707971 662436 470141 347688 167379 363681 320203 521230 707170 251317 449431
17073D49431K61267k60479L20895k55145k5673k23418A32276K90407K4368G7908
$$ 449431 710698 450219 771114 515969 490296 266878 132276 422683 447051 77908
17062E10858J42784m2763j92571R6357j51276L4132J66468j84351K10207o5523
$$ 510858 653642 610879 418308 514665 363389 397521 563989 379638 589845 524322
17052E24322Q9584K0671j20492j02497j98787L9594J33701K2710L83838k96836
$$ 524322 613906 634577 514085 411588 212801 252395 386096 408806 792644 495808
17042D95808B06378N7233Q2609K95323l17217L43437l08158M21321B63733K75108
$$ 495808 206378 263611 346220 641543 324326 667763 359605 780926 263733 538841
17032E38841p3008k27962L15130B44741K43871J07506J28888B24721M18713L47416
$$ 538841 465833 237871 553001 244741 488612 596118 725006 224721 643434 990850
17022I90850B96639L32875K64225l18933r9527j09205K07237j08849R7537r2229
$$ 990850 296639 629514 893739 574806 475279 366074 573311 464462 561999 469770
17012D69770O2850L45444r1627j16541K43847m06785K00354P8558k47414J6655
$$ 469770 532620 878064 786437 669896 913743 506958 707312 785870 538456 555111
17002E55111j00240J37309K81247j72755p6647K54266B94752O77986j43473k6693
$$ 555111 454871 592180 873427 700672 624025 878291 294752 972738 829265 802572
16992H02572k44210o4612J06732J81108k73830K20584o0224r7454K78124J08191
$$ 802572 558362 493750 600482 781590 507760 728344 668120 570666 848790 956981
16982I56981r2883n8196J73941k29340j21950J34065R285L74836l70406K40783
$$ 956981 864098 805902 979843 750503 628553 762618 771903 1146739 776333 1017116
16972A017116j65913j27193L15465l10217j08027J03114N9107K01244j76348J77586
$$ 1017116 851203 724010 1039475 729258 621231 724345 783452 984696 808348 985934
16962I85934j31765k48493N44132k0427k39164M3705j53703M36467j77615l34847
$$ 985934 854169 605676 1149808 1129381 890217 933922 780219 1216686 1039071 704224
16952G04224J87414J42933n2283J19706k2073p9912k45150L0021N44922l17031
$$ 704224 891638 1034571 982288 1101994 1079921 1000009 754859 784880 1329802 1012771
16942A012771J01892j56030m3821N8153K08899j80302J46578m7487J68120l77531
$$ 1012771 1114663 958633 914812 972965 1181864 1001562 1148140 1100653 1268773 891242
16932H91242J37463N78186p85118N21646k30118J32078k55151J40351n1375K31263
$$ 891242 1028705 1606891 821773 1343419 1113301 1245379 990228 1130579 1079204 1310467
16922A310467k73266L65551q0478k24171j33794L52509L41068m80783J48643J03395
$$ 1310467 1037201 1402752 1322274 1098103 964309 1316818 1657886 1177103 1325746 1429141
16912A429141j67652n015p7108N36514k16933q9393p3543K01973L576q0947K78847
$$ 1429141 1261489 1256474 1179366 1715880 1498947 1409554 1336011 1537984 1541560 1460613 1739460
16901A739460l00802J64673R2485p5613K15418j42042J12565l31213M17586o5900
$$ 1739460 1438658 1603331 1695816 1620203 1835621 1693579 1806144 1474931 1892517 1826617
16891A826617j85196L1571K25247J73492P0486k79067J44547l26222N51029m90810
$$ 1826617 1641421 1672992 1898239 2071731 2142217 1863150 2007697 1681475 2232504 1741694
16881A741694N33622k24154P5434j68456n2792L33568N1603N7363K27755J03864
$$ 1741694 2275316 2051162 2126596 1958140 1905348 2238916 2290519 2347882 2575637 2679501
16871B679501l37183k72640L49418L3199J42039l3649m0960J12075p3692L34404
$$ 2679501 2342318 2069678 2419096 2452295 2594334 2560685 2519725 2631800 2558108 2892512
16861B892512n80868Q4987M91539k51211j22010L72410K11647j93034q145j30016
$$ 2892512 2311644 2396631 2888170 2636959 2514949 2887359 3099006 2905972 2897827 2767811
16851B767811L3679K23807J74676J456k05363J16750K51202j2924r3719K89806
$$ 2767811 2801490 3025297 3199973 3201429 2996066 3112816 3364018 3351094 3257375 3547181
16841C547181k50508L67285j64342L2381K37978l5099J0166L41626j91288K15181
$$ 3547181 3296673 3663958 3499616 3531997 3769975 3734876 3745042 4086668 3895380 4110561
16831D110561j90097L16105l12279L37889O9510L18901M5813q117l3601K11337
$$ 4110561 3920464 4236569 3924290 4262179 4331689 4650590 4696403 4688286 4654685 4866022
16821D866022k5656j31638N11174m7906k10708P13573q9226J34353M45445k88547
$$ 4866022 4840366 4708728 5219902 5171996 4961288 5674861 5585635 5719988 6165433 5876886
16811E876886K29035k06396M29698J20531K4602J41872L290M66045L54856K44071
$$ 5876886 6105921 5899525 6329223 6449754 6474356 6616228 6619518 7085563 7440419 7684490
16801G684490l18690J88661L44294o6070L18864N28976m62226M46390L92947J78415
$$ 7684490 7365800 7554461 7898755 7832685 8151549 8680525 8218299 8664689 9057636 9236051
16791I236051L05820K31560K6816N92324J11610L02144N12260m911M90769K40053
$$ 9236051 9541871 9773431 9800247 10392571 10504181 10806325 11318585 11313674 11804443 12044496
16781A2044496N79289K89575k1014P33096L96223N47801R1420J268832K40591
$$ 12044496 12623785 12913360 12892346 13625442 14021665 14569466 14660886 15929718 16170309
16772A6170309L05186O87759N97061K58104R96227N70991N56769Q11590P99702
$$ 16170309 16475495 17163254 17760315 18018419 19014646 19585637 20142406 20953996 21753698
16763B1753698R46164R22031J037534Q47537J041776J142743J414061J176341
$$ 21753698 22699862 23621893 24659427 25506964 26548740 27691483 29105544 30281885
16755C0281885J498100J519633R88282K044982J701418J992517K110520J943553
$$ 30281885 31779985 33299618 34287900 36332882 38034300 40026817 42137337 44080890
16747D4080890K386961K782844K155375L268920K858032L368298L328331L885074
$$ 44080890 46467851 49250695 51406070 54674990 57533022 60901320 64229651 68114725
16739F8114725M371879L950214M951311M551474N561851N938953O129944O448718
$$ 68114725 72486604 76436818 81388129 85939603 91501454 97440407 103570351 110019069
16731A10019069O868227P256925P415158P948072P573886P522696Q538881P490792
$$ 110019069 116887296 124144221 131559379 139507451 147081337 154604033 163142914 170633706
16723A70633706P135404O289497N742165M560993L434563K307149O38511r20104
$$ 170633706 177769110 184058607 189800772 194361765 197796328 200103477 200741988 199821884
16715A99821884k099693l485650m798430n650617o977064p002084p394766p621679
$$ 199821884 197722191 194236541 189438111 183787494 176810430 169808346 162413580 154791901
16707A54791901q535561q081362p629647p858016o819134p088647o758785n988676
$$ 154791901 146256340 138174978 130545331 122687315 115868181 108779534 102020749 96032073
16699I6032073n702320n559640n150166m339349m760223l829137l645776l682479
$$ 96032073 90329753 84770113 79619947 75280598 70520375 66691238 63045462 59362983
16691E9362983l492919l033211k610377k718308k566946j885780k369383j931518
$$ 59362983 55870064 52836853 50226476 47508168 44941222 43055442 40686059 38754541
16683C8754541j703615j958526j466445j703483j288074j297806j446810r96706
$$ 38754541 37050926 35092400 33625955 31922472 30634398 29336592 27889782 26893076
16675B6893076j379738q43863j146458j320867n26600r19099p71814l31359j027654
$$ 26893076 25513338 24669475 23523017 22202150 21675550 20756451 19984637 19653278 18625624
16666A8625624j107912k38572n10357m82655o67517n48704l62193o57632k66771
$$ 18625624 17517712 17279140 16768783 16286128 15618611 15069907 14707714 14050082 13783311
16657A3783311l80786m81477q92348J8952l04061r3151q57995k18531l41069K3329
$$ 13783311 13402525 12921048 12028700 12047652 11743591 11650440 10792445 10573914 10232845 10256174
16647A0256174k02520k71106o08317l31109j79798l55084o3459m2778k69580J2534
$$ 10256174 10053654 9782548 9174231 8843122 8663324 8308240 8244781 8202003 7932423 7944957
16637G944957o72316L6004l33050J88541m04401j46940M33512q97088L12210m20072
$$ 7944957 7272641 7308645 6975595 7164136 6759735 6612795 7046307 6149219 6461429 6041357
16627F041357m1798J06644k42205k74254j93877j88728k9477J03635k67877r7930
$$ 6041357 5999559 6106203 5863998 5589744 5395867 5207139 5177662 5281297 5013420 4915490
16617D915490j45458j96676j12796j12209L11411q8159l68631j14948m4296m0557
$$ 4915490 4770032 4573356 4460560 4348351 4659762 4571603 4202972 4088024 4043728 4003171
16607D003171K2957J86094l05215j68901K35568k94560m3656j92208J91682o7880
$$ 4003171 4026128 4212222 3907007 3738106 3973674 3679114 3635458 3443250 3634932 3567052
16597C567052l15265p3105J25051Q123k61826P1645j57273p3691j24353K04552
$$ 3567052 3251787 3178682 3303733 3311856 3050030 3121675 2964402 2890711 2766358 2970910
16587B970910k47624J09788n60282J66072M09345j9161l49649L96736m67492J2
$$ 2970910 2723286 2833074 2272792 2438864 2848209 2829048 2479399 2876135 2408643 2408655
16577B408655K4628J9459j48418K83142j52955j35253k91922L88289P8112m41059
$$ 2408655 2433283 2452742 2304324 2587466 2434511 2299258 2007336 2395625 2473737 2032678
16567B032678N2277l05837K43591j1512j23116m2116M3489K17961k47676j05050
$$ 2032678 2084955 1779118 2022709 2011197 1888081 1845965 1889454 2107415 1859739 1754689
16557A754689J31419j21981R3045l07922L31575J42749j15508j65221j19492J05208
$$ 1754689 1886108 1764127 1857172 1549250 1880825 2023574 1908066 1742845 1623353 1728561
16547A728561l7804j85651L25287j50082O8479l02157m7635L2265J50056P1945
$$ 1728561 1690757 1505106 1830393 1680311 1748790 1446633 1398998 1431263 1581319 1653264
16537A653264k7738k14185L0297q4363N1393K5124L6547O3550o8829j16488P5767
$$ 1653264 1625526 1411341 1441638 1357275 1408668 1433792 1470339 1533889 1465060 1348572 1424339
16526A424339N5204k10671m6985q7242L72979l64803M2202L0725j09295J99473
$$ 1424339 1479543 1268872 1221887 1134645 1507624 1142821 1185023 1215748 1106453 1305926
16516A305926j31848J7404L1018j38213m7448J52328j09376j6959O2695k25062
$$ 1305926 1174078 1191482 1222500 1084287 1036839 1189167 1079791 1062832 1125527 900465
16506I00465J499J06644k07558j86234N59662m46825J13116M10331m48456L492
$$ 900465 901964 1008608 801050 614816 1174478 727653 840769 1251100 802644 806136
16496H06136K87011j52800q8799k1075Q2252r4691l0282K09416O7307k07778J72848
$$ 806136 1093147 940347 851548 830473 912725 818034 787752 997168 1064475 856697 1029545
16485A029545j2250Q769l85919M04460k09100J54710l92046L30702j82091n9426
$$ 1029545 1017295 1026064 640145 1044605 835505 990215 598169 928871 746780 687354
16475F87354o5545l1543K60785o1618J30397k78472j78947Q6156J32538J08350
$$ 687354 621809 590266 851051 789433 919830 641358 462411 548567 681105 789455
16465G89455j98856k91489M02755N3028J07276k47817R8638j69487K76207k1003
$$ 789455 590599 299110 701865 754893 862169 614352 712990 543503 819710 798707
16455G98707B85932L80514J1648J39920l17583L69920k4239j67001K55654M904
$$ 798707 285932 666446 678094 818014 500431 870351 846112 679111 934765 939669
16445I39669l95466j35224L61386C82189R7823J56808K59006l58148R5657n8491
$$ 939669 544203 408979 770365 382189 480012 636820 895826 537678 633335 574844
16435E74844J87614M5387K9477k74976K48625C28262N05576l82873J2606K945
$$ 574844 762458 807845 837322 562346 810971 328262 833838 450965 463571 466516
16425D66516j13782J26842j47988J43912J48444j28463L45519m040C53883K77791
$$ 466516 352734 479576 331588 475500 623944 495481 841000 836960 353883 631674
16415F31674O931j50326r001K86125r4967j97688k23393L53046k65796J30206
$$ 631674 638605 488279 479278 765403 670436 472748 249355 602401 336605 466811
16405D66811m5568n2137J87909K7090L7005B53873J89447L0868k4981j43984R4605
$$ 466811 421243 369106 557015 584105 621110 253873 443320 474188 449207 305223 399828
16394C99828o7367N2436j21740J41396J5037j4281m2375n7842K27708j40478J49728
$$ 399828 332461 384897 263157 404553 419590 405309 362934 305092 532800 392322 542050
16383E42050j88169Q8418A81212K38345j88152J56600m0324h333B27421M984K36336
$$ 542050 353881 442299 181212 419557 231405 388005 347681 -8333 227421 232405 468741
16372D68741j61863O3709j6409Q7364p3614O1116p7246K86037k76368P5658j14764
$$ 468741 306878 370587 354178 441542 367928 429044 351798 637835 361467 437125 322361
16361C22361M26814B84105L17953A52691L2566O3183j08692m301L87682k38235
$$ 322361 749175 284105 602058 152691 185257 248440 139748 135447 523129 284894
16351B84894R4258m5397A66416o2137D3952J81726N0413A03764J03871J11906
$$ 284894 379152 333755 166416 104279 43952 225678 276091 103764 207635 319541
16341C19541J13265J89558j98958J00788k21617N5619o7981p0759Q6062L56094
$$ 319541 432806 622364 423406 524194 302577 358196 290215 219456 305518 661612
16331F61612H7199L10794j84256J52676j11248K9051J96530J5432c341C55827
$$ 661612 87199 397993 213737 366413 255165 284216 480746 496178 -3341 355827
16320C54478j07905K75549C607J32391J32520m3401K20951J75908A40356K34789
$$ 354478 246573 522122 3607 135998 268518 225117 446068 621976 140356 375145
16310C75145j47556L8482M0933j33757E2630J43687O524J18759A54037L06924
$$ 375145 227589 266071 307004 173247 52630 196317 202841 321600 154037 460961
16300D60961j0033B12635M5705h7056C29613q8157G0044j7883K93621L1968j7873
$$ 460961 450928 212635 258340 -87056 329613 241456 70044 52161 345782 377750 359877
16289C59877i2927F0030J37173k9322K6587B8183K89120J92825j92413j7691C1994
$$ 359877 -92927 60030 197203 167881 194468 28183 317303 510128 317715 300024 31994
16277B95608L42978k89922n8436a75802D93326B13032H2115J19927Q1020M8750
$$ 295608 638586 348664 290228 -175802 493326 213032 82115 202042 283062 331812
16267C31812d845E9487J67895q5061h552C46126P1097j55348J73229p5680r235
$$ 331812 -4845 59487 227382 142321 -8552 346126 417223 261875 435104 359424 350189
16256C50189n6019K83404A16915K08863d9359B82305J53775a3000B18291J86189
$$ 350189 294170 577574 116915 325778 -49359 282305 436080 -13000 218291 404480
16246D04480a59674A26473a25948F8427Q1061n8789E631M77616G3014b10464Q7495
$$ 404480 -159674 126473 -125948 68427 149488 90699 5631 483247 73014 -210464 -122969
16235a22969E2450J714K9661j5255a35878C08396j49419K57056I1320k5121O8058
$$ -122969 52450 54164 83825 68570 -135878 308396 158977 416033 91320 66199 134257
16224A34257j6595j2064K08753m3730l0563o4682n4746K8559p1433J10540q5139
$$ 134257 117662 105598 314351 270621 240058 175376 120630 149189 77756 188296 103157
16213A03157J77949q2124R4562j05792K88849k13389j24834E9094L2760J36029
$$ 103157 281106 198982 293544 187752 476601 263212 138378 59094 91854 227883
16203B27883h1874I3845l4337h602A03438i4762B10679j3229g6095A33088a15030
$$ 227883 -81874 93845 59508 -8602 103438 -94762 210679 197450 -76095 133088 -115030
16191A27555f2710A58169K21638j4762B8326f8009B79671E3898a30246B63492
$$ 127555 -62710 158169 379807 365045 28326 -68009 279671 53898 -130246 263492
16180e8207I5434c5354j19390D40089F5155K58879D9946L0423K58794a83387B19154
$$ -58207 95434 -35354 -154744 440089 65155 324034 49946 80369 339163 -183387 219154
16168C13265C7010J95745E8900J03726d9427A02568N1458E9909J9821b94396B79567
$$ 313265 37010 232755 58900 162626 -49427 102568 154026 59909 79730 -294396 279567
16156C05872H4228K13816A15020K23402A10220J64854a3837j06062I5027r410
$$ 305872 84228 298044 115020 338422 110220 275074 -13837 -119899 95027 85617
16146H5617J41857a13950J3789k04940d3920C71606a34519B41831A14978K88642
$$ 85617 227474 -113950 -100161 -305101 -43920 371606 -134519 241831 114978 403620
16136D03620A59696J2985a51793D44868k13821J13083G3190n746O9821a17125
$$ 403620 159696 172681 -151793 444868 231047 344130 73190 67444 137265 -117125
16125b06083P9895q0969A47407f4392A5434P4181f022C92386B0635K84158H4603
$$ -206083 -126188 -207157 147407 -64392 15434 89615 -6022 392386 20635 304793 84603
16113c043j92876c7936A50597Q0134c46072P6272Q5030O5106d2888N819H5070
$$ -3043 -195919 -37936 150597 230731 -346072 -269800 -184770 -119664 -42888 -37069 85070
16101B78735A19429L59296K9117E2972O1512D131a85271c2571A22773f5168l1698
$$ 278735 119429 478725 507842 52972 114484 4131 -185271 -32571 122773 -65168 -96866
16090i6866F5287O9629g2724A17834B6099N4048a21968q4865A05901K41689a60046
$$ -96866 65287 134916 -72724 117834 26099 80147 -121968 -206833 105901 347590 -160046
16078A3097a22436A96784a31601O3745C6744f1775k94987A67793I730P9512c24830
$$ 13097 -122436 196784 -131601 -67856 36744 -61775 -356762 167793 9730 89242 -324830
16066a33493e9080j85054i3822A12345a04312j26038B49364F1702b10540D40603
$$ -133493 -59080 -244134 -93822 112345 -104312 -230350 249364 61702 -210540 440603
16055A30206b32473l7175I7343J9055f8273C36376f3162B7178a01791E0712M8068
$$ 130206 -232473 -269648 97343 116398 -68273 336376 -63162 27178 -101791 50712 98780
16044I8780d08477D4670K06428A03480a61755G6265j7470a97295A25945J56229
$$ 98780 -408477 44670 251098 103480 -161755 76265 58795 -197295 125945 282174
16034B82174G7779b51558E7135D042a25364J3039j61741C8475b59691A82385G9320
$$ 282174 77779 -251558 57135 4042 -125364 -112325 -274066 38475 -259691 182385 79320
16022f2858C06458a38860f8929A86651b3107A86775I3264b88635E0714I511N997
$$ -62858 306458 -138860 -68929 186651 -23107 186775 93264 -288635 50714 9511 15508
16011A5508f8868j61019J07858K249k56657J46163B49727b84095A94854f4902
$$ 15508 -68868 -229887 -122029 -119780 -376437 -230274 249727 -284095 194854 -64902
16000a86887C71473i49A27859f9668r5684L7871B02201f0941A37337J6283J68652
$$ -186887 371473 -949 127859 -69668 -165352 -127481 202201 -60941 137337 153620 322272
15989C22272o195d3610B9705a39819f0967B08820c00747a39383B48544O0629L05060
$$ 322272 316077 -43610 29705 -139819 -60967 208820 -300747 -139383 248544 309173 614233
15978F14233A63939K6756a75014l1053O8580G6723b60154a29495B59439A141K25199
$$ 614233 163939 190695 -175014 -206067 -137487 76723 -260154 -129495 259439 1141 226340
15967B26340G7386c1311F4658b3167B54927b17638A607a4468A33246j5812Q8619
$$ 226340 77386 -31311 64658 -23167 254927 -217638 1607 -14468 133246 117434 206053
15956B06053b31917L8137M4109A34253b51801P8118A95763b76856a07348n804
$$ 206053 -231917 -193780 -149671 134253 -251801 -173683 195763 -276856 -107348 -113152
15946a13152L074A37033K5101a08301B7271a41889c5715D11566d9747p6237A5913
$$ -113152 -110078 137033 162134 -108301 27271 -141889 -35715 411566 -49747 -125984 15913
15934B85592a88751K7427A78249g5396k36488A07331i4147l95177f9008o8216
$$ 285592 -188751 -161324 178249 -75396 -311884 107331 -94147 -489324 -69008 -137224
15924a37224H8204d7001l6982B11915g5509A01165a20214j84446h5513F904e9549
$$ -137224 88204 -47001 -83983 211915 -75509 101165 -120214 -304660 -85513 6904 -59549
15912B38899n7464l6476a18025N6243H2853c33422a1016A05333b01478j4706D0263
$$ 238899 181435 144959 -118025 -61782 82853 -333422 -11016 105333 -201478 -216184 40263
15900i3841C91559a63858a3128B90388h8811A5453L35353b40199c3168a1374F00
$$ -93841 391559 -163858 -13128 290388 -88811 15453 350806 -240199 -33168 -11374 600
15888a46871F8500J33067a80682C04222G8708l6854e4k60276Q7649L0027j21685
$$ -146871 68500 201567 -180682 304222 78708 41854 -54 -260330 -172681 -142654 -264339
15877b64339C41201f9510j31572N641r8486O3579e3928l49240A18749b30070A36228
$$ -264339 341201 -69510 -201082 -195441 -293927 -230348 -53928 -403168 118749 -230070 136228
15865b03338b18D30483j80858N0619o0497f8067J8133j75247R2714m7231i742
$$ -203338 -218 430483 249625 300244 239747 -68067 -49934 -225181 -132467 -179698 -9742
15853a10221I7332A5063b3113C8108K07488a15282N0057B24206c67703f3192k4724
$$ -110221 97332 15063 -23113 38108 245596 -115282 -65225 224206 -367703 -63192 -87916
15842h7916L2741j9670A27351Q3799a4299j58847g6555A5749a736q7463B08270
$$ -87916 -55175 -74845 127351 211150 -14299 -173146 -76555 15749 -1736 -89199 208270
15830A72192b8396C134K4036J04592k1390i8678n1989A50407b41037i4376j25672
$$ 172192 -28396 3134 27170 131762 110372 -98678 -150667 150407 -241037 -94376 -220048
15819b20048D73064B2457b35282h4918j3157q0642n5027J9467O8264F6547J39436
$$ -220048 473064 22457 -235282 -84918 -98075 -178717 -233744 -214277 -146013 66547 205983
15808B05983h342q0375A30425e3289A09405b16826A03629K26026a57061F6734
$$ 205983 -8342 -88717 130425 -53289 109405 -216826 103629 329655 -157061 66734
15797I0188c7605j29682M7452A01525c7527k53200j84863h4855j2594B78484i8256
$$ 90188 -37605 -167287 -119835 101525 -37527 -290727 -475590 -84855 -97449 278484 -98256
15785c4223l4986m5691o514l0648h729B38817J5022a78944d7579j54348e1020
$$ -34223 -69209 -114900 -121414 -152062 -8729 238817 253839 -178944 -47579 -201927 -51020
15773c22380a2783A6580g5024c649j31951j13496J7813B73487j08238o6593a48833
$$ -322380 -12783 16580 -75024 -3649 -135600 -249096 -231283 273487 165249 98656 -148833
15761I8324J290c50453A54188J38955i5935C1708J67428l8104J74961a69105j68672
$$ 98324 99614 -350453 154188 293143 -95935 31708 199136 161032 335993 -169105 -337777
15750c37777c5674k0405j76284E2400k1260h1571B43313A14419D8872a77993o7976
$$ -337777 -35674 -56079 -232363 52400 31140 -81571 243313 114419 48872 -177993 -245969
15739b45969B77438h7545L6027i069k60249b0508j85728B91d8360l96215D40325
$$ -245969 277438 -87545 -51518 -9069 -269318 -20508 -206236 291 -48360 -444575 440325
15727A5729a30512r6627B2603d12007C9338a01392j2679A97192K00765e5590I1588
$$ 15729 -130512 -227139 22603 -412007 39338 -101392 -114071 197192 397957 -55590 91588
15715a13200L0295K6203l262l4436j86702E3347K29780a70784f9067A5734M9154
$$ -113200 -82905 -56702 -59964 -94400 -281102 53347 283127 -170784 -69067 15734 64888
15704F4888B1709P560g6218A09134M14089C9974g7117b0992P434B20082a53420
$$ 64888 21709 29269 -76218 109134 523223 39974 -77117 -20992 -13558 220082 -153420
15692A51531b80335i0133c5941b591A57637c9668D9574p705J901O8283a67088
$$ 151531 -280335 -90133 -35941 -2591 157637 -39668 49574 41869 43770 112053 -167088
15680i3379B58182b71616h3023o1702F2734a87778A38951f1771F767L24173j14471
$$ -93379 258182 -271616 -83023 -144725 62734 -187778 138951 -61771 6767 330940 216469
15669B16469f0919i928r3165A90787k0490b37768c4315k04056P3989A67750c58876
$$ 216469 -60919 -9928 -103093 190787 170297 -237768 -34315 -238371 -164382 167750 -358876
15657a73747j4325g3907m4899e0840j24490E6881d56652a58835k42662a61825
$$ -173747 -188072 -73907 -118806 -50840 -175330 56881 -456652 -158835 -401497 -161825
15646a33485q0991A11042o944a55415B3262K5226a93582g6291C9672c44066a02880
$$ -133485 -214476 111042 104098 -155415 23262 48488 -193582 -76291 39672 -344066 -102880
15634B49530a302k45872a22120m6941j60129B36705L9230a19739B3739a68507
$$ 249530 -1302 -247174 -122120 -169061 -329190 236705 275935 -119739 23739 -168507
15623b53655e009E9207e2875B36844a24799A69416a8241l4053b4472A97851a56498
$$ -253655 -5009 59207 -52875 236844 -124799 169416 -18241 -52294 -24472 197851 -156498
15611a41382j40516A47152E674i8811k7126b7229B16497d8249A46948a07974I0786
$$ -141382 -281898 147152 5674 -98811 -125937 -27229 216497 -48249 146948 -107974 90786
15599b08822B66224A23560Q3448a65839I3671c6093A87462b61203e4325a8317
$$ -208822 266224 123560 207008 -165839 93671 -36093 187462 -261203 -54325 -18317
15588A6278a0637A78413J12542c60347F2585k0406e6152G6130a18540c3354n5451
$$ 16278 -10637 178413 290955 -360347 62585 42179 -56152 76130 -118540 -33354 -88805
15577h8805j4964E8153a09189l06956B71596h9515j78878a7604j99632r4846C0656
$$ -88805 -103769 58153 -109189 -416145 271596 -89515 -268393 -17604 -217236 -312082 30656
15565g2809C64260E4390b25042A05052L5598b7718k0718j00020q071G8076a34901
$$ -72809 364260 54390 -225042 105052 140650 -27718 -48436 -148456 -156527 78076 -134901
15553a7651A29445i3056j2108j44641q1772A51886p4831a34131l9642d1567r8537
$$ -17651 129445 -93056 -105164 -249805 -331577 151886 77055 -134131 -173773 -41567 -140104
15542a40104E1389A9927L47401b49868q5249a1964F1578Q5785n7908k694c9154
$$ -140104 51389 19927 367328 -249868 -335117 -11964 61578 147363 89455 86761 -39154
15530a79378j80326a65873G3128b46610A72572F5711f1673F1383e0713A31495
$$ -179378 -359704 -165873 73128 -246610 172572 65711 -61673 61383 -50713 131495
15519A53150b24692K6911B30888o9803g2878I3384c3240D57184F8941A3720J94051
$$ 153150 -224692 -197781 230888 161085 -72878 93384 -33240 457184 68941 13720 207771
15508B07771G2310L21323j68462d4070B06075a99826c0327m0528A39282O7255
$$ 207771 72310 393633 225171 -44070 206075 -199826 -30327 -70855 139282 206537
15498B06537D5412a25713L3353n6683c0118C27191a08955D1446g4148F3964J95577
$$ 206537 45412 -125713 -92360 -149043 -30118 327191 -108955 41446 -74148 63964 259541
15487B59541b49149F925J41861N5404E9676a53050G0832a84026O9983j62858A37510
$$ 259541 -249149 6925 148786 204190 59676 -153050 70832 -184026 -114043 -276901 137510
15475B9895R7200m231m3780a72853B86256b29438A4491K40393q5733C4159C928
$$ 29895 127095 122864 79084 -172853 286256 -229438 14491 254884 169151 34159 3928
15463b30981B89572o7831h2138B57907E8660a08801D0926d274m3450A19398a13742
$$ -230981 289572 221741 -82138 257907 58660 -108801 40926 -4274 -47724 119398 -113742
15451a95404A03635a48295A28842M0843k1732f4674j60821A55203A482h1208j6828
$$ -195404 103635 -148295 128842 169685 147953 -64674 -225495 155203 1482 -81208 -98036
15440i8036k35344C46396a41594A0784K18171q6277b28109d0395A53230b96001
$$ -98036 -333380 346396 -141594 10784 228955 142678 -228109 -40395 153230 -296001
15429A14893m8664J2750K4082k8676l4909J46168B693J74366e5104j71693B6900
$$ 114893 66229 78979 103061 74385 39476 185644 2693 177059 -55104 -226797 26900
15417g2074p0135N0204A24645m6880b23700E4888j2447J33193b35706C7953b2616
$$ -72074 -142209 -92005 124645 77765 -223700 54888 42441 175634 -235706 37953 -22616
15405G9876h4622A84070k2881e5738A70362M6630M8965o2736D6431b78122I9868
$$ 79876 -84622 184070 161189 -55738 170362 216992 265957 203221 46431 -278122 99868
15393B31975D741P981a80580D4325N9383b90222A34626i7834C02879C2163M3160
$$ 231975 4741 12722 -180580 44325 103708 -290222 134626 -97834 302879 32163 75323
15382G5323e6522F8674d53590f6872o5704A9205P5173L13211A03002a6798j97178
$$ 75323 -56522 68674 -453590 -66872 -132576 19205 94378 407589 103002 -16798 -213976
15371b13976a0481G8165B1J84785c56665a9839E0184J1545J17175J25209a02246
$$ -213976 -10481 78165 21 184806 -356665 -19839 50184 61729 178904 304113 -102246
15359a55605b6884A62673i9288C82390E721b14501Q1467j78431e5272C7959f1506
$$ -155605 -26884 162673 -99288 382390 5721 -214501 -133034 -311465 -55272 37959 -61506
15347F3077B0760a38284p7596A47605a3473o8021j86154E2107K02316C662a07667
$$ 63077 20760 -138284 -215880 147605 -13473 -81494 -267648 52107 254423 3662 -107667
15335g2247A50689A4474K26217a28538b4062f54A14691a82056A8123M1195J99260
$$ -72247 150689 14474 240691 -128538 -24062 -654 114691 -182056 18123 59318 258578
15324B58578j10949a53782b6196n4983o5360b1372j55703d2424j2971A44833J11247
$$ 258578 147629 -153782 -26196 -81179 -146539 -21372 -177075 -42424 -55395 144833 256080
15313B56080i6444A63809G1552K655f2471A5867J90369B6958K4987P6647M9217
$$ 256080 -96444 163809 71552 74207 -62471 15867 206236 26958 51945 128592 177809
15302A77809b09877D4560g8818C2424J50054a19373I819e7769C24175j08161F9625
$$ 177809 -209877 44560 -78818 32424 182478 -119373 9819 -57769 324175 216014 69625
15290a56503D390d9920J653A29905a99865R7921B41517A04851A228Q4388K02171
$$ -156503 4390 -49920 -48267 129905 -199865 -101944 241517 104851 1228 85616 287787
15279B87787k6898n9799e9226B2244J5153P8586l7798R2788J89884i6230A60616
$$ 287787 260889 201090 -59226 22244 37397 115983 78185 170973 360857 -96230 160616
15267b47565J4355A73724F2096M07122a89804B47773C2105b26208d6023B13898
$$ -247565 -233210 173724 62096 469218 -189804 247773 32105 -226208 -46023 213898
15256I6414J36204j08961j999a31769A22961L06175j78967K4731O39338P53391
$$ 96414 232618 123657 121658 -131769 122961 429136 250169 274900 914238 1667629
15246A667629k09657R7522n86623k58151B43551H1140c12217d8247B32014f5158
$$ 1667629 1457972 1555494 968871 710720 243551 81140 -312217 -48247 232014 -65158
15235A64692b42457N992r2377B47154n7486b31680i9256B98487J09776f9600k38152
$$ 164692 -242457 -236465 -328842 247154 189668 -231680 -99256 298487 408263 -69600 -307752
15224c07752A22895b15283B587K09577n6388b27767A26298K9776k4177a07915
$$ -307752 122895 -215283 2587 212164 155776 -227767 126298 156074 131897 -107915
15213i5489E2410a03124b4849d29F9998J38862c23345J07191f9980B37870J8978
$$ -95489 52410 -103124 -24849 -429 69998 208860 -323345 -216154 -69980 237870 256848
15202B56848B7139M246M01094B13437F566K03884c25995c3768a5267o7469A36783
$$ 256848 27139 31385 432479 213437 6566 210450 -325995 -33768 -15267 -82736 136783
15190b00881A61891K4369l2836E0558K7154n728l0163M7126p518b90682A18012
$$ -200881 161891 186260 153424 50558 77712 71984 41821 88947 81429 -290682 118012
15178I9041N6892F342L8330J07240a17872N4743r258B3322K06690I2468a77389
$$ 99041 155933 6342 44672 151912 -117872 -63129 -72387 23322 230012 92468 -177389
15166f4534C5959a25935D22470j71704a39227A67083D9450d5528B12803F722J38101
$$ -64534 35959 -125935 422470 250766 -139227 167083 49450 -45528 212803 6722 144823
15155A44823Q2036b17336D26058G976O7290M3909B0645R714K16269o7179J14230
$$ 144823 226859 -217336 426058 7976 75266 119175 20645 30359 246628 179449 293679
15144B93679o5076J27685a15502B98646A45530B9391K0939c0832n7359E4050K37396
$$ 293679 228603 356288 -115502 298646 145530 29391 50330 -30832 -88191 54050 291446
15133B91446N79973A30163a01423e657A45092F8012M0251M67328B05939J8821
$$ 291446 871419 130163 -101423 -5657 145092 68012 108263 575591 205939 224760
15123B24760N6797N6053H8535K97050L3859b39409e3438j492B76787a08581d7671
$$ 224760 281557 337610 88535 385585 419444 -239409 -53438 -54930 276787 -108581 -47671
15111B39213j3793b9040A40374M0593a16570p4607B70485M0626h5438j27729C37900
$$ 239213 225420 -29040 140374 180967 -116570 -191177 270485 311111 -85438 -213167 337900
15099g273B73996A16784k0155h9253A73473J47712q7613h3158A82274D2840M4504
$$ -7273 273996 116784 96629 -89253 173473 321185 233572 -83158 182274 42840 87344
15088H7344J66544j18418J52059q4366a89642C8351N3599C0220K22497o8278C2059
$$ 87344 253888 135470 287529 203163 -189642 38351 91950 30220 252717 184439 32059
15076b57020A84018k1144d7382A32878j7961m5708J48437a62815B46400o5919
$$ -257020 184018 162874 -47382 132878 114917 69209 217646 -162815 246400 180481
15066A80481L0139a348C90488A35002J83461j197J13600H0433J25918a00306K2855
$$ 180481 210620 -1348 390488 135002 318463 317266 430866 80433 206351 -100306 -77451
15055g7451H4444C4509M10454A41954K29735I2113M2909j1540b1514D6197L59111
$$ -77451 84444 34509 444963 141954 371689 92113 135022 123482 -21514 46197 405308
15044D05308F3795J3294J3453K7036a17699B11708m4569e9188B37881D7916K14144
$$ 405308 63795 77089 90542 117578 -117699 211708 167139 -59188 237881 47916 262060
15033B62060j05849D4752J85792E2863M400M96133m8202A86025j7037a6584A40420
$$ 262060 156211 44752 230544 52863 57263 553396 505194 186025 168988 -16584 140420
15021C70399l6964A01847J12649M5004k3234M7080K38799k28951p4095O3509J99945
$$ 370399 333435 101847 214496 259500 236266 283346 522145 293194 219099 282608 482553
15010D82553A84156a73156C17400P5623C4080J11521K65658B0003R8315K17681
$$ 482553 184156 -173156 317400 393023 34080 145601 411259 20003 118318 335999
15000C35999P9376A21056Q3289A00447a06947C37191A43638L1652g7004A40703
$$ 335999 415375 121056 204345 100447 -106947 337191 143638 175290 -77004 140703
14989B31556n5080J85624A34603Q6809L7711Q8880i472E47980B03794K26405j71432
$$ 231556 176476 362100 134603 221412 259123 348003 -9472 547980 203794 430199 258767
14978B58767l4026n149L27292k65745e335A41961F9814J92664A18978J89633J65185
$$ 258767 224741 219592 546884 281139 -5335 141961 69814 262478 118978 308611 473796
14967D73796a56015e678D78848D003J82925M5801A12786D9499K41818A26890J43462
$$ 473796 -156015 -5678 478848 4003 186928 232729 112786 49499 291317 126890 270352
14956B70352A08910A3343L97285J21936f534D7968M19221b1684D46340F6569K27079
$$ 270352 108910 13343 410628 532564 -6534 47968 467189 -21684 446340 66569 293648
14945B93648o4142K88480R9056B89383d7486C71391j84955K03961A63395P2014
$$ 293648 229506 517986 617042 289383 -47486 371391 186436 390397 163395 235409
14935B35409r7399M2368K17679L5307j29411L64934C07297c0385D44110B08906
$$ 235409 138010 180378 398057 433364 303953 668887 307297 -30385 444110 208906
14924C78780A60873O456p6862J90780L6714l3634K22323k05164Q6490j78353J30028
$$ 378780 160873 167329 90467 281247 317961 284327 506650 301486 387976 209623 339651
14913C39651J5546N2666j06831k8970J3033R6222A85651n1070J30036k0833K81772
$$ 339651 355197 407863 301032 272062 285095 381317 185651 134581 264617 243784 525556
14902E25556b06545B44492K18950J13864k12977j45029C3656M99027j60843b12232
$$ 525556 -206545 244492 463442 577306 364329 219300 33656 532683 371840 -212232
14891B99183K16153j54157a8372C55350l0148K75664B24066M6917K49513A67946
$$ 299183 515336 361179 -18372 355350 325202 600866 224066 270983 520496 167946
14880D26716j35852J03682N1186I9492J1159Q6192J97216O6705N7684o2377j87317
$$ 426716 290864 394546 445732 99492 110651 196843 394059 460764 518448 456071 268754
14869B68754j6916p6254N26789k21644j38073J88034j550I2414L84601o5317j02845
$$ 268754 251838 175584 702373 480729 342656 530690 529140 92414 477015 411698 308853
14858C08853j28422M79295j43402O1170P7617j36238j87368o6313K27570n6293
$$ 308853 180431 659726 516324 577494 655111 518873 331505 265192 492762 436469
14848D36469j72883J97990K889J16484k28884O6768L80931l31272q8968A24086
$$ 436469 263586 461576 464465 580949 352065 418833 799764 468492 379524 124086
14837C29343j14956K65008B14407J22637J95365k65726J0977r147K95564B26926
$$ 329343 214387 479395 214407 337044 532409 266683 277660 268513 564077 226926
14826D13554j996o199P9129m2592E3475O1275L31821J61343k30216J51642j8495
$$ 413554 411558 405359 484488 441896 53475 114750 446571 607914 377698 529340 510845
14815E10845r3408J42441A23653K60869J76773p9078j80908K43093j80706N32076
$$ 510845 417437 559878 123653 384522 561295 482217 301309 544402 363696 895772
14805H95772k92981k33194o8386K51071J19056k82038A75793J91772L31400j07663
$$ 895772 602791 369597 301211 552282 671338 389300 175793 367565 698965 591302
14795E91302l8078J84641k60205O4255K58981n6327Q5823l37659K17073j2753
$$ 591302 553224 737865 477660 541915 800896 744569 830392 492733 709806 697053
14785F97053k48556K04729j77891J27893k50688L79288J89566k24706k36230p4751
$$ 697053 448497 653226 475335 603228 352540 731828 921394 696688 460458 385707
14775C85707J23030j46307P3683K28551Q4884j58585K3759m3483j14210K62818
$$ 385707 508737 362430 436113 664664 749548 590963 614722 571239 457029 719847
14765G19847r2494p409L6309L56412D69758J5875j66908L33863q115K6943p1530
$$ 719847 627353 619944 656253 1012665 469758 485633 318725 652588 644473 671416 599886
14754E99886q4272L263K84270q7402J5329P1812J09582k17870R5964k11430M05057
$$ 599886 515614 518877 803147 715745 731074 802886 912468 694598 790562 579132 984189
14743I84189m76032J43886J92294r340J19553k05224l20419L37809C72962K53147
$$ 984189 508157 652043 844337 834997 954550 749326 428907 766716 372962 626109
14733F26109J34929j96863K31379r2781J27054j58002j44330L35134k959l48980
$$ 626109 761038 564175 795554 702773 829827 671825 527495 862629 859670 510690
14723E10690M72210L27585n17312l28376J60570M83193k34430K1182k66001K70691
$$ 510690 982900 1310485 793173 464797 625367 1108560 874130 895312 629311 900002
14713I00002j54989Q5270K7685J9440J09009J29607C62247M15265l7438j83706
$$ 900002 745013 830283 857968 877408 986417 1116024 362247 777512 740074 556368
14703E56368J56629M39818l40648J1861o2001J60672j70563J38702q9236J30782
$$ 556368 712997 1152815 812167 824028 762027 922699 752136 890838 801602 932384
14693I32384J09875j20627j74098J00217j77430J58891K93232l70917L96919O358
$$ 932384 1042259 921632 747534 847751 670321 829212 1122444 751527 1148446 1154804
14683A154804l86514Q9063K71344n07238L74982l08053L33271k87872J05761J31601
$$ 1154804 768290 857353 1128697 621459 996441 688388 1021659 733787 839548 971149
14673I71149J29703J27070l77876L69167j31538j21130K39649k75367R023J9315
$$ 971149 1100852 1227922 850046 1219213 1087675 966545 1206194 930827 939850 959165
14663I59165K40653J65631k94774q1163K07063j71931Q1513J19195k95881N77594
$$ 959165 1199818 1365449 1070675 989512 1196575 1024644 1106157 1225352 929471 1507065
14653A507065l04945m1576P5833k69598J97219J79264j99854J5790R0491J65043
$$ 1507065 1202120 1160544 1236377 966779 1163998 1343262 1143408 1159198 1249689 1414732
14643A414732j05664K85919l47287J03867k70300K22109j44658J08110J41743
$$ 1414732 1309068 1594987 1247700 1351567 1081267 1303376 1158718 1266828 1408571
14634A408571k30242M3845J4717K3079J70078j3939L18914m12007J45728j71866
$$ 1408571 1178329 1222174 1236891 1259970 1430048 1416109 1735023 1323016 1468744 1296878
14624A296878N35983n98646J46301J92647k30517J81349k01536K41183n4452r1911
$$ 1296878 1832861 1234215 1380516 1573163 1342646 1523995 1322459 1563642 1509190 1417279
14614A417279M0511L13142k42294K2214M7337m4742J71107K58484m54500k31739
$$ 1417279 1457790 1770932 1528638 1550852 1598189 1553447 1724554 1983038 1528538 1296799
14604A296799J98210k5079K0423J05515L4076j72437K18571k37994P4349L14679
$$ 1296799 1495009 1469930 1490353 1595868 1629944 1457507 1676078 1438084 1512433 1827112
14594A827112N9297j60893j55301l1245J99902K34925k43585K99729k04240k3859
$$ 1827112 1886409 1725516 1570215 1538970 1738872 1973797 1730212 2029941 1825701 1801842
14584A801842n8173M8735K27937J61858l69969L04337m64818K14926J3752K40532
$$ 1801842 1743669 1792404 2020341 2182199 1812230 2116567 1651749 1866675 1880427 2120959
14574B120959J84839o5497j97580L35551l28839M00156j07016O8305J24313j23899
$$ 2120959 2305798 2240301 2042721 2378272 2049433 2449589 2342573 2410878 2535191 2411292
14564B411292r7035J17221J37215n7359K11332J77265J56129j31259q454N27152
$$ 2411292 2314257 2431478 2568693 2511334 2722666 2899931 3056060 2924801 2916347 3443499
14554C443499K89063K30081r213P22136J057785J670084L720200R011865K0454022
$$ 3443499 3732562 3962643 3953430 4675566 5733351 7403435 11123635 20135500 40589522
14545D0589522J533555j8326239j1449177E929661k833938q07356P3652k16421
$$ 40589522 42123077 23796838 12347661 5929661 3095723 2288367 2362019 2145598
14537B145598q7900K8859k3831P8060L204k18999K75965k82252j26432M51066
$$ 2145598 2057698 2086557 2062726 2140786 2143990 1924991 2200956 1918704 1792272 2243338
14527B243338L437m3740L9118p8863K06249k44874N04802l86323K27175L9132
$$ 2243338 2246775 2203035 2242153 2163290 2369539 2124665 2629467 2243144 2470319 2509451
14517B509451L66726k02665K24318q5730j42872K17497j19206K92824P1323J1893
$$ 2509451 2876177 2673512 2897830 2812100 2669228 2886725 2767519 3060343 3131666 3143559
14507C143559l56952R6864j19042L06813p4245K0419P0070J72405j40845j5930
$$ 3143559 2786607 2883471 2764429 3071242 2996997 3017416 3087486 3259891 3119046 3103116
14497C103116Q3874K12589j31869J72716j79803K54965j3622K93093n70987J24894
$$ 3103116 3186990 3399579 3267710 3440426 3260623 3515588 3501966 3795059 3224072 3348966
14487C348966Q26959p11761J97661j65566L95285j43462J64892Q29J5546M33568
$$ 3348966 4175925 3464164 3661825 3496259 3891544 3748082 3912974 3913803 3929349 4362917
14477D362917m59127L46127l9243l10068M27296j85082K3014L06760j72961L19792
$$ 4362917 3903790 4249917 4210674 3900606 4327902 4142820 4165834 4472594 4299633 4619425
14467D619425l018j41021j92363K71793K26864o5715K25360n11996O37149K25984
$$ 4619425 4616407 4475386 4283023 4554816 4781680 4715965 4941325 4429329 5066478 5292462
14457E292462j73652K80480n903k62659j55460L30827L46458M4083J8797k62214
$$ 5292462 5118810 5399290 5393387 5130728 4975268 5306095 5652553 5696636 5715433 5453219
14447E453219O9219K27282K98407l87039K80176J25581J94212K03663j79930l1857
$$ 5453219 5522438 5749720 6048127 5661088 5941264 6066845 6261057 6464720 6284790 6252933
14437F252933J19215P3725L79051k69466L34540k48677Q2670P04575k86277q6022
$$ 6252933 6372148 6445873 6824924 6555458 6889998 6641321 6723991 7428566 7142289 7056267
14427G056267K24876L83985k06415r6393O40695j81558J44286J80895P8247p8712
$$ 7056267 7281143 7665128 7458713 7362320 8003015 7821457 7965743 8146638 8224885 8146173
14417H146173M71654L79719l52971L0239k1911L39690j16173K63658L51330L1266
$$ 8146173 8617827 8997546 8644575 8674814 8652903 8992593 8876420 9140078 9491408 9522674
14407I522674K83370J41560p2660L28216J94109K9274j16698L2366L92156n1313
$$ 9522674 9806044 9947604 9874944 10203160 10397269 10426543 10309845 10342211 10734367 10683054
14397A0683054J1969O45216M37083J28376M11870J34966P9284J68369J88645K26205
$$ 10683054 10695023 11340239 11777322 11905698 12317568 12452534 12531818 12700187 12888832 13115037
14387A3115037K78782J96663k7710J55079M99815K01155M63585j87002M84766
$$ 13115037 13393819 13590482 13562772 13717851 14217666 14418821 14882406 14695404 15180170
14378A5180170L21247N53224L15205j06081N08427M99380J70845M31878J92949
$$ 15180170 15501417 16054641 16369846 16263765 16772192 17271572 17442417 17874295 18067244
14369A8067244N30687K99955q4378P79285L25560N87210M39351J98222K42597
$$ 18067244 18597931 18897886 18813508 19592793 19918353 20505563 20944914 21143136 21385733
14360B1385733O60571Q58685R3647O55819O00373M56005N19071M34971O23407
$$ 21385733 22046304 22904989 22998636 23654455 24254828 24710833 25229904 25664875 26288282
14351B6288282M76430O38059R89229P35518N48885Q07979Q72664P99230P69505
$$ 26288282 26764712 27402771 28392000 29127518 29676403 30484382 31357046 32156276 32925781
14342C2925781O15884J337769P03738J150314R32508J100463J115117R98359J214927
$$ 32925781 33541665 34879434 35583172 36733486 37665994 38766457 39881574 40879933 42094860
14333D2094860J052421J580737J460501J077738J550478J224006K019407J722349
$$ 42094860 43147281 44728018 46188519 47266257 48816735 50040741 52060148 53782497
14325E3782497J461834J967094J718590K191784K010450K059988J857741L119015
$$ 53782497 55244331 57211425 58930015 61121799 63132249 65192237 67049978 70168993
14317G0168993K108020L327921K319470L185342K824828L257392L855086L469462
$$ 70168993 72277013 75604934 77924404 81109746 83934574 87191966 91047052 94516514
14309I4516514M145908L789994M243234M761047M722143N454081N135136N809379
$$ 94516514 98662422 102452416 106695650 111456697 116178840 121632921 126768057 132577436
14301A32577436O192649O179340O979195O988312P676101Q059487Q503026Q867446
$$ 132577436 138770085 144949425 151928620 158916932 166593033 174652520 183155546 192022992
14293A92022992R691955J0081828J0386739J1187078J1511480J2154293J2910822
$$ 192022992 201714947 211796775 222183514 233370592 244882072 257036365 269947187
14286B69947187J3003670J3584920J3738718J4434826J4709720J4471584J4451066
$$ 269947187 282950857 296535777 310274495 324709321 339419041 353890625 368341691
14279C68341691J4221694J3812080J3248476J2067509J0671482R439051P440768
$$ 368341691 382563385 396375465 409623941 421691450 432362932 441801983 449242751
14272D49242751M779344J150564j839574j886076j303095j929116k989471n839567
$$ 449242751 454022095 455172659 453333085 451447009 450143914 448214798 445225327 439385760
14264D39385760q811108j0925299j2201502j3289414j4280731j4544924j4715712
$$ 439385760 430574652 419649353 407447851 394158437 379877706 365332782 350617070
14257C50617070j4910299j4755372j4717672j3182246j3539152j2966441j2863563
$$ 350617070 335706771 320951399 306233727 293051481 279512329 266545888 253682325
14250B53682325j1964940j1789140j1017956j0565472r988533r107766q738831
$$ 253682325 241717385 229928245 218910289 208344817 198356284 189248518 180509687
14243A80509687q584355p862002p730671p209886o235400o020277o007551n254188
$$ 180509687 171925332 164063330 156332659 149122773 142887373 136867096 130859545 125605357
14235A25605357n627216n212843m813716m342082l443335m759087l589061l475926
$$ 125605357 119978141 114765298 109951582 105609500 102166165 97407078 93818017 90342091
14227I0342091l721218l112205l014814l371058k443406k967893k239195k133930
$$ 90342091 86620873 83508668 80493854 77122796 74679390 71711497 69472302 67338372
14219F7338372k709462j912911j939477j971569j833318j727213j570172j664701
$$ 67338372 64628910 62715999 60776522 58804953 56971635 55244422 53674250 52009549
14211E2009549j840878j615217j397949q42240j084027j186073j349245j511534
$$ 52009549 50168671 48553454 47155505 46313265 45229238 44043165 42693920 41182386
14203D1182386j137361j337442p46192o29831j236024r79211o99138j266918q75764
$$ 41182386 40045025 38707583 37961391 37331560 36095536 35116325 34417187 33150269 32274505
14194C2274505n83758o67689q28936r53352q96308n52765m43764o08288q27486
$$ 32274505 31690747 31023058 30194122 29240770 28344462 27791697 27347933 26739645 25912159
14185B5912159l86890n27259o10142l36518m80942p25752p54048m10844l14933
$$ 25912159 25525269 24998010 24387868 24051350 23570408 22844656 22090608 21679764 21364831
14176B1364831n49215l25372m67248p39863K8526j47229o52813j47708n57899
$$ 21364831 20815616 20490244 20022996 19283133 19311659 19164430 18511617 18363909 17806010
14167A7806010j50900p18535J95711m84432m02101m02201R3512m92916l82560
$$ 17806010 17655110 16936575 17132286 16647854 16245753 15843552 15937064 15444148 15061588
14158A5061588k55837J88304n93865m22782q2404k58530m61473J39573o28669
$$ 15061588 14805751 14994055 14400190 13977408 13895004 13636474 13175001 13314574 12685905
14149A2685905K27815l46053j21352k44040l57444o2771m7591k78655k43272j82130
$$ 12685905 12913720 12567667 12446315 12202275 11844831 11782060 11734469 11455814 11212542 11030412
14139A1030412j55849k89581k22452k27407Q5044j70668N6989k71915J7918k97585
$$ 11030412 10874563 10584982 10362530 10135123 10220167 10049499 10106488 9834573 9852491 9554906
14129I554906k21361m9867m581p3116m52669Q9793p5078j49861L8694m09347K3695
$$ 9554906 9333545 9283678 9279097 9205981 8753312 8843105 8768027 8618166 8656860 8247513 8271208
14118H271208o3899k66595J47158n42057L30131l55087r259k57889j36135L11253
$$ 8271208 8207309 7940714 8087872 7545815 7875946 7520859 7511600 7253711 7117576 7428829
14108G428829o22086M83522j12609m30093m39337L60005j27902K01035k16742
$$ 7428829 6806743 7290265 7177656 6747563 6308226 6668231 6540329 6741364 6524622
14099F524622j1306k97424j46767J26257n1012L0345k86722J58667l83844R7575
$$ 6524622 6513316 6215892 6069125 6195382 6144370 6174715 5887993 6046660 5662816 5760391
14089E760391j63996k05548R3102j45195N4305J4741J00026j47626k77281R7945
$$ 5760391 5596395 5390847 5483949 5338754 5393059 5407800 5507826 5360200 5082919 5180864
14079E180864Q9842r9772k96460L39609n30515K3615o2511K81118J61003l11798
$$ 5180864 5270706 5170934 4874474 5214083 4683568 4707183 4644672 4925790 5086793 4774995
14069D774995k74647O5387k35849K79875k73045J6577J12124M8656l48079J27006
$$ 4774995 4500348 4565735 4329886 4609761 4336716 4353293 4465417 4514073 4165994 4293000
14059D293000P1058l28384J50316M7016l02795J28248m3201j35092J56449l29447
$$ 4293000 4364058 4035674 4185990 4233006 3930211 4058459 4015258 3880166 4036615 3707168
14049C707168k33800J75175J29791k52781J12019L1638j07121k24312o7336j47604
$$ 3707168 3473368 3648543 3778334 3525553 3637572 3669210 3562089 3337777 3270441 3122837
14039C122837J67364j111j5055r8095K65585N470N2669j84145K3798O2381l75400
$$ 3122837 3290201 3289090 3274035 3175940 3441525 3446995 3499664 3315519 3339317 3401698 3026298
14028C026298M82448n48765O6655j99964L18703k08206j37542o1095L67120l40569
$$ 3026298 3508746 2959981 3026636 2826672 3145375 2937169 2799627 2738532 3105652 2765083
14018B765083L85459n00918J91316k09458j88516K35155M79407n90129L00619
$$ 2765083 3150542 2649624 2840940 2631482 2442966 2678121 3157528 2567399 2868018
14009B868018n94173N18132m25643J61348n925k06308Q8228L817r2405J06606
$$ 2868018 2273845 2791977 2366334 2527682 2521757 2315449 2403677 2407494 2315089 2421695
13999B421695J70680m33120K95598j24086j85836J10982j37199J88941j89720
$$ 2421695 2592375 2159255 2454853 2330767 2144931 2255913 2118714 2307655 2117935
13990B117935O78958M75587K280008Q090560K0912645R819114j6713562j2304672
$$ 2117935 2796893 3272480 5552488 13643048 34555693 44374807 27661245 15356573
13982A5356573o205035k566475j342325o76678p74349k11541j51161J06675m76832
$$ 15356573 9151538 6585063 5242738 4566060 3791711 3580170 3429009 3535684 3058852
13973C058852n3119j29268k40410Q3084l1755j72280L71419j85709j51011J3513
$$ 3058852 3005733 2876465 2636055 2719139 2687384 2515104 2886523 2700814 2549803 2563316
13963B563316k63767k14011J89102J89515k90486j61768L11250j18917K24448
$$ 2563316 2299549 2085538 2274640 2464155 2173669 2011901 2323151 2204234 2428682
13954B428682j62746j03567L21271l83332J7749k89764L73035j54953j42662m3083
$$ 2428682 2265936 2162369 2483640 2100308 2118057 1828293 2201328 2046375 1903713 1860630
13944A860630J22972j1452r5601J31266J44885j03646j20170j87835j40294J57885
$$ 1860630 1983602 1972150 1876549 2007815 2152700 2049054 1928884 1741049 1600755 1758640
13934A758640K24144k74388K92031m03298k05249L75353o0899K1099j04593J44486
$$ 1758640 1982784 1708396 2000427 1597129 1391880 1767233 1706334 1727433 1622840 1767326
13924A767326L4868j76188J0537k37852K59674m4166k60816K81953L79066l29558
$$ 1767326 1802194 1626006 1636543 1398691 1658365 1614199 1353383 1635336 2014402 1684844
13914A684844k60842q0620N04915r4662k13761n2294J89289j91727j6707l62041
$$ 1684844 1424002 1343382 1848297 1753635 1539874 1487580 1676869 1485142 1468435 1106394
13904A106394N99906j10648r536j02726J21874m55065M43547j70361j92124L41953
$$ 1106394 1706300 1595652 1586116 1483390 1605264 1150199 1593746 1423385 1231261 1573214
13894A573214R2526k04647K03790k98371Q1152Q3341l64948K23457J61330j63909
$$ 1573214 1665740 1461093 1664883 1366512 1447664 1531005 1166057 1389514 1550844 1386935
13884A386935l55937K78296R4348k00788O0126N55454n23241K32523k78362k45452
$$ 1386935 1030998 1309294 1403642 1202854 1262980 1818434 1295193 1527716 1249354 1003902
13874A003902L86732q9311K351k14765K16953m6058j65053M24096l8709k60902
$$ 1003902 1390634 1301323 1303674 1088909 1305862 1259804 1094751 1518847 1480138 1219236
13864A219236k1717j26118n3055j1322L26941l00147K05937j22383j24513J33884
$$ 1219236 1197519 1071401 1018346 1007024 1333965 1033818 1239755 1117372 992859 1126743
13854A126743k72676L19443j49624N0348l33986L10946Q8623j77134j02336K61702
$$ 1126743 854067 1173510 1023886 1074234 740248 1051194 1139817 962683 860347 1122049
13844A122049J79261r1686k99464J66805n866m8231Q0708N1521j87842l5924J68874
$$ 1122049 1301310 1209624 910160 1076965 1071099 1022868 1103576 1155097 967255 931331 1100205
13833A100205r9781j50804J56845M9165j62325p6833k583r1448N69061m46009
$$ 1100205 1000424 849620 1006465 1055630 893305 816472 813889 722441 1291502 845493
13823H45493M07699m4313l26674r9008J0227O2610K00860Q9242p0362k10940J11639
$$ 845493 1253192 1208879 882205 783197 793424 856034 1056894 1146136 1075774 864834 976473
13812I76473r8446L58875l345k75458O0166j56539j60808K9804K47885j88011
$$ 976473 878027 1236902 1233557 958099 1018265 861726 700918 730722 978607 790596
13802G90596P6321J1450n0411K04693o9950J12173l79466m6524J06154J82232
$$ 790596 866917 878367 827956 1032649 962699 1074872 695406 648882 755036 937268
13792I37268m16543L76182K7218J46375j87524J32842j01407r2629m8560K07998
$$ 937268 520725 896907 924125 1070500 882976 1015818 914411 821782 773222 981220
13782I81220K8330m11485M61045k88810p6731q561k6584J75777j44088L4478L0990
$$ 981220 1009550 598065 1059110 770300 693569 685008 658424 834201 690113 724591 755581
13771G55581L8418j1470j24924J1232J41576J36176m30257J37322L17579k11666
$$ 755581 793999 782529 657605 668837 810413 946589 516332 653654 971233 759567
13761G59567K02157k42805m9161J41840K4483K6407l41503L90944k83664r0449
$$ 759567 961724 718919 669758 811598 836081 862488 520985 911929 628265 537816
13751E37816Q1112M5264m2753m5198J9825p3046L50440k53117J5551J35391k62943
$$ 537816 618928 664192 621439 576241 596066 523020 873460 620343 635894 771285 508342
13740E08342j16183M42231l49055K7215K79839k68625O5043K13758j3898q9269
$$ 508342 392159 834390 485335 512550 792389 523764 588807 802565 788667 699398
13730F99398j98222K65890k217l08145O4445J64535j44511K58735N2036r9425
$$ 699398 501176 767066 764849 456704 521149 685684 541173 799908 851944 752519
13720G52519k37687L03281j42239K7130o1406k02739K46515k67667L60345k42472
$$ 752519 514832 818113 675874 703004 641598 438859 685374 417707 778052 535580
13710E35580M3235Q7274j25296M87162C79248q9119o7459K82748J27821O870j58515
$$ 535580 578815 666089 540793 1027955 379248 290129 222670 505418 633239 640109 481594
13699D81594q6278K08791K61409k97286n4894K5081J84653J95720k06075C04674
$$ 481594 395316 604107 865516 568230 513336 538417 723070 918790 712715 304674
13688C86357p8605L00175Q3379p1155k15217N7203p2433K30670P4405K78518m26479
$$ 386357 307752 607927 691306 620151 404934 462137 389704 620374 694779 973297 546818
13677E46818L72656B79180K04307O5564Q6905k36276J36110k06856L44375j30065
$$ 546818 919474 279180 483487 549051 635956 399680 535790 328934 673309 543244
13667E43244q9174J44079j80960K10264l4354k90788K08756j12970K33855j19030
$$ 543244 454070 598149 417189 627453 593099 302311 511067 398097 631952 512922
13657E12922Q9185o718k29207m8803L20926k87549E9701M63904k8958j44421J88158
$$ 512922 602107 595389 366182 317379 638305 350756 59701 523605 494647 350226 538384
13646E38384j18940A98059L33087r1228Q48O7284r5279j55514J57257k00518N5713
$$ 538384 419444 198059 531146 439918 440766 508050 412771 257257 414514 213996 269709
13635B69709P0249j1447K44772A30553J60147A35804L13919r0799K62788k39314
$$ 269709 339958 328511 573283 130553 290700 135804 449723 358924 621712 382398
13625C82398J50947l7983k35919A10737K05520A53314M85056k15898o6479O1353
$$ 382398 533345 495362 259443 110737 316257 153314 638370 422472 355993 417346
13615D17346j11368K71088A35271K69443J28816j55441K0483j65813J04683j54902
$$ 417346 305978 577066 135271 404714 533530 378089 398572 232759 337442 182540
13605A82540K82128j63955J94609J82326A28407K17289R1385B04295M91025B42777
$$ 182540 464668 300713 495322 677648 128407 345696 437081 204295 695320 242777
13594B01612J75710L05769B16944H3246b8757B67005K83693B60628l2472I1468
$$ 201612 377322 683091 216944 83246 -28757 267005 550698 260628 228156 91468
13583G22129l04118Q7123j42579K82505j83905J72739k94373J40706k06282N0889
$$ 722129 418011 505134 362555 645060 461155 633894 339521 480227 273945 324834
13573C24834A0156K20400H1978L28083A13792L98173k11203J43763J25199J08552
$$ 324834 10156 230556 81978 410061 113792 511965 300762 444525 569724 678276
13563F78276A66631M62262r8400m149a46363E62081A69967M32018A37926J40587
$$ 678276 166631 628893 530493 526344 -146363 562081 169967 601985 137926 278513
13553B78513J61169A44630N43139l22024J05194Q4387j13821J47760k59885L59589
$$ 278513 439682 144630 687769 365745 470939 555326 441505 589265 329380 688969
13543F88969I3536J91842q1196K39868j9784j43296N0135O2786n3845j0829P784
$$ 688969 93536 285378 204182 444050 424266 280970 331105 393891 340046 329217 337001
13532C37001J3816J22765B15319K28904A50241j719J59284B3732K68565j7023
$$ 337001 350817 473582 215319 444223 150241 148522 307806 23732 292297 275274
13522B75274n7011j6599l0604Q4561J05949I1685J20527L0363m5673J92831a2748
$$ 275274 218263 201664 171060 255621 361570 91685 212212 242575 196902 389733 -12748
13510C99925A61231L38906p8453j36228M5384J75999F9385a4204B80902L62255
$$ 399925 161231 500137 421684 285456 330840 506839 69385 -14204 280902 643157
13500F43157j89591o583A87873J24618j48222J52159k7754P0181J8917A34633
$$ 643157 453566 446983 187873 312491 164269 316428 288674 358855 377772 134633
13489D44685p8194K4684n5400l6767J91358B09482K13954k1091j24032J4270j02244
$$ 444685 366491 391175 335775 299008 490366 209482 423436 402345 278313 292583 190339
13478A90339J60760J945j15425r8484K01951C9458R5764J90981n9454p154R3686
$$ 190339 351099 353044 237619 139135 341086 39458 135222 326203 266749 259595 353281
13467C53281b72985A14088C1772O5387L68852a09294A67304j7018a7633D00250
$$ 353281 -272985 114088 31772 97159 466011 -109294 167304 150286 -17633 400250
13456D67416B03011K00222j34668A5688M83707j28996j46817m074l8201b17023
$$ 467416 203011 403233 268565 15688 499395 370399 223582 219508 181307 -217023
13445B52328O7289o0468C8351j0898L88995J8433Q5341C8370M07164A10443C1889
$$ 252328 319617 259149 38351 27453 416448 434881 520222 38370 445534 110443 31889
13433B94993j35128D5423J26587E1229J15805J27058L7492d5136H4081J12033
$$ 294993 159865 45423 172010 51229 167034 294092 331584 -45136 84081 196114
13423A96114O593J45355j63002L02017k02497E5901J61705K97977B39663n8215
$$ 196114 202707 348062 185060 487077 284580 55901 217606 515583 239663 181448
13413A81448L1483J52685J38830A96101J31688o6580M0732A15906K73514A28856
$$ 181448 212931 365616 504446 196101 327789 261209 301941 115906 389420 128856
13402C71969B6545J97937I7315a0411D90191G3097f4291E2295J60380q8129J36057
$$ 371969 26545 224482 97315 -10411 490191 73097 -64291 52295 212675 124546 260603
13391B60603K8573O3110e3440D53265B23146K72089j31363k8830j59013J36884
$$ 260603 289176 352286 -53440 453265 223146 495235 363872 335042 176029 312913
13381C12913D9068J16511J06052l6452A1514b8506j57712A44161K60676n8233
$$ 312913 49068 165579 271631 235179 11514 -28506 -186218 144161 404837 346604
13371C46604N882j347f3555B2986K71897J15267j96502L51808D1836J43800p7781
$$ 346604 352486 351139 -63555 22986 294883 410150 213648 565456 41836 185636 107855
13360A07855k728a6842C12108N6822A03185a20650D17784A33158N65056A71405
$$ 107855 105127 -16842 312108 368930 103185 -120650 417784 133158 698214 171405
13349A27214L9021R8357M14658B58358H1452M7260l8800M9740J08537P3836J44071
$$ 127214 166235 264592 679250 258358 81452 128712 89912 139652 248189 322025 466096
13338D66096B26428J24656G5412K43750J76772A18443J09495M5254A09458L08100
$$ 466096 226428 351084 75412 319162 495934 118443 227938 273192 109458 417558
13328D17558P9269B29985G2078L26996M1166n171A19261L42253H9434J74111J18970
$$ 417558 496827 229985 72078 399074 440240 435069 119261 461514 89434 263545 382515
13317C82515A80023K38795A91326K25827J84439A85908C969g1467B95261j05029
$$ 382515 180023 418818 191326 417153 601592 185908 3969 -71467 295261 190232
13307A90232Q7512B6245J62077g4267E6360K41196B7403L38882a12141E1823O1806
$$ 190232 277744 26245 188322 -74267 56360 297556 27403 366285 -112141 51823 113629
13296A13629a45616A35971P5425q2391D3234f3866E22595A75888M36753b8108
$$ 113629 -145616 135971 211396 129005 43234 -63866 522595 175888 612641 -28108
13285D04291J775m9698C8569M99392B16060j7780o2544Q2164a70258G9311l3786
$$ 404291 406066 356368 38569 537961 216060 198280 135736 217900 -170258 79311 45525
13274D5525K25K84077n7602G735K4911M10298c55909f7560A82048J18547A29365
$$ 45525 45750 329827 272225 7735 32646 442944 -355909 -67560 182048 300595 129365
13262a03167B03328b1932B5533L67953j88914b43895B42418D3944K35863n8416
$$ -103167 203328 -21932 25533 393486 204572 -243895 242418 43944 279807 221391
13252B21391n9468L34063a12351b1435k19963N732B61489G681J41288R6997l1078
$$ 221391 161923 495986 -112351 -21435 -241398 -235666 261489 7681 148969 245966 214888
13241B14888i2839H5651O3685o2857M6102J06106F18Q1326R6954R9608A18659
$$ 214888 -92839 85651 149336 86479 132581 238687 618 81944 178898 278506 118659
13229A37932a395A13336J41306p5787E8996N0640g8314c8728G7710N9812F3397
$$ 137932 -1395 113336 254642 178855 58996 109636 -78314 -38728 77710 137522 63397
13217A09341a50301B36608A2801J72227a23789B44963h03A96937I4017a7943E2209
$$ 109341 -150301 236608 12801 185028 -123789 244963 -803 196937 94017 -17943 52209
13205A42056M9045O8584K42626a03995a810l6476j48051I5461J09981L491i8692
$$ 142056 191101 259685 502311 -103995 -1810 -38286 -186337 95461 205442 208933 -98692
13193A27186N6245F6177J10624j0751c962B60936j07225N6665I2997f1966P075
$$ 127186 183431 66177 176801 166050 -3962 260936 153711 210376 92997 -61966 -54891
13182e4891j87943L3346A51246c9714A05754P7531l1007P7772H1443J61247E5429
$$ -54891 -242834 -209488 151246 -39714 105754 183285 152278 230050 81443 242690 55429
13170F6003Q9284j3522J69607r850l2324e2693b3592C947b43757E1709K45821
$$ 66003 155287 141765 311372 301522 269198 -52693 -23592 3947 -243757 51709 297530
13159B97530E5448K85931c70298a39490F0511L81858A90301J2854J12139E6572
$$ 297530 55448 341379 -370298 -139490 60511 442369 190301 203155 315294 56572
13148C40992h1194H4810a38999L1107F334K28305J22314I7180J31990Q6836H0262
$$ 340992 -81194 84810 -138999 -107892 6334 234639 356953 97180 229170 316006 80262
13136h0856A7894Q3674l024O6220a96755O3330N2874A878J7695P3851k7945J40777
$$ -80856 17894 101568 98544 164764 -196755 -133425 -80551 1878 19573 93424 65479 206256
13124B06256n858f4507D986J60117J03121E6689J03002g4012B33090a79216D6524
$$ 206256 200398 -64507 4986 165103 268224 56689 159691 -74012 233090 -179216 46524
13112b15814A49126K45504G9108a63156A8209g1440A31322C0612J94633A948a00543
$$ -215814 149126 394630 79108 -163156 18209 -71440 131322 30612 225245 1948 -100543
13100B84282a50756A190d42851h6413r788B42162C9404M4173e0059q941B91677
$$ 284282 -150756 1190 -442851 -86413 -96201 242162 39404 83577 -50059 -59000 291677
13088F5340L8051f7654B40986n8958m1286K91222r9254j21960D2188P7403n3996
$$ 65340 103391 -67654 240986 182028 140742 431964 332710 210750 42188 119591 65595
13077F5595a62749A26322d3452B90546i3224A37669O1504n5148a8290E2945b07879
$$ 65595 -162749 126322 -43452 290546 -93224 137669 199173 144025 -18290 52945 -207879
13065A28398J62120J04057j58289B2412J34843c7649A57822O5379J17114q0476
$$ 128398 290518 394575 236286 22412 157255 -37649 157822 223201 340315 259839
13055B59839f5972j44543C34365D4823K5846j8453e1533A09602D9303J08755G5469
$$ 259839 -65972 -210515 334365 44823 70669 52216 -51533 109602 49303 158058 75469
13043G5265M56988a41321A14145D9256J02194a13988H3181K5746J724l8023b4000
$$ 75265 532253 -141321 114145 49256 151450 -113988 83181 108927 110651 72628 -24000
13031d556B47505k2796B9516M67269B02734E3279J63858J39400b4007o0676B93596
$$ -4556 247505 224709 29516 496785 202734 53279 217137 356537 -24007 -84683 293596
13019A75308L4966M2326C9580J12509C4792j2712a3970r6740H9763K82199j19221
$$ 175308 210274 252600 39580 152089 34792 22080 -13970 -110710 89763 371962 252741
13008B52741c5933A13035M344J50331j9599f7294B70370B7191L29508a09531L3597
$$ 252741 -35933 113035 117379 267710 248111 -67294 270370 27191 356699 -109531 -75934
12997g5934I121h3595A71521F4762J39254b803A85647J8671l9491E4546a16216
$$ -75934 9121 -83595 171521 64762 204016 -2803 185647 204318 164827 54546 -116216
12985C0285O152a9265B39687H3591a72981C2937L14236B2786L67402e2076b3618
$$ 30285 36437 -19265 239687 83591 -172981 32937 347173 22786 390188 -52076 -23618
12973A53708Q4161D6223P9954g8216k16666b220H2043K80058G1466K08485g0540
$$ 153708 237869 46223 126177 -78216 -294882 -2220 82043 362101 71466 279951 -70540
12961F9503c06013B13272E4397P6501E1846Q1941J30299b71292R0426I9296K20309
$$ 69503 -306013 213272 54397 130898 51846 133787 264086 -271292 -180866 99296 319605
12950C19605a13609B59847c9746j69943A63881N8920M3198a29389A41512i7130
$$ 319605 -113609 259847 -39746 -209689 163881 222801 265999 -129389 141512 -97130
12939h1998A44528Q7943A1774J24194A2323a21896A53784a3465k61776C1467P9336
$$ -81998 144528 232471 11774 135968 12323 -121896 153784 -13465 -275241 31467 110803
12928A10803C1527h1737A41899k9836j0552j5832e01043B45265N3735A12007a7434
$$ 110803 31527 -81737 141899 112063 101511 85679 -501043 245265 299000 112007 -17434
12916B07018l6074J2305k8126A9270J46660M1662J66334D6788L2883a0410F8683
$$ 207018 170944 183249 155123 19270 165930 207592 373926 46788 79671 -10410 68683
12904D02330r5151b84502C0466L515a0578B04480K4510f4295C35867a56541G5813
$$ 402330 307179 -284502 30466 33981 -10578 204480 228990 -64295 335867 -156541 75813
12892B00561H3107l4017N031j3947J99852G5488Q2640o5340K0099e1789E4601
$$ 200561 83107 49090 54121 40174 240026 75488 158128 92788 112887 -51789 54601
12880F4719B4871P868J65294b31542A1453b80779a6420o1996A68227a82305G1676
$$ 64719 24871 32739 198033 -231542 11453 -280779 -16420 -78416 168227 -182305 71676
12868A89901a08038e3666B21868k3403a36164K1774B01471a24107A20605C2842
$$ 189901 -108038 -53666 221868 198465 -136164 -114390 201471 -124107 120605 32842
12857A04739b7007A83679c28660A40607M9500b17087A01982a11650A41758a88893
$$ 104739 -27007 183679 -328660 140607 190107 -217087 101982 -111650 141758 -188893
12846A35491a49106M2599n4268A5733K71429A13396P3144A5592J6557e0159A72970
$$ 135491 -149106 -106507 -160775 15733 287162 113396 186540 15592 32149 -50159 172970
12834a7518E1757K7030d2438A83046K68409j68750b13947G9020b8951I3852Q4714
$$ -17518 51757 78787 -42438 183046 451455 282705 -213947 79020 -28951 93852 178566
12823A78566c75264A17951a32142A91420J00581g6072E98814k59110G8355k6665
$$ 178566 -375264 117951 -132142 191420 292001 -76072 598814 339704 78355 51690
12813E1690c9881B49470c14122h3051A4719h7631A47573a08744j64302A55090
$$ 51690 -39881 249470 -314122 -83051 14719 -87631 147573 -108744 -273046 155090
12802C00731A1948a58442e7726A19634c3985B05972H4940e4143b5287F3783C954
$$ 300731 11948 -158442 -57726 119634 -33985 205972 84940 -54143 -25287 63783 3954
12790b93201c6992A643O438a09141B8051Q913d8265A84316f5027n4278B71754
$$ -293201 -36992 1643 8081 -109141 28051 36964 -48265 184316 -65027 -119305 271754
12778c2916k30146J28598B18036d2789H9131L94476A16669d9070H0300M2203b07796
$$ -32916 -263062 -134464 218036 -42789 89131 483607 116669 -49070 80300 122503 -207796
12766d98059F8280B596f7953K8894B73137a16699B98541p2377D5653a7990k53545
$$ -498059 68280 2596 -67953 -39059 273137 -116699 298541 226164 45653 -17990 -271535
12755b71535H2038K05599P4493j00284a3654k14128j21384J02305K0121C05715
$$ -271535 82038 287637 362130 261846 -13654 -227782 -349166 -246861 -226740 305715
12744B27316q2177J4309k2042K16962I4334l8239L53577A54006K6746N5468J67339
$$ 227316 145139 159448 137406 354368 94334 56095 409672 154006 180752 236220 403559
12733D03559B9882c015C14289B5597i5544d6228C3508P9927J58516A23494B3493
$$ 403559 29882 -3015 314289 25597 -95544 -46228 33508 113435 271951 123494 23493
12721B01917g011A6916K09655C3227J2752p753M7281A2575a97742I779N6379h8910
$$ 201917 -7011 16916 226571 33227 45979 38226 85507 12575 -197742 9779 66158 -88910
12708a1248A79061J88007o918H708J29300O8865m3628e7412q7064A25064P1845
$$ -11248 179061 367068 360150 8708 138008 206873 163245 -57412 -144476 125064 196909
12697A96909B0207a46303a5560r5683k51397B01848a58177A57047c6183q0184
$$ 196909 20207 -146303 -15560 -111243 -362640 201848 -158177 157047 -36183 -116367
12687a16367c4752A35456K1622h3949B18047P0098Q2312A60090a9745C04683j47018
$$ -116367 -34752 135456 157078 -83949 218047 288145 370457 160090 -19745 304683 157665
12676A57665O7764J34472D8486P6182g2483C5743r109J6198a8773E4162m197K16670
$$ 157665 225429 359901 48486 124668 -72483 35743 26634 42832 -18773 54162 49965 266635
12664B66635Q6413A516J90119K0317H7914L79758A14288j7879K9087K7337n2226
$$ 266635 353048 1516 191635 211952 87914 467672 114288 96409 125496 152833 100607
12653A00607l3777J68334A15833l777K13212c2619H5214l9895N3979a39387f5844
$$ 100607 66830 235164 115833 112056 325268 -32619 85214 45319 99298 -139387 -65844
12641F5662L7110A537a24162B30796G6444g2334B5031d8772A25108m4623J68994
$$ 65662 102772 1537 -124162 230796 76444 -72334 25031 -48772 125108 80485 249479
12630B49479r5991J42922K04028j43413j00723N1137K0206N0961H8648M4964J60975
$$ 249479 153488 296410 500438 357025 256302 307439 327645 378606 88648 133612 294587
12619B94587A7835N6786L4963K07174b23418k4140d1207B70788b88053O410A67786
$$ 294587 17835 74621 109584 316758 -223418 -247558 -41207 270788 -288053 -281643 167786
12607a76017C7135a14443A18340b26275C02015B73J59568a20478B7352K21841
$$ -176017 37135 -114443 118340 -226275 302015 273 159841 -120478 27352 249193
12597B49193a21019I543b8051H504O0815e5727C59777E0828J26152J8216a01003
$$ 249193 -121019 9543 -28051 8504 69319 -55727 359777 50828 176980 195196 -101003
12585h4420A29381D8281K7303c742j9746B51837E0469O2400a91345l486j28244
$$ -84420 129381 48281 75584 -3742 -23488 251837 50469 112869 -191345 -194831 -323075
12574c23075g9530A10895l5827b3471B72839c4738C22036r3457b06012B95883
$$ -323075 -79530 110895 75068 -23471 272839 -34738 322036 228579 -206012 295883
12563c9098j54173H4516J78703a00378B28615j06001B5614J23970F8630c0007
$$ -39098 -193271 84516 263219 -100378 228615 122614 25614 149584 68630 -30007
12552A23153l2546D3920a25992k12198I483A238N8939K74724j23030q463d09086
$$ 123153 90607 43920 -125992 -338190 9483 1238 60177 334901 211871 203408 -409086
12540I6719a61495j5752B46438L9939f0446q5112A87915J86073A62034h9639K7157
$$ 96719 -161495 -177247 246438 286377 -60446 -145558 187915 373988 162034 -89639 -62482
12529f2482B79502f1315A53523E6327a39020A7248c13567B80723a71743k4920
$$ -62482 279502 -61315 153523 56327 -139020 17248 -313567 280723 -171743 -196663
12519a96663A45015g1019A13954J0002d29251a5431k7847C738a23301n3787B01607
$$ -196663 145015 -71019 113954 123956 -429251 -15431 -43278 3738 -123301 -177088 201607
12507h1675n495M2781A74564j418J496B041J50728J28803J09276j9060A85280
$$ -81675 -87170 -44389 174564 173146 174642 2041 152769 281572 390848 371788 185280
12495A39736P5727d6443o4519J5178j77262p6851A40591c05159c4840j00106f6616
$$ 139736 215463 -46443 -110962 -95784 -273046 -349897 140591 -305159 -34840 -134946 -66616
12483c711A16357L1046c0877H4545R7578p9093a67829D06613A53917Q3624a47007
$$ -3711 116357 147403 -30877 84545 182123 103030 -167829 406613 153917 237541 -147007
12471b651B7656M8667C5942Q8904a7002A31196c44409c2821B05560f5904J40r7927
$$ -2651 27656 76323 35942 124846 -17002 131196 -344409 -32821 205560 -65904 -65764 -163691
12459a63691f7713D97L50891C8815J72494a52613A36621j5601c48614D8801G384
$$ -163691 -67713 497 351388 38815 211309 -152613 136621 121020 -348614 48801 7384
12447G2581a22175J1585j49093H1153b5202j37761I1982O3081a57053n2116A1229
$$ 72581 -122175 -110590 -259683 81153 -25202 -162963 91982 155063 -157053 -209169 11229
12435A95577k9205g2674B92964E8140b88049A79535A4508K07690F7177B3883e35868
$$ 195577 166372 -72674 292964 58140 -288049 179535 14508 222198 67177 23883 -535868
12423B03236l4r4238K5185J07912F0134K50211E3339J17479l2434b43757a02572
$$ 203236 203202 108964 134149 242061 60134 310345 53339 170818 138384 -243757 -102572
12411E0370a56319G4805e821j47623A33641e5698B00268L14614j56382j63977
$$ 50370 -156319 74805 -5821 -153444 133641 -55698 200268 514882 358500 194523
12401A94523a16831E7206J79924E3491L9737J07342l3640e4591j42190L0575A20550
$$ 194523 -116831 57206 237130 53491 93228 200570 166930 -54591 -196781 -166206 120550
12389A11188b19947P9341b5237B04933c0796n8426A14627a26935B54057A7201
$$ 111188 -219947 -140606 -25237 204933 -30796 -89222 114627 -126935 254057 17201
12378E6860k0603h866B62829F1768j5539f787C9802o963J8181A844i0336k81126
$$ 56860 36257 -8866 262829 61768 46229 -6787 39802 32839 51020 1844 -90336 -371462
12366c71462a16259E1811b73068I293J82224J43173I7921A7623b18051E1877a62718
$$ -371462 -116259 51811 -273068 9293 191517 334690 97921 17623 -218051 51877 -162718
12354a35010C37807B7322J40699J3961m3756G473J49093O1923b63813D38298a64320
$$ -135010 337807 27322 168021 181982 138226 7473 156566 218489 -263813 438298 -164320
12342b2060i023G2467b00417e1107B559K27987o6287c73449g8126D8739c9242
$$ -22060 -9023 72467 -200417 -51107 2559 230546 164259 -373449 -78126 48739 -39242
12330a97499Q140p7483A30795B501P4516a09489B06081a94917e4723j83861e2457
$$ -197499 -189359 -266842 130795 2501 77017 -109489 206081 -194917 -54723 -238584 -52457
12318a78185H568M7802o580b8507m11921g2900C20630I748i574l313k5588k21184
$$ -178185 8568 56370 49790 -28507 -440428 -72900 320630 9748 -9574 -12887 -38475 -259659
12306b59659o372g6020A46834a51458o0804B28022d00898c9214o5941B98853h6273
$$ -259659 -266031 -76020 146834 -151458 -212262 228022 -400898 -39214 -105155 298853 -86273
12294A9179a44622B30392c40720J51415R603A85585q9480k6659J56075B331f1808
$$ 19179 -144622 230392 -340720 -189305 -179702 185585 96105 69446 225521 2331 -61808
12282H8115b9888C56777A09118K06296j54401N711b40386G8253M4388M9396C1696
$$ 88115 -29888 356777 109118 315414 161013 166724 -240386 78253 122641 172037 31696
12270B79025A05976m331K8790E9102J39516k3375e4948j13225P9169A00233M8421
$$ 279025 105976 101645 130435 59102 198618 175243 -54948 -168173 -89004 100233 148654
12259A48654N7747k0274C7883R0178C0736K86270A28875b33076C06283h2830A13958
$$ 148654 206401 186127 37883 128061 30736 317006 128875 -233076 306283 -82830 113958
12247h3771C3446b98672E0156K55534J69962I7377c6375A18630M0856K24814E1170
$$ -83771 33446 -298672 50156 305690 475652 97377 -36375 118630 159486 384300 51170
12235a09234C28027f7233l9037k00156A56471e879A87655H1098k5728A8277O4635
$$ -109234 328027 -67233 -106270 -306426 156471 -5879 187655 81098 55370 18277 82912
12224H2912P2019J00329O5064H8680M27670D1708L194Q0778K08545f4014B03088
$$ 82912 154931 255260 320324 88680 516350 41708 44902 125680 334225 -64014 203088
12212D81700j72787a86407E5697M7877D5520B092K10791J42305j67707G9803L88334
$$ 481700 308913 -186407 55697 103574 45520 2092 212883 355188 187481 79803 468137
12201D68137A68040f5999n3835H0739P7460o3413K90794A52778J20732l2196j05606
$$ 468137 168040 -65999 -119834 80739 158199 94786 385580 152778 273510 241314 135708
12190A35708J1200J48645e3229A14786J20981o3715M2851j142N9489l6643B3434
$$ 135708 146908 295553 -53229 114786 235767 172052 214903 213761 273250 236607 23434
12178A67749i4846A22011Q2044c18223B29807A2693K00936e4170B05380k8670
$$ 167749 -94846 122011 204055 -318223 229807 12693 213629 -54170 205380 176710
12168A76710Q6191h1212r1977A55496K5023a58124B21173a38537D38873A73051
$$ 176710 262901 -81212 -173189 155496 180519 -158124 221173 -138537 438873 173051
12157A44918b40901A31713J84940g0878B77154c44558C1075j0920J01761K80415
$$ 144918 -240901 131713 316653 -70878 277154 -344558 31075 20155 121916 402331
12147D02331f3066j00928A63588C1360P8183f5078G2551d6448I1344P0834a82961
$$ 402331 -63066 -163994 163588 31360 109543 -65078 72551 -46448 91344 162178 -182961
12135H4944C5296b23127B19929c6229H8562a59850B95902n4114a74417n2924P7579
$$ 84944 35296 -223127 219929 -36229 88562 -159850 295902 241788 -174417 -227341 -149762
12124a49762B13664i9730b7829A1303a71786B03513J1002A0671L75291a3280A18044
$$ -149762 213664 -99730 -27829 11303 -171786 203513 214515 10671 385962 -13280 118044
12112A68894o1386a92640j10355J41377E7839O76a421l785k31985l9550c5571
$$ 168894 107508 -192640 -302995 -161618 57839 58515 -1421 -5206 -237191 -276741 -35571
12100D3106a02525H3665J34242d5512A40373f0569j52671B83334M9367b15323
$$ 43106 -102525 83665 217907 -45512 140373 -60569 -213240 283334 332701 -215323
12089c37080D1913b57883a6211j09038N9543n8750A23597c07757A24763F606h3272
$$ -337080 41913 -257883 -16211 -125249 -65706 -124456 123597 -307757 124763 6606 -83272
12077I9011a97034a3433A60870b74537M5332A82368b3322F8129K01967a20740
$$ 99011 -197034 -13433 160870 -274537 -229205 182368 -23322 68129 270096 -120740
12066A85527F4508a2521k38453C3707g1927B32841A2969O1822a97697h7796L0281
$$ 185527 64508 -12521 -250974 33707 -71927 232841 12969 74791 -197697 -87796 -57515
12055e7515a6306k58310a16075d3715j43897A11509E4756f2811j2829p7402K1960
$$ -57515 -16306 -274616 -116075 -43715 -187612 111509 54756 -62811 -75640 -153042 -131082
12044a31082F5097L6060j785J79385K46351J106820k25929C26929g426B14487
$$ -131082 65097 101157 99372 278757 525108 1631928 1405999 326929 -7426 214487
12033G1226B2755b3444k14336A04545N7294b00566j8721D8187J73876F837a65861
$$ 71226 22755 -23444 -237780 104545 161839 -200566 -219287 48187 222063 6837 -165861
12021a10355I4551a48143M6309I3131k9903i5751K4293J101A5038i9835l25721
$$ -110355 94551 -148143 -101834 93131 63228 -95751 -71458 -70357 15038 -99835 -425556
12010d25556D1740K8522Q4270D0232K12939F3386b830A43347K46049L1055G7720
$$ -425556 41740 70262 154532 40232 253171 63386 -2830 143347 389396 420451 77720
11998e7768k6039A30795L3961E7495a0603C86140b87794D1658i0797L5047C4199
$$ -57768 -83807 130795 164756 57495 -10603 386140 -287794 41658 -90797 -55750 34199
11986B35730C7520J46508B6607g5350A23009a4885B96496j13382a54961j55A58270
$$ 235730 37520 184028 26607 -75350 123009 -14885 296496 183114 -154961 -155116 158270
11974G0723b43556C8439a57652k3786A73146O6846a19848j20605C60172A57753
$$ 70723 -243556 38439 -157652 -181438 173146 239992 -119848 -240453 360172 157753
11963b8929D14293a0704A17760a09528C485K08532G3242i1408B14700g2854j201
$$ -28929 414293 -10704 117760 -109528 3485 212017 73242 -91408 214700 -72854 -74055
11952g4055A90679b33276A06740d8846C1596f0788k2220B14344B1629a28697n2591
$$ -74055 190679 -233276 106740 -48846 31596 -60788 -83008 214344 21629 -128697 -181288
11941a81288E1001h2026B18584b01603K9997B97014K6616b16961i660H831K79985
$$ -181288 51001 -82026 218584 -201603 -171606 297014 323630 -216961 -9660 8831 288816
11930B88816j06683g5645J9171A83238J165Q256M7261a6396k19395C11880a30532
$$ 288816 182133 -75645 -56474 183238 184403 192659 239920 -16396 -235791 311880 -130532
11918e9952b0279o07801C0012J71621a39834A76197e3714A88421k3260J07604
$$ -59952 -20279 -628080 30012 201633 -139834 176197 -53714 188421 165161 272765
11908B72765H9356a94286D9088a38332q4327B3934K09809a41184l4334a3539C8436
$$ 272765 89356 -194286 49088 -138332 -222659 23934 233743 -141184 -175518 -13539 38436
11896d34880B00705a52507E6274b22643A23698J2741a446j37039j60196M2757
$$ -434880 200705 -152507 56274 -222643 123698 136439 -1446 -138485 -298681 -255924
11886b55924b2068j93527R4647A9570a90271C4592L5882a6853F2788R8510B5715
$$ -255924 -22068 -215595 -120948 19570 -190271 34592 70474 -16853 62788 161298 25715
11874H52a50678K5150n202j03396N0044A58772b4111G4383f3279I7235d90339
$$ 852 -150678 -125528 -130730 -234126 -184082 158772 -24111 74383 -63279 97235 -490339
11862b65446D86049b11389n2416A71141R82c1613G959h3715B63064i9692k52137
$$ -265446 486049 -211389 -263805 171141 172123 -31613 7959 -83715 263064 -99692 -351829
11851c51829I7306a19237A95504e7643a0297b129j52071P5738B1171Q2706R0900
$$ -351829 97306 -119237 195504 -57643 -10297 -2129 -154200 -78462 21171 103877 194777
11840A94777H7107D743c7117q1992B47308C0103a66520n8493A07959a52721B04012
$$ 194777 87107 4743 -37117 -119109 247308 30103 -166520 -225013 107959 -152721 204012
11828B49254c04374h0971A6359a58473f8124B32561a24687J3941A07275a12970
$$ 249254 -304374 -80971 16359 -158473 -68124 232561 -124687 -110746 107275 -112970
11817a62668F2573q63a33908e878C520O3804C2365c34705R3573A17155G295b45551
$$ -162668 62573 61710 -133908 -5878 3520 67324 32365 -334705 -241132 117155 7295 -245551
11804d5058J4355k38042b3799h475l7032k58181I6028a98346d2792A21729J30100
$$ -45058 -30703 -268745 -23799 -8475 -45507 -303688 96028 -198346 -42792 121729 251829
11793B51829g3834B15804a54175o5387A95951a55936E9882N5502f0945C369a52899
$$ 251829 -73834 215804 -154175 -219562 195951 -155936 59882 115384 -60945 3369 -152899
11781A65456a3773j77595c6381C32823a64316B35628K6774a6897C1939J69969
$$ 165456 -13773 -191368 -36381 332823 -164316 235628 262402 -16897 31939 201908
11771B01908a03572M1022B35659c108B35404c89037A03774b17266i2509j1154
$$ 201908 -103572 -62550 235659 -3108 235404 -389037 103774 -217266 -92509 -103663
11761a03663m1639j60734a46262A03557K793b70186g2460k7528B49418b13727
$$ -103663 -145302 -306036 -146262 103557 106350 -270186 -72460 -99988 249418 -213727
11750e8093A36720c71396a34976D4186K19154e3894A0398L9609L6636p83j5738
$$ -58093 136720 -371396 -134976 44186 263340 -53894 10398 50007 86643 85860 70122
11739G0122k7664A2370b26764B96507p9663A1305J85345C1164Q0280K46243B5596
$$ 70122 42458 12370 -226764 296507 216844 11305 196650 31164 111444 357687 25596
11727A11932a2446j6940C35118b79310G4525l6000a20192C30643d6626A43924
$$ 111932 -12446 -29386 335118 -279310 74525 38525 -120192 330643 -46626 143924
11716a13433k5377b5668A07011O6653m6946b40037P3237j4156B64044B9448b4581
$$ -113433 -138810 -25668 107011 173664 126718 -240037 -166800 -180956 264044 29448 -24581
11704i1907D4167o837Q8637d4311j33944l8095c4022j7451F3587b83063k3887
$$ -91907 44167 37330 125967 -44311 -178255 -216350 -34022 -51473 63587 -283063 -306950
11693c06950J05810F9729B8640J88408C9372j8202a05292C7956Q8116m9219J47374
$$ -306950 -201140 69729 28640 217048 39372 21170 -105292 37956 126072 76853 224227
11682B24227l1685O3277h9719K6080a2818A51719c19472c1323j41804j41652A99190
$$ 224227 192542 255819 -89719 -63639 -12818 151719 -319472 -31323 -173127 -314779 199190
11670A08431m2118a03098B75269j00698a29956j31715B40558L5021a15483m3140
$$ 108431 66313 -103098 275269 174571 -129956 -261671 240558 275579 -115483 -158623
11660a58623G4104a4825l72943N6627i1708C23033e067j67668l1350h7290A58641
$$ -158623 74104 -14825 -387768 -331141 -91708 323033 -5067 -172735 -204085 -87290 158641
11648a1980p4060H7783J03584c0900F1829b80449A32545a91666C14490b1044A2099
$$ -11980 -86040 87783 191367 -30900 61829 -280449 132545 -191666 314490 -21044 12099
11636B0225q77M4985M2261J49575c9195A55862m0234g8302B75645C9224a49838
$$ 20225 19348 64333 106594 256169 -39195 155862 115628 -78302 275645 39224 -149838
11624A08737e245B6398b2262H8695c44871D9588d68502A26104a46435B08303I5914
$$ 108737 -5245 26398 -22262 88695 -344871 49588 -468502 126104 -146435 208303 95914
11612E5459l689b57926d2023A4362g9292p6761A18961Q1281F2744d8693j1602
$$ 55459 51770 -257926 -42023 14362 -79292 -156053 118961 200242 62744 -48693 -60295
11601f0295B49098A4956P098K19597f0838B3376K18265a82742A5699f6280a3711
$$ -60295 249098 14956 22054 241651 -60838 23376 241641 -182742 15699 -66280 -13711
11589A28469L13305A23790a79175P3677b6585F1484a93738N5344M1228F9076C762
$$ 128469 441774 123790 -179175 -105498 -26585 61484 -193738 -138394 -97166 69076 3762
11577C5419J34691p4993f4801A07936J11771b79224O1641G6808h3447E1125K89788
$$ 35419 170110 95117 -64801 107936 219707 -279224 -217583 76808 -83447 51125 340913
11566C40913A65197q1923K89686G9458c64903A01913J38570A5238o720K16644
$$ 340913 165197 83274 372960 79458 -364903 101913 240483 15238 8518 225162
11556B25162N4203J9812H7494K57674A70313J22615a34307D9668A6899b30372
$$ 225162 279365 299177 87494 345168 170313 292928 -134307 49668 16899 -230372
11545I1371B7757K50657Q704L9249d7495k37808J06875A94886c58489C1575J52003
$$ 91371 27757 278414 287118 326367 -47495 -285303 -178428 194886 -358489 31575 183578
11534A83578J1711e1259A60259D2765J29724a3639A42339N6360K03442F9947j6327
$$ 183578 195289 -51259 160259 42765 172489 -13639 142339 198699 402141 69947 53620
11523E3620N1104M1417J68997i2477q7904A77253O3445A14751K0449a56953A63662
$$ 53620 104724 146141 315138 -92477 -180381 177253 240698 114751 135200 -156953 163662
11511g3752B69571o1273a38052A34646J50357c2441A19720A6680e7786B92423
$$ -73752 269571 208298 -138052 134646 285003 -32441 119720 16680 -57786 292423
11500f4897C11532M9035F6771O8814K41565i0865k33824d5132C49445j16782A05471
$$ -64897 311532 360567 66771 135585 377150 -90865 -324689 -45132 349445 232663 105471
11488f8261H9284i2669B37026r0901M7091J26453j36942J02023G5139j7631J1310
$$ -68261 89284 -92669 237026 146125 193216 319669 182727 284750 75139 57508 68818
11477F8818J49786I0391a35276A70756o9779C5967K8013D135K06816j2094b08569
$$ 68818 218604 90391 -135276 170756 100977 35967 63980 4135 210951 198857 -208569
11465C82676A90850E2361a36631d2380A73664C6137a8958l3004C99421E7462J63983
$$ 382676 190850 52361 -136631 -42380 173664 36137 -18958 -51962 399421 57462 221445
11454B21445I3767J67011A16710J03599J45485d3377J3150j2380k98539d2723
$$ 221445 93767 260778 116710 220309 365794 -43377 -30227 -42607 -341146 -42723
11443B15701a2631D6236a40869B65635d5175m174A53903B2050K75592j8351I4667
$$ 215701 -12631 46236 -140869 265635 -45175 -49349 153903 22050 297642 279291 94667
11431b36099p8646A70945F1320Q1236R3471f2430C8636i6721C36661a3440C91038
$$ -236099 -314745 170945 61320 142556 236027 -62430 38636 -96721 336661 -13440 391038
11419a1044n9640A0164a79709q3018a1919j18830A39501a91696N618e1773j01928
$$ -11044 -70684 10164 -179709 -262727 -11919 -130749 139501 -191696 -186078 -51773 -153701
11408a53701a2441B32855r6279M0697l7580m6606a55694r2329D9848J5412b49759
$$ -153701 -12441 232855 136576 177273 139693 93087 -155694 -248023 49848 65260 -249759
11396I9286L533Q3912B2818c32750J35429A59625c44325A11506c62195a47646
$$ 99286 102819 186731 22818 -332750 -197321 159625 -344325 111506 -362195 -147646
11385a06040m0793D8003J97462a58499I3245d16307i8766C4716J4027P4307k90
$$ -106040 -146833 48003 245465 -158499 93245 -416307 -98766 34716 48743 123050 122760
11374A22760m9648b05126C45916d6356D6820b7011B50996D1648A5293M4934a48029
$$ 122760 73112 -205126 345916 -46356 46820 -27011 250996 41648 15293 60227 -148029
11362g0425j75154A21988m8133b05083G5001L7103K38931A46935b85175j52147
$$ -70425 -245579 121988 73855 -205083 75001 112104 351035 146935 -285175 -437322
11352d37322B829K38830E3202j5817Q6748D9424i7645c5567E4755J29715b35753
$$ -437322 2829 241659 53202 37385 124133 49424 -97645 -35567 54755 184470 -235753
11340A01828a90793L9548j08585M1019f6808A47859n0260d018l07202A56918b46479
$$ 101828 -190793 -151245 -259830 -218811 -66808 147859 97599 -4018 -311220 156918 -246479
11328i2086k34214H2152C7099M656c12483A1058c47908C3086K3656l722i7898
$$ -92086 -326300 82152 37099 41755 -312483 11058 -347908 33086 56742 53020 -97898
11316A35169a12537C14156a00906A7182P1878C6976b9367O608q0574E9325a44619
$$ 135169 -112537 314156 -100906 17182 89060 36976 -29367 -22759 -103333 59325 -144619
11304a93257B14429a56373b4973p3146j07006o4685d5056A59399c029m8197a9341
$$ -193257 214429 -156373 -24973 -98119 -205125 -269810 -45056 159399 -3029 -51226 -19341
11292A34044a45785n6467E737J09865C8105b35226l0666E9004a0124o8034A2485
$$ 134044 -145785 -202252 5737 115602 38105 -235226 -265892 59004 -10124 -78158 12485
11280b79289A02028K41273c13146J24469D6455L79599i9174F4408J06171a80557
$$ -279289 102028 343301 -313146 -188677 46455 426054 -99174 64408 170579 -180557
11269B23503a55634k46240k4690K10217P7323K6327N1656B215a85331E18250f4959
$$ 223503 -155634 -401874 -426564 -216347 -139024 -112697 -61041 2215 -185331 518250 -64959
11257g2309j02879J8646E4373c7495A73861f3041B31305d8878k40912b7335q9819
$$ -72309 -175188 -156542 54373 -37495 173861 -63041 231305 -48878 -289790 -27335 -117154
11246a17154j76463N3422a2755B38437f7874J224A22798K0001a82031J2113A56808
$$ -117154 -293617 -240195 -12755 238437 -67874 -66650 122798 142799 -182031 -169918 156808
11234C9827c0064j11723G8922Q8109a76313G119J3753d0087d624D7712a33699
$$ 39827 -30064 -141787 78922 167031 -176313 7119 20872 -40087 -4624 47712 -133699
11222e0888r499D8622L3531a4580b868B544a58031C12960E2793c03621e1454B01175
$$ -50888 -60387 48622 82153 -14580 -2868 2544 -158031 312960 52793 -303621 -51454 201175
11209D2134a51909r100L398D1368h3641b9620B11935d5287F0069a73413f3491
$$ 42134 -151909 -161009 -157611 41368 -83641 -29620 211935 -45287 60069 -173413 -63491
11197A36020D5279M39328k01018B384N9525b9066n8535j54512a18862D2017L13364
$$ 136020 45279 484607 283589 2384 61909 -29066 -87601 -242113 -118862 42017 355381
11186C55381a45898P896A31044R4774b14327R1383G8100a15296G1411B2978d0308
$$ 355381 -145898 -138002 131044 225818 -214327 -122944 78100 -115296 71411 22978 -40308
11174B94141B1766d53651a95638D8183L3156a61155B41491n9897f5170j64511
$$ 294141 21766 -453651 -195638 48183 81339 -161155 241491 181594 -65170 -229681
11164b29681g5542A51616f9046h643j11550J9569J190d4286j65217A09452M1601
$$ -229681 -75542 151616 -69046 -8643 -120193 -100624 -99434 -44286 -209503 109452 151053
11153A51053H324g4887B6358f2029A25880B7506N6207g9284F8338f0622b1707
$$ 151053 8324 -74887 26358 -62029 125880 27506 83713 -79284 68338 -60622 -21707
11141A00857c183A34409b8761A73456P0844G4891K27985M6367a73978A8131l029
$$ 100857 -3183 134409 -28761 173456 244300 74891 302876 349243 -173978 18131 15102
11130A5102b657j05884p4020A03624m396a34681B78099l0653e6272k9835b0890
$$ 15102 -2657 -108541 -182561 103624 99228 -134681 278099 247446 -56272 -86107 -20890
11118d7058H7321J55828N5122p5369l0620K58273C2999i1783J0929j91088d8334
$$ -47058 87321 243149 298271 222902 192282 450555 32999 -91783 -80854 -271942 -48334
11106B65009b12377B33714m6729j4037K13623A33670L7271D4477M14851B27986
$$ 265009 -212377 233714 186985 172948 386571 133670 170941 44477 459328 227986
11095G939K31863J61109a08248B23516f946C3502M03379A44677l1394N4535e6726
$$ 7939 239802 400911 -108248 223516 -6946 33502 436881 144677 113283 167818 -56726
11083b9991k07915A56408J41787q8969M5732A15587J92985j52829P9433c758A6550
$$ -29991 -237906 156408 298195 209226 254958 115587 308572 155743 235176 -3758 16550
11071E15895A93690L37404j31841J89926A49449K16234R2559J55660A87236M62159
$$ 515895 193690 531094 399253 589179 149449 365683 458242 613902 187236 649395
11061F49395n824B58227K15784O2307J57245o6964N5933K17504k87182J02574
$$ 649395 643571 258227 474011 536318 693563 626599 682532 900036 612854 715428
11051G15428O032n9192L44096M5743j41853k07820J28169l07841L01139j68453
$$ 715428 721460 662268 1006364 1052107 910254 702434 830603 522762 823901 655448
11041F55448k89377M23336C88990M20615k41648L91098j75439k40784J40810K51753
$$ 655448 366071 789407 388990 809605 567957 959055 783616 542832 683642 935395
11031I35395j83184p6201M30642l29194k22874N10871k77018K09579k35845q7203
$$ 935395 752211 676010 1106652 777458 554584 1065455 788437 998016 762171 674968
11021F74968P556J70626q2060j71638q8725j33164K65690j46022q8072K15632
$$ 674968 682524 853150 771090 599452 510727 377563 643253 497231 409159 624791
11011F24791L34639l67516K64916k28447n3161K68017Q5531k55416q0571K31443
$$ 624791 959430 591914 856830 628383 575222 843239 928770 673354 592783 824226
11001H24226k60215J63171Q1045L3063k19501K69094l48223J27159O1621m9370
$$ 824226 564011 727182 808227 841290 621789 890883 542660 669819 731440 682070
10991F82070M2009P6118j6791L770N84545F73217L21669k55957J39443J5365L31031
$$ 682070 724079 800197 783406 787176 1371721 673217 994886 738929 878372 893737 1224768
10980A224768K7791Q3674o0426L82161J73397O60150L2806Q34548o8065k31530
$$ 1224768 1252559 1336233 1275807 1657968 1831365 2491515 2524321 3358869 3290804 3059274
10970C059274n979M25256n18472L54010p84894l81276l39438j76443p1995j84421
$$ 3059274 3053295 3478551 2960079 3314089 2529195 2147919 1808481 1632038 1560043 1375622
10960A375622r8930J3341l92668M54638o4295J07272j02961l19489l50696k9992
$$ 1375622 1276692 1290033 897365 1352003 1287708 1394980 1292019 972530 621834 591842
10950E91842K0950P8462B13250K2997J33485j78116J29109j00437b3941A64473
$$ 591842 612792 691254 213250 236247 369732 191616 320725 220288 -23941 164473
10939A54693m8805j4885a00411A19050J48757f6793A24626R4376H1739N4756k4255
$$ 154693 105888 91003 -100411 119050 267807 -66793 124626 219002 81739 136495 112240
10928A12240Q911A3801J14634d0823I5666b7447j3728C67535f8169F4078L8127
$$ 112240 121151 13801 128435 -40823 95666 -27447 -41175 367535 -68169 64078 102205
10917A02205L1059i2520p9129M0035A10966a2189A29589B3560h7773B5894g7719
$$ 102205 133264 -92520 -171649 -131614 110966 -12189 129589 23560 -87773 25894 -77719
10905B4172K0909c8147H1256a53942d9638l4603a0524j74938d1908l21071A78804
$$ 24172 45081 -38147 81256 -153942 -49638 -84241 -10524 -185462 -41908 -362979 178804
10893d6654r4477I9533J44057o4046b12732j32094J14728l40731a06577A6484
$$ -46654 -141131 99533 243590 179544 -212732 -344826 -230098 -570829 -106577 16484
10882h4963A05465R2781a05636L8499K6343n9564r8336B1008b4682E0415c1029
$$ -84963 105465 198246 -105636 -67137 -40794 -100358 -198694 21008 -24682 50415 -31029
10870A56584L26543a14373C6935o360J84538r7506a40982A62806G3053J18314
$$ 156584 483127 -114373 36935 30575 215113 117607 -140982 162806 73053 191367
10860A91367B7881c3232J3754D3244h5521j8578M4006E9557J69213A3444M1625
$$ 191367 27881 -33232 -19478 43244 -85521 -104099 -60093 59557 228770 13444 55069
10849E5069J66891r6033d9528B01528b6579A70515K3207a80082g316k21063B69239
$$ 55069 221960 125927 -49528 201528 -26579 170515 193722 -180082 -7316 -228379 269239
10837C66736A54862b24673A30567k1023a59138A12438j7670a44851A19918J86326
$$ 366736 154862 -224673 130567 109544 -159138 112438 94768 -144851 119918 306244
10827C06244d1216l05387r7664A59302a03911f741A52977B7859P9950c1775o9655
$$ 306244 -41216 -346603 -444267 159302 -103911 -6741 152977 27859 107809 -31775 -101430
10816a01430C28547G2544a18903a5635k03952A33660a36088e7511j06986A29974
$$ -101430 328547 72544 -118903 -15635 -219587 133660 -136088 -57511 -164497 129974
10805a35911k00192B97600b8730A27652M5435E4640K67628E5241c4222D117b92676
$$ -135911 -336103 297600 -28730 127652 173087 54640 322268 55241 -34222 4117 -292676
10793b00411D5400e07179J94060d2416C6531b86528J21149F9309b32378A20437
$$ -200411 45400 -507179 -313119 -42416 36531 -286528 -165379 69309 -232378 120437
10782i280k93649a45934F4822J38553q5632K9499J53080b07852R8096D2224c6978
$$ -9280 -302929 -145934 64822 203375 117743 147242 300322 -207852 -109756 42224 -36978
10770D1106J74646J39651h5233C4508b57447a15794B40574a61252e1535o0960
$$ 41106 215752 355403 -85233 34508 -257447 -115794 240574 -161252 -51535 -112495
10760a12495q7931D6491b06592A39205N2287d54079i0884j1315p261E0134h286
$$ -112495 -200426 46491 -206592 139205 191492 -454079 -90884 -102199 -109460 50134 -8286
10748b0692l37179J31849C07252a84725A85676b03395j25879J09792B6588a12955
$$ -20692 -357871 -226022 307252 -184725 185676 -203395 -329274 -219482 26588 -112955
10737C34524c33536D8498b0472k15226F5316M018b12110f2321c0366A25552h5592
$$ 334524 -333536 48498 -20472 -235698 65316 69334 -212110 -62321 -30366 125552 -85592
10725A46912b96932A76436d07104A59719L1540b79519b9951j71305B11268a33835
$$ 146912 -296932 176436 -407104 159719 191259 -279519 -29951 -201256 211268 -133835
10714i3621A28264b02170a8033Q657B11134a56090A5883h0801p2422j11673G1572
$$ -93621 128264 -202170 -18033 -9376 211134 -156090 15883 -80801 -153223 -264896 71572
10702d9571j70527a7951E23356I4720m1589F754b14971H843a13206J0636D7118
$$ -49571 -220098 -17951 523356 94720 53131 6754 -214971 8843 -113206 -102570 47118
10690C0574a36723j09118L4783e1573o8049l4404M5844j85907J39603f4482j06663
$$ 30574 -136723 -245841 -211058 -51573 -119622 -154026 -108182 -294089 -154486 -64482 -171145
10679a71145N4513K6443F2779N0195D0185h1642K816a4925A7063i2057O25j81714
$$ -171145 -116632 -90189 62779 112974 40185 -81642 -78826 -14925 17063 -92057 -91432 -273146
10667b73146b9336k57245Q1360L7469B623L3535b210j18564A15394a28596p9931
$$ -273146 -29336 -286581 -205221 -167752 2623 36158 -2210 -120774 115394 -128596 -208527
10656b08527I3044b7582a2126E3738F914b71316J32362M6755K7944j41905h3544
$$ -208527 93044 -27582 -12126 53738 6914 -271316 -138954 -92199 -64255 -206160 -83544
10644b03226A4997M4295d67143a29066c8400l380j33111B29961c01653a03977
$$ -203226 14997 59292 -467143 -129066 -38400 -41780 -174891 229961 -301653 -103977
10633b8728j79229P3050a9730A00748d4407E6251e58l61150F7995a48780f8902
$$ -28728 -207957 -134907 -19730 100748 -44407 56251 -558 -361708 67995 -148780 -68902
10621c00899h4349C5216a03939L0858B27707D1042J07026M3596m2851A6553a8416
$$ -300899 -84349 35216 -103939 -73081 227707 41042 148068 191664 148813 16553 -18416
10609a52964C17463H7105a51462l302H9508J23719E0735b92503a7175j53274A99599
$$ -152964 317463 87105 -151462 -154764 89508 213227 50735 -292503 -17175 -170449 199599
10597a21787d5579A169J74473B4573a08059k7100p3561O1544g752j65871F3071
$$ -121787 -45579 1169 175642 24573 -108059 -135159 -208720 -147176 -7752 -173623 63071
10585A6533K88700d0724j92051J14698K0626p517M7325j22771O0195N0383E4332
$$ 16533 305233 -40724 -232775 -118077 -97451 -104968 -57643 -180414 -120219 -69836 54332
10573c58187B016b02616k93965G2773J73554f36m05321D1603b46699B03917l0610
$$ -358187 2016 -202616 -496581 72773 246327 -636 -405957 41603 -246699 203917 173307
10562A73307h2189b3250k13554H3261L8464J72116A09176A5247i3421k17414a47373
$$ 173307 -82189 -23250 -236804 83261 121725 293841 109176 15247 -93421 -310835 -147373
10550e689j74932o244A67561c682C2669K09376a35110j01414d9303A79594d4665
$$ -5689 -180621 -186865 167561 -3682 32669 242045 -135110 -236524 -49303 179594 -44665
10538b15533a0412A75535J24804B5863g0130q2914d9372m772r5504G6928b07456
$$ -215533 -10412 175535 300339 25863 -70130 -153044 -49372 -54144 -149648 76928 -207456
10526b38375b8645N505F7743L4782a23738d2470F4156b998B06880H971a28387
$$ -238375 -28645 -23140 67743 102525 -123738 -42470 64156 -2998 206880 8971 -128387
10514A16494J01186j01465g0409B88144a7361B33091b66990a15150A40019a14460
$$ 116494 217680 116215 -70409 288144 -17361 233091 -266990 -115150 140019 -114460
10503d33417B21869m4667a28304m070L3893r576J7376i361A11363e3841m6060
$$ -433417 221869 177202 -128304 -132374 -98481 -108057 -90681 -9361 111363 -53841 -99901
10492i9901k15455a42821A14652J06453e5216l2979a656G9123b21620Q8239A04546
$$ -99901 -315356 -142821 114652 221105 -55216 -88195 -1656 79123 -221620 -133381 104546
10480D28570k08572J81019j21149c1428D24810A86275b70439A27910a18659k43127
$$ 428570 219998 401017 279868 -31428 424810 186275 -270439 127910 -118659 -361786
10470c61786A89529a57955m3157j91998A81025E6848a90866H4120b16880B01549
$$ -361786 189529 -157955 -201112 -393110 181025 56848 -190866 84120 -216880 201549
10459a10017C26443a67232A70596a18396A91711b64755Q7679P5214B56035j24948
$$ -110017 326443 -167232 170596 -118396 191711 -264755 -177076 -101862 256035 131087
10449A31087a32929J695A47183q464b17058D04149A25861J9128b09946B77466
$$ 131087 -132929 -131234 147183 138719 -217058 404149 125861 144989 -209946 277466
10438h3624k586j61645d439j28184A66850i89A77587B5179a5147H9594J0007N5789
$$ -83624 -86210 -247855 -4439 -132623 166850 -989 177587 25179 -15147 89594 99601 155390
10426A55390C4693e9339O404F4248b35674A33852a04026B5508c03506f3113q1499
$$ 155390 34693 -59339 -52935 64248 -235674 133852 -104026 25508 -303506 -63113 -144612
10415a44612D7522b41434J18812K0381B03139b57562e7922J9652j84573j63005
$$ -144612 47522 -241434 -122622 -102241 203139 -257562 -57922 -38270 -222843 -385848
10405c85848D46003A06826a6772C30897H7027O5204A145K17340e2964C49819e6804
$$ -385848 446003 106826 -16772 330897 87027 152231 1145 218485 -52964 349819 -56804
10393A38650J2361A1072J75909L8787f6123E30466j42895j50535O7486L9510A14064
$$ 138650 151011 11072 186981 225768 -66123 530466 387571 237036 304522 344032 114064
10381A56631F8950A3585f9591D65792A95171J24314H8575J06499B288J86415O4110
$$ 156631 68950 13585 -69591 465792 195171 319485 88575 195074 2288 188703 252813
10370B52813l9430J05868P9403M53235m01627J67377j29973j89533L19711j7333
$$ 252813 213383 319251 398654 851889 450262 617639 487666 298133 617844 600511
10360F00511H6124N9210R8736I0184M42505J0394A84258O3528R0407j135L97377
$$ 600511 86124 145334 244070 90184 532689 543083 184258 247786 338193 337058 734435
10349G34435j72431k20702o0539o6864q2864F5307j1624R8057O4300K30401A48656
$$ 734435 562004 341302 280763 213899 131035 65307 53683 151740 216040 446441 148656
10337a99917A98659M9625A0593K45065F9537J08328K5857k6033b9428C09230j32103
$$ -199917 198659 248284 10593 255658 69537 177865 203722 177689 -29428 309230 177127
10326A77127a18744M1478p198A60655K2637A7759J032J01393i4444C36567C5063
$$ 177127 -118744 -77266 -84464 160655 183292 17759 18791 120184 -94444 336567 35063
10314E3467M8594J22261b1328B462c167F5904c16454a40304d8064A01877b1373
$$ 53467 102061 224322 -21328 2462 -3167 65904 -316454 -140304 -48064 101877 -21373
10302B23682I8248a83872l8031i3884A94534r3067O1463p2014b4959B8401a836
$$ 223682 98248 -183872 -221903 -93884 194534 101467 162930 90916 -24959 28401 -1836
10290A54475K3584J18212a97573e3509k43554c1908B54978d6909l31864H0980
$$ 154475 178059 296271 -197573 -53509 -297063 -31908 254978 -46909 -378773 80980
10279d99539D2043d2421o5295F26809A54470a83502B02005D2262h9942n4242G6067
$$ -499539 42043 -42421 -107716 626809 154470 -183502 202005 42262 -89942 -144184 76067
10267c41946J70467r1272A78458a59364B73476a69482B56064r4458L78334A48371
$$ -341946 -171479 -262751 178458 -159364 273476 -169482 256064 161606 539940 148371
10256E5157d273A13044m7444g5911r7809B9581Q4313h0811A9522a86251A42122
$$ 55157 -4273 113044 65600 -75911 -173720 29581 113894 -80811 19522 -186251 142122
10244a30124j79572P9757D7734J9462L6283m4461J8814c10700I3790i7774E5342
$$ -130124 -309696 -229939 47734 67196 103479 59018 77832 -310700 93790 -97774 55342
10232i977c577k36421N417N5396B87406r5281a01238q2848P8648q3780P238n218
$$ -9977 -3577 -239998 -234581 -179185 287406 192125 -101238 -184086 -105438 -189218 -181980 -187198
10220a87198A22238a81423a9630l57185B41394a75415J9621k58742a66316b647
$$ -187198 122238 -181423 -19630 -376815 241394 -175415 -155794 -414536 -166316 -2647
10209H4474b55836E0475b70398J7824c2516A65554C3587O024M4742c1567P520
$$ 84474 -255836 50475 -270398 -252574 -32516 165554 33587 39611 84353 -31567 -24047
10198b4047A76419D3230h2664k0984j89397B97863a12410n964j09763f8272j64373
$$ -24047 176419 43230 -82664 -103648 -293045 297863 -112410 -118374 -228137 -68272 -232645
10187b32645k35072A0547a40533B52573E0495L9568b75376F1676a95072j8918
$$ -232645 -467717 10547 -140533 252573 50495 90063 -275376 61676 -195072 -213990
10177b13990E8497e3944j70084c6995j09002N7247C9627K2284a34861m29634A07891
$$ -213990 58497 -53944 -224028 -36995 -145997 -88750 39627 61911 -134861 -564495 107891
10165e2671k95568E2443D430d91089a90436C03512e2804j65472F5371c17483A8836
$$ -52671 -348239 52443 4430 -491089 -190436 303512 -52804 -218276 65371 -317483 18836
10153A68383Q6873a00015F4053c6938j24718j25980j49095c8918D0192a73913
$$ 168383 255256 -100015 64053 -36938 -161656 -287636 -436731 -38918 40192 -173913
10142A88070D9799c5656k21712B29583a71418M3004D2914A9765q626a49018b5551
$$ 188070 49799 -35656 -257368 229583 -171418 -128414 42914 19765 11139 -149018 -25551
10130a69880A42842h1709p8007I0411J5590Q7720A4857P9268a55421j3364O4433
$$ -169880 142842 -81709 -159716 90411 106001 193721 14857 94125 -155421 -168785 -104352
10119a04352m34287B56556a22328K371G29L66249b05540A9084c2384m2238p3340
$$ -104352 -538639 256556 -122328 -119957 729 366978 -205540 19084 -32384 -74622 -147962
10108a47962D9908g9748C0721N574a97260e1469E2411J42390a73199I8917o286
$$ -147962 49908 -79748 30721 36295 -197260 -51469 52411 194801 -173199 98917 92631
10097I2631b38632d2207j67423P3742l04169A34966M4705a17211A69137E5952
$$ 92631 -238632 -42207 -209630 -135888 -440057 134966 179671 -117211 169137 55952
10086d6054C9085J2228a90453O9179k70748a7119G6581d9413j09561B2094a08900
$$ -46054 39085 51313 -190453 -121274 -392022 -17119 76581 -49413 -158974 22094 -108900
10074a52915c122A61414b69765F965Q9660J31245l3161a10016k3458D0886B855
$$ -152915 -3122 161414 -269765 6965 96625 227870 194709 -110016 -133474 40886 2855
10062a07413c0280B54571C5429c63170J12503J01799e7539k63689a19770j02772
$$ -107413 -30280 254571 35429 -363170 -250667 -148868 -57539 -321228 -119770 -222542
10052b22542B75669b29473d6368m3398k472O73l3994M1356n639A32980O9362f6270
$$ -222542 275669 -229473 -46368 -89766 -92238 -91565 -125559 -84203 -89842 132980 202342 -66270
10039A09056E734P5293a23937A9945a81478h4513j66617B9033b56992B09313F1232
$$ 109056 5734 81027 -123937 19945 -181478 -84513 -251130 29033 -256992 209313 61232
10027e4933l7630K5131A57856c51748a74386h6742c6488G7397d0266A18528M4589
$$ -54933 -92563 -67432 157856 -351748 -174386 -86742 -36488 77397 -40266 118528 163117
10016A63117E4052a75601D9729b95463P4188f7624A04532K1782e68923e8039j8884
$$ 163117 54052 -175601 49729 -295463 -221275 -67624 104532 126314 -568923 -58039 -76923
10005g6923F7384a65032C62288i4990A40000a70818j24210M8660m05404b48169
$$ -76923 67384 -165032 362288 -94990 140000 -170818 -295028 -246368 -651772 -248169
9994A28749a81370L0802A00628b29823c7119m682k27396B98163b0693j19617E1968
$$ 128749 -181370 -150568 100628 -229823 -37119 -41801 -269197 298163 -20693 -140310 51968
9982E882J7805N8209B3231L20055a66023j51878i6534E0644K834b15540B32961
$$ 5882 23687 81896 23231 343286 -166023 -317901 -96534 50644 53478 -215540 232961
9970a95282b8529A84483p1735m2587a63628q4670j91582i8399m6312A69674K31570
$$ -195282 -28529 184483 112748 70161 -163628 -248298 -439880 -98399 -144711 169674 401244
9959D01244A4321a7122f761j3989F5117b78386I0810a56354k60332e2084A04692
$$ 401244 14321 -17122 -6761 -20750 65117 -278386 90810 -156354 -416686 -52084 104692
9947A67653a30083G040i5852A22141a82447j33965F8659d458l23474C48695j67408
$$ 167653 -130083 7040 -95852 122141 -182447 -316412 68659 -4458 -327932 348695 181287
9936A81287b83486B77132i0394j99623J5407A25864a32728A27110b00853l4071
$$ 181287 -283486 277132 -90394 -290017 -274610 125864 -132728 127110 -200853 -234924
9926b34924L6153n4252B07121F4186P948a42282J09H8000c11082a32076D32733
$$ -234924 -198771 -253023 207121 64186 72134 -142282 -142173 88000 -311082 -132076 432733
9914b91698J08704M1078k594D64006a08341r1836h2293l3193j66539i6663A78716
$$ -291698 -182994 -141916 -144510 464006 -108341 -200177 -82293 -115486 -282025 -96663 178716
9902a40569f9233k06337C03859f8787a6181G3607g4192k16421D16303b46647Q8539
$$ -140569 -69233 -275570 303859 -68787 -16181 73607 -74192 -290613 416303 -246647 -158108
9891a58108O6312B4715b12859R070I6198d17133H5996d3918l59339h1430m6236
$$ -158108 -91796 24715 -212859 -203789 96198 -417133 85996 -43918 -403257 -81430 -127666
9880a27666M6744j17116B04228I4539B6365O0798b1429k37431Q8865O3685K4162
$$ -127666 -80922 -198038 204228 94539 26365 87163 -21429 -258860 -169995 -106310 -82148
9869h2148D1599L63b08639f7235A05179e7930o2418m1054a6564A5776K31029b44503
$$ -82148 41599 41962 -208639 -67235 105179 -57930 -120348 -161402 -16564 15776 246805 -244503
9856A69072a31021N3079j22119K6785j27944E0310N1346J63664a20657f0296C2248
$$ 169072 -131021 -77942 -200061 -173276 -301220 50310 101656 265320 -120657 -60296 32248
9844e19478C4439i8555A93673f4647j27720i1929o1224f3326A12271F473K7070
$$ -519478 34439 -98555 193673 -64647 -192367 -91929 -153153 -63326 112271 6473 33543
9833C3543c6485k28270c9810A48539e30093d7783A33493m0098c39917A55623a13310
$$ 33543 -36485 -264755 -39810 148539 -530093 -47783 133493 93395 -339917 155623 -113310
9821a12703O071a3801F2354h4728A46215a44200j3086b2387A1823f404p430B28071
$$ -112703 -106632 -13801 62354 -84728 146215 -144200 -157286 -22387 11823 -6404 -13834 228071
9808C5943L0326b16960R6002l21344b1982j34337o1534H1641a41074j82734d3791
$$ 35943 66269 -216960 -120958 -442302 -21982 -156319 -217853 81641 -141074 -323808 -43791
9796F637a24476D7322d4435l6580j69530N9767h3213m269p6736d8881j21096p5144
$$ 6637 -124476 47322 -44435 -81015 -250545 -190778 -83213 -87482 -164218 -48881 -169977 -245121
9784b45121j29077F7977c57728a19323j20578A16432i4810G7009A5718b87379
$$ -245121 -374198 67977 -357728 -119323 -239901 116432 -94810 77009 15718 -287379
9773b21649d378n9905C336c24429I016R0741E118b23301h6701k10920B57752c94890
$$ -221649 -4378 -64283 3336 -324429 9016 99757 5118 -223301 -86701 -297621 257752 -394890
9760C43124e547o3441A13835h6060G6394a78560d8819l17022A3449b00096j11618
$$ 343124 -5547 -68988 113835 -86060 76394 -178560 -48819 -365841 13449 -200096 -311714
9749c11714H9873e7673B167a59825K9964B04979b1066j71084e0242j95485B22801
$$ -311714 89873 -57673 2167 -159825 -129861 204979 -21066 -192150 -50242 -245727 222801
9737a49583K4965G5010L04428D3214A5915Q4617a70551l20847A74929d820k25602
$$ -149583 -124618 75010 379438 43214 15915 100532 -170551 -491398 174929 -4820 -230422
9726b30422I5081a79744n4026j67876A53602P4677e1660B63263i1755k11800A71036
$$ -230422 95081 -179744 -233770 -401646 153602 228279 -51660 263263 -91755 -303555 171036
9714a32362B27090A07047a66425F5115O6170b35738M7487b893a395k90235I8537
$$ -132362 227090 107047 -166425 65115 131285 -235738 -188251 -2893 -1395 -291630 98537
9702A69031i0644k11911A52805d00212c2867I640J26670d97521b41937a11669
$$ 169031 -90644 -302555 152805 -400212 -32867 9640 136310 -497521 -241937 -111669
9691h3265E3461b56625c4945j74707C5335K31341D7235g8197K2509A15836i2869
$$ -83265 53461 -256625 -34945 -209652 35335 266676 47235 -78197 -55688 115836 -92869
9679H213l750c17812A85289p9826b0156H1829b13514h5688n3633K5708H9879d3400
$$ 8213 4463 -317812 185289 105463 -20156 81829 -213514 -85688 -139321 -113613 89879 -43400
9666I0099O8836B44b2168l34828J32483f7189j50740J07100B03800a6101k2206
$$ 90099 158935 244 -22168 -356996 -224513 -67189 -217929 -110829 203800 -16101 -38307
9655c8307p9885L8979K3768a4170D0407M9580N325a87123d1828B10807I6990d5327
$$ -38307 -118192 -79213 -55445 -14170 40407 89987 95312 -187123 -41828 210807 96990 -45327
9642B53482B8777K9375j1746b05336l2970R9852B3862a5355B12117a5431j90686
$$ 253482 28777 58152 46406 -205336 -238306 -138454 23862 -15355 212117 -15431 -206117
9631b06117a2000k19519b1543k9538D4645k286c06098e9964n9344J0514a0578
$$ -206117 -12000 -231519 -21543 -51081 44645 42359 -306098 -59964 -119308 -108794 -10578
9619f5757A97924b58326c2528k17858m0124f5972c0253q1323k3427A60190K590
$$ -65757 197924 -258326 -32528 -250386 -290510 -65972 -30253 -111576 -135003 160190 162780
9608A62780d5989H4868a76566r9288H7211c51223J42680B32579a24721d9313l60272
$$ 162780 -45989 84868 -176566 -275854 87211 -351223 -208543 232579 -124721 -49313 -409585
9597d09585c3165D1479c56970B78608a39878D9383a1823j96844L0953A5893L93743
$$ -409585 -33165 41479 -356970 278608 -139878 49383 -11823 -208667 -177714 15893 409636
9586D09636D6912c2063k72600D975c05532A15437b54870E8543c27535A74105a5766
$$ 409636 46912 -32063 -304663 4975 -305532 115437 -254870 58543 -327535 174105 -15766
9574c1838k98420J41658A91937a17832j8079j83304A9535J08806F2726a17956
$$ -31838 -330258 -188600 191937 -117832 -135911 -319215 19535 128341 62726 -117956
9563a48187L6565B865b07654R7618H5627M9599b44661B87209a8881H1457C0195
$$ -148187 -111622 2865 -207654 -110036 85627 135226 -244661 287209 -18881 81457 30195
9551d8731F1207a64152O3903B98457F608a42197A58959c9581j5694J0485B46799
$$ -48731 61207 -164152 -100249 298457 6608 -142197 158959 -39581 -55275 -44790 246799
9539d7969l59960i6755K4464l22957a19862r4827R3887q1602j04814A70050b04461
$$ -47969 -407929 -96755 -72291 -395248 -119862 -214689 -120802 -202404 -307218 170050 -204461
9527a51982q9493q6391o8348N6364d9680j53985B6116a10298a1255A25672h6086
$$ -151982 -241475 -327866 -396214 -339850 -49680 -203665 26116 -110298 -11255 125672 -86086
9515A83476H1550O8670c3129A17316h947A45205a24712j1185A61279c01050B01604
$$ 183476 81550 150220 -33129 117316 -8947 145205 -124712 -135897 161279 -301050 201604
9503E1718J92820f2335r5698L5559p0248a3923m8527m9360D3589M5499f1764j7393
$$ 51718 244538 -62335 -158033 -122474 -192722 -13923 -62450 -111810 43589 89088 -61764 -79157
9491g9157m2118I9761A4479K21221I6416M0201C4163A5307N3168K530i7608D8696
$$ -79157 -121275 99761 14479 235700 96416 136617 34163 15307 68475 71005 -97608 48696
9478a1780j26945F6524c16149O1062F5037a10819A08662J1424D9197c7362a366
$$ -11780 -138725 66524 -316149 -255087 65037 -110819 108662 120086 49197 -37362 -1366
9466c11881p3941e3086m10187i3334j30020L5233G9659a22425n4275F126a13413
$$ -311881 -385822 -53086 -463273 -93334 -223354 -188121 79659 -122425 -176700 6126 -113413
9454a977E5976c66140c0336j44564p9868i4112a8866j87068f0679j80069A36956
$$ -1977 55976 -366140 -30336 -174900 -254768 -94112 -18866 -205934 -60679 -240748 136956
9442c18216A62523O5891a73853e7003b5344B66300E9846A5268J20127j8063b8464
$$ -318216 162523 228414 -173853 -57003 -25344 266300 59846 15268 135395 117332 -28464
9430b26154G3529b13654F7133c55632J73453e6367k8283j54884I2104A1349b98545
$$ -226154 73529 -213654 67133 -355632 -182179 -56367 -84650 -239534 92104 11349 -298545
9418B5943Q3456c22829c7772m7230F2306a71531B27830b67752N2533h4042m5930
$$ 25943 109399 -322829 -37772 -85002 62306 -171531 227830 -267752 -215219 -84042 -129972
9407a29972C13339a72310B27008I678R8760b40275b7524j11936o2799C02704a71708
$$ -129972 313339 -172310 227008 9678 108438 -240275 -27524 -139460 -202259 302704 -171708
9395a63563g5995m7873o821r0396M5090C2085f217n3776A34825c1744q9547n9671
$$ -163563 -75995 -123868 -130689 -221085 -175995 32085 -6217 -59993 134825 -31744 -121291 -180962
9383a80962f8478A61890e9658a9154k53241a13823H3935a11465A87942l976h3028
$$ -180962 -68478 161890 -59658 -19154 -272395 -113823 83935 -111465 187942 183966 -83028
9371a48580k5657o0511i0197a1737k19760O0217f944k47289j09659a65864B64513
$$ -148580 -174237 -234748 -90197 -11737 -231497 -171280 -6944 -254233 -363892 -165864 264513
9359B4380K0305b24705C6786Q8210a48933e2342m2392A48545d611j73702A34352
$$ 24380 44685 -224705 36786 124996 -148933 -52342 -94734 148545 -4611 -178313 134352
9347g2846A09111h0547B61809k3076a37686N4560m7010O4784a0430j43107F3718
$$ -72846 109111 -80547 261809 238733 -137686 -83126 -130136 -65352 -10430 -153537 63718
9335A55393b54290b9249l37818d8680k43297p3165H5711e4142A54304N3720c8358
$$ 155393 -254290 -29249 -367067 -48680 -291977 -365142 85711 -54142 154304 208024 -38358
9323b29495M8974M8081E3431L1509f9188l715G6150J96286h5524a9560A62395
$$ -229495 -180521 -132440 53431 84940 -69188 -72903 76150 272436 -85524 -19560 162395
9311i9726a4517G5270e2515j03623J8635M2875j25632h813k6409A4064L4297e8151
$$ -99726 -14517 75270 -52515 -156138 -137503 -94628 -220260 -8813 -35222 14064 48361 -58151
9298B7502M4946c06541g128B50512h3118j49160a13145l8233M1621G8871a26507
$$ 27502 72448 -306541 -7128 250512 -83118 -232278 -113145 -151378 -109757 78871 -126507
9286b36678B76197h6369q6969a6676j39375B9861b39982O3375k22824c0759m6186
$$ -236678 276197 -86369 -173338 -16676 -156051 29861 -239982 -176607 -399431 -30759 -76945
9275g6945I0905D4359b31195C8573a69633h3003B97336a12139A59853b56224h6704
$$ -76945 90905 44359 -231195 38573 -169633 -83003 297336 -112139 159853 -256224 -86704
9263b79549N9029A20129J0419K1659a28276e6265j43262P0919A17678c3958q1508
$$ -279549 -220520 120129 130548 152207 -128276 -56265 -199527 -128608 117678 -33958 -115466
9252a15466k7350j30187E5051P3340J0553R9682A2603b10407K5283D480a12437
$$ -115466 -142816 -273003 55051 128391 138944 238626 12603 -210407 -185124 4480 -112437
9240f4672k7307j71289d4912l52711f4310k07899A49935Q2816a99718A46365P0237
$$ -64672 -91979 -263268 -44912 -397623 -64310 -272209 149935 232751 -199718 146365 216602
9229B16602M8462D0565c5945j9199E3106J92006B7030c13541N5780k1469F4405
$$ 216602 265064 40565 -35945 -55144 53106 245112 27030 -313541 -257761 -279230 64405
9217a11216j22144f819A45101c0168k76231h649q2507j44198B88943A02765b52848
$$ -111216 -233360 -6819 145101 -30168 -306399 -8649 -91156 -235354 288943 102765 -252848
9205h5613b7308a2422C258c52687A65406a28740n5642A86667i2289B16032a08955
$$ -85613 -27308 -12422 3258 -352687 165406 -128740 -184382 186667 -92289 216032 -108955
9193B52332c45075H0886L8375c3421k41065C5666K0031e04425a05499n4361R422
$$ 252332 -345075 80886 119261 -33421 -274486 35666 55697 -504425 -105499 -159860 -150438
9182a50438F7942b40141O4269A38164b3702o316j65165N5139B9694b20562B52761
$$ -150438 67942 -240141 -175872 138164 -23702 -30018 -195183 -140044 29694 -220562 252761
9170B437R9204a92738B46045a51545E3380h5672a9182C9987b85599K4967A21933
$$ 2437 101641 -192738 246045 -151545 53380 -85672 -19182 39987 -285599 -260632 121933
9158b4050K68q6362B02647C05a65745k2605B138a85769A03010m6860L7519a74483
$$ -24050 -23782 -110144 202647 305 -165745 -188350 2138 -185769 103010 56150 93669 -174483
9145c99458A07032e15253J71294B39917d6813A51426g0016h457A87617a36196
$$ -399458 107032 -515253 -343959 239917 -46813 151426 -70016 -8457 187617 -136196
9134g3846q7810p5661K0612A45454A2382c10986C04967A02441i0580k17093F7051
$$ -73846 -161656 -237317 -216705 145454 12382 -310986 304967 102441 -90580 -307673 67051
9122D604b39954g8176j84719A3445b31567j53263D6945a70052b7815k5044j26290
$$ 4604 -239954 -78176 -262895 13445 -231567 -384830 46945 -170052 -27815 -52859 -179149
9111a79149F7898b38644B58092a23291e3529G7487M7813c4331q676J5637j21581
$$ -179149 67898 -238644 258092 -123291 -53529 77487 125300 -34331 -43007 -27370 -148951
9100a48951L5293j04727B4066a59828L3546j02810i7024j05468e151r0752r7906
$$ -148951 -113658 -218385 24066 -159828 -126282 -229092 -97024 -202492 -5151 -95903 -193809
9089a93809a7590k96169A68233A0761O0575b19079G7622H003h6640K6509o9491
$$ -193809 -17590 -313759 168233 10761 71336 -219079 77622 8003 -86640 -60131 -129622
9078a29622c8424D97b27653C48660a87218j99137a4543B9237b22063A40749a18057
$$ -129622 -38424 497 -227653 348660 -187218 -386355 -14543 29237 -222063 140749 -118057
9066b22894j472J1403g508k42009P6089Q6281k10870M0725I8105b05978D7776
$$ -222894 -224366 -212963 -7508 -249517 -173428 -87147 -298017 -257292 98105 -205978 47776
9054f9726k09192j0586L7155m5635a9248b785j34068N0702A69493b81918A96436
$$ -69726 -278918 -289504 -252349 -297984 -19248 -2785 -136853 -86151 169493 -281918 196436
9042A02221L8441a01921L1685D8670O1389K63925a85356r7058j45320h4924E9956
$$ 102221 140662 -101921 -70236 48670 110059 373984 -185356 -282414 -427734 -84924 59956
9030d4152r3403A03760e4114j34827A27408c06715a8728o9517A20677M03595a5720
$$ -44152 -137555 103760 -54114 -188941 127408 -306715 -18728 -88245 120677 524272 -15720
9018b27188B19705H7294m2735a41234O8134n1210k233d9021A29397E2912a17142
$$ -227188 219705 87294 44559 -141234 -73100 -124310 -126543 -49021 129397 52912 -117142
9006d8110r3164l2221k47059a02512G2825b25300B4455J66455a9135j89995d8419
$$ -48110 -141274 -173495 -420554 -102512 72825 -225300 24455 190910 -19135 -209130 -48419
8994A84699i9461F4707b42759C29448A43741R815H531P9636a28389j56741g8603
$$ 184699 -99461 64707 -242759 329448 143741 153556 8531 88167 -128389 -285130 -78603
8982c19084A5380a37487D9805b16982E8829a75103M7087l12862b02053B31152
$$ -319084 15380 -137487 49805 -216982 58829 -175103 -128016 -440878 -202053 231152
8971a10989j48228P7583A74366a9934A18987E2847e7102j62232K2080h6943j48051
$$ -110989 -259217 -181634 174366 -19934 118987 52847 -57102 -219334 -197254 -86943 -234994
8960b34994N4499D3691b78126G1241b37713j29870e3968H2784B8151L15843a7620
$$ -234994 -180495 43691 -278126 71241 -237713 -367583 -53968 82784 28151 343994 -17620
8948c6971C3506i0663A08537Q4103a75574L4595A57774D8062K39910a05006A30924
$$ -36971 33506 -90663 108537 192640 -175574 -140979 157774 48062 287972 -105006 130924
8936a81049p037B1626J82444A5172c72694a72617P7238b5704j65812B52517b08552
$$ -181049 -188086 21626 204070 15172 -372694 -172617 -95379 -25704 -191516 252517 -208552
8924A92249b9827H1474J199191n4542D32794I2343J93087q6446m4602c20879A87508
$$ 192249 -29827 81474 1280665 1226123 432794 92343 285430 198984 154382 -320879 187508
8912H1771h0241k51945B20015h0009l0186M0253A03060f287A7125c09900D522
$$ 81771 -80241 -332186 220015 -80009 -110195 -69942 103060 -6287 17125 -309900 4522
8900a93290b237m3852A85317b58845A11731b70228L9081p7464g6659B73829b28020
$$ -193290 -2237 -46089 185317 -258845 111731 -270228 -231147 -308611 -76659 273829 -228020
8888a688j96992H1654b49703a14256j86365G5901J7213A9549J85058j02142b00638
$$ -1688 -198680 81654 -249703 -114256 -300621 75901 93114 19549 204607 102465 -200638
8876a93904G5583c45996c4164j94125r7263J60520A3960K27778e2211q445A28151
$$ -193904 75583 -345996 -34164 -228289 -325552 -165032 13960 241738 -52211 -60656 128151
8864e2792j0716j11387O2946B26228a48293C8799a49240A07569M4284E3798J31640
$$ -52792 -63508 -174895 -111949 226228 -148293 38799 -149240 107569 151853 53798 185438
8853A85438a63050j18922a34017m09708A29982a45401A78841G6076J3001a42932
$$ 185438 -163050 -281972 -134017 -543725 129982 -145401 178841 76076 89077 -142932
$$ [...]
##END NTUPLES=NMR SPECTRUM
##END=
