##TITLE=AC1453_NESNAP272_7818805_155McSOorp
##JCAMPDX= 6.0         $$ Bruker NMR JCAMP-DX V2.0
##DATA TYPE= NMR SPECTRUM
##DATA CLASS= NTUPLES
##ORIGIN= BRUKER
##OWNER= Administrator
$$ 1.72 TOPSPIN		Version 2.1
$$ 2013-04-30 18:22:33.605 -0700  Administrator@X
$$ Compression mode = diff/dup
##.OBSERVE FREQUENCY= 400.02188249412
##.OBSERVE NUCLEUS= ^1H
##.ACQUISITION MODE= SIMULTANEOUS (DQD)
##.ACQUISITION SCHEME= undefined
##.AVERAGES= 64
##.DIGITISER RES= 22
##SPECTROMETER/DATA SYSTEM= spect
##.PULSE SEQUENCE= noesygpps1d.comp
##.SOLVENT NAME= COFFEE_meoh
##.SHIFT REFERENCE= INTERNAL, COFFEE_meoh, 1, 14.9609
##AUDIT TRAIL= $$ (NUMBER, WHEN, WHO, WHERE, PROCESS, VERSION, WHAT)
$$ ##TITLE= Audit trail, TOPSPIN		Version 2.1
$$ ##JCAMPDX= 5.01
$$ ##ORIGIN= Bruker BioSpin GmbH
$$ ##OWNER= Administrator
$$ $$ E:\/data/COFFEE/nmr/AC1453_NESNAP272_7818805_155McSOorp/12/pdata/1/auditp.txt
$$ ##AUDIT TRAIL=  $$ (NUMBER, WHEN, WHO, WHERE, PROCESS, VERSION, WHAT)
(   1,<2013-04-30 18:22:28.715 -0700>,<Administrator>,<X>,<go>,<TOPSPIN 2.1>,
      <created by zg
	started at 2013-04-30 18:10:58.199 -0700,
	POWCHK enabled, PULCHK disabled,
       configuration hash MD5:
       F7 49 AB AC A2 8D 51 76 73 8D C1 9A A6 38 9F DE
       data hash MD5: 64K
       C5 75 61 DF 06 37 35 05 47 29 B2 D8 81 85 F1 99>)
(   2,<2013-04-30 18:22:31.652 -0700>,<Administrator>,<X>,<proc1d>,<TOPSPIN 2.1>,
      <Start of raw data processing
       efp LB = 0.3 FT_mod = 6 PKNL = 1 PHC0 = 0 PHC1 = 0 SI = 128K 
       data hash MD5: 128K
       BE A6 AB F9 00 91 4C D6 B5 86 0F 00 04 30 68 FD>)
(   3,<2013-04-30 18:22:32.574 -0700>,<Administrator>,<X>,<proc1d>,<TOPSPIN 2.1>,
      <pk PHC0 = -78.56323 PHC1 = 0 
       data hash MD5: 128K
       3B FC E9 A3 E1 42 07 98 98 A6 6E 81 E9 A9 27 DE>)
(   4,<2013-04-30 18:22:32.996 -0700>,<Administrator>,<X>,<proc1d>,<TOPSPIN 2.1>,
      <abs ABSG = 1 
       data hash MD5: 128K
       32 09 29 8B DA 12 64 DE 9F C9 F7 D4 12 0B A3 FD>)
(   5,<2013-04-30 18:22:33.105 -0700>,<Administrator>,<X>,<proc1d>,<TOPSPIN 2.1>,
      <abs ABSG = 2 
       data hash MD5: 128K
       E5 02 F3 6C EE 19 92 1B BF F9 6D F8 F8 8B A0 A3>)
(   6,<2013-04-30 18:22:33.199 -0700>,<Administrator>,<X>,<proc1d>,<TOPSPIN 2.1>,
      <abs ABSG = 3 
       data hash MD5: 128K
       C8 D6 16 AB 00 51 7F 81 B6 8C 67 B2 F9 EC 86 E6>)
(   7,<2013-04-30 18:22:33.309 -0700>,<Administrator>,<X>,<proc1d>,<TOPSPIN 2.1>,
      <abs ABSG = 4 
       data hash MD5: 128K
       83 26 78 31 0F 3A FE B9 A4 42 E5 89 27 48 9B 5B>)
(   8,<2013-04-30 18:22:33.418 -0700>,<Administrator>,<X>,<proc1d>,<TOPSPIN 2.1>,
      <abs ABSG = 5 
       data hash MD5: 128K
       8B 85 B9 03 9B 97 24 55 19 20 04 7D 9D DA AD EB>)
$$ ##END=
$$ 
$$ $$ hash MD5
$$ $$ 61 12 5B 99 4A 39 EA 66 67 20 88 FD 4E AA 0C DE
##$RELAX= 
##$RELAX= 
##$RELAX= 
##$RELAX= 
##$RELAX= 
##$RELAX= 
##$RELAX= 
##$RELAX= 
$$ Bruker specific parameters
$$ --------------------------
##$DU= <E:\>
##$EXPNO= 12
$$ [...]
150 150 150 150 150 150 150 150
##$TP07= 0
##$TPNAME0= <>
##$TPNAME1= <>
##$TPNAME2= <>
##$TPNAME3= <>
##$TPNAME4= <>
##$TPNAME5= <>
##$TPNAME6= <>
##$TPNAME7= <>
##$TPOAL= (0..7)
0.5 0.5 0.5 0.5 0.5 0.5 0.5 0.5
##$TPOFFS= (0..7)
0 0 0 0 0 0 0 0
##$TUNHIN= 0
##$TUNHOUT= 0
##$TUNXOUT= 0
##$USERA1= <user>
##$USERA2= <user>
##$USERA3= <user>
##$USERA4= <user>
##$USERA5= <user>
##$V9= 5
##$VALIST= <valist>
##$VCLIST= <CCCCCCCCCCCCCCC>
##$VD= 0
##$VDLIST= <DDDDDDDDDDDDDDD>
##$VPLIST= <PPPPPPPPPPPPPPP>
##$VTLIST= <TTTTTTTTTTTTTTT>
##$WBST= 1024
##$WBSW= 4
##$XGAIN= (0..3)
0 0 0 0
##$XL= 0
##$YL= 0
##$YMAX_a= 6185704
##$YMIN_a= -12920530
##$ZGOPTNS= <>
##$ZL1= 120
##$ZL2= 120
##$ZL3= 120
##$ZL4= 120
##$ABSF1= 14.9609
##$ABSF2= -5.597281
##$ABSG= 5
##$ABSL= 3
##$ALPHA= 0
##$AQORDER= 0
##$ASSFAC= 0
##$ASSFACI= 0
##$ASSFACX= 0
##$ASSWID= 0
##$AUNMP= <proc_prof1d_extract.lims>
##$AXLEFT= 0
##$AXNAME= <>
##$AXNUC= <1H>
##$AXRIGHT= 0
##$AXTYPE= 0
##$AXUNIT= <>
##$AZFE= 0.1
##$AZFW= 0.1
##$BCFW= 0
##$BC_mod= 0
##$BYTORDP= 0
##$COROFFS= 0
##$CY= 15
##$DATMOD= 1
##$DC= 0
##$DFILT= <>
##$DTYPP= 0
##$F1P= 0
##$F2P= 0
##$FCOR= 0.5
##$FTSIZE= 131072
##$FT_mod= 6
##$GAMMA= 0
##$GB= 0
##$INTBC= 1
##$INTSCL= 1
##$ISEN= 128
##$LB= 0.3
##$LEV0= 0
##$LPBIN= 0
##$MAXI= 10000
##$MC2= 0
##$MEAN= 0
##$ME_mod= 0
##$MI= 0
##$NCOEF= 0
##$NC_proc= -2
##$NLEV= 6
##$NOISF1= 0
##$NOISF2= 0
##$NSP= 0
##$NTH_PI= 0
##$NZP= 0
##$OFFSET= 14.9609
##$PC= 1
##$PHC0= -78.56323
##$PHC1= 0
##$PH_mod= 1
##$PKNL= yes
##$PPARMOD= 0
##$PPDIAG= 0
##$PPIPTYP= 0
##$PPMPNUM= 2147483647
##$PPRESOL= 1
##$PSCAL= 4
##$PSIGN= 0
##$PYNMP= <proc.py>
##$REVERSE= no
##$SF= 400.020009676438
##$SI= 131072
##$SIGF1= 0
##$SIGF2= 0
##$SINO= 400
##$SIOLD= 131072
##$SPECTYP= <>
##$SREGLST= <1H.CDCl3>
##$SSB= 0
##$STSI= 131072
##$STSR= 0
##$SW_p= 8223.68421052631
##$SYMM= 0
##$S_DEV= 0
##$TDeff= 65536
##$TDoff= 0
##$TI= <>
##$TILT= no
##$TM1= 0
##$TM2= 0
##$TOPLEV= 0
##$USERP1= <user>
##$USERP2= <user>
##$USERP3= <user>
##$USERP4= <user>
##$USERP5= <user>
##$WDW= 1
##$XDIM= 131072
##$YMAX_p= 426126163
##$YMIN_p= -11223
##$CURPLOT= <Network HP LaserJet P1505>
##$CURPRIN= <$Network HP LaserJet P1505>
##$DFORMAT= <normdp>
##$LAYOUT= <+/1D_H.xwp>
##$LFORMAT= <normlp>
##$PFORMAT= <normpl>
##$SURQMSG= 1
$$ End of Bruker specific parameters
$$ ---------------------------------
##NTUPLES= NMR SPECTRUM
##VAR_NAME=  FREQUENCY,     SPECTRUM/REAL,   SPECTRUM/IMAG
##SYMBOL=    X,             R,               I
##VAR_TYPE=  INDEPENDENT,   DEPENDENT,       DEPENDENT
##VAR_FORM=  AFFN,          ASDF,            ASDF
##VAR_DIM=   131072,        131072,          131072
##UNITS=     HZ,            ARBITRARY UNITS, ARBITRARY UNITS
##FACTOR=    0.0627417313425164, 1,          1
##FIRST=     8223.62146879497, 196,          -55882
##LAST=      0,             1350,            -55632
##MIN=       0,             -11223,          0
##MAX=       8223.62146879497, 426126163,    0
$$ Real data points
##PAGE= N=1
##DATA TABLE= (X++(R..R)), XYDATA
$$ [...]
67792 70042 68207 67067 66270 65556 64865 64182 63502 62897 62506 62418 62547 62655 62646 62733 63112 63526 63559 63370 63604 64350
67772 64350 64782 64286 63462 63365 64040 64571 64474 64276 64606 65428 66457 67689 69095 70318 71171 72101 73557 75130
67754 75130 75905 75609 74852 74214 73683 73213 73223 74058 75285 76082 76210 76101 75999 75573 74626 73694 73542 74232 75049
67735 75049 75258 74621 73303 71632 70037 68840 67928 66820 65168 63089 60971 59150 57884 57367 57561 58092
67719 58092 58507 58590 58363 57889 57220 56424 55567 54743 54224 54391 55255 56169 56275 55329 53933 52926 52705 53109 53757
67700 53757 54345 54729 54874 54756 54302 53455 52284 51030 50007 49457 49455 49868 50453 51084 51893 53099 54658 56131
67682 56131 56994 57074 56624 55983 55217 54193 52973 51982 51669 52073 52863 53777 54750 55595 55861 55304 54361 53866 54252
67663 54252 55224 56231 57061 57873 58810 59778 60522 60809 60559 59944 59358 59166 59438 59935 60364 60537 60343 59768 59055
67644 59055 58640 58731 58986 58835 58124 57234 56540 56021 55497 54975 54553 54230 54092 54463 55515 56828 57766 58268 58902
67625 58902 60076 61611 63147 64533 65592 65976 65615 65003 64617 64257 63393 62017 60759 60153 60181 60515 60881
67608 60881 61144 61348 61715 62365 62975 62983 62216 61082 60131 59676 59844 60543 61240 61156 60069 58725 58183 58827 60198
67589 60198 61583 62457 62572 62008 61211 60620 60238 59739 59082 58704 58997 59852 60847 61666 62043 61500 59590 56610
67571 56610 53780 52400 52766 54023 55061 55420 55346 55205 55119 55102 55267 55717 56269 56496 56088 55149 54052 53035
67553 53035 52058 51104 50489 50681 51760 53236 54507 55380 56016 56535 56856 56884 56610 56031 55186 54283 53593 53164
67535 53164 52850 52648 52755 53191 53638 53856 54001 54327 54812 55388 56230 57350 58054 57475 55682 53795 52747 52453
67517 52453 52403 52467 52616 52315 51010 49067 47474 46563 45730 44681 44219 45271 47572 49882 51277 51690 51394
67500 51394 50597 49626 48974 48929 49409 50207 51047 51422 50913 49849 49173 49323 49668 49471 49036 49269 50256 50979 50615
67481 50615 49649 49324 50192 51488 51893 50819 49010 47917 48434 50174 51967 52953 53118 52957 52929 53221 53780
67464 53780 54439 55116 55817 56354 56229 55134 53515 52247 51730 51677 51870 52598 54068 55820 57204 58149 58973
67447 58973 59516 59077 57370 55151 53582 53108 53218 53238 53111 53196 53458 53279 52314 51252 51200 52304 53460 53614
67429 53614 52946 52465 52799 53819 55160 56536 57564 57836 57348 56538 55783 55094 54408 53881 53689 53735 53713 53443
67411 53443 53044 52842 53111 53804 54515 54781 54433 53620 52596 51579 50688 49853 48884 47761 46736 46044 45669 45541
67393 45541 45663 45840 45648 45122 45128 46428 48583 50418 51473 52194 52677 52250 50649 48800 47824 47839 48280 48838
67375 48838 49405 49541 48848 47775 47323 47967 49344 50971 52689 54364 55624 56106 55740 54777 53711 53030 52740
67358 52740 52324 51422 50358 49608 49051 48291 47542 47471 48188 49068 49689 50307 51176 51960 52189 51873 51311 50641 49894
67339 49894 49227 48809 48634 48645 48808 48972 48963 48972 49486 50563 51550 51816 51525 51364 51745 52581 53625 54621 55211 55113
67319 55113 54478 53874 53848 54470 55248 55500 55084 54753 55442 57065 58395 58405 57328 56088 55066 53988 52832
67302 52832 52199 52653 54102 55981 57816 59488 61078 62533 63499 63612 62977 62180 61735 61750 62207 63150 64332
67285 64332 65047 64754 63579 61929 59983 58027 56799 56711 56979 56349 54683 53139 52781 53714 55515 57571
67269 57571 58898 58729 57782 58019 60451 63849 66253 67099 67103 66772 66115 65433 65254 65491 65596 65592 66014 66728 66746
67250 66746 65621 64176 63370 63068 62559 61792 61470 62106 63487 64927 65689 65340 64097 62747 61976 61870 62200
67233 62200 62832 63556 63908 63706 63565 64259 65641 66676 66598 65549 64123 62805 61983 61889 62265 62485 62371 62493
67215 62493 63382 64790 66104 67134 67985 68425 68040 67087 66620 67466 69347 71229 72404 73038 73798 75086 76666
67198 76666 77959 78598 78656 78386 77940 77402 76857 76221 75144 73370 71189 69344 68484 68790 70046 71826 73667
67181 73667 75268 76554 77467 77777 77299 76166 74748 73439 72724 73161 74857 77056 78743 79685 80444 81346
67165 81346 81948 81721 80811 79871 79455 79738 80474 81017 80750 79799 79031 79067 79603 79939 79850 79573 79317 79238 79656 80769
67145 80769 82206 83357 84062 84610 85099 85273 85052 84814 84948 85384 85740 85847 85966 86478 87409 88318 88801 89040
67127 89040 89629 90873 92557 94418 96300 97732 97981 97032 96011 96081 97274 98921 100727 102599 103872 103836
67111 103836 103037 102967 104209 105746 106479 106559 106780 107417 108307 109462 110902 112237 113080 113662 114441 115248 115359 114397
67093 114397 112824 111611 111659 113316 116094 118906 120924 122079 122632 122566 121820 120815 120249 120399 121059 122110
67077 122110 123709 125821 127923 129338 129712 129190 128297 127585 127288 127396 128112 129828 132347 134539 135433 135482 136055
67060 136055 137669 139429 140414 140875 141645 142931 144406 146120 148571 151757 154804 156813 157747 158307 159173 160627
67044 160627 162647 164981 167113 168463 168853 168731 168911 170077 172408 175446 178300 180199 181075 181532 182165 183072
67028 183072 184161 185686 188103 191405 194907 197835 199971 201688 203499 205587 207682 209432 211015 213191
67014 213191 216441 220206 223433 225883 228350 231471 234884 237868 240389 243009 246010 249054 251648 253684
67000 253684 255646 258446 262792 268382 273901 278167 281218 284028 287392 291370 295620 299854 303960 308007
66986 308007 312151 316408 320699 325202 330316 335948 341344 346118 351036 356997 363423 368671 372242 375708
66972 375708 380994 388341 396437 404028 410767 416810 422320 427530 432876 438810 445551 452995 460776 468449
66958 468449 475743 482746 489913 497912 507282 517973 529275 540451 551385 562431 573714 585024
66946 585024 596364 608137 620579 633438 646414 659567 673014 686592 700177 714034 728492
66935 728492 743534 759115 775656 793650 812823 832215 851169 869821 888542 907432 926667
66924 926667 946938 968997 992795 1017482 1042300 1067266 1092887 1119462 1146886 1174977 1203714
66913 1203714 1233148 1263285 1294191 1325993 1358693 1392103 1426146 1461101 1497322 1534769 1572984
66902 1572984 1611437 1649738 1687697 1725580 1764247 1804521 1846177 1887883 1928409 1967681 2006472
66891 2006472 2045373 2084376 2123183 2161446 2198777 2234971 2270257 2304935 2338702 2370663 2400139
66880 2400139 2427141 2451879 2474235 2494049 2511625 2527440 2541363 2552638 2560729 2565816 2568310 2568237
66868 2568237 2565398 2559781 2551393 2539861 2524732 2506188 2485056 2462012 2437152 2410405 2381871 2351517
66856 2351517 2319056 2284562 2248850 2212713 2175982 2137927 2098513 2058721 2019485 1980810 1942076
66845 1942076 1902800 1862864 1822333 1781450 1740712 1700701 1661801 1624058 1587184 1550684 1514259
66834 1514259 1478173 1443094 1409436 1376959 1345039 1313158 1281139 1249164 1217747 1187531 1158937
66823 1158937 1131933 1106172 1081283 1057120 1033746 1011105 988690 965862 942782 920623 900366
66812 900366 881560 862871 843737 824807 806788 789648 773187 757534 742571 727558 711965
66801 711965 696263 681284 667175 653577 640468 628103 616308 604555 592745 581324 570614
66790 570614 560524 550939 541827 532900 523651 513931 504118 494589 485340 476261 467478 459275 451882 445354
66776 445354 439457 433696 427731 421714 415868 409836 402939 395147 387322 380315 374185 368517 363155 358279
66762 358279 353923 349721 345147 339935 334365 329084 324465 320171 315558 310468 305320 300455 295782 291181
66748 291181 286853 283106 280045 277581 275467 273207 270287 266675 262809 259001 255160 251200 247269 243455
66734 243455 239719 236370 234041 232815 231862 230412 228622 226940 225099 222507 219360 216528 214423 212724
66720 212724 211152 209721 208147 205856 202847 199789 196994 194065 190955 188500 187212 186189 184189 181357
66706 181357 178972 177628 176666 175437 174126 173011 171705 169714 167253 164977 163197 161776 160550 159429
66692 159429 158268 157000 155786 154763 153814 152848 152099 151754 151473 150730 149550 148426 147522 146451 144938 143277
66676 143277 141966 141170 140701 140172 139031 136854 133879 131008 129036 128039 127657 127623 127723 127602 127044 126257 125488
66659 125488 124514 122995 121226 119999 119582 119297 118341 116720 115126 114058 113302 112289 110845 109479 108844 108902
66643 108902 108909 108431 108063 108659 109969 110668 109916 108390 107442 107630 108397 108825 108303 106727 104593 102837 102122 102160
66625 102160 102090 101566 101097 101241 101801 102038 101438 100094 98495 97137 96187 95326 94105 92623 91684 91991 93271
66608 93271 94482 94869 94510 93877 93281 92835 92576 92314 91683 90715 90152 90722 92114 93114 92806 91359 89581
66591 89581 88108 87175 86750 86555 86170 85497 85003 85218 86080 87013 87553 87653 87427 86974 86487 86240 86268 86228 85725
66572 85725 84720 83546 82597 82027 81666 81166 80280 79066 77879 77200 77368 78234 79070 79102 78351 77684 77785 78287
66554 78287 78314 77706 77216 77468 78227 78896 79307 79681 80083 80323 80315 80181 79939 79341 78156 76564 75087 74108 73474
66535 73474 72707 71612 70530 69910 69803 69991 70419 71204 72251 73210 73858 74240 74375 74146 73604 73094 72878 72835
66517 72835 72701 72437 72219 72260 72760 73781 74928 75361 74442 72379 70044 68232 67227 66966 67329 68144 69050
66500 69050 69529 69240 68422 67799 67825 68050 67566 66135 64559 63780 63932 64461 64831 64787 64245 63385 62745 62840 63656
66481 63656 64734 65670 66298 66532 66330 65801 65067 64152 63223 62740 62914 63153 62612 61412 60820 61929 64454 67030
66463 67030 68447 68406 67375 66109 65245 65062 65453 66093 66671 67017 67148 67163 66995 66388 65277 64055 63192 62654
66445 62654 62074 61445 61215 61600 62247 62855 63675 65062 66750 67998 68332 67877 67085 66451 66339 66768 67320 67509
66427 67509 67254 66800 66320 65805 65283 64861 64550 64252 63929 63609 63329 63251 63706 64783 65967 66568 66524 66426 66714
66408 66714 67264 67852 68505 69113 69180 68414 67282 66510 66178 65757 64963 64128 63722 63838 64190 64321 63836 62845 62128
66389 62128 62445 63528 64215 63775 62708 61972 61848 62019 62363 63072 64076 64941 65427 65710 65914 65852 65458 65105
66371 65105 65196 65622 65891 65712 65251 64927 65126 65961 67046 67607 67136 65981 65081 65042 65634 66237 66567 66818 67247
66352 67247 67822 68292 68431 68185 67703 67219 66840 66381 65521 64240 63055 62636 63189 64316 65548 66841 68402
66335 68402 70120 71427 71824 71411 70773 70419 70438 70620 70759 70764 70633 70424 70218 70021 69743 69344 68944 68630 68235
66316 68235 67562 66870 66772 67442 68264 68580 68506 68548 68649 68291 67531 67163 67586 68215 68432 68423 68502 68205 66962 65312
66296 65312 64493 64887 65750 66470 67168 67849 67897 66937 65540 64516 64010 63750 63706 63944 64230 64374 64683 65577 66947
66277 66947 68337 69485 70225 70225 69480 68817 69155 70320 71270 71475 71372 71370 71225 70728 70302 70373 70558 70111 68946
66258 68946 67704 66877 66336 65772 65223 64944 64977 65074 65036 64955 65088 65551 66241 67079 68136 69438 70736 71621 71875
66239 71875 71651 71339 71259 71334 71013 69730 67638 65684 64777 64964 65620 66238 66710 66998 66957 66549 65942 65330 64819
66220 64819 64462 64198 63885 63662 64117 65669 67841 69596 70438 70753 71029 71242 71281 71425 71997 72798 73291 73248 72926
66201 72926 72670 72598 72595 72473 72137 71751 71654 72032 72718 73369 73769 73957 74167 74650 75382 75986 76146 76067 76267 76813 77078
66180 77078 76401 74789 72869 71349 70647 70779 71424 72196 72955 73770 74572 75065 75007 74427 73621 73174 73805 75737
66162 75737 78134 79649 79663 78682 77529 76698 76537 77273 78474 79141 78842 78272 78142 78103 77500 76701 76737 77746
66144 77746 78736 79041 79168 79885 81051 81836 81782 81265 80940 80998 81041 80680 80152 80071 80544 80952 80856 80685 81062 81799
66124 81799 82218 82253 82513 83281 84118 84609 84899 85274 85680 85898 85816 85412 84817 84444 84675 85359 86033 86635 87493 88569
66104 88569 89383 89876 90659 92055 93485 94284 94562 94775 94927 94838 94810 95285 96032 96352 96088 95822 95971 96207 95968
66085 95968 95186 94311 93806 93775 93930 93844 93332 92609 92024 91703 91550 91443 91285 90965 90485 90028 89764 89712 89894 90462
66065 90462 91395 92225 92382 91790 90937 90361 90289 90661 91325 92188 93303 94692 95984 96475 95823 94534 93461 92964
66047 92964 92851 92929 93131 93129 92393 90855 89195 88237 88239 88851 89528 89866 89836 89834 90363 91511 92894 94150 95281 96365
66027 96365 97160 97236 96492 95370 94526 94302 94454 94449 94092 93773 93936 94474 94964 95475 96677 98984 101873 104261
66009 104261 105357 105056 103834 102502 101812 101923 102345 102612 102843 103412 104301 105202 106145 107568 109733 112374 115058
65992 115058 117537 119664 121268 122355 123248 124367 125964 128143 130870 133792 136296 138047 139332 140578
65978 140578 141644 141970 141448 140673 140126 139406 137623 134456 130537 126879 124119 122283 120960 119596 117852
65963 117852 115857 114042 112684 111752 111229 111340 112235 113601 114794 115360 115259 114679 113885 113309 113503 114791 116973
65946 116973 119478 121830 123956 126136 128753 132102 136271 141026 145726 149480 151700 152657 153367 154731 156751
65931 156751 158649 159644 159510 158592 157598 157377 158413 160296 161899 162464 162422 162867 164260 166004 167371 168424
65915 168424 169723 171448 173328 175385 178143 181817 185714 188917 191308 193410 195375 196711 197144 197096 196994
65900 196994 196566 195373 193716 192436 191886 191646 191254 190730 190206 189467 188175 186309 184191 182183 180470 178940
65884 178940 177157 174703 171762 169150 167527 166635 165557 163676 161189 158744 156795 155384 154353 153584 153009
65869 153009 152615 152596 153440 155563 158699 161812 163855 164530 164197 163306 162244 161493 161319 161256 160439 158657 156622
65852 156622 154982 153578 152050 150669 149998 149990 150061 149924 149803 149838 149846 149772 149903 150433 151105 151484 151365 150813 150036 149304
65832 149304 148782 148372 147921 147611 147822 148542 149278 149705 150140 151137 152961 155663 159282 163562 167708 171055 173937
65815 173937 177372 181699 186000 189149 191034 192258 192898 192277 190160 187622 186234 186552 187807 188988 189760
65800 189760 190283 190610 190641 190447 190306 190412 190800 191475 192406 193371 194003 194107 193912 193942 194588 195733 196869 197749 198858
65781 198858 201039 204664 209515 215498 222961 232068 242322 253145 264545 276686 289076 300816 311435
65768 311435 320807 328331 332959 334221 332559 328457 321925 313150 303050 292707 282677 273258 265034
65755 265034 258633 254260 251847 251446 253109 256735 262513 271194 283345 298467 315419 333650 353551
65742 353551 375619 399752 425359 451675 477778 502616 525159 544377 559198 568799 572955 571810
65730 571810 565442 554015 538281 519412 498265 475227 450862 426237 402377 379720 358295 338141
65718 338141 319345 301959 286053 271677 258648 246688 235870 226612 218993 212407 206143 200099
65706 200099 194676 190189 186616 183691 181004 178244 175647 173951 173517 173659 173279 172114 170916 170406 170544
65691 170544 170925 171438 172163 172942 173507 173934 174619 175679 176684 177205 177504 178423 180552 183774 187717 192439 198378
65674 198378 205704 214072 223139 233118 244695 258584 275246 294773 316779 340621 366034 393505
65662 393505 423675 456246 489688 522034 551790 578034 600048 617279 629715 638002 643044 645545
65650 645545 646023 645100 643475 641582 639524 637597 636712 637934 641491 646402 651064 654026 654222 650955 643977
65635 643977 633392 619165 600873 578260 551968 523343 493553 463189 432747 403072 375061
65624 375061 349174 325473 304041 285093 268727 254780 242950 232919 224298 216599 209430 202786
65612 202786 197010 192331 188434 184644 180653 176878 173927 171816 170018 168220 166663 165632 164960 164328 163798
65597 163798 163684 163989 164357 164619 165041 165810 166547 166655 166130 165779 166440 168153 170280 172412 174897 178288 182501
65580 182501 186881 191130 195772 201521 208537 216749 226736 239723 256474 276526 298745 322481 347891
65567 347891 375256 404252 433877 462893 490218 515011 536493 553827 566297 573576 575609 572170
65555 572170 562788 547389 526878 502796 476454 448645 420133 391985 365141 339960 316429 294710
65543 294710 275181 257953 242660 228906 216835 207053 199878 194726 190442 186360 182882 180844 180406
65530 180406 180867 181514 182275 183334 184459 185063 184753 183480 181243 178009 174024 169925 166384 163689 161651
65515 161651 159821 157821 155634 153641 152219 151319 150595 149943 149690 150150 151144 152188 153065 153999 155210 156457
65499 156457 157220 157285 156976 156680 156306 155465 154102 152654 151521 150773 150546 151373 153731 157438 161872 166624 171576
65482 171576 176481 180950 184912 188561 191804 194200 195620 196501 197178 197384 196780 195623 194398 193003 190802
65467 190802 187500 183547 179577 175775 171948 167975 164003 160331 157259 154963 153367 152139 150909 149585
65453 149585 148455 147906 147991 148334 148549 148666 148957 149374 149463 148975 148360 148451 149712 151891 154313 156372 157912 159273
65435 159273 160956 163065 165175 166854 168231 169864 172061 174541 176723 178168 178728 178473 177645 176574 175461
65420 175461 174198 172519 170424 168378 166995 166542 166881 167874 169570 171893 174430 176808 179092 181460 183648
65405 183648 185133 185817 186053 185920 184999 183043 180461 177884 175701 174289 174244 175829 178424 181028 183288 185722
65389 185722 188952 192932 196861 199654 200682 200258 199284 198329 197266 195841 194114 192056 189321 185954 182879
65374 182879 181020 180187 179530 178854 178744 179525 180882 182524 184395 186138 187206 187719 188511 189945 191460 192648
65358 192648 194138 196874 201074 206433 212799 220055 227806 235823 244469 253961 263464 271682 278262 283904
65344 283904 289105 293504 296586 298288 298640 297407 294596 290860 286888 282558 277196 270615 263434 256263
65330 256263 248968 241081 232769 225045 218958 214780 212056 210238 209107 208747 209336 210834 212678 213953 214153
65315 214153 213695 213309 213057 212370 210951 209029 206597 203082 198171 192452 186810 181618 176937 173027 170035
65300 170035 167489 164804 162136 160155 159120 158860 159460 161168 163565 165725 167480 169662 172640 175383 176677
65285 176677 176709 176593 176645 176049 174360 172427 171470 171704 172326 172590 172541 172791 173799 175385 176843 177613 177920 178611
65267 178611 180310 182853 185629 188221 190500 192327 193601 194615 196004 198129 200728 203356 205950 208788
65253 208788 212031 215568 219256 222998 226483 229028 229804 228280 224559 219429 213990 208963 204278 199455
65239 199455 194366 189452 185221 181766 178846 176189 173672 171468 170104 170113 171398 173171 174680 175771 176575
65224 176575 176974 176778 176220 175830 175765 175617 174996 174020 173138 172604 172248 171680 170667 169405 168414 168065 168285 168766
65206 168766 169389 170276 171558 173260 175336 177576 179541 180838 181441 181525 181054 179799 177799 175507 173444 171974
65190 171974 171374 171723 172541 172955 172538 171862 171908 173076 174954 176932 178725 180314 181680 182750 183525 184178 184952
65173 184952 185849 186393 185866 184007 181414 179087 177473 176122 174359 172170 170232 169096 168575 168130 167675 167653
65157 167653 168246 168932 169090 168734 168251 167653 166657 165480 164915 165367 166308 167017 167488 168193 169341 170866 172929
65140 172929 175868 179627 183736 187933 192456 197624 203459 209771 216248 222386 227714 232315 236813 241715
65126 241715 247079 252995 259943 268218 277316 286339 294907 303273 311694 320144 328541 336686 343859 349057
65112 349057 351852 352642 351714 348449 341923 332148 320367 308213 296809 286448 276694 266837 256666
65099 256666 246871 238347 231071 224085 216766 209677 203842 199453 195758 192149 188910 186716 185720 185450 185483
65084 185483 185827 186557 187362 187824 188024 188399 188829 188339 186191 183038 180404 178997 178094 176777 175216 174242 174072
65067 174072 174139 174125 174487 175666 177213 178167 178197 178035 178723 180646 183373 186155 188395 189798 190440 190803 191467
65050 191467 192582 193804 194831 195752 196598 196856 195890 193826 191542 189715 188256 186782 185217 183750 182596
65035 182596 182060 182431 183475 184296 184128 183055 181620 179896 177462 174218 170806 168106 166542 165917 165663 165224
65019 165224 164430 163598 163204 163449 164123 164772 164915 164416 163771 163783 164689 165950 167191 168924 171767 175291 178476
65002 178476 181301 185065 190859 198350 206387 214195 221486 227857 232751 235956 237658 237953 236657 233710
64988 233710 229702 225863 223496 223258 224928 227924 232012 237366 243999 251411 258795 265299 270079 272487
64974 272487 272497 270761 267986 264319 259436 253148 245815 238238 231195 224942 219212 213763 208778 204557 201041
64959 201041 198066 195929 195084 195236 195340 194727 193712 192879 192325 191960 192000 192627 193583 194547 195549 196461 196500 195015
64941 195015 192607 190719 190061 190027 189740 189116 188714 189029 190161 191912 193921 195849 197532 198823 199437 199241
64925 199241 198683 198474 198741 198846 198214 197045 195980 195223 194264 192451 189779 187093 185423 185023 185183 185125 184817
64908 184817 184673 184765 184944 185615 187632 191155 195242 198978 202606 207009 212376 218004 223418 229174 236329
64893 236329 245310 255449 265531 274782 283450 292522 302830 314424 326732 339244 351934 365075
64881 365075 378676 391998 403532 411604 415210 414435 410037 402751 393078 381624 369330 357164 345717
64868 345717 335337 326579 320179 316323 314162 312425 310512 308704 307317 306067 304422 302118 298951 294414
64854 294414 288069 280199 271639 262976 254331 245824 237737 230088 222573 215198 208605 203454 199690 196715
64840 196715 194102 191922 190495 190049 190479 191258 191695 191416 190559 189427 188153 186825 185664 184882 184491 184392 184461
64823 184461 184486 184359 184562 186044 189110 192651 195068 195968 196473 197820 200145 202805 205427 208325 212133 217339
64807 217339 224035 231816 239985 247992 255645 262801 269024 273752 276706 278011 277971 276883 274958 272224 268572
64792 268572 264080 259266 254771 250772 246972 243271 240185 238366 237849 238053 238467 239075 240081 241538 243340
64777 243340 245350 247305 248779 249524 249771 250008 250553 251589 253502 256758 261371 266839 272766 279273 286608
64762 286608 294662 303144 311955 321055 330142 338882 347414 356238 365593 375299 385222 395526 406352 417632
64748 417632 429416 441974 455222 468182 479369 487680 492700 494274 492137 486078 476305 463563 448959
64735 448959 433612 418337 403616 389885 377728 367622 359551 353105 348008 344387 342435 341886 341911
64722 341911 341516 340114 337926 335815 334656 334797 336245 339251 344390 351964 361547 372381 384027 396354
64708 396354 408944 420802 430702 437610 440789 439817 434768 426309 415360 402612 388441 373212 357540
64695 357540 342186 327745 314439 302173 290782 280285 270902 262768 255687 249313 243655 239243 236579
64682 236579 235479 235159 235042 235226 236014 237226 238340 239302 240787 243466 247268 251652 256488 262250 269313
64667 269313 277323 285436 292946 299438 304434 307299 307722 306108 303257 299609 295049 289477 283348 277445
64653 277445 272285 268042 264916 263160 262601 262510 262273 262023 262402 263835 266311 269675 273685 277818 281499 284728
64637 284728 288211 292695 298414 305346 313705 323857 335864 349408 364036 379219 394188 408066
64625 408066 420277 430569 438538 443333 444090 440546 433066 422187 408444 392672 376097 359828 344409
64612 344409 330138 317650 307748 300560 295275 290923 287123 283840 280797 277649 274546 271974 270001 268166
64598 268166 266181 264278 262675 261201 259718 258530 258002 258007 258192 258607 259738 262056 265768 270876 277127 284062
64582 284062 291456 299677 309308 320557 333372 347976 364665 383057 402009 420511 438226 454983
64570 454983 470184 483112 493547 501558 506753 508152 504948 497230 485867 471859 455916 438580
64558 438580 420504 402407 384754 367667 351326 336388 323725 313678 305758 299214 293760 289660
64546 289660 287196 286259 286433 287354 288998 291654 295670 301154 307874 315311 322711 329156 333808 336163 335997
64531 335997 333135 327578 319960 311593 303737 296884 290946 285903 281827 278338 274630 270435 266612 264363
64517 264363 263977 264724 265890 267371 269190 270999 272445 273608 274600 275051 274558 273543 273017 273427 274308 275240
64501 275240 276563 278849 282202 286504 291901 298489 305780 313061 320124 327148 333948 339900 344513 347576
64487 347576 348813 348036 345822 343494 342185 342292 343933 347407 352802 359521 366544 372950 377975 380975 381721
64472 381721 380517 377707 373334 367589 361362 355877 351885 349482 348486 348520 348980 349625 351282 355277 361853
64457 361853 369525 376299 381161 384044 384850 383194 379156 373665 367900 362622 358236 355122 353496 353125 353521
64442 353521 354413 355786 357605 359936 363373 368806 376515 385888 396385 408439 422883 439690 457900
64429 457900 476897 497317 520578 547996 580617 619493 665628 719799 782871 856521 943509
64418 943509 1046919 1168727 1308577 1463543 1628863 1798919 1967935 2130775 2284070 2426786
64408 2426786 2559021 2679740 2785558 2871530 2932886 2966465 2971665 2950697 2907395 2844908 2764247
64397 2764247 2664905 2546378 2408982 2254263 2085920 1910347 1735311 1567483 1411183 1268985
64387 1268985 1142460 1031936 936231 853349 781503 719356 665742 619681 580587 547994 521005
64376 521005 498291 478825 462506 449874 441212 435950 432870 430676 428289 424804 419567 412449 403807
64363 403807 393953 382768 370041 356118 342039 329026 317857 308591 300753 293878 287990 283419 280109
64350 280109 277435 274998 273268 273036 274368 276598 279202 282094 284969 286972 287362 286182 283972 281130 277808
64335 277808 274176 270386 266400 262137 257765 253668 250171 247512 245967 245780 246934 249129 252013 255323
64321 255323 258816 262200 265260 268064 270993 274449 278504 282962 287881 293804 301139 309362 317203 323676
64307 323676 328513 331461 331707 328533 322377 314680 306682 298673 290429 281971 273709 266087 259301 253214
64293 253214 247453 241733 236237 231546 228041 225439 223043 220393 217572 215020 213221 212497 212852 213955 215498
64278 215498 217627 220768 224886 229191 232947 236428 240673 246267 252726 259130 264891 269720 273367 275924
64264 275924 278065 280327 282249 282861 282102 281152 281161 282253 284094 286748 290251 293605 295108 293830 290331 285797
64248 285797 280909 275724 270137 264062 257383 250218 243202 237209 232688 229423 226921 224891 223300 222208
64234 222208 221677 221748 222336 223173 223953 224562 225141 226005 227583 230316 234277 238775 242550 244685 245367 245619 246342
64217 246342 247713 249407 251059 252416 253329 253799 253938 253710 252860 251298 249428 247867 246839 246076 245310 244589
64201 244589 244016 243391 242322 240662 238696 236874 235481 234593 234311 234876 236411 238626 241025 243582 246968
64186 246968 251883 258264 265536 273565 282879 293755 305451 316632 326261 333760 338586 340230 338697
64173 338697 334598 328626 321248 312927 304315 295986 288131 280603 273088 265222 256861 248450 240864 234644
64159 234644 229567 225090 220978 217256 213877 210845 208512 207264 206952 207048 207470 208849 211782 216116 221172
64144 221172 226479 232030 237902 243903 249610 254671 259000 262646 265470 267025 266867 264951 261622 257279
64130 257279 252204 246724 241303 236404 232348 229294 227243 226107 225838 226376 227341 228048 228262 228846 231142 235599
64114 235599 241341 247215 252858 258583 264613 270813 276916 282684 287983 292842 297293 301000 303376 304276
64100 304276 304315 304253 304364 304715 305749 308177 312370 318133 324844 331502 336897 340250 341618 341329 339229 334968
64084 334968 328829 321630 313787 305099 295650 286327 278102 271150 264995 259275 254112 249964 247308 246249
64070 246249 246260 246546 246923 248096 250786 254713 258787 262231 265243 268460 272093 275767 279110 282190 285224
64055 285224 287997 289877 290537 290365 289944 289281 287905 285638 282881 280033 277025 273636 270085 267052 265169
64040 265169 264629 265202 266525 268426 271045 274595 278971 283680 288152 292003 294960 296708 296988 295847 293747
64025 293747 291414 289489 288210 287430 287083 287610 289755 293853 299393 305289 310490 314323 316535 317175 316476
64010 316476 314725 312224 309296 306273 303405 300739 298059 295016 291447 287593 283858 280325 276694 272783
63996 272783 268928 265804 263996 263786 264993 266837 268305 269000 269469 270406 271833 273433 275322 277888 280919
63981 280919 283572 285324 286547 287958 289874 292138 294448 296626 298796 301371 304628 308205 311240 313036
63967 313036 313479 312936 312067 311605 311945 313016 314835 317966 322911 329239 335988 342878 350434 358894 367831
63952 367831 377097 387373 399381 413197 428780 446604 467296 491174 518659 550714 588304 631739
63940 631739 680998 736358 798186 866341 940228 1019166 1102295 1188398 1276273 1364982 1453254
63929 1453254 1538823 1618852 1690906 1753215 1804412 1843586 1870429 1884707 1885681 1872519 1845250 1804898
63917 1804898 1752812 1690369 1619300 1541827 1460330 1377017 1293649 1211174 1129812 1050012 973293
63906 973293 901715 836628 778312 726636 681500 642637 609531 581647 558366 538754 521890
63895 521890 507453 495581 486156 478698 472903 468675 465595 462973 460678 459322 459345 460450 462341 465510
63881 465510 470669 477617 485271 492848 500629 509500 520074 532417 546428 562204 580034 600203 622881
63868 622881 648181 676289 707636 743043 783490 829354 879881 933781 990460 1050314 1113681
63857 1113681 1179970 1248188 1317865 1388917 1460747 1532040 1601329 1667379 1729048 1785245 1835071
63846 1835071 1877753 1912532 1938829 1956355 1964754 1963346 1951641 1929929 1898959 1859261 1811351 1756371
63834 1756371 1695900 1631146 1562901 1492208 1420421 1348569 1277324 1207591 1140439 1076260 1014721
63823 1014721 955798 900241 848728 801197 757394 717429 681322 648492 618308 590800 566336
63812 566336 544787 525482 507802 491405 476050 461602 448178 435955 424898 414848 405764 397556
63800 397556 389785 381830 373474 365233 357977 352116 347137 342110 336752 331677 327388 323469 319337 315467
63786 315467 312971 312041 311754 311648 312515 315173 319287 324057 329418 335695 342416 348272 352067 353201 351382
63771 351382 346577 339273 330392 320921 311734 303427 295982 288904 282075 276153 271723 268481 265770 263509
63757 263509 261917 260678 259243 257732 256679 255930 254787 253371 252831 253780 255310 256141 256154 256151 256537 256940 256956
63740 256956 256712 256682 257333 258900 261154 263427 265217 266779 268849 271744 275036 278188 281194 284375 287785
63725 287785 291149 294358 297713 301592 306086 311133 316763 322941 329280 335273 340827 346233 351502 356050
63711 356050 359256 361004 361413 360309 357455 353221 348609 344381 340416 336129 331377 326777 323099 320480
63697 320480 318377 316315 314549 313777 314223 315247 316014 316418 317160 319001 322035 325659 329142 332186 334979
63682 334979 337700 340105 341725 342411 342449 342221 342013 342187 343176 345137 347832 350941 354262 357552 360624 363768
63666 363768 367706 372797 378561 384229 389469 394246 398286 401155 402672 402839 401498 398496 394082 388752
63652 388752 382716 375966 368893 362435 357459 354142 352039 350567 349490 349118 350028 352417 355848 359803 364359
63637 364359 370080 377381 386250 396419 407433 418644 429479 439701 449193 457630 464731 470734 476210
63624 476210 481441 486358 491015 495720 500672 505945 511926 519387 528971 540853 554991 571360 589907
63611 589907 610631 633829 659982 689297 721643 757060 795907 838226 883067 928615 972767
63600 972767 1013548 1049210 1078216 1099207 1111160 1113957 1108904 1098482 1085309 1071247 1057262 1043694
63588 1043694 1030473 1017199 1003141 987220 968281 945731 919879 891468 861040 829177 797119
63577 797119 766556 738660 713771 692037 673810 659203 647749 638747 631618 625837 621121 617868
63565 617868 616877 618239 621025 624447 628778 634654 641968 650146 659144 669378 680831 693007 705861
63552 705861 720145 736779 756421 779824 808081 842403 884168 935389 998467 1074722 1162833
63541 1162833 1258272 1353443 1438262 1502181 1537962 1544907 1528579 1497192 1458017 1416335 1376148
63530 1376148 1340463 1310717 1286571 1266589 1249008 1231942 1213469 1192040 1166821 1137588 1104427
63519 1104427 1067712 1028212 987014 945419 904894 866789 831748 799576 769964 743185 719768
63508 719768 699645 682084 666419 652337 639482 627282 615403 603941 592912 581873 570370
63497 570370 558464 546522 534780 523421 512874 503594 495553 488267 481314 474619 468277 462378 457114
63484 457114 452831 449859 448278 447928 448571 450038 452302 455481 459854 465750 473230 481760 490373 498326 505461
63469 505461 511803 517090 521059 524021 526623 529047 530942 532228 533434 535015 536871 538866 541352 544679
63455 544679 548454 551736 553838 554589 554023 552266 549674 546742 543918 541766 541118 542673 546478 552120 559358
63440 559358 568302 579145 592188 608173 628304 654039 687373 731286 789091 862436 949364 1043793
63428 1043793 1136495 1217062 1276559 1310133 1318152 1305078 1277138 1240598 1201353 1164934 1135988
63417 1135988 1117378 1109927 1113312 1127252 1151707 1185897 1227377 1272284 1316417 1356034 1388045 1410146
63405 1410146 1421253 1421867 1413902 1400001 1382676 1363762 1344391 1325273 1306715 1288329 1268947 1247087
63393 1247087 1221455 1191105 1155574 1115294 1071738 1026800 982056 938697 897774 859953 825132
63382 825132 792845 763128 736625 713827 694639 678728 665795 655378 646924 640426 636649 636352
63370 636352 639435 645041 652302 660844 670820 682697 696847 713241 731793 753124 778498 808704
63358 808704 843329 881508 923036 968305 1017429 1070062 1125877 1184465 1244540 1303653 1358807
63347 1358807 1407082 1445822 1473035 1488136 1492071 1486613 1473886 1456626 1438058 1420652 1404992 1390225
63335 1390225 1375383 1359765 1342246 1321107 1294942 1263385 1226755 1185514 1140616 1094101 1048665
63324 1048665 1006425 968386 935264 908533 890448 883179 887988 904660 930679 960250 984511 994002
63312 994002 982512 949714 900739 843305 784642 729800 681394 640004 604889 574902 549181
63301 549181 527208 508435 492147 477809 465365 454972 446405 438842 431287 423215 414859 406987 400316
63288 400316 394933 390177 385201 379779 374514 370095 366450 362842 358824 354800 351477 349010 346997 345196
63274 345196 343876 343342 343405 343561 343547 343514 343691 344051 344351 344438 344473 344829 345704 346880 347985 349053 350616 353055
63256 353055 356067 359030 361807 364912 368809 373380 378216 383167 388222 392925 396420 398335 399462 401211
63242 401211 404350 408532 413066 417814 423100 429010 435192 441350 447599 454319 461895 470629 480567 491317
63228 491317 502354 513661 525779 539042 553032 566998 580551 593764 606906 620388 634634
63217 634634 649620 664801 679899 695500 712321 729993 747117 762386 775142 784902 791094 793459
63205 793459 792172 787308 778608 765993 749920 731108 710316 688560 666958 646038 625610 605734
63193 605734 587407 571921 559798 550700 544000 539042 535264 532701 532244 534869 540656 548986 559504
63180 559504 572323 587260 603465 620036 636602 653090 669151 684114 697421 708974 719090
63169 719090 728092 735925 742252 747035 750838 754368 757734 760357 761412 760149 755882 748073 736599 721807
63155 721807 704216 684185 661815 637188 610899 584392 559400 536793 516156 496780 478768
63144 478768 462808 449148 437390 427191 418540 411275 404887 399001 393636 388797 384214 379817 376140
63131 376140 373885 373081 372869 372089 370164 367650 365951 366137 367906 369901 371177 372086 373598 376101 379164
63116 379164 382228 385112 387850 390366 392510 394304 396061 398176 400776 403625 406458 409329 412493 416089
63102 416089 420202 425110 431001 437388 443354 448726 454624 462390 472253 483530 495971 510224 526748
63089 526748 544704 562237 577576 589574 597400 600243 597642 590043 578888 566043 552991 540360
63077 540360 528163 516436 505610 496253 488555 482284 477266 473725 472012 472158 473849 476717 480407 484497
63063 484497 488730 493429 499401 507251 516901 527786 539341 551337 564189 579055 597151 618660
63051 618660 642577 667943 694867 723965 755153 787599 820649 854202 888236 922572 957163
63040 957163 992105 1027288 1062527 1098088 1134492 1171641 1208759 1245480 1282454 1320460 1359266
63029 1359266 1397725 1434546 1468430 1497757 1520751 1536030 1542766 1540499 1529155 1509134 1481016 1445273
63017 1445273 1402691 1355021 1304764 1254161 1204552 1156732 1111560 1070072 1033211 1001585 975378
63006 975378 954429 938537 927837 922845 923978 930972 942750 957831 974866 992865 1011069 1028820
62994 1028820 1045638 1061295 1075733 1089046 1101680 1114444 1127995 1142383 1157359 1172936 1189132
62983 1189132 1205230 1219898 1232191 1241839 1248347 1250503 1247215 1238265 1223642 1202785 1175393 1142729
62971 1142729 1107093 1069985 1031552 991918 952121 913354 876046 840272 806484 775241 746594
62960 746594 720372 696785 676101 657857 641051 625139 610296 596624 583679 571096 559162
62949 559162 548276 538124 527863 517131 506415 496364 487045 478037 468997 459911 450958 442451 434826
62936 434826 428431 423236 418930 415346 412581 410591 408881 406800 404078 400933 397757 394939 392943 392152
62922 392152 392389 392766 392384 391277 390440 390711 391801 392701 393055 393785 396171 400582 406389 412901 419830 426812
62906 426812 433007 437533 440056 440691 439580 436941 433382 429713 426403 423537 421363 420460 421134 422936 425119
62891 425119 427494 430465 434130 437650 439837 440322 439878 439479 439299 438852 437896 436813 436074 435718 435542 435493 435649
62874 435649 436015 436556 437217 437641 437066 434920 431428 427350 423184 418933 414549 410154 405808 401517 397563
62859 397563 394384 391977 389907 388086 387018 386944 387246 387259 387284 388091 389630 390985 391562 391649 391700 391858 392428 394076
62841 394076 396968 400246 402920 404957 406878 408647 409703 409971 410098 410644 411655 413138 415242 417728 419903
62826 419903 421573 423599 427055 432037 437736 443379 448698 453655 458186 462182 465367 467260 467544 466488
62812 466488 464825 463315 462541 462828 463997 465363 466333 466920 467417 467868 468327 469380 471753 475429 479752 484480
62796 484480 490132 497155 505302 514018 522963 531912 540751 549958 560646 573638 588721 605155 622665
62783 622665 641665 662850 687050 715294 748466 786777 829802 877060 928472 984341 1044890
62772 1044890 1109541 1176482 1243181 1307571 1368565 1425326 1476469 1520309 1555572 1581426 1597049
62761 1597049 1601639 1594869 1577100 1549250 1512732 1469301 1420602 1367843 1312070 1254493 1196227 1137901
62749 1137901 1079890 1022837 967629 915046 865787 820603 779911 743331 710067 679719 652376
62738 652376 628022 606324 586926 569508 553646 539094 526205 515547 507053 500020 493941 488779
62726 488779 484377 480295 476480 473455 471503 470148 468860 467834 467663 468604 470535 473326 476833 480837 485341
62711 485341 490684 497019 504030 511624 520529 531610 544844 559650 576030 594640 615786 639242
62699 639242 665202 694471 727113 761698 796774 832722 871267 913233 957645 1003138 1049293
62688 1049293 1096027 1142260 1185963 1225267 1258892 1285648 1304332 1314334 1315778 1308812 1293231 1269162
62676 1269162 1237704 1200437 1158634 1113361 1066032 1018234 971071 925146 881135 839777 801246
62665 801246 765102 731097 699584 670943 645004 621376 599954 580772 563633 548247 534581
62654 534581 522704 512416 503367 495409 488523 482426 476644 470935 465365 459884 454160 448070 442074 436839
62640 436839 432549 428885 425730 423580 422991 423774 425171 426847 429250 432666 436274 438717 439469 439087 438120
62625 438120 436452 433982 431329 429313 428090 427305 426812 426698 426798 426822 427031 428145 430375 433062 435466 437546
62609 437546 439634 441794 443985 446606 450268 455022 460308 465803 471866 478858 486438 494023 501843 511097
62595 511097 522956 537776 555326 575418 597988 622893 649984 679255 710470 742623 774158
62584 774158 803882 831359 856229 877410 893296 902715 905532 902415 894226 881560 864626 843491
62572 843491 818632 791264 762937 734625 706369 678000 650108 623977 600524 579563 560298
62561 560298 542298 525669 510487 496602 484089 473381 464675 457541 451428 446208 441777 437472 432480
62548 432480 426822 421306 416498 412256 408432 405410 403617 402905 402783 402965 403353 403876 404803 406896 410626 415223
62532 415223 419018 420890 421087 420615 420250 420321 421027 422524 424745 427486 430778 435001 440545 447501 455802 465532
62516 465532 476902 489965 504564 520681 538580 558508 580478 604559 631050 659940 690305
62505 690305 720781 750590 779582 807166 831915 852606 869107 881691 889900 892860 890606 884410
62493 884410 875702 865263 853661 841864 830996 821755 814450 809431 807148 807894 811867 819465 831164
62480 831164 846892 865772 886735 909268 933200 957656 980586 999666 1013624 1022426 1026322 1025151
62468 1025151 1018597 1006539 988807 965006 935182 900578 863263 824914 786212 747412 709053
62457 709053 671925 636647 603582 573064 545528 521416 500973 484044 470060 458336 448438 440147
62445 440147 433056 426534 420228 414448 409762 406301 403705 401716 400452 399911 399526 398618 397266 396286 396155
62430 396155 396266 395680 394502 393954 394901 396691 397870 397865 397509 397857 398893 399637 399328 398177 396993 396368 396387 396882
62412 396882 397612 398145 397932 396792 395206 393817 392705 391480 390074 388993 388643 388788 388958 389102 389471 390093
62396 390093 390860 392020 394100 397235 400965 404829 408823 413119 417638 422129 426489 430708 434677 438317
62382 438317 441881 445888 450661 456074 461797 467768 474375 482141 491175 500904 510476 519522 528484 538150
62368 538150 548972 561015 574417 589617 607017 626670 648485 672645 699688 730275 765154
62357 765154 805324 851918 905687 966674 1034433 1108311 1187303 1269694 1353064 1434570 1511048
62346 1511048 1578967 1634867 1676400 1703150 1716468 1718393 1710560 1693769 1668328 1634641 1593465 1545715
62334 1545715 1492298 1434285 1373186 1310825 1248920 1188773 1131194 1076562 1025083 977175 933446
62323 933446 894046 858202 824815 793479 764521 738102 713768 690982 669585 649477 630288
62312 630288 611751 594168 578169 564154 552134 541855 532842 524581 516963 510387 505230 501416 498658
62299 498658 496771 495421 493886 491529 488392 485055 482080 479914 478973 479315 480364 481478 482721 484646 487398
62284 487398 490592 494023 497950 502482 507176 511542 515647 519970 524788 529813 534348 537829 540433 543160
62270 543160 547105 552637 559448 567249 576029 585738 596263 608002 622133 640035 662490 689572 721222
62257 721222 757854 800454 850074 907191 971590 1042790 1120177 1202495 1287446 1372026 1452989
62246 1452989 1526759 1589562 1638562 1672871 1692996 1699512 1692958 1674745 1647026 1611301 1567805 1516552
62234 1516552 1458337 1394530 1326595 1256274 1185638 1116486 1050106 987855 931294 881154 836698
62223 836698 796714 760789 729090 701334 676691 654566 634900 617798 603224 590915 580196
62212 580196 570115 560140 550536 541705 533469 525460 517813 510899 504632 498780 493750 490275 488253 486641
62198 486641 484740 483054 482631 483922 486442 489286 491837 494292 497506 502153 508098 514855 522422 531130
62184 531130 540894 551256 562199 574178 587170 600303 612721 624250 634921 644377 652259 658831
62172 658831 664868 671177 678599 688191 700963 717530 738293 763904 795329 833516 879006 931576
62160 931576 990064 1052728 1117734 1182906 1244987 1299920 1344514 1377665 1399739 1411315 1413038 1406172
62148 1406172 1392271 1372154 1345701 1312663 1273206 1227801 1177342 1123646 1069216 1016163 965594
62137 965594 918215 874988 836773 803658 775146 750946 731252 716313 705983 699745 697027 697475
62125 697475 701024 707648 717072 728903 743076 759901 779507 801494 825318 850686 877172 903588
62113 903588 928207 949596 966808 978888 984902 984894 980478 974023 967250 960788 954781 949391 944570 939712
62099 939712 933837 926335 917742 909984 905631 906399 912104 921178 932244 945010 959626 975621 991898
62086 991898 1007621 1022767 1037773 1053035 1068858 1085621 1103732 1123558 1145564 1170399 1198578
62075 1198578 1230126 1264716 1302111 1342154 1384254 1427078 1468973 1508660 1545515 1579443 1610729
62064 1610729 1639919 1667536 1693902 1719379 1744752 1771000 1798448 1826112 1851975 1873908 1890494
62053 1890494 1901227 1906161 1905381 1898907 1887108 1870939 1851269 1827851 1799232 1763947 1721664 1673210
62041 1673210 1619835 1562678 1502597 1440083 1375443 1309292 1242773 1177125 1113349 1052581 996312
62030 996312 945597 900165 858992 821737 788968 760903 736709 715385 696678 680566 666306
62019 666306 652668 639001 625514 612519 599828 586968 573777 560699 548620 538277 529632 521935
62007 521935 514563 507720 502155 498437 496692 496789 498435 501290 505387 511268 519221 528396 537150 544361 549995
61992 549995 554369 557387 558806 558815 557857 556027 552996 548452 542256 534170 523936 511942 499617 488702
61978 488702 479930 472574 465457 458255 451582 445985 441371 437545 434757 433318 432937 432939 432978 433073 433059 432576 431694
61961 431694 431034 431032 431507 432208 433375 435338 437855 440350 442754 445683 449735 454943 461014 467805 475359 483642
61945 483642 492460 501642 511256 521714 533720 548050 565199 585192 607707 632429 659230 688102
61933 688102 718918 751235 784184 816533 847073 875136 900757 924155 945136 963152 977913
61922 977913 989550 998012 1002549 1002172 996580 986456 972969 957270 940478 923821 908551 895704
61910 895704 886023 880115 878678 882499 892060 907020 926310 948859 974008 1000915 1027774 1052079
61898 1052079 1071725 1085592 1093185 1094282 1089108 1078367 1062700 1042300 1017353 988687 957683 925650
61886 925650 893504 861974 831831 803815 778364 755377 734221 714148 694892 676750 660052
61875 660052 644719 630512 617492 606040 596483 588925 583309 579434 577012 576005 576828 579926 585003
61862 585003 590973 596893 602943 610339 620214 632663 646953 662647 680402 701522 726889 756551
61850 756551 790232 827759 868781 912514 958165 1005414 1054105 1103609 1152902 1201099 1247379
61839 1247379 1290296 1327697 1357514 1378399 1389504 1390259 1380822 1362552 1337720 1308919 1278992 1251016
61827 1251016 1227570 1209831 1197838 1191804 1192750 1201575 1217824 1239698 1265014 1291663 1317201 1338575
61815 1338575 1352680 1357239 1351194 1334515 1307892 1272444 1229484 1180445 1127043 1071301 1015184 960170
61803 960170 907290 857452 811470 769693 731894 697651 666761 639270 615284 594881 577938
61792 577938 563845 551550 540238 529927 521190 514312 508977 504746 501536 499410 498128 497177 496258 495600
61778 495600 495793 497356 500389 504498 508946 513005 516376 519334 522335 525307 527446 527972 527080 525820 524947
61763 524947 524243 523210 521984 521046 520276 518964 516853 514555 512668 510949 508672 505470 501513 497198 493097
61748 493097 489940 488139 487370 487027 487062 487959 489839 491979 493401 493760 493572 493754 494954 497151 499913 503166
61732 503166 507535 513547 520651 527617 534001 540640 548329 556554 564066 570395 576182 582111 588145 593949
61718 593949 599544 605157 610635 615353 618729 620748 621922 622704 622904 621763 618733 614087 608621 602862 596815
61703 596815 590398 583684 576643 569038 560916 553026 546380 541338 537245 532986 527870 522132 516742 512671
61689 512671 510176 508718 507599 506574 505752 505079 504199 502846 501150 499424 497796 496176 494553 493177 492501
61674 492501 492921 494515 496860 499143 500631 501182 501280 501580 502328 503210 503614 503113 501821 500437 499825 500414 501979
61657 501979 504034 506337 508854 511367 513409 514696 515494 516490 518417 521716 526309 531588 536905 542192 547961
61642 547961 554629 562172 570586 580221 591253 603107 614850 625979 636282 645105 651493 655191 656911
61629 656911 657317 656254 653323 648877 643951 639421 635532 632090 628751 625190 621291 617185 612982 608547
61615 608547 603667 598310 592627 586913 581591 576912 572452 567273 560908 553875 546867 539720 531778 523046
61601 523046 514363 506418 499164 492303 485770 479542 473420 467325 461444 455848 450248 444504 439103 434816
61587 434816 431895 429831 427822 425372 422643 420393 419342 419327 419230 417993 415659 413189 411373 410207 409259
61572 409259 408251 407232 406468 406343 407114 408516 409689 409743 408460 406387 404277 402553 401215 400054 398804
61557 398804 397280 395632 394430 394221 394827 395340 395008 394017 393113 392533 391632 389686 386789 383786 381478 380029
61541 380029 379024 377852 376163 374139 372341 371151 370422 369827 369447 369744 370904 372472 373769 374486 374691 374414
61525 374414 373490 371786 369346 366245 362512 358281 353885 349718 346065 343104 340919 339401 338305 337475 336861
61510 336861 336250 335239 333740 332235 331165 330241 328820 326848 324905 323299 321679 319757 317818 316205 314804
61495 314804 313473 312554 312400 312688 312807 312743 312983 313613 314108 314089 313806 313765 314288 315493 317286 319223 320792 321999
61477 321999 323388 325341 327689 330107 332523 334975 337384 339683 341903 343995 345770 347144 348247 349260
61463 349260 350427 352104 354327 356305 356978 356345 355695 356133 357404 358568 359341 360118 361115 362181 363343 364805
61447 364805 366386 367469 367622 366871 365369 363255 360954 359167 358352 358334 358526 358424 358011 357861 358714 360666 362885
61430 362885 364480 365487 366656 368432 370620 372937 375302 377497 379150 380254 381257 382485 383885 385517
61416 385517 387749 390677 393835 396844 399905 403217 406292 408395 409411 409746 409492 408223 405602 401718 396807
61401 396807 391079 384872 378650 372693 367115 362182 358275 355356 352822 350112 347273 344798 343064 342058
61387 342058 341444 340697 339377 337551 335911 335246 335747 336859 337758 337896 337275 336409 335996 336396 337369 338419 339349
61370 339349 340300 341301 342111 342637 343263 344522 346536 349044 351852 354949 358185 361235 364058 367063 370524
61355 370524 374039 376985 379411 382120 385829 390627 396357 403182 411503 421560 433354 446753 461400
61342 461400 476643 491847 506735 521220 535056 547865 559371 569304 577245 583029 587213 590594
61330 590594 593140 593842 591857 587337 580899 572735 562784 551566 540292 530121 521603 514732 509149 504256
61316 504256 499491 494717 490205 486243 482874 480010 477594 475604 473991 472601 471139 469395 467691 466912
61302 466912 467808 470480 474788 480938 489153 498874 508928 518460 527048 533843 537436 537089 533559 528242
61288 528242 521922 514835 507463 500449 493878 487388 481092 475831 472358 470647 470147 470363 471075 472262 473996
61273 473996 476299 479072 482311 486344 491614 498207 505817 514150 523004 531977 540466 548159 555320 562387
61259 562387 569490 576574 583899 592220 602421 615031 630089 647366 666599 687278 708129 727087
61247 727087 742136 752310 757840 759475 757854 753293 745831 735459 722542 708034 693013 678033
61235 678033 663213 648919 635890 624585 614768 605992 598171 591395 585449 579924 574771 570422 567347
61222 567347 565706 565449 566492 568660 571561 574750 577985 581197 584148 586319 587372 587691 588163 589302 590807
61207 590807 592161 593451 595266 597852 600628 602642 603364 603076 602704 603358 605924 610957 618788 629559 643166
61192 643166 659493 678860 702006 729406 760758 795191 831633 868694 904643 938112 968799
61181 968799 997069 1022977 1046053 1065978 1083043 1098010 1111815 1125248 1138406 1150452 1160273 1167292
61169 1167292 1171276 1171677 1167932 1160347 1149959 1137311 1122073 1103971 1083343 1060446 1034929 1006555
61157 1006555 976012 944538 913083 882251 852651 824814 798943 775221 754210 736543 722298
61146 722298 710974 702103 695669 691881 690615 691047 691937 692398 692212 691141 688249 682562 674418 665529 657528
61131 657528 650990 645966 642721 641538 642390 645340 650894 659558 671291 685759 702841 722626 745232
61118 745232 770824 799460 830690 863787 898612 935842 976042 1019000 1064184 1111157 1159169
61107 1159169 1206977 1253690 1299280 1343656 1385782 1424437 1459460 1491485 1520680 1546386 1567839
61096 1567839 1584521 1595897 1601408 1600713 1593541 1579444 1558140 1530053 1496172 1457607 1415634 1371895
61084 1371895 1327938 1284485 1241323 1197865 1153799 1109677 1067027 1027357 990758 956071 922756
61073 922756 891807 864293 839852 817529 797411 780317 766222 754150 743492 734445 727149 721274
61061 721274 716605 713340 711666 711554 712941 715637 719188 723315 728366 734908 743127 753012 764698 778087
61047 778087 792638 808178 825479 845349 867652 891937 918425 947528 979010 1012630 1048905
61036 1048905 1088043 1128772 1169631 1210935 1254000 1298839 1344359 1390627 1439121 1490589 1544224
61025 1544224 1599123 1654797 1709961 1762577 1811843 1858920 1905363 1952357 2001881 2056962 2119787
61014 2119787 2190724 2269600 2356577 2451314 2553067 2662891 2784951 2925467 3091962 3294118
61004 3294118 3543713 3853339 4237630 4717356 5321385 6086027 7058628 8305338 9906909
60995 9906909 11926983 14360496 17090232 19877845 22401817 24342037 25491787 25849837
60987 25849837 25635536 25206029 24916842 24998183 25493328 26258299 27004360 27378362 27077665
60978 27077665 25964636 24117831 21782942 19256428 16779983 14499158 12477894 10729041
60970 10729041 9236827 7972292 6905491 6011010 5266096 4648127 4135872 3711285 3358631
60961 3358631 3063186 2812067 2595517 2406626 2240527 2094134 1965413 1852059 1751519
60952 1751519 1662525 1585454 1520470 1466081 1419849 1379501 1342768 1307244 1271443 1235524 1200357
60941 1200357 1166360 1133660 1102597 1073344 1045469 1018538 992729 968337 945126 922746 901408
60930 901408 881464 862583 843928 825054 806120 787311 768524 749724 731282 713763 697435
60919 697435 682054 667229 652991 639783 627793 616624 605907 595939 587237 579745 573011 566947
60907 566947 561738 557167 552766 548649 545389 542995 540797 538571 536978 536464 536340 535433 533212 529858 525629
60892 525629 520671 515264 509870 504848 500163 495324 489744 483432 477127 471435 466133 460838 456000 452391
60878 452391 449784 447143 444244 442014 440907 439935 437989 435370 433273 432255 431982 432172 433049 434872 437528
60863 437528 440651 443984 447663 452248 458266 465647 473821 482304 490806 498766 505384 510317 513920 516644
60849 516644 518639 520085 521335 522437 522950 522471 520892 517973 513289 506925 499655 492045 483898 474992 465821
60834 465821 457117 449048 441416 434253 427700 421605 415778 410455 406112 402967 400996 400184 400460 401667 403888
60819 403888 407396 411948 416547 420380 423738 427543 432252 437588 443010 447959 451963 455083 458120 461791
60805 461791 465824 469300 471809 473789 475857 478295 481192 484583 488309 492003 495308 497993 499890 500952
60791 500952 501244 500745 499305 496916 493829 490165 485720 480380 474430 468092 461092 453166 444807 436969 430077
60776 430077 423773 417593 411499 405743 400606 396369 393230 391098 389657 388664 388059 387821 387924 388399 389279 390419
60760 390419 391508 392261 392602 392752 393135 394015 395223 396453 397827 399821 402530 405445 408200 411149 414935
60745 414935 419814 425678 432374 439544 446464 452535 457849 462908 467937 472814 477405 481551 484906 487268
60731 487268 489026 490807 492707 494211 494906 494891 494460 493693 492476 490780 488907 487449 486812 486610 485836 483874
60715 483874 481126 478390 475930 473495 470876 467858 463847 458279 451460 444473 438139 432426 426981 421738
60701 421738 416858 412367 408096 403809 399288 394537 390004 386411 384218 383266 382915 382457 381556 380489 379931
60686 379931 380341 381652 383604 386081 388942 391898 394946 398674 403599 409356 415130 420792 427010 434074
60672 434074 441255 447580 452800 457177 460687 462925 463696 463281 462013 459846 456546 452213 447407 442630 437865
60657 437865 432850 427718 422950 418657 414414 410122 406615 404884 404943 405967 407369 409128 411169 413138 414915
60642 414915 416692 418271 418826 417851 415966 414334 413440 412819 411843 410387 408824 407778 407936 409659 412522 415494
60626 415494 417845 419813 422103 424863 427547 429889 432499 436098 440460 444660 448257 451557 454686 457139
60612 457139 458673 460081 462449 465981 470111 474648 480149 487151 495457 504308 512906 520719 527611 533760
60598 533760 539280 543903 547325 549880 552531 555975 559867 563034 564478 564184 562990 561652 560110 557832
60584 557832 554830 551952 549980 548829 547920 547015 546315 546050 546475 548069 551157 555398 560181 565489 571891
60569 571891 579662 588516 598377 609892 623866 640436 659118 679431 701274 724754 749755 775588
60557 775588 801054 825026 847046 867322 886351 904785 923434 942951 963435 984699 1006913
60546 1006913 1030547 1055640 1081556 1107602 1133421 1158503 1181684 1201551 1217275 1228797 1236298
60535 1236298 1239637 1238116 1230682 1216634 1196398 1171557 1143823 1114054 1082417 1049441 1016590 985675
60523 985675 957787 932886 910244 889134 869160 850304 832911 817430 803806 791176 778623
60512 778623 766379 755818 747949 742239 737268 732152 726855 721414 715648 709714 704305 700033 697056 695588
60498 695588 696444 700712 709083 721763 738928 760912 787846 819129 853239 887977 920887 949498
60486 949498 971397 984465 987301 979453 961266 933744 898720 858795 816721 774766 734609 697459
60474 697459 663888 633745 606665 582595 561589 543334 527302 513221 500981 490209 480453 471734
60462 471734 464373 458208 452477 446578 440526 434597 428967 423853 419515 415908 412651 409550 406804 404524
60448 404524 402446 400385 398612 397482 396887 396341 395404 393839 391650 389223 387247 386114 385463 384578 383147
60433 383147 381424 379778 378418 377551 377403 377819 378061 377350 375668 373763 372278 371165 370141 369384 369318 369902
60417 369902 370785 372158 374696 378353 381910 384266 385602 386707 387665 388031 387931 388081 388752 389517 390078 390575
60401 390575 390998 391024 390675 390529 390938 391535 391831 392003 392802 394803 397728 400390 401510 401023 400350 400902 402518
60384 402518 404005 404907 405844 407206 408594 409757 411062 412637 413944 414674 415236 415820 415846 415007 414139 414298 415505
60367 415505 417080 418588 419680 419636 418172 416414 416006 417269 419066 420459 421606 422960 424478 425987 427647
60352 427647 429573 431445 432877 433870 434663 435425 436390 437998 440490 443503 446448 449332 452886 457683 463379
60337 463379 469094 474530 480343 487281 495211 503203 510296 515787 519036 519572 517510 513459 507918 501200
60323 501200 493925 487053 481148 476039 471504 467839 465395 463897 462696 461516 460621 460374 460934 462319 464542
60308 464542 467687 471910 477284 483789 491796 502548 517645 537816 562432 590167 619538 648624
60296 648624 674956 696274 711124 718456 717233 707084 689192 666065 640580 615405 592708 573607
60284 573607 557866 544605 533317 524018 516708 511146 507042 504026 501568 499279 497218 495636 494613
60271 494613 494255 494995 497213 500605 504283 507382 509330 509779 508757 506775 504368 501529 497864 493141 487411
60256 487411 480861 474035 467964 463456 460214 457168 453758 450454 447926 446202 444864 443710 442805 442068 441182
60241 441182 439990 438754 437766 436822 435407 433609 432432 432750 434172 435542 436507 437823 439999 442497 444713
60226 444713 446989 449969 453460 456664 459229 461459 463704 466143 468935 472011 474881 477168 479221 481679
60212 481679 484616 487579 490355 493263 496851 501692 508122 515621 522815 528700 533631 538524 543476 548017
60198 548017 552340 557191 562515 567300 571000 574248 577795 581501 584719 587001 587985 587244 584817 581544 578403
60183 578403 575702 573119 570183 566517 562028 557206 552893 549462 546444 543179 539556 535866 532272 528792
60169 528792 525613 523098 521454 520582 520183 519986 519983 520497 521802 523597 525075 525702 525820 526314 527640 529240 530085
60152 530085 529941 529974 531652 534980 538343 540446 541899 544319 548267 552804 556944 560777 565159 570952 578715
60137 578715 588542 600069 612993 627562 644020 661585 678581 693595 705931 714948 719836 720373
60125 720373 717207 711034 702183 691424 680392 670522 662034 654653 648863 645579 644703 644914 645118 645469 646678
60110 646678 648769 650991 652674 653780 654552 654972 654681 653279 650556 646585 641815 636968 632528 628340 623959
60095 623959 619421 615282 611928 609373 607882 608154 610458 614150 618539 623728 629966 636746 643440 650452
60081 650452 658725 668171 677589 686137 693906 700779 705736 707721 706566 702655 696339 688100 678713 668743
60067 668743 658183 646939 635294 623690 612433 601827 592205 583594 575759 568665 562439 556796 551089
60054 551089 545131 539363 534081 529133 524584 520905 518149 515752 513697 513082 514827 518420 522697 527390
60040 527390 533065 539845 547061 554138 561114 568223 575416 582360 588653 594168 599334 604761 610295 614829
60026 614829 617460 618376 618072 616112 611444 603794 594019 583052 571123 558131 544294 530231 516680
60013 516680 504229 493088 483068 473917 465608 458223 451808 446558 442828 440621 439235 437850 436404
60000 436404 435564 435898 437322 439253 441069 442514 443839 445476 447454 449405 451279 453701 457283 461910 466930
59985 466930 471765 476077 479702 482840 485958 489121 491757 493425 494362 494741 493901 491049 486423 480994 475277
59970 475277 469251 463316 458316 454502 451339 448545 446550 445613 445306 445307 446027 447821 450078 451752 452571 453078
59954 453078 453638 453944 453539 452320 450450 448226 446279 445518 446444 448569 450829 452622 454090 455391 456142 455985
59938 455985 455305 454745 454072 452284 449074 445532 442957 441455 440228 438830 437516 436565 435955 435720 436034 436765
59922 436765 437373 437449 437167 437040 437380 438038 438609 438966 439602 441177 443673 446373 448944 452057 456431 461617 466422
59905 466422 470353 473879 477305 480196 482131 483404 484608 486010 487681 489834 492513 495211 497223 498405
59891 498405 499361 500882 503355 506684 510666 515386 521136 527923 535177 542176 548741 555277 562219 569667
59877 569667 577510 585622 593812 601787 609183 615451 619742 621211 619562 615146 608532 600196 590578 580168
59863 580168 569443 558914 549194 540745 533602 527678 523321 521039 520576 520800 520888 521204 522561 525038 528189
59848 528189 532289 538571 547964 560108 573955 588815 604087 618206 628737 634028 634488 632065 628889
59835 628889 626709 626939 630162 635458 640931 645228 648114 649555 649025 646184 641606 636168 630062 622981 614951
59820 614951 606318 597127 587201 576755 566348 556241 546395 537119 529044 522373 516729 511845 507772
59807 507772 504251 500615 496773 493641 492025 491428 490617 489085 487346 485853 484264 481973 478869 475234 471142
59792 471142 466357 460913 455527 451159 448072 445562 442850 440105 438227 437554 437253 436291 434746 433668 433764
59777 433764 434672 435640 436443 437309 438207 438726 438653 438337 438288 438684 439423 440489 441989 443915 446131 448592 451371
59760 451371 454433 457588 460617 463289 465307 466576 467555 469060 471577 474956 478779 482680 486259 489138
59746 489138 491398 493651 496423 499645 502871 505654 507551 508245 508077 508053 508821 509897 510345 509981 509369 508901
59730 508901 508533 508314 508450 508752 508663 508011 507306 507111 507543 508582 510368 512843 515388 517185 517844 517580 516926
59713 516926 516454 516555 517291 518403 519506 520251 520561 520878 522009 524328 527188 529490 530799 531485 531785 531379
59697 531379 530150 528868 528658 529956 532300 534985 537602 540079 542434 544498 545796 545816 544569 542737 541155
59682 541155 540243 540062 540670 542167 544445 547190 550115 552958 555209 556079 555018 552242 548625 545018 541732
59667 541732 538705 536026 534137 533532 534383 536419 538971 541095 541872 540846 538162 534321 529962 525860 522794
59652 522794 521170 520886 521730 523707 526793 530559 534340 537694 540475 542519 543512 543128 541179 537716 533171
59637 533171 528293 523752 519837 516627 514314 513205 513545 515361 518286 521409 523727 524984 525831 526931 528317
59622 528317 529922 532256 535867 540328 544387 547058 548133 547722 545914 542950 539263 535289 531586 529031
59608 529031 528301 529133 530605 532317 534802 538595 543323 547987 551830 554693 556716 557949 558202 557173 554800
59593 554800 551406 547420 543095 538671 534536 530863 527327 523616 520086 517332 515180 512717 509458 505949
59579 505949 502939 500397 497644 494246 490546 487375 485358 484385 483793 483085 482308 481653 481068 480577 480565 481263 482248
59562 482248 483081 484157 486231 489217 492241 494807 497099 499084 500259 500646 501277 503141 506088 509152 511622
59547 511622 513502 515221 517149 519246 521116 522631 524393 527267 531701 538077 547482 561305 579998 602779
59533 602779 628282 654388 677464 693325 700019 699265 694772 689772 686358 685965 689350 696399 706638
59520 706638 719614 734422 749477 763373 775545 785664 792984 796858 797287 794321 787506 776703 762943
59507 762943 747637 731279 713691 695198 676684 658815 642036 627113 614676 604288 594899 586361
59495 586361 579690 575630 573648 572562 571511 570130 568391 566684 565672 565713 566650 568294 570778 574294 578777
59480 578777 584074 590191 597276 605551 615401 627328 641618 658052 675907 694114 711487 726950
59468 726950 739578 748476 752937 752999 749762 744872 739726 735288 732461 732246 735439 742388 753101 767567
59454 767567 785916 808299 834525 863958 896120 931445 971153 1016136 1066089 1119561 1174126
59443 1174126 1225964 1269623 1299029 1309382 1298720 1268463 1223001 1168417 1110762 1054715 1003093
59432 1003093 956922 915865 879090 846072 816531 789911 765681 744289 727077 714890 707415
59421 707415 704170 705344 711074 720711 733684 750508 771937 797504 825904 856626 890149 926486
59409 926486 964272 1000999 1032904 1054633 1060775 1049281 1023334 989422 953740 920473 892370 871525
59397 871525 859139 854980 857159 862039 864411 858813 842018 814928 781834 747451 714552 684165
59385 684165 657049 634023 615124 599515 586564 576178 567815 560100 552183 544826 539305 535651 532785
59372 532785 530063 527748 526042 524558 523028 521871 521712 522647 524124 525347 525820 525801 526210 527849 530807 534800
59356 534800 539799 545949 553164 561351 570941 582696 597118 614408 634822 658480 684874 713123
59344 713123 742772 773929 806624 840407 874472 907760 938976 966963 990990 1010385 1024115
59333 1024115 1031241 1031585 1025408 1012687 993427 968615 940091 909360 877165 844203 811474 779733
59321 779733 749321 720812 695179 672935 653621 636505 621350 608167 596696 586587 577809 570523
59309 570523 564764 560501 557778 556499 556258 556625 557530 559220 562079 566612 573521 583633 597769 616479
59295 616479 639393 664557 688529 707424 718225 719676 712525 699022 681907 663635 646273 631459
59283 631459 619872 610951 603770 598205 594864 593995 595086 597592 601579 607502 615796 626820 640809 657695
59269 657695 677212 699110 722939 747718 772267 795876 818093 837902 853734 864524 870231 871197
59257 871197 867544 859530 847936 833664 817266 799250 780604 762580 746037 731147 717622 705068
59245 705068 693338 682774 674090 667884 664291 663143 664383 668282 675226 685132 697047 709697 722632
59232 722632 736458 751605 767240 781856 794541 804955 812391 815719 814325 808401 798330 784513
59220 784513 767852 749576 730326 710047 688941 667893 647760 628982 612046 597515 585154
59209 585154 573811 562765 552552 543941 536693 529998 523677 518149 513517 509435 505746 502611 500018
59196 500018 497689 495545 493838 492760 492243 492189 492654 493737 495475 497805 500480 503064 505189 506832 508296
59181 508296 510048 512584 516239 520918 526087 531183 536047 540969 546376 552519 559407 567084 575974 586711
59167 586711 599511 614003 630011 648158 669094 692312 716287 739762 762256 783288 801842
59156 801842 816960 828323 835925 839573 839003 834101 824748 810892 793150 773039 752259 731935 712682
59143 712682 695036 679392 665690 653477 642250 631695 621797 612803 604862 597682 590816 584278 578480
59130 578480 573490 568879 564494 560898 558713 557880 557833 558099 558441 558794 559483 561275 564861 570281 577052 584748
59114 584748 593334 603088 614269 626742 639936 653346 666986 681045 695183 708674 721309 733633
59102 733633 746088 758367 769790 779923 788563 795511 800645 804072 806002 806673 806419 805564 804284 802891
59088 802891 802118 802572 803840 804702 804320 802649 799604 794604 787280 778089 767792 756779 745182 733139
59074 733139 720531 706912 692209 677247 663304 651323 641587 633625 626290 618594 610864 604525 600313
59061 600313 597302 594163 590768 587800 585242 582247 578431 574523 571434 569165 566863 563718 559606 554916
59047 554916 549955 544713 539315 534361 530425 527343 524498 521814 519917 519267 519716 521041 523301 526437 530045
59032 530045 533832 537789 541782 545584 549571 554654 561161 568439 576023 584598 595228 608137 622859
59019 622859 639069 656605 674955 693321 710994 727235 741044 751522 758297 761393 761004 757782
59007 757782 752993 747985 743714 740952 740412 742267 745979 751034 757520 765693 775425 786462 798733 811982
58993 811982 825543 838902 852105 865175 877602 888814 898614 906612 911695 912689 909271 901809 890735
58980 890735 876594 860353 843111 825793 809427 795156 783422 773574 764935 757888 753457 752236
58968 752236 754242 759277 766737 775549 785078 795876 808873 824097 840741 858092 875668 892656
58956 892656 907830 919947 927801 930291 927022 918592 905860 889249 869238 847021 824097 801584
58944 801584 780419 761616 745638 732011 720364 711360 705846 703481 703047 703632 704615 704899 703293 699546
58930 699546 694100 687025 678073 667701 657066 646947 637398 628448 620437 613609 607951 603375 599582
58917 599582 596061 592801 590651 590266 591112 592288 593929 596852 601203 606501 612764 620459 629505 639536
58903 639536 651181 665902 684368 705971 730026 756333 784170 811763 837227 859474 878021
58892 878021 892853 904861 915806 927577 941934 960924 986410 1018727 1056347 1097186 1139609
58881 1139609 1181971 1222029 1257529 1287111 1310300 1326909 1336610 1338754 1332412 1316826 1291975 1258639
58869 1258639 1218252 1173054 1126001 1079780 1035970 995525 959602 928981 902908 879617 858131
58858 858131 838764 821778 806516 792038 777763 763205 747942 732262 717181 703449 691073
58847 691073 679999 670583 662979 656676 651020 645764 640780 635656 629992 623807 617415 611121 605171 599701
58833 599701 594626 589770 585050 580292 575100 569312 563424 558046 553171 548546 544579 542100 541232 541221 541519
58818 541519 542414 544441 547721 552036 557144 562832 568880 574925 580195 583739 585379 586102 586983 588047 588688
58803 588688 588739 588399 587546 585994 584108 582280 580157 577315 574376 572334 571050 569605 568013 567323 567972 569321
58787 569321 571021 573619 577460 582146 587524 594234 602766 612683 623121 633420 643023 651550 659196 666375
58773 666375 672763 677362 679562 679479 677335 673385 668402 663251 657916 651930 645759 640664 637082 634277 631743
58758 631743 629771 628437 627307 626629 627659 631254 636979 643910 651327 658366 664202 669066 674043 679408
58744 679408 684291 688408 692922 698884 705892 713029 720109 727241 734035 740156 745961 751898 757851 763716
58730 763716 770017 777439 786288 796702 808608 821099 832679 842596 851213 858769 864736 868834 871743
58717 871743 874328 876990 880211 884761 890934 898520 907838 919629 933367 946952 958736 968728 977049
58704 977049 982532 983933 981471 975995 967385 954871 938285 918035 894474 868248 840788 813628
58692 813628 787684 763686 742542 724538 708895 694903 682846 673131 665189 657890 650386 641995
58680 641995 632232 621754 612372 605190 599426 593837 588506 584328 581598 580109 580009 581556 584606 589200
58666 589200 596126 606108 619000 634428 652398 672432 692813 711640 727914 740866 749224 752361
58654 752361 751527 748761 745036 740351 734992 729532 724019 718187 712128 705949 699262 691924 684743 678594
58640 678594 673338 668507 664542 662450 662631 664818 668627 673410 678197 682604 687212 692261 696688 699289
58626 699289 700058 699432 697162 693079 688238 684018 680627 677739 676008 676668 680092 686076 695199 708582 726402
58611 726402 747668 771195 795744 819374 839759 855299 865445 870400 871219 869683 867112 863593 858886
58598 858886 853447 847782 841577 834444 826880 819536 812268 804878 798028 792305 787240 782528 779490 779892
58584 779892 783869 790411 799282 810901 824731 839368 854071 868814 883032 895676 906432 915647
58572 915647 923205 928709 932656 936268 940316 945157 951622 960651 972238 985847 1001581 1019791 1039911
58559 1039911 1061030 1083296 1107282 1131997 1154980 1174478 1190360 1202807 1211288 1215088 1214011 1208471
58547 1208471 1199591 1188997 1177745 1165651 1152272 1137963 1123150 1107324 1089898 1071324 1052118
58536 1052118 1031538 1008783 984957 962207 941313 921713 903614 888305 876415 867398 860833 856789
58524 856789 854924 854645 856214 860363 866765 874187 882111 890932 900464 909554 917218 923139 927070 928941
58510 928941 929475 929638 929627 929365 929517 930808 932753 934434 936127 938802 942449 946478 951281 957685 965179 972473
58494 972473 979556 987275 994999 1000783 1003961 1005680 1006530 1005565 1002045 996445 989296 980682 971443 963379 957679
58479 957679 954369 953596 956072 961897 970202 980221 991463 1002652 1011880 1018093 1021205 1020766 1015916 1006866
58465 1006866 995005 981419 966624 951676 937975 925830 914709 904935 897539 892403 888327 885163
58453 885163 884142 885762 889139 893775 900079 907496 913837 917334 918156 917249 914929 911139 905971 899531 892268
58438 892268 885519 880593 877337 874859 873453 874283 877383 881703 887027 893908 901728 908956 915738 924271
58424 924271 936159 951190 969079 990351 1014759 1040458 1065315 1087472 1104435 1113717 1115250 1111625
58412 1111625 1105329 1097208 1087793 1078071 1068232 1057429 1045570 1033796 1022618 1011267 999546 988701
58400 988701 979756 972441 966409 962071 959696 958935 959646 961947 965385 969365 974185 980001 985062 987027 985843
58385 985843 983259 979771 974633 968788 964868 963776 963928 964442 966388 970114 973956 976535 978048 978582 977706
58370 977706 976487 977290 980568 984326 987665 992233 999169 1007265 1015485 1024809 1036240 1049181 1063047 1078234
58356 1078234 1094374 1109790 1123657 1136453 1147481 1154567 1157218 1157520 1156884 1154663 1150966 1147872 1146477
58343 1146477 1145588 1144732 1145576 1148945 1153441 1158572 1166199 1177109 1189247 1201278 1214822 1231041 1248064
58330 1248064 1264194 1280823 1299505 1318673 1335872 1350979 1364762 1376461 1385274 1392271 1398567 1403534
58318 1403534 1406845 1410198 1414972 1420241 1425028 1430337 1437082 1444339 1451605 1460481 1472169 1485632 1499989
58305 1499989 1516155 1534221 1551950 1568001 1584020 1601543 1619582 1637247 1655762 1675670 1695014
58294 1695014 1712634 1730317 1749398 1768357 1786146 1804617 1825064 1845581 1864669 1884219 1906140
58283 1906140 1929224 1952279 1977081 2005145 2034756 2064214 2094856 2127768 2160840 2192258 2223685
58272 2223685 2256854 2290491 2323812 2359497 2399859 2443618 2489780 2540784 2598218 2659372 2721832
58261 2721832 2787491 2858135 2931256 3004418 3079464 3157945 3236661 3312421 3387016 3462730 3537272
58250 3537272 3608312 3678830 3752728 3829300 3907301 3990089 4081222 4179193 4281987 4392309 4512684
58239 4512684 4640234 4772284 4912230 5063731 5224341 5391424 5568827 5760676 5964266
58230 5964266 6176662 6402581 6647615 6909402 7184166 7476324 7792567 8132207 8492947
58221 8492947 8880503 9302565 9759039 10248650 10779392 11361729 11997678 12688006 13443927
58212 13443927 14279983 15202481 16218056 17346685 18612785 20031508 21619094 23409182
58204 23409182 25443803 27758656 30396889 33429926 36947831 41044159 45839143 51514589
58196 51514589 58310692 66515049 76502922 88795420 104063806 123108220 146861800
58189 146861800 176294987 212003420 253514429 298688194 343610096 383121371 411935783
58182 411935783 426126163 424444013 408718890 382981268 351815831 318932819 286581634
58175 286581634 255732124 226612731 199259301 173851514 150727603 130177633 112273845
58168 112273845 96884895 83781756 72697024 63340684 55435029 48751309 43101421
58161 43101421 38311551 34227878 30735428 27746834 25178319 22952915 21016376 19329508
58153 19329508 17849785 16535399 15360034 14307432 13356298 12484292 11681539 10946465 10272357
58144 10272357 9649871 9077811 8558888 8088163 7656527 7261850 6906042 6584424 6287996
58135 6287996 6012859 5757816 5516133 5279703 5048991 4829936 4623446 4426315 4239624
58126 4239624 4067232 3907936 3757338 3615669 3486013 3366654 3252810 3144210 3043586
58117 3043586 2949260 2856576 2765433 2679522 2599152 2521291 2445579 2374088 2306214 2239802 2176155
58106 2176155 2118093 2064258 2011080 1959167 1911972 1869166 1826986 1784334 1743161 1703649 1664212
58095 1664212 1625474 1589298 1554710 1519523 1484943 1453804 1425396 1396898 1368744 1343597 1321038
58084 1321038 1298347 1275651 1255292 1236811 1217447 1197077 1177865 1159584 1139999 1119368 1099900
58073 1099900 1081183 1060823 1039289 1019494 1001765 983720 965013 947811 932625 917952 903968
58062 903968 892360 882525 872101 861235 852149 844512 835484 824460 813499 802893 790644 776933
58050 776933 764761 755253 746185 736178 726716 718995 712152 705671 700479 696623 692661 688069 683655 679200
58036 679200 673489 666958 661380 656652 650825 643625 636825 630736 623468 614327 604995 596632 588664 581067
58022 581067 575047 570710 566713 562830 560303 559102 557541 555185 553483 552864 551916 550147 548900 548704 548292
58007 548292 547125 546384 546468 545920 543924 541711 540384 539277 537476 535213 532854 530060 526603 522705 518324
57992 518324 513607 509942 508661 508846 508540 507967 509133 512141 514622 515239 515088 514937 513669 510510 506560 503004
57976 503004 499676 496291 493259 490464 486973 482739 478939 476080 473398 470542 468053 465833 463155 460640
57962 460640 460121 461885 464056 465434 466958 469555 472490 474770 476463 477708 478022 477432 476788 476242 474839
57947 474839 472239 469377 466947 464725 462805 461813 461472 460649 459341 458930 459992 461505 462778 464410 466839
57932 466839 469650 472878 477258 482631 487769 492252 496774 501210 504317 505878 507111 508253 507780 504911
57918 504911 500941 497072 492684 486785 479565 471595 462990 454212 446140 438589 430389 421631 414103 408715
57904 408715 404254 399562 395083 391270 387318 382693 378232 374524 370747 366354 362394 359930 358524 357468
57890 357468 357156 358024 359404 360594 361922 363809 365999 368560 372216 376749 380652 383462 386815 391882 397259
57875 397259 400858 402541 403356 403429 402259 400173 397856 395111 391440 387181 382937 378517 373582 368673 364539
57860 364539 361038 357641 354416 351672 349293 347146 345543 344715 344625 345702 348690 353245 357897 362056 366721
57845 366721 372485 378320 383340 388319 394118 399810 403788 405851 406898 407334 406951 405717 403617 400382 396252
57830 396252 392333 389330 386725 383902 381113 378561 375642 372148 369248 368164 368656 369713 370933 372338
57816 372338 373765 375378 377907 381518 385301 388583 391556 393747 393219 388482 380196 369922 358386 346118
57802 346118 334469 324392 315181 305911 297300 290612 285475 280290 274376 268312 262682 257803 254252 252408
57788 252408 251692 251161 250419 249226 246984 243602 240153 237693 236179 235449 236231 238995 242709 246091 249357
57773 249357 253450 258320 263380 268988 275920 283785 291296 297752 303100 307003 309118 309896 310021 309466 308071
57758 308071 306383 304785 302469 298558 293646 288987 284724 280167 275159 269949 264372 258615 254133 252251
57744 252251 252334 252764 253097 253672 253781 252224 249416 247012 245461 243732 241536 240001 239828 240386 241038 241851 242535
57727 242535 242131 240437 238627 237781 237725 237827 238132 239084 240707 242475 243723 244105 244014 244347 245388 246215 245825
57710 245825 244499 243264 242380 241249 239524 237359 234833 232051 229657 228315 227854 227732 228037 229117 230658
57695 230658 232143 233870 236271 238505 239056 237701 235657 233766 231720 229186 226526 224157 222189 220935
57681 220935 220929 222268 224656 228123 232929 238882 245602 253433 263340 276099 292460 313946 342558 379838
57667 379838 426895 484568 551714 622895 688832 739623 767655 769029 744770 701240 647626 591645
57655 591645 537582 487642 443441 405681 373824 346978 324523 305615 289087 274360 261778
57644 261778 251731 244055 238432 234539 231561 228429 224841 221427 218699 216543 214832 213724 213115 212561
57630 212561 211976 211749 211969 212217 212248 212217 212139 211768 211132 210561 210123 209584 208847 207856 206336 204314 202623 201978 201848
57611 201848 201199 200110 199570 199883 200495 201182 202013 202176 200459 197259 194629 193776 193730 193092 191901 191021 190656
57594 190656 190295 189455 187861 185444 182658 180234 178318 176394 174265 172396 171087 170067 169091 168225 167365
57579 167365 166318 165431 165221 165246 164394 162554 160893 160096 159469 158311 157095 156539 156381 155884 154958 154083 153572
57562 153572 153390 153238 152518 150795 148590 147158 147171 148200 149610 151229 152961 154558 156099 157882 159635
57547 159635 160609 160762 160948 161662 162432 162803 163025 163437 164054 165055 166745 168723 170093 170788 171583 172438 172157
57530 172157 170245 167760 165557 163063 159809 156845 155340 154780 153979 153048 152873 153265 153226 152812 153181 154694
57514 154694 156285 157050 157436 158401 160116 161982 163501 164690 165732 166512 166642 166016 165129 164448 163587 161700
57498 161700 158801 156048 154394 153505 152393 150557 148136 145381 142513 139812 137540 135939 135338 135801 136633
57483 136633 136818 136131 135313 135008 135186 135698 136639 137890 139024 139882 140564 140682 139527 137251 134948 133204 131549
57466 131549 129768 128686 128985 130158 131340 132334 133159 133462 133245 133404 134734 136951 139368 141783 144031 145457
57450 145457 145783 145843 146539 147619 148274 148383 148298 147994 147346 146777 146769 147132 147552 148359 149930 151799 153205 154114 154885
57431 154885 155355 155112 154321 153513 152908 152617 152925 153654 153875 153211 152808 153974 156318 158307 159250 159615 159793 159801
57413 159801 160019 160958 162275 163039 162995 162667 162328 161832 161415 161593 162167 162296 161680 160844 160185 159588 159143 159380 160475
57394 160475 161938 163304 164556 165712 166537 166851 166725 166342 166038 166332 167428 168876 170304 172181 175076 178368
57378 178368 180609 181228 181099 181250 181773 182207 182272 181907 181072 179887 178672 177710 177115 176905 176953 177042 177217 177823 178859
57359 178859 179696 179958 180260 181367 182910 183764 183547 182985 182905 183619 185220 187626 190236 192294 193775 195299
57343 195299 197043 198383 198797 198604 198570 199165 200310 201498 202165 202276 202524 203565 205137 206341 206674 206391 205998
57326 205998 205913 206506 207989 210202 212759 215302 217431 218788 219573 220503 221858 223049 223649 224208 225314 226460
57310 226460 226804 226616 226871 227704 228361 228524 228636 229007 229609 230666 232398 234176 235058 235226 235845 237377 239108
57293 239108 240558 242175 244278 246410 248238 250200 252664 255244 257476 259551 261842 264263 266504 268451
57279 268451 270065 271297 272367 273639 275106 276561 278297 280824 283752 285836 286506 286611 287308 288966 291513
57264 291513 295017 299346 303882 308177 312413 316854 321460 326439 332422 339475 346575 352725 358073 363287
57250 363287 368345 372791 376849 381375 386734 392434 397975 403549 409741 416860 424679 432597 440050 446892
57236 446892 453443 460104 467030 474213 481732 489794 498516 507617 516357 524144 531436 539688 549903 561493
57222 561493 573159 584659 596914 610411 624415 638014 651140 664092 676742 688821 700642
57211 700642 712941 726080 739733 753340 766701 780196 794383 809176 823539 836380 847685
57200 847685 858370 869066 879540 889321 898297 906621 914636 923136 933190 945359 959307 974230
57188 974230 989404 1004407 1019373 1035074 1052116 1069910 1086946 1102291 1116378 1130239 1144497
57177 1144497 1159220 1174125 1188669 1202457 1215861 1229909 1245356 1262148 1279746 1297507 1314840
57166 1314840 1331624 1348625 1366869 1386512 1406841 1427375 1448189 1469035 1489078 1507940 1526321
57155 1526321 1545077 1564236 1583332 1602215 1621041 1639810 1658271 1676088 1692974 1709007 1724875
57144 1724875 1741397 1758702 1776244 1793571 1810634 1827553 1844828 1863647 1885059 1908745 1933503
57133 1933503 1959049 1986373 2016105 2047556 2079781 2112575 2145880 2179038 2211232 2241977 2270845
57122 2270845 2297634 2323379 2350389 2380592 2414576 2452845 2497269 2550506 2614524 2690299 2778410
57111 2778410 2879228 2992921 3119977 3261644 3419756 3596661 3795584 4020568 4276073
57102 4276073 4567457 4902235 5290276 5742876 6272854 6896073 7632250 8504314 9538111
57093 9538111 10762456 12207194 13899342 15860283 18104199 20634467 23438189 26483379
57085 26483379 29719901 33080353 36481376 39830345 43033730 45993758 48593059 50691456
57077 50691456 52155598 52905224 52936106 52302844 51084654 49364348 47224939 44750023 42021059
57068 42021059 39115590 36108159 33069936 30065566 27150640 24371412 21764632 19356391
57060 19356391 17161658 15185567 13425277 11871545 10510449 9325301 8298061 7410303
57052 7410303 6644315 5984045 5415155 4924579 4500568 4133164 3814177 3536533 3293878
57043 3293878 3080827 2893212 2727702 2581041 2449758 2330741 2222013 2122692 2032220 1949931
57033 1949931 1875411 1808714 1749911 1698948 1656434 1624259 1604969 1601085 1615790 1653539 1717949
57022 1717949 1807227 1910693 2009304 2080412 2105305 2076534 2000582 1893382 1771981 1648853
57012 1648853 1531482 1424133 1328580 1244342 1169976 1104558 1047710 998705 956252 919113 886451
57001 886451 857691 832354 809958 789903 771496 754256 738102 723178 709586 697257 685904
56990 685904 675237 665559 658096 654355 655032 659764 667762 678181 689815 700880 709253 712742 709381
56977 709381 698210 680100 657453 632860 608178 584621 563027 543751 526769 512159 500240
56966 500240 491155 484676 480531 478676 479217 482503 489343 500629 516475 535876 557021 577470 594134
56953 594134 603899 604860 596859 580933 558770 532674 505326 479023 455307 435260 419472 407504
56941 407504 398078 390378 384889 382725 384579 390717 401450 417008 437235 461909 491018 523864 557706
56928 557706 587778 609074 618318 614704 599549 575580 546214 514781 483846 454966 428886 405771
56916 405771 385290 366835 350068 335311 323051 313067 304425 296544 289794 284665 280785 277244 273690
56903 273690 270630 268807 268679 270248 272866 275386 277105 278510 280611 283655 287073 290605 294777 300257
56889 300257 307394 316572 328350 342922 359600 376839 392361 403379 407440 403508 392165 374937
56877 374937 353864 331446 310159 291630 276556 265326 258141 254635 254186 256859 263419 274295 289287
56864 289287 308700 334137 367610 410063 460807 517589 576495 631957 677485 707121 717169
56853 717169 707722 682846 648688 610718 572500 536316 503884 476248 453862 437241 427085 423629
56841 423629 426654 436540 454712 482745 521741 572965 638140 717849 809437 906495 999849 1078851
56829 1078851 1133125 1155338 1143782 1102792 1040727 967125 890417 816588 748939 688785 636483
56818 636483 592136 555889 527880 508003 496005 492193 497941 515036 544485 586246 639763 703657
56806 703657 774296 844938 906596 950033 968174 958538 924318 872578 810796 744942 679906 619829
56794 619829 567063 521708 483033 450890 425310 405656 391193 382056 378896 381916 391057 406840
56782 406840 430146 460929 497195 534874 568444 592417 603133 599465 582123 553059 515731 474733
56770 474733 434065 395885 361169 330709 304718 282198 261888 243600 227862 214596 203044
56759 203044 192760 183811 176114 169395 163741 159430 156159 153039 149431 145359 141312 138066 136374 136150
56745 136150 136173 135296 133727 132521 132063 131871 131665 131634 131644 131133 130116 129462 129822 130824 131715 132294 132851 133508
56727 133508 134002 134005 133506 132924 132818 133384 134286 135042 135391 135176 134293 133113 132547 133143 134371 135256 135573 135917 136824
56708 136824 138278 139912 141229 141847 142038 142751 144509 146554 147707 147860 147825 147856 147226 145432 143032 140985
56692 140985 139685 138904 138227 137348 136240 135189 134371 133441 131917 129907 128081 126938 126454 126314 126074 125269
56676 125269 123896 122652 122112 121829 120937 119562 118864 119604 121393 123484 125543 127365 128576 129166 129831 131278
56660 131278 133400 135353 136316 136114 135397 135227 136081 137252 137678 137394 137499 138606 140001 140725 140846 141115 141800
56643 141800 142453 142617 142266 141641 141101 141087 141854 143119 144228 144788 145052 145651 146981 148874 150846 152535 153822
56626 153822 154631 154934 155039 155532 156633 157837 158481 158454 158102 157719 157581 158239 160130 162877 165427 167039 167814
56609 167814 168266 168788 169590 170707 171909 172826 173339 173696 174199 174993 176133 177579 179077 180243 180862 181050 181149
56592 181149 181500 182150 182728 182821 182527 182385 182645 183115 183847 185355 187686 189853 190894 191084 191388 192042 192466 192364
56574 192364 192028 191607 190893 190000 189489 189560 189655 189160 188157 187346 187507 189010 191571 194546 197832 202319 209080
56557 209080 218221 228859 239790 249634 256842 260611 261813 262260 262983 263836 264556 265225 265623 265161 263777
56542 263777 262173 260817 259384 257453 255102 252517 249629 246466 243320 240235 236886 233288 230159 228133
56528 228133 226905 225478 223046 219561 215729 212521 210410 209050 207870 206723 205604 204189 202354 200789
56514 200789 200139 199797 198602 196719 195651 196153 197272 197808 197681 197306 196643 195617 194725 194447 194556 194531 194235
56497 194235 193745 193000 192037 191130 190356 189571 189026 189245 189897 189590 187498 184573 182520 182032 182606 183594 184726
56480 184726 185882 186995 188063 188923 189329 189507 190223 191906 194037 195739 196616 196840 196849 197260 198487 200166 201423
56463 201423 201971 202322 202725 202736 202276 202207 203163 204494 205169 205154 205122 205326 205580 205941 206594 207307 207751 208134 208916 210051
56443 210051 211116 211918 212420 212364 211579 210436 209422 208473 207267 205971 205078 204758 204903 205605 207004 208807 210506
56426 210506 211932 213126 213950 214385 214946 216149 217644 218576 218770 218981 219943 221687 223831 226054 228088 229665
56410 229665 230688 231267 231576 231774 231991 232246 232437 232581 232890 233448 234025 234450 234974 236064 237903 240198 242291
56393 242291 243393 243028 241429 239321 237306 235700 234804 234813 235378 235882 236282 237063 238204 238951 238959 238928 239607 240784
56375 240784 241876 242923 244331 246029 247616 249148 251189 254076 257442 260431 262256 262834 262977 263610 264730
56360 264730 265666 266348 267526 269420 270974 271029 269670 267841 266173 264796 263858 263600 264087 265209 266718 268147
56344 268147 269110 269801 270658 271551 272054 272540 273963 276321 278495 280035 281885 284652 287469 289516 291502 294462
56328 294462 297998 301015 303459 306012 308592 310434 311365 311834 311906 311265 309964 308333 306418 304335 302787
56313 302787 302334 302512 302518 302393 302689 303387 304103 304946 306183 307358 307756 307572 307722 308752 310687 313620 317522
56296 317522 321706 325269 327895 329636 330374 330215 329902 330020 330268 330288 330560 331694 333511 335740 338780 342737
56280 342737 346542 349272 351606 354589 357779 360126 362035 364766 368292 371575 374690 378756 383800 388572
56266 388572 392653 397032 402304 407930 413648 420034 427132 433968 440034 446104 453043 460776 468885 477256
56252 477256 485858 494821 504947 517170 531304 546334 562147 579966 600798 624339 649659 676111
56240 676111 703427 731660 761053 791192 820465 847264 871398 893266 912061 926171 935079 939308
56228 939308 938682 932401 921034 906677 890620 872307 851155 828040 804391 780985 758163 736177
56216 736177 714869 693984 674072 656106 640091 625180 611277 599180 588979 579680 570720 562481
56204 562481 555017 547735 540763 535141 531092 527454 523486 519950 517777 516839 516659 517187 518188 518962 519245
56189 519245 519454 519641 519280 518457 518122 518758 520001 521873 524974 529021 532633 535262 537973 541571 545266 548069
56173 548069 550386 553304 557238 561985 567216 572298 576562 580369 584994 590985 597547 603942 610392 617136
56159 617136 623780 630146 636795 644201 652378 661586 672311 684231 696403 708816 722514 737873 754092
56146 754092 770795 788816 809034 831813 857921 888389 922909 959805 998234 1039250 1084496
56135 1084496 1135516 1194750 1265378 1349344 1446690 1556771 1677929 1805236 1930648 2046765
56125 2046765 2149613 2238117 2313435 2379645 2442379 2504695 2565055 2619634 2664602 2695734 2708982
56114 2708982 2703919 2685398 2660192 2632763 2604390 2573789 2536797 2487317 2420769 2336244 2235246
56103 2235246 2120576 1997574 1874081 1757009 1649794 1553831 1470329 1399459 1339699 1289645
56093 1289645 1248967 1216578 1189907 1167382 1149654 1137004 1127619 1119883 1114228 1111165 1109668 1109189 1110984
56080 1110984 1115571 1121019 1125723 1130745 1137462 1145075 1152594 1161085 1171599 1182846 1193222 1203327 1214286
56067 1214286 1225597 1236906 1249857 1265685 1282864 1299562 1316556 1335328 1355278 1375335 1396329
56056 1396329 1419097 1442113 1463709 1484762 1506586 1528062 1547599 1566004 1584635 1602686 1619166
56045 1619166 1635565 1653569 1672179 1690115 1708989 1730803 1754379 1777619 1801324 1827235 1854287
56034 1854287 1880563 1907220 1936654 1968384 2000468 2033525 2069642 2108806 2150068 2194657 2244192
56023 2244192 2297286 2351509 2407130 2465311 2524608 2583164 2642453 2704731 2768799 2832529 2897697
56012 2897697 2967787 3042828 3120877 3202705 3290285 3382438 3476797 3574330 3677228 3784382 3893988
56001 3893988 4008516 4131775 4263049 4399572 4542598 4695288 4856756 5024363 5199852
55992 5199852 5386994 5585259 5792350 6010894 6245840 6497309 6762977 7045332 7349292
55983 7349292 7675091 8021338 8392793 8796923 9235249 9706824 10217700 10777640 11390098
55974 11390098 12055564 12782450 13584294 14468995 15442464 16520481 17724958 19071497 20574399
55965 20574399 22261985 24173468 26345077 28817217 31655051 34947510 38793201 43312658
55957 43312658 48678334 55118659 62908115 72396958 84068541 98558125 116638003 139220851
55949 139220851 167297749 201598873 241934120 286517893 331704325 372367140 402922558
55942 402922558 418809349 417949666 401451060 373053066 337619430 299604825 262238471
55935 262238471 227459821 196205538 168739446 144941629 124524706 107140276 92409552
55928 92409552 79953700 69433878 60559660 53069911 46730178 41348204 36771556 32867299
55920 32867299 29517021 26627999 24130693 21962220 20063668 18391765 16918451 15616728
55912 15616728 14457366 13419059 12489825 11656577 10902824 10217340 9595526 9030705 8512167
55903 8512167 8032727 7590471 7182171 6802099 6447815 6120212 5817214 5533797 5268333
55894 5268333 5022580 4795273 4581960 4381344 4195801 4025405 3867240 3720671 3587455
55885 3587455 3466481 3354114 3250152 3158026 3078697 3009456 2948802 2897086 2851810 2807469 2760808
55874 2760808 2711815 2659411 2601012 2536613 2468535 2396732 2319090 2236755 2154379 2074464 1996047
55863 1996047 1919517 1847925 1782498 1721267 1663211 1609625 1560415 1513203 1467278 1424630 1385972
55852 1385972 1349462 1314309 1281882 1252137 1222637 1192316 1162668 1134090 1104611 1073612 1043455
55841 1043455 1015891 989975 964911 941922 921735 902962 884480 867051 851293 836430 822160
55830 822160 809431 798345 787617 776970 767708 760029 752146 742979 733348 723597 712384 698856 683950
55817 683950 668728 653448 638907 626449 615971 605986 596170 587651 580471 573359 566555 562123 560702
55804 560702 560540 560604 561983 565254 569164 573057 578017 584267 589959 593967 597501 601467 604488 605172 604258
55789 604258 602795 600090 595252 589163 583268 577704 572063 566628 561520 555743 548149 538273 525581 509542
55775 509542 491273 473433 457484 442663 428553 416687 408333 402469 397493 393431 390920 389330 387422
55762 387422 384920 382109 378773 374620 369907 364778 358906 352436 346150 340068 333236 325594 318555 312899
55748 312899 307599 301698 295872 291035 286813 282530 278468 275048 272014 269412 267988 267603 266665 264395 262295
55733 262295 262089 263373 264608 265211 265330 264662 262986 260941 258924 256064 251545 246125 241094 236578 232130
55718 232130 228172 225507 224015 223029 222400 222118 221601 220570 220018 221135 223755 226935 230522 234986 240086
55703 240086 244805 248398 250628 251195 249763 246422 241680 236233 230947 226451 222393 217865 212859 208442
55689 208442 205094 201988 198486 195209 192878 191195 189788 189250 190159 192009 194116 196755 200278 203849 206236
55674 206236 207363 208010 208403 208126 207089 205695 204220 202637 200795 198402 195285 192022 189656 188457 187708
55659 187708 187049 187065 188112 189633 191312 193821 197660 202168 206508 210738 215209 219804 224496 229592 234654
55644 234654 238280 239852 240383 240634 239595 236041 230533 224528 218424 211838 205033 198625 192511 186441 181054
55629 181054 177049 173862 170494 167179 164914 163707 162626 161344 160410 160132 160288 160788 161732 162960 164278
55614 164278 165820 167460 168339 167766 166103 164059 161686 158892 156168 153915 151756 149457 147653 146593 145116
55599 145116 142294 139289 137932 138024 137703 136197 134559 133767 133605 133552 133455 133144 132420 131536 130858 130235 129529 129384
55581 129384 130368 131780 132557 133021 134394 136816 139257 141261 143342 145604 147494 149168 151772 155917 160928
55566 160928 165896 170458 174304 176937 178327 179000 179248 178944 178184 177201 175626 172796 168957 165248 162301
55551 162301 159689 156877 153891 150881 147830 144874 142185 139473 136317 132955 130044 127716 125696 124156
55537 124156 123484 123324 122890 122188 121835 121695 120938 119544 118453 117955 117211 115827 114676 114516 114872 114961 114829 114879
55519 114879 115069 115401 116454 118615 121210 123115 123971 124264 124538 124972 125451 125633 125153 124136 123264 123097 123481
55502 123481 123831 123767 123367 123000 122930 122913 122284 120753 118945 117734 117201 116747 116100 115609 115573 115872 116296 116672 116648
55483 116648 115911 114686 113528 112608 111634 110452 109250 108246 107690 108042 109538 111644 113424 114337 114206 112829
55467 112829 110398 108067 107097 107476 108156 108603 109178 110042 110744 111092 111516 112268 113001 113426 113688 113846 113635 112945
55449 112945 111978 110862 109652 108694 108310 108214 108012 108166 109495 111746 113741 115004 116124 117315 117880 117608
55433 117608 117544 118631 120426 121775 122066 121290 119635 117644 116116 115229 114349 113193 112552 113274 115067 116898
55417 116898 118082 118498 118232 117637 117370 117839 118805 119825 120668 121095 120712 119460 117844 116371 115119 114028
55401 114028 113136 112359 111586 111152 111575 112610 113269 113053 112469 111999 111390 110426 109673 109814 110832 112366 114283
55384 114283 116404 118192 119328 120107 120790 121082 120745 120205 119968 119902 119607 119041 118338 117548 117065 117654 119394 121118
55366 121118 121664 121241 120855 120887 121077 121558 122847 124860 126721 127736 127977 127876 127673 127320 126583 125225 123339
55349 123339 121384 119745 118483 117694 117665 118320 118978 119150 119194 119665 120386 120767 120762 120788 120880 120672 120174 119888 120022 120170
55329 120170 120013 119806 119892 120055 119769 118998 118421 118716 119760 120769 121186 121182 121091 120771 119934 118847 118084 117665 117088
55310 117088 116243 115608 115351 114977 114157 113271 112744 112447 112194 112264 112914 113779 114313 114456 114460 114368 114145 113961 113896 113688
55290 113688 113192 112759 112690 112670 112275 111775 111865 112755 114028 115294 116528 117807 119069 120141 120841 121111 121159 121247
55272 121247 121312 121114 120773 120651 120597 120006 118860 118002 117884 117695 116459 114472 112940 112517 112951 113855 115033 116145
55254 116145 116779 116983 117232 117812 118593 119398 120243 121173 122117 122840 122986 122399 121530 121137 121315 121232 120170 118482
55236 118482 117147 116715 117140 118263 119903 121671 123146 124167 124693 124645 124153 123606 123152 122511 121621 121066 121413
55219 121413 122503 123731 124666 125031 124602 123626 122882 122805 122955 122863 122838 123334 124035 124330 124320 124528 124937 125079 124830
55200 124830 124425 123914 123271 122739 122376 121676 120446 119619 120169 121443 121716 120404 118719 117992 118293 118902 119245
55183 119245 119067 118396 117720 117712 118524 119734 120932 121889 122239 121696 120639 119800 119361 119030 118965 119757 121328 122734
55165 122734 123398 123841 124796 126206 127528 128490 129172 129769 130641 132230 134567 137106 139284 140991 142310 143100
55149 143100 143008 141739 139314 136286 133632 132026 131255 130662 130003 129456 129062 128845 129242 130555 131991 132225 131133
55132 131133 130054 129978 130392 130387 130050 129960 129947 129292 127937 126676 126132 126114 126012 125529 124912 124673 125048 125691 126012 125875
55112 125875 125717 125926 126442 127101 127993 129163 130241 130718 130476 129885 129439 129439 129843 130346 130742 131231 132174 133541
55094 133541 134884 135906 136704 137390 137873 138169 138541 139092 139572 139850 140253 141082 141992 142241 141511 140224 139090
55077 139090 138472 138199 137837 137113 136087 134945 133731 132372 130906 129495 128330 127596 127414 127594 127683 127536 127703
55060 127703 128842 130820 132796 134177 135082 135814 136295 136186 135313 133870 132369 131334 130824 130306 129300 128076
55044 128076 127414 127797 129104 130930 132805 134276 135248 136159 137314 138253 138345 137843 137633 137980 138295 138173 137761
55027 137761 136992 135447 133389 132013 131968 132342 131862 130617 129793 129985 130570 130724 130404 130251 130927 132641 135003
55010 135003 137264 138863 139783 140313 140568 140377 139583 138334 137169 136722 137193 138119 138907 139485 140106 140639 140641 140196
54992 140196 140117 140998 142466 143636 143984 143598 142969 142722 143187 144013 144505 144504 144463 144566 144372 143666 143029 143053 143475 143706
54972 143706 143847 144526 145962 147777 149625 151438 153121 154519 155726 156974 158163 158885 158957 158628 158229 157899
54956 157899 157698 157678 157755 157738 157619 157642 157982 158454 158698 158605 158441 158481 158624 158550 158268 158199 158540 158821 158451 157540 156779
54935 156779 156573 156716 156871 156913 156766 156408 156131 156426 157441 158912 160584 162282 163612 164332 165131 167358 171594
54918 171594 177059 182733 188447 194489 200760 206886 212654 217701 221174 222326 221242 218561 214798 210437
54904 210437 206160 202262 198072 192724 186444 180429 175538 171713 168637 166265 164575 163403 162708 162542 162636
54889 162636 162441 161827 161352 161634 162681 164006 165146 165969 166697 167789 169587 171979 174520 176973 179646 183144
54873 183144 187877 193752 200155 206264 211569 216121 220144 223386 225038 224350 221242 216304 210378 204281
54859 204281 198764 194375 191113 188357 185443 182415 179918 178271 176978 175409 173558 171747 169948 167952
54845 167952 165923 164097 162140 159655 157277 156236 156652 157214 156922 156171 155595 154867 153529 152165 151663 151821
54829 151821 151816 151724 152424 154030 155494 155949 155605 155079 154608 154231 154056 154002 153718 153116 152597 152522 152774 153070 153393 153858
54809 153858 154391 154776 154913 154897 154954 155301 155950 156693 157397 158187 159119 159784 159616 158544 157043 155580 154317 153347
54791 153347 152832 152741 152696 152250 151335 150437 150334 151488 153550 155650 157284 158656 160038 161206 161928 162606 163830
54774 163830 165458 166760 167436 167930 168674 169601 170582 171908 174107 177538 182267 188101 194642 201536 208714
54759 208714 216157 223452 229878 234867 238100 239227 237946 234459 229515 223893 218101 212529 207480 202947
54745 202947 198744 194953 191831 189182 186326 183025 180047 178320 177732 177213 176013 174479 173440 173095 172833
54730 172833 172126 171274 171049 171762 173006 174310 175716 177552 179983 182986 186527 190508 194803 199578 205297
54715 205297 212021 218917 224780 228810 230596 229795 226493 221610 216221 210535 204261 197897 192749 189392
54701 189392 186901 184074 180805 177746 175173 172893 170962 169750 169288 169149 169041 169092 169369 169539 169261 168715
54685 168715 168439 168696 169207 169508 169392 168969 168465 168085 167964 168122 168493 169082 169974 171008 171649 171512 170954 170800
54667 170800 171384 172238 172702 172490 171605 170202 168761 167927 167892 168306 168974 170162 171824 173142 173379 172808 172214
54650 172214 171799 171215 170361 169502 168717 167932 167368 167359 167742 168056 168267 168751 169546 170251 170690 171078 171487 171724 171816 172044
54630 172044 172340 172224 171509 170567 169744 169041 168557 168664 169378 169975 169660 168451 167095 166286 166135 166277 166323 166219
54612 166219 166134 166010 165484 164505 163738 163959 165228 167037 169007 170942 172536 173698 174970 176844 178723 179459
54596 179459 179007 178685 179581 181441 183379 184873 185643 185279 183638 181221 178796 176912 175856 175547 175258 174097
54580 174097 172138 170525 170107 170545 171110 171705 172598 173696 174731 175738 176811 177686 178113 178320 178614 178843 178698
54563 178698 178274 177876 177532 177191 177130 177646 178518 179260 179779 180364 181102 181713 181908 181643 181082 180500 180057 179478 178267
54544 178267 176467 174913 174391 174850 175723 176720 177946 179544 181613 184150 186701 188404 188904 188945 189549 190804
54528 190804 191997 192748 193386 194243 195167 195848 196102 195718 194505 192758 191366 191091 191798 192600 192782 192411 192013
54511 192013 191778 191402 190773 190412 190881 191991 193067 193798 194304 194490 194113 193504 193411 193897 194080 193300 191892 190484
54493 190484 189340 188765 189280 190692 191773 191685 191130 191222 191808 191922 191429 191052 190970 190572 189673 188922 188823 189219 190005
54474 190005 191510 193795 196229 198148 199515 200652 201771 203070 204917 207605 210986 214431 217053 218200
54460 218200 218059 217640 217738 218088 217996 217552 217501 218018 218398 218169 217709 217470 217223 216564 215688 215163 215109 214998 214234 212746
54440 212746 211105 210027 209650 209395 208758 208059 207990 208555 209005 208866 208393 207892 207198 206131 205032 204431 204431 204660
54422 204660 204645 204167 203509 203421 204460 206267 207855 208685 209086 209505 209859 209801 209140 207771 205697 203438 201947
54405 201947 201688 202122 202487 202679 202965 203243 203238 203174 203597 204554 205477 205962 206197 206581 207269 208183 209113 209706 209682 209194
54385 209194 208736 208613 208712 208847 209004 209069 208703 207823 206996 206946 207737 208745 209438 209823 210119 210404 210813 211659 213008
54366 213008 214342 215100 215409 215819 216419 216733 216563 216362 216556 216974 217244 217367 217486 217427 216865 215788 214452 213115
54348 213115 212071 211661 211811 211818 211019 209508 207818 206136 204370 202758 201793 201545 201619 201745 201920 202033 201990 202199
54330 202199 203234 204829 205835 205492 204219 202853 201681 200627 199882 199678 199688 199206 197968 196405 195110 194357
54314 194357 194158 194478 195230 196125 196727 196807 196706 197174 198597 200475 201900 202484 202513 202302 201866 201339 201236 201902
54296 201902 202977 203710 203753 203453 203413 203864 204372 204169 202951 201302 200117 199578 199043 198005 196761 195930 195612
54279 195612 195341 194704 193729 192727 191927 191292 190698 190287 190538 191758 193581 195331 196788 198214 199558 200199
54263 200199 199727 198549 197359 196314 195125 193779 192733 192421 192820 193518 194045 194261 194502 195251 196548 197902
54247 197902 198885 199623 200520 201720 203037 204206 205013 205414 205790 206861 208984 211596 213680 214756 215130 215261
54231 215261 215230 214898 214186 213020 211241 208864 206377 204507 203648 203602 203893 204124 203967 203074 201359 199285 197486
54214 197486 196089 194767 193594 193281 194248 195802 196733 196472 195226 193324 191060 189027 187818 187316 186925 186610
54198 186610 187038 188508 190407 192017 193268 194318 195016 195262 195439 195833 195990 195233 193664 192105 191132 190649
54182 190649 190427 190562 191255 192349 193271 193398 192581 191307 190223 189504 188867 188204 187786 187747 187819 187805 187888 188147 188187
54163 188187 187642 186731 185976 185630 185740 186395 187447 188296 188454 188101 187634 187009 186093 185364 185496 186326 186936 186813
54145 186813 186309 185920 185738 185798 186311 187258 188217 188933 189682 190760 191892 192500 192390 191986 191996 192936 194697 196443
54127 196443 197193 196733 195801 195273 195360 195707 196017 196358 197015 198209 199882 201599 202831 203467 203968 204842 206055
54110 206055 207072 207443 207231 206901 206866 207098 207192 206833 206156 205548 205166 204859 204564 204524 204976 205800 206635 207293 207995
54091 207995 209165 210989 213072 214663 215391 215747 216611 218228 219880 220638 220200 218907 217249 215617 214319
54076 214319 213465 212831 212100 211218 210373 209663 209058 208666 208744 209318 210038 210529 210708 210608 210116 209118 207716 206066
54058 206066 204228 202452 201364 201320 201650 201233 199999 199179 199650 200668 200845 199937 198898 198509 198857 200092 202661
54041 202661 206450 210502 214027 217068 219835 222089 223828 225999 229638 234498 239251 242991 245905 248528
54027 248528 251013 253332 255547 257536 258832 259180 259087 259442 260554 261753 262054 261153 259664 258417 257696 257296
54011 257296 257079 257041 256847 255784 253486 250412 247343 244690 242552 241069 240248 239610 238496 236687 234429 231980
53995 231980 229540 227533 226443 226299 226699 227365 228306 229403 230268 230740 231142 231750 232214 231835 230382 228402 226648
53978 226648 225333 224084 222644 221343 220655 220405 219912 218952 218107 217867 217891 217590 217048 216779 216835 216809 216627 216675 217118
53959 217118 217732 218456 219517 220866 222053 222898 223723 224675 225382 225600 225682 225960 226149 225961 225964 227093 229370 231777
53941 231777 233522 234929 236756 239071 241256 243006 244832 247403 250670 253970 256911 259845 263380 267711
53927 267711 272558 277460 281901 285378 287693 289104 289950 290359 290572 291243 292868 295020 296731 297716 298746
53912 298746 300680 303581 306909 310138 312966 315317 317437 319646 321783 323205 323600 323471 323516 323753 323568 322441
53896 322441 320360 317691 314909 312347 310029 307809 305699 303832 302015 299705 296617 293069 289476 285841
53882 285841 282080 278590 275992 274349 272982 271129 268622 265970 263922 262908 262767 263041 263496 264135 264746
53867 264746 264830 264174 263089 261879 260441 258765 257382 256801 256706 256310 255424 254651 254507 254815 255061 254981 254699 254586
53849 254586 255107 256583 259034 262330 266440 271322 276835 283118 290972 301387 314680 330577 349300
53836 349300 372178 400870 435960 476041 517635 555876 585823 603822 608075 598558 577056 547169
53824 547169 513340 479083 446106 415157 387223 363472 344353 329243 316960 306383 296790 288020
53812 288020 280373 274158 269375 265920 263801 262874 262600 262495 262658 263424 264627 265743 266824 268686 271848
53797 271848 275688 279009 281215 282622 283847 285270 286995 288896 290583 291601 291825 291649 291688 292356 293686
53782 293686 295381 296985 298051 298277 297565 295999 293833 291481 289470 288228 287781 287589 286856 285178 282834
53767 282834 280288 277520 274208 270554 267427 265399 263947 262095 259690 257574 256488 256246 256149 255823 255345
53752 255345 254814 254173 253477 253056 253216 253816 254242 253916 252869 251734 251138 251187 251578 252015 252278 252109 251475 250919
53734 250919 251286 252953 255541 258418 261142 263348 264683 265181 265420 265951 266745 267482 268204 269368 271295 273835
53718 273835 276503 278756 280249 281100 281869 283081 284753 286531 288152 289675 291379 293672 296887 300874 304829
53703 304829 307842 309636 310673 311684 313267 315786 319262 323341 327561 331711 335794 339809 343708 347347
53689 347347 350259 351809 351997 351851 352404 353380 353554 352500 351331 351412 352850 354594 355635 355734 355268 354787 354646
53672 354646 354750 354712 354382 354041 353905 353649 352721 351013 348987 347203 345916 345086 344547 344192 344134 344670 345904 347404
53654 347404 348460 348815 349012 349790 351124 352154 352267 352044 352676 354517 356748 358698 360855 364146 368705 374097
53638 374097 380421 388368 398311 410331 425366 445346 471483 502771 536439 569267 597948 618903
53626 618903 629054 627284 615009 595288 571561 546915 523791 503754 487352 474262 463819 455691
53614 455691 450061 446998 445828 445550 445941 447741 451560 457006 463056 468747 473188 475530 475593 474255 472607
53599 472607 470868 468675 466180 464172 463102 462638 462393 462523 463270 464278 464736 464096 462397 460012 457253 454286
53583 454286 451303 448678 446820 445789 445095 443995 442010 439196 435979 432849 430091 427763 425880 424470
53569 424470 423311 421802 419493 416677 414032 411662 409092 406357 404350 403652 403631 403403 403215 403988 405725 407263
53553 407263 407744 407600 407821 408811 410219 411454 412104 412209 412359 413243 414958 417042 419296 422196 426223 431136
53537 431136 436239 441276 446749 453350 461215 469700 477875 485335 492590 500579 509829 520227 531509 543642
53523 543642 556628 570205 584010 598016 612712 628797 646621 665842 685721 705872 726648
53512 726648 748711 772416 797757 824693 853179 883016 913886 945378 976674 1006586 1034481
53501 1034481 1061054 1087535 1114168 1140115 1164883 1189012 1213095 1236979 1260471 1284154 1308723
53490 1308723 1333905 1358805 1383115 1407262 1431434 1455171 1478038 1500049 1521221 1541234 1559885
53479 1559885 1577501 1594503 1610758 1625673 1638798 1650068 1659531 1667177 1673078 1677436 1680281 1681177 1679376
53466 1679376 1674290 1665840 1654428 1640674 1625148 1608230 1590120 1570977 1550980 1530180 1508333 1485096
53454 1485096 1460483 1434935 1408812 1381981 1354178 1325722 1297576 1270706 1245515 1221865 1199375
53443 1199375 1177704 1156855 1137332 1119754 1104224 1090335 1077980 1067853 1060814 1056955 1055658 1056637
53431 1056637 1060540 1068344 1080281 1095477 1112543 1130357 1148241 1165675 1182136 1197397 1211878 1226516
53419 1226516 1242265 1259833 1279816 1302812 1329231 1359072 1391923 1427070 1463515 1500042 1535477
53408 1535477 1569036 1600492 1630158 1658812 1687570 1717722 1750589 1787330 1828695 1874924 1925922
53397 1925922 1981474 2041081 2103691 2167936 2232877 2298369 2364586 2431445 2498682 2566198 2633916
53386 2633916 2701310 2767466 2831658 2893576 2952833 3008528 3059610 3105592 3146690 3183271 3215320
53375 3215320 3242436 3264182 3280423 3291490 3298089 3300835 3299668 3293704 3281791 3263251 3238036 3206249
53363 3206249 3167704 3122038 3069147 3009439 2943765 2873297 2799439 2723652 2647165 2570790 2495079
53352 2495079 2420645 2348239 2278437 2211350 2146804 2084786 2025383 1968191 1912125 1856209 1800482
53341 1800482 1745829 1692947 1641833 1592309 1544664 1499610 1457861 1419826 1385414 1353986 1324804
53330 1324804 1297770 1273480 1252353 1233945 1217352 1202013 1187885 1175034 1163430 1153022 1143750
53319 1143750 1135611 1128906 1124162 1121466 1120046 1118951 1118026 1117919 1119315 1122547 1127767 1134952 1143690 1153451
53305 1153451 1164119 1175919 1188800 1202417 1216831 1232858 1251470 1273097 1297528 1324140 1352151
53294 1352151 1381090 1411223 1443233 1477313 1512916 1549429 1586610 1624026 1660543 1694797 1726047
53283 1726047 1754193 1779258 1801252 1820425 1837143 1851372 1862534 1870020 1873747 1874146 1871714 1866610
53271 1866610 1858674 1847814 1834351 1818893 1801868 1783198 1762402 1738957 1712710 1684117 1654017
53260 1654017 1622898 1590458 1556053 1519510 1481198 1441386 1400021 1357262 1313798 1270385 1227477
53249 1227477 1185582 1145617 1108457 1074210 1042195 1011581 981838 952714 924129 896139 868857
53238 868857 842355 816652 791715 767404 743586 720409 698424 678359 660802 645940 633325
53227 633325 621938 610922 600412 591304 583978 577535 570594 562608 554037 545442 536810 527783 518253
53214 518253 508609 499531 491526 484589 478273 472072 465675 458990 452221 445886 440381 435405 430136 424168
53200 424168 417895 411729 405410 398473 391091 383885 377083 370415 363872 358048 353506 350051 346823 343028
53186 343028 338551 333997 330173 327508 325945 325298 325382 325716 325491 324227 322238 320167 318273 316511 315045
53171 315045 314105 313414 312387 310999 309969 309853 310335 310681 310616 310439 310489 310801 311273 311921 312849 313980 314834 314660
53153 314660 312990 310093 306800 303913 301878 300879 300879 301452 301874 301663 300998 300469 300559 301487 303284 305679 307927
53136 307927 309182 309310 309094 309405 310309 311318 312387 314095 316706 319556 321760 323240 324582 326124 327693
53121 327693 329075 330173 330756 330751 330880 332346 335493 339346 342775 345525 347695 348906 348775 347875 347321 347409 347307
53104 347307 346179 344048 341505 339094 337102 335485 333731 331215 327892 324417 321419 318931 316675 314548
53090 314548 312565 310634 308732 307202 306537 306741 307098 306743 305459 303853 302708 302269 302265 302417 302614 302650 302294
53073 302294 301792 301845 302650 303272 302491 300132 297138 294456 292367 290821 289800 289125 288365 287256 285988 284930
53057 284930 284275 284068 284314 284880 285492 285972 286308 286475 286425 286394 286913 288314 290300 292180 293404 293815 293548 292859
53039 292859 291982 291015 289914 288592 286999 285203 283533 282502 282362 282728 282957 282950 283274 284354 285777 286694 286802
53022 286802 286700 287218 288597 290397 292090 293505 294602 295106 294788 294122 294173 295546 297718 299760 301437 303174
53006 303174 305069 306533 306982 306483 305555 304695 304203 304172 304393 304436 304034 303287 302444 301623 300835 300142 299594 299103 298443
52987 298443 297487 296447 295831 295979 296673 297427 298148 299066 299921 299799 298286 296357 295491 296127 297601 299385 301568
52970 301568 304113 306432 307974 308711 308924 309052 309813 311780 314556 317000 318610 320067 322072 324225 325520
52955 325520 325422 323956 321253 317686 314116 311278 309007 306602 303879 301390 299661 298625 297794 296694 295226
52940 295226 293772 292774 292035 290875 289292 288505 289683 292454 295382 297722 299907 302318 304488 305801 306318
52925 306318 306466 306440 306322 306391 306853 307481 307899 308075 308183 308169 307745 306744 305184 303099 300630 298217 296343 295017
52907 295017 293751 292133 290201 288237 286499 285278 284932 285541 286688 287866 289017 290296 291452 291926 291707
52892 291707 291563 292095 292915 293218 292851 292321 291857 291076 289644 287816 286197 285317 285444 286331 287074 286736 285362
52875 285362 283956 283252 282953 282508 282079 282203 282832 283304 283197 282741 282458 282794 283969 285788 287633 288998 290037
52858 290037 291260 292745 294033 294701 294703 294125 293087 291903 290994 290468 290067 289603 289171 288954 289140 290058 291940
52841 291940 294339 296211 296846 296469 295695 294643 292967 290579 287969 285804 284433 283785 283519 283258 282884 282659
52825 282659 283034 284294 286369 288803 290778 291410 290396 288378 286399 284946 283773 282719 282250 282855 284180
52810 284180 285307 285957 287041 289814 294673 300927 307496 313570 318704 322498 324275 323191 318942 312445
52796 312445 305423 298999 292930 286517 279972 274407 270630 268523 267529 267155 266893 266245 265112 263818 262597
52781 262597 261437 260438 259814 259397 258788 258226 258560 259886 260972 260794 260026 260089 261099 261896 261992 262329 263758 265778
52763 265778 267325 268086 268330 267962 266584 264452 262748 262692 264497 267209 269466 270534 270730 270809 271004 270964 270672
52746 270672 270892 272290 274429 276196 277127 277825 279007 280668 282403 284089 285835 287464 288564 289105 289620
52731 289620 290598 291992 293526 295194 297078 298873 300116 300876 301695 302597 302689 301184 298492 295689 293038 289739
52715 289739 285287 280540 276960 275058 273972 272499 270237 267724 265793 264880 264855 265275 265751 266116 266350 266468
52699 266468 266515 266584 266735 266889 266863 266581 266209 266042 266252 266778 267473 268236 268945 269390 269488 269559 270160 271584 273655 276020
52679 276020 278439 280704 282505 283586 283971 283884 283555 283165 282881 282815 283028 283605 284565 285631 286358 286641 286919 287645
52661 287645 288731 289747 290493 291101 291692 292299 293071 294273 295998 298115 300484 303090 305924 308889 311740
52646 311740 313987 314992 314488 312901 310915 308770 306296 303578 301189 299636 298858 298376 297705 296579 295076
52631 295076 293687 293023 293271 294125 295343 297149 299922 303618 307631 311074 313142 313478 312409 310695 308836
52616 308836 306796 304524 302470 301154 300311 298968 296539 293511 290848 288993 287786 287119 287140 287731 288323 288546
52600 288546 288729 289382 290445 291514 292593 293994 295505 296375 296417 296530 297613 299416 300972 301819 302211 302350
52584 302350 302123 301641 301442 301935 302958 304001 304615 304624 304254 304072 304460 305115 305430 305400 305700 306729 308002 308757
52566 308757 308856 308758 308816 308932 308890 308762 308920 309630 310662 311396 311458 311186 311260 311931 312823 313438 313600 313430 313255 313523
52546 313523 314463 315649 316302 316196 315976 316368 317286 318004 318017 317481 316923 316807 317357 318561 320175 321781 322881
52529 322881 323067 322207 320533 318537 316756 315624 315255 315287 315110 314554 314220 314845 316407 318106 319186 319549 319719
52512 319719 320519 322665 326188 330250 333922 337139 340469 344005 347054 349029 350000 350116 349058 346523 342859
52497 342859 338803 334857 331292 328441 326493 325103 323630 321802 319911 318441 317682 317621 318053 318758 319613 320454
52481 320454 320964 321046 321254 322374 324407 326463 327929 329221 331003 333070 334633 335442 336074 337117 338569 340042
52465 340042 341218 342060 342901 344392 347093 350959 355270 359010 361314 361761 360487 357992 354784 351315 348118
52450 348118 345591 343472 340948 337564 333770 330313 327440 324970 322790 320916 319358 318313 318142 318740 319255
52435 319255 318976 318175 317537 317076 316375 315690 315885 317108 318283 318226 316829 314877 313151 311973 311302 310975 310932
52418 310932 311268 311950 312676 313332 314405 316436 319161 321772 324077 326822 330777 336064 342529 350196 359218
52403 359218 369906 382895 398478 415312 430486 441386 447132 447908 443829 435358 424237 412800
52391 412800 402285 392580 383537 375626 369197 363973 359648 356329 353978 352040 350129 348634 348025 347887
52377 347887 347302 346128 345244 345509 347011 349503 352988 357461 362471 367490 372571 378103 383860 388775 391909
52362 391909 393253 393261 391915 388840 384342 379814 376752 375515 375260 374953 374253 373502 373180 373475 374237 375168 376062
52345 376062 376963 378145 379858 382051 384341 386368 388130 389876 391673 393309 394767 396595 399563 403959
52331 403959 409492 415831 422964 430925 439543 448706 458691 469878 482179 495023 507910 520735 533510
52318 533510 546038 558041 569469 580477 591126 601266 610756 619748 628772 638529 649495 661562
52306 661562 674110 686532 698706 710867 723161 735509 747858 760281 772776 785144 797133
52295 797133 808436 818482 826519 832140 835542 837089 836868 834961 831870 828255 824316 819837 814787 809488
52281 809488 804151 798666 792975 787374 782316 778151 775076 773124 772088 771743 772072 773063 774370 775662 777272
52266 777272 779936 783828 788477 793829 800684 809667 820461 832561 846099 861067 876282 890160 902461
52253 902461 914320 926556 938771 950313 961182 971536 980960 988837 995027 999676 1002633 1003636 1002930
52240 1002930 1001240 999038 996158 992201 987127 981359 975445 969653 963828 957638 950991 944258 938063 932842
52226 932842 928547 924678 920606 915988 911008 906302 902538 899941 898103 896383 894623 893414 893482 894826 896802
52211 896802 899025 901887 906022 911575 918162 925196 932080 938421 944364 950334 956123 960679 963375 965126
52197 965126 967609 971499 976115 980713 985343 990378 995940 1002075 1008856 1015926 1022391 1027543 1031364 1034063
52183 1034063 1035489 1035399 1033938 1031368 1027520 1021949 1014618 1006096 997025 987654 977952 968070 958603 950329
52169 950329 943674 938499 934510 931735 930333 930133 930784 932366 935348 939805 945057 950311 955302 960102 964697
52154 964697 969012 972959 976078 977482 976755 974821 973441 973733 975421 977535 979552 981766 984767 988650 992703
52139 992703 995819 997290 997189 996007 994097 991564 988578 985561 983022 981301 980476 980524 981555 983856 987627
52124 987627 992808 999425 1008054 1019606 1034470 1052082 1071444 1091877 1113135 1135072 1157411 1179677
52112 1179677 1201203 1221346 1239911 1257209 1273551 1288817 1302714 1315293 1326960 1338064 1348710
52101 1348710 1358992 1369238 1379978 1391709 1404620 1418423 1432457 1446035 1458701 1470211 1480347
52090 1480347 1488652 1494126 1495254 1490727 1480439 1465771 1448825 1431400 1414592 1399002 1385071 1373285
52078 1373285 1364132 1357799 1353907 1351675 1350340 1349363 1348446 1347731 1347913 1349743 1353342 1358294 1364339 1371494 1379494
52063 1379494 1387701 1395720 1403595 1411238 1418334 1425141 1432696 1441619 1451173 1460067 1467834 1474832 1481231 1486732
52049 1486732 1491044 1493977 1495128 1494131 1491257 1487276 1482636 1477216 1470800 1463389 1455118 1446371 1437983 1430885
52035 1430885 1425499 1421767 1419532 1418439 1417697 1416665 1415619 1415216 1415189 1414364 1412216 1409615 1407691 1406671 1406294
52020 1406294 1406667 1407990 1409883 1411709 1413424 1415514 1418246 1421501 1425247 1429560 1434099 1438008 1440539 1441420
52006 1441420 1440581 1437810 1432807 1425272 1414763 1400664 1382543 1360484 1334987 1306659 1276129 1244185
51994 1244185 1211855 1180286 1150592 1123703 1100144 1079750 1061619 1044579 1027881 1011545 996030
51983 996030 981701 968669 956968 946568 937138 927998 918485 908291 897270 884985 870687 854000
51971 854000 835706 817660 801699 788555 777876 769210 762692 758711 757354 758484 762143 768421 777017
51958 777017 787292 798736 810913 822830 832774 839034 840625 837318 829480 818232 805358 792479
51946 792479 780289 768847 758437 749785 743524 739927 739159 741311 745966 752184 759309 767618 777776
51933 777776 789680 802142 813696 823410 830778 835129 835531 831312 822501 809659 793447 774572 754100
51920 754100 733445 713710 695141 677516 661101 646794 635124 625472 616692 608321 600712 594150
51908 594150 588455 583629 580305 579209 580554 584289 590606 599774 611750 626332 643428 662666 682894
51895 682894 702498 719973 733696 741537 741730 734326 721148 704167 684578 663583 643060 624714
51883 624714 609074 595956 585513 578125 573658 571652 572295 576530 585053 597643 613661 632744 654685
51870 654685 678749 703367 726624 747039 763782 776041 782399 781399 772906 758538 740526 720444
51858 720444 699249 678029 658150 640879 627229 617892 612799 610914 610939 612255 614873 618653 622942
51845 622942 626828 629443 630229 629339 627480 624928 620962 614903 607401 599963 593341 587245 581632 577330 575101
51830 575101 574910 576496 579955 585201 591394 597461 602839 607202 609847 610016 607774 604092 600071 596316 593010
51815 593010 590267 588341 587673 588800 592198 598294 607512 620063 635519 652764 670482 687559 703084
51802 703084 716282 726691 734231 738816 739915 736637 728351 715368 699144 681686 664562 648409
51790 648409 633317 619322 606314 593922 582076 571538 563346 557760 554220 552131 551066 550298 548920
51777 548920 546608 543698 540355 536414 532180 528602 526282 524977 524559 525804 529647 536082 544357 553893
51763 553893 564536 576331 589490 604095 619172 632377 641247 644702 643023 636861 626937 614403
51751 614403 600701 586936 573755 561649 550919 541546 533575 527439 523422 521104 519934 520164 522579
51738 522579 527453 534476 543613 555318 569868 587088 606674 627932 649028 667301 680834 689387
51726 689387 693772 695019 694506 694144 695671 699613 704926 709275 709801 704590 694177 681423 669495 660043
51712 660043 653278 648995 646767 645491 643646 640315 635718 630919 627433 627084 631639 642108 658174 678013
51698 678013 698513 716013 727585 732141 730563 725063 718616 714521 715567 722900 735519 750776 765271
51685 765271 775607 779166 774934 763759 747699 729004 709526 690660 673495 659073 648555 642817
51673 642817 641629 643489 646748 650760 655506 660317 663905 666069 668672 674255 683875 696663 710941 724870
51659 724870 736225 742687 742993 737448 727158 713297 697332 681317 667347 656904 650982 650406 655453
51646 655453 665226 677651 689907 698773 701341 696303 684600 668452 649783 629836 609767 590665
51634 590665 572946 556452 541374 528474 518193 510148 503793 499046 495820 493448 491198 489139 487839
51621 487839 487316 486853 485981 485052 484576 484357 483775 482751 481978 482146 483289 484981 486847 488649 490177 491341
51605 491341 492274 493049 493503 493629 493938 495017 496839 499030 501781 505880 511764 519184 527990 538535 550933
51590 550933 564533 578561 592505 605250 614622 618909 618626 615880 612260 608392 605408 605412 609908 618738
51576 618738 631309 648298 671377 701497 738004 779248 823556 869684 916866 964817 1013739
51565 1013739 1064044 1115487 1166126 1212471 1251604 1283773 1313029 1345582 1387650 1443972 1516537
51554 1516537 1603544 1699694 1797824 1890193 1968717 2025668 2055793 2058060 2034974 1990266 1927359
51543 1927359 1849372 1759593 1661656 1559454 1456730 1356431 1260552 1170857 1089390 1017800 956361
51532 956361 904109 859846 822514 790866 763609 740155 720703 705259 692915 682374 672882 664329
51520 664329 656613 649309 641996 634671 627691 621364 615642 610270 605156 600486 596445 592972 589881 587052
51506 587052 584335 581313 577422 572399 566591 560779 555665 551393 547497 543435 539224 535487 532810 531223
51492 531223 530423 530399 531616 534607 539456 545642 552315 558765 564610 569472 572625 573321 571519 567962 563392
51477 563392 558014 551910 545568 539557 533868 528106 522242 516714 511747 507003 502106 497226 492892 489382
51463 489382 486459 483699 480990 478690 477274 476775 476699 476490 476005 475375 474625 473754 473111 473384 475130 478513 483563
51446 483563 490414 499216 510154 523955 542296 567282 600109 640022 684418 729608 771334 805096
51434 805096 827332 837473 839018 837862 838845 843458 850090 855414 855359 846181 826346 797936 765650 733938
51420 733938 705051 679451 657224 638598 623506 611329 601312 593033 586431 581548 578429 577195
51408 577195 577943 580357 583559 586610 589201 591644 594176 596610 598716 600636 602705 605198 608511 613238
51394 613238 619687 627510 636223 645936 657223 670422 685400 701947 720035 739871 762084 787861
51382 787861 818593 855554 900257 954763 1020937 1099429 1189928 1292271 1406398 1530876 1661930
51371 1661930 1794013 1920592 2034304 2127707 2195340 2235291 2248360 2235929 2198963 2138698 2057558
51360 2057558 1959298 1848639 1730586 1609597 1489196 1372487 1262755 1162988 1074757 997953
51350 997953 931680 875114 827454 787489 753617 724319 698599 676058 656521 639481 623920
51339 623920 608877 594158 580381 568293 558162 549741 542634 536608 531634 527659 524404 521537 519069
51326 519069 517345 516377 515429 513484 510082 505497 500372 495480 491625 489212 487856 486717 485240 483302 480829
51311 480829 477839 474885 472827 471883 471387 470745 470173 470188 470897 472314 474951 479390 485311 491488 496750 500554
51295 500554 502724 503214 502246 500267 497602 494452 491244 488559 486559 484911 483473 482639 482760 483626 484877
51280 484877 486547 488796 491455 494419 498263 503688 510236 516195 520086 521871 522427 522285 521330 519458 517011
51265 517011 514563 512634 511612 511596 512212 512823 513020 512702 511638 509329 505611 501237 497457 494875 492965 490829
51249 490829 488320 486141 484936 484530 484229 483712 483464 484355 486936 491089 496164 501358 506135 510487 514849
51234 514849 519698 525112 530589 535162 537744 537662 535054 530781 525868 520948 516145 511275 506137 500841 496022
51219 496022 492527 490616 489466 487796 485099 482045 479546 477642 475588 473029 470715 469803 470545 472009 473203
51204 473203 474236 476074 479287 483391 487547 491489 495505 499718 503878 507823 511733 515742 519567 522776
51190 522776 525283 527297 528864 529791 530123 530523 531921 534766 538631 542503 545421 546977 547489 547816 548810 550681
51174 550681 552840 554525 555598 556542 557653 558416 557899 555642 551926 547258 541903 536079 530396 525737 522545
51159 522545 520346 518107 515152 511719 508631 506496 505231 504253 502957 501007 498364 495203 491813 488511
51145 488511 485658 483695 483049 483915 486136 489287 492830 496245 499207 501735 504036 506078 507410 507540 506439
51130 506439 504535 502255 499693 496796 493793 491304 489926 489719 490246 491200 492742 495009 497527 499608 501287
51115 501287 503323 506063 508889 511123 512974 515063 517347 519138 520038 520281 520234 520157 520416 521369 522909 524676
51099 524676 526866 530207 534858 539794 543707 546063 546908 546152 543797 540725 538445 537709 537715 537000 534992 532529
51083 532529 531078 531683 534611 539557 545828 552372 558087 562405 565494 567695 568883 568608 566714 563502 559347
51068 559347 554550 549593 545163 541724 539347 538113 538395 540494 544164 548728 553616 558753 564499 571114
51054 571114 578035 583773 587034 588121 588869 590995 594802 599632 605008 610904 617292 624016 631078 638658
51040 638658 646899 655887 665667 676071 686820 698152 711015 726071 742527 758341 771478 780660
51028 780660 785218 785020 780710 773444 764069 752710 739196 723577 706304 688320 671050 655832 643152
51015 643152 632710 624313 618353 615242 614750 616177 619000 623169 628891 636217 644723 653674 662753 672566
51001 672566 684022 697172 711000 724358 736612 747314 755924 762295 766985 770598 773135 774396 774735
50988 774735 774859 775064 775216 775464 776483 779025 783699 791293 802845 819077 839970 865029 893626 924736
50974 924736 956475 986440 1012857 1035514 1055543 1074375 1092980 1111947 1131849 1153211 1176248
50963 1176248 1200892 1226969 1254060 1281343 1308131 1334679 1362082 1391158 1421813 1453637 1486641
50952 1486641 1520949 1556040 1590682 1623416 1652808 1677561 1696954 1711233 1721326 1728358 1733780 1739609
50940 1739609 1747722 1758599 1770810 1781569 1787467 1785221 1772901 1751137 1722851 1691519 1659638 1628564
50928 1628564 1598950 1570883 1543912 1517336 1490359 1461936 1431014 1397304 1361565 1324809 1287447
50917 1287447 1249461 1211113 1173099 1136238 1101330 1069130 1039983 1013539 989125 966364 945281
50906 945281 926008 908725 893714 881008 870034 860005 850684 842437 835517 829629 824282 819250 814633
50893 814633 810774 808146 807044 807235 808145 809361 810739 812079 813180 814312 816174 819086 822566 826001 829434
50878 829434 833347 837833 842345 846189 849080 851356 853805 857145 861387 865893 870217 874697 879992 886341
50864 886341 893650 901993 911517 922048 933457 946362 961764 979815 999647 1020756 1044018 1070892
50852 1070892 1102190 1138238 1179819 1228022 1283089 1344137 1410328 1481897 1559660 1643872 1733923
50841 1733923 1828996 1928593 2032279 2139119 2247435 2355001 2459242 2557229 2645758 2721900
50831 2721900 2783757 2830666 2862649 2879848 2882721 2872601 2851669 2822402 2787310 2749206 2711285
50820 2711285 2676566 2647245 2624546 2608858 2599747 2595907 2595349 2595699 2594408 2589007 2577507 2558616 2531454
50807 2531454 2495146 2448892 2392506 2326848 2253747 2175515 2094437 2012600 1932147 1855455 1784771
50796 1784771 1721426 1665570 1616729 1574498 1538669 1509094 1485817 1469226 1459676 1456954 1460357 1469118
50784 1469118 1482339 1498591 1516075 1533413 1549946 1565137 1578126 1588188 1595313 1599906 1602040 1601435
50772 1601435 1598072 1592416 1584892 1575392 1563368 1548189 1529321 1506538 1480162 1451005 1419786 1386692
50760 1386692 1351745 1315614 1279712 1245324 1212823 1181995 1152986 1126530 1103141 1082535 1064168
50749 1064168 1048078 1034781 1024410 1016452 1010422 1006416 1004847 1005939 1009661 1015873 1024325 1034811 1047679
50736 1047679 1063995 1084843 1110504 1140564 1174726 1213155 1256029 1303088 1353704 1407145 1462650
50725 1462650 1519493 1577123 1635268 1693860 1752877 1812094 1870781 1927589 1980868 2029089 2070869
50714 2070869 2104704 2128997 2142510 2144878 2136921 2120708 2099121 2074871 2049700 2024562 2000359 1978136
50702 1978136 1958649 1942239 1929278 1920283 1915278 1913378 1913260 1913802 1913916 1911999 1906014 1894273 1876072
50689 1876072 1851718 1822203 1788903 1753367 1717208 1681927 1648668 1618149 1591079 1568562 1551745
50678 1551745 1541020 1535992 1536423 1542856 1556125 1576776 1605355 1642756 1689506 1744751 1806449 1872480
50666 1872480 1941071 2010184 2077200 2139574 2195617 2244718 2287239 2324315 2357269 2386900 2413522
50655 2413522 2437774 2460862 2483606 2505422 2524612 2539693 2550387 2557552 2562513 2566500 2570570 2575850
50643 2575850 2583694 2595477 2612353 2635303 2665152 2702163 2745655 2794389 2847324 2903654 2962181
50632 2962181 3021227 3079458 3136458 3192413 3247772 3303512 3361142 3421497 3482921 3540132 3584247
50621 3584247 3604205 3590134 3537892 3451815 3343125 3225172 3109185 3002727 2910109 2833286
50611 2833286 2772750 2728198 2698641 2682205 2676422 2678954 2687744 2700259 2712959 2721787 2723060 2713865
50599 2713865 2692046 2656414 2607133 2545729 2474636 2396602 2314186 2229479 2144148 2059742 1977837
50588 1977837 1899826 1826614 1758564 1695662 1637753 1584833 1537245 1495418 1459266 1427928 1400278
50577 1400278 1375682 1354203 1336260 1322261 1312509 1307230 1306583 1310636 1319158 1331289 1345550 1360566
50565 1360566 1376004 1392681 1411665 1433322 1457238 1482755 1509283 1536243 1563273 1590754 1619897
50554 1619897 1651933 1687262 1725595 1766806 1811253 1859159 1910067 1963108 2017499 2072403 2126442
50543 2126442 2177808 2225130 2268226 2308142 2346652 2385693 2426952 2471743 2521124 2575972 2636843
50532 2636843 2703901 2777230 2857231 2944662 3040425 3145501 3260938 3387492 3525183 3673345
50522 3673345 3830997 3996841 4168906 4344510 4520663 4694174 4861282 5017510 5158105
50513 5158105 5278457 5374163 5441327 5477352 5481344 5453478 5394200 5304421 5186399 5044068 4882612
50502 4882612 4708042 4527073 4346772 4173878 4014317 3873192 3754857 3662793 3599502 3566515
50492 3566515 3564163 3591071 3643805 3716973 3803498 3894745 3980762 4051149 4096540 4110006 4087822
50481 4087822 4029567 3937997 3818692 3679003 3526270 3366385 3203722 3041944 2884254 2732795
50471 2732795 2588489 2452012 2324689 2208089 2102981 2009176 1926228 1853743 1790924 1736291
50461 1736291 1688108 1644903 1605548 1569128 1534967 1502660 1471989 1442821 1414983 1388153 1362030
50450 1362030 1336826 1313418 1292640 1274493 1258371 1243905 1231190 1220247 1210844 1202927 1196673 1191989
50438 1191989 1188387 1185597 1183899 1183632 1184872 1187839 1193116 1201089 1211592 1224501 1240241 1259202 1280987
50425 1280987 1304747 1329978 1356523 1384140 1412747 1442891 1475307 1510134 1547252 1587328 1631753
50414 1631753 1681437 1736403 1796716 1863124 1936395 2016588 2103319 2196164 2294296 2396099 2499672
50403 2499672 2603487 2706230 2806302 2901954 2991778 3074598 3148929 3212776 3263827 3299565 3317350
50392 3317350 3314919 3291111 3246302 3182459 3102914 3011722 2912818 2809829 2706662 2607700 2516810
50381 2516810 2436367 2367726 2312342 2271731 2246351 2235267 2237048 2250273 2272780 2301010 2330701
50370 2330701 2358021 2379684 2392361 2392757 2378515 2348931 2304896 2248438 2182210 2108897 2030718 1949522
50358 1949522 1867274 1786151 1707997 1633803 1563848 1498200 1436811 1379267 1324831 1273012 1224072
50347 1224072 1178850 1138156 1102392 1071525 1045150 1022546 1002977 986082 971824 960073 950502
50336 950502 943001 937877 935318 934840 935619 937242 939727 942821 945669 947353 947435 945793 942210 936442 928590
50321 928590 919209 909039 898799 889156 880748 874136 869696 867462 867054 867921 869740 872529 876315 880925
50307 880925 886295 892799 900921 910542 920765 930563 939399 947106 953468 958349 962277 966425 971660 977731
50293 977731 983699 989027 993896 998453 1002234 1004615 1005424 1004753 1002451 998284 992489 985765 978755 972100 966997
50278 966997 965151 967855 975345 987077 1001923 1017680 1031014 1038917 1040567 1037576 1032512 1027495 1023873
50265 1023873 1022288 1022434 1023004 1022495 1020200 1016383 1011621 1006335 1000990 996417 993568 992837 993684 994883 995045
50250 995045 993104 988721 982513 975658 968895 961911 953964 945112 936544 929621 924871 921932 920078 918624
50236 918624 917241 916333 916884 919527 923850 928900 934237 940046 946345 952680 958691 964417 969688 973681 975601
50221 975601 975648 974801 973635 971772 968664 964588 960585 957581 955864 955465 956765 960459 966740 974408 980753
50206 980753 982539 977557 965670 948530 928322 906659 884491 862686 842416 824891 810701 799345
50194 799345 789564 780425 772297 766416 763244 761539 759499 756633 753889 752018 750631 749208 748291 748917 751153
50179 751153 753908 756195 758009 759926 762371 765535 769626 774802 780911 787551 794407 801436 808718 816182
50165 816182 823611 830961 838548 846717 855389 864221 873271 883139 894252 906374 919217 933272 949618
50152 949618 968968 991238 1015864 1042055 1068684 1094342 1117655 1137426 1152711 1163277 1169983 1174158
50140 1174158 1176424 1176623 1175160 1174000 1175981 1183501 1198196 1221523 1254896 1298995 1353160 1415419 1482782
50127 1482782 1551485 1617449 1677198 1728812 1772347 1809544 1843167 1876223 1911255 1949807 1992291
50116 1992291 2038163 2085882 2132505 2173525 2203771 2218888 2216164 2194356 2153489 2095179 2022658
50105 2022658 1939904 1850795 1759134 1668788 1582993 1503660 1431803 1368353 1313794 1267277 1227096
50094 1227096 1192337 1163407 1140846 1124453 1113826 1108880 1109116 1112877 1117788 1121525 1121865 1116876 1106130
50081 1106130 1091492 1075863 1061018 1047023 1033504 1020709 1009271 999533 991374 984419 978395 973454
50069 973454 970077 968355 967567 966890 966357 966592 967640 968655 968872 968356 967607 966840 965972 964953 963794 962440
50053 962440 960923 959600 959123 960189 963321 968668 975895 984397 993733 1003917 1015390 1028867 1045121
50040 1045121 1064602 1087106 1111865 1137965 1164664 1191572 1218895 1247483 1278281 1311525 1346656
50029 1346656 1382981 1420212 1458311 1497130 1536400 1575862 1615361 1655096 1696023 1739852 1788384
50018 1788384 1842930 1904420 1973816 2051922 2138550 2231912 2328803 2425325 2517683 2602865 2679276
50007 2679276 2747088 2808002 2864524 2919365 2975319 3035288 3101880 3176603 3259147 3347011 3435462
49996 3435462 3518176 3588628 3641317 3671785 3676132 3651779 3599304 3522819 3427714 3318222 3197489
49985 3197489 3069156 2937497 2805794 2675429 2546796 2420438 2297168 2177951 2064247
49976 2064247 1957987 1860684 1772785 1694142 1624751 1564686 1513653 1471001 1435922 1407279 1383521
49965 1383521 1363147 1345126 1328673 1312977 1297595 1282933 1269834 1258670 1249177 1241105 1234703 1230549
49953 1230549 1229179 1230900 1235830 1244124 1256201 1272523 1292890 1316038 1340096 1363322 1384308 1401898
49941 1401898 1415397 1424783 1430342 1432141 1430130 1424485 1415276 1401772 1382623 1356949 1324974 1287669
49929 1287669 1246385 1203067 1160212 1119965 1083286 1050273 1021074 996081 975349 958338 944426
49918 944426 933523 926167 923175 925126 931822 941990 953688 965248 976009 986320 997169 1009967
49906 1009967 1026271 1047097 1072312 1101010 1132731 1168168 1208569 1254853 1307729 1368349 1437931
49895 1437931 1516176 1600389 1686668 1771957 1854806 1934465 2009800 2079215 2141159 2194391 2238012
49884 2238012 2271763 2296641 2315270 2331441 2348936 2370220 2395720 2423812 2451077 2472624 2482757
49873 2482757 2476154 2448961 2399228 2326962 2234401 2126180 2008523 1887546 1768008 1653394
49863 1653394 1546544 1449673 1363916 1289323 1225514 1172158 1128807 1094660 1068813 1050701 1040101
49852 1040101 1036752 1040181 1049818 1064833 1083581 1103422 1121501 1135952 1146285 1152743 1155597 1155162 1152109
49839 1152109 1147186 1140398 1130599 1116090 1095784 1070000 1040456 1009588 979651 952073 927344 905403
49827 905403 886144 869694 856348 846345 839723 836332 835932 838270 843123 850434 860484 873826 890910
49814 890910 911686 935549 961623 989037 1017004 1044769 1071533 1096366 1118202 1136112 1149835
49803 1149835 1160028 1167728 1173338 1176151 1175071 1169841 1161398 1150947 1138920 1125019 1109012 1091020
49791 1091020 1070977 1048405 1023210 996511 970213 945703 923318 903120 885736 872073 862411
49780 862411 856055 851735 848055 843751 838116 831512 825198 820366 817456 816564 818296 823724 833405 846707
49766 846707 862241 878833 895957 913352 930396 945922 958764 968624 976399 983462 990523 997290
49754 997290 1003088 1007268 1008780 1005745 996117 978990 955206 926881 896585 866750 839197 814796
49742 814796 793619 775429 759908 746559 734859 724700 716450 710341 706014 702813 700404 698906 698574
49729 698574 699555 701873 705464 710192 715821 721961 728154 734343 741342 750544 762887 778247 795939 815531
49715 815531 836893 859676 883003 905475 925187 940113 949256 953535 955085 955398 954389 951156 945017
49702 945017 935545 922311 905421 886167 866495 847668 829797 812673 796475 781455 767455 754287
49690 754287 742324 732285 724504 718858 715351 714269 715570 718598 722647 727594 733727 741241 750196 760685
49676 760685 772684 785900 800240 816240 834527 854808 875867 896544 916159 933892 948502
49665 948502 959156 966119 970226 972170 972840 973934 977222 982974 989525 994378 995246 990140 977485 956921
49651 956921 929922 899229 867657 837388 809817 785510 764312 745866 730062 716827 705668
49640 705668 695855 687129 679893 674539 670804 667958 665436 663064 660800 658541 656216 653808 651185 648055
49626 648055 644265 640027 635756 631759 628145 624873 621712 618239 614206 609880 605819 602257 598981 595891
49612 595891 593318 591596 590579 589931 589716 590298 591657 593186 594306 595039 595852 597094 598734 600498 602098
49597 602098 603334 604152 604665 605108 605765 606873 608444 610081 611029 610638 608928 606743 605151 604588 604567 604399 604061
49580 604061 604147 604904 605753 606000 605812 606056 607255 609156 611429 614349 618466 623893 630415 638245 648180 660757
49564 660757 675538 691531 708132 725229 742329 758042 770786 779776 785057 786733 784700 779199
49552 779199 771215 762067 752770 743914 735912 729133 723959 720805 719861 720614 721873 722573 722398 721470 719716
49537 719716 716957 713439 709858 706848 704752 703741 703801 704709 706445 709583 714787 721856 729711 737457 745124
49522 745124 753375 762931 774341 787693 802257 816802 830564 843456 855203 864967 872421 878670
49510 878670 885492 893981 904587 918000 934870 954438 974154 990978 1002623 1007580 1004847 994226
49498 994226 976578 953451 926798 899166 873438 851606 833920 819542 807760 798159 790138 783079
49486 783079 776943 772029 768153 764666 761353 758622 756600 754767 752813 751242 750554 750326 749756 748790 747956
49471 747956 747273 746154 744645 744001 745587 749575 755122 761581 769118 778245 789155 801567 814950 828657
49457 828657 841973 854256 865133 874481 882053 887136 888804 886667 881322 873953 865513 856297 846087
49444 846087 834604 822073 809537 798335 788985 780793 772907 765534 759692 756040 754517 754952 757347
49431 757347 761647 767881 776500 787879 801673 817738 837906 865688 903863 953827 1018239 1102866
49419 1102866 1213495 1349979 1502489 1651715 1772021 1838242 1836067 1770113 1661763 1537275
49409 1537275 1416280 1308708 1218102 1144790 1086985 1041997 1007960 984090 969400 962047 960141
49398 960141 962537 968637 977893 989729 1003550 1018654 1034274 1049703 1064184 1076823 1086915 1094226
49386 1094226 1098545 1099148 1095255 1087021 1075568 1061901 1046322 1029084 1011064 993383 976671 961209
49374 961209 947589 936711 929047 924346 922203 922694 926229 932973 942555 954101 966169 976732 983790
49361 983790 986433 985274 981678 976709 970861 964431 957587 950063 941300 931120 920091 909135 898985
49348 898985 890077 882591 876312 870664 865169 859861 855161 851560 849525 849380 850876 852964 854347 854290 852777
49333 852777 850028 846289 842136 838558 836393 835777 836370 838065 841222 846181 852792 860589 869201 878314 887375
49318 887375 895769 903360 910409 916731 921391 923696 924175 924018 923731 923003 921864 921130 921453 922568 923918 925496
49302 925496 927614 930242 933152 936450 940331 944393 947710 949656 950336 950294 950202 950772 952471 955070 957740 959763
49286 959763 961044 961873 962366 962184 960661 957163 951556 944431 936811 929581 923220 918036 914408 912651 912750
49271 912750 914373 917257 921545 927603 935426 944366 953634 962987 972697 982917 993327 1003365 1012318
49258 1012318 1019193 1023183 1024854 1026695 1032033 1043348 1061636 1086938 1118827 1156382 1198084 1241783
49246 1241783 1284481 1322266 1351018 1367705 1371304 1362899 1345210 1321783 1295830 1269333 1243111 1217610
49234 1217610 1193426 1171280 1151985 1136612 1126235 1121203 1120745 1123539 1128520 1135090 1142789 1151231 1160388
49221 1160388 1170621 1182135 1194463 1206604 1217688 1227355 1235495 1241877 1246179 1248246 1248166 1246247 1243183
49208 1243183 1240012 1237552 1235983 1235483 1237192 1242893 1253515 1268458 1286646 1307617 1331090 1355948 1380402
49195 1380402 1403064 1423401 1441371 1457080 1470671 1481894 1489808 1493368 1492294 1487024 1477956 1465463
49183 1465463 1450659 1435455 1421540 1409769 1400773 1395599 1395262 1400006 1409606 1424366 1445530 1474870
49171 1474870 1514330 1566002 1631578 1710675 1799075 1888554 1968922 2030962 2068556 2079573 2066143
49160 2066143 2034321 1992390 1947953 1905754 1867722 1834477 1806345 1783301 1764763 1749884 1737952
49149 1737952 1728570 1721699 1717638 1716765 1719269 1725165 1734465 1747087 1762588 1780096 1798480 1816496 1832908
49136 1832908 1846633 1856810 1862852 1864811 1863875 1862114 1861341 1862266 1864783 1868641 1873479 1878627 1883473 1888011
49122 1888011 1892768 1898385 1905444 1914241 1924261 1934256 1943396 1952084 1961194 1970948 1981289 1993057 2007921
49109 2007921 2027319 2052454 2085427 2129439 2187246 2259389 2343524 2434768 2527176 2616514 2702690
49098 2702690 2789081 2878455 2968385 3049402 3107387 3129964 3113982 3068279 3007936 2944148 2878795
49087 2878795 2807651 2727160 2638091 2545031 2454402 2372407 2302989 2247028 2203529 2171217 2148703
49076 2148703 2133956 2124660 2118995 2115588 2113054 2110112 2105888 2099682 2090940 2080087 2068889 2059092 2050908
49063 2050908 2043467 2036480 2030615 2026304 2022994 2019739 2015997 2011721 2007148 2002778 1999350 1997675 1998329 2001170
49049 2001170 2005077 2008675 2011609 2014731 2018749 2023217 2027297 2030962 2034875 2039540 2045341 2053015 2063268 2076150
49035 2076150 2091499 2109838 2132058 2158258 2187622 2219444 2253645 2290248 2328873 2368606 2407791
49024 2407791 2444051 2475182 2500039 2518089 2528447 2530384 2524896 2514859 2503256 2491784 2481230 2472263
49012 2472263 2465271 2460019 2456102 2453597 2452896 2454110 2456967 2461211 2466946 2474556 2484216 2495367 2506804 2517558
48998 2517558 2527557 2537178 2546417 2554883 2562307 2568440 2572671 2574536 2574574 2573977 2573278 2572097 2570331 2568739 2567962
48983 2567962 2567631 2566989 2565911 2564739 2563446 2561558 2558865 2555794 2553001 2550728 2548514 2545494 2541084 2535323
48969 2535323 2528432 2520223 2510357 2499148 2487638 2476811 2467134 2458825 2452037 2446597 2442080 2438417 2436044
48956 2436044 2435354 2436463 2439727 2445904 2455413 2467827 2482517 2499480 2519046 2541027 2564635 2589233
48944 2589233 2614828 2641807 2670430 2700583 2731923 2764220 2797535 2832060 2867927 2905398 2945086
48933 2945086 2987643 3033241 3081653 3132773 3186632 3242846 3300520 3358839 3417379 3475827 3533898
48922 3533898 3591826 3650594 3711409 3775079 3841851 3911390 3982627 4053832 4122954 4187873 4246720
48911 4246720 4298723 4344896 4387376 4427931 4467460 4506684 4546362 4586496 4626084 4664213 4700954
48900 4700954 4736963 4772772 4808785 4845176 4881206 4915212 4945929 4973504 4998702 5021676 5042067
48889 5042067 5059848 5075368 5088805 5100167 5109482 5116343 5119544 5117822 5110841 5099046 5082963 5063405
48877 5063405 5042034 5020790 5000452 4980045 4957311 4929206 4892320 4843960 4783389 4711844 4631577
48866 4631577 4545223 4455635 4365273 4275556 4187309 4101828 4020835 3945389 3875499 3810824 3751032
48855 3751032 3695467 3643402 3594932 3550899 3511492 3475600 3442026 3410842 3383025 3359270 3339745
48844 3339745 3324658 3314329 3308707 3307199 3308980 3313256 3319337 3326713 3334959 3343513 3351809 3359868 3368455
48831 3368455 3378369 3389779 3402567 3417016 3433762 3453142 3474917 3498485 3523087 3548003 3573074
48820 3573074 3599001 3626682 3656127 3686403 3716734 3747260 3778490 3810420 3842555 3874580 3906700
48809 3906700 3939417 3973357 4009151 4046977 4086088 4125179 4163468 4201196 4238989 4277152 4315995
48798 4315995 4356536 4400312 4448384 4500812 4556933 4615617 4675088 4732990 4787015 4835439 4877137
48787 4877137 4911581 4939115 4960956 4978559 4993017 5004974 5014573 5021022 5022416 5016465 5001524 4977029
48775 4977029 4943410 4902020 4854857 4803754 4749688 4693026 4634233 4573914 4512301 4449186 4384546
48764 4384546 4318811 4252388 4185134 4116529 4046310 3974889 3903231 3832290 3762445 3693545 3625637
48753 3625637 3559627 3497168 3439937 3388964 3344279 3304909 3269390 3236546 3205721 3176255 3147154
$$ [...]
##END NTUPLES=NMR SPECTRUM
##END=
