##TITLE=AC1453_NESNAP272_7818805_155McSOorp
##JCAMPDX= 6.0         $$ Bruker NMR JCAMP-DX V2.0
##DATA TYPE= NMR SPECTRUM
##DATA CLASS= NTUPLES
##ORIGIN= BRUKER
##OWNER= Administrator
$$ 1.72 TOPSPIN		Version 2.1
$$ 2013-05-01 01:07:46.776 -0700  Administrator@X
$$ Compression mode = diff/dup
##.OBSERVE FREQUENCY= 400.02188249412
##.OBSERVE NUCLEUS= ^1H
##.ACQUISITION MODE= SIMULTANEOUS (DQD)
##.ACQUISITION SCHEME= undefined
##.AVERAGES= 8
##.DIGITISER RES= 22
##SPECTROMETER/DATA SYSTEM= spect
##.PULSE SEQUENCE= zg30
##.SOLVENT NAME= COFFEE_meoh
##.SHIFT REFERENCE= INTERNAL, COFFEE_meoh, 1, 14.98509
##AUDIT TRAIL= $$ (NUMBER, WHEN, WHO, WHERE, PROCESS, VERSION, WHAT)
$$ ##TITLE= Audit trail, TOPSPIN		Version 2.1
$$ ##JCAMPDX= 5.01
$$ ##ORIGIN= Bruker BioSpin GmbH
$$ ##OWNER= Administrator
$$ $$ E:\/data/COFFEE/nmr/AC1453_NESNAP272_7818805_155McSOorp/20/pdata/1/auditp.txt
$$ ##AUDIT TRAIL=  $$ (NUMBER, WHEN, WHO, WHERE, PROCESS, VERSION, WHAT)
(   1,<2013-05-01 01:07:39.916 -0700>,<Administrator>,<X>,<go>,<TOPSPIN 2.1>,
      <created by zg
	started at 2013-05-01 01:06:34.182 -0700,
	POWCHK enabled, PULCHK disabled,
       configuration hash MD5:
       F7 49 AB AC A2 8D 51 76 73 8D C1 9A A6 38 9F DE
       data hash MD5: 64K
       ED DF 86 71 18 67 87 41 CC E8 0F 3E C2 4E B0 5E>)
(   2,<2013-05-01 01:07:42.901 -0700>,<Administrator>,<X>,<proc1d>,<TOPSPIN 2.1>,
      <Start of raw data processing
       efp LB = 0 FT_mod = 6 PKNL = 1 PHC0 = 0 PHC1 = 0 SI = 32K 
       data hash MD5: 32K
       6E 46 68 7E DF 36 F7 B4 C2 40 21 B7 DF 10 E3 80>)
(   3,<2013-05-01 01:07:43.197 -0700>,<Administrator>,<X>,<proc1d>,<TOPSPIN 2.1>,
      <pk PHC0 = 99.59656 PHC1 = 0 
       data hash MD5: 32K
       21 41 89 9C 36 A8 06 80 E6 69 57 7F 8F DA DD F7>)
(   4,<2013-05-01 01:07:43.338 -0700>,<Administrator>,<X>,<proc1d>,<TOPSPIN 2.1>,
      <abs ABSG = 1 
       data hash MD5: 32K
       03 1E BC A0 05 FD 26 6E 04 E3 32 3C 4F A0 16 37>)
(   5,<2013-05-01 01:07:43.463 -0700>,<Administrator>,<X>,<proc1d>,<TOPSPIN 2.1>,
      <abs ABSG = 2 
       data hash MD5: 32K
       E7 87 9E 82 60 DD 8D AF E7 94 01 49 3E 9C 9C 29>)
(   6,<2013-05-01 01:07:43.526 -0700>,<Administrator>,<X>,<proc1d>,<TOPSPIN 2.1>,
      <abs ABSG = 3 
       data hash MD5: 32K
       76 F4 F4 8F F3 E9 E3 C4 4A 86 1C 6B 72 52 E3 B5>)
(   7,<2013-05-01 01:07:43.588 -0700>,<Administrator>,<X>,<proc1d>,<TOPSPIN 2.1>,
      <abs ABSG = 4 
       data hash MD5: 32K
       8C 72 51 D8 AE E0 6F 07 4D DA 12 C6 43 D1 B5 49>)
(   8,<2013-05-01 01:07:43.619 -0700>,<Administrator>,<X>,<proc1d>,<TOPSPIN 2.1>,
      <abs ABSG = 5 
       data hash MD5: 32K
       CF 14 A5 B0 4E 81 34 2B DD 92 85 84 03 C3 8A 0B>)
$$ ##END=
$$ 
$$ $$ hash MD5
$$ $$ A7 81 C4 26 14 0A DC 64 62 11 1C D1 74 64 13 E9
##$RELAX= 
##$RELAX= 
##$RELAX= 
##$RELAX= 
##$RELAX= 
##$RELAX= 
##$RELAX= 
$$ Bruker specific parameters
$$ --------------------------
##$DU= <E:\>
##$EXPNO= 20
##$NAME= <AC1453_NESNAP272_7818805_155McSOorp>
$$ [...]
150 150 150 150 150 150 150 150
##$TP07= 0
##$TPNAME0= <>
##$TPNAME1= <>
##$TPNAME2= <>
##$TPNAME3= <>
##$TPNAME4= <>
##$TPNAME5= <>
##$TPNAME6= <>
##$TPNAME7= <>
##$TPOAL= (0..7)
0.5 0.5 0.5 0.5 0.5 0.5 0.5 0.5
##$TPOFFS= (0..7)
0 0 0 0 0 0 0 0
##$TUNHIN= 0
##$TUNHOUT= 0
##$TUNXOUT= 0
##$USERA1= <user>
##$USERA2= <user>
##$USERA3= <user>
##$USERA4= <user>
##$USERA5= <user>
##$V9= 5
##$VALIST= <valist>
##$VCLIST= <CCCCCCCCCCCCCCC>
##$VD= 0
##$VDLIST= <DDDDDDDDDDDDDDD>
##$VPLIST= <PPPPPPPPPPPPPPP>
##$VTLIST= <TTTTTTTTTTTTTTT>
##$WBST= 1024
##$WBSW= 4
##$XGAIN= (0..3)
0 0 0 0
##$XL= 0
##$YL= 0
##$YMAX_a= 607385
##$YMIN_a= -518309
##$ZGOPTNS= <>
##$ZL1= 120
##$ZL2= 120
##$ZL3= 120
##$ZL4= 120
##$ABSF1= 14.98509
##$ABSF2= -5.573092
##$ABSG= 5
##$ABSL= 3
##$ALPHA= 0
##$AQORDER= 0
##$ASSFAC= 0
##$ASSFACI= 0
##$ASSFACX= 0
##$ASSWID= 0
##$AUNMP= <proc_prof1d_extract_pilot.lims>
##$AXLEFT= 0
##$AXNAME= <>
##$AXNUC= <1H>
##$AXRIGHT= 0
##$AXTYPE= 0
##$AXUNIT= <>
##$AZFE= 0.1
##$AZFW= 0.1
##$BCFW= 0
##$BC_mod= 0
##$BYTORDP= 0
##$COROFFS= 0
##$CY= 15
##$DATMOD= 1
##$DC= 0
##$DFILT= <>
##$DTYPP= 0
##$F1P= 0
##$F2P= 0
##$FCOR= 0.5
##$FTSIZE= 32768
##$FT_mod= 6
##$GAMMA= 0
##$GB= 0
##$INTBC= 1
##$INTSCL= 1
##$ISEN= 128
##$LB= 0
##$LEV0= 0
##$LPBIN= 0
##$MAXI= 10000
##$MC2= 0
##$MEAN= 0
##$ME_mod= 0
##$MI= 0
##$NCOEF= 0
##$NC_proc= -8
##$NLEV= 6
##$NOISF1= 0
##$NOISF2= 0
##$NSP= 0
##$NTH_PI= 0
##$NZP= 0
##$OFFSET= 14.98509
##$PC= 1
##$PHC0= 99.59656
##$PHC1= 0
##$PH_mod= 1
##$PKNL= yes
##$PPARMOD= 0
##$PPDIAG= 0
##$PPIPTYP= 0
##$PPMPNUM= 2147483647
##$PPRESOL= 1
##$PSCAL= 4
##$PSIGN= 0
##$PYNMP= <proc.py>
##$REVERSE= no
##$SF= 400.02
##$SI= 32768
##$SIGF1= 0
##$SIGF2= 0
##$SINO= 400
##$SIOLD= 32768
##$SPECTYP= <>
##$SREGLST= <1H.CDCl3>
##$SSB= 0
##$STSI= 32768
##$STSR= 0
##$SW_p= 8223.68421052631
##$SYMM= 0
##$S_DEV= 0
##$TDeff= 65536
##$TDoff= 0
##$TI= <>
##$TILT= no
##$TM1= 0
##$TM2= 0
##$TOPLEV= 0
##$USERP1= <user>
##$USERP2= <user>
##$USERP3= <user>
##$USERP4= <user>
##$USERP5= <user>
##$WDW= 1
##$XDIM= 32768
##$YMAX_p= 448724602
##$YMIN_p= -710950
##$CURPLOT= <Network HP LaserJet P1505>
##$CURPRIN= <$Network HP LaserJet P1505>
##$DFORMAT= <normdp>
##$LAYOUT= <+/1D_H.xwp>
##$LFORMAT= <normlp>
##$PFORMAT= <normpl>
##$SURQMSG= 1
$$ End of Bruker specific parameters
$$ ---------------------------------
##NTUPLES= NMR SPECTRUM
##VAR_NAME=  FREQUENCY,     SPECTRUM/REAL,   SPECTRUM/IMAG
##SYMBOL=    X,             R,               I
##VAR_TYPE=  INDEPENDENT,   DEPENDENT,       DEPENDENT
##VAR_FORM=  AFFN,          ASDF,            ASDF
##VAR_DIM=   32768,         32768,           32768
##UNITS=     HZ,            ARBITRARY UNITS, ARBITRARY UNITS
##FACTOR=    0.250966925370066, 1,           1
##FIRST=     8223.43324360094, 181466,       -152967
##LAST=      0,             -91292,          103285
##MIN=       0,             -710950,         0
##MAX=       8223.43324360094, 448724602,    0
$$ Real data points
##PAGE= N=1
##DATA TABLE= (X++(R..R)), XYDATA
$$ [...]
19533b25218A52177f3213p8835K0698a5749l1151A72172J95J83605C1103i8358
19521a36544e2335k06674F5521a09711B99868A25315m7044N3516M4089c3819m9231
19510h3050k22071B6867j866b5305H2718d2148k22881E4746L2389F650f9387l44853
19498d14240D5442b38148b9258k65492J15307b6006I3200a43002C39815j02215
19488B37600a08476j72711D5897a63156B41872a11580c8688j58351g1932E7121
19477E9979c0282J1717q7108k51939B21995a31953j3962f2628l44906b1130j71282
19466a92412C2428M7471Q103o356b32187a04998g699k04005D830O6653K7477g7878
19453b66440j64208d0020j28463a8888B42920l120R0157A37496f3538B63708g2341
$$ plain form
19533 -225218 152177 -63213 -142048 -121350 -15749 -46900 172172 172367 355972 31103 -98358
19521 -136544 -52335 -259009 65521 -109711 299868 125315 78271 131787 175876 -33819 -83050
19510 -83050 -305121 26867 25001 -25305 82718 -42148 -265029 54746 87135 6650 -69387 -414240
19498 -414240 45442 -238148 -29258 -294750 -179443 -26006 93200 -143002 339815 237600
19488 237600 -108476 -281187 45897 -163156 241872 -111580 -38688 -197039 -71932 57121
19477 59979 -30282 -18565 -105673 -357612 221995 -131953 -145915 -62628 -407534 -21130 -192412
19466 -192412 32428 79899 88002 81646 -232187 -104998 -7699 -211704 4830 71483 98960 -77878
19453 -266440 -430648 -40020 -168483 -18888 242920 239800 329957 137496 -63538 263708 -72341
19441a28845B8809a57718B10845f4467B27699c05665J6778A7494f6866m5069C14896
19429g741E2773c65811a40771k150J7779A86572F2592a53688G7536i8802D3887
19417h8304q9153A86107a69969O1825C1377h9555c9322l34237A26794a73762A67967
19405b61285c9032j98775O60n1371A09893a48882o1463O9049e7965C2007J58186
19394A90193G3793l3594e6836j0299G7330Q7537A8499a49096f4363B9361Q988
19383C8349a20888B47549c6684A20639g2373j38066B61104C6125J24542a37911
19372a30573I4743d2754n7314r5581k0627k4253B22457g1882A6259a47024p2778
19361b19802f9373j28906P8596D9663a77404j41223B06294D5987b96970a31875
$$ plain form
19441 -128845 28809 -157718 210845 -64467 227699 -305665 -288887 17494 -66866 -111935 314896
19429 -7741 52773 -365811 -140771 -142921 -125142 186572 62592 -153688 77536 -98802 43887
19417 -88304 -177457 186107 -169969 -108144 31377 -89555 -39322 -373559 126794 -173762 167967
19405 -261285 -39032 -237807 -237147 -288518 109893 -148882 -210345 -141296 -57965 32007 190193
19394 190193 73793 40199 -56836 -67135 77330 164867 18499 -149096 -64363 29361 38349
19383 38349 -120888 247549 -36684 120639 -72373 -210439 261104 36125 160667 -137911
19372 -130573 94743 -42754 -100068 -195649 -216276 -240529 222457 -71882 16259 -147024 -219802
19361 -219802 -69373 -198279 -119683 49663 -177404 -318627 206294 45987 -296970 -131875
19350d7856l11220J58030b9446A94093d2214M600A54382b92498A76880c7672A10225
19338I8279b83775B27433n8431c23641a14725E7948e9014O437j93252b9576o5219
19327i4795B883J48845e7594k91163a33927K8987o6098K7283k28148J08756A23533
19315B1374a54064E8016M2169a12710G1227d19179a20938J5438a6330C3459a17454
19303a11479j86430c5316p4169A29469e60087h189k28853c6653A14768c01371
19292A43989A2684J6765a94966N1497r6216J19308M5841k81336H9125d4238k05617
19281b49855A9001Q6545b33741J1106A21508d9428C3038a40185A02901K01072
19271C03973e1679k26612M0706A79473B32b47210q3569A1524a29167C30711a02281
$$ plain form
19350 -47856 -359076 -201046 -29446 194093 -42214 -37614 154382 -292498 176880 -37672 110225
19338 98279 -283775 227433 169002 -323641 -114725 57948 -59014 -52577 -245829 -29576 -94795
19327 -94795 2883 151728 -57594 -348757 -133927 -104940 -171038 -143755 -371903 -263147 123533
19315 21374 -154064 58016 100185 -112710 71227 -419179 -120938 -105500 -16330 33459 -117454
19303 -111479 -297909 -35316 -109485 129469 -560087 -8189 -237042 -36653 114768 -301371
19292 143989 12684 29449 -194966 -143469 -239685 -120377 -74536 -355872 89125 -44238 -249855
19281 -249855 19001 105546 -233741 -222635 121508 -49428 33038 -140185 102901 303973
19271 303973 -51679 -278291 -237585 179473 232 -247210 -330779 11524 -129167 330711 -102281
19259c15058a00318P226K325c1203k64312M2258A43860C3638R1190c6731k97809
19248c34540H9581J71116g7456l4047j0931p9127l7096o3414B07822o6639o7072
19237G4111J02384P2934A16400a78440p589B9738b11473B51420g4411j81610A36490
19225b65430J25404F2148O95a83927c9712j1405l43760A60105N3381L342b48782
19213E5272c19068B40269c11800g0203r9657K9633I9502L16041F0212a17307C4311
19201G5974a07093B3283b89513a44014A62962c95785o3624b09818A58609f4098
19190A15609C0791d92317J05527A21530c7258D902J50088C6103f9011A18704e3308
19178b8095E4490d91825A17961a77097A15629i4447A64871k0376O3129A01934
$$ plain form
19259 -315058 -100318 -93092 -90767 -31203 -295515 -253257 143860 33638 124828 -36731 -334540
19248 -334540 89581 260697 -77456 -111503 -122434 -201561 -238657 -302071 207822 141183 74111
19237 74111 176495 249429 116400 -178440 -186029 29738 -211473 251420 -74411 -256021 136490
19225 -265430 -140026 62148 62843 -183927 -39712 -51117 -394877 160105 213486 216828 -248782
19213 55272 -319068 240269 -311800 -70203 -169860 -140227 99502 415543 60212 -117307 34311
19201 75974 -107093 23283 -289513 -144014 162962 -395785 -459409 -209818 158609 -64098
19190 115609 30791 -492317 -386790 121530 -37258 4902 154990 36103 -69011 118704 -53308
19178 -28095 54490 -491825 117961 -177097 115629 -94447 164871 144495 207624 101934
19167a64837a6063A94869j8261B7604d26118f5741k30919O7296f7526A8646b04931
19155d03407I4459P8937a30097a4270C12585h3131A0483P325c02489j022c6840
19143a59301q264j91142A7074c50023a64160Q1A75397d1889j7374j84105A88462
19131b01315R6140A13051b9093H2817a04890o1426I2156a08690O364j08836l8128
19120b49290O7669F3189i5795B1341g311j30160j44228c8730C09140g5579B44942
19108a87561i3477L2025E5108a59206e039A22087A7892a7307k98431J37486p8138
19097b56390a2495j10775A99836q3300a19147o0851Q2497j57972k9013R5687M1019
19086a47780P0754L874A26313a18874h365H5673h6990j2171A47178e4406k91469
$$ plain form
19167 -164837 -16063 194869 176608 27604 -426118 -65741 -296660 -229364 -67526 18646 -204931
19155 -403407 94459 173396 -130097 -14270 312585 -83131 10483 17808 -302489 -303511 -36840
19143 -159301 -167565 -358707 17074 -350023 -164160 -164079 175397 -41889 -59263 -243368 188462
19131 -201315 -105175 113051 -29093 82817 -104890 -166316 92156 -108690 -102326 -211162 -249290
19120 -249290 -181621 63189 -95795 21341 -7311 -137471 -281699 -38730 309140 -75579 244942
19108 -187561 -93477 -61452 55108 -159206 -5039 122087 17892 -17307 -315738 -178252 -256390
19097 -256390 -12495 -123270 199836 116536 -119147 -179998 -97501 -255473 -284486 -188799 -147780
19086 -147780 -77026 -73152 126313 -118874 -8365 85673 -86990 -99161 147178 -54406 -345875
19075c45875A07255b31357A86980a44655B17458a29793j84232a32390j31107A93083
19064f0228A35438b67204i2124M4101G4930A7748J39304a30923j16810E038c3263
19052C309d4554M489F029a26042A84728b88857B4125K31937G599J66410G2889
19040e3453a6967j69254A35219O9447F4594K78034H6410h7150j6570C44018A46012
19028C0814b72633B7576a43315A6594g4483A83001K4181a18622L0279j91794b1127
19016C3573a12258K9647c0111A44099c52622H4005b91982m4673c5293p8063a8021
19004a14960j38851g2776q3253b7779n0368A70332D3066h0347k17624a14959q3324
18993a98283f3119K8139k25982f3969A06206J07252I99Q3447i0894d1248l9249
$$ plain form
19075 -345875 107255 -231357 186980 -144655 217458 -129793 -314025 -132390 -263497 193083
19064 -60228 135438 -267204 -92124 -48023 74930 17748 157052 -130923 -247733 5038 -33263
19052 3309 -44554 -40065 6029 -126042 184728 -288857 24125 256062 7599 174009 72889
19040 -53453 -16967 -186221 135219 204666 64594 342628 86410 -87150 -103720 344018 146012
19028 30814 -272633 27576 -143315 16594 -74483 183001 207182 -118622 -88343 -280137 -21127
19016 33573 -112258 -82611 -30111 144099 -352622 84005 -291982 -336655 -35293 -113356 -18021
19004 -114960 -253811 -72776 -156029 -27779 -78147 170332 43066 -80347 -297971 -114959 -198283
18993 -198283 -63119 -34980 -260962 -63969 106206 213458 999 84446 -90894 -41248 -80497
18982h0497b9102l38384a16084N1826C0669c1238C22239j55740c76619e1395q8016
18971a39411j08338P7892g4245M260B02462c50205J12398j1609B07109d0699A64588
18959A1015M5500b44201R3923o8856E0286b0165n0961j36847A63666a11270j71397
18948b82667B07874e5686m2485A08795J32054M4601l0953a13429q0683i6730C28938
18936d0606J649p7509A1560a11446M5646j07361A8195a69654L7269B583i8484
18924a32788A01796P6021K31742a20319l89613a20884o9459M7320K8553p5773
18914a90243b3511N705B31943K18808a80520J4685I9012d7050D5675a03853j53328
18903b57181B29334F0067c0613j22995m3272d703G4726b34046I6958a73017A66711
$$ plain form
18982 -80497 -29102 -367486 -116084 -64258 30669 -31238 322239 166499 -376619 -51395 -139411
18971 -139411 -247749 -169857 -74245 -69985 202462 -350205 -237807 -249416 207109 -40699 164588
18959 11015 56515 -244201 -150278 -219134 50286 -20165 -71126 -207973 163666 -111270 -282667
18948 -282667 207874 -55686 -98171 108795 240849 285450 254497 -113429 -194112 -96730 328938
18936 -40606 -38957 -116466 11560 -111446 -65800 -173161 18195 -169654 -132385 2583 -98484
18924 -132788 101796 177817 409559 -120319 -509932 -120884 -190343 -143023 -114470 -190243
18914 -190243 -23511 -17806 231943 450751 -180520 -165835 99012 -47050 45675 -103853 -257181
18903 -257181 229334 60067 -30613 -153608 -196880 -4703 74726 -234046 96958 -173017 166711
18891b71294b0782B25470c6032j01526A08674e0286j90444k50195J73496C12445
18880a78734P4303l04417a02603j00795L397i2300p9131F6157a85415l7249n6431
18869b79095k2551i1677A89925g6738j42067m28644a65605H5688k4957a43740
18858b42394N5098r6751B80666a44223L0764m122c6317k48070B37866M9593a08365
18846b50202E8396N56654H6992K06323E000J1446a82598R0540L282j10257M2565
18835a56468j1334A31347a50416l17860g7743I1690J09523h9569c3942A06006
18824b2126j00029A30857n6970a73404d173q7363j6327I3640J06793C1424a24633
18812i629j14030F1511b32304F3749J95602a49866k14751A76500e11400f216I680
$$ plain form
18891 -271294 -20782 225470 -36032 -137558 108674 -50286 -240730 -490925 -317429 312445
18880 -178734 -104431 -408848 -102603 -203398 -200001 -92300 -171431 66157 -185415 -222664 -279095
18869 -279095 -301646 -91677 189925 -76738 -218805 -647449 -165605 85688 60731 -143740
18858 -242394 -187296 -284047 280666 -144223 -113459 -117581 -36317 -284387 237866 287459 -108365
18846 -250202 58396 615050 86992 293315 5000 16446 -182598 -92058 -88776 -199033 -156468
18835 -156468 -167802 131347 -150416 -468276 -77743 91690 201213 -89569 -33942 106006
18824 -22126 -122155 130857 73887 -173404 -4173 -91536 -107863 93640 200433 31424 -124633
18812 -9629 -123659 61511 -232304 63749 259351 -149866 -364617 176500 -511400 -6216 9680
18800a68843I7999a19022n6089B8947c60827A80851o3535m4697c19824h4881r6856
18789a81737g7022c2336C1451f2547A656c48974a66309c5281o9808j73552A20374
18777a72485d4606I3929K10393g9604D79193A41602b36276c5383B3691b89245
18766F1261J5848a15062B31106a69584A10016Q5602c22510J49009c3209p3555
18756a06764b8017q9601d2524j68773d8068k68227F6424K73435a29982A01110
18745b22254e9056j69299R4355B80919A1731a55747M963f6762j48894A65564a1923
18733B3854C998J69759F4109N4674i4119H5610b12238b8068o4451E054K20744
18722B25798d4498E9866C922d20672a9552G5472b69298A88720c02892j36133a88607
$$ plain form
18800 -168843 97999 -119022 -175111 28947 -360827 180851 117316 72619 -319824 -84881 -181737
18789 -181737 -77022 -32336 31451 -62547 1656 -348974 -166309 -35281 -105089 -278641 120374
18777 -172485 -44606 93929 304322 -79604 479193 141602 -236276 -35383 23691 -289245
18766 61261 77109 -115062 231106 -169584 110016 195618 -322510 -173501 -33209 -106764
18756 -106764 -28017 -117618 -42524 -211297 -48068 -316295 66424 339859 -129982 101110
18745 -222254 -59056 -228355 -134000 280919 11731 -155747 -150784 -66762 -215656 165564 -11923
18733 23854 3998 173757 64109 118783 -94119 85610 -212238 -28068 -92519 5054 225798
18722 225798 -44498 59866 3922 -420672 -19552 75472 -269298 188720 -302892 -439025 -188607
18710g7245B22122G2155h9670C1468K03545c0430A59447c59101a76800k33006
18700d09806A05569B6908m4f3000K065B04113L5083a21768j36371i8681K6965
18689g1716C34240d04683P9077A93017a67862o470j54199I2602a86379f2905j35443
18678a98348k12843a91118G8869a57280B8886M3526M7000h9351A72647b0946q2525
18667a03471A03960c9305F4509b69331b5127F4346b3995H7190a75640f5922A17799
18655A87415r3352m0347b84676H4952b58659a08698L1202m3290c1313l21425B9475
18643A81514J8486a23978B9238M6790L1572a63763M6952b1146A03697i4371B6546
18631D5104c43928J57470C3536h4701D2662a43582A58023h5327k18993P7963l1095
$$ plain form
18710 -77245 222122 72155 -89670 31468 235013 -30430 159447 -359101 -176800 -409806
18700 -409806 105569 26908 26864 -63000 -60935 204113 239196 -121768 -258139 -98681 -71716
18689 -71716 334240 -404683 -325606 193017 -167862 -174332 -328531 92602 -186379 -62905 -198348
18678 -198348 -411191 -191118 78869 -157280 28886 72412 119412 -89351 172647 -20946 -103471
18667 -103471 103960 -39305 64509 -269331 -25127 64346 -23995 87190 -175640 -65922 117799
18655 187415 94063 53716 -284676 84952 -258659 -108698 -77496 -120786 -31313 -352738 29475
18643 181514 200000 -123978 29238 76028 107600 -163763 -116811 -21146 103697 -94371 26546
18631 45104 -343928 -186458 33536 -84701 42662 -143582 158023 -85327 -304320 -226357 -257452
18620b57452M0038h8329a0909A5561a17587A253J84312a0203l693C4113d84624
18608a08717k7767I5838d46241h8374K8712p758j0490A05419a23971F8800c2625
18596D5306b7762A78853b13439i8107l3906j83405h5668b9989j99067A23332A9472
18584a70142A34836e7246C43661j42464h0717j48712m0953q4188a32122f1390
18573b74206B93335b10911F2250a91556A16890e9814j71500H9003B1968f938o4556
18562g1494j23570R3830j58131C7827a38032B4491N058P690L838i3814j51972
18551b45786l6531F1093f9465j3168r5916A07598i5722A39725F6724a65181A7921
18539g7699A4531K0535a67741e8440r0833B21084F2348b26461k7104D2779b19558
$$ plain form
18620 -257452 -217414 -88329 -10909 15561 -117587 1253 185565 -10203 -13896 34113 -484624
18608 -108717 -136484 95838 -446241 -88374 -59662 -67420 -77910 105419 -123971 68800 -32625
18596 45306 -27762 178853 -213439 -98107 -132013 -315418 -85668 -29989 -229056 123332 19472
18584 -170142 134836 -57246 343661 201197 -80717 -229429 -270382 -354570 -132122 -61390
18573 -274206 293335 -210911 62250 -191556 116890 -59814 -231314 89003 21968 -6938 -71494
18562 -71494 -195064 -101234 -259365 37827 -138032 24491 29549 37239 41077 -93814 -245786
18551 -245786 -282317 61093 -69465 -82633 -178549 107598 -95722 139725 66724 -165181 17921
18539 -77699 14531 35066 -167741 -58440 -149273 221084 62348 -226461 -253565 42779 -219558
18527b05436k37077g6952J834r1975P1545j06521j12856a3902j69785F4708c10550
18515B21858A10865b32996B11270E6583J66858D9540b06731J01579A04626j7798
18505H6828k0573f7568A57763f1158k57885i1868H2920a68721m5105Q8794N7678
18494f7354F0504O2105h2376k92523a4369k74A28987g8204A01686J4808d70888
18482a131j71331d9649E3825K55272b15977A03373K459b08048c5480o2126B3821
18470b2505G367a25436C6377K95843E7308c41703H6450b62067B45246b32952B6468
18458b06992F0438R5746f4344r4530n3319Q6753B9085a11386j34392h5461A4867
18446C24490F8758a38599A9320g7034B03542a98854J2084B740R4938c8853A24213
$$ plain form
18527 -205436 -442513 -76952 -75118 -167093 -95548 -202069 -314925 -13902 -183687 64708 -310550
18515 221858 110865 -232996 211270 56583 223441 49540 -206731 -105152 104626 86828
18505 86828 66255 -67568 157763 -61158 -319043 -91868 82920 -168721 -213826 -125032 -67354
18494 -67354 60504 122609 -82376 -374899 -14369 -14643 128987 -78204 101686 116494 -470888
18482 -1131 -172462 -49649 53825 309097 -215977 103373 105832 -208048 -35480 -97606 23821
18470 -22505 7367 -125436 36377 332220 57308 -341703 86450 -262067 245246 -232952 26468
18458 -206992 60438 156184 -64344 -158874 -212193 -125440 29085 -111386 -245778 -85461 14867
18446 324490 68758 -138599 19320 -77034 203542 -198854 -186770 2740 97678 -38853 124213
18434c2977G5256C7438b72656h121H1233k0309a56503F7685d3716n9111A68745
18422a28906A22825e79461A04085K29968a9957B79481a67368A44709i7555C27932
18411B31415b6376l99874B87020a18670B56908L6202a53869e300l14063e5519
18400a53618q6226A58300b59884a04869B69730b05994o8203A32799D2011i0403
18389B01317b55250p0035p6640a78751B64702a75082d6610p6213I5497a42932
18378B89098A15599b96985B08263a46403K240a8872j72807O1121m2413P6312H3029
18366a26421K0666H800P4846a53502H7982K87620b69694b0640c821A48041m7189
18355A00852O7866h8099L7091k16730d9885I151b34781J0543f2250A52206L1670
$$ plain form
18434 -32977 75256 37438 -272656 -8121 81233 60924 -156503 67685 -43716 -102827 168745
18422 -128906 122825 -579461 104085 334053 -19957 279481 -167368 144709 -97555 327932
18411 231415 -26376 -426250 287020 -118670 256908 293110 -153869 -5300 -319363 -55519
18400 -153618 -239844 158300 -259884 -104869 269730 -205994 -274197 132799 42011 -90403
18389 201317 -255250 -325285 -401925 -178751 264702 -175082 -46610 -122823 95497 -142932
18378 289098 115599 -296985 208263 -146403 -144163 -18872 -191679 -130558 -172971 -96659 83029
18366 -126421 -105755 8800 83646 -153502 87982 375602 -269694 -20640 -3821 148041 100852
18355 100852 168718 -88099 -51008 -267738 -49885 9151 -234781 -224238 -62250 152206 183876
18344A83876b9012k19023e313A0864b28019j72167d7310C17293f5933K9281E01598
18332c78163A89793D2645a00659B8753K73060h1594p0505C06402G3526a17992
18321a02011A4938a2016D4061b22324f1718p2933N3231A25428D3354a61621d7720
18309a01718r1993A67602h5925E9427b62201a24718a0503p3078C14274I836b4772
18297B72727J35310c8980j82540A35970c56791f9385A8145d36040B2748b18958
18286a75290H4464M8364b38038F6887L10240b0411A45929f6256B8259L1881J25540
18275A85680G7966a13034b1316l0614A83417K0039c4711E8333a06080n2639b7185
18263a7134e541j68039N6780k6652q3698g9548j4928a8551r9938k17057O6404
$$ plain form
18344 183876 -29012 -248035 -5313 10864 -228019 -400186 -47310 317293 -65933 -36652 501598
18332 -378163 189793 42645 -100659 28753 301813 -81594 -152099 306402 73526 -117992
18321 -102011 14938 -12016 44061 -222324 -61718 -134651 -81420 125428 43354 -161621 -47720
18309 -101718 -193711 167602 -85925 59427 -262201 -124718 -10503 -83581 314274 9836 -24772
18297 272727 408037 -38980 -221520 135970 -356791 -69385 18145 -436040 22748 -218958
18286 -175290 84464 132828 -238038 66887 377127 -20411 145929 -66256 28259 60140 185680
18275 185680 77966 -113034 -21316 -51930 183417 203456 -34711 58333 -106080 -158719 -27185
18263 -17134 -5541 -173580 -116800 -143452 -227150 -79548 -94476 -18551 -118489 -335546 -269142
18252b69142p3824A0234N2284a96841c435A44298a88243F8628i0841D6840b09640
18240A3760o196a9206n4958A87765a05574c7915k82612d9612A2049d36637A41309
18228A51609n0879b07010h9082E9618J91433B1533i1627B65983c3414R304E6277
18216b23498l7256A34586P8096l649r5108b06095f4580j03556E4067c87433a58308
18204a16867F2600a45258b4622A83956a08778k49487c7287D7262N1052f7730K0365
18193d7365k306K3885l65729A0523a22534n3905a1426E6301b3878B8689a54343
18181F6731a16127r8166I6459h380l94757A52407B6255h3109a369l23848J2112
18170c13105C6865K0654a80238c0127j22408C182M6029K03060a62112d1774D28907
$$ plain form
18252 -269142 -342966 10234 62518 -196841 -3435 144298 -188243 68628 -90841 46840 -209640
18240 13760 7564 -19206 -74164 187765 -105574 -37915 -320527 -49612 12049 -436637 141309
18228 151609 100730 -207010 -89082 59618 251051 21533 -91627 265983 -33414 -24110 56277
18216 -223498 -260754 134586 212682 209033 113925 -206095 -64580 -168136 54067 -387433 -158308
18204 -116867 62600 -145258 -24622 183956 -108778 -358265 -37287 47262 98314 -67730 -47365
18193 -47365 -49671 -25786 -391515 10523 -122534 -176439 -11426 56301 -23878 28689 -154343
18181 66731 -116127 -214293 96459 -8380 -403137 152407 26255 -83109 -1369 -325217 -313105
18170 -313105 36865 57519 -180238 -30127 -152535 3182 49211 252271 -162112 -41774 428907
18158A26935e1998q2522a4976m03509b1760k75740a16280A77707a85302d0951
18147b07911j92070A52834g514j23821p2170k8999a05887r0240G3269A4954f8206
18135I9371A8179M95540h9436j01091j33257e8205n3155a0202l91431C46926a0023
18123A27246K4697a59827C03539k8868D994J23236a15396N7462j36018q343B4809
18111A29362q426j9966A9779a133m80084C24820c01597A5171J83769B519a47729
18099D619b39080K4342j1469A18573K71700F852a55512K4527B26084c90238H3469
18087H9564L61678A61560c31212L0944p277H5525b75925a28930D8346a03040A67374
18075a70264L6010p0654F4473M8226c2547a4010B98469b02767A50143C5041J3142
$$ plain form
18158 126935 -51998 -134520 -14976 -418485 -21760 -297500 -116280 177707 -185302 -40951
18147 -207911 -399981 152834 -7514 -131335 -203505 -232504 -105887 -196127 73269 14954 -68206
18135 99371 18179 513719 -89436 -190527 -323784 -58205 -111360 -10202 -401633 346926 -10023
18123 127246 151943 -159827 303539 274671 4994 128230 -115396 -57934 -193952 -202295 24809
18111 129362 120936 100970 19779 -1133 -481217 324820 -301597 15171 198940 2519 -147729
18099 4619 -239080 -214738 -226207 118573 390273 6852 -155512 -130985 226084 -390238 83469
18087 89564 451242 161560 -331212 -300268 -307545 85525 -275925 -128930 48346 -103040 167374
18075 -170264 -134254 -204908 64473 112699 -32547 -14010 298469 -202767 150143 35041 48183
18064D8183b235l24023o6955P887e9382j6513l2896A74715f2104l7271E6955a96402
18051A42066b43272E1804J36249D9019a08358B735c67850J77449A95087J27455
18041C22542G0024L9062P0732a8896A24699k9597J93748c53587a69468m8142k47363
18030d64973g4794B92414g3712p1785g1050r6799C25156a61824A47971b45268
18019a43064A30272a64214D1223a94003C71L9312j3575i2057C9036J64283G8840
18007c9806m8316c4889j13798D0073A6578J59990f5456o4269j33760A65688a24556
17995b05328A82571k3341l882J2699C0958a28777C7225a517l31142i1947A33172
17983a45492g2087A29256j9218j3082c42234P8983J23243L514e1523A21546b3196
$$ plain form
18064 48183 -2235 -326258 -393213 -385326 -59382 -75895 -108791 174715 -62104 -99375 56955 -196402
18051 142066 -243272 51804 188053 49019 -108358 2735 -367850 -190401 195087 322542
18041 322542 70024 109086 179818 -18896 124699 95102 288850 -353587 -169468 -217610 -464973
18030 -464973 -74794 292414 -73712 -145497 -71050 -167849 325156 -161824 147971 -245268
18019 -143064 130272 -164214 41223 -194003 371 39683 26108 -92057 39036 203319 78840
18007 -39806 -88122 -34889 -148687 40073 16578 176568 -65456 -129725 -263485 165688 -124556
17995 -205328 182571 159230 155348 168047 30958 -128777 37225 -1517 -332659 -91947 133172
17983 -145492 -72087 129256 110038 96956 -342234 -263251 -140008 -136494 -51523 121546 -23196
17971e4280I6094j211a67858M589A79731a26687A40982f6916J1632k01072m5085
17960c01441A64908F2360b95362P6086A9275b23908A81598b92021D005N0610a73372
17948e7108k1674A34775a79679l9535h9307j11667B62233F5159a37645H4182R5758
17937A79940c6925D8115A2221J18146a70289k7353C4819d738r4811a658A1308
17925A79373M1957f962A50921J01033f0454b4235H9323K05759a8650j05976B49205
17913b32567k8352a07159m0021A65092e9994A3014J40837J13400j6835j16681
17903A33735g7442D4235k1703J75364k1062a87461j32906A96850a27287q5419
17893b12706A24494m3001f4828B98755A38581h6626a7213D9921J16956C859J06216
$$ plain form
17971 -54280 96094 94883 -167858 -163269 179731 -126687 140982 -66916 -55284 -256356 -301441
17960 -301441 164908 62360 -295362 -219276 19275 -223908 181598 -292021 4005 54615 -173372
17948 -57108 -78782 134775 -179679 -219214 -89307 -200974 262233 65159 -137645 84182 179940
17937 179940 -36925 48115 12221 130367 -170289 -197642 34819 -4738 -99549 -1658 11308
17925 179373 221330 -6962 150921 251954 -60454 -24235 89323 295082 -18650 -124626 249205
17913 -232567 -260919 -107159 -147180 165092 -59994 13014 153851 267251 250416 133735
17903 133735 -77442 44235 22532 197896 176834 -187461 -320367 196850 -127287 -212706
17893 -212706 124494 81493 -64828 298755 138581 -86626 -17213 49921 166877 3859 110075
17882A10075a26129A51612d15741c5462B0513O3071d4656H9447c9613H8536a59554
17870a63264n6853A88858e4352l8048J9165B65524G5375N2701J01982b18287O7542
17859a50745E7303K38421c48173a47423k50026e4649a3022l66000A76182f2253
17848C8026l05J75113a10884b6850A54152A1505g0278j4930q5790d2318C58856
17836a96735m6781a17552d5512B58189f668j01985F0619a49194J076A26430J02954
17825B29384a18530H7978a32528b4944k23340a12746j82539H5755a11636o0280
17815a71916C0624d1188A61583O2025a58590M9360q8732K7849k72467c7641r4298
17804a31939C76662g1794j4516J896B4238a03976k79535D8102d052l11494a32120
$$ plain form
17882 110075 -126129 151612 -415741 -35462 20513 83584 -44656 89447 -39613 88536 -159554
17870 -163264 -220117 188858 -54352 -92400 -73235 265524 75375 128076 230058 -218287 -150745
17859 -150745 57303 295724 -348173 -147423 -397449 -54649 -13022 -379022 176182 -62253
17848 38026 37721 212834 -110884 -26850 154152 11505 -70278 -85208 -170998 -42318 358856
17836 -196735 -243516 -117552 -45512 258189 -6668 -108653 60619 -149194 -148118 126430 229384
17825 229384 -118530 87978 -132528 -24944 -248284 -112746 -295285 85755 -111636 -171916
17815 -171916 30624 -41188 161583 223608 -158590 -109230 -197962 -170113 -442580 -37641 -131939
17804 -131939 376662 -71794 -86310 -84414 24238 -103976 -383511 48102 -4052 -315546 -132120
17792a11274J9957A82815a80278D1291R9893B3212M31964A17539M9647F6275P7075
17781A43350b4249A11113C6269K7758b05233m5441I6660J2927J46817a98774g0675
17769b94253A9277O424L04598c20962C46495b64503A39613a08879B1222b50935
17758E325J46401c62335B42555C8986p727J21314a15878G9410L0990f9496L2833
17747c6663n2310B47637e0839j50760f7234E3547K49690D6768K88988c24132I3207
17735a82788A4694c4341A08881i4005j22473A78112a1787k25219H7544A1450L2688
17724D4138e211I1816R5742a18541M0190c957I4502b02594d1206k05764m5626
17713b92596I9246J3075b1266G90L85958k5576D9276L93512f7091K9485C88790
$$ plain form
17792 -111274 -91317 182815 -180278 41291 141184 23212 455176 117539 167186 66275 143350
17781 143350 -24249 111113 36269 64027 -205233 -250674 96660 109587 256404 -198774 -70675
17769 -294253 19277 25701 330299 -320962 346495 -264503 139613 -108879 21222 -250935
17758 5325 151726 -362335 242555 38986 31259 152573 -115878 79410 110400 -69496 -36663
17747 -36663 -88973 247637 -50839 -201599 -67234 53547 303237 46768 335756 -324132 93207
17735 -182788 14694 -34341 108881 -94005 -216478 178112 -11787 -237006 87544 11450 44138
17724 44138 -5211 91816 187558 -118541 -78351 -3957 94502 -202594 -41206 -246970 -292596
17713 -292596 99246 112321 -21266 790 386748 361172 49276 442788 -67091 -37606 388790
17701B1297e20k25590N366B61792E3340J23433L4723H0295b15734c9196I5850
17689b0055j76941b4083b861p0036C80830f6461O687I8122b57865a8795O121I5634
17676B9831g7757j79338a14530e6858E1565a3797r9108H3923R6796b23595A87793
17664A97263a52435H812K04117e3759A76805G0074K37068g2727A05561c11585
17653i3749B5393f5232B07061a90096P9791A11384M9126k4542c56831B23075c80488
17641A35906d04944a09264j66902b5451k82379i6919F3242f8473b2436k92702
17631c15138c9485m25563B4914c0922k21433d0860A58767o6093g9881A0035K59543
17620B69578a73024h2209A34971a67042B5527P7189b00721F7878K09690j04909
$$ plain form
17701 21297 -520 -226110 -220744 261792 53340 176773 211496 80295 -215734 -39196 95850
17689 -20055 -196996 -24083 -2861 -72897 380830 -66461 -59774 98122 -257865 -18795 -12674 95634
17676 29831 -77757 -257095 -114530 -56858 51565 -13797 -112905 83923 180719 -223595 187793
17664 197263 -152435 8812 212929 -53759 176805 70074 307142 -72727 105561 -311585
17653 -93749 25393 -65232 207061 -190096 -110305 111384 160510 135968 -356831 223075 -380488
17641 135906 -404944 -109264 -276166 -25451 -307830 -96919 63242 -68473 -22436 -315138
17631 -315138 -39485 -465048 24914 -30922 -252355 -40860 158767 92674 -79881 10035 269578
17620 269578 -173024 -82209 134971 -167042 25527 102716 -200721 67878 277568 172659
17610A72659i7606D4111L30163h9427C45353b38825A98114G9821J21262p0369
17600A30714a9785A39322N8298a01558k15781A05440j093B7757c9777A43431b40073
17588C38211r8909c6718I4467K38965e6946B13510b03489l8939a10605K0824A31004
17576d4331p3467K8728J4484B42627c8545I7240J41897J163j13126m8458N9540
17565A38256m495J16235q1810c93483A60296h5461j59288A23388D6849a18769
17554B63182a017m59003A72503J2233N8880O6151B595c14336B09787c31493I3266
17542C353J27558a98789C9842c8741H8135R920h0518j67886E7333O7968C5922
17530D9261L355L0800J12369K15800d0649n7488N634l15099A11265M160A0864
$$ plain form
17610 172659 -97606 44111 374274 -89427 345353 -238825 198114 79821 201083 130714
17600 130714 -19785 139322 197620 -101558 -317339 105440 104347 27757 -39777 143431 -240073
17588 338211 239302 -36718 94467 333432 -56946 213510 -203489 -242428 -110605 -89781 131004
17576 -44331 -117798 -89070 -74586 242627 -38545 97240 239137 240300 127174 78716 138256
17565 138256 133761 249996 168186 -393483 160296 -85461 -244749 123388 46849 -118769
17554 263182 -1017 -460020 172503 184736 243616 309767 2595 -314336 209787 -331493 93266
17542 3353 130911 -198789 39842 -38741 88135 98055 -80518 -248404 57333 125301 35922
17530 49261 52616 83416 195785 411585 -40649 -98137 -92503 -407602 111265 115425 10864
17518b19590A77591o7287b6197B97679a91318a1867l4332A46872c5520G1347J37594
17507B08941j0667g3693k39719A61925c0630A57632C9366L3659K44873J35834
17497D53732F2833d196B43157o8403q4505J52385f235H9767C6490J27988A6194
17485B1974c19953B31162J08057h4738B11499E2697d8292A77516H1180D0084b2991
17473d881G58a14735B46241I6546n526P7640J43312A50707l8332J89439H756K29597
17461B38353E909P9766J19001j6333P0335A17313K77894G6594J28776N27845k64415
17450D68800j53106I5584J30095r2169N2278j3637c2565B09333A02056m8478Q0213
17439A33791P3061R0029r0267i69k0596B23924M8976j8768K41360I1219j1682
$$ plain form
17518 -219590 177591 110304 -26197 297679 -191318 -11867 -46199 146872 -35520 71347 208941
17507 208941 198274 -73693 -313412 161925 -30630 157632 39366 73025 317898 453732
17497 453732 62833 -4196 243157 174754 90249 242634 -6235 89767 36490 164478 16194
17485 21974 -319953 231162 339219 -84738 211499 52697 -48292 177516 81180 40084 -22991
17473 -4881 758 -114735 246241 96546 91020 168660 311972 150707 112375 301814 8756 238353
17461 238353 5909 85675 204676 188343 258678 117313 395207 76594 205370 733215 468800
17450 468800 315694 95584 225679 133510 185788 172151 -32565 209333 102056 53578 133791
17439 133791 206852 296881 206614 -969 -21565 223924 272900 254132 495492 91219 79537
17428G9537R5519E2777L08317Q7871A51335N7941K36896B01770J90506o0267J01805
17417D33814E8337P1166J23386A08258M90779k0157E4354K00856o0907a67215
17406c958B43934c31592a47721j79468g3908r739D0419b30398a09911A06118n2744
17395E3374L09366k7196R657j52717B9215a28290f6D8649K10826H5331K84054
17384C69385d0613A15132D5508K29284A26805M27890A10056P2341Q7993j05421
17374A64969D3123J13150a72156G9037K4214J95669D591J71427R2048I1782J34754
17363B26536J80808A00085a83966f4582A28402e081C34294i1084B84741b95463
17352B65321J61634A37246R8983a9751A19048a2703q015A45587J55052I9592J70999
$$ plain form
17428 79537 175056 52777 361094 448965 151335 209276 446172 201770 392276 332009 433814
17417 433814 58337 129503 252889 108258 599037 578880 54354 255210 194303 -167215
17406 -3958 243934 -331592 -147721 -327189 -73908 -83647 40419 -230398 -109911 106118 53374
17395 53374 362740 335544 345201 192484 29215 -128290 -66 48649 259475 85331 369385
17384 369385 -40613 115132 45508 274792 126805 554695 110056 182397 270390 164969
17374 164969 43123 156273 -172156 79037 103251 298920 4591 176018 268066 91782 226536
17363 226536 407344 100085 -183966 -64582 128402 -5081 334294 -91084 284741 -295463
17352 265321 426955 137246 236229 -19751 119048 -12703 -20718 145587 300639 99592 270591
17341B70591n899J8684r1141g586B15073n9653N3708a84529E4539M07667a1724
17329d0418A22104A040J98663F5570a83844P6169J4619A78444L1740A00527b0366
17317A47673f1470C43869A17555c22054K1207D50907A94291O4422l7062B5073
17306a11701A79217a48033B70544r9980J74347p9288B5992K98700H7670J55799
17296B43469q9243g3212j3299C33132E8666J63324A06490J0311C2555J4159J60435
17285B07149Q5755p1431k1568r7652J77844j35024h1021j01806g4460A01266B130
17273C69132j83666f192C04628A52079Q6717a46858A93867P2785n6900J46121
17263C55873a28983j10643A91098q4241N0045a42182b205D3696K42743m6484j1468
$$ plain form
17341 270591 264692 283376 192235 -7586 215073 155420 209128 -184529 54539 462206 -11724
17329 -40418 122104 1040 199703 65570 -183844 -107675 -93056 178444 210184 100527 -20366
17317 147673 -61470 343869 117555 -322054 -300847 450907 194291 258713 221651 25073
17306 -111701 179217 -148033 270544 170564 344911 265623 25992 324692 87670 243469
17296 243469 154226 -73212 -86511 333132 58666 221990 106490 116801 32555 46714 207149
17285 207149 292904 221473 199905 102253 280097 145073 -81021 -182827 -74460 101266 2130
17273 369132 185466 -6192 304628 152079 238796 -146858 193867 266652 209752 355873
17263 355873 -128983 -239626 191098 106857 156902 -142182 -2205 43696 286439 239955 228487
17252B28487J69246m5649A1561L35970H2032J9317P9151R405J8044m2901b45230
17240E14585H7136K59284R7573C6644c62796A16430C8074K11558j01523K20876
17230C68985j65001K5714j08248a9939B00015J51613G3841J2035K01869A5344
17219B7851R7264j4527d3749A24871b6883E9864R4769K9466R1868f9716C87867
17207C25638G7820J67484K32580F3519J74142H5216J84434p6071J37601H0173
17196A22990J40572k2734J78525A68318n6926K48361A40149F6959A7038K85230
17186C02268e4110j81515I4654M416K5134n6227J27962e6773m3436B30836e7769
17174c5858A81499K99482m3681j79731J49271r6901m2308M03807B38807k8004
$$ plain form
17252 228487 397733 352084 11561 347531 82032 101349 180500 189905 207949 165048 -245230
17240 514585 87136 346420 443993 36644 -362796 116430 38074 249632 148109 368985
17230 368985 203984 229698 121450 -19939 200015 351628 73841 85876 287745 15344
17219 27851 125115 110588 -43749 124871 -26883 59864 154633 184099 275967 -69716 387867
17207 325638 77820 245304 477884 63519 237661 85216 269650 193579 331180 80173
17196 122990 263562 240828 419353 168318 111392 359753 140149 66959 17038 302268
17186 302268 -54110 -235625 94654 99070 124204 67977 195939 -56773 -100209 230836 -57769
17174 -35858 181499 480981 437300 257569 406840 309939 267631 671438 238807 210803
17164B10803A2804K21878J00674D4067N1633R7881N0742H5829J48633m1290D5777
17152B48331M6576j46425L14520j01439K12324q5009j41379A14046e2549B76992
17141A71950l5567M51607A31173K89945I6979J86828J0007J91281k09488L0718
17131C06325R6792A71873a00787C56015J39559j58214E3170N1111L7911J44295
17121B86487j33137j1667K51932j21048O45n3826J18023J9625j08924L24510k34508
17110C38112N2018c9308C65897K5469A77206K86816j47089j43812J72695F6990
17099A26987l6843L35894j49827r8444L61292j52384A78228K04453j69222K29029
17089D42488M4685k6500j33867J05430A59957K81867J66099B57137J39226n4526
$$ plain form
17164 210803 12804 234682 335356 44067 95700 193581 244323 85829 234462 193172 45777
17152 248331 294907 148482 463002 361563 573887 488878 347499 114046 -52549 276992
17141 171950 136383 587990 131173 421118 96979 283807 293814 485095 275607 306325
17131 306325 403117 171873 -100787 356015 495574 337360 53170 104281 142192 286487
17121 286487 153350 141683 393615 272567 273212 219386 337409 357034 248110 572620 338112
17110 338112 390130 -39308 365897 391366 177206 464022 316933 173121 345816 66990
17099 126987 90144 426038 276211 177767 539059 386675 178228 382681 213459 442488
17089 442488 487173 460673 326806 432236 159957 441824 607923 257137 396363 341837
17079C41837j00659K86546r0398n5693A78565j5950J68098j17609l399l6303K51196
17068D24598j05766A11412J95971R1066O0904j76415J20465M0928R4544o5087
17058D73788k7240k8329n3491m764L3436K7494K39909k19661J4120K1761J8606
17047D95629J45554C15790j16366K61514J32912E0987K11225K09971B29376N8221
17037B87597K97386k61445J61265K75205l5114j14935B70987J94725M402n8586
17027D11528J31424M7359A99967L98180B89921L34244k24365J78446k50860J98460
17017E25846j17078r0410P4479J83336J13441k24976o9801O8117J50425m8775
17007E64604j74937r6134K47110K605O9952B73088L30357R0189l40868L58712
$$ plain form
17079 341837 241178 527724 437326 381633 178565 162615 330713 213104 209705 173402 424598
17068 424598 318832 111412 307383 398449 459353 282938 403403 444331 538875 473788
17058 473788 446548 418219 364728 359964 393400 420894 660803 441142 455262 477023 495629
17047 495629 641183 315790 199424 460938 593850 50987 262212 472183 229376 287597
17037 287597 584983 323538 484803 760008 724894 609959 270987 465712 470114 411528
17027 411528 542952 590311 199967 598147 289921 624165 399800 578246 327386 525846
17017 525846 408768 318358 392837 576173 689614 464638 394837 462954 613379 564604
17007 564604 389667 293533 540643 543248 613200 273088 603445 693634 352766 711478
16997G11478L0221K2312K8478j38513j27679q4046R1742p6828L35230j73889o7180
16986E51326O8949p9150J58401l07887J94166P0068J82647k91891P8583q4255
16976E40957J8343j27638M13871j75548j03116J71645m3333L51242k91508Q3384
16966H38299j69533O6728K330j00113K5467J34161J00208Q9984l30596P1730M81492
16955A210157n79974J33072q558L7735J14421Q4223l4849N5537p376k03723L88519
16944A189184k83156K41516D75950O04787j08391P4826j30256L47743l80189N49298
16934A433768j35548j99655j10217P0101k39027L8612K55321O6817n9443k49827
16924H70902J24223J71290Q856l1974J8695k4170P5411k4876K21902J20698R0867
$$ plain form
16997 711478 741699 764011 792489 653976 526297 442251 533993 457165 792395 618506 551326
16986 551326 620275 541125 699526 391639 585805 655873 838520 546629 625212 540957
16976 540957 559300 431662 845533 669985 566869 738514 695181 1046423 754915 838299
16966 838299 668766 735494 737824 637711 663178 797339 897547 987531 656935 728665 1210157
16955 1210157 630183 763255 754697 792432 906853 991076 956227 1011764 1004388 800665 1189184
16944 1189184 906028 1147544 475950 1080737 972346 1047172 916916 1264659 884470 1433768
16934 1433768 1298220 1098565 988348 1058449 819422 858034 1113355 1180172 1120729 870902
16924 870902 995125 1166415 1175271 1143297 1161992 1137822 1213233 1188357 1410259 1530957 1621824
16913A621824m28262k03385J22812J56798j59718P3152j30750j06845N23568k67128
16903A202066M2965J30130K2077j85068M40259K75502m72552O5578k94037K34985
16893A461905N3444j98007K1850J80559o3228N79176l64802P664J22977j88822
16883A612716K35289k40336K94789Q9000M02764o22711J33434p0293k04958J9218
16873A648912M04392l4095l48978L50494k5559L70358k86145O9920k01034M286
16863A952551K60910N1594j23514L71645J86348l44191J37220j26769l5094r6138
16853B234562p5561M69820J32433j59987l8632M1552L16484L2758k75716P4949
16843B752662j4383L78498j02434k6112j94938M45396K69144j17430L4332Q1126
$$ plain form
16913 1621824 1193562 990177 1112989 1269787 1110069 1183221 1052471 945626 1469194 1202066
16903 1202066 1245031 1375161 1397238 1212170 1652429 1927931 1455379 1520957 1226920 1461905
16893 1461905 1515349 1317342 1339192 1519751 1456523 2035699 1670897 1678561 1801538 1612716
16883 1612716 1848005 1607669 1902458 1991458 2394222 1771511 1904945 1834652 1629694 1648912
16873 1648912 2053304 2019209 1670231 2020725 1995166 2365524 2079379 2149299 1948265 1952551
16863 1952551 2213461 2265055 2141541 2513186 2699534 2355343 2492563 2365794 2330700 2234562
16853 2234562 2159001 2628821 2761254 2601267 2562635 2604187 2920671 2953429 2677713 2752662
16843 2752662 2738279 3116777 3014343 2988231 2793293 3238689 3507833 3390403 3424735 3505861
16833C505861l12666K60121K85484r9114o5747K73849j24921R5313M4451J36001
16823C998632L35611j04244J58006j12683J40702K54003P0734k25669K56109k56740
16813D514461M31893q05K23607k5369K51589o773K71474k56617O34545k49372
16803E788633K67902k2086R8633m4763M39388l0685K99762p6107N08484L63625
16793G592786k02425M18995j44353N20289K86431j31426L86626K2184L35961L49129
16783I434197L89617L18274K63664K13357M89679M92588K16886L23289N06036
16774A2647587L82484J85418M46772Q42299L55985M52659P31925L44207Q06700
16765A7196036M38362Q69736N09780R04289R04539O73157J018272P34269J200591
$$ plain form
16833 3505861 3193195 3453316 3738800 3639686 3573939 3847788 3722867 3818180 3862631 3998632
16823 3998632 4334243 4229999 4388005 4275322 4416024 4670027 4740761 4515092 4771201 4514461
16813 4514461 4946354 4945549 5169156 5143787 5395376 5388603 5660077 5403460 6038005 5788633
16803 5788633 6056535 6034449 6133082 6088319 6527707 6497022 6796784 6720677 7229161 7592786
16793 7592786 7390361 7809356 7665003 8185292 8471723 8340297 8726923 8749107 9085068 9434197
16783 9434197 9823814 10142088 10405752 10619109 11108788 11601376 11818262 12141551 12647587
16774 12647587 13030071 13215489 13662261 14504560 14860545 15313204 16045129 16389336 17196036
16765 17196036 17634398 18504134 19013914 19918203 20822742 21495899 22514171 23248440 24449031
16756B4449031R40745Q67612J625119J156657J669045J157319J477684J976247
16748C5319459J531412J934246K032177K370510K328495K932223K352016K896301
16740E3696839L187225L599245L686604M105781M425878M410493M947455N370961
16732H7430481N888887O421015O287172P016788P122774P480151P900109Q202453
16724A43749830P917102P574367P360664O571996N938252N341861L553061K655479
16716A90662612J569276l45521j841882k378361m023619m745368o050801o610580
16708A66235756p598920p468370q006316p982537q040614p674796p112800p235066
16700A05116337o262619o542670n678506n720788m820117m788433m278707m181157
$$ plain form
16756 24449031 25389776 26257388 27882507 29039164 30708209 31865528 33343212 35319459
16748 35319459 36850871 38785117 40817294 43187804 45516299 48448522 50800538 53696839
16740 53696839 56884064 60483309 64169913 68275694 72701572 77112065 82059520 87430481
16732 87430481 93319368 99740383 106027555 113044343 120167117 127647268 135547377 143749830
16724 143749830 151666932 159241299 166601963 173173959 179112211 184454072 188007133 190662612
16716 190662612 192231888 191886367 190044485 187666124 183642505 178897137 172846336 166235756
16708 166235756 158636836 151168466 143162150 135179613 127138999 119464203 112351403 105116337
16700 105116337 98853718 92311048 86632542 80911754 76091637 71303204 67024497 62843340
16692F2843340l539521l761048l024413l217057k394700k819126k443429j990193
16684C9653853k581952j173814j790716k326237j089819j458498j255297j469176
16676B6508344r07004j225539q95962j140809j198687r00628n44275q65594o25347
16667A8204499n53952n79840q98126o97817m04706q23108m31569k80817k30949
16658A3303615n83528j13745n99749m25704l35009m41381k12019m60451k71349
16649I860680J3047n08549l68173k89468j71891j87354l41056K1427k66689k23376
16639G538598o3539j91269m38982j09105Q6528m68980J28293j75415j45994l74588
16629E785547k63452K01523r3428j32011k58720K86414n86107k36151n9992J59718
$$ plain form
16692 62843340 59303819 55542771 52518358 49301301 46906601 44087475 41644046 39653853
16684 39653853 37071901 35898087 34107371 31781134 30691315 29232817 27977520 26508344
16676 26508344 25601340 24375801 23479839 22339030 21140343 20239715 19695440 18829846 18204499
16667 18204499 17650547 17070707 16172581 15474764 15070058 14246950 13815381 13534564 13303615
16658 13303615 12720087 12606342 12006593 11580889 11245880 10804499 10592480 10132029 9860680
16649 9860680 9873727 9365178 8997005 8707537 8535646 8348292 8007236 8028663 7761974 7538598
16639 7538598 7475059 7283790 6844808 6735703 6822231 6353251 6481544 6306129 6160135 5785547
16629 5785547 5522095 5723618 5630190 5498179 5239459 5525873 4939766 4703615 4643623 4803341
16619D803341k60018P2559k8100p0195j8862j31888m80300K15384l07543j89200
16609C605178K19847j806k94345l21846K75875j20558k68329K01610j92925J90686
16599C293387K11626k82157r4422k95644j93990J26332K75089j77456r8484l15411
16589B448870J83168q7440k1636j43298J58484q7175l08560K26140q3304K78676
16579B563925l55018k13577J96018k32163p0936K29006J44176k57545K35251m64982
16569A774155L179J82493j50693k24617R6900j27668K42148Q5567j89482k17957
16559A474025L42842p6077o67229O99667l43142K95447k38073l08531L10455k27424
16549A261960j3279J09391N15225m68298R5930J33372k75235N7334k32244J86430
$$ plain form
16619 4803341 4543323 4615882 4587782 4517587 4498725 4366837 3886537 4101921 3794378 3605178
16609 3605178 3825025 3823219 3528874 3207028 3482903 3362345 3094016 3295626 3102701 3293387
16599 3293387 3505013 3222856 3128434 2832790 2638800 2765132 3040221 2862765 2764281 2448870
16589 2448870 2632038 2544598 2522962 2379664 2538148 2450973 2142413 2368553 2285249 2563925
16579 2563925 2208907 1995330 2191348 1959185 1888249 2117255 2261431 2003886 2239137 1774155
16569 1774155 1777334 1959827 1809134 1584517 1681417 1553749 1795897 1881464 1691982 1474025
16559 1474025 1816867 1740790 1073561 1773228 1430086 1725533 1487460 1178929 1489384 1261960
16549 1261960 1248681 1358072 1873297 1404999 1500929 1634301 1359066 1416400 1184156 1370586
16539A370586m2586K90712L970l77251j58910J19163J02792J34451j49770j20162
16529A172995k16077K73992L66888k91537j14308m90584M73225k1099L0147j49497
16519A034145K52547l11754r7772M85220j08582j12386k20293O4060m41336L77056
16509I20905J45288l47192o5676j7166M42972m99246M54914l86831J54521j4140
16499G88349K09720n0874k17801J02960L02958l13406m0461o0792n1698l10608
16489C58347M94268L7232l45118L24925k50069Q5715J32192C88578J79990o3750
16479E04818M09917j32749C89515M07241p2383Q5394n5073j29214l1511K31670
16469H25639k29387K35668j08215J57568k37665j80190L44539k32878l4457o7916
$$ plain form
16539 1370586 1328000 1618712 1622682 1245431 1086521 1205684 1308476 1442927 1293157 1172995
16529 1172995 956918 1230910 1597798 1306261 1191953 701369 1174594 1153495 1183642 1034145
16519 1034145 1286692 974938 877166 1362386 1253804 1141418 921125 985185 543849 920905
16509 920905 1066193 719001 653325 636159 1079131 579885 1034799 647968 802489 788349
16499 788349 998069 947195 729394 832354 1135312 821906 781445 720653 668955 358347
16489 358347 852615 889847 544729 869654 619585 705300 837492 388578 568568 504818
16479 504818 914735 781986 389515 796756 724373 809767 754694 625480 593969 825639
16469 825639 596252 831920 723705 881273 643608 463418 807957 575079 540622 472706
16459D72706B00953L91432o6283K18451j79237p2222K54677j69906Q5915j32030
16449E31750k55250J86339j00763j11421J08398P9376q1676L89446r5192j4062
16439F36945l17693K81384j89078J11724j24864J02587j87940J95971K11202k27974
16429D92264L2743j01276J41728k70804K64668B78681j7423J81173k866l8852
16419D00713j92117L37518q0773J39219k04782K41048j59803l5492N3341r4626
16409D04246k2393K1320l7036j9337K08626q0021n2474J95757j13150j44879n1129
16398C09530K2002e057D35670j89220L40452B40602L5588K18690r5223k5457K6480
16387D00680R0182J02929A10949K07326j0646J80944R6234F1082K40020j33801
$$ plain form
16459 472706 200953 592385 526102 744553 565316 493094 747771 577865 663780 531750
16449 531750 276500 462839 362076 250655 359053 438429 356753 746199 651007 636945
16439 636945 319252 600636 411558 523282 398418 501005 313065 509036 720238 492264
16429 492264 525007 423731 565459 294655 559323 278681 261258 442431 439565 400713
16419 400713 208596 546114 465341 604560 399778 640826 481023 445531 498872 404246
16409 404246 381853 403173 366137 346800 555426 475405 422931 618688 505538 360659 309530
16398 309530 331532 -5057 435670 246450 586902 240602 276190 494880 399657 374200 400680
16387 400680 490862 593791 110949 318275 307629 488573 584807 61082 301102 167301
16377A67301K66001l9971G9009L42580J03257A58813K23769k3538A78912L2644
16367B11556J08746o2322J69584n3673o0905p8364N3005L31337g1270A59617J39453
16356B99070j35086K85970k04223J06451K34421j98655r5651g0915A74602O7872
16346B42474K64474Q2254J85250A82562K13783j19978r9752J80845O606p1573
16336B92493n3817d8702C62098J13137A61485M9082a36431f2536A20110m2394
16326G7716i8831G7892J05670q6283J42249j109L83714l07679A08174J56631L08035
16315E72840G7589Q6581l9983J74745R1145j84205A5743J24335K16651A63227
16304A10772J56655A3672J27508K20949A40040L58551a59076C12683G6605M1612
$$ plain form
16377 167301 433302 393331 79009 421589 524846 158813 382582 359044 178912 211556
16367 211556 320302 257980 427564 373891 312986 234622 287627 618964 -71270 159617 299070
16356 299070 163984 449954 245731 352182 586603 387948 292297 -70915 174602 242474
16346 242474 506948 589202 774452 182562 396345 276367 176615 357460 364066 292493
16336 292493 238676 -48702 362098 475235 161485 210567 -136431 -62536 120110 77716
16326 77716 -98831 77892 183562 97279 239528 238419 622133 314454 108174 264805 572840
16315 572840 77589 164170 124187 298932 390077 205872 15743 140078 356729 163227
16304 110772 267427 13672 141180 362129 140040 498591 -159076 312683 76605 118217
16294A18217J49571a65760D49854C1795J43778H4096a38733B42093a02593A23925
16283E15347L3470A39950K21012A7872K63610B8961L35002A79149m789Q0521j05951
16272A48930Q5682L4294J89136l2919c3444r3529N3093I8515m4523L14564M7984
16261D16540A10315L8057j2027a17672A27616L37472A86949O2642q8223L30728
16251D92096A51400l8540c6705j7239A75254a16515k7662F1257a57113B57597
16240B40423j9033a38045C7774b6783H5732J85827j30561D395c8358B03462a8391
16228a21422j8070E5725J8726J55232A308g134A94172m5815M5107G1103P1727
16217A42830O352a1280C18123B5115J48123q3926J59626b49730a16155B12345
$$ plain form
16294 118217 267788 -165760 449854 31795 175573 84096 -138733 242093 -102593 123925
16283 515347 548817 139950 360962 17872 281482 28961 363963 179149 174360 254881 148930
16272 148930 234612 268906 458042 425123 -33444 -126973 -73880 98515 53992 368556 416540
16261 416540 110315 148372 136345 -117672 127616 465088 186949 249591 161368 492096
16251 492096 151400 112860 -36705 -53944 175254 -116515 -144177 61257 -157113 257597
16240 240423 221390 -138045 37774 -26783 85732 271559 140998 4395 -38358 203462 -18391
16228 -121422 -139492 55725 74451 229683 1308 -7134 194172 148357 193464 71103 142830
16217 142830 149182 -11280 318123 25115 173238 89312 248938 -249730 -116155 212345
16206i3847A76874b55125A29375a98800B0867J75619I6493a38331C92060A80427
16195b09741a6843A31702J0415L82753A38237m5293c6458A52393o1226b79503
16184F4855C884J67738h527A08088C0881N34237a17583d3847C73674p9409C7246
16172a67380B36915J34965g2448A38704B1927L46179a08894a6731A7513L20358
16162C37871i2155A18545a50267B47349n9824E4983J76411j10501C6090K92150
16152C28240C6659L400K64141j44245g7217e040F0274J75227A9702J940d2944
16140h4376k92346A42054d40981E3014J89353a4432k73037A95798j6371r308m9295
16129A20824K4631G0961N0931m2946a87408A96620a584B62419A07213g0849B95158
$$ plain form
16206 -93847 176874 -255125 129375 -198800 20867 196486 96493 -138331 392060 180427
16195 -209741 -16843 131702 142117 524870 138237 92944 -36458 152393 91167 -279503
16184 64855 3884 171622 -8527 108088 30881 565118 -117583 -43847 373674 294265 37246
16172 -167380 236915 371880 -72448 138704 21927 368106 -108894 -16731 17513 337871
16162 337871 -92155 118545 -150267 247349 187525 54983 231394 120893 36090 328240
16152 328240 36659 40059 304200 159955 -77217 -5040 60274 235501 19702 21642 -42944
16140 -84376 -376722 142054 -440981 53014 242367 -14432 -287469 195798 179427 170119 120824
16129 120824 145455 70961 121892 78946 -187408 196620 -1584 262419 107213 -70849 295158
16117a18379e0033A3L3825g3759B19679a7938E07331a54937d0958j84326d461
16105a29776M9020l9237a8358A35529J04666J16893j42486c25775f1678l48092
16095d09770A06255p189f9061q7732I4213D6852H793h0364A13684N0976b49077
16083A69688H0196f3777B92447L43B2721b2600D5629O6182e6110l1478A3690P4977
16071H8667J76624q5569b80919a3620A08962C7571K94415N2512a52921m5969A7402
16059A38195k5779g1515D68530g8801j47629e4197b5505A07008a71187A42514
16048B85165a20652M0212B93068i7667D8149a46528B48243a26112A9793c85463
16037A11093B2364h3298m6172e2473C0803K0373K17454f3583B12959a02097k68162
$$ plain form
16117 -118379 -50033 13 33838 -73759 219679 -17938 507331 -154937 -40958 -225284 -4461
16105 -129776 -80756 -119993 -18358 135529 240195 357088 214602 -325775 -61678 -409770
16095 -409770 106255 99066 -69061 -156793 94213 46852 8793 -80364 113684 164660 -249077
16083 169688 80196 -63777 292447 292790 22721 -22600 45629 111811 -56110 -87588 13690 88667
16071 88667 265291 179722 -280919 -13620 108962 37571 331986 384498 -152921 -198890 17402
16059 138195 112416 -71515 468530 -78801 -226430 -54197 -25505 107008 -171187 142514
16048 285165 -120652 -80440 293068 -97667 48149 -146528 248243 -126112 19793 -385463
16037 111093 22364 -83298 -129470 -52473 30803 51176 268630 -63583 212959 -102097 -370259
16026c70259I3246J79966c89630Q9805N598I0484b09081A0633M5302J72503g405
16014C5553I673a43857F6408a17592j17431H0885i5147B5261a52209b276I6684
16002d12430A68153G0462a21972A4316a64671k81118F5749b6176A02220a93753
15991b06416o1714J21990A87377a50772p7566A4105b61795i3708a4760C0057J48800
15980A78857a64988m113f0948b1129j48807b7063k89534A45363f422j62905b2625
15968g9962j997A64832A7402N4819R7079A8356i7162B14067g1294D6712K61315
15957C08027E5520J69533a30464A99740G470K10475g5638D8509A5801b54569B37978
15945b71923a02341G5134c14281A73797a71225b3083r6574A3237a1642k19983
$$ plain form
16026 -370259 93246 273212 -389630 -299825 -294227 90484 -209081 10633 55935 228438 -7405
16014 35553 9673 -143857 66408 -117592 -235023 80885 -95147 25261 -152209 -2276 96684
16002 -412430 168153 70462 -121972 14316 -164671 -445789 65749 -26176 102220 -193753
15991 -206416 -268130 -146140 187377 -150772 -228338 14105 -261795 -93708 -14760 30057 178857
15980 178857 -164988 -169101 -60948 -21129 -169936 -27063 -316597 145363 -6422 -169327 -22625
15968 -79962 -81959 164832 17402 72221 169300 18356 -97162 214067 -71294 46712 308027
15957 308027 55520 225053 -130464 199740 7470 217945 -75638 48509 15801 -254569 237978
15945 -271923 -102341 75134 -314281 173797 -171225 -23083 -119657 13237 -11642 -231625
15935b31625E6810b51783k53915h6881K8578G6685a64627B34170a18574m445B39547
15923A12212k6401h8710K5274l56970b5402A8157a57110A4548c86358J60613R9655
15912a26090N3696a2823l98544a4125C6850d3511D6275J42659b72465B23379g7630
15900H4187h1738j12059C630K478L52287b41987r1573a17845j21282A638h6589
15888a88754l9974h5150b530B55468i3349m0227r0510B04431c6569j30107D7034
15876c52608A94271a30631d4583B80989e8133K4379j27447A85125K305a54988
15865d5904A66144f1272j3031k33100a8349A73321i7946A27993B2447L8249J39914
15854B00610B9169A2439L3932a46989F329i5666o2794j11181M3109j575a09180
$$ plain form
15935 -231625 56810 -251783 -505698 -86881 -58303 76685 -164627 234170 -118574 -123019 239547
15923 112212 85811 -88710 -63436 -420406 -25402 18157 -157110 14548 -386358 -225745 -126090
15912 -126090 -72394 -12823 -411367 -14125 36850 -43511 46275 188934 -272465 223379 -77630
15900 84187 -81738 -193797 3630 6108 358395 -241987 -333560 -117845 -239127 1638 -86589
15888 -188754 -228728 -85150 -2530 255468 -93349 -133576 -224086 204431 -36569 -166676 47034
15876 -352608 194271 -130631 -44583 280989 -58133 -33754 -161201 185125 187430 -154988
15865 -45904 166144 -61272 -74303 -307403 -18349 173321 -97946 127993 22447 60696 200610
15854 200610 29169 12439 46371 -146989 6329 -95666 -158460 -269641 -226532 -228107 -109180
15842c67909A26162D8712a08366C03243b39344A63949D4052P088R4127a3309r9323
15831a12632B82017k150i6056F4181f5135j20687C6885a51520o2968D1594a72135
15819d7869j54096g5611l09660A3338e06716C9445J08520F9218a07031L2321A69185
15807G0347R5651c94175E18a17053B80363K7059a23181A05518f0673B73121a34972
15795a09826C2601J90122b87036d3406C1899a03515B8095d76721b1922k51247
15785b73169M2008p2862f4925D398K56067c01316J00589f3933k99865a530n0051
15774e1581K1221A3945K54545c67348A58341b96178a28163K266A69501q2697c8097
15762c0998k49831J9698A25350a76120j65286J23409A23738a31476L0055E0051
$$ plain form
15842 -367909 126162 48712 -108366 303243 -239344 163949 44052 51140 145267 -13309 -112632
15831 -112632 282017 279867 -96056 64181 -65135 -185822 36885 -151520 -214488 41594 -172135
15819 -47869 -201965 -75611 -385271 13338 -506716 39445 147965 69218 -107031 -74710 169185
15807 70347 165998 -394175 518 -117053 280363 307422 -123181 105518 -60673 273121 -134972
15795 -109826 32601 222723 -287036 -43406 31899 -103515 28095 -476721 -21922 -273169
15785 -273169 -231161 -304023 -64925 4398 260465 -301316 -200727 -63933 -363798 -1530 -51581
15774 -51581 -30360 13945 268490 -367348 158341 -296178 -128163 -125897 169501 86804 -38097
15762 -30998 -280829 -261131 125350 -176120 -341406 -217997 123738 -131476 -101421 50051
15751B62475A1063d6611D8320e8300n2609A88365a05111n59c8485q8906E9916
15739A07850b42040Q3230a7289c220j39802C3507c7756n2524c8552A50017c14599
15727g1792q1672A61388a78477Q5196k5145A65840a39120H0579c1404R500A0244
15715b04834L0154I3273c0732j86791M9324a8395k18250o305e5728k46877P7448
15704b25157K9714Q036g6505k06122E2235f1586C6722a11264A77804G1926J43618
15693B15544e9265G1988b1903p011A45240b23923C52548b532k25230c4598k60018
15682b94616a12016j308m06504B32310a10595d0040b479l84648N9299I9874K3033
15671A22907j2518K0569a32225o7048C05382d03934A26683a05228A85400a83053
$$ plain form
15751 262475 11063 -46611 48320 -58300 -110909 188365 -105111 -105670 -38485 -127391 59916
15739 107850 -242040 -158810 -17289 -3220 -143022 33507 -37756 -90280 -38552 150017 -314599
15727 -71792 -153464 161388 -178477 -93281 -118426 165840 -139120 80579 -31404 -21904 10244
15715 -204834 -174680 93273 -30732 -217523 -168199 -18395 -236645 -242950 -55728 -302605 -225157
15704 -225157 -195443 -187407 -76505 -282627 52235 -61586 36722 -111264 177804 71926 215544
15693 215544 -59265 71988 -21903 -28914 145240 -223923 352548 -2532 -227762 -34598 -294616
15682 -294616 -112016 -113324 -519828 232310 -110595 -40040 -2479 -387127 -327828 99874 122907
15671 122907 110389 130958 -132225 -199273 305382 -403934 126683 -105228 185400 -183053
15660B82437b46146c0645k3141k15067J16696N4284j04818g4436j45524N8331
15650a61629r538P4512A83665D3838L2338J41303e0722k02827f1839B24601a06594
15638c48461R8373A51296J10528o5746c6351G356J85621a94197b2281j59707l2453
15627b14441B29467b33012g2552A79260k7806b8346j00049L4458C26746g1717
15616H6092e0951o7297C865a28108b8027l83889A84700F5009a1474j51540B13045
15604b03866j2598f4486k17743d5413A38215c08860A85236a13988k0344A00629
15593b40064A75831h3409J500C12479b67572i0231m0193A95367d2955C3295K2794
15582E6089R8236n9688J77105a75463F5218N6397a11894A9630a78354k51765A26080
$$ plain form
15660 282437 -246146 -30645 -53786 -268853 -152157 -97873 -202691 -74436 -219960 -161629
15650 -161629 -171167 -96655 183665 43838 76176 217479 -50722 -253549 -61839 224601 -106594
15638 -348461 -250088 151296 261824 196078 -36351 7356 192977 -194197 -22281 -181988 -214441
15627 -214441 229467 -233012 -72552 179260 151454 -28346 -128395 -93937 326746 -71717
15616 86092 -50951 -118248 3865 -128108 -28027 -411916 184700 65009 -11474 -163014 213045
15604 -203866 -216464 -64486 -282229 -45413 138215 -308860 185236 -113988 -134332 100629
15593 -240064 175831 -83409 -81909 312479 -267572 -90231 -130424 195367 -42955 33295 56089
15582 56089 154325 94637 271742 -175463 65218 121615 -111894 19630 -178354 -430119 126080
15570B13412c96714O5540a35586B15914G7544b46687F5070A5681a08683K725p7890
15559a83848A30888c32188I4292C6890N4403b21706N9086F3245h8844j15133G8866
15547C8186L42138A42420b27195h0475b3855k19428J07002j78827C2041c95112
15536A13555a88115b8902r9715C5607K0415O6082K12149f5208c994j36161e294
15524f5591J6629B41354C9148b3698A57553c28968f6177J43D1062b5752q8217
15513a13969k57466J01988A21921C6720A0011a63732A06797J1341l2385J35484
15503B21237p2469C8879a1400l163j56883C75796A06397D0764K8913J46142N9920
15492B75739b30850h9578D6007J36472E8169c58366a64425L1996N2534l38302
$$ plain form
15570 213412 -396714 -331174 -135586 215914 77544 -246687 65070 15681 -108683 -105958 -183848
15559 -183848 130888 -332188 94292 36890 91293 -221706 -162620 63245 -88844 -203977 78866
15547 38186 380324 142420 -227195 -80475 -23855 -243283 -136281 -315108 32041 -395112
15536 113555 -188115 -28902 -128617 35607 56022 122104 334253 -65208 -3994 -140155 -5294
15524 -65591 -48962 241354 39148 -23698 157553 -328968 -66177 -66034 41062 -25752 -113969
15513 -113969 -371435 -269447 121921 36720 10011 -163732 106797 118138 85753 221237
15503 221237 148768 38879 -11400 -14563 -171446 375796 106397 40764 69677 215819 275739
15492 275739 -230850 -89578 46007 182479 58169 -358366 -164425 -132429 -79895 -418197
15482d18197G4887f2502j63386d6253o3525K1313A5974c0901A38037N6718b6681
15470a61695B57832a48692N6476l0566M7731l2599n5984B17946a49050k0505L2734
15459a36821C9816e0520A81235E3937K56345F3255M0858P2060J2559F0490c47493
15447c22783c7192A35043o6816J07239n0655c40542a37983M7481H5031a32666
15436h4805B18084H366O8465c8184j1721k44480P8506A10726K33485e831j57055
15425a62886O6834j26535B2238e6197j22347j4398L2137c8654D8944j1921b99860
15413A15624B5060K56158A39203c28814H9770J33915b19755N8154C93277A47170
15402a18293j30141k19673C1150g6318n5684a7784k30444C8368b1313j69077B61602
$$ plain form
15482 -418197 74887 -62502 -225888 -46253 -109778 -88465 15974 -30901 138037 194755 -26681
15470 -161695 257832 -148692 -92216 -122782 -75051 -107650 -163634 217946 -149050 -169555 -136821
15459 -136821 39816 -50520 181235 53937 310282 63255 104113 176173 188732 60490 -347493
15447 -322783 -37192 135043 68227 175466 124811 -340542 -137983 -90502 85031 -132666
15436 -84805 218084 8366 76831 -38184 -49905 -294385 -215879 110726 344211 -5831 -162886
15425 -162886 -96052 -222587 22238 -56197 -178544 -192942 -160805 -38654 48944 37023 -299860
15413 115624 25060 281218 139203 -328814 89770 223685 -219755 -161601 393277 147170
15402 -118293 -248434 -468107 31150 -76318 -132002 -17784 -248228 38368 -21313 -190390 261602
15390a81303H7354j220J4170C3956i007j96644q1898B780f0552H5672a62024c4282
15377a58707a9659o7484I4220J35922H6755b63924n2346h8710P86B7817J20992
15366A48809D6620n09a58945b1227D318O7964a4928j51470k10318I2522J5388
15355A07910A8885i5543A51410H68a11334K654H5228J01947h6923D2173b8516
15343C18386b17187A43179d3566B30676n5518J80765A46796b5823B51479j14013
15333A37466e6392E23672B58157A24784i3978B2218C426K6699d261n6905H6604
15321a08953L5557B40704o2839b07989P8896P305K1980L7178n1521G7188O2088
15310A39276c27461D5722J03817A7528K70595P7057b81160Q9690B3679M1209G017
$$ plain form
15390 -181303 87354 86134 100304 33956 -9007 -205651 -287549 2780 -60552 85672 -162024 -34282
15377 -158707 -19659 -87143 94220 230142 86755 -263924 -316270 -88710 -87924 27817 148809
15366 148809 46620 46111 -158945 -21227 4318 72282 -14928 -166398 -376716 92522 107910
15355 107910 18885 -95543 151410 868 -111334 -108680 85228 187175 -86923 42173 -28516
15343 318386 -217187 143179 -43566 230676 175158 355923 146796 -25823 251479 137466
15333 137466 -56392 523672 258157 124784 -93978 22218 3426 30125 -4261 -61166 86604
15321 -108953 -73396 240704 177865 -207989 -129093 -121788 -99808 -62630 -114151 77188 139276
15310 139276 -327461 45722 149539 17528 288123 365180 -281160 -191470 23679 64888 7017
15298A54763E6022j0058a20413c5977F5738a12151J1752A48427o6791k0328c57286
15286d6457F1983P1440c6875A61104a3324r1393A46491J38442E2423J82207j0099
15275B24531i902j4287E5660K54721h0567J1200B66492c52371a66096c4610G9833
15263A32859o5495J02636d0563D2417P60K46626p5633A3433J17729R8324m8544
15252A80942F538J29702L21913N30360Q0191k48792O38958n50396k96214Q6790
15242F99050i2253j84712I1977p786J03488a36032b2712j87705C28846j5125j33961
15231A79760b5189C89567E4954b641m2432A4359N7323b49139A60446M2896b59625
15219A31672n8876J38318a30302A5645a21936M6602j09129J8849D1800i3470G089
$$ plain form
15298 154763 56022 45964 -120413 -35977 65738 -112151 -100399 148427 81636 61308 -357286
15286 -46457 61983 133423 -36875 161104 -13324 -104717 146491 284933 52423 234630 224531
15275 224531 -9902 -24189 55660 310381 -80567 -69367 266492 -352371 -166096 -34610 79833
15263 132859 67364 170000 -40563 42417 43177 289803 214170 13433 131162 229486 180942
15252 180942 6538 136240 458153 988513 1068704 819912 1458870 908474 612260 699050
15242 699050 -92253 -276965 91977 84191 187679 -136032 -22712 -210417 328846 313721 179760
15231 179760 -25189 389567 54954 -2641 -45073 14359 71682 -249139 160446 203342 -259625
15219 131672 72796 211114 -130302 15645 -121936 -75334 -184463 -165614 41800 -93470 7089
15207G92J91843j2018q103A2862a7206q7103A83645B8835h2783E2809a56768D78
15194B62763f0247C04457b5529A76198c5262B74288k8060B4443N567J56085O1218
15183B47313g9523j29324Q6739k18889A3289N37854F6793a95512j13910N0971
15173b58451h5060k0203A22915L1233M9743a8273A15052K21191A43761J34742
15163B78503A4010c60043e4322l7597b3228C20043a15290B89180G7689B1536K6355
15152D7891Q8679m0a88366A04623P6420a11872Q494B6307J16037a62515M2125
15141a20390c7280r9452N1224A91876k6003o3599k248P7487P238J49888p0667
15130B63972A29578C2345K10399l9632B3665a06316B64279a07076B50007a02249
$$ plain form
15207 792 192635 180617 172514 12862 -17206 -104309 183645 28835 -82783 52809 -156768 478
15194 262763 -60247 304457 -25529 176198 -35262 274288 246228 24443 30010 186095 247313
15183 247313 -79523 -208847 -122108 -340997 13289 551143 66793 -195512 -309422 -258451
15173 -258451 -85060 -105263 122915 154148 203891 -18273 115052 336243 143761 278503
15163 278503 14010 -360043 -54322 -91919 -23228 320043 -115290 289180 77689 21536 47891
15152 47891 136570 136530 -188366 104623 181043 -111872 -103378 26307 142344 -162515 -120390
15141 -120390 -37280 -136732 -85508 191876 165873 102274 100026 177513 184751 334639 263972
15130 263972 129578 32345 242744 203112 23665 -106316 264279 -107076 250007 -102249
15119B46649h2661b9087h430A73937I744K11704p9820a23898B50469c2589l28100
15108c60689a3360c079j30455j5748A9849a59361c5453C44491d6975A09536N147
15097A14683P0319j4534K12730D2105m949K52581G7600J03657a29563A46630n4369
15086I2261J40158K79431d7266D032J53449O2424e562E3746P4616D0363a82955
15074A67424R6039N9248h3625A38737E5883L48584A31650b32179C7663P5101L66961
15063D79725j22914q6146L49915a12458M7927B64961I7769j8287C4539K40367
15053B74906C8751a14387A56774n281J15303L44543F9940J01000J14877J45916
15043D31733A45620J77083l9642I5753M42816A11094L22419A99912p9741M1706
$$ plain form
15119 246649 -82661 -29087 -8430 173937 9744 221448 141628 -123898 250469 -32589 -360689
15108 -360689 -13360 -3079 -133534 -149282 19849 -159361 -35453 344491 -46975 109536 114683
15097 114683 185002 170468 383198 42105 37156 289737 77600 181257 -129563 146630 92261
15086 92261 232419 511850 -47266 4032 157481 219905 -5562 53746 128362 40363 -182955
15074 167424 263463 322711 -83625 138737 55883 404467 131650 -232179 37663 112764 479725
15063 479725 356811 270665 620580 -112458 -64531 264961 97769 79482 34539 274906
15053 274906 38751 -114387 156774 151493 266796 611339 69940 170940 285817 431733
15043 431733 145620 322703 283061 95753 538569 111094 433513 199912 120171 161877
15033A61877o3449J37427f14A51147a8564C14360j0867j33012B271K64204k9925
15022B36550d852B56855J67705j99185q6177N2030p7199j1485K07052c7808A8631
15010C53341A07637A4719O379a06374A91458J40792A18444L9338p1219J51369
15000B37932F2583L2806d9130A75027f9671k49247f1466F6062k0340K48541J11110
14989D05373m7630J82417A65240P5257P7796f4308B3532L07674l2627j33163L16721
14978D82137B4169M9804K6686J1497K50l9529l6291K03787O077L13884A65010
14966C60750A51942g8657A03019l3966J92031B0094Q0183b04381B12329K6744
14956B39073J7482N1859K2R0353B7724K57895d8871C43890J16967F3201b9189
$$ plain form
15033 161877 98428 235855 -614 151147 -18564 314360 303493 170481 2271 266475 236550
15022 236550 -4852 256855 424560 225375 139198 191228 114029 102544 309596 -37808 18631
15010 353341 107637 14719 21098 -106374 191458 332250 118444 157782 86563 237932
15000 237932 62583 95389 -49130 175027 -69671 -318918 -61466 66062 45722 294263 405373
14989 405373 357743 540160 165240 240497 318293 -64308 23532 331206 298579 165416 482137
14978 482137 24169 73973 100659 112156 112406 72877 36586 240373 246450 560334 165010
14966 360750 151942 -78657 103019 69053 261084 20094 100277 -204381 212329 239073
14956 239073 256555 308414 308436 398789 27724 285619 -48871 343890 460857 63201 -29189
14944B09548b28481D2605K44591K44828k06537J82743b0086b888F4371K25628
14934B89999p3174O3685q1090J16337j25145G1515K28658O8063A70334B0406L6412
14923E6818L17238J48013j08726j66346P7829L97881C085J66276C04J19592M17101
14912E36997j21544j58505j20041o5295L92851j61143L6670j07971j08004J08692
14902B32707B9513K66651K83025B37729J00463R9262J91997A48206K59974j72941
14892B35239A6506O9704L22115P1423K05096B10503J30243J68366A42303J28422
14882B70725o95J42393A82407K86233i813C74219L2103A97261J41196j01433K83593
14871E20617B5080M12524A26764K41814A73186L40026j86604j02934g4072C80100
$$ plain form
14944 209548 -228481 42605 287196 532024 325487 508230 -20086 -2888 64371 289999
14934 289999 216825 280510 199420 315757 190612 71515 300173 368236 170334 20406 56818
14923 56818 374056 522069 413343 246997 324826 722707 3085 169361 304 119896 536997
14912 536997 415453 256948 136907 71612 464463 303320 339990 232019 124015 232707
14902 232707 29513 296164 579189 237729 338192 437454 629451 148206 408180 235239
14892 235239 16506 86210 408325 479748 684844 210503 340746 509112 142303 270725
14882 270725 270030 412423 182407 468640 -9813 374219 406322 197261 338457 237024 520617
14871 520617 25080 437604 126764 368578 173186 513212 326608 223674 -74072 380100
14860B29265L07775j85426J27241k7127k05506L38270p0798j53874J07398K10805
14850F78023B79633J93131A89163J57767J35188k26512J96507a72477g522A24820
14839D80771m6428H4973J96554j2537K25887j42367I8941K22065L76148j91008
14829E06146j85931J33346j29228P3961R5788q8413N4137M7269O7514B62035J9408
14818B81443K82701j3207j9466n9210B09651J64858A81759M84633A4211O19548
14808F33759A75086K48626p7235O602m2451q1491J06083P3832I5676M30061O0141
14797E85878j31431j32950K53342p2178r816P6484o169j44031j41084N19661j75588
14786F22118A98746J27782K16321j84709J34028j64050K13883J29160J09653B78037
$$ plain form
14860 229265 537040 351614 478855 451728 246222 584492 513694 359820 467218 678023
14850 678023 279633 472764 189163 346930 482118 255606 452113 -172477 -7522 124820
14839 480771 434343 84973 281527 268990 494877 352510 98941 321006 697154 506146
14829 506146 320215 453561 324333 398294 494082 405669 459806 507075 574589 262035 281443
14818 281443 564144 550937 531471 472261 209651 374509 181759 666392 14211 633759
14808 633759 175086 423712 346477 353079 310628 229137 335220 409052 95676 525737 585878
14797 585878 454447 321497 574839 502661 492845 569329 563160 419129 278045 797706 622118
14786 622118 198746 326528 542849 358140 492168 328118 542001 671161 780814 278037
14775D02979K05558k72764K04355J01207j15112J32578A11658M43194k60140L67369
14765F62081B68636L53824k93745R5221p3263Q7198J99926k42361A31116J96273
14755C27389L26286j5166j07864J47378j39938J89639j09964K46485l42250K37076
14745G59071q7944J266k09050J12176J73958k91576j52229K75830J41064o6795
14735F55771p8108q8930K83029L1447j29716Q6236j88721L2556L13284D51187
14724F96706N1972R5856k46760j47664J17142J58464k02704K50392k9790l05890
14714D37724K32452k02433L85612k46210p4542K08184k2339k66888L08816k83548
14704D76828L18004J33440m23775N56100l07804r0173k71791M7228N78740l81878
$$ plain form
14775 402979 608537 335773 540128 641335 526223 658801 111658 554852 294712 662081
14765 662081 268636 622460 328715 423936 350673 437871 637797 395436 131116 327389
14755 327389 653675 638509 530645 678023 538085 727724 617760 864245 521995 759071
14745 759071 671127 672393 463343 575519 749477 457901 305672 581502 722566 655771
14735 655771 577663 488733 771762 803209 673493 759729 571008 603564 916848 451187
14724 696706 748678 844534 597774 450110 567252 725716 523012 773404 743614 437724
14714 437724 670176 467743 853355 607145 532603 740787 718448 451560 760376 476828
14704 476828 794832 928272 504497 1060597 752793 662620 390829 438057 1016797 634919
14694F34919k26373K47134L07150m5615j83687J71832M3375k11848J15665K36075
14684A088627n40869M45089l48021L81466l19397K73908r4266p2902J44463j0870
14674I47228J90109k92880l8580J39588m51014K98959L67552l97615J9576K0134
14664H03057l73851O38529Q883O9926l69353o3389J00768J71933o395J40332k66195
14653H54245J25795J68526k59287j37588J3773K18448L5501j24975K03430j85898
14643I11970N1741j63483J95381p4502K29553J2719K70035r9536k33657J21454
14633A221675l26797K83002R7150n5432j16800j3441Q6726o2068j04946L71427
14623A380496j28311m2870M34606l90000j03314k5464N21686l76362J33488o5712
$$ plain form
14694 634919 408546 655680 962830 917215 733528 905360 948735 736887 852552 1088627
14684 1088627 547758 992847 644826 1026292 706895 980803 886537 813635 958098 947228
14674 947228 1137337 844457 805877 945465 494451 793410 1160962 763347 782923 803057
14664 803057 429206 1067735 1076618 1146544 777191 713802 814570 986503 980108 1120440 854245
14653 854245 980040 1148566 889279 751691 765464 983912 1019413 894438 1097868 911970
14643 911970 963711 800228 995609 921107 1150660 1163379 1433414 1333878 1100221 1221675
14633 1221675 894878 1177880 1275030 1219598 1102798 1089357 1176083 1114015 1009069 1380496
14623 1380496 1252185 1209315 1643921 1253921 1150607 1125143 1646829 1270467 1403955 1338243
14613A338243o0985K10112j06741j21511L02528k61051J14916q5934J2782L70988
14603A713347m09584k0977J3304K39156l09260K68875J36297p4061o3993m3004
14593A450100J45768J11230k51212j08026K40135J61113l27625J22779K92134
14584A836396m42700M02405o1305J61367k11696j62691K08086J50210j01024J51746
14574A930794O6457m97775P77486j64514m22514L67164J33550k56691O4350M45910
14564B444217m20772q1768K64393j70724J40475J84497j511M46600q2015J70393
14554B893785O6503K89162P37502L10344J481379L037327M921309P144111O201161
14545B7082583n84480k235103o338248H051451C914784j118486j42419m90204
$$ plain form
14613 1338243 1277258 1487370 1380629 1259118 1561646 1300595 1415511 1329577 1342359 1713347
14603 1713347 1303763 1282786 1296090 1535246 1225986 1494861 1631158 1557097 1493104 1450100
14593 1450100 1595868 1707098 1455886 1347860 1587995 1749108 1421483 1544262 1836396
14584 1836396 1393696 1796101 1734796 1896163 1684467 1521776 1729862 1880072 1779048 1930794
14574 1930794 1997251 1499476 2276962 2112448 1689934 2057098 2190648 1933957 1998307 2444217
14564 2444217 2023445 1941677 2206070 2035346 2175821 2360318 2358807 2805407 2723392 2893785
14554 2893785 2960288 3249450 3986952 4297296 5778675 8816002 13737311 20881422 27082583
14545 27082583 26498103 24263000 17924752 8051451 3914784 2796298 2653879 2163675
14537B163675l83818l1229K08K22154j63986k3109J74204j14197k22502J6184
14527A637584K34729L34669L6591k8456k00004L49021m84560M27628l65970K85788
14517B227020Q8802o0056R6182O773k58678L84279l25453J17201L38714k19360
14507B395424j0748M19181m10039M37225n4249R4009n8433k7282J82977j75206
14497B792859J44680k75623J14786L6108P9212j97559L6691Q9917L39104n64543
14487B595632M40456K90953l63350q478R0144K63585M14227l96606K92055k25883
14477C392735J56317K8269N0969J80215L819j60161L11779J67347l51711n4259
14467C725319q5945K09194J66029l0063j93222N35075j66424j66763Q8783L46246
$$ plain form
14537 2163675 1779857 1748628 1748836 1970990 1807004 1783895 1958099 1843902 1621400 1637584
14527 1637584 1872313 2206982 2243573 2215117 2015113 2364134 1879574 2307202 1941232 2227020
14517 2227020 2315822 2255766 2351948 2358721 2100043 2484322 2158869 2276070 2614784 2395424
14507 2395424 2384676 2803857 2393818 2831043 2776794 2870803 2812370 2785088 2968065 2792859
14497 2792859 2937539 2661916 2776702 2812810 2892022 2694463 2731154 2821071 3160175 2595632
14487 2595632 3036088 3327041 2963691 2955213 3045357 3308942 3723169 3326563 3618618 3392735
14477 3392735 3549052 3577321 3628290 3808505 3812324 3652163 3963942 4131289 3779578 3725319
14467 3725319 3639374 3848568 4014597 3984534 3791312 4326387 4159963 3993200 4081983 4428229
14457D428229j51244o5986J49005p7738J60185Q1227J59326J2239K50161k09648
14447D735756L67933q7000P0980k714J26369K883M27034j50661r1194K16898j20546
14436E495738r9748Q2537L48204k81005N60491m1353j65497J75909J18056J57163
14426F350495j93174J99842K52791j4213K69011k95211N42828l14287K60207K05239
14416G263528j63856K89140N7490j58382L03903L41424J99882k27649O0968J34154
14406H100602J18054L53017J53484K4005K2247J0633N23012o1859N81864j70605
14396I654454L22479k20894K90052J65901J22798k1458M32120K20559K48139j78887
14386A1035263M22405J56431J67979J64231l9976O92777K39029J75598K10031
$$ plain form
14457 4428229 4276985 4210999 4360004 4282266 4442451 4523678 4683004 4695243 4945404 4735756
14447 4735756 5103689 5016689 5087669 5084955 5211324 5214207 5641241 5490580 5399386 5616284 5495738
14436 5495738 5395990 5478527 5826731 5545726 6106217 6064864 5899367 6075276 6193332 6350495
14426 6350495 6157321 6357163 6609954 6595741 6864752 6569541 7112369 6798082 7058289 7263528
14416 7263528 7099672 7388812 7446302 7287920 7591823 7933247 8133129 7905480 7966448 8100602
14406 8100602 8218656 8571673 8725157 8749162 8771409 8782042 9305054 9243195 9825059 9654454
14396 9654454 9976933 9756039 10046091 10211992 10334790 10313332 10745452 10966011 11214150 11035263
14386 11035263 11457668 11614099 11782078 11946309 11906333 12599110 12838139 13013737 13223768
14377A3223768j92086M34004L18777N71857j0716M61270p1988P84121J67843K35122
14367A5921972L54459J38997M42800L81403K03270N32048K42778L19073O70177
14358A9206977K66983J90332M51705N18992O41900O04677L1935Q97733M59902
14349B3271136O43083N85482J007353K56204Q15140O17264P43803N11716J034209
14340B9485390P11526O76998P67618J213187P77944J306155Q68096R75162J501223
14331C8283299R36527J182355J498030J339774J337688J641426J254765J847252
14323D9321116J719266J549187J750133K183710K076909K003529K437870J979541
14315F5021261K675316K617760K738238L067925L517198L043140L543517L579054
$$ plain form
14377 13223768 13031682 13465686 13784463 14356320 14345604 14806874 14734886 15519007 15686850 15921972
14367 15921972 16276431 16415428 16858228 17239631 17442901 17974949 18217727 18536800 19206977
14358 19206977 19473960 19664292 20115997 20634989 21276889 21881566 21913501 22811234 23271136
14349 23271136 23914219 24499701 25507054 25763258 26578398 27195662 27939465 28451181 29485390
14340 29485390 30196916 30873914 31641532 32854719 33632663 34938818 35806914 36782076 38283299
14331 38283299 39219826 40402181 41900211 43239985 44577673 46219099 47473864 49321116
14323 49321116 51040382 52589569 54339702 56523412 58600321 60603850 63041720 65021261
14315 65021261 67696577 70314337 73052575 76120500 79637698 82680838 86224355 89803409
14307H9803409L920652M332415M172578M729614N034746N489936N483686O059894
14299A29026930O599964O450948P391299P701982Q320655Q983295Q968375R911831
14291A93355279J0738269J0891369J1970190J2441554J3209296J3664345J4443146
14284B80713448J4982300J5691737J6238111J6071243J6703986J6233894J6314921
14277C92949640J5338761J4577413J2696503P398711K583308q25461k075086j911514
14269D40732275l465450K157844Q890973M08960p504538j0284163j2276836j2844398
14261D05814667j3436924j4730011j6312431j6789559j6998502j6055028j5513296
14254B95978916j5213578j4170577j4059464j3290042j2789726j2090795j1473652
$$ plain form
14307 89803409 93724061 98056476 102229054 106958668 111993414 117483350 122967036 129026930
14299 129026930 135626894 142077842 149469141 157171123 165491778 174475073 183443448 193355279
14291 193355279 204093548 214984917 226955107 239396661 252605957 266270302 280713448
14284 280713448 295695748 311387485 327625596 343696839 360400825 376634719 392949640
14277 392949640 408288401 422865814 435562317 442961028 445544336 444718875 442643789 440732275
14269 440732275 437266825 439424669 448315642 448724602 441220064 430935901 418659065 405814667
14261 405814667 392377743 377647732 361335301 344545742 327547240 311492212 295978916
14254 295978916 280765338 266594761 252535297 239245255 226455529 214364734 202891082
14247B02891082j0423559r937855r334410q721942q154720p564848p638904o643136
14239A34471708o754660n609316n652841n316775n007415m248947m743408m026425
14231I3111921l924489l353948l407941l595588k905599l378306k594596k714983
14223F7236471k628799k005019k611069j854577j818592k036962j761482j824289
14215E0695682j703607j162987j329505j638094j399832j257052j347518p22614
14207D0134473j208600j219967j243142j211553o73941j023381o45143q83622
14199C2025124q24659j061796n88480p49242n42952o46285p82568n15558p79214
14190B5534370p30095q10881n74899m54919q65160p1423k07622q17284k97080
$$ plain form
14247 202891082 192467523 182529668 173195258 164473316 156318596 148753748 141114844 134471708
14239 134471708 127717048 122107732 116454891 111138116 106130701 101881754 97138346 93111921
14231 93111921 89187432 85833484 82425543 78829955 75924356 72546050 69951454 67236471
14223 67236471 64607672 62602653 59991584 58137007 56318415 54281453 52519971 50695682
14215 50695682 48992075 47829088 46499583 44861489 43461657 42204605 40857087 40134473
14207 40134473 38925873 37705906 36462764 35251211 34577270 33553889 32908746 32025124
14199 32025124 31200465 30138669 29550189 28800947 28257995 27611710 26829142 26313584 25534370
14190 25534370 24804275 23993394 23418495 22963576 22098416 22026993 21819371 21002087 20705007
14181B0705007o34204l37217m33690q51422j77612m82884j39961k84736o93561
14172A6669720J07654k90760p52574j18718l50405k47110j24832m01235l14865
14163A4176875k31529r0394n89777k23302N6356m73673j01697j01556n64017j38828
14153A1718458n7415l57745j1322l66757j16809k08580m2554n8219j68241m99623
14143I831193K5933l55996J3965k72302l07034K62093n77365J55357j35433l26838
14133H313573J24258l21584J8903l10192J07262l40212J68011L8818j84876q4282
14123G529679j72165l31541K64895n56632Q1445P8756k50709L3933j61643n74326
14113E941692M16964l07498M6360k21889q0300J59534q4291j99446J07553j93246
$$ plain form
14181 20705007 20070803 19733586 19299896 18448474 18270862 17787978 17648017 17363281 16669720
14172 16669720 16777374 16486614 15734040 15615322 15264917 15017807 14892975 14491740 14176875
14163 14176875 13945346 13854952 13265175 13041873 13098229 12624556 12522859 12421303 11857286 11718458
14153 11718458 11661043 11303298 11291976 10925219 10808410 10599830 10557276 10499057 10330816 9831193
14143 9831193 9857126 9501130 9515095 9242793 8935759 9197852 8620487 8775844 8640411 8313573
14133 8313573 8437831 8116247 8135150 7824958 7932220 7592008 7760019 7798837 7613961 7529679
14123 7529679 7357514 7025973 7290868 6734236 6815681 6894437 6643728 6677661 6516018 5941692
14113 5941692 6358656 6051158 6097518 5875629 5795329 5954863 5870572 5671126 5778679 5585433
14103E585433n1258K0968l21642L87363k11277l572j06145q0817m3661k63124
14093D912268m13618J22334K43100k28040K23763l23270j04139Q9049M6159j75856
14083D391750J37714r7445K15770l43666J36860j2945N3090n42193n8171J85789
14073D066553j54054J52216k45p1879K2349n09430M12662p7637j52769k92539
14063C395227K51387j69685K5997J74866n43365K37343L47945l71791L072M5330
14053C396326m59199K31220L45345k20571l0739m26013J21238k01424k6360L45974
14043C075797O906j35768j39160Q3366j46018k83062L28413K7653j47543m8748
14033B621836K90154m88661M33262m51697O0377K22740n9651l6440j28427J9462
$$ plain form
14103 5585433 5534175 5555143 5233501 5620864 5409587 5406015 5299870 5219053 5175392 4912268
14093 4912268 4498650 4620984 4864084 4636044 4859807 4536537 4432398 4521447 4567606 4391750
14083 4391750 4529464 4432019 4647789 4304123 4440983 4428038 4481128 3938935 3880764 4066553
14073 4066553 3912499 4064715 4064470 3992591 4014940 3505510 3918172 3840535 3687766 3395227
14063 3395227 3646614 3476929 3502926 3677792 3134427 3371770 3719715 3347924 3350996 3396326
14053 3396326 2937127 3168347 3513692 3293121 3262382 2836369 2957607 2756183 2729823 3075797
14043 3075797 3082703 2946935 2807775 2891141 2745123 2462061 2790474 2818127 2670584 2621836
14033 2621836 2911990 2423329 2856591 2404894 2465271 2688011 2628360 2591920 2463493 2482955
14023B482955k73179K12084J91353J25096m85983n580j45008L62949j57323J06873
14013B414237k45332o5231J40559K07718l58828R5677N4682j51796o1030l4042
14003A996614m34708J46858N87821l14508J0957j43675k22271J88182k47265K69282
13993A837287J62977K19946k7139R23443K018021M591606P042426P156689J739086
13984B5664342j331659l289464j0101491m059401k008466p90872p43704J86656
13976C525941o26908q7960R8305m48392j93533N5447L24170m14813j1595l4356
13966B186306k23808p0189N4723j10297m592J59675J02169j37142l02848L06384
13956A960381j79046M4260j8890j68126J83018L98082m76353J53386n38851J89501
$$ plain form
14023 2482955 2209776 2421860 2613213 2738309 2252326 2246746 2101738 2464687 2307364 2414237
14013 2414237 2168905 2103674 2244233 2451951 2093123 2188800 2243482 2091686 2030656 1996614
14003 1996614 1561906 1708764 2296585 1982077 1993034 1849359 1627088 1815270 1568005 1837287
13993 1837287 2000264 2220210 2193071 3116514 5134535 9726141 16768567 23925256 25664342
13984 25664342 24332683 21043219 10941728 6882327 4873861 4082989 3339285 3525941
13976 3525941 2899033 2811073 2909378 2460986 2267453 2322900 2647070 2232257 2220662 2186306
13966 2186306 1962498 1892309 1947032 1836735 1832143 1991818 2093987 1956845 1653997 1960381
13956 1960381 1781335 1825595 1806705 1638579 1821597 2219679 1743326 1896712 1357861 1547362
13946A547362k7510P2974J14832J03060l41197N32723K1815m68203J6607j94665
13936A377798L18821O9210j09569l38848L13392l1488k14695q4775J38203L08887
13926A746936k71973J93459m39800J9127j51807L91587q5037p380L0930p5587
13916A350455p9739L8085k89553M59835k19850R2651q0571P1362m3137j00709
13906A198829J7914q9939J83067m0280k41887k75390N55492j47339j00030J29759
13896A190196K11118j92258n9796p8029L66394k23452o9633J2753J38761p7280
13886A218774j50691K31389p6071k86149J46855r9827D47849O83639p5391J36383
13876A192480k16480L3619N3442R2176k65352N290J71513o5767p8599N5245o5358
$$ plain form
13946 1547362 1519852 1592826 1707658 1810718 1469521 2002244 2024059 1555856 1572463 1377798
13936 1377798 1696619 1765829 1656260 1317412 1630804 1599316 1384621 1299846 1438049 1746936
13926 1746936 1474963 1668422 1228622 1247749 1095942 1487529 1402492 1395112 1426042 1350455
13916 1350455 1270716 1308801 1019248 1479083 1259233 1351884 1271313 1342675 1299538 1198829
13906 1198829 1216743 1126804 1309871 1269591 1027704 752314 1307806 1160467 1060437 1190196
13896 1190196 1401314 1209056 1149260 1071231 1437625 1214173 1144540 1157293 1296054 1218774
13886 1218774 1068083 1299472 1223401 937252 1084107 984280 447849 1131488 1056097 1192480
13876 1192480 976000 1009619 1063061 1155237 889885 895175 1066688 1000921 922322 977567 912209
13865I12209K24649k69106J9445L36811k54630p4151Q9130j57952M22685j77009
13855A072081O3434k56655K9060n3512n395L16437k77536l3204k53791P8227J62518
13844H41664K64795n03577K51558L12402k77314j15283j54226M91804m21900K82820
13834I72743k51700K07431J02867k78034K1387j77506l9372R5668K3449O1766
13824G38699R3325j19582J2613L8098K53398k90127n3777j51650J64047q4037
13814F01007K79390l24204L25725l75137M64263k13344m009j96850J09871l1449
13804F35263K5030Q1625J2343j20515J65426j22034J56958q2884k68602K89558
13794G72168p9838k04184N28645l01235j53244K69037J72061j80809l29001K23455
$$ plain form
13865 912209 1136858 867752 887197 1224008 969378 895227 984357 826405 1249090 1072081
13855 1072081 1135515 878860 907920 854408 849013 1165450 887914 854710 600919 679146 841664
13844 841664 1106459 602882 854440 1166842 889528 774245 620019 1111823 689923 972743
13834 972743 721043 928474 1031341 753307 774694 597188 557816 653484 676933 738699
13824 738699 832024 712442 725055 763153 1016551 726424 672647 520997 685044 601007
13814 601007 880397 556193 881918 506781 971044 757700 753691 556841 666712 635263
13804 635263 660293 741918 754261 633746 799172 677138 834096 751212 482610 772168
13794 772168 692330 488146 1016791 715556 562312 831349 1003410 822601 493600 717055
13784G17055K41245k11226j37816j75405n2033L86316j43006J08136k17142K67875
13774G83999C38688M42099K2652j20807j13918J99369k01360l3078L49549l09886
13764E73308K4939n8623j00959M73040A51309N66412j20666p7660P0226k41982
13754C47639M90809l22631N1013J50206N6903k08086k08844O31874m61818k22835
13744C04230K11375A49103P750K94262J02968j97372j26854C9284N55216q0651
13734E13849J41297k08325K33687R8573B80350J76236J44185k53521J33365K96863
13724G77478J6850C45213K62815B69384O2570K68647L437B14421J70575N80180
13714I65176D33022j55842K09794q9703K89696k18724J15868j30534N2460B34871
$$ plain form
13784 717055 958300 747074 609258 433853 381820 768136 625130 733266 516124 783999
13774 783999 338688 780787 803439 682632 568714 768083 566723 533645 883194 573308
13764 573308 598247 539624 438665 911705 151309 717721 597055 519395 589621 347639
13754 347639 838448 515817 566830 717036 773939 565853 357009 988883 527065 304230
13744 304230 515605 149103 156853 451115 554083 356711 229857 39284 594500 513849
13734 513849 655146 446821 680508 779081 280350 456586 600771 347250 480615 777478
13724 777478 794328 345213 608028 269384 331954 600601 604038 214421 384996 965176
13714 965176 433022 277180 486974 397271 686967 468243 584111 453577 506037 234871
13703E88829p8306K6003j37349J94594j80836j79427L62571k05704M08071B12736
13692E54679M2354j75894K04651K7016k49960J16411k47207J16831P6167j50118
13682C14930r8591K86489J95166N6976B81147L68138j71449J6592j05313J92490
13672E81605k02260q4290n6571J27406n5308r1730N3266A13439M45915A40801
13661C66550J81942k63901j38868L62758J59266A05273K95168p0865K00582j85754
13651C44404j5438J95538B57127M75453l23057r8529R2059J66720j57227j45509
13641B67037Q8350F3672M85435k0442k39823j7841K1940K75671j52460j02292
13631C13860l0578j04173K38394A58011L39633J77152j47719j58478j8112j8589
$$ plain form
13703 588829 510523 536526 399177 593771 412935 233508 596079 390375 798446 212736
13692 554679 597033 421139 625790 652806 402846 519257 272050 388881 465048 314930
13682 314930 216339 502828 697994 754970 281147 649285 477836 494428 389115 581605
13672 581605 379345 295055 238484 365890 310582 218852 272118 113439 559354 140801
13661 366550 548492 284591 145723 508481 667747 105273 400441 329576 530158 344404
13651 344404 328966 524504 257127 732580 409523 310994 403053 569773 412546 267037
13641 267037 355387 63672 549107 528665 288842 271001 292941 568612 416152 313860
13631 313860 283282 179109 417503 158011 497644 674796 527077 368599 350487 331898
13621C31898A50270J6137K13733A63335L53610B08768m0459J51143j44764J96828
13611C71516O7462R458P0208l6371j66158M41573l51144B1581J05726L33818j57360
13600C03765K16988b02058E70034A46175R5768n7312o8056K62583o5171A24354
13589D50519J2808J6747n1939A09181K45238N9048q9958L4014j05232n7852J21291
13578C15730A32633J02163o6928L35257B21387H0355L65594P1008d1078G3812
13567C44671K00398a91501B45524F4786L05032o0972J37943k09559J9667R6590
13557C53487j26797K19171A09291L4631J74427L12273n7783f3914C82059K61867
13547F43926B10605Q3661J22016A14540P5013O320k3371J87894q7158J70067j35216
$$ plain form
13621 331898 150270 166407 380140 163335 516945 208768 168309 319452 174688 371516
13611 371516 438978 448436 518644 482273 316115 757688 406544 21581 127307 461125 303765
13600 303765 520753 -202058 570034 146175 241943 184631 116575 379158 313987 124354
13589 450519 463327 480074 428135 109181 354419 413467 323509 357523 252291 194439 315730
13578 315730 132633 234796 167868 503125 221387 80355 445949 516957 -41078 73812
13567 344671 545069 -191501 245524 64786 369818 308846 446789 237230 256897 353487
13557 353487 226690 445861 109291 143922 318349 630622 572839 -63914 382059 643926
13547 643926 210605 294266 416282 114540 189553 195873 172502 360396 273238 443305 308089
13536C08089A01701K52978A22161J45733c0042C45109B3726d1170D10560k03067
13526B07493J09205O9176p9193C1075N02606k62862K5737J95926B11963L7575
13516B49538j3132k9718F8340J19229P4105K8044R0639j08679o4375J56373I6368
13504A60700K31730j34921G3974J63837J04926A66095J04880A22134K88394j55634
13494B54894N6285c5266B71605f1070e209k31036F64822k95036A60542J97189
13484C57731j53377J53131O3105e7737B41312L858K51405F651K98073d8906A1748
13472A79974D7249M89422A46179K12871j08538h1707B10105Q0047p1562A04868
13461C89735J32681j10933A87928K62334G7896A2430A413J76837K70227A11135
$$ plain form
13536 308089 101701 354679 122161 267894 -30042 345109 23726 -41170 410560 207493
13526 207493 316698 385874 306681 31075 533681 270819 296556 492482 211963 249538
13516 249538 236406 206688 68340 187569 261674 289718 380357 271678 207303 363676 96368
13504 160700 392430 257509 73974 237811 342737 166095 270975 122134 410528 254894
13494 254894 311179 -35266 271605 -61070 -5209 -236245 664822 369786 160542 357731
13484 357731 204354 357485 420590 -57737 241312 245170 496575 6651 304724 -48906 11748
13472 179974 47249 536671 146179 359050 250512 -81707 210105 290152 218590 104868
13461 389735 522416 411483 187928 450262 77896 12430 1413 178250 448477 111135
13450A2851O6380J1439a32459A44036l3711O7680G9613K99843a06217F85193A97559
13438B07268F3327K08458m6399J12619j07280J03302p9700m3263j2162G1792J20226
13427A92018J22421A13966J12038j6705r212J29996J8087A54367E6972N5671J49832
13416B62475q8762K2851C0560L72640a31307B28673K6520k7190D845M6598N7608
13405A09051I292K95951n0399E5986J96980o6375G708b53389A89141D1298L63173
13394D04471E7265k139K0834J67194k1445D5956M0850J6142j2258K22269D9448
13382B57869f9659K2068B50653m9017F5964J585K07483K0241P1382A79180J93084
13371C72264A02194M1427P7810i5466E72711B00290G3104g7598C22758q7273r7289
$$ plain form
13450 12851 79231 90670 -132459 144036 110325 178005 79613 379456 -106217 685193 197559
13438 207268 63327 271785 225386 338005 230725 334027 254327 211064 198902 71792 192018
13427 192018 314439 113966 226004 209299 200087 330083 348170 154367 56972 112643 262475
13416 262475 173713 196564 30560 403200 -131307 228673 255193 228003 4845 51443 109051
13405 109051 9292 305243 254844 55986 252966 186591 7708 -253389 189141 41298 404471
13394 404471 57265 55126 75960 243154 221709 45956 86806 102948 90690 312959 49448
13382 257869 -69659 -47591 250653 201636 65964 67549 275032 295273 366655 179180 372264
13371 372264 102194 143621 221431 -95466 572711 200290 73104 -77598 322758 235485 138196
13360A38196J38481F3216K37131B2145J56839J33061A41643e9095E7626R5091
13350A52717i624D84121j97673j22399Q6059j8627Q8249R846G1554J96728o4617
13339B03665n818O5937J01732j10886k5518k9644R3447I7799M50147n5194G7417
13327B50683E2110L91949k12021B5802K67420p0702J3964O510J14614A50666c6842
13315A93865J96071A73838J99833j40567J30209e5645C7806a16330C55351l2518
13305C22833I0059J05138K1681J05572B9107J24026k3167E3276R2901o9884j0375
13294F5918L50511A31474j1213a27674B132K94074a42986A49036l447O4519r1550
13283A18558J87202H8259G507a55179j050I0840D0126P8162O9705H3755P405a89514
$$ plain form
13360 138196 276677 63216 300347 22145 178984 312045 141643 -59095 57626 152717
13350 152717 -9624 484121 286448 164049 250108 231481 319730 329576 71554 268282 203665
13339 203665 197847 263784 365516 254630 229112 199468 292915 97799 547946 492752 77417
13327 250683 52110 444059 232038 25802 293222 222520 236484 242994 357608 150666 -36842
13315 193865 389936 173838 373671 233104 363313 -55645 37806 -116330 355351 322833
13305 322833 90059 195197 216878 322450 29107 153133 129966 53276 146177 76293 65918
13294 65918 416429 131474 120261 -127674 2132 296206 -142986 149036 145589 210108 118558
13283 118558 305760 88259 7507 -155179 -156229 90840 40126 118288 187993 83755 91160 -189514
13270E267M40998A75873m4286P8496B5539a91016I5867J17892o7017i235A71587
13258A1347L49561E7101a32606a63A98167K5988K0529c9393B5462i7717A61317
13246A1416J69392Q5699L8878j14428P2412i2067A12674l3385K9947b8995G2392
13234c045B5776K503a37553C8214N07073q7831A80196a19231C19987B8969P4210
13223A03179a19953C85236A80339J22308j11717a02168B08234a49863B30268A7751
13212c2319D59729B7518J37535J2383a2344A52521M729F4224C1830A267J02424
13201A03691j704j7454J37628r7277N6111a40860D2861J03113h2144F4261J99642
13190B63903B7251i8168n5765l0423H1842K1205B5009f8467A58974b1368G6653
$$ plain form
13270 5267 446265 175873 131587 210083 25539 -191016 95867 213759 146742 -9235 171587
13258 11347 360908 57101 -132606 -163 198167 224155 244684 -39393 25462 -97717 161317
13246 11416 180808 266507 305385 190957 263369 -92067 112674 79289 109236 -28995 72392
13234 -3045 25776 28279 -137553 38214 545287 457456 180196 -119231 319987 28969 103179
13223 103179 -119953 385236 180339 302647 190930 -102168 208234 -149863 230268 17751
13212 -32319 459729 27518 165053 177436 -12344 152521 157250 64224 31830 1267 103691
13201 103691 101987 84533 222161 124884 180995 -140860 42861 145974 -82144 64261 263903
13190 263903 27251 -98168 -153933 -184356 81842 103047 25009 -68467 158974 -21368 76653
13178B0341J77722J25986n7215b58311A49960m2329i2080E891L02382j04500H8955
13166A447a64288D51461e9444j22747A14728d4269C08412G9376e8184k1361D0007
13154D61497A22952D061J6071i6195l3608B52901a87494C18904h8846B03020a06837
13142b2077A17481b15564b3712n1605C20361j24004p4211A6182M4058M5624O74
13131A06538i3900C41391A15793K2999a65087A78036b43721A61727a92430A58330
13120a6279o468C8551l905g9567a6101B03453J95080A89045d4353D4890J0585
13109E5475R4789K45960j55263j16170q571A316K54034B1237a16110C7129J33152
13098A70281A2549g8917b0171j40593d5513C16970r6866a87812O7745m2223H7021
$$ plain form
13178 20341 198063 324049 266834 -258311 149960 107631 -92080 5891 308273 203773 88955
13166 1447 -164288 451461 -59444 -182191 114728 -44269 308412 79376 -58184 -79545 40007
13154 461497 122952 4061 20132 -96195 -129803 252901 -187494 318904 -88846 203020 -106837
13142 -22077 117481 -215564 -23712 -75317 320361 196357 122146 16182 60240 105864 106538
13131 106538 -93900 341391 115793 138792 -165087 178036 -243721 161727 -192430 158330
13120 -16279 -22747 38551 34646 -79567 -16101 203453 398533 189045 -44353 44890 55475
13109 55475 150264 396224 240961 124791 116220 1316 255350 21237 -116110 37129 170281
13098 170281 12549 -78917 -20171 -160764 -45513 316970 220104 -187812 -120067 -162290 87021
13086F3545Q8464m5647c01076I4374a44699B119J73088a7044g902H0661d2650
13074d2682j24008A98291a46890M1422B87109J5161a30521N5183C6364b53601
13063b45398E9148J25803J31718b3323B24745a89868O8668C44254a77508C78604
13052B93447b904A16835K74638j61812a54683H9541K1816J91111b00044G2039
13041F2307a54245C54466i8734B18761G7191J4750a3045l56254B15874c62838
13030B17293M1013k1577D4340M4308m1152J74722f1984B61607a5517A82953K0797
13019B03750o7187J51526f783C25560j52740J11659I4189Q0377A3287N19509A95594
13007A42567K7850J88032a78761C70672d2775B94697E7109j8114j0279d1579G8646
$$ plain form
13086 63545 152009 106362 -301076 94374 -144699 2119 175207 -17044 -7902 80661 -42650
13074 -42682 -166690 198291 -146890 -105468 287109 302270 -130521 -75338 36364 -253601
13063 -245398 59148 184951 316669 -23323 224745 -189868 -121200 344254 -177508 378604
13052 293447 -2904 116835 391473 229661 -154683 89541 111357 302468 -200044 72039
13041 62307 -154245 354466 -98734 218761 77191 91941 -13045 -369299 215874 -362838
13030 217293 258306 236729 44340 88648 47496 222218 -61984 261607 -15517 182953 203750
13019 203750 136563 288089 -6783 325560 172820 284479 94189 174566 13287 532796 195594
13007 142567 170417 358449 -178761 370672 -42775 294697 57109 38995 28716 -41579 78646
12995A14926f0545A42907R2909A08178J95587I3704b59670I9585d769A08600O7811
12984A76411o4620a05948I9032e9667D7185L1216a10638e1526r3001A00486Q6624
12973A87110h0029A2274J25305F5155K84955b5873q7720q5984G3749J2933l1778
12962E4904A0489J34551C8563b32384g9581H371e7255E12451c0375H5339B8495
12950C3523a24378L3784j76381G7015B3111L007K47237j36233J38942A16283J69592
12939B85875j15371L6614G9427a2621c073D95728g6786C16108j55086a29279D2597
12927D1400L37594a16027H5938L46301a85628h5520f593C98338E2009J26139A1018
12915e764B61442b5517n9191j26557c6525Q831B78678j38175g2084B15020a27555
$$ plain form
12995 114926 -60545 142907 235816 108178 303765 93704 -259670 99585 -4769 108600 176411
12984 176411 111791 -105948 99032 -59667 47185 78401 -110638 -51526 -144527 100486 187110
12973 187110 -80029 12274 137579 65155 350110 -25873 -113593 -199577 73749 86682 54904
12962 54904 10489 145040 38563 -232384 -79581 8371 -57255 512451 -30375 85339 28495
12950 33523 -124378 -90594 -266975 77015 23111 26118 273355 137122 276064 116283 285875
12939 285875 170504 207118 79427 -12621 -3073 495728 -76786 316108 161022 -129279 42597
12927 41400 378994 -116027 85938 432239 -185628 -85520 -6593 398338 52009 178148 11018
12915 -5764 261442 -25517 -84708 -211265 -36525 -27694 278678 140503 -72084 215020 -127555
12903A99913E5336f3950A14486C0233e5103A0567J57942B6702d13688H8316d003
12891B07150F9337a38751A43555C8751a075j11482d8174q5222A0741J09694c8340
12879a93155C23906A02482a9519j51351f6877D36494j04959E2450K90968a51185
12868C19547a43946o6528e4811B45206o5432J5378g4090p968A45243J06910D6467
12856A91608a54413m0285A39899K88917I583M3012b36635A04303l2548a43061
12845C25034B4455J7747g9077C12883a94664B78761h0895L3943B06944a2145D9464
12833A55878G3757l3653J0227a83125B1552M218M32164K0153k35269p1770j3707
12822A57341b72667B54042a04367l8486c5390p4597d5707j32839B07991f3773
$$ plain form
12903 199913 55336 -63950 114486 30233 -55103 10567 168509 26702 -413688 88316 -4003
12891 207150 69337 -138751 143555 38751 -1075 -112557 -48174 -133396 10741 120435 -38340
12879 -193155 323906 102482 -19519 -170870 -66877 436494 331535 52450 343418 -151185
12868 319547 -143946 -210474 -54811 245206 179774 195152 -74090 -82058 145243 252153 46467
12856 191608 -154413 -194698 139899 428816 9583 52595 -236635 104303 71755 -143061
12845 325034 24455 42202 -79077 312883 -194664 278761 -80895 -46952 206944 -12145 49464
12833 155878 73757 40104 50331 -183125 21552 25770 457934 478087 242818 171048 157341
12822 157341 -272667 254042 -104367 -142853 -35390 -109987 -45707 -178546 207991 -63773
12811e5060k0330j19786A95416b5531p6817M0739b5000F7660b86104e2556j03615
12800a56171B21914c9699a9506E5708d6298D5004L6298b54500f0030H5519K16025
12789C01544a46442n8713A79587a47512b4835C02670j49617k8591B1540a05589
12778C43150A34555D8309a04842c5491A88724f0997j0643A65308o9594j0041J54265
12767B39938A10961m2192a40370d4950H1720a66154B50903I4827b1053I8469a05642
12755e7256B52923a44601F421b91614B70574a92523g6295A7497b39453C53655
12744a20408j57518E7632a29773e5604k6963C06604q240H3889b38319F4395a59490
12732E834K23743h3730A61559J0246R2407a28364A17146q258h7452B50327h0491
$$ plain form
12811 -55060 -75390 -195176 195416 -25531 -102348 -61609 -25000 67660 -286104 -52556 -156171
12800 -156171 221914 -39699 -19506 55708 -46298 45004 81302 -254500 -60030 85519 301544
12789 301544 -146442 -205155 179587 -147512 -24835 302670 153053 124462 21540 -105589
12778 343150 134555 48309 -104842 -35491 188724 -60997 -71640 165308 95714 85673 239938
12767 239938 110961 68769 -140370 -44950 81720 -166154 250903 94827 -21053 98469 -105642
12755 -57256 252923 -144601 6421 -291614 270574 -192523 -76295 17497 -239453 353655
12744 -120408 -277926 57632 -129773 -55604 -82567 306604 298364 83889 -238319 64395 -159490
12732 5834 229577 -83730 161559 171805 264212 -128364 117146 108888 -87452 250327 -80491
12720A33605b74561A0768b9821l11551b4834B32998i070B11686H9003h9189A91958
12708A50210Q6450f9685H3294a9867A18273Q432R3209b34139j8561e4712F5865
12696B35429e7871l59B07378b25754L3380K0969C75456p2577F1529O0528b8027
12684B25794h1021j64252P2157I196K17394j06798i8488A59086C1081K07806b72339
12672b7532j81539B8744J48422m2962M12505H1125a47396C07829E3040J6052C2928
12660A85173H3714k0233J5223J26622M0395J38112A80069h80D3430j5048h4637
12648A5754G185L6531c06570A61128g4094C51633f1694j64214C4428j3595K54214
12637B75047D8084K23301P7109A29294C5040N01639k61493A12540Q4909p7809
$$ plain form
12720 133605 -274561 10768 -29821 -341372 -24834 232998 -9070 211686 89003 -89189 191958
12708 150210 236660 -69685 83294 -19867 118273 126705 219914 -234139 -252700 -54712 65865
12696 235429 -57871 -58230 207378 -225754 -192374 -171405 375456 302879 61529 122057 -28027
12684 225794 -81021 -245273 -173116 9196 226590 119792 -98488 159086 31081 238887 -272339
12672 -27532 -209071 28744 177166 134204 546709 81125 -147396 307829 53040 69092 32928
12660 185173 83714 63481 78704 205326 245721 383833 180069 -880 43430 28382 -84637
12648 15754 7185 43716 -306570 161128 -74094 351633 -61694 -225908 34428 20833 275047
12637 275047 48084 271385 348494 129294 35040 536679 275186 112540 197449 119640
12627A19640i4809B53087J86869i7468B28863D3234M26104A49210A2761L66036
12617C78797b02163A09432n945d2927j73747m4345e745A03066f0248R301B05262
12605a77389G6060J97065o314h0608A33708a39434B83052A07574c618n5432M770
12594e4280K6683k46471C51292a31700A91446M1273H3401O3439M2553C4863a1057
12582A66334g6702B31811b37846B27717G2731a39115B37524a3842n6855p4804
12572a45501A6538R9824a527k58272C10329A30443J15154p0869L47566b52528
12561D86401B04951a82220k3799A86022J1455D7323b44947o7559d6659a0843p1435
12550h2278H6433M9234a10287A4821Q3595J1777b5224m98G7871O4630P4366a07949
$$ plain form
12627 119640 -94809 253087 439956 -97468 228863 43234 469338 149210 12761 378797
12617 378797 -202163 109432 103487 -42927 -216674 -261019 -5745 103066 -60248 -50947 205262
12605 -177389 76060 273125 266811 -80608 133708 -139434 283052 107574 -3618 -59050 -54280
12594 -54280 -27597 -274068 351292 -131700 191446 232719 83401 146840 189393 34863 -11057
12582 166334 -76702 231811 -237846 227717 72731 -139115 237524 -13842 -70697 -145501
12572 -145501 16538 116362 -1527 -259799 310329 130443 245597 174728 522294 -252528
12561 486401 204951 -182220 -206019 186022 197477 47323 -244947 -312506 -46659 -10843 -82278
12550 -82278 86433 135667 -110287 14821 98416 110193 -25224 -25722 77871 142501 216867 -107949
12537b16694B44395i4884D3913b26802D16456b3967k7404j78989A70746F8377
12526g1857j06001l36480b23211K8294A90488j4385O4925A15576a08038C63758
12515B9022b8128r7966j3101e6263j4982l9286n0401A72228a01782b1885A9920
12503B08158B5740L62547a71550i63A50790A8226b38613A89393n5932P9367F1981
12491C25048E3245a05966C21363j34283a28154I8531k1562B6057b70746G025O9975
12480G7000n116K3707h8446D4963O8872K3106q463b5703C6530a206m7641A51189
12467A17220l3601J44564b25595f6458C85375A56269d9348B77175J10362m3166
12457C44371j45114D7536a07401N0632j87690A77989j4020L5787b85965A2139
$$ plain form
12537 -216694 244395 -94884 43913 -226802 416456 -23967 -51371 -230360 170746 68377
12526 -71857 -177858 -514338 -223211 -194917 190488 176103 241028 115576 -108038 363758
12515 29022 -28128 -126094 -139195 -56263 -71245 -110531 -160932 172228 -101782 -21885 19920
12503 208158 25740 388287 -171550 -963 150790 18226 -238613 189393 133461 212828 61981
12491 325048 53245 -105966 321363 187080 -128154 98531 76969 26057 -270746 7025 77000
12480 77000 71884 95591 -88446 44963 113835 136941 128478 -25703 36530 -1206 -48847 151189
12467 117220 83619 228183 -225595 -66458 385375 156269 -49348 277175 387537 344371
12457 344371 199257 47536 -107401 -56769 -244459 177989 163969 199756 -285965 12139
12446a52152I0811f4581j72848L8774K1216P8651B57428A22676c21577e2641B30990
12434f6077b2194m4864G0118c29180B79547E0270O1513a40072B0029K56546e6219
12422c9117F3427k0019a95699a0193A8447H803N36726i8215C8468J6387d25085
12410d402m6644p3796N4232B58747a83166B11330e2091H9347b76858A22659i4869
12398A20741D0566J42603H5954b5673j01045e1424q4343K3462j45866l7239a41058
12386a51138d6927k2409j9938G3643l2645M07047A11554a84246h7575B02517b03071
12374a08047D22c40187i6254a9701r0482B099J64986a67574g7272n3080A5364
12362b45909C0341J42433C3478r092K39360j28958K95228c40464A83900g7220
$$ plain form
12446 -152152 90811 -64581 -237429 -198655 -177439 -98788 257428 122676 -321577 -52641 230990
12434 -66077 -22194 -67058 70118 -329180 279547 50270 111783 -140072 20029 276575 -56219
12422 -39117 63427 43408 -195699 -10193 18447 8803 545529 -98215 38468 54855 -425085
12410 -4402 -51046 -124842 -70610 258747 -183166 211330 -52091 89347 -276858 122659 -94869
12398 120741 40566 183169 85954 -25673 -126718 -51424 -135767 -112305 -258171 -295410 -141058
12386 -151138 -46927 -69336 -89274 73643 40998 448045 111554 -184246 -87575 202517 -203071
12374 -108047 422 -340187 -96254 -19701 -110183 2099 167085 -167574 -77272 -130352 15364
12362 -245909 30341 172774 33478 24386 263746 134788 430016 -340464 183900 -77220
12351C6818O3271A933J58514a9350A04551l2916b13550m1004A49008m1871L488
12340A10625K76199a47792n714l9373c883C25164b06821G734J9281f6288j7386
12329h3674l81106f1450A1014a60416k07133a56268p658P9571C80732A48076l3564
12318A14512c20820B4229J59720N821a5634D9694K99036d6207m3585B30187A09147
12306F0838h6985J3539o802j54843Q3698l2126F6721a377n6496J7188k1769l4083
12294i6537A513J68065a28135A45667l9986l9782M2627J25590q3789a7229j70384
12283a87613J480L7739e6051F5824a52065I1677B1839N1119J45918F1615M5551
12272A07166M7080p0155c554j42137e9128B23344r0478g2235B47239a87414B97933
$$ plain form
12351 36818 100089 1933 160447 -19350 104551 71635 -213550 -254554 149008 107137 110625
12340 110625 386824 -147792 -153506 -192879 -3883 325164 -206821 7734 27015 -66288 -83674
12329 -83674 -464780 -61450 11014 -160416 -367549 -156268 -163926 -84355 380732 148076 114512
12318 114512 -320820 24229 183949 189770 -15634 49694 348730 -46207 -89792 230187 109147
12306 60838 -86985 -73446 -80248 -235091 -151393 -183519 66721 -1377 -57873 -40685 -62454 -96537
12294 -96537 1513 169578 -128135 145667 105681 65899 108526 234116 150327 -17229 -187613
12283 -187613 -186133 -148394 -56051 65824 -152065 91677 21839 72958 218876 61615 107166
12272 107166 154246 84091 -3554 -145691 -59128 223344 132866 -72235 247239 -187414 297933
12260D976K7265K0404b6299j01633B19640P9846j04243L1944d6221k43766g8476
12248F3402K11596l3975a14562D9079J90243F4772b53830C99238a41421E7755
12237a50699G2336M66685k48761b78465G0524j8896j6841O2440K06510j04206
12227A99531p8385R1530K24721j48471D7588L36280b0889H1188J41066L3635j21714
12216A34175J09971j17481l2401b6597m1365j40728R4487A20215A573a7030C32944
12204H1440M67700b44989C78264J5200A09809j4011k2907j9791K36984e5640C34446
12192B61005A13467a84174B54907J90333a67048E8969d257j86681I4643L37365
12182D32008A34038a57916f6164A01962J97191F5641J37425p9039E3486d28853
$$ plain form
12260 4976 32241 52645 -26299 -127932 219640 299486 195243 227187 -46221 -289987 -78476
12248 63402 274998 241023 -114562 49079 239322 64772 -253830 399238 -141421 57755
12237 -150699 72336 539021 290260 -278465 70524 51628 34787 97227 303737 199531
12227 199531 121146 212676 437397 288926 47588 383868 -20889 81188 222254 255889 134175
12216 134175 244146 126665 94264 -26597 -67962 -208690 -114203 120215 1573 -17030 332944
12204 81440 549140 -244989 378264 393464 109809 95798 72891 53100 290084 -55640 334446
12192 261005 113467 -184174 254907 445240 -167048 58969 -4257 -190938 94643 432008
12182 432008 134038 -157916 -66164 101962 299153 65641 203066 124027 53486 -428853
12171F263J32366m161M6763a7728F3993J99733i1508A18243C772a10325D2373
12159A27929B5924a6909p4258A31011J30854i295q3219L9934B54342a71662B0768
12147G3521b631C00336b018r9390j07658i3357n8579M1886G0311a20699A03953
12135A46576L4041h8186n4517O5050q9446A52728o9605c6363B62613E6157K8492
12124H4649a17577C3638J30897a91783I5244i683k37471E3044g9086n4494c5409
12112B29468N4199j04834H7016a7260k0732j30919a5163C0420J32591g6787B45590
12100a01412K6657B98030j01664C9595a44402A88203M8715C4788a6050j4608A60729
12088C89189j86820h9405j6731G6972K8116b28882C39854a02777F9484a34941
$$ plain form
12171 6263 138629 134468 181231 -17728 63993 263726 -91508 118243 3772 -110325 42373
12159 127929 25924 -16909 -91167 131011 261865 -9295 -92514 -52580 254342 -171662 20768
12147 73521 -2631 300336 -2018 -101408 -209066 -93357 -151936 -110050 70311 -120699 103953
12135 146576 180617 -88186 -142703 -77653 -167099 152728 83123 -36363 262613 56157 84649
12124 84649 -117577 33638 164535 -191783 95244 -9683 -247154 53044 -79086 -133580 -35409
12112 229468 283667 178833 87016 -17260 -37992 -168911 -15163 30420 163011 -76787 245590
12100 -101412 -74755 298030 196366 39595 -144402 188203 236918 34788 -16050 -30658 160729
12088 389189 202369 -89405 -106136 76972 105088 -228882 339854 -102777 69484 -134941
12077B1448a30243A49531a35437G6794a41751o4648A23379J22201b29556A83795
12066a01954A06164h9758b5209j00196A62757b1428J025o7099d556B51396J50764
12055D02160e5938B3726e7943j17445A57289f8285j78471F7148N6507a75211b2735
12043g916A38089K17010O4046L51053N817k06682k55917I4870J46885E5679c16167
12031I5276b47532A01998l4761B3878a52470B90300a53174E9886e5682B35334
12020B3059a42958j91154A30062O9062a75322P6991k32053C4468c5330A6569J61263
12009A77832f5946j85155f8523j40155h2205C73837b95329i3743H043b42676e951
11997E5085l182a63403L4638j27157A43012A8945Q0682a75446g2443A8159P6138
$$ plain form
12077 21448 -130243 149531 -135437 76794 -141751 -206399 123379 245580 -229556 183795
12066 -101954 106164 -89758 -25209 -125405 162757 -21428 -20403 -87502 -4556 251396 402160
12055 402160 -55938 23726 -57943 -175388 157289 -68285 -246756 67148 123655 -175211 -22735
12043 -7916 138089 355099 419145 770198 776015 569333 313416 94870 241755 55679 -316167
12031 95276 -247532 101998 67237 23878 -152470 290300 -153174 59886 -55682 235334
12020 23059 -142958 -334112 130062 199124 -175322 -98331 -330384 34468 -35330 16569 177832
12009 177832 -65946 -251101 -68523 -208678 -82205 373837 -295329 -93743 8043 -242676 -5951
11997 55085 51903 -163403 -128765 -255922 143012 18945 99627 -175446 -72443 18159 94297
11986I4297c87193C35490e2715A0997a04016A17455d4363j34442A31444A641R5787
11975I7428C5419Q7897l6719K67084b9326j65168D064J04123b75383E329J90445
11964A95774d72650a11694D8303c06226b4012E3834a35372A51306b3415E8196
11953A33435a15414A05075J32845G0436i5862A39458m2419k4674k4923B1836a34222
11941b4257k02432J09288d60j2760B19237b4707J1169A733b0630h263G5374a04258
11928I2252l7727K14952B9553h4996M0165j99692M0987A51434c8089A31690a66462
11916b00046A88821J59648e8792A30896e3861n1004A24055C2932a47224b5840
11905A91199j0722O8286a32352a6556A4206a84811A22560a17699M1399K7892j73120
$$ plain form
11986 94297 -387193 335490 -52715 10997 -104016 117455 -44363 -178805 131444 1641 97428
11975 97428 35419 123316 86597 353681 -29326 -194494 4064 108187 -275383 5329 195774
11964 195774 -472650 -111694 48303 -306226 -24012 53834 -135372 151306 -23415 58196
11953 133435 -115414 105075 237920 70436 -95862 139458 97039 72365 47442 21836 -134222
11941 -24257 -226689 -117401 -460 -13220 219237 -24707 -13538 1733 -20630 -8263 75374 -104258
11928 92252 54525 269477 29553 -84996 -44831 -244523 -203536 151434 -38089 131690 -166462
11916 -200046 188821 348469 -58792 130896 -53861 -104865 124055 32932 -147224 -25840
11905 191199 180477 248763 -132352 -16556 14206 -184811 122560 -117699 -76300 -48408 -221528
11894b21528A81042p8243P0734E7522b54212r389d9759B35970a00563c6333j98593
11883b34926I0013j1563K39553a76005N258F4164a90398g2740k68204A86200a21798
11871b6444l0904A45396c3295j89068I9624J35220a35470o683A1569K9726b30430
11859b6003A67831a6802j91707A28882M9777P5049D8329J51295o1445K9912j4824
11848A53267c74624J17234A22494b41245R4240A1300d0631m8679r6046h6603n0646
11837a37249J3074k44941J35610Q7402A87299a83851k2639A01793Q9121p2107
11827A18807n1887l1348d16747c6613H1233l4557a13102A65143a64608E6111a52394
11815b0270p4352J9066B226J60777J23845a23929k34972l0029A68684b6975i751
$$ plain form
11894 -221528 181042 102799 173533 57522 -254212 -263601 -49759 235970 -100563 -36333 -234926
11883 -234926 90013 78450 318003 -176005 -170747 64164 -190398 -72740 -340944 186200 -121798
11871 -26444 -57348 145396 -33295 -222363 99624 234844 -135470 -142153 11569 41295 -230430
11859 -26003 167831 -16802 -208509 128882 178659 253708 48329 199624 138179 168091 153267
11848 153267 -374624 -257390 122494 -241245 -147005 11300 -40631 -89310 -185356 -86603 -137249
11837 -137249 -124175 -369116 -233506 -146104 187299 -183851 -206490 101793 190914 118807
11827 118807 66920 35572 -416747 -36613 81233 46676 -113102 165143 -164608 56111 -152394
11815 -20270 -94622 -75556 2226 163003 286848 -123929 -358901 -388930 168684 -26975 -9751
11803e97656B06303n7771k2018a29221A59391o7186c2807B77492h2856B1855d21570
11791A06077J09521a70769B05756o5621L2349C6413f5801j44933h0304D4822N1228
11780I6050J2211L3597A0150a568m2774B968J3343i3531J4233A88186a17955B24074
11767A8684L36242A13681a93168B29033a37802j2639B66034d01476f023q0932
11757h6955A29394E3566p942J19218P8680m1510h0983J4524q820A72052K50150
11746D22202b26493B10731c3690D0962c78876P1679A85162e4818j51058A12015
11735a39291f8642j62422a8845n4446H9139a80066D2209K11816j18964b1803l901
11724b5704A95053B6829f5471K1241A0900a06276M5868B05125G6369L7466a78485
$$ plain form
11803 -597656 206303 148532 126514 -129221 159391 92205 -32807 277492 -82856 21855 -421570
11791 106077 215598 -170769 205756 140135 172484 36413 -65801 -210734 -80304 44822 96050
11780 96050 108261 141858 10150 -1568 -44342 2968 16311 -93531 -79298 188186 -117955 224074
11767 18684 354926 113681 -193168 229033 -137802 -150441 266034 -401476 -6023 -86955
11757 -86955 129394 53566 45624 164842 243522 202012 -80983 -66459 -75279 172052 422202
11746 422202 -226493 210731 -33690 40962 -378876 -307197 185162 -54818 -205876 112015
11735 -139291 -68642 -231064 -18845 -73291 89139 -180066 42209 254025 135061 -21803 -25704
11724 -25704 195053 26829 -65471 -44230 10900 -106276 -60408 205125 76369 113835 -178485
11712i9578j01539I3736l8017L83430d28496d2638R106G3831i0513G0235i6951
11700a71070r0503A06129g2693k11292a01689J590j04339C08940j36856G8307
11689a14904j0577D0484i0424f415a00k999A20240a43069q3534a01809B2804J82342
11677B05146r5834c3200j58834Q5080C21565h3832F5372a03641A9861K0931e44255
11665C24195A57945m2217a37048k16544D8059a33333G4527O5636L06905B0859
11654a3298A35050F019J87936b73119O5901B18729e8052A45528p0908f4837F104
11642A1017a20603A40442K5489a85785C25717e3255E45g5936A31153B5055e5641
11630A16135b58311f1089A70462a98457M4290k07144B56044a5970D2018J61682
$$ plain form
11712 -99578 -201117 93736 55719 439149 -428496 -42638 -33532 73831 -90513 70235 -96951
11700 -171070 -261573 106129 -72693 -283985 -101689 -100099 -204438 308940 172084 78307
11689 -114904 -125481 40484 -90424 -6415 -100 -3099 120240 -143069 -226603 -101809 22804 205146
11677 205146 109312 -33200 -192034 -106954 321565 -83832 65372 -103641 19861 40792 -544255
11665 324195 157945 115728 -137048 -353592 48059 -133333 74527 140163 447068 20859
11654 -13298 135050 6019 193955 -273119 -207218 218729 -58052 145528 74620 -64837 6104
11642 11017 -120603 140442 165931 -185785 325717 -53255 545 -75936 131153 25055 -55641
11630 116135 -258311 -61089 170462 -198457 -154167 -361311 256044 -15970 42018 203700
11620B03700I2763a58254A44996o4082K9916b3915k68462A50724J41792f0951
11609c858G2689b20772K4172G4687b74099a2145k5537q2100J1909B95646f5750
11597A09614N2138F4756K62610j49588E3731a87295A24267a15814L3794B17132
11586B16964C4036J44718a34804C2577J81916a33868e9867B34853P6453D9907
11575a52183A06233b19898b0147B14054o5302a29071N0202F2333a93317A39387
11564C67626f3109C35048b3055A28438M8528l3802l4040M4043K8208H2225L9052
11553A21277L1873d30456b12045e6594G9035L02922B873Q3640E650J50288F9269
11541B19045b05094A21914a00549D6473j6005g276r4039A78426A634N11525d9354
$$ plain form
11620 203700 92763 -158254 144996 80914 110830 -23915 -292377 150724 292516 -60951
11609 -3858 72689 -220772 -196600 74687 -274099 -12145 -37682 -119782 -107873 295646 -65750
11597 109614 161752 64756 327366 177778 53731 -187295 124267 -115814 -82020 217132
11586 216964 34036 178754 -134804 32577 214493 -133868 -59867 234853 311306 49907
11575 -152183 106233 -219898 -20147 214054 148752 -129071 -78869 62333 -193317 139387
11564 367626 -63109 335048 -23055 128438 176966 143164 109124 153167 181375 82225 121277
11553 121277 153150 -430456 -212045 -56594 79035 381957 2873 86513 5650 155938 69269
11541 219045 -205094 121914 -100549 46473 30468 -7276 -101315 178426 1634 513159 -49354
11529a3845A05251K81631j37887p8171f5335H9022C9119a66833F2648O4497i4243
11517C95472r0688A47528D5086P0930C1548L37348j44443L8998j15680a14049
11506D66741E9266a87360A13936h026j6182C54752j56049n8366J07389K9761j37209
11495A40278f8393B85906j11225o2627R892d7079C7245J59629F412J25054E6216
11483A25939a3592a269A18858M5683G9139J04375J76340j39305D4425G831J68105
11472A75936b9184G0667J31059F1285J41332l1551M1407L66397c51207C6161J21661
11461A57822p5192a2779B13768n2883J66805A38339l9189K67944A51102p1057
11451H0045J9440J20924A7595J61988a8658A95067c49142a33110A60759J66952
$$ plain form
11529 -13845 105251 386882 248995 170824 -65335 89022 39119 -166833 62648 127145 -94243
11517 395472 304784 147528 45086 116016 31548 368896 224453 263451 147771 -114049
11506 466741 59266 -187360 113936 -8026 -24208 354752 198703 140337 247726 277487 140278
11495 140278 -68393 285906 174681 112054 121946 -47079 37245 196874 6412 131466 56216
11483 125939 -13592 -1269 118858 164541 79139 183514 359854 220549 44425 7831 175936
11472 175936 -29184 70667 201726 61285 202617 171066 212473 578870 -351207 36161 157822
11461 157822 82630 -12779 213768 160885 327690 138339 99150 367094 151102 80045
11451 80045 99485 220409 17595 179583 -18658 195067 -349142 -133110 160759 327711
11441C27711G3910R4628O1770b50083a20000C87351A6987Q5185k8202C3840A2773
11429g5320b7627l92623a11983d0231p4961d0576C3984a15247k0535F01619A70974
11417c48982J73894k9330B63395i2132j80567g6852C4498L590J70374a04771K5036
11406g9735A14205a09224c6087r6433A30954f0435m7847E8999K04427A09895K6281
11395A36176J20566a4208p6071k3120B20356b14980A02117b64829g631m5892E546
11383a57106P5186F0358a05364r4837A05876A9790c90987a2853B58183a15110
11372a06128J9300b213o6698I1179J46842A8154J46447o9415b44243a1802F3625
11360e6310j83318i1491b5400a2572G1953b0915r9797A00265m8810K11755g843
$$ plain form
11441 327711 73910 168538 230308 -250083 -120000 387351 16987 102172 73970 33840 12773
11429 -75320 -27627 -420250 -111983 -40231 -115192 -40576 33984 -115247 -135782 601619 170974
11417 -348982 -175088 -204418 263395 -92132 -272699 -76852 34498 38088 208462 -104771 -79735
11406 -79735 114205 -109224 -36087 -132520 130954 -60435 -108282 58999 263426 109895 136176
11395 136176 256742 -14208 -90279 -113399 220356 -214980 102117 -264829 -7631 -53523 5546
11383 -157106 -81920 60358 -105364 -200201 105876 19790 -390987 -12853 258183 -115110
11372 -106128 -86828 -2213 -68911 91179 238021 18154 164601 95186 -244243 -11802 63625
11360 -56310 -239628 -91491 -25400 -12572 71953 -20915 -120712 100265 51455 263210 -7843
11348A18714a81146D5989n943c22992i572A27507e1788k07026B1839f8173q7803
11337a55976o2632e3978E219J45573g2101H1K38687b5641B43703b69521J01455
11326a68066m2304C09869c2057A71673F2438J20035D0441c53870J40921A43954
11315B44044I839K5205e6786F4477c9500J2709A50525b24405A72945g7058p5153
11304a52211A82034e7140A28178a09290F2782i9670a9916D4025J3691N5253j702
11293A11267n2056b50811I3227f2768n2968K7178m6773d4700M612p2709k99830
11282d12627N1077A26029n8016J34889A8435K63719c91746B7178c2448A61957
11271G8167P5820a31483A42476a49940o0883h2641a8221A41845A4267J73090D2719
$$ plain form
11348 118714 -181146 45989 40046 -322992 -9572 127507 -51788 -258814 21839 -68173 -155976
11337 -155976 -218608 -53978 5219 150792 -72101 81 238768 -25641 243703 -269521 -168066
11326 -168066 -210370 309869 -32057 171673 62438 182473 40441 -353870 -212949 143954
11315 244044 9839 35044 -56786 64477 -39500 -26791 150525 -224405 172945 -77058 -152211
11304 -152211 182034 -57140 128178 -109290 62782 -99670 -19916 44025 57716 112969 111267
11293 111267 59211 -250811 93227 -62768 -115736 -88558 -135331 -44700 -40088 -112797 -412627
11282 -412627 -361550 126029 68013 202902 18435 282154 -391746 27178 -32448 161957
11271 78167 153987 -131483 142476 -149940 -210823 -82641 -18221 141845 14267 187357 42719
11259A90849f1986j02170A72738b47823B34528p1153e9875A61290a88437B4342
11248c8073r121A3130b19544g4398l69214C56476b9260p6045K8278K7455B15032
11236a01165B35977i1377A2197r02m411K32991A10617g9241b9910j6441B48026
11224a46756M2419c5922q0088j64093H316O5492c8680A67932c04664E8379c34265
11212c1426E1700P2889c1661H0555J4361Q3384G1130L8698j2050h9318B44128
11200D46a8132j56323a0660A34203d11377a31537l7084k31247n8623a33249r3447
11189b26696E337R1400l9701j721f3660A5206Q3353C5325c43503g4653B0414a40911
11176a86947C1138c87780C1317L55802j69263a25968A86958c49557a17285B16109
$$ plain form
11259 190849 -61986 -164156 172738 -247823 234528 163375 -59875 161290 -188437 24342
11248 -38073 -47194 13130 -219544 -74398 -443612 356476 -29260 -105305 -77027 -49572 215032
11236 -101165 235977 -91377 12197 11295 6884 239875 110617 -79241 -29910 -46351 248026
11224 -146756 -104337 -35922 -116010 -280103 8316 73808 -38680 167932 -304664 58379 -334265
11212 -31426 51700 124589 -31661 80555 94916 178300 71130 109828 97778 -89318 244128
11200 446 -18132 -174455 -10660 134203 -411377 -131537 -168621 -399868 -458491 -133249 -226696
11189 -226696 5337 96737 57036 55315 -63660 15206 98559 35325 -343503 -74653 20414 -140911
11176 -186947 31138 -387780 31317 387119 217856 -125968 186958 -349557 -117285 216109
11165d2649n1409p7671C17749I1356a22017d9697I9375N568c1306j82998c336
11153D1267K48565j43116c73246A66700J9802O2035b18315A10459c31861l6225
11143c68086n4707d4114j01355K4386I3376j1941a63177J526A85283d9511B15844
11131B10455r5211a32817N8546B64579b13954j23814C86861I3542k6602i9155
11120B67074A15882M8013F6358N3703J3028L0433E3457K56508A5945e0334b3073
11108G0533j4000d8074A27589L9732m184K08210b17743B19956H8657L7009P9430
11097B05096C7919j1240a4930j0329q3887C94169A18172L30960A83210K78741
11087D61951a53921B05083p5049a98580H2872R9884b13941A05011J80794J15099
$$ plain form
11165 -42649 -94058 -171729 317749 91356 -122017 -49697 99375 104943 -31306 -214304 -3336
11153 41267 289832 146716 -373246 166700 186502 248537 -218315 110459 -331861 -368086
11143 -368086 -422793 -44114 -145469 -121083 93376 81435 -163177 -161651 185283 -49511 215844
11131 210455 115244 -132817 -74271 264579 -213954 -337768 386861 93542 66940 -99155
11120 267074 115882 163895 66358 120061 133089 163522 53457 309965 15945 -50334 -23073
11108 70533 56533 -48074 127589 167321 163137 371347 -217743 219956 88657 125666 205096
11097 205096 37919 26679 -14930 -25259 -109146 394169 118172 449132 183210 461951
11087 461951 -153921 205083 130034 -198580 82872 182756 -213941 105011 285805 400904
11077D00904A6590M65893H751K40208N8596J75848P8103j86178j3744p6704A9953
11065A84126J32734R790A36800L14285k21367L78839k11891k7373A07096O98981
11055H06077q7542o690K05824l83030K6190J76577k60315J76568k68958J12291
11045D96992K51541j17031K84272k52842q0601K59772n7270N02334F33109L82097
11035A015206j24844l83407B31475M31623R7758j10105p109p8983L62377l98819
11025E28217L41204j91619J0736l04154R0792K59099k72381r3825O4811M02484
11015H35364k62356M04987m15077J08999k44995L65056l80876K68537o217K10802
11005H84224j558k46505j78169J14101A39344M08621L47631j20920k44816L8150
$$ plain form
11077 400904 16590 482483 8751 248959 307555 483403 561506 375328 361584 284880 19953
11065 184126 316860 326650 136800 451085 229718 608557 396666 369293 107096 806077
11055 806077 718535 711845 917669 534639 560829 737406 477091 653659 384701 496992
11045 496992 748533 631502 915774 662932 582331 842103 784833 1287167 633109 1015206
11035 1015206 890362 506955 231475 663098 760856 650751 643642 564659 927036 528217
11025 528217 869421 677802 688538 384384 475176 734275 461894 368069 432880 835364
11015 835364 573008 977995 562918 671917 426922 791978 411102 679639 673422 884224
11005 884224 882666 636161 457992 572093 139344 547965 895596 774676 529860 568010
10995E68010M9567j72734K27640n968B66637O11192p8427J79595k44622J20993
10985H55368M23486l83856J50375j09112L91290m28769O30478R0118O7099L47460
10975B033937M59749k77461N46794K2824K1056L28617j47109j94134j79904k72855
10965B341514k83854n72764K15347j90988J38044k65117n3875k24028j74410l160
10955I26709k91845L93655j6939n4275j89181j43377n7104B38351O8710J02666
10945D09727j86440A01626b76016B54553O6589i0032B47100o1022f1258B39236
10934C05345h370q1778A43486d5835C5047f3969E1508b30491E7581d3474j73179
10923b16653I3738h2007d0956D39617G3952K24265c83040A86376C7696b7461r9336
$$ plain form
10995 568010 617577 444843 672483 666515 266637 877829 799402 978997 734375 855368
10985 855368 1278854 894998 1045373 936261 1327551 898782 1529260 1619378 1686477 2033937
10975 2033937 2493686 2216225 2763019 2785843 2806899 3135516 2988407 2794273 2614369 2341514
10965 2341514 2057660 1484896 1700243 1509255 1647299 1382182 1328307 1104279 929869 926709
10955 926709 634864 1028519 1011580 957305 768124 624747 567643 238351 307061 409727
10945 409727 223287 101626 -276016 254553 321142 -90032 247100 186078 -61258 239236
10934 305345 -8370 -90148 143486 -45835 35047 -63969 51508 -230491 57581 -43474 -216653
10923 -216653 93738 -82007 -40956 439617 73952 298217 -383040 186376 37696 -27461 -126797
10912a26797K6676a6337k49000f5735A49268J1795b80190h233A22837k1590P7478
10901A78725C4180r770c65650e46k36414A7924c42290D290J34147e357I6761j3093
10889H3668M3903C7309b3632p9709B5655J7735Q5821a46502m74200C39096a43112
10877A02317e8792F5463d9983K669o1695I6055a21467L0289A11783d6891h718
10865b48103k5756a30675A78847a48586A39142c32474J03841B4025J49876a76957
10854c3642l38561J44464j29977J8980D1491b36631P5447A4364b01249o7327A9617
10842a93362F8826g2147E9500O598a15852N2725K6931D1066R8766G707a38535
10830a6918j24067O369p6360A41836d2686K487B45736f8632A80009B3927N607
$$ plain form
10912 -126797 -100121 -16337 -265337 -65735 149268 161063 -280190 -8233 122837 101247 178725
10901 178725 34180 24410 -365650 -546 -236960 17924 -342290 4290 138437 -5357 96761 83668
10889 83668 127571 37309 -23632 -103341 25655 43390 129211 -146502 -620702 339096 -143112
10877 102317 -58792 65463 -49983 -47314 -109009 96055 -121467 -91178 111783 -46891 -8718
10865 -248103 -273859 -130675 178847 -148586 139142 -332474 -228633 24025 173901 -176957
10854 -33642 -372203 -227739 -357716 -338736 41491 -236631 -161184 14364 -201249 -268576 19617
10842 -193362 68826 -72147 59500 66098 -115852 -63127 -36196 41066 139832 7707 -138535
10830 -16918 -140985 -134616 -210976 141836 -42686 -40199 245736 -68632 180009 23927 29534
10819B9534M1017C1908N2322i2049K1121q3982p9884d5431A30588C30O5576a46263
10806a14229k3746A00205L9707b87545A06886a14687j28043Q3157d2519A74737
10795B09999p6287a75924Q0540k32612H465a09629c9978q7797O3572l1200A72014
10783a6384D31548c01472H0744c07678J09586I361a19138G0880b57714a1894A03724
10771B2654a9307B3565q613a706A17503J98513E9895O492P9734B6763b12853A3961
10758A37316a65937A04871B6995P6555q872K34372a32568B3134h1430j09915G9473
10746b72666a9977k00451E2664M7373N3868e1510a7095k86530K6147d7103C4861
10734a62305P073H1515e4645I0963R46c50563B0397K9284a04410D3079a48940
$$ plain form
10819 29534 70551 31908 84230 -92049 -70928 -154910 -234794 -45431 130588 330 65906 -146263
10806 -114229 -137975 100205 139912 -287545 106886 -114687 -242730 -159573 -42519 174737
10795 209999 133712 -175924 -95384 -327996 8465 -109629 -39978 -127775 -64203 -95403 172014
10783 -16384 431548 -301472 80744 -307678 -198092 9361 -119138 70880 -257714 -11894 103724
10771 22654 -19307 23565 14952 -1706 117503 316016 59895 66387 146121 26763 -212853 13961
10758 137316 -165937 104871 26995 103550 94678 329050 -132568 23134 -81430 -191345 79473
10746 -272666 -19977 -220428 52664 100037 153905 -51510 -17095 -303625 -277478 -47103 34861
10734 -162305 -155232 81515 -54645 90963 91909 -350563 20397 49681 -104410 43079 -148940
10722a88963g8212A50274a04330C17458g4829l6432A72711a20339A9519h8944
10711A8251a1227j09411j231N1129k897p4145p2587b3516F9088a25801n2790m7510
10699b26101e690A88434f0479G241e6945j09739C7564A2520N3943a02413M2529
10688e9884B02510K5642b12011i5329l84623a46488E51f6556A44042a8276j67773
10677a86049A6500b22698e804j74872L1907A11186A1880J05667n5113b91708F0252
10665c6536j63987B15832l822d55036c5989A51455e31780a41164A34398b26914
10654i80o9651N240C4624c17510n4946k0091i858j28895A07379O875c15045a55359
10641b48063a348k69186a33118j71806O3245e1653a7698j40832c4459j12774k85371
$$ plain form
10722 -188963 -78212 150274 -104330 317458 -74829 -111261 172711 -120339 19519 -88944
10711 18251 -11227 -120638 -121869 -70740 -73637 -147782 -220369 -23516 69088 -125801 -178591 -226101
10699 -226101 -5690 188434 -60479 7241 -56945 -166684 37564 12520 66463 -102413 -59884
10688 -59884 202510 228152 -212011 -95329 -479952 -146488 551 -66556 144042 -18276 -186049
10677 -186049 16500 -222698 -5804 -180676 -148769 111186 11880 117547 62434 -291708 60252
10665 -36536 -200523 215832 212010 -455036 -35989 151455 -531780 -141164 134398 -226914
10654 -980 -70631 -65391 34624 -317510 -372456 -392547 -9858 -138753 107379 114254 -315045 -155359
10641 -248063 -1348 -270534 -133118 -304924 -241679 -51653 -17698 -158530 -34459 -147233 -432604
10630d32604C7757b31797b3773f770k21688g7935L8613n1290A85790a26935l1996
10619a58931C571a41080e4314k5225j84741A11479a97051O0647a3471l4792A65237
10607d8804j65366B6504J42712c4879j63533A56083p0762b87262J02739g8429
10596C6223b26883h03A05150j8036N9416g2649d037j2368j80580k8062a01068
10584a11116cA64222J49033j12461l1726l0137f3939n6193k31753c6689j15944
10573a52633p2200A62812a12497e3338A30841e2062J5890B2181e9783n3365d6799
10561c9564j14511a113A6368c7192m06569C8368a02982C2721a28831A36751a38806
10549a49287d2l90900d1639n9338A62130m1549g9988A07549i9572q4767j37683
$$ plain form
10630 -432604 37757 -231797 -23773 -6770 -228458 -77935 -39322 -90612 185790 -126935 -158931
10619 -158931 3571 -141080 -54314 -79539 -264280 111479 -197051 -136404 -13471 -48263 165237
10607 -48804 -214170 26504 169216 -34879 -198412 156083 85321 -287262 -184523 -78429
10596 36223 -226883 -803 105150 87114 146530 -72649 -4037 -16405 -196985 -225047 -101068
10584 -111116 -3 164222 313255 200794 169068 138931 -63939 -120132 -351885 -36689 -152633
10573 -152633 -224833 162812 -112497 -53338 130841 -52062 -36172 22181 -59783 -113148 -46799
10561 -39564 -154075 -1113 16368 -37192 -443761 38368 -102982 32721 -128831 136751 -138806
10549 -149287 -42 -390942 -41639 -100977 162130 120581 -79988 107549 -99572 -184339 -322022
10538c22022a52521A6752a68355C2386E67d50087A175h7547A20980B9091e6194
10526C2460J18178e8324j61930O6177H1194b33043E2385c6383B79926o3438b58219
10514a63119b4099B92256i4076F0164B1319D633J8494K7428d8061l645K4842k44852
10502b71716C27848j23493H0287M5680n7983R2888a13384d9077A13137a91029
10491D2450a9379j84276A38850a62948B0677a11112B8639J55878o4493a76482
10480a7644B92427l6434K49076F4756Q3534r342P3669G1352b02780G2244b8845
10468A04276e9839B2278J95169C6387J43937p4271c76196J10806j06015i6852
10457I3110b15295B57944d0462H4425b09592A67843b03043A44270i9753j78472
$$ plain form
10538 -322022 -152521 16752 -168355 32386 567 -450087 1175 -87547 120980 29091 -56194
10526 32460 150638 -58324 -220254 -154077 81194 -233043 52385 -36383 279926 216488 -258219
10514 -163119 -24099 292256 -94076 60164 21319 4633 23127 50555 -48061 -51706 -26864 -271716
10502 -271716 327848 204355 80287 125967 67984 160872 -113384 -49077 113137 -191029
10491 42450 -19379 -203655 138850 -162948 20677 -111112 28639 184517 120024 -176482
10480 -17644 292427 255993 505069 64756 148290 138948 212617 71352 -202780 72244 -28845
10468 104276 -59839 22278 217447 36387 180324 106053 -376196 -265390 -371405 -96852
10457 93110 -215295 257944 -40462 84425 -209592 167843 -203043 144270 -99753 -278225
10447b78225c9751I4853g4021A17591J7915h0079H7208K9671a43669L3561A85329
10435a50551j21774C7421M8433l0561O0857K23203a57155A36560l1794m7326g6460
10423h1906b4251i148p1603r3744F4432B0868c2112A5403K10312c49336c9096
10411C93762G7884a91212P449B65308i9489k2825l72M2133a4690E848a03837k29018
10399c32855n7572F1696J4615R4802K31430Q3721d9877A72748M60546B32297D0037
10387A62628J73073j19885f5489n9758C7802A7963K20304J22134j18853q7083
10377A54465K8818O08444k71743A25575I160J84735K98819j71427N5218A72336
10366F64525k16839P1101A54846K36113A71544p0663L16341j87609m5906O9567
$$ plain form
10447 -278225 -39751 94853 -74021 117591 135506 -80079 87208 116879 -143669 -110108 185329
10435 -150551 -272325 37421 85854 55293 116150 339353 -157155 136560 104766 57440 -76460
10423 -81906 -24251 -9148 -80751 -174495 64432 20868 -32112 15403 225715 -349336 -39096
10411 393762 77884 -191212 -183763 265308 -99489 -122314 -122686 -80553 -14690 5848 -103837 -332855
10399 -332855 -390427 61696 76311 171113 402543 486264 -49877 172748 633294 232297 40037
10387 162628 335701 215816 -65489 -125247 37802 17963 238267 360401 241548 154465
10377 154465 183283 791727 519984 125575 9160 193895 492714 321287 376505 172336
10366 664525 447686 518787 154846 390959 171544 100881 417222 229613 183707 253274
10356B53274E4651J31489J8640L72535p2364p4553J84499B77160J12361Q7209
10346D76730j37825g7800C18368A57737J40708e5611B63559m6597D0334P2153
10336A12487J59193n3726a86041A93460K07433M0158c2565A18858n2106R0103
10326A56855l0277J37809a74528D14991A0601J86760J61274b5374A45117K23848
10316C68965A3090d1798H4180A2586f1364j6436A04147a02141k3724l03006R1128
10305c37743a30108a81H8019m8P250o916b48484B02531r3418f7265j77209F1254
10292b88167b009l85094i6359C01787g4163I0328a96756B88920G0901d4954H7177
10280a0005j13280A5342c5570j67694i004j43752G4854j5685j3478a18587H7666
$$ plain form
10356 253274 54651 186140 204780 577315 504951 430398 614897 277160 389521 476730
10346 476730 338905 -77800 318368 157737 298445 -55611 263559 216962 40334 112487
10336 112487 271680 217954 -186041 193460 400893 441051 -32565 118858 66752 156855
10326 156855 126578 264387 -174528 414991 10601 197361 358635 -25374 145117 368965
10316 368965 13090 -41798 84180 12586 -61364 -77800 104147 -102141 -125865 -428871 -337743
10305 -337743 -130108 -181 88019 87971 95221 88305 -248484 202531 109113 -67265 -244474 61254
10292 -288167 -2009 -387103 -96359 301787 -74163 90328 -196756 288920 70901 -44954 87177
10280 -10005 -123285 15342 -35570 -203264 -9004 -152756 74854 59169 45691 -118587 87666
10268H9182a08545m2624A83107j8118A422g6567D1918L75715n665j12150D1896
10256B66337a24682A84403a03718l2122c5198A0990J85509A6301K5595c18073
10245a76435A71875a13264M1978m0135A3346K45755B942J72670q640J19323E7115
10233H0275J41932a35192C9014i015A9854b34016k2278i1485B5689D040b6475
10221d3552j43371P8946K0256L5620A53427G2535J43780K1836a01885H8774Q04
10210H9578d17059q5387B40164A15552d11445A40745b4482k8235B8672c48671
10199C88917a30394M0594H8318P5028o1782D5417R1197C3421a02247A39685J26588
10188B66273I4580a22803b3777p9143D3076e6375j10145B2991b32254A26762b82688
$$ plain form
10268 89182 -108545 -151169 183107 164989 1422 -76567 41918 417633 411968 299818 41896
10256 266337 -124682 184403 -103718 -135840 -35198 10990 196499 16301 41896 -318073
10245 -176435 171875 -113264 -71286 -111421 13346 259101 2942 175612 166972 286295 57115
10233 80275 222207 -135192 39014 -9015 19854 -234016 -256294 -91485 25689 4040 -26475
10221 -43552 -186923 -107977 -87721 -52101 153427 72535 216315 238151 -101885 88774 89578
10210 89578 -417059 -502446 240164 115552 -411445 140745 -24482 -52717 28672 -348671
10199 388917 -130394 -89800 88318 163346 101564 45417 136614 33421 -102247 139685 266273
10188 266273 94580 -122803 -23777 -102920 43076 -56375 -166520 22991 -232254 126762 -282688
10176a67796e7992p9742j36357f4560B9152j2354R6836d58772B3271a48763J9650
10165a29113k10509A22789c97416J36187F2922m708a3547o6359j53317a4098l8665
10154e2763j70766a07065J6482r3106A36790c95074o4349h6396r6371c855n27868
10143e31723i7488C0187b54912M8110A99004C7300a26891b2465m25229a69550
10132A29845a3288A04182b24768A7145c28347c0721J2633D1980Q490N5388a47941
10120c44588h0366A14633a91348I4543c7487n2169C7179a40343a5078j7021A00500
10108F0457f2131k00533j7387F0005i580k90897A16002D8825O9691d8518A22888
10096h6240d1796p1136d5625k2191H5651b07242D9525d151m2584J3450G0043A4903
$$ plain form
10176 -167796 -57992 -137734 -274091 -64560 29152 16798 113634 -458772 23271 -148763 -129113
10165 -129113 -339622 122789 -397416 -261229 62922 58214 -13547 -79906 -233223 -14098 -52763
10154 -52763 -223529 -107065 -90583 -183689 136790 -395074 -459423 -86396 -182767 -3855 -531723
10143 -531723 -97488 30187 -254912 -206802 199004 37300 -126891 -22465 -447694 -169550
10132 129845 -13288 104182 -224768 17145 -328347 -30721 -18088 41980 50470 105858 -147941
10120 -344588 -80366 114633 -191348 94543 -37487 -89656 37179 -140343 -15078 -32099 100500
10108 60457 -62131 -262664 -280051 60005 -9580 -300477 116002 48825 118516 -48518 122888
10096 -86240 -41796 -112932 -45625 -67816 85651 -207242 49525 -4151 -46735 -33285 70043 14903
10083a80751m2189a3637E4967b21647B6132K84239e0295O396n664C67827e3991
10071f8660b8440j02117A47190c1116A39299L2916D4718b81627C0146a37878j27469
10060b65347f7607j41230l8200P3456o9469i9559j39436a15872j45495A93329
10049c7148j86361F8591c9299G7022i1325L6788C5525a03567k8739l1310C58151
10037b82116N7351A02674K2436Q9844a34008e8526C31300c7892j9000j09177N2907
10026a13162h076j01253K1961j0866k9628q6319n4525C1767Q8725C897f6827A69105
10013d60181a14228A54366a17249C2174a73823A28549a63144j63285J18010A9935
10002a68296K3139a8523l5719j92477J22269q5636j17310a38038J9847e4376k53037
$$ plain form
10083 -180751 -222940 -13637 54967 -221647 26132 310371 -50295 -43899 -49563 367827 -53991
10071 -68660 -28440 -130557 147190 -31116 139299 172215 44718 -281627 30146 -137878 -265347
10060 -265347 -67607 -208837 -247037 -173581 -243050 -99559 -238995 -115872 -261367 193329
10049 -37148 -223509 68591 -39299 77022 -91325 -54537 35525 -103567 -132306 -163616 358151
10037 -282116 -224765 102674 125110 214954 -134008 -58526 331300 -37892 -56892 -166069 -113162
10026 -113162 -8076 -109329 -87368 -98234 -127862 -214181 -268706 31767 120492 3897 -66827 169105
10013 -460181 -114228 154366 -117249 32174 -173823 128549 -163144 -326429 -208419 19935
10002 -168296 -145157 -18523 -54242 -246719 -124450 -210086 -327396 -138038 -118191 -54376 -307413
9991c07413c3268B22732c7762q3793N3740j00430A89679F9733a88803c5231D7169
9979A81342b08338J3773g0165A07821a21878A86731c37229g4321j62382f2565
9968b80365h8868m9245m4013b7091q9733A43258a46223L1455K1687B22071g1758
9956d71661c1484B6869d75653b4766k01599f3291j22809L4762K9206k5290B62612
9944E4471b6061n1007j09430a8303A56578k7014c3382j8831H7797J95470C534
9932a56880A67866k993k3968e93334b24123E299b1220A91830g2893n8169j40932
9921b71994D8252L7221a64072g0451D8634a14198o024r5066G3980c11331O6582
9910b44749A16654E6500c0660k32534R9137n0265C3622g1025M517I3010a43065
$$ plain form
9991 -307413 -33268 222732 -37762 -121555 -67815 -168245 189679 69733 -188803 -35231 47169
9979 181342 -208338 -194565 -70165 107821 -121878 186731 -337229 -74321 -236703 -62565
9968 -280365 -88868 -138113 -182126 -27091 -116824 143258 -146223 -114768 -93081 222071 -71758
9956 -471661 -31484 26869 -475653 -24766 -226365 -63291 -186100 -151338 -122132 -147422 262612
9944 54471 -26061 -77068 -186498 -18303 156578 129564 -33382 -52213 87797 283267 3534
9932 -156880 167866 164873 140905 -593334 -224123 5299 -21220 191830 -72893 -131062 -271994
9921 -271994 48252 85473 -164072 -70451 48634 -114198 -120222 -215288 73980 -311331 -244749
9910 -244749 116654 56500 -30660 -263194 -164057 -214322 33622 -71025 -66508 93010 -143065
9898A52056a10507c0931p6356j07129O7399p2621O3186a6584k14511Q4001f4884
9886a93735f572r0573J5805j7292C69917a06041B01040a79463e9416B1587a47358
9874b52985B29412b94785j1068D6626g4122j38348f1884B15313a85202L1434E1622
9862a19994k633e1423A64390R5840j11561k0812a76292I108e58628a08569k40535
9851c49104a56566k2709C0907g1087k0336A59131f7442B64450b99170o3784J77921
9840a85033B46450g716A93314b67459A08529a66321j25522g8106B73297A20321
9829A28851E6821B5624a3131A69233J35670E3939c75610A2934d62152d360A9014
9817d95235H6872f7498B61935a82529k4274a1362B68511F4287Q727c57255e1902
$$ plain form
9898 152056 -110507 -30931 -107287 -214416 -147017 -219638 -156452 -16584 -231095 -147094 -64884
9886 -193735 -6572 -97145 -81340 -98632 369917 -106041 201040 -179463 -59416 21587 -147358
9874 -252985 229412 -294785 -305853 46626 -74122 -212470 -61884 215313 -185202 -153768 51622
9862 -119994 -122627 -51423 164390 260230 148669 127857 -176292 9108 -558628 -108569 -349104
9851 -349104 -156566 -179275 30907 -71087 -91423 159131 -67442 264450 -299170 -362954 -185033
9840 -185033 246450 -7716 193314 -267459 108529 -166321 -291843 -78106 273297 120321
9829 128851 56821 25624 -13131 169233 304903 53939 -375610 12934 -462152 -4360 19014
9817 -495235 86872 -67498 261935 -182529 -206803 -11362 268511 64287 73014 -357255 -51902
9805e0472k1039B29710L8549G5707h0149q4318M814A51042a42663j21388o672
9794b70723f9669B40604n1596l57a16956i24A07889c44384i2791k35460P5161
9783b53090i6775B11195F0080q165O0090a34304O6152N014j07695j48752g2042
9771e62654b22637B23912c63676C8301b02996A16044c30077b2065B84977c5764
9760a89013H581b50709b3806n9299p7040A35134g6980L5420k20963D8650K0537
9749F9187a43332m6662l5514G213c61402H8797b73240a34890A8996a8026A59662
9737a44227I3386a27115o7938l3845M5520O9050G3539a15331m6863A9642K57987
9726B77629h9839o7725j60479a30003l8167r547o4817c5894l22566E8429a95965
$$ plain form
9805 -50472 -71511 229710 268259 75707 -80149 -164467 -159653 151042 -142663 -264051 -270723
9794 -270723 -69669 240604 189008 188651 -116956 -924 107889 -344384 -92791 -328251 -253090
9783 -253090 -96775 211195 60080 51915 112005 -134304 -68152 -63138 -170833 -319585 -72042
9771 -562654 -222637 223912 -363676 38301 -202996 116044 -330077 -22065 284977 -35764
9760 -189013 8581 -250709 -23806 -83105 -160145 135134 -76980 -41560 -262523 48650 69187
9749 69187 -143332 -189994 -225508 7213 -361402 88797 -273240 -134890 18996 -18026 159662
9737 -144227 93386 -127115 -195053 -228898 -183378 -114328 73539 -115331 -162194 19642 277629
9726 277629 -89839 -157564 -318043 -130003 -168170 -177717 -242534 -35894 -358460 58429 -195965
9714f3648r2820q9083a16258B80896j28671p4799J67072b82670M5421B15939G9301
9702B6114L4676b01670J967n7290o290A74207d8964G4104b14837a04222A8319
9690A36472g230j36379G4302a01693B35980a48060A39867b76178N0221O9807L2566
9679a23584j30833J09950A4604O6926k9716j2334e0363A39058l4191c00739A55588
9667I1435F716i8175l01289a61936A66018a03986P289j98372p695p6627a32214
9655a683A88407P5070a91954j2011J01502k05523M9075a27747d5831D3690K00882
9644B44572d04472h297l55c377r8596k6670A25344c02891b5770l0511j03236k9129
9632a88646o250j1524m1974i911A9098b5014l3937b5192j73593f1509k1121G7525
$$ plain form
9714 -63648 -156468 -245551 -116258 280896 152225 77426 244498 -282670 -237249 215939 79301
9702 26114 60790 -201670 -199703 -256993 -263283 174207 -48964 74104 -214837 -104222 18319
9690 136472 -7230 -143609 74302 -101693 235980 -148060 139867 -276178 -225957 -156150 -123584
9679 -123584 -254417 -144467 14604 81530 51814 39480 -50363 139058 104867 -300739 155588
9667 91435 6716 -98175 -399464 -161936 166018 -103986 -96697 -295069 -302764 -379391 -132214
9655 -1683 188407 263477 -191954 -203965 -102463 -307986 -258911 -127747 -45831 43690 244572
9644 244572 -404472 -8297 -8652 -3377 -101973 -128643 125344 -302891 -25770 -56281 -159517 -188646
9632 -188646 -194896 -206420 -248394 -9911 19098 -25014 -58951 -25192 -198785 -61509 -82630 77525
9619c2253H6654e5817H791c52725A24915a0310j12084j96777c9283k05309D8393
9607A61167g9319l14769a88296A18948f1282k05295C0389R3730E048b38941h0230
9595C20491g8879j34961B54866a01893j32534L5981o1737A59666E3856J5739c95558
9583A93559J5695d8917j72060R7172l429p3405R8249A340d20755h3308g741C59183
9570H3469b14795d459I9485c17227C4329A2739K02261a8664j43359O497B26712
9558C8035a63526j71207J21060A51770O0356J4407F1669a45149B14367b5874j908
9547b7782A86156g098j8868B936b47221J21457N9374A26746l47b71599G6883N2802
9535A29685a05651p1604A41950c11108A66129d07554a48125g632A09J53464K13915
$$ plain form
9619 -32253 86654 -55817 8791 -352725 124915 -10310 -122394 -319171 -39283 -244592 48393
9607 161167 -79319 -394088 -188296 118948 -61282 -266577 30389 124119 5048 -238941 -80230
9595 320491 -78879 -213840 254866 -101893 -234427 -198446 -260183 159666 53856 69595 -395558
9583 193559 209254 -48917 -220977 -123805 -127234 -200639 -102390 1340 -420755 -83308 -7741 359183
9570 83469 -214795 -4459 99485 -317227 34329 12739 215000 -18664 -162023 -155526 226712
9558 38035 -163526 -334733 -213673 151770 212126 226533 61669 -145149 214367 -25874 -27782
9547 -27782 186156 -7098 -25966 2936 -247221 -125764 -66390 126746 126399 -271599 76883 129685
9535 129685 -105651 -177255 141950 -311108 166129 -407554 -148125 -7632 109 153573 367488
9524C67488a78013k2121A95755O9106r2952j0045m5920c6280H2803a05071K6343
9513g8728j21115j61957k4640A05115b67092m7923f9006A26767c08853O4715G586
9501D4314j9815c1511k03135C6174a80294O8095K7637B3369D275J9133J60505
9490A83913a27474r8335A86395a20036E7583i1171K8361l2459o1227F6127a4079
9478g8862j66276c8249j30537F5389a22920M9920l4986k13705H3087c464k11490
9467b14954D4183a49182A54625a99755N6316l1826J1109M5549e9055j55035j9370
9456b33460P2808N8919b2845C2189a28003M9494B76760d24223J81118F079f9596
9444a63333f7031E2308R8026D0234c1445o4325l42971N7523A22494N9178b07217
$$ plain form
9524 367488 -178013 -200134 195755 264861 171909 161864 115944 -36280 82803 -105071 -78728
9513 -78728 -199843 -361800 -386440 105115 -267092 -315015 -69006 126767 -308853 -244138 7586
9501 44314 24499 -31511 -234646 36174 -180294 -112199 -84562 23369 4275 23408 183913
9490 183913 -127474 -225809 186395 -120036 57583 -91171 -62810 -95269 -156496 66127 -14079
9478 -78862 -245138 -38249 -168786 65389 -122920 -73000 -107986 -321691 83087 -3464 -214954
9467 -214954 44183 -149182 154625 -199755 -143439 -175265 -164156 -118607 -59055 -214090 -233460
9456 -233460 -160652 -101733 -22845 32189 -128003 -78509 276760 -424223 -243105 6079 -69596
9444 -163333 -67031 52308 150334 40234 -31445 -95770 -438741 -381218 122494 181672 -207217
9432b35227B85901D0936b0405k58057N2347G3551a27161L3435p5918B70111a33839
9420d43611D5818d2125j27247A19685d8877j21307e3804C678K6789J46766d8230
9408D535K86369a27525H2624L10909a99509k5761l70599a34008f844k45032e197
9396a73308M6601A62465b76790A06127n0310a96107A24594b21502k5363J03102
9386a43763j23624A0447a4736j37930N9051C43446b41676J07005c9078l6357A74605
9374B26028b42943E7133M7959K15317j23578i4233L420L9846l9490A47388G1725
9362a29734g083K087B62738d0291D6421b57340d7867e884A06440a62000L1435
9351a30565a4533A11970a8482D1863a36213c1509B10955a53515d1774a3944j56124
$$ plain form
9432 -235227 285901 40936 -20405 -278462 -226115 73551 -127161 -93726 -169644 270111 -133839
9420 -443611 45818 -42125 -169372 119685 -48877 -170184 -53804 3678 30467 177233 -48230
9408 4535 290904 -127525 82624 393533 -199509 -225270 -595869 -134008 -6844 -251876 -5197
9396 -173308 -126707 162465 -276790 106127 55817 -196107 124594 -221502 -246865 -143763
9386 -143763 -267387 10447 -14736 -152666 -93615 343446 -241676 -134671 -39078 -75435 174605
9374 226028 -242943 57133 105092 320409 196831 -94233 -90813 -50967 -90457 147388 71725
9362 -129734 -7083 -4996 262738 -40291 46421 -257340 -47867 -5884 106440 -162000 -130565
9351 -130565 -14533 111970 -18482 41863 -136213 -31509 210955 -153515 -41774 -13944 -170068
9340a70068A17361b09206F0319a57271l44811e0758r5783q9415h7101G3711K6608
9329A00319b68053j28539h8188B58490A4931h8924k9828D6609c0654j88210h5256
9317b20061b1463j24785m7102N746I0605a16931B0532K52486b8530j67152N7288
9306a38394B51872A0839b21332L9879P3522B344g772C4235a98880m333R3815L7338
9294g2060k344C6685J88d06283B29577B0122J7495a51391d0501j7170B40964b52303
9281a90422O5912A54706a41200B57497i4937j89105E3267M0977a49345e5559A85814
9269b71081O7726a2179F7349L4015b35064e5923j01925l8259F9128b28141h7031
9257H2536l785R4522c0924k58392g8278B97818c27901C7688L5610r253a86001
$$ plain form
9340 -170068 117361 -209206 60319 -157271 -502082 -50758 -146541 -235956 -87101 73711 100319
9329 100319 -268053 -396592 -88188 258490 14931 -88924 -118752 46609 -30654 -218864 -85256
9317 -220061 -21463 -146248 -193350 -187604 90605 -116931 20532 273018 -28530 -195682 -138394
9306 -138394 251872 10839 -221332 -181453 -107931 2344 -7772 34235 -198880 -203213 -109398 -72060
9294 -72060 -74404 36685 36873 -406283 229577 20122 37617 -151391 -40501 -57671 240964 -252303
9281 -190422 -124510 154706 -141200 257497 -94937 -284042 53267 94244 -149345 -55559 185814
9269 -271081 -203355 -12179 67349 101364 -235064 -55923 -157848 -196107 69128 -228141 -87031
9257 82536 78751 173273 -30924 -289316 -78278 297818 -327901 37688 73298 64045 -186001
9245A10654b18329I5739l3947d7133J1164k8763h631B45319i5879j02928I6544
9233A43934b7506k94868A25952i8616K5021A03912j880c39985J29740F1030a92340
9221A10519b52796D2791b61159C09909f2089r2415N6485k83419G690a24065c781
9209A04037a25331O1901A06657b31814G9327i5233H2164a71718j36357k61682
9199e69757g479p6509a5806r3135k83926A69795b03307i8986j71619C7828c11544
9187C37634k1328g4004K5185k96179a01650A80618c66107J12945A56176f1106
9176A19228j0879K09190e4147G9822Q6783m7877B3180Q769L0870K62295a82572
9164a15778E0945d4064B4692J21636B3400P3648O8096k0950C3895g5410j1967
$$ plain form
9245 110654 -218329 95739 61792 -47133 -35969 -64732 -8631 245319 -95879 -198807 96544
9233 143934 -27506 -322374 125952 -98616 -73595 103912 102032 -339985 -210245 61030 -192340
9221 110519 -252796 42791 -261159 309909 -62089 -154504 -98019 -381438 7690 -124065 -3781
9209 104037 -125331 -63430 106657 -231814 79327 -95233 82164 -171718 -308075 -569757
9199 -569757 -7479 -83988 -15806 -108941 -392867 169795 -203307 -98986 -270605 37828 -311544
9187 337634 316306 -74004 -48819 -344998 -101650 180618 -366107 -253162 156176 -61106
9176 119228 108349 317539 -54147 79822 166605 118728 23180 31949 62819 325114 -182572
9164 -115778 50945 -44064 24692 146328 23400 97048 165144 144194 33895 -75410 -87377
9153h7377j26448Q6071j30L8689e317k10698b9634j10908A31K20465N6932d244
9140a40277A79991H4524a57723H1555a82728B58226l4027I9467d20790b5215H2378
9128b39580H1890k7706J05348l0088n9889a26593j53648A19475C39J04474a75938
9116h2011k32992a2062r3116j54761a3241o0738K6960R552B83619q8807h7431
9104C093c55786j32344B6848J94336a28577B08714l2874a32324O4190j03312E3838
9092A7723g7825A62832C8705P8087b35463J00743e9168m64j32497o0994g5191
9080a3425B29528a01228r5428f3306m8067B56627d7108a2091j87715A92796d28856
9068b39790B35477c08876J02646P8812G1479J08580a23969n3012C9876j1579K16690
$$ plain form
9153 -87377 -213825 -127754 -127884 -89195 -5317 -216015 -29634 -140542 131 220596 277528 -4244
9140 -140277 179991 84524 -157723 81555 -182728 258226 224199 99467 -420790 -25215 82378
9128 -239580 81890 54184 159532 129444 69555 -126593 -280241 119475 339 104813 -175938
9116 -82011 -315003 -12062 -105178 -259939 -13241 -73979 -47019 -37467 283619 194812 -87431
9104 3093 -355786 -488130 26848 221184 -128577 208714 175840 -132324 -68134 -171446 53838
9092 17723 -77825 162832 38705 116792 -235463 -134720 -59168 -59632 -192129 -253123 -75191
9080 -13425 229528 -101228 -196656 -63306 -111373 256627 -47108 -12091 -199806 192796 -428856
9068 -239790 235477 -308876 -206230 -127418 71479 180059 -123969 -176981 39876 28297 244987
9057B44987a73530e8714A09606N060a21125C29224A4801J08J01935n6623M241
9046F4462L55716A80198i7725b1005B44524b10415M3995M3929L8517j66476Q0335
9035a70115F9584J48381r9598a23904o3466b8569m284A76140i9484k64571C7044
9023b170m4143n1651A70358c12066E5720k6941a73701d7603a4090l11333K663
9012c22760A74722d31203g2154j73219a8179A19021L1329a11226a1194l29899
9002c41093H1233a17358k1158j02742f0241C04477j30819E9702a21857K7353j3292
8991a07796K1572k27795f2005m7042A5774J52538a11664a6270C51354b49695P2224
8980a77471B7304J36188a51448K4194A085K44981j08481b36919B04222r9674K5344
$$ plain form
9057 244987 -173530 -58714 109606 114666 -121125 329224 14801 14909 116844 60221 64462
9046 64462 420178 180198 -97725 -21005 244524 -210415 -166420 -122491 -83974 -250450 -170115
9035 -170115 69584 217965 118367 -123904 -187370 -28569 -32853 176140 -99484 -364055 37044
9023 -2170 -46313 -97964 170358 -312066 55720 28779 -173701 -47603 -14090 -325423 -322760
9012 -322760 174722 -431203 -72154 -245373 -18179 119021 150350 -111226 -11194 -341093
9002 -341093 81233 -117358 -138516 -241258 -60241 304477 173658 59702 -121857 -94504 -107796
8991 -107796 -86224 -314019 -62005 -109047 15774 168312 -111664 -16270 351354 -249695 -177471
8980 -177471 27304 163492 -151448 -127254 1085 246066 137585 -236919 204222 104548 129892
8969A29892c77666J34184A22878l0720a33488A15973c403F7668b45330J13053
8959a32277k19322a69555m5419A11015d22015a75248O7987B44757a66926j51896
8949c18822f4059r0348P0924j56843D8720J2849K11707b46213A7988f6108k27051
8938b93159R0209h9172C60779e654C80563A54690H720a66010L6437j92994A21006
8926A55619p4949M20219L9495J79407J51896l99025M34105B43384l6702a32100
8915A03811a54228E8982a36692m7880B1953K74818d1554A31815b68433q3737A79954
8903d6964A45751N5134P3027b4099h727n7710A69381a99982A99040c06083G0010
8891D5013K0670a77427J2937O6450B10d7755A29179c96693c7802p2828A60259
$$ plain form
8969 129892 -377666 -243482 122878 92158 -133488 115973 -3403 67668 -245330 -132277
8959 -132277 -351599 -169555 -214974 111015 -422015 -175248 -107261 244757 -166926 -318822
8949 -318822 -64059 -154407 -83483 -240326 48720 61569 273276 -246213 17988 -66108 -293159
8938 -293159 -202950 -89172 360779 -5654 380563 154690 8720 -166010 -129573 -322567 121006
8926 155619 80670 500889 540384 719791 871687 472662 906767 243384 206682 -132100
8915 103811 -154228 58982 -136692 -184572 21953 296771 -41554 131815 -268433 -352170 179954
8903 -46964 145751 200885 273912 -24099 -8727 -66437 169381 -199982 199040 -306083 70010
8891 45013 65683 -177427 -164490 -98040 210 -47755 129179 -396693 -37802 -110630 160259
8879B44738n5157I4318a38118e4695A38608d2868j93427A12821K4698Q9452d30516
8867F309J55263J01658A14564a14478A24671a47130o8855a8405N769q7280d5013
8855d8088N53k19996M636g0302l8594j43112E0048J08247l6249d4155a2478E2739
8842a0839m45445a07732R054L1240I6390a28324D7333a35929p5335A97807c31188
$$ plain form
8879 244738 189581 94318 -138118 -54695 138608 -42868 -236295 112821 137519 226971 -430516
8867 6309 161572 263230 114564 -114478 124671 -147130 -215985 -18405 -12636 -99916 -45013
8855 -48088 -47535 -267531 -262895 -70302 -108896 -252008 50048 158295 122046 -44155 -12478 52739
8842 -10839 -456284 -107732 -98678 -67438 96390 -128324 47333 -135929 -211264 197807 -331188
$$ [...]
##END NTUPLES=NMR SPECTRUM
##END=
