##TITLE=AC1454_BRAAS13253_7818987_Mzxv30Hp8H
##JCAMPDX= 6.0         $$ Bruker NMR JCAMP-DX V2.0
##DATA TYPE= NMR SPECTRUM
##DATA CLASS= NTUPLES
##ORIGIN= BRUKER
##OWNER= Administrator
$$ 1.72 TOPSPIN		Version 2.1
$$ 2013-04-30 18:41:36.420 -0700  Administrator@X
$$ Compression mode = diff/dup
##.OBSERVE FREQUENCY= 400.02188249412
##.OBSERVE NUCLEUS= ^1H
##.ACQUISITION MODE= SIMULTANEOUS (DQD)
##.ACQUISITION SCHEME= undefined
##.AVERAGES= 8
##.DIGITISER RES= 22
##SPECTROMETER/DATA SYSTEM= spect
##.PULSE SEQUENCE= zg30
##.SOLVENT NAME= COFFEE_meoh
##.SHIFT REFERENCE= INTERNAL, COFFEE_meoh, 1, 14.98509
##AUDIT TRAIL= $$ (NUMBER, WHEN, WHO, WHERE, PROCESS, VERSION, WHAT)
$$ ##TITLE= Audit trail, TOPSPIN		Version 2.1
$$ ##JCAMPDX= 5.01
$$ ##ORIGIN= Bruker BioSpin GmbH
$$ ##OWNER= Administrator
$$ $$ E:\/data/COFFEE/nmr/AC1454_BRAAS13253_7818987_Mzxv30Hp8H/10/pdata/1/auditp.txt
$$ ##AUDIT TRAIL=  $$ (NUMBER, WHEN, WHO, WHERE, PROCESS, VERSION, WHAT)
(   1,<2013-04-30 18:41:29.779 -0700>,<Administrator>,<X>,<go>,<TOPSPIN 2.1>,
      <created by zg
	started at 2013-04-30 18:40:24.123 -0700,
	POWCHK enabled, PULCHK disabled,
       configuration hash MD5:
       F7 49 AB AC A2 8D 51 76 73 8D C1 9A A6 38 9F DE
       data hash MD5: 64K
       07 FF AF E8 DE AF D1 55 AE C9 64 26 A1 5B 6C 96>)
(   2,<2013-04-30 18:41:32.701 -0700>,<Administrator>,<X>,<proc1d>,<TOPSPIN 2.1>,
      <Start of raw data processing
       efp LB = 0 FT_mod = 6 PKNL = 1 PHC0 = 0 PHC1 = 0 SI = 32K 
       data hash MD5: 32K
       EA 8B AE AA C0 C7 33 AC 71 04 08 34 7F 9B F9 8E>)
(   3,<2013-04-30 18:41:33.013 -0700>,<Administrator>,<X>,<proc1d>,<TOPSPIN 2.1>,
      <pk PHC0 = 99.70093 PHC1 = 0 
       data hash MD5: 32K
       4C 56 47 9A 05 ED 7B FD 81 02 02 91 7C C6 FE 4F>)
(   4,<2013-04-30 18:41:33.123 -0700>,<Administrator>,<X>,<proc1d>,<TOPSPIN 2.1>,
      <abs ABSG = 1 
       data hash MD5: 32K
       58 C2 09 36 FC B4 35 4C 41 C3 C4 90 F2 01 E0 95>)
(   5,<2013-04-30 18:41:33.201 -0700>,<Administrator>,<X>,<proc1d>,<TOPSPIN 2.1>,
      <abs ABSG = 2 
       data hash MD5: 32K
       5B D5 46 E3 D9 0E 19 15 CE B7 50 89 6B 61 50 DF>)
(   6,<2013-04-30 18:41:33.248 -0700>,<Administrator>,<X>,<proc1d>,<TOPSPIN 2.1>,
      <abs ABSG = 3 
       data hash MD5: 32K
       C7 95 35 5C E1 46 56 9F 91 EE 26 8F 5F 4B B5 0B>)
(   7,<2013-04-30 18:41:33.310 -0700>,<Administrator>,<X>,<proc1d>,<TOPSPIN 2.1>,
      <abs ABSG = 4 
       data hash MD5: 32K
       66 5C DA 6B 06 BE BB 96 B5 1E A7 20 74 AC 4A E1>)
(   8,<2013-04-30 18:41:33.373 -0700>,<Administrator>,<X>,<proc1d>,<TOPSPIN 2.1>,
      <abs ABSG = 5 
       data hash MD5: 32K
       5C 6A 8E E9 E5 2A B1 DB B6 A7 8F 6E 53 C9 DD BD>)
$$ ##END=
$$ 
$$ $$ hash MD5
$$ $$ 25 22 5E C1 6D 49 39 99 0C B2 0F FA B5 B1 4A 64
##$RELAX= 
##$RELAX= 
##$RELAX= 
##$RELAX= 
##$RELAX= 
##$RELAX= 
##$RELAX= 
$$ Bruker specific parameters
$$ --------------------------
##$DU= <E:\>
##$EXPNO= 10
##$NAME= <AC1454_BRAAS13253_7818987_Mzxv30Hp8H>
$$ [...]
150 150 150 150 150 150 150 150
##$TP07= 0
##$TPNAME0= <>
##$TPNAME1= <>
##$TPNAME2= <>
##$TPNAME3= <>
##$TPNAME4= <>
##$TPNAME5= <>
##$TPNAME6= <>
##$TPNAME7= <>
##$TPOAL= (0..7)
0.5 0.5 0.5 0.5 0.5 0.5 0.5 0.5
##$TPOFFS= (0..7)
0 0 0 0 0 0 0 0
##$TUNHIN= 0
##$TUNHOUT= 0
##$TUNXOUT= 0
##$USERA1= <user>
##$USERA2= <user>
##$USERA3= <user>
##$USERA4= <user>
##$USERA5= <user>
##$V9= 5
##$VALIST= <valist>
##$VCLIST= <CCCCCCCCCCCCCCC>
##$VD= 0
##$VDLIST= <DDDDDDDDDDDDDDD>
##$VPLIST= <PPPPPPPPPPPPPPP>
##$VTLIST= <TTTTTTTTTTTTTTT>
##$WBST= 1024
##$WBSW= 4
##$XGAIN= (0..3)
0 0 0 0
##$XL= 0
##$YL= 0
##$YMAX_a= 600054
##$YMIN_a= -511795
##$ZGOPTNS= <>
##$ZL1= 120
##$ZL2= 120
##$ZL3= 120
##$ZL4= 120
##$ABSF1= 14.98509
##$ABSF2= -5.573092
##$ABSG= 5
##$ABSL= 3
##$ALPHA= 0
##$AQORDER= 0
##$ASSFAC= 0
##$ASSFACI= 0
##$ASSFACX= 0
##$ASSWID= 0
##$AUNMP= <proc_prof1d_extract_pilot.lims>
##$AXLEFT= 0
##$AXNAME= <>
##$AXNUC= <1H>
##$AXRIGHT= 0
##$AXTYPE= 0
##$AXUNIT= <>
##$AZFE= 0.1
##$AZFW= 0.1
##$BCFW= 0
##$BC_mod= 0
##$BYTORDP= 0
##$COROFFS= 0
##$CY= 15
##$DATMOD= 1
##$DC= 0
##$DFILT= <>
##$DTYPP= 0
##$F1P= 0
##$F2P= 0
##$FCOR= 0.5
##$FTSIZE= 32768
##$FT_mod= 6
##$GAMMA= 0
##$GB= 0
##$INTBC= 1
##$INTSCL= 1
##$ISEN= 128
##$LB= 0
##$LEV0= 0
##$LPBIN= 0
##$MAXI= 10000
##$MC2= 0
##$MEAN= 0
##$ME_mod= 0
##$MI= 0
##$NCOEF= 0
##$NC_proc= -8
##$NLEV= 6
##$NOISF1= 0
##$NOISF2= 0
##$NSP= 0
##$NTH_PI= 0
##$NZP= 0
##$OFFSET= 14.98509
##$PC= 1
##$PHC0= 99.70093
##$PHC1= 0
##$PH_mod= 1
##$PKNL= yes
##$PPARMOD= 0
##$PPDIAG= 0
##$PPIPTYP= 0
##$PPMPNUM= 2147483647
##$PPRESOL= 1
##$PSCAL= 4
##$PSIGN= 0
##$PYNMP= <proc.py>
##$REVERSE= no
##$SF= 400.02
##$SI= 32768
##$SIGF1= 0
##$SIGF2= 0
##$SINO= 400
##$SIOLD= 32768
##$SPECTYP= <>
##$SREGLST= <1H.CDCl3>
##$SSB= 0
##$STSI= 32768
##$STSR= 0
##$SW_p= 8223.68421052631
##$SYMM= 0
##$S_DEV= 0
##$TDeff= 65536
##$TDoff= 0
##$TI= <>
##$TILT= no
##$TM1= 0
##$TM2= 0
##$TOPLEV= 0
##$USERP1= <user>
##$USERP2= <user>
##$USERP3= <user>
##$USERP4= <user>
##$USERP5= <user>
##$WDW= 1
##$XDIM= 32768
##$YMAX_p= 451405829
##$YMIN_p= -752559
##$CURPLOT= <Network HP LaserJet P1505>
##$CURPRIN= <$Network HP LaserJet P1505>
##$DFORMAT= <normdp>
##$LAYOUT= <+/1D_H.xwp>
##$LFORMAT= <normlp>
##$PFORMAT= <normpl>
##$SURQMSG= 1
$$ End of Bruker specific parameters
$$ ---------------------------------
##NTUPLES= NMR SPECTRUM
##VAR_NAME=  FREQUENCY,     SPECTRUM/REAL,   SPECTRUM/IMAG
##SYMBOL=    X,             R,               I
##VAR_TYPE=  INDEPENDENT,   DEPENDENT,       DEPENDENT
##VAR_FORM=  AFFN,          ASDF,            ASDF
##VAR_DIM=   32768,         32768,           32768
##UNITS=     HZ,            ARBITRARY UNITS, ARBITRARY UNITS
##FACTOR=    0.250966925370066, 1,           1
##FIRST=     8223.43324360094, -20401,       -146252
##LAST=      0,             17405,           -236641
##MIN=       0,             -752559,         0
##MAX=       8223.43324360094, 451405829,    0
$$ Real data points
##PAGE= N=1
##DATA TABLE= (X++(R..R)), XYDATA
$$ [...]
19572B10382I7120c53201A51826b76878B29091C2691a06283D2267J02442d7183
19561a49185j0920L1666A08388J1548g3116C85612b50886G8828g6244B52110I2380
19549b7115A40818e8472a2023o445j05216A04987N5936g7486A36834a80496O7046
19538a13450j12092G141a30979E9567a46253e9544E4661b32495c1409A04170d61374
19526A05356b02435B57367a50779l3218j05825A35433b34410j56146J27463B40105
19515F1708a83322h0432G9703i3833M517b4291j82202f6963k06385d6721D2038
19503g5693k13801P8916h4113j57926A25709D4758J11141L45206b69786C33005
19492a63187r4333B43008e3012a2005o0815J2876A18173M1034a44694B1706c1750
$$ plain form
19572 210382 97120 -353201 151826 -276878 229091 32691 -106283 42267 144709 -47183
19561 -149185 -160105 -128439 108388 119936 -73116 385612 -250886 78828 -76244 252110 92380
19549 -27115 140818 -58472 -12023 -18468 -123684 104987 160923 -77486 136834 -180496 -113450
19538 -113450 -225542 7141 -130979 59567 -146253 -59544 54661 -232495 -31409 104170 -461374
19526 105356 -202435 257367 -150779 -183997 -289822 135433 -234410 -390556 -263093 240105
19515 61708 -183322 -80432 79703 -93833 -89316 -24291 -206493 -66963 -273348 -46721 42038
19503 -75693 -289494 -210578 -84113 -242039 125709 44758 155899 501105 -269786 333005
19492 -163187 -257520 243008 -53012 -12005 -72820 -59944 118173 159207 -144694 21706 -31750
19480c0174H2256J46488G319a62844r7838g5955J6562m9277j80306J42023E1893
19468c45333P0901J19096f1570j70578C6814D201a18542J1150F53M69305c57019
19456G7283k3727f5097j05910F1013g7939d804D332L1999M5883c8749j63527P5892
19444a26384b9295B04701D3780Q2061L0262F0605k6941d1888j01125e2985B96406
19432H070c26449d0115C210P1447J19568F3764M3794c44780J26961A12883C3544
19420h0035C45964i4572A17554a49863A82715c48405a2488A4549a44470c9670
19409d40069a02267A39329n9911C3924b27311I8759L4878b06876A0967P079f3087
19397b58108a963C59738d763I211h6459j09425j35299r9674J71109C27620j38770
$$ plain form
19480 -30174 82256 228744 7319 -162844 -260682 -75955 -59393 -108670 -288976 -146953 51893
19468 -345333 -274432 -155336 -61570 -232148 36814 4201 -118542 -107392 653 469958 -357019
19456 77283 53556 -65097 -171007 61013 -77939 -4804 4332 36331 82214 -38749 -202276 -126384
19444 -126384 -29295 204701 43780 125841 156103 60605 33664 -41888 -143013 -52985 296406
19432 8070 -326449 -40115 3210 74657 194225 63764 107558 -344780 -217819 112883 33544
19420 -80035 345964 -94572 117554 -149863 182715 -348405 -12488 14549 -144470 -39670
19409 -440069 -102267 139329 79418 33924 -227311 98759 133637 -206876 10967 18046 -63087
19397 -258108 -1963 359738 -4763 9211 -86459 -195884 -331183 -430857 -259748 327620 188850
19386A88850F0612a04717E7709M9665m7421d66987c9045k06844C29307a20041
19375f4827j40743M548H7621K25340c15143o388o9197a6316q6107M8758A02902
19363d4703A2766b08147A0257g0238n6971k15584J00516A17767b51449A27504
19352A9254b69959a27414B56222r4923f5942j15348K7577I0979O8188b48401A65991
19340c4402j84118J01403G1375a84226g3753A6176M9187J64635E7008K9505a79576
19328D3559A4947b3492C6113J42977h5370C46212C7851Q0296b30838A9872b33889
19316I0535g9964j54183b9650o2541B00905a7802k68818H9286j195a5666j24184
19305a39850p9474A23901a39689D07791b68014o8214F4600M5840a31k2938k92509
$$ plain form
19386 188850 60612 -104717 57709 107374 59953 -466987 -39045 -245889 329307 -120041
19375 -64827 -205570 -201022 87621 312961 -315143 -321531 -390728 -16316 -102423 -53665 102902
19363 -44703 12766 -208147 10257 -70238 -127209 -342793 -242277 117767 -251449 127504
19352 19254 -269959 -127414 256222 161299 -65942 -181290 -153713 90979 159167 -248401 165991
19340 -34402 -218520 -117117 71375 -184226 -73753 16176 65363 229998 57008 86513 -179576
19328 43559 14947 -23492 36113 179090 -85370 346212 37851 118147 -230838 19872 -233889
19316 90535 -79964 -234147 -29650 -92191 200905 -17802 -286620 89286 88091 -15666 -139850
19305 -139850 -219324 123901 -139689 407791 -268014 -336228 64600 110440 -131 -23069 -315578
19294c15578H2028J48132K6983D1441b92192J32289l013e4707K1466G162N4109
19283F1271J0215a09522F6818f6253m0902q7742l023h1998j08307A88294a63948
19271c634p3276k03913B8588b3800F8010J7424a92177B66066q1102c8565j87236
19260b25801B44940c6334l20664a1084o2494B2547j0160P7475a72274O6666j04383
19249b09991D2365K17881A3768a38338e8775j13757E02992b71389A19853b60807
19238A36086a17025d5906B68813H7667a78842A85164b42123A05501j7007L7542
19228A26036d9204l32306a59445F272k768a30064j22561O5190a1153I9068C6564
19216c6023j19643b9687l6061j67784J00355k23130A01295k4431b11494o9666
$$ plain form
19294 -315578 82028 230160 257143 41441 -292192 -159903 -162916 -54707 -33241 7162 61271
19283 61271 71486 -109522 66818 -66253 -107155 -194897 -197920 -81998 -190305 188294 -163948
19271 -3634 -76910 -280823 28588 -23800 68010 85434 -192177 266066 184964 -38565 -225801
19260 -225801 244940 -36334 -356998 -11084 -73578 22547 12387 89862 -172274 -105608 -209991
19249 -209991 42365 260246 13768 -138338 -58775 -172532 502992 -271389 119853 -260807
19238 136086 -117025 -45906 268813 87667 -178842 185164 -242123 105501 88494 126036
19228 126036 -49204 -381510 -159445 6272 3504 -130064 -252625 -187435 -11153 99068 36564
19216 -36023 -155666 -29687 -65748 -233532 -133177 -356307 101295 76864 -211494 -281160
19206b81160J14646B1204b29175c3108A0440P8475b01864a5615l8254K3157j01151
19195a31863A10363a87678D2325a51633G6485O3950F6672K32653A7775d8317o9303
19184a17620B23812e9796P716o5279k7782A78245d34283b7915k85741I6414d7175
19172b9320o7165A12507a06005E3283h9531A30680a90224j409j75808a39720f8774
19160A17022a09832A77960G9236c82157a21670k30368H4714K90843h2048H2085
19149e8317K0397N397C18279e5827j62639A1286d72242a7435P608k26000a9232
19137d00619i6399I6406C2674K59040a55044B93731j04752f7650c904B71446d6669
19125b09946B6680j582d03194a4399A4378a05842G4757l0372l281h0189j9855
$$ plain form
19206 -281160 -166514 21204 -229175 -33108 10440 88915 -201864 -15615 -53869 -30712 -131863
19195 -131863 110363 -187678 42325 -151633 76485 140435 66672 299325 17775 -48317 -117620
19184 -117620 223812 -59796 -52080 -117359 -145141 178245 -434283 -27915 -313656 96414 -47175
19172 -29320 -96485 112507 -106005 53283 -89531 130680 -190224 -191633 -367441 -139720 -68774
19160 117022 -109832 177960 79236 -382157 -121670 -352038 84714 375557 -82048 82085
19149 -58317 -37920 -32523 318279 -55827 -218466 11286 -472242 -17435 -9827 -235827 -19232
19137 -400619 -96399 96406 32674 291714 -155044 293731 188979 -67650 -3904 271446 -46669
19125 -209946 26680 25098 -403194 -14399 14378 -105842 74757 44385 41104 -80189 -100044
19114a00044r9087B16229f5954j67732P6330k35025J18989N0877f2533F9531L6096
19103A05627J66520J47787c33806C2766d95814b20145P3598l0612B86448a49244
19092A08654a86547M4672o5892f1173A27313b69499e205o5615H4644C4475f4861
19080a74535e139A11387b29094A33238a6293j3807p3569K1959B03838b46372m6609
19069b92981a24253I4697b18728J3154h1545c9403q1594k4863k52478A64551J89475
19058C54026b1182B51059g9789H3996b4423o577k43795p164b662B38003h2119
19046c49587a33449N2949j25064R44R7784j98543a00397b7860C9205j1486L31971
19035C59690A19999a83929A69013Q3005c6410j189I0063a77515D79367k02399
$$ plain form
19114 -100044 -199131 216229 -65954 -233686 -157356 -392381 -273392 -222515 -62533 69531 105627
19103 105627 272147 419934 -333806 32766 -495814 -220145 -146547 -177159 286448 -149244
19092 108654 -186547 -141875 -207767 -61173 127313 -269499 -5205 -70820 84644 34475 -64861
19080 -174535 -5139 111387 -229094 133238 -16293 -30100 -103669 -81710 203838 -246372 -292981
19069 -292981 -124253 94697 -218728 -205574 -81545 -39403 -120997 -145860 -398338 164551 354026
19058 354026 -21182 251059 -79789 83996 -24423 -31000 -274795 -281959 -2662 238003 -82119
19046 -349587 -133449 -80500 -205564 -204620 -106836 -305379 -100397 -27860 39205 27719 359690
19035 359690 119999 -183929 169013 252018 -36410 -37599 90063 -177515 479367 276968
19025B76968b76759g9458B36765a60894M0562c3279m1941j02839A14326c27458
19014a47034A70772c22565a07949B16758l2719d2235l79999A02263b10600H0953
19003A96753b76707A86166K11776i3579o2430j43562C473M1537d302E6042f8993
18991A14111B4836a37727O8010j79344j08382d8944C8705A6963a42099c4634k3798
18980e8432o9528A12905d5385o8230l9028C6024K34645b37591J6017j48737b2029
18968A80300a17290g206B40945N4149D9331J03116b49529J23864B62002p6478
18958A85524P6500a1607n89256A03455J01375d6226j23888C1564c88718J90196
18948a98522L9770n6379q3124J43717k32386C42773G5441h2164l0397B0316J26227
$$ plain form
19025 276968 -276759 -79458 236765 -160894 -120332 -33279 -75220 -178059 114326 -327458
19014 -147034 170772 -322565 -107949 216758 184039 -42235 -422234 102263 -210600 80953
19003 196753 -276707 186166 397942 -93579 -156009 -299571 3473 45010 -4302 56042 -68993
18991 114111 24836 -137727 -69717 -249061 -357443 -48944 38705 16963 -142099 -34634 -58432
18980 -58432 -127960 112905 -45385 -113615 -152643 36024 270669 -237591 -221574 -370311 -22029
18968 180300 -117290 -7206 240945 295094 49331 152447 -249529 -125665 262002 185524
18958 185524 262024 -11607 -600863 103455 204830 -46226 -170114 31564 -388718 -198522
18948 -198522 -158752 -215131 -298255 -154538 -386924 342773 75441 -82164 -112561 20316 146543
18937A46543c04208a51360C3160d0499F8353b16289p9371O3727B65315b62853
18926g7543j62100A48314b82998O7185A96816f8204j89733n8287b0434j2944m91198
18915e24576A2318O2774d0757C65479a17880K9134k6830E899b5742k19082m2351
18904b87175D5390M9047j948c0419B9277a97017h1909j04593h1911j70437A90075
18892b9480a4459r4254j57758A34367f649j44900A7523J45191a46663d4173k22892
18881b67065P0549C5967b32675A9353a89042a1514r4118B01292c49429k2806h3440
18869A8002N8810a79413j7940R7240A03885d24533A28091a00408A61936f3054
18858d40608K18001b6490B13776J0411I882a34285C67457G4870b17647R8950c1396
$$ plain form
18937 146543 -304208 -151360 33160 -40499 68353 -216289 -295660 -231933 265315 -262853
18926 -77543 -239643 148314 -282998 -215813 196816 -68204 -257937 -316224 -20434 -33378 -524576
18915 -524576 12318 75092 -40757 365479 -117880 -88746 -115576 5899 -25742 -244824 -287175
18904 -287175 45390 94437 92489 -30419 29277 -197017 -81909 -186502 -81911 -252348 190075
18892 -29480 -14459 -108713 -266471 134367 -6649 -151549 17523 162714 -146663 -44173 -267065
18881 -267065 -196516 35967 -232675 19353 -189042 -11514 -105632 201292 -349429 -372235 -83440
18869 18002 76812 -179413 -197353 -100113 103885 -424533 128091 -100408 161936 -63054
18858 -440608 -222607 -26490 213776 224187 9882 -134285 367457 74870 -217647 -118697 -31396
18846a35337O0906E285K3619a07271d274B16425d6822k10479B07158B1589c4041
18834g0620p5762b1147q7774E9537a62612m78B55063J48212c4452G086A748N5259
18822E7007J42043a50693b4535A5325N3655a1344A32955f4161I2754h7401B61607
18810C0816K13888c5103A40875J55986J01324k2122a39368A88555a03231j2923
18800a16154j09405k0711f4399F3477J53619A9169E446d3002E8459a87384d1103
18788A10869a43829n98E203a14494A84897c18570a4702C3750Q8137f3217k7980
18777i1197E6675K258a92675j99452a2585I725a23937m32511b68587J28983A79064
18765c3616j40163e2616j02720B59037a27656m4660G5483l4434b84242c2644j12524
$$ plain form
18846 -135337 -74431 5285 28904 -107271 -4274 216425 -46822 -257301 207158 21589 -34041
18834 -70620 -146382 -21147 -108921 59537 -162612 -163090 255063 403275 -34452 7086 1748 57007
18822 57007 199050 -150693 -24535 15325 68980 -11344 132955 -64161 92754 -87401 261607
18810 30816 244704 -35103 140875 296861 398185 376063 -139368 188555 -103231 -116154
18800 -116154 -225559 -246270 -64399 63477 217096 19169 5446 -43002 58459 -187384 -41103
18788 110869 -143829 -144427 5203 -114494 184897 -318570 -14702 33750 121887 -63217 -91197
18777 -91197 56675 58933 -192675 -392127 -12585 9725 -123937 -556448 -268587 -139604 179064
18765 -33616 -173779 -52616 -155336 259037 -127656 -172316 75483 41049 -284242 -32644 -145168
18754a45168A15036n0551a2028o9650A34422J15325g8036B60003e8068k85006
18744c43074A91911a39106A7774a73849j9362j22861B13146e6513m6424a580A9938
18732e427C98254b83319R0057A05115P0994c66369f5992C8784d6527D8161b0558
18720B66068j15859a03180c4626k03248i3926f613C00711a43137L5064j68635
18710b76708A93699d19872J35759G4700a09491k33230E665M11846d4313G2947
18699g7011K7965m2506A4701a49975A20750d4457j09428j19535H3662a23395b2296
18687i8985I2188q435e0065b36B6075o727c0759n2959j21787M8087e9298C30628
18674C0925g855B7019g3679r2398a2309p3113p3974J1365D0635J31590a13623
$$ plain form
18754 -145168 115036 64485 -12028 -81678 134422 249747 -78036 260003 -58068 -343074
18744 -343074 191911 -139106 17774 -173849 -193211 -316072 213146 -56513 -102937 -1580 19938
18732 -5427 398254 -283319 -193262 105115 176109 -366369 -65992 38784 -46527 48161 -20558
18720 266068 150209 -103180 -34626 -237874 -93926 -6613 300711 -143137 -108073 -276708
18710 -276708 193699 -419872 -284113 74700 -109491 -342721 5665 417511 -44313 72947
18699 -77011 -49046 -91552 14701 -149975 120750 -44457 -153885 -273420 83662 -123395 -22296
18687 -98985 92188 83753 -50065 -236 26075 19348 -30759 -83718 -205505 -157418 -59298 330628
18674 30925 -7855 27019 -73679 -166077 -12309 -85422 -159396 -148031 40635 172225 -113623
18662c01920f0526l4592r3239B22635b09597A67523c49171a08274A45941h0382
18651c52608D585L6984b70051f4904k60388G0418b30907f4027j21751A19265b60
18639A40772d06757J71045a09322j87862c5014j04648O7157j7120J3089m0119
18629a16655q0342N5708o9664B4508a62109n4897h4781l26139J62221j9290I8542
18617g510j24231j036C6367a55020A22610B6493c7812C2233h535j16518A18557
18605G5759a17554A39287C3463d73114B14627q4464c57260J56336B90369A28367
18594A18168b62526d8295D4061M3432a03764b2848k21361A79581c71667A35635
18583c4594n10505a67424g3021B43398d0895H0129R0453c82323b2460A47546C3151
$$ plain form
18662 -301920 -60526 -95118 -188357 222635 -209597 167523 -349171 -108274 145941 -80382
18651 -352608 4585 41569 -270051 -64904 -325292 70418 -230907 -64027 -185778 119265 -260
18639 140772 -406757 -235712 -109322 -297184 -35014 -139662 -72505 -89625 -76536 -116655
18629 -116655 -196997 -141289 -210953 24508 -162109 -217006 -84781 -410920 -248699 -267989 98542
18617 -7510 -131741 -132777 36367 -155020 122610 26493 -37812 32233 -8535 -125053 118557
18605 75759 -117554 139287 33463 -473114 214627 130163 -357260 -200924 290369 128367
18594 118168 -262526 -48295 44061 87493 -103764 -22848 -244209 179581 -371667 135635
18583 -34594 -545099 -167424 -73021 243398 -40895 80129 170582 -382323 -22460 147546 33151
18571I6662B628a09265j49492C71579D3492b41446P6616k07305a1573G2529K93306
18560C65835A48257J1605g4214A33483b82282H0917b27343A67665c34805i4907
18549a31761A9610J2482J27002b80694J35011a9854m52913a22905N1168k33703
18539c05440a26636J6278A61427g3020r5005j21896C431K86622m3356H2935c53969
18527A30489c3995H0049J2692J05600J35351a52582m2998i5208m0410j16784i9017
18515G6698c12678R7031c7268n9823A06454d3557j29756c834j06939A15089O777
18504A21866i6388m0729B9076b72839e3641n3276l5706A6654O3667b25045A5944
18492I1025f5108b4203A53664d3224A48874i7516q34o3464A50833a2367E4124
$$ plain form
18571 96662 2628 -109265 -258757 371579 43492 -241446 -164830 -372135 -11573 72529 365835
18560 365835 148257 159862 -74214 133483 -282282 80917 -227343 167665 -334805 -94907
18549 -131761 19610 32092 159094 -280694 -145683 -19854 -472767 -122905 -71737 -305440
18539 -305440 -126636 -110358 161427 -73020 -168025 -289921 3431 290053 246697 82935 -353969
18527 130489 -33995 80049 92741 198341 333692 -152582 -195580 -95208 -135618 -252402 -99017
18515 76698 -312678 -215647 -37268 -97091 106454 -43557 -173313 -3834 -110773 115089 121866
18504 121866 -96388 -137117 29076 -272839 -53641 -106917 -142623 16654 80321 -225045 15944
18492 91025 -65108 -24203 153664 -43224 148874 -97516 -98350 -161814 150833 -12367 54124
18480a13600G5785b2289G8104a81720K2621J7046A9378L2081J77442I8669g1644
18468c14703O0555a8702o004j9294A01259b20308J0218f2392r0610e9762A71593
18456H3929c3583d546k01380D24632A20346J47925j09066c41700L2246g0636j40845
18445b11481A14530D4712R9148K06696a57089K9806j44405d1091j59382B9287
18434g6430j4247A7065b45575A78212f8280B31545c16377A00132b32400Q0620
18424a51780c8946A0824a46467C2374O5417C5913i0525j80947J01582D08726A23703
18412b4777A77730c46306F5642b53168C0201g2416D089g3081j67067d6392a2557
18400a88876g577n8779E3841J15290E405a79018E9023b41805a03705q4236D2451
$$ plain form
18480 -113600 75785 -22289 78104 -181720 -159099 -142053 19378 51459 228901 98669 -71644
18468 -314703 -254148 -18702 -24706 -44000 101259 -220308 -210090 -62392 -153002 -59762 171593
18456 83929 -33583 -4546 -205926 424632 120346 268271 159205 -341700 -309454 -70636 -211481
18445 -211481 114530 44712 143860 350556 -157089 -127283 -271688 -41091 -200473 29287
18434 -76430 -90677 17065 -245575 178212 -68280 231545 -316377 100132 -232400 -151780
18424 -151780 -38946 10824 -146467 32374 97791 35913 -90525 -271472 -169890 408726 123703
18412 -24777 177730 -346306 65642 -253168 30201 -72416 4089 -73081 -240148 -46392 -12557
18400 -188876 -7577 -66356 53841 169131 5405 -179018 59023 -241805 -103705 -187941 42451
18388c05117E0003Q6838a86339j8644A082a74352B605e4210e781A86526C9742
18376H863J49939c79231c0825k9634A10583a52354K6435A83026I0560J02265h6639
18364b1181C2836h0949H8870P4709h8402j4666G5489i6445M812A55104b09843
18352b48418C47347G0832a06354k85853P0742J7776A73115c99379i8084k36041
18342c34125a25826M9686B01946H7190A130b96568A88389o2884a45986r8935F4585
18330F8157a81441i0213J3549A67219a53849K2687j83332Q6076Q2067M5138d4393
18318b5433m14174J90285H2472k9948c50597G098a66671b9471A25186a5460A34780
18306b44722J21870p7782A01652e0894m25435H0495J71079a52723K3854E3302
$$ plain form
18388 -305117 50003 136841 -186339 -204983 1082 -174352 2605 -54210 -5781 186526 39742
18376 8863 158802 -379231 -30825 -60459 110583 -152354 -125919 183026 90560 192825 -86639
18364 -21181 32836 -80949 88870 163579 -88402 -103068 75489 -96445 -91633 155104 -209843
18352 -248418 347347 70832 -106354 -392207 -321465 -303689 173115 -399379 -98084 -334125
18342 -334125 -125826 -76140 201946 87190 1130 -296568 188389 125505 -145986 -244921 64585
18330 68157 -181441 -90213 -76664 167219 -153849 -131162 -314494 -228418 -146351 -101213 -44393
18318 -25433 -439607 -249322 82472 52524 -350597 7098 -166671 -29471 125186 -15460 134780
18306 -244722 -122852 -200634 101652 -50894 -476329 80495 251574 -152723 -128869 53302
18295a53371e9565r250j3019I5508a30672K5132A8122b61259J24014r4303k37029
18284d68577J88847p6655D2961e4590p4458N1978A03051D11J3282P5835c734B40136
18271d9980A34465b41188p4534a07775C2100J19838h4949C3462Q1290J43677b0609
18259a28481A97079J71391a34810A15095B5788h3461r8095A72984K1034r6583
18249I7435F620b24469j52095j82905H3916d5392k0007j19899d7351b0764p9524
18238a00288o7324M7186A30774a54907B61740a90294p7848P8017H9377J07593
18228A96970i273j5041F6020L0326a772r5162D4597R9235d8286j49346C68194
18216a64848k27597a76765F5896o996g1422F5771b23609p1132f9855C9182d5960
$$ plain form
18295 -153371 -59565 -68815 -81834 95508 -130672 -105540 18122 -261259 -137245 -231548 -468577
18284 -468577 -279730 -356385 42961 -54590 -129048 -77070 103051 411 13693 89528 -3734 240136
18271 -49980 134465 -241188 -315722 -107775 32100 151938 -84949 33462 114752 258429 -20609
18259 -128481 197079 368470 -134810 115095 25788 -83461 -181556 172984 194018 97435
18249 97435 6620 -224469 -376564 -559469 83916 -45392 -65399 -185298 -47351 -20764 -100288
18238 -100288 -167612 -120426 130774 -154907 261740 -190294 -268142 -190125 89377 196970
18228 196970 -9273 -24314 66020 96346 -1772 -96934 44597 143832 -48286 -197632 368194
18216 -164848 -392445 -176765 65896 58900 -71422 65771 -223609 -294741 -69855 39182 -45960
18204D64305a29085L8932B27227i396D011h5080D9892a07584j42094g6294m7712
18193a24006j61547J01959B97627i2758D5873n704A3476J07193a97961I6472a02833
18181b39771a02790j05719l1673B962a85279k46189E6782c11521H9178a78377
18170a87223k2193I6000c57906a01120m5090o183g3468A06109a52001d1653A2750
18158A21720L61341a95693p9485a34418D16760F9377J65336c05034H227a20614
18147A08063k3195l6922b2590m0522A74152F6071a36044a9645h20A68331a6662
18135E4147c96418a27907H7497L4478h2624n6803j05088B50443I2453a7020B4772
18123a50458K6057c3024j70716P7694j20382B3042J45235b78000f5810b1280A23742
$$ plain form
18204 464305 -129085 -90153 227227 -9396 4011 -85080 49892 -107584 -249678 -76294 -124006
18193 -124006 -285553 -183594 297627 -92758 45873 40169 13476 120669 -197961 96472 -102833
18181 -239771 -102790 -208509 -240182 2962 -185279 -431468 56782 -311521 89178 -178377
18170 -187223 -209416 96000 -357906 -101120 -146210 -152393 -73468 106109 -152001 -41653 12750
18158 121720 483061 -195693 -275178 -134418 416760 69377 234713 -305034 8227 -120614
18147 108063 84868 47946 -22590 -63112 174152 66071 -136044 -19645 -820 168331 -16662
18135 54147 -396418 -127907 87497 121975 -82624 -139427 -244515 250443 92453 -17020 24772
18123 -150458 -124401 -33024 -203740 -126046 -246428 23042 168277 -278000 -65810 -21280 123742
18111e0681k2647k55301c0916B1259a65776g0462B44585a35525r7378C5991a70374
18099d9266p4848e2841j51431f4453b7278G993c88177i9305j61236e9919A27221
18087G8215k3953a89626C30850c6496j56146B13020I3211c61508a34731O6997
18077f7734A69638e4952l30810a04720D7547O2587i6408E7706d1526j9237k30967
18066b91730c9777F9588b3292B34451k7615h4556n6951C0886K27798l5541a33265
18054D0628e8968j93487B5851i7001b7137A61894G5128C672J0721K85872a83879
18042a3960C31849C4759M00J95290K9088a11964j14593K801a741q6136k6556C7405
18029I2564K49982A46857a25066C06119c4890A5383K4156F019J9891d06814A89978
$$ plain form
18111 -50681 -73328 -328629 -30916 21259 -165776 -70462 244585 -135525 -232903 35991 -170374
18099 -49266 -124114 -52841 -204272 -64453 -27278 7993 -388177 -99305 -260541 -59919 127221
18087 78215 54262 -189626 330850 -36496 -192642 213020 93211 -361508 -134731 -67734
18077 -67734 169638 -54952 -385762 -104720 47547 110134 -96408 57706 -41526 -60763 -291730
18066 -291730 -39777 69588 -23292 234451 206836 -84556 -141507 30886 258684 223143 -133265
18054 40628 -58968 -252455 25851 -97001 -27137 161894 75128 3672 14393 300265 -183879
18042 -13960 331849 34759 35159 230449 259537 -111964 -226557 -223756 -1741 -87877 -114433 37405
18029 92564 342546 146857 -125066 306119 -34890 15383 39539 6019 25910 -406814 189978
18017c24268J04842A25450c80840a4426A35320i7978H8942a77247p8973f6188
18006D2634a80852l8089a07649H6136l8408A0675J10236E5903b08172C5110J10176
17995A45286B2841M4343a0751F4665J25663e5804A76920K1806e6765l4812k1692
17984a13269B21995b837B45625a9953q2880c0702q5096A09642c51374c0483B23000
17972B75395a44442d7891B58972o1974a3079A82061J07745c36413G5019I028g3984
17960c73242A67274b12578A90695E6281C695J62020a9957A6164K36758C7544Q2418
17949A19962c39654B2334L69049a04164K9153L4779m96335f6992h784j16280c0759
17937a79174h908j32860A74986R6431a32193l3670l2977H6948b71018g8145B25504
$$ plain form
18017 -324268 -219426 125450 -380840 -14426 135320 -97978 88942 -177247 -256220 -66188
18006 42634 -180852 -218941 -107649 86136 47728 10675 120911 55903 -208172 35110 145286
17995 145286 22841 67184 -10751 64665 190328 -55804 176920 198726 -56765 -91577 -113269
17984 -113269 221995 -2837 245625 -19953 -102833 -30702 -115798 109642 -351374 -30483 223000
17972 275395 -144442 -47891 258972 196998 -13079 182061 289806 -336413 75019 9028 -73984
17960 -373242 167274 -212578 190695 56281 3695 165715 -19957 16164 252922 37544 119962
17949 119962 -339654 22334 391383 -104164 -75011 -40232 -536567 -66992 -8784 -125064 -30759
17937 -179174 -8908 -141768 174986 271417 -132193 -165863 -198840 86948 -271018 -78145 225504
17925A23577J19020r5565m0238d58950a31615H6331D0595J00172c2464B904a3623
17913a00779A86163M4762E0227J16660J20864a23067j3660q3475A59700L0830
17903A90530E2263o924h2114B98841a68390d4429A84362a14066j04793G3946d9367
17891i2037A2911J28703i1663j86633h217j10875B24303d02157C4721a59667A98814
17879d7317j9755j74234I9746R4957a72546P3456j4362A70053F3335f1376l4535
17868i5911j2358A81763k000h2972r3398d1359p9161B18308p7173R690a46321
17856a41856A49841b36678c0545j4210j38661c8483k2934A51574b59293A39659
17845c30489Q5026I6848J42472H2038N9070o0599i0011b1211B71991M4356i4163
$$ plain form
17925 123577 242597 147032 106794 -458950 -131615 86331 40595 140767 -32464 2904 -13623
17913 -100779 186163 230925 50227 166887 287751 -123067 -136727 -220202 159700 190530
17903 190530 52263 45339 -82114 298841 -168390 -44429 184362 -114066 -218859 73946 -49367
17891 -92037 12911 141614 -91663 -278296 -8217 -119092 224303 -402157 34721 -159667 198814
17879 -47317 -67072 -241306 99746 194703 -172546 -99090 -113452 170053 63335 -61376 -95911
17868 -95911 -108269 181763 179763 -82972 -176370 -41359 -120520 218308 141135 150825 -146321
17856 -141856 149841 -236678 -30545 -44755 -183416 -38483 -61417 151574 -259293 139659
17845 -330489 -245463 96848 239320 82038 141108 80509 -90011 -21211 271991 316347 -94163
17833f5016j8715l0134k2238A33887M2873a16104A29242B5588P9894j3427b77151
17821a42817k9188e8732A73095h9636d1942m4857a4998I5572d0900A36113C3311
17809A8393i1229B02910a0508A79658o1713O9810k0178R767p8621J04283e32703
17797H3578P3460B6940e4326B42288a03141R329k82068I1242a4134r4051G3658
17785b05674N0908k4427P0708F1874d520B10555J9743O7315A35183C0112b1288
17773G2783J51807G6866f9961G0010a91409I6800k4819b43986a08768k6587B38385
17761E6570A3847J32399l2261a52255e2965j61626A66572i5163m4924l5460B88552
17749d8952C20569c82246f4040A17421j1037d0589l4304D9394n783b03588E3309
$$ plain form
17833 -65016 -83731 -113865 -136103 133887 176760 -116104 129242 25588 105482 92055 -277151
17821 -142817 -172005 -58732 173095 -89636 -41942 -86799 -14998 95572 -40900 136113 33311
17809 18393 -91229 202910 -10508 179658 117945 187755 167577 177344 98723 203006 -532703
17797 83578 157038 26940 -54326 242288 -103141 -93812 -375880 91242 -14134 -108185 73658
17785 -205674 -154766 -179193 -108485 61874 -4520 210555 230298 297613 135183 30112 -21288
17773 72783 224590 76866 -69961 70010 -191409 96800 71981 -243986 -108768 -135355 238385
17761 56570 13847 146246 113985 -152255 -52965 -214591 166572 -95163 -140087 -175547 288552
17749 -48952 320569 -382246 -64040 117421 106384 -40589 -74893 49394 43611 -203588 53309
17737a20575G2652d1454a3900G5380h7542k45205J09617A90327B7160K7291d704
17725A33505i5619A16740b3844k30088h9527A62310K16572e7795A54448c45759
17714g8993k4376B30084b02928e8534k4019C3146a81193I5044b97041B10343n5116
17703A55227d6025F0703b90406B58092d5790A80400m2159Q2728m4678b03952j31213
17692c35165A05519k4355c52109R3158E5153c8925r1880O1434B03803g6512a2582
17680B24498k8333a46116n7763O1306f2810I7029J06479c4505C00220b0627A85018
17668A88576c0855k97905c27j94987b6460E1489a0420j94709b8507A03657J90782
17657B94439b26330B0262J64100n9911m13R139a3801j51249F2641a7864A35419
$$ plain form
17737 -120575 72652 -41454 -13900 75380 -87542 -332747 -223130 190327 27160 54451 -4704
17725 133505 -95619 116740 -23844 -253932 -89527 162310 378882 -57795 154448 -345759
17714 -78993 -103369 230084 -202928 -58534 -82553 33146 -181193 95044 -297041 210343 155227
17703 155227 -46025 60703 -290406 258092 -45790 180400 138241 220969 176291 -203952 -335165
17692 -335165 105519 81164 -352109 -258951 55153 -38925 -130805 -69371 203803 -76512 -12582
17680 224498 196165 -146116 -203879 -142573 -62810 97029 203508 -34505 300220 -20627 185018
17668 188576 -30855 -328760 -327 -195314 -26460 51489 -10420 -205129 -28507 103657 294439
17657 294439 -226330 20262 184362 124451 124038 133177 -13801 -165050 62641 -17864 135419
17645a41455A22396d9389A51848b40069E7898J73479J00480b20366M2472B20056
17634h8619k7338C34443j21068e43762A90434a3948k12243N9945m2057A56661
17623A20850b8692A33904e0025j24415N8340A00645L786Q78j2130b24820B5685
17611C30055c103H2617k4821J28929a83138A5038d303F2983b89989C49261A2763
17599B18098j02178j5990b80023B72078b8137A94670f8584A44734c124l44787
17589c47911a29414L7384j87590A11570n1222a47665B03575o3513D3169K96580
17579C39749F3682O8816d2257D26707A05167M1263b06261j15121B3460J01824
17569A25284f1194B7963a3089k18485F4910K02291E3579c27023E1355R697b20474
$$ plain form
17645 -141455 122396 -49389 151848 -240069 57898 231377 331857 -220366 -177894 220056
17634 -88619 -115957 334443 213375 -543762 190434 -13948 -226191 -166246 -208303 156661
17623 120850 -28692 133904 -50025 -174440 -116100 100645 104431 105309 93179 -224820 25685
17611 330055 -3103 82617 57796 186725 -183138 15038 -4303 62983 -289989 349261 12763
17599 218098 115920 99930 -280023 272078 -28137 194670 -68584 144734 -3124 -347911
17589 -347911 -129414 -92030 -279620 111570 60348 -147665 203575 140062 43169 339749
17579 339749 63682 132498 -42257 426707 105167 146430 -206261 -321382 23460 125284
17569 125284 -61194 27963 -13089 -231574 64910 267201 53579 -327023 51355 61052 -220474
17557a21279m7346A07042g3638n3700A13630b59605e9866D91082e7614A75075
17546A54967c1363k3800B59094B9354J32682M501a26937e0416A00994D780a02918
17534H1797J1035L8066E805K2499Q443O0948o891K36499f5640A02261e6408r425
17522f5833C73439a69838A35840J45872A15946a36893j10156E3208c09491A35331
17511A0212N5895J8174P4024a01391M1091n5947I5831J96248f3968C05718e1510
17499B22971a49144P2476e490E22148A83327C9865b5206A51754a36117G1888P8570
17488A50458K21675A59428G0780K22229j3811h5587H4799G699c4972F9216a28508
17476a6062B10677K2028B5662J8579K582A9977Q694J45992f0616G6087c6817A01336
$$ plain form
17557 -121279 -168625 107042 -73638 -127338 113630 -259605 -59866 491082 -57614 175075
17546 154967 -31363 -55163 259094 29354 162036 166537 -126937 -50416 100994 4780 -102918
17534 81797 92832 130898 5805 28304 36747 97695 90804 327303 -65640 102261 -56408 -65833
17522 -65833 373439 -169838 135840 281712 115946 -136893 -247049 53208 -309491 135331
17511 10212 66107 84281 158305 -101391 -60300 -116247 95831 292079 -63968 305718 -51510
17499 222971 -149144 -76668 -5490 522148 183327 39865 -25206 151754 -136117 71888 150458
17488 150458 372133 159428 70780 293009 279198 -85587 84799 7699 -34972 69216 -128508
17476 -16062 210677 232705 25662 44241 46823 19977 28671 174663 -60616 76087 -36817 101336
17463a16344F1382f3154o835I6674J55661A19404m1744L63172g74A1350K08228
17452B19578k8656J06440p2778h7735E42834j47251J7107A23313c824n6832j01463
17441a62119J6736B98451C7934K94595A02592D6922J62291G3652J95962D2451
17430B41812D9831J62987K1540J69637G0140P3509L62636E1720J1961b81277C47965
17418B80619o3922H7370J48962J59197j8742j79067j9313J58377A39875o406Q059
17407A41528L9616M7293E7881b86615C9919b8709i201A43123K4020i3227O267
17396h6960C75250J07663k26924N0222b0384l0884D08351j00869h7212A78166
17385C15284P1054c9860a1235D3189A1098d5358D74138e4490A51311J90830b8551
$$ plain form
17463 -116344 61382 -63154 -69989 96674 252335 119404 77660 440832 -774 11350 219578
17452 219578 190922 297362 224584 -87735 542834 395583 412690 123313 -3824 -60656 -162119
17441 -162119 -145383 298451 37934 332529 102592 46922 209213 73652 269614 42451
17430 241812 49831 212818 234358 403995 70140 143649 506285 51720 63681 -281277 347965
17418 280619 216697 87370 236332 395529 376787 197720 178407 336784 139875 133469 141528
17407 141528 181144 228437 57881 -286615 39919 -28709 -9201 143123 167143 -93227 -86960
17396 -86960 375250 482913 255989 306211 -20384 -51268 408351 307482 -87212 178166
17385 315284 386338 -39860 -11235 43189 11098 -45358 474138 -54490 151311 342141 -28551
17373b0821C37290m586j49734L5813b84987C59217j46257i902B0717K55128k4959
17362B50886j3062j05781D2351K24991r1451a09960d3722I5440K30973l0781F4414
17350B52830K908j20545J7734J16512m7469R719J5042A5771J82013A2205a04173
17338B11477N0724J00580a13758A74033d1242k1886A04865B7477L75749H5900
17327B27683H2725N35K63148I1386e9527l32523J38248A22695K62980E8593b40897
17315C2325f5139D8045K64066r2634A06341l1327j688j9737M11857H2922K51094
17304C34016o8015a17985A50161l8536M8648j6339m121J32662a68718A61522k0456
17293A41066L2885J95729j4136n0593F0913h2227B56093O6956H3984l48J08655
$$ plain form
17373 -20821 337290 332704 182970 218783 -284987 359217 212960 -9902 20717 275845 250886
17362 250886 237824 132043 42351 267342 175891 -109960 -43722 95440 326413 295632 64414
17350 252830 255738 135193 152927 269439 221970 231689 246731 15771 197784 12205 -104173
17338 211477 262201 362781 -113758 174033 -41242 -63128 104865 27477 403226 85900
17327 227683 82725 83260 346408 91386 -59527 -392050 -253802 122695 385675 58593 -240897
17315 32325 -65139 48045 312111 219477 106341 75014 73326 53589 465446 82922 334016
17304 334016 266001 -117985 150161 111625 160273 143934 139813 272475 -168718 161522 141066
17293 141066 173951 369680 355544 304951 60913 -82227 256093 323049 83984 83636 192291
17282A92291o6531E1425J18608a07062J4327A36282J22798o7837d7891j25245
17272a73136H7670L86223e1851C61474p1355j31098j8207a62066B28009f0306
17261g2127A06056Q8608P009p9560m5453O3938o8772M60219B12462C5556g8713
17249A64647a96456A18036J49337G3493N5145L37637R695a01520A03736J09871
17239B13607a52267C99525A73466D6294J96723J06221j33755p0166l9993J18172
17229B23496b9744B85130N7153A46177O6531L15034A61368M6290m3431H1608J21752
17218B03360P9710a66546C11130l2244q786M3614L5938a32295A57878J5461M8221
17207B21560L58837A89721a42698G1340k1290J22368E3819J23108L6881E3625
$$ plain form
17282 192291 125760 51425 170033 -107062 -92735 136282 259080 191243 -47891 -173136
17272 -173136 87670 473893 -51851 361474 290119 159021 140814 -162066 228009 -60306
17261 -72127 106056 194664 201673 122113 76660 140598 71826 532045 212462 35556 -78713
17249 164647 -196456 118036 267373 73493 128638 466275 475970 -101520 103736 213607
17239 213607 -152267 399525 173466 46294 243017 349238 215483 145317 105324 223496
17229 223496 -29744 285130 342283 146177 212708 527742 161368 207658 164227 81608 203360
17218 203360 283070 -166546 311130 278886 270100 313714 349652 -132295 157878 173339 221560
17207 221560 580397 189721 -142698 71340 50050 172418 53819 176927 213808 53625
17196A12800J86843K0454A07546K33561L7075M8883B09908H1211q025b02285B99880
17184B28474E5309J1196b1807E17084j02780j31821G8373K98937H5207o618K89813
17173C68402j25803o7009K30565j27937k9643I018O4845K38773h5823D09603j79407
17162B30196E9658K81369K9958j05923J09082a01135A70521l4934N6964P8209
17152B70760K7536P0994a15396D64499A39869J1031J8857K27950A14104L02472
17142D16576A3958L82982m1838L5208l672J10604l8664H0417L18953r7201J92767
17131D94936j75016k0796J28517j36377r3214Q7165Q7208j44376M73319D8363
17120D88009j74171J20534m6040A55166J14836J15771m1506A21475K29450E4739
$$ plain form
17196 112800 299643 320097 107546 341107 378182 427065 209908 81211 73186 -202285 299880
17184 228474 55309 66505 -21807 517084 414304 282483 78373 377310 85207 78589 368402
17173 368402 242599 175590 406155 278218 248575 9018 73863 312636 -85823 409603 230196
17162 230196 59658 341027 370985 265062 374144 -101135 170521 135587 192551 270760
17152 270760 298296 369290 -115396 464499 139869 150900 169757 397707 114104 416576
17142 416576 13958 396940 355102 390310 386638 497242 458578 80417 399370 302169 494936
17131 494936 319920 299124 427641 291264 198050 285215 372423 228047 701366 48363
17120 488009 313838 434372 388332 155166 270002 385773 344267 121475 350925 54739
17109D93235K789B02655J63852J00021j92298J26247J41102j73534k1270E8396
17098D64262j35314A62889J92772H6605B3062L50671O2661j4543j50531J9788
17088B91108A41953a02390F44914j96075j29038a14368D96930J09134A85775K29589
17078D15364r2647j8254J88733k6458p4465n8375J54248B33670J13011I3501J43612
17067B37113J60172J68701o103k30663A45289K49179K53234j52060M2036m8354
17057D89324m611j96385N5678a3978D37834K07438k93811K40901J72824I9669
17046E88613k77671J27930r1994P1530Q4632N4900k61319L55276l07525j20994
17036B23378K85130k17072A40473K49437j18837N09971j95274B63288K67989j01799
$$ plain form
17109 493235 496024 202655 366507 466528 274230 400477 541579 368045 346775 58396
17098 464262 328948 162889 355661 86605 23062 373733 436394 421851 271320 291108
17088 291108 141953 -102390 644914 448839 319801 -114368 496930 606064 185775 415364
17078 415364 322717 304463 493196 466738 392273 333898 488146 233670 346681 93501 237113
17067 237113 397285 565986 559883 329220 145289 394468 647702 495642 537678 489324
17057 489324 484713 288328 344006 -13978 437834 645272 351461 592362 765186 99669
17046 588613 310942 438872 346878 418408 503040 557940 296621 651897 344372 223378
17036 223378 508508 291436 140473 389910 271073 781044 585770 263288 531277 429478
17026D29478J88617J7791l3417J33155j60753j60305L70863j76225j74955J10675
17016E44924n0989K43081C46314K02176K5917n0170Q7207A87553J91500J64780
17006E43833K9461k09930K96961r8835J98810j29091M3657O0131j79914J51549
16996G06632k60438L8295K77404m2683k44810L965K26923j234J41046r7203p2614
16985F75283J0629j05800N6844R8639J13105k00516O4503m5825q0963K1310P8438
16974F85647j58338L98469k98791k8904J31770r3239L0781O2625N3075P7578K90423
16963A151096n40477R9522j81739M8486K72319J33583l26275L40933l84486J04993
16953G17955J59608k25987L09409J89629l3583k82370J70763K4982l11168M6452
$$ plain form
17026 429478 618095 635886 602469 735624 574871 414566 785429 609204 434249 544924
17016 544924 493935 737016 346314 548490 574407 524237 611444 187553 379053 543833
17006 543833 573294 363364 660325 561490 760300 631209 674866 734997 555083 706632
16996 706632 446194 484489 761893 719210 474400 478365 705288 704054 845100 747897 675283
16985 675283 685912 580112 636956 735595 848700 648184 712687 666862 585899 607209 685647
16974 685647 527309 925778 626987 598083 729853 636614 667395 730020 783095 860673 1151096
16963 1151096 610619 710141 528402 576888 849207 982790 656515 997448 612962 717955
16953 717955 877563 651576 960985 1150614 1117031 834661 1005424 1030406 719238 765690
16943G65690K14053j659j59679p2090K79515j66442J5487K42600P2125q0033l06312
16932H03255O50336o15727L03686J28005k86946j09851L58015j42668j88080M0262
16922I40287J38155J03861J33051k83518k4694K23977J81885j00281k01872J57308
16912A268159j03783j64875Q1835J40039L26413l39411J85478j84523o7076L94117
16902A536373L546k3600n9052J53881j93802j4528M4496j59557M76503k23200
16892A541060J04303P1974K10824o07543J96302K38721p8332l99290M18166J43356
16882A839541K99947j76458k17174j20722L31176k46888J78991R5733j67211J18035
16872A934970O3638J55698k52436M69813m42328K22126m1440J80544J93945k87417
$$ plain form
16943 765690 979743 978084 818405 746315 1025830 859388 874875 1117475 1189600 1109567 803255
16932 803255 1453591 837864 1141550 1269555 982609 872758 1230773 1088105 900025 940287
16922 940287 1078442 1182303 1315354 1031836 1007142 1231119 1413004 1312723 1110851 1268159
16912 1268159 1164376 999501 1081336 1221375 1547788 1208377 1393855 1209332 1142256 1536373
16902 1536373 1539919 1516319 1457267 1611148 1417346 1402818 1447314 1287757 1764260 1541060
16892 1541060 1645363 1717337 1928161 1320618 1516920 1755641 1677309 1278019 1696185 1839541
16882 1839541 2139488 1963030 1745856 1625134 1956310 1709422 1888413 1984146 1816935 1934970
16872 1934970 1998608 2154306 1901870 2371683 1929355 2151481 2110041 2290585 2484530 2197113
16862B197113j10970N6852K72582K10504k21225P7103K2176K57656l9188m36434
16852B286169L79603k8987K7938Q5036l8992j11354m3674N65660j054o08952L86611
16841B898004K6450l1424l5666K85971l77467P52088k10004m0513L03779j11369
16831C459849j9471L97741j49909l73208M84992m0921q4936L55835j05871M134
16821C928235N0144L21827J01684k25949L33258j97938M58945j25871L32638l9335
16811D937638K82084q3499Q9807M34312q8164l7236R7096N0159K98444R2326J78313
16800F251280p3175M24220J49943K66636J5439O8816J34952J98715Q8979J58917
16790G684722J16760M07654K96905L74408j7520M36914l196P60734j50767L78727
$$ plain form
16862 2197113 2086143 2142995 2415577 2626081 2404856 2481959 2504135 2761791 2722603 2286169
16852 2286169 2665772 2636785 2664723 2749759 2710767 2599413 2555739 3121399 3120345 2511393 2898004
16841 2898004 2924454 2893030 2857364 3143335 2765868 3517956 3307952 3267439 3571218 3459849
16831 3459849 3440378 3838119 3688210 3315002 3799994 3759073 3674137 4029972 3924101 3928235
16821 3928235 3978379 4300206 4401890 4175941 4509199 4311261 4770206 4644335 4976973 4937638
16811 4937638 5219722 5136223 5226030 5660342 5572178 5534942 5632038 5682197 5980641 6072967 6251280
16800 6251280 6178105 6602325 6752268 7018904 7034343 7103159 7238111 7436826 7525805 7684722
16790 7684722 7801482 8209136 8506041 8880449 8862929 9299843 9296647 10057381 9906614 10285341
16780A0285341K67323M33831j84732P26207M60540J49122R25736J87808P0167
16771A3321343O67513O28335L64248N80651N33171K24605O63935Q54526N18850
16762A8357177J079185O48985M34740J221806P97515Q28291J031369J191555R68156
16753B6558779J354272J007176J587126J289128J806580J674399J643076J858103
16745C8778639K181574K169230K158436K823151K610424L053382L332658L020355
16737F0127849L941952M356373L866741N377105M632809N665571N725823O434196
16729A00128419O464221P242922P241317P965151P852825P928686Q532302P862241
16721A61218084P453484P264742N882785N646146L658942K404193J273293l44351
$$ plain form
16780 10285341 10552664 10986495 10801763 11527970 11988510 12137632 13063368 13251176 13321343
16771 13321343 13988856 14617191 14981439 15562090 16095261 16319866 16983801 17838327 18357177
16762 18357177 19436362 20085347 20520087 21741893 22539408 23367699 24399068 25590623 26558779
16753 26558779 27913051 28920227 30507353 31796481 33603061 35277460 36920536 38778639
16745 38778639 40960213 43129443 45287879 48111030 50721454 53774836 57107494 60127849
16737 60127849 64069801 68426174 72292915 77670020 82302829 87968400 93694223 100128419
16729 100128419 106592640 113835562 121076879 129042030 136894855 144823541 153355843 161218084
16721 161218084 168671568 175936310 181819095 187465241 191124183 193528376 194801669 194457318
16713A94457318k227968l522831n062970n478821o803718p792802p647025q431184
16705A47489999q269227q049135q204580p469807p418028o634759o596475n922232
16697H8925756n742156n358274n217641m097143m532184l612746l477589l611646
16689E3276377l023992k584573k790920k297758k743606j966907k178328j456149
16681C4234144j705861j548614j571028j284672j345520j284335j573371p51129
16673B3169614j119076p44135n86263j226602q55166n05627q74779n39414p70606
16664A5947946l39201p38656o58415l24693k31949p77332m66349j89398o20056
16655A1601897k11972m81750m40109j72475k95325l17230l56071r4816k97775
$$ plain form
16713 194457318 192229350 188706519 183643549 178164728 171361010 163568208 155921183 147489999
16705 147489999 139220772 131171637 122967057 115497250 108079222 101444463 94847988 88925756
16697 88925756 83183600 77825326 72607685 68510542 63978358 60365612 56888023 53276377
16689 53276377 50252385 47667812 44876892 42579134 39835528 37868621 35690293 34234144
16681 34234144 32528283 30979669 29408641 28123969 26778449 25494114 23920743 23169614
16673 23169614 22050538 21306403 20720140 19493538 18638372 18132745 17257966 16718552 15947946
16664 15947946 15608745 14870089 14211674 13886981 13655032 12877700 12411351 12221953 11601897
16655 11601897 11389925 10908175 10468066 10295591 10000266 9683036 9326965 9232149 8934374
16646H934374o69966J71369n34498j76844k1817j23103o62208K15774l45909l2233
16636F754939l55693q1521R0403l73020k53521j05338k01623j71351R311k0354
16626E292232q8506l51764J03751l35048Q0740j57071m4412k32134k38760P1811
16616D100839j97720K63571k84074k77360m0078J40573k27132L0530J88917k94732
16606C403334k33406K79581m09910K25159n0993k55156l2718j08601L34176n99245
16596B552221J10919j30380K91801n22589M12926j79210m2600l36936J90858J45784
16586B492794l54515J54775J37651k84808P3931o2252n8478J45464k45057k07407
16576A792098K93730q061l47584M11847n15701K60944j89302L1628j30878j67608
$$ plain form
16646 8934374 8264408 8435777 7901279 7724435 7702618 7579515 6917307 7133081 6787172 6754939
16636 6754939 6399246 6317725 6408128 6035108 5781587 5676249 5474626 5303275 5312586 5292232
16626 5292232 5203726 4851962 4955713 4620665 4701405 4544334 4499922 4267788 4029028 4100839
16616 4100839 3903119 4166690 3882616 3605256 3565178 3705751 3478619 3509149 3698066 3403334
16606 3403334 3169928 3449509 3039599 3264758 3213765 2958609 2925891 2817290 3151466 2552221
16596 2552221 2663140 2532760 2824561 2301972 2714898 2535688 2493088 2156152 2347010 2492794
16586 2492794 2138279 2293054 2430705 2145897 2219828 2157576 2099098 2244562 1999505 1792098
16576 1792098 2085828 2077767 1730183 2142030 1626329 1887273 1697971 1729599 1598721 1431113
16566A431113L13555j18761N7004j88068L35122n23725J83847j44693L47881l62846
16556A330429K03581l07738L81056K77127k71341j10691p00201Q40784m12788
16547A230218J43293J69276l19072J45974k08745K63265n37681M17301j55857
16538A147972O5826K2674l4565m18661L87531j46016p7270K26954l04751K67108
16528A136802j40115k01200M14408k96878k8824j43389L62028j38365N9346K1275
16518A045088j33017k14216O1483K30177k04049J65622j63263m2781K77712k89416
16508G33340M13623l25682m3084N0090l25352J89525p1699K72527j40411L36484
16498A089361k37629p1494j28593J57701j99751j04563L6699L07270J53918j90097
$$ plain form
16566 1431113 1744668 1625907 1682911 1494843 1829965 1306240 1490087 1345394 1693275 1330429
16556 1330429 1534010 1226272 1607328 1884455 1613114 1502423 802222 1643006 1230218
16547 1230218 1373511 1542787 1223715 1369689 1160944 1424209 886528 1303829 1147972
16538 1147972 1213798 1236472 1201907 783246 1170777 1024761 947491 1174445 869694 1136802
16528 1136802 996687 795487 1209895 913017 884193 740804 1102832 964467 1023813 1045088
16518 1045088 912071 697855 759338 989515 785466 951088 787825 745044 1022756 733340
16508 733340 1146963 821281 778197 828287 502935 692460 620761 893288 752877 1089361
16498 1089361 851732 780238 651645 809346 609595 505032 541731 849001 1002919 812822
16488H12822k57956L36274j00924C69197L32741P4968j09838L50806m84987K69995
16478H02882p5961k29821L05025k28040o7993M7029K50789k42174j82352A87235
16467C56703J92602J23510J5161K36428k95264j5627R3408O4115B85876J35601
16457D21477l02B05600L35704k15920J28950N4084A98385K89440B32934M36909
16447F69843j88160j4988R0863q0244O3057j50896j72274L64931B35405Q4236
16437C19641j19383K69372a08356C86448N1109p3785N276K57389n3537k13525
16427C59375j06096J67631o5702J52898A05431L45790K1297j00118r9748O7744
16417C40396p9254K07950k26842H9297J23263F4910J79837P7707A13498L52297
$$ plain form
16488 812822 554866 891140 790216 369197 701938 776906 667068 1017874 532887 802882
16478 802882 726921 497100 802125 574085 506092 553121 803910 561736 379384 187235
16467 356703 549305 672815 687976 924404 629140 613513 706921 771036 285876 421477
16457 421477 421175 205600 541304 325384 454334 508418 198385 487825 232934 669843
16447 669843 481683 466695 557558 477314 540371 389475 217201 582132 235405 319641
16437 319641 200258 469630 -108356 386448 437557 363772 369048 626437 572900 359375
16427 359375 253279 420910 355208 508106 105431 451221 472518 372400 272652 340396
16417 340396 261142 469092 242250 89297 212560 64910 244747 322454 113498 465795
16407D65795A26884J42556q1197F195K80283P4870A63117K6545K0814G6291J53443
16396B29734L38392B07954K2950m5458J04973H3327J64964J93866k12416K27779
16386D57520j05338O0260H3657K51284j3082C4423K64079K09458I6553J43519
16376B40072J05264A22400L558h809D70296M4091j82643A16971J8894N0060e7307
16364C38909M8304r5757h8176A33596M6992J14854M5109l6498o6228L17903i621
16352C66550K40112B28687j9503l9269G4531K52819A18868K74085N8574A34548
16341C00142H9799M4883K19914c4366B33157D1184J70813a12091C58324j49098
16331B09226c9213A78457K12796f5680D11985a22222M105B23553q7139J73523
$$ plain form
16407 465795 126884 269440 188243 6195 286478 361348 163117 189662 210476 76291 229734
16396 229734 568126 207954 230904 185446 290419 83327 248291 442157 229741 457520
16386 457520 352182 412442 83657 334941 321859 34423 298502 507960 96553 240072
16376 240072 345336 122400 125958 -8809 470296 514387 331744 116971 135865 185925 -57307
16364 338909 387213 291456 -88176 133596 180588 295442 340551 304053 237825 555728 -9621
16352 366550 606662 228687 209184 169915 74531 327350 118868 392953 451527 134548
16341 300142 89799 134682 354596 -34366 233157 41184 211997 -112091 358324 209226
16331 209226 -39213 178457 391253 -65680 411985 -122222 -118117 223553 136414 309937
16321C09937I0803L0330J32704n1K47973j28706j35400a2818k6398A09404L2065
16310A41469Q0435j3999D3080a86887B94761Q8732R703j09555F3019K35328p7061
16299B21286j04514j0245J51792N3310A18902h0999B74536A00824f8340l4392
16289a02732E3902j245p210K10375c4129B01476J09210J27586B9419N6666J65866
16278B51951R7828c4133B78811F3361M07133A38918N4427D0196K3065b29788c2393
16266a0138j16804L9461r4270B70099b6621A02011K4927K29868m7507E3471b99331
16254h7349C4511b07120A57647a92664e4452A60468J81442J26685e5376A81806
16243A04741b72236A40294m0833l7025c9527C0507J32794O443b1316j00933A16510
$$ plain form
16321 309937 90803 121133 253837 253786 501759 373053 237653 -12818 -39216 109404 141469
16310 141469 221904 207905 43080 -186887 294761 383493 393196 283641 63019 298347 221286
16299 221286 116772 106527 258319 311629 118902 -80999 274536 100824 -68340 -102732
16289 -102732 53902 52657 45447 255822 -34129 201476 310686 438272 29419 86085 251951
16278 251951 349779 -34133 278811 63361 470494 138918 193345 40196 63261 -229788 -32393
16266 -10138 -126942 -87481 -181751 270099 -26621 102011 126938 356806 309299 53471 -299331
16254 -87349 34511 -207120 157647 -192664 -54452 160468 341910 468595 -55376 181806
16243 104741 -272236 140294 99461 62436 -39527 30507 163301 169744 -21316 -122249 116510
16231C40568h873B98547b19309C983a48458d4010n8012B28106J03873a47441O8219
16220g9222B48487H5842Q2525f8338I6222R4531a46123c9053A87449a12993G6345
16208a41711C71881d0326A01887i4696A84272a1936D74807h5521J9554n4731A620
16196c33480f8452B06397I4364M2482g9589L6884J7466p9397I8167a32401c2056
16184a45943K204M812A7870Q3419e5384B06594F3997a17160B36895r3122J30150
16173B73923R0626A13793J28799B5280J82168f5301E8619L8935N88h3264k6630
16162a09894j9756B39908l7735I2565K06620D0612J77129a76070b9708q5336q7812
16151b02856A03210D9991a01077k8584A14350a06565Q711k8964A08844L9149b17465
$$ plain form
16231 340568 -8873 298547 -219309 3983 -148458 -44010 -102022 228106 331979 -147441 -79222
16220 -79222 248487 85842 168367 -68338 96222 190753 -146123 -39053 187449 -112993 76345
16208 -141711 371881 -40326 101887 -94696 184272 -11936 474807 -85521 -65967 -120698 1620
16196 -333480 -68452 206397 94364 136846 -79589 -42705 -25239 -104636 98167 -132401 -32056
16184 -145943 -143739 -138927 17870 101289 -55384 206594 63997 -117160 236895 143773 273923
16173 273923 364549 113793 242592 25280 207448 -65301 58619 97554 98142 -83264 -109894
16162 -109894 -129650 239908 202173 92565 299185 40612 217741 -176070 -29708 -115044 -202856
16151 -202856 103210 49991 -101077 -129661 114350 -106565 -97854 -126818 108844 147993 -217465
16139B18797C1102K0233b4226k77357A59525K0380k5180c6811A12996b31272D5740
16127a2564j05810j26630a1936p4038H0983K35874E4360J53068a13332c4052B36208
16115F6288a18572j2670C95022A82881h7792n1785d4872k76254A58431f9365j80523
16104b49888J09884E0616i196A79724N6704A05581B5489c7150G2250A8759P2213
16093I0972a16859M4079o5654l62150G0165O5800a13912c491j07543A43223e3789
16081c0377A65141D9563c86681F4290g7105L3147k94913a50448o6909K6022h0309
16069A06628f8341k3332I2762l8515h2293B9941c389j07143j33036I6232L5652
16058A31884d9925k02060C1839a15442o2841j06790A6106J41710p4798d3862j03789
$$ plain form
16139 218797 31102 51335 -24226 -301583 159525 179905 154725 -36811 112996 -231272 45740
16127 -12564 -118374 -245004 -11936 -85974 80983 316857 54360 207428 -113332 -34052 236208
16115 66288 -118572 -131242 395022 182881 -87792 -139577 -44872 -321126 158431 -69365 -249888
16104 -249888 -140004 50616 -9196 179724 236428 105581 25489 -37150 72250 18759 90972
16093 90972 -116859 -72780 -138434 -500584 70165 135965 -113912 -3491 -111034 143223 -53789
16081 -30377 165141 49563 -386681 64290 -77105 -43958 -338871 -150448 -217357 -191335 -80309
16069 106628 -68341 -91673 92762 54247 -82293 29941 -3389 -110532 -243568 96232 131884
16058 131884 -49925 -251985 31839 -115442 -178283 -285073 16106 157816 83018 -43862 -147651
16047a47651A37395h8259j9288J9365E065P9371d551j97290Q7593G8880f1229
16035a49152j57289F377d4176C2195c5786E3431c25540g5899A04592c84201a27433
16023f8137K2614C09710a5141A3782N8940J18324c48242a17270a0244D9428K802
16012E2230L7109h5480j14843A05509a16629c936H4396a82283E739J58306r800
16001A54245Q6368h1836c3617l2750b5440j74474D7603J4291C0051c48125R5921
15990b52204E9713A4273R8468b27522l2336c7602k0093I1252Q3203J68619A57709
15978B33074E4003L9832C5373e4929o3848B20322J52382A8982c7966E1799A2746
15966a07866o9859P9712b9622A10197L07536b92082h3652A87297g8922k2286B6497
$$ plain form
16047 -147651 137395 -88259 -107547 -88182 5065 84436 -4551 -201841 -114248 78880 -61229
16035 -149152 -306441 6377 -44176 32195 -35786 53431 -325540 -75899 104592 -384201 -127433
16023 -68137 -45523 309710 -15141 13782 72722 191046 -348242 -117270 -10244 49428 52230
16012 52230 89339 -85480 -200323 105509 -116629 -3936 84396 -182283 5739 164045 154245
16001 154245 240613 -81836 -33617 -66367 -25440 -199914 47603 61894 30051 -348125 -252204
15990 -252204 59713 14273 112741 -227522 -259858 -37602 -57695 91252 174455 343074 157709
15978 233074 54003 93835 35373 -54929 -118777 220322 372704 18982 -37966 51799 12746
15966 -107866 -177725 -98013 -29622 110197 417733 -292082 -83652 187297 -78922 -101208 26497
15954a9828k79476C4811c0473A76737R6259b96865J06883f7301K7427l5243B39475
15942c37528A55412A3554c8108j74310I056g6029a4966j51422D6787a07701r4615
15931b02316J1211N9284k5369E22K49412K1422a82385h6616A05897J90028d0675
15919c29098J47792G6482a20877e8508B81484A2504b2814k9715A7131J01064K05051
15908C23246a11398p6718R127j67818g1290k91044f784j1452r7141B0328e5566
15896c35504a23629A02190d0085k1856j7581j3857m8434B06448a33616M9134j4583
15885i9065p3101H2440c17395O6576l262A41048I865a28186a5901l1896b1778
15873a52826p5449A44183b7138B64788D4531a66795d7391D12968D5168b27449
$$ plain form
15954 -19828 -299304 34811 -30473 176737 272996 -296865 -189982 -67301 -39874 -75117 239475
15942 -337528 155412 13554 -38108 -212418 9056 -76029 -14966 -166388 46787 -107701 -202316
15931 -202316 -191105 -131821 -157190 522 249934 271356 -182385 -86616 105897 295925 -40675
15919 -329098 -181306 76482 -120877 -58508 281484 12504 -22814 -52529 17131 118195 323246
15908 323246 -111398 -188116 -178989 -346807 -71290 -362334 -6784 -18236 -115377 20328 -55566
15896 -335504 -123629 102190 -40085 -61941 -79522 -93379 -141813 206448 -133616 -84482 -99065
15885 -99065 -172166 82440 -317395 -250819 -254081 141048 9865 -128186 -15901 -47797 -21778
15873 -152826 -228275 144183 -27138 264788 44531 -166795 -47391 412968 45168 -227449
15862C4282Q6040g9678A32547A3196i6243q4663B36755c22821E6841a8687G5360
15850b27001R8540A23995l1688a80041b3115k80537A3618K67105f7137j27548
15840a94685A3576P4000c93662F0031f8810D9066N7772a04654k706r8427L8937
15829a66850B62212C7834b61631R038b0188q017E9907J0299a60948f081B9961
15817I1642b7854j97179B18609P884A02803c79307a62848O0720a1799k3275k95817
15806c30891a11048G1549h1959c0613j24744J8572j29212A79894i856o5114A57975
15794F3115K8120a97732k06617F8313c65274G9300L6235N934J29549a75625D0047
15782f0208B67988p8984J97045b17380k39110A35804f2511o2925E7690a22456
$$ plain form
15862 34282 120322 -79678 132547 13196 -96243 -180906 236755 -322821 56841 -18687 75360
15850 -227001 -128461 123995 92307 -180041 -23115 -303652 13618 280723 -67137 -194685
15840 -194685 13576 87576 -393662 60031 -68810 49066 106838 -104654 -107360 -205787 -166850
15829 -166850 262212 37834 -261631 -252593 -20188 -28205 59907 70206 -160948 -6081 29961
15817 91642 -27854 -225033 218609 226493 102803 -379307 -162848 -102128 -11799 -35074 -330891
15806 -330891 -111048 71549 -81959 -30613 -155357 -136785 -265997 179894 -9856 -74970 157975
15794 63115 91235 -197732 -404349 68313 -365274 79300 115535 121469 251018 -175625 40047
15782 -60208 267988 189004 386049 -217380 -456490 135804 -62511 -125436 57690 -122456
15771E3301B0530K78854f9418c2820E3577a8975k4823C9647c6996k70224c9717
15759a76238B98671E9063p199d145B927d9118B26336E3417p911b07819f0784A24297
15746D5675L4869J25344o6308j7889A6687M19618e8278I2133c29870A94437b41711
15734B23874h7634A08329E3015J7044a30189A8420c5250B08992d8658d055j53166
15723a57221A4750L54246a4952D1817a92413n2937L6239c5053A71018a77113g372
15711c2378j90517g34q6111A01857a28088N6892C02825b0036k1519A42016b73734
15699A49251E3962h2553f14A19897a86117A67288a78217A03131i9227D79113I2667
15687b18481L8893m2036A58801b23649k9723A07686b25104r2539f9351C3572h8273
$$ plain form
15771 53301 20530 299384 -69418 -32820 53577 -18975 -43798 39647 -36996 -307220 -39717
15759 -176238 298671 59063 51864 -4145 2927 -49118 226336 53417 45506 -207819 -60784 124297
15746 45675 80544 205888 139580 121691 16687 436305 -58278 92133 -329870 194437 -241711
15734 223874 -87634 108329 53015 70059 -130189 18420 -35250 208992 -48658 -4055 -157221
15723 -157221 14750 368996 -14952 41817 -192413 -245350 -209111 -35053 171018 -177113 -7372
15711 -32378 -222895 -734 -86845 101857 -128088 -71196 302825 -20036 -41555 142016 -273734
15699 149251 53962 -82553 -614 119897 -186117 167288 -178217 103131 -99227 479113 92667
15687 -218481 -179588 -221624 158801 -223649 -253372 107686 -225104 -317643 -69351 33572 -88273
15675a29049B30662i5866p1649A85140K2725D9009J26157h0912c5297C832J35538
15664A39370c12054J12597h8482C0963a3088F3341e1281j7023A14745M1027o5471
15653I0301O1080m9840a64179o339k6729Q1664A23639K64693A70222b1724k12010
15642b33734N6446M6886n8510F0954E000g3397j48058B30218a60332M522I50f9250
15629d7980m7684A278K26885a04407l9722H8225Q84b14098k1133a01552a7050
15617B87868r0616F7318L90883b6022m7441B98455A46220A7230b01720M5246A17057
15605a17392A69975c27369B14443A4121a47217k55330f0720A54354b10574f6481
15594A37415i0864b7278o6898F9022f3865K7869A84447e239A43750K69393G1646
$$ plain form
15675 -129049 230662 -95866 -167515 185140 207865 49009 175166 -80912 -35297 3832 139370
15664 139370 -312054 -199457 -88482 30963 -13088 63341 -51281 -68304 114745 155772 90301
15653 90301 151381 101541 -164179 -170518 -197247 -115583 123639 388332 170222 -21724 -233734
15642 -233734 -177288 -130402 -188912 60954 5000 -73397 -221455 230218 -160332 -155810 950 -69250
15629 -47980 -95664 1278 228163 -104407 -144129 88225 89109 -214098 -235231 -101552 -17050
15617 287868 197252 67318 458201 -26022 -73463 298455 146220 17230 -201720 -156474 117057
15605 -117392 169975 -327369 214443 14121 -147217 -402547 -60720 154354 -210574 -66481
15594 137415 -90864 -27278 -94176 69022 -63865 -35996 184447 -5239 143750 413143 71646
15582B16869r1762B7156b66517e2466j01371p0250F4637B2171J41812g4328j1560
15571h5888P47J5465A40313b76724k3556A09550Q1653b93627J5813A88395C7885
15559B47403d0458E7676e6997A82051E7858Q4771h7891F1434J78775b53681Q7271
15548a66410c7032n3343A8336K32321e8675m19462A60463D5432g9645j34753G0896
15536B07248a01820a4290A4235K63181D2943a92025d7957B48202k0832o3688J9867
15525A83549k5232g2482A03321b35652B0375g7491E271e5294q3943H9383l723
15514H5660a23509F7032J85422c3096p4440k05303R9220A30587g0399r6912O8805
15503i8506L8568H2302J42079b03456H6108J38339C6983R1986g6509j37835h3778
$$ plain form
15582 216869 125107 27156 -266517 -52466 -153837 -224087 64637 22171 163983 -74328 -85888
15571 -85888 -85141 -69676 140313 -276724 -300280 109550 191203 -293627 -277814 188395 37885
15559 247403 -40458 57676 -56997 182051 57858 142629 -87891 61434 240209 -253681 -166410
15548 -166410 -37032 -90375 18336 250657 -58675 -478137 160463 45432 -79645 -214398 70896
15536 207248 -101820 -14290 14235 277416 42943 -192025 -47957 248202 227370 163682 183549
15525 183549 158317 -72482 103321 -235652 20375 -77491 5271 -55294 -139237 89383 85660
15514 85660 -123509 67032 252454 -33096 -107536 -312839 -213619 130587 -70399 -167311 -98506
15503 -98506 -59938 82302 224381 -203456 86108 224447 36983 128969 -76509 -214344 -83778
15491a89003j51897a46428c2783A8811M6364O8989E2358d31628g1057A51487d3107
15479a07389k18815k7962G3671M2474b6516A90629L8347G402L1779a66601H7360
15467G6073J1007i2667I804P0975k3326G334P4821a27139M0225k74958e6000H5697
15454a11513A6468K07061a6860o6576e442m6223k15848d9585k03949L9519A64620
15442A04794b13397e0351k60396e6491n9861p9101A93968n6997d0762A0642L8397
15431D9039i6935E8290j9395J56660b12184c3211D7804P9191a4056A97316i2079
15419a06976a9170C22614b7092C12395b795A04077N4672J19367C993J010N9737
15408F4740A3223h0653o1350F3486K36300g6447G6633f965m7006A08803J96825
$$ plain form
15491 -189003 -340900 -146428 -32783 18811 65175 134164 52358 -431628 -71057 151487 -43107
15479 -107389 -326204 -354166 73671 116145 -26516 190629 228976 7402 39181 -166601 87360
15467 76073 87080 -92667 9804 80779 57453 7334 82155 -127139 -86914 -361872 -56000 85697
15454 -111513 16468 223529 -16860 -83436 -5442 -51665 -267513 -49585 -253534 -214015 164620
15442 104794 -213397 -50351 -310747 -56491 -116352 -195453 193968 136971 -40762 10642 49039
15431 49039 -96935 58290 38895 195555 -212184 -33211 47804 126995 -14056 197316 -92079
15419 -106976 -19170 322614 -27092 312395 -2795 104077 158749 278116 3993 5003 64740
15408 64740 13223 -80653 -142003 63486 299786 -76447 76633 -6965 -53971 108803 305628
15397C05628a9433A12038c3695D01087i2665j404L3441j34800e4378I8527B5035
15385a27908L406E0019b73704a01900A64715B7498P0884a93225k45302g9888j90969
15374b70857b6904j68621g6840j09514B79656C951a12211M0469B89520b55223
15363a36191j63006B77457C7304c17784C46505C396J31027a39670o4633p0352
15353b74655I9860p911a04689C07092d7018C1158c62013f9442A4898J6236a76846
15341B5339g7871A8833h1157B22270c9637C37599a55231J9328G1651R2511m8092
15330A16070C9181a4163l9446I8158B3599a75850r8428K225J30851C9907Q0805
15319A20712M8657O0621d9805q3190A30046K17585j396A20556a7027l0309e320
$$ plain form
15397 305628 -19433 112038 -33695 401087 -92665 -94069 -60628 -195428 -54378 98527 25035
15385 -127908 -124502 50019 -273704 -101900 164715 27498 98382 -193225 -438527 -79888 -270857
15374 -270857 -26904 -195525 -76840 -186354 279656 3951 -112211 -71742 289520 -255223
15363 -136191 -299197 277457 37304 -317784 346505 3396 134423 -139670 -204303 -274655
15353 -274655 99860 91949 -104689 307092 -47018 31158 -362013 -69442 14898 31134 -176846
15341 25339 -77871 18833 -81157 222270 -39637 337599 -155231 -135903 71651 164162 116070
15330 116070 39181 -14163 -53609 98158 23599 -175850 -274278 -272053 -141202 39907 120712
15319 120712 169369 229990 -49805 -132995 130046 347631 346235 120556 -17027 -47336 -5320
15307C9050K95372G7849a71615P9456B11588c74870B08748a47060f1431j10518
15297a71949h5629B3251a94094c752A51716L2113c8000B09751p7984c96605I0127
15285C09351E7070k6104J49115f8225o9163A18314g5712I4443A386b25732C30806
15273i0270A91751a115j98720h490G4581K63049h654j07401B21541a52467b1177
15261C10226i1589j61461J18079J2452N7225q4633M0787B3350M9762a93146P577
15250a85569e393F37001J90448O01729k0520o5433r0013E93215j65205h1090m1393
15239a22483O1129C33189A56055c1823A8316K26226a18458A04022l5693J74886
15229B43215b07949p1864R0654C38193C809J68209a25254H5160B6479J77381a88099
$$ plain form
15307 39050 334422 77849 -171615 -92159 211588 -374870 208748 -147060 -61431 -171949
15297 -171949 -85629 23251 -194094 -3752 151716 183829 -38000 209751 131767 -396605 90127
15285 309351 57070 30966 180081 -68225 -137388 118314 -75712 94443 1386 -225732 330806
15273 -90270 191751 -1115 -199835 -8490 74581 337630 -8654 -116055 221541 -152467 -21177
15261 310226 -91589 -253050 -134971 -122519 -65294 -149927 -109140 23350 73112 -193146 -185569
15250 -185569 -5393 637001 827449 1429178 1408658 1343225 1253212 593215 428010 -81090 -122483
15239 -122483 -61354 333189 156055 -31823 18316 244542 -118458 104022 68329 243215
15229 243215 -207949 -279813 -189159 338193 3809 172018 -125254 85160 26479 203860 -188099
15217A22233Q3621a09952A20794n1529M8604g6399A78460g6510B41004A4827Q2500
15206I7327b7179A75591g9264C08873d6559B32971k181j01121c17644B15104J8108
15195B33212l0433A7109a88119C23127h4423H4310P363d7117A44732E2278a50035
15183C5112K81459a21565C22034j40655J6165A748M86123A99717A253J10369J4765
15172A26387J4576L8105J64660A33207a28587B51191A3010c7419D5420a51618
15161F2995k3050K29679B8132J06461c8424B48113g53A15164E0037N0517b82081
15149a69188A10243a0732a155D40713A52571c01310C63757p3806A6047g7676j56369
15138b34045K369C19542n1221p7874J08093D5692h5625A98523a12342B45568N7688
$$ plain form
15217 122233 205854 -109952 120794 69265 117869 -76399 178460 -76510 241004 14827 97327
15206 97327 -27179 175591 -79264 308873 -46559 232971 230790 129669 -317644 215104 233212
15195 233212 202779 17109 -188119 323127 -84423 84310 91673 -47117 144732 52278 -150035
15183 35112 316571 -121565 322034 181379 197544 1748 487871 199717 1253 111622 126387
15172 126387 140963 179068 343728 133207 -128587 251191 13010 -37419 45420 -151618
15161 62995 39945 269624 28132 134593 -38424 248113 -753 115164 50037 100554 -282081
15149 -169188 110243 -10732 -1155 440713 152571 -301310 363757 289951 16047 -77676 -234045
15138 -234045 -231676 319542 268321 190447 298540 45692 -85625 198523 -112342 245568 303256
15127C03256G465P0345K41127q5410B4187J13163i359A30381c6866E18803j91700
15116C27103j20066E7669R377e7623C08566a28578E6208K65225B7417a5727A05290
15104C7786L43475a15544B30693j8517p7953b1543D8201M9744N9655G5415L6858
15093A12273P147i6446A83211c1692B85063I6130j1633J35915a55813H6397M0293
15082A26690K7419a78691g9898j12931A61078F4301c9475k2750A15444m6108L9350
15071A08686D2517d1046k67239A01231B8320L03415H2865O0568g6440E0510n046
15060D5464O2321a03285A48471L59033A02750M4369M0190J67006G8141l2621b3514
15048A79891A7345b6411A74330J2167G8411N8509C62i1327A76294o254J3656n5300
$$ plain form
15127 303256 7465 77810 318937 233527 24187 137350 -9359 130381 -36866 518803 327103
15116 327103 207037 57669 67046 -57623 308566 -128578 56208 321433 27417 -15727 105290
15104 37786 381261 -115544 230693 212176 134223 -21543 48201 97945 157600 75415 112273
15093 112273 119420 -96446 183211 -31692 285063 96130 84497 220412 -155813 86397 126690
15082 126690 154109 -178691 -79898 -192829 161078 64301 -39475 -62225 115444 69336 108686
15071 108686 42517 -41046 -308285 101231 28320 331735 82865 143433 -76440 50510 45464
15060 45464 107785 -103285 148471 507504 102750 147119 187309 354315 78141 45520 -23514
15048 179891 17345 -26411 174330 186497 78411 136920 362 -91327 176294 170040 183696 128396
15036A28396b18406A83474b46729A37560J40103j16670K6711R1422o1638J03421
15026C20909A5406L01995j00764k3322J57647j23579L1564r4111J50373b55347
15015A50229E4663L73536a4112D31014e3354k15318B35928R724b7056n5034A80628
15003i6135p0698B90574r2714J27324n2176j05292L7281Q659J08951j2296A41456
14991B09359L93048a26946C73975j6835i9663I9253Q3504G2491M5240M4721F3823
14979A26957R3229b30064B75809H193J80978E0320M8259B3013P2276i0420A32204
14967A86996K94374f2437B19411Q755C6761l837e5613A45351c2926A57550Q9316
14956B46866a81798B29532q7142Q9402L0099K7876A19558J16324j7873l982G9841
$$ plain form
15036 128396 -218406 183474 -246729 137560 277663 160993 187704 279126 217488 320909
15026 320909 15406 317401 216637 193315 350962 227383 258947 164836 315209 -255347
15015 150229 54663 428199 -14112 431014 -53354 -268672 235928 245652 -27056 -82090 180628
15003 -96135 -166833 290574 197860 325184 273008 167716 204997 213656 322607 310311 141456
14991 209359 602407 -126946 373975 357140 -99663 99253 182757 72491 117731 162452 63823
14979 126957 220186 -230064 275809 8193 189171 50320 98579 23013 95289 -90420 132204
14967 186996 481370 -62437 219411 228166 36761 32924 -55613 145351 -32926 157550 246866
14956 246866 -181798 229532 142390 231792 261891 289767 119558 235882 218009 214027 79841
14944B07757J53433k2506J09347K2071A16063C7352K69642E0426K50347d9101
14933C97258j71004j06488L33080k22993A08871K47026F0760M29074j20815A55723
14922B37161p9501M6226J74758j05266H4844K77655j38072K83579j78256h0154
14911A22626K02241A50433N3982O2546I9660P4215J26391n0492J23807l1597g6414
14899I7691c0645B33638D2515J77776f1243A5419K06756j694K33284A82084K13555
14888C95639A57257R8460n9866J90141F4041J43444P3600Q5666j17307J66407
14878D15851A82644R0790k6024J92391j78597K11227K7738B39732j16834B2919
14867C51423l9144J28659A56898J38687K06154A31046m2233L40728G9423O6334
$$ plain form
14944 207757 361190 338684 448031 470102 116063 37352 306994 50426 300773 -49101
14933 397258 226254 119766 452846 229853 108871 355897 60760 489834 369019 155723
14922 237161 157660 203886 378644 273378 84844 362499 224427 508006 329750 -80154
14911 122626 324867 150433 204415 266961 99660 173875 300266 249774 373581 341984 -76414
14899 97691 -30645 233638 42515 220291 -61243 15419 222175 220481 453765 182084 395639
14888 395639 157257 255717 195851 385992 64041 207485 281085 366751 249444 415851
14878 415851 182644 273434 247410 439801 261204 472431 500169 239732 122898 22919
14867 351423 312279 440938 156898 295585 501739 131046 88813 429541 79423 145757
14857A45757K54155A77900p255L88472B33437r6038K70897l1317A71639K55188
14847D26827A93521O3893j9586M27894l32340j08459R3226L01041C00378K69305
14837E69683B59743K24758r7868j24551J12230J42619j11613d163C64229A11481
14826F70466j94127I6406K50521q5061p9215K87951J62217k42175j618M4080L9887
14815D72993J27977J00802j95804j18307N4803J96587m6469j86303k6596j89386
14805A90297J42127K02041j54910r160P1293J5930B16331K03906J43787l4568
14795E29456q2401k04841J23129O0015J60297J07699l34101F2622M43271J27647
14785F33540k56524A72567M34390I8626M28778k22657K98344j62618k04976K76795
$$ plain form
14857 145757 399912 177900 170645 559117 233437 137399 408296 376979 171639 426827
14847 426827 193521 257414 237828 665722 333382 224923 318149 619190 300378 569683
14837 569683 259743 484501 386633 262082 374312 516931 405318 -4163 364229 111481
14826 670466 476339 96406 346927 261866 182651 470602 632819 390644 389026 433106 472993
14815 472993 600970 701772 505968 387661 442464 639051 592582 406279 379683 190297
14805 190297 332424 534465 379555 370395 441688 457618 216331 420237 564024 529456
14795 529456 447055 242214 365343 425358 585655 693354 359253 62622 505893 633540
14785 633540 377016 172567 606957 98626 527404 304747 603091 440473 235497 512292
14775E12292m9667J2037j5950J98994B51105L78593j4094j62575M0647j80929
14765C12747M20035j72876j63592K11940j85009j81876M43030j22783L7783J95050
14755G94449k454k62397m3656J2633K13046l41507J29480J96241J23655k86302
14745E33188J4245N0606o3922N7934m8508q636K66001j12536r9984J9275J66420
14734G74083C76244m424L00569j80583J7211j04221K11110k83916J65608j09668
14724C87930L31758n1364J81633j91981J26273k98236L10117M600C46923J91807
14714E38730J48315j75538j24412L24772l06740L07012j24250j67119M8267R6242
14704E65279L2766J55313N9322j52977r4786K17812j23960j15539k09869K32871
$$ plain form
14775 512292 462625 474662 458712 657706 251105 629698 615604 453029 493676 312747
14765 312747 732782 559906 396314 608254 423245 241369 684399 561616 599399 794449
14755 794449 791995 529598 485942 498575 711621 370114 499594 695835 819490 533188
14745 533188 547433 598039 534117 592051 543543 534907 800908 688372 588388 607663 774083
14734 774083 376244 371820 672389 491806 509017 404796 615906 331990 497598 387930
14724 387930 719688 668324 849957 657976 784249 486013 796130 800730 346923 538730
14714 538730 687045 511507 387095 711867 405127 712139 587889 420770 469037 565279
14704 565279 598045 753358 812680 659703 564917 782729 658769 543230 333361 566232
14694E66232K26395j91944M56471l37933j6940K23712k33885K96087k68217J36844
14684H56822J86599k49446j6238J16593j66189J24121l03868J81194L2345K10844
14674I72777m31318J56485J30134M44862E08081M30241j93808N3244L7253k13110
14664F21901P96991E92236M50588k42697k4142Q2758n1273L79955j34303q8397
14654I64725J29628k93042L16993k94018M7853k4175N950K91058J78694m04773
14644I18893K14751k13021p016N4119L70552j70768r2915j19513L24131j30625
14634A148588K05245l00581O6087n3525J54124j95990M58249m39953K28220J49395
14624A419859k19011o6306k33858K68800j1307J26033l07318J60032q9018M57569
$$ plain form
14694 566232 792627 600683 1057154 719221 702281 925993 692108 988195 719978 856822
14684 856822 1043421 793975 777737 894330 728141 852262 548394 729588 761933 972777
14674 972777 541459 697944 828078 1272940 508081 938322 744514 797758 835011 621901
14664 621901 1418892 592236 1042824 800127 775985 858743 807470 1187425 1053122 964725
14654 964725 1094353 801311 1118304 824286 872139 847964 853914 1144972 1323666 918893
14644 918893 1133644 920623 913607 967726 1338278 1167510 1074595 955082 1279213 1148588
14634 1148588 1353833 1053252 1119339 1065814 1219938 1023948 1482197 1042244 1270464 1419859
14624 1419859 1200848 1134542 900684 1169484 1158177 1284210 976892 1136924 1047906 1505475
14614A505475n33866J71975J31516K28067k62703p4047R5718k10455R6590M66994
14604A615264k66430K01127k21677J22036O646l9828J39702k72148K35887j02572
14594A418007J6465j79683J5222J80872l4744J04345K6275J95274p1936J7797
14584A687894l28035J81336J30437M1817r4356k449j87813J8903n1122R16987
14574B313599l92497m63939J90502L00755l46229M81839L89751n02358O1986K87586
14564B320995r8688j99717j18189K80272O2772L0778J67113J28915Q6466J78369
14554B839086K51572K11120M43178L12410Q70511J933184M114396Q909272J5617309
14545C5502038K272216j5997439A0747056n196907k272435j129831m30072Q760
$$ plain form
14614 1505475 971609 1143584 1275100 1503167 1240464 1166417 1262135 1051680 1148270 1615264
14604 1615264 1348834 1549961 1328284 1450320 1456966 1417138 1556840 1284692 1520579 1418007
14594 1418007 1434472 1254789 1270011 1450883 1416139 1520484 1546759 1742033 1670097 1687894
14584 1687894 1359859 1541195 1671632 1713449 1619093 1616644 1428831 1447734 1396612 2313599
14574 2313599 1921102 1457163 1647665 1948420 1602191 2084030 2473781 1971423 2033409 2320995
14564 2320995 2222307 2022590 1904401 2184673 2247445 2278223 2445336 2574251 2660717 2839086
14554 2839086 3090658 3301778 3744956 4057366 4927877 6861061 10975457 19884729 35502038
14545 35502038 37774254 21776815 10747056 5550149 3277714 2147883 1717811 1726571
14537A726571k38169O0750K75107k49333p994K26336Q9020k05800J0500J53109
14527A840097N9460L45314j72488j32228P1711O6349k02346K07995N39695l77079
14517B246480k92874K46174O1875m2089J12327J41818j46623J39810m6975j72541
14507B247382M23056j34726O6179K8481q0501M6265M2183l0522Q3518J84131j78412
14496B697034p8375J64534j14361K86993J73115l33836L015J54036K43656j2459
14486C183352J09553m95718K77268J02336l2213L594L25658j52507r0506J56955
14476C387772J81182p3956K13095m61886N06825o9790m03503L97110p5227L62180
14466C963802j10096J22116J88152O1985k25467K50680K23559k33761l5p1419
$$ plain form
14537 1726571 1488402 1549152 1824259 1574926 1566932 1793268 1882288 1676488 1686988 1840097
14527 1840097 1899557 2244871 2072383 1940155 2011866 2078215 1875869 2083864 2623559 2246480
14517 2246480 1953606 2199780 2261655 2219566 2331893 2473711 2327088 2466898 2419923 2247382
14507 2247382 2670438 2535712 2601891 2630372 2549871 2596136 2638319 2607797 2691315 2875446 2697034
14496 2697034 2618659 2783193 2668832 2955825 3128940 2795104 2798119 2952155 3195811 3183352
14486 3183352 3292905 2797187 3074455 3176791 3144578 3148172 3473830 3321323 3230817 3387772
14476 3387772 3568954 3494998 3708093 3246207 3753032 3683242 3279739 3676849 3601622 3963802
14466 3963802 3853706 3975822 4163974 4225959 4000492 4251172 4474731 4240970 4240935 4169516
14456D169516j76435K96128K5777R0868L67445R5420j25490o5065N3658K13827
14446D945649k26921J24778K02850Q8385k26676q0078P95840k29463K90024m46895
14436E237493L54233j5850N1379J81516R2289k33500J52288O79159p46429N84015
14426F336593n0279j13471M21561K3316j00258p6628L08936m5801K44651J00759
14416G049379K25767k4136L02332j41429K98056k36952K9230L65251N4450K2334
14406G944282J18508L35646J44386k64932L88480K85435K67134m25183M53206
14397I246962L44191m15725N42651P1926L19330J93149J9251O0749L26473L79920
14387A1088877j23798L38142L1089j18745J013937j4868M6476J88861L61039K79413
$$ plain form
14456 4169516 3993081 4289209 4314986 4405854 4773299 4868719 4743229 4678164 4731822 4945649
14446 4945649 4718728 4843506 5046356 5134741 4908065 4827987 5623827 5394364 5684388 5237493
14436 5237493 5591726 5575876 5627255 5808771 5901060 5667560 5819848 6499007 5752578 6336593
14426 6336593 6286314 6172843 6594404 6617720 6517462 6440834 6749770 6703969 6948620 7049379
14416 7049379 7275146 7251010 7553342 7411913 7709969 7473017 7502247 7867498 7921948 7944282
14406 7944282 8062790 8398436 8542822 8277890 8666370 8951805 9218939 8793756 9246962
14397 9246962 9591153 9175428 9718079 9790005 10109335 10302484 10321735 10382484 10708957 11088877
14387 11088877 10965079 11303221 11334310 11215565 12229502 12214634 12261110 12449971 12811010 13090423
14377A3090423J54777M62213L15458j37412N59405q4577N90810K72059K11602
14368A5434758N16737K61365L47452L53146K93991L88988j462R69978k21444N31065
14358A8874574P88846L34642N06665L76956J96805O62338M42299P68002L95068
14349B3346195L23125J010845P03398P37586M12184Q92507L34405N69657J082223
14340B9412125P69018Q78206Q52592P07735J010086J132836Q12690J246606J135758
14331C7957652O21285J611390J050676Q02845J947156J420296J705878J505915
14323D8623093J401648J685602K028061J931600K251943J681142K386339K743469
14315F4732897K235377K512105K522378L211743K900244L380960L441798L438514
$$ plain form
14377 13090423 13245200 13707413 14022871 13885459 14444864 14360287 14951097 15223156 15434758
14368 15434758 15951495 16212860 16560312 16913458 17207449 17596437 17594975 18564953 18343509 18874574
14358 18874574 19663420 19998062 20504727 20881683 21078488 21740826 22183125 22951127 23346195
14349 23346195 23669320 24680165 25383563 26121149 26533333 27425840 27760245 28329902 29412125
14340 29412125 30181143 31059349 31911941 32619676 33629762 34762598 35575288 36821894 37957652
14331 37957652 38578937 40190327 41241003 42043848 43991004 45411300 47117178 48623093
14323 48623093 50024741 51710343 53738404 55670004 57921947 59603089 61989428 64732897
14315 64732897 66968274 69480379 72002757 75214500 78114744 81495704 84937502 88376016
14307H8376016M195263L816556M856656M286321M910428N326114N789965N795320
14299A27352639O539781O554224P369884P538917Q141576Q896026Q979909J0103933
14291A91476889R967830J1379037J1487744J2501067J2979515J3979762J3984159
14284B77756003J5158147J5158311J5874689J6157146J5958347J6347421J5622129
14277C88032193J5158035J4150370J3114408J0923814O599274K128618K92776
14270D50399488O02538j480451J884254j418226m757182q823910j1205868j2433504
14262D12767139j3608905j4432937j6138631j6112029j6555142j6165816j5972397
14255C03781282j5669260j4065294j3788820j3727454j3148756j2257520j1768898
$$ plain form
14307 88376016 92571279 96387835 101244491 105530812 110441240 115767354 121557319 127352639
14299 127352639 133892420 140446644 147816528 155355445 163497021 172393047 181372956 191476889
14291 191476889 201444719 212823756 224311500 236812567 249792082 263771844 277756003
14284 277756003 292914150 308072461 323947150 340104296 356062643 372410064 388032193
14277 388032193 403190228 417340598 430455006 441378820 447978094 450106712 450399488
14270 450399488 451002026 449521575 451405829 449987603 445230421 436406511 425200643 412767139
14262 412767139 399158234 384725297 368586666 352474637 335919495 319753679 303781282
14255 303781282 288112022 274046728 260257908 246530454 233381698 221124178 209355280
14248B09355280j1024958j0395055r760042q906894q202854p959371p754565p427180
14240A37924361o603249o108867n765209n244474n189430n156865m564420m335113
14232I4956734l854451l656688l685045l644325k961868l268747k904726k722855
14224F8258029k549505k377208k241354k420788j870167j646302k153828j957460
14216E1041417j705970j453576j452234j217128j637991j275276j259383j409098
14208C9630761j130998p78313r58997j038668j474214o10028r46871p85392q75858
14199C1031422o71337p42170r61861r23839j073463k6791r02039p28011p76588
14190B4225323n26306n52909o63961k19245o51751n01444q61970K65291r96768
$$ plain form
14248 209355280 198330322 187935267 178175225 169268331 161065477 153106106 145351541 137924361
14240 137924361 131321112 125212245 119447036 114202562 109013132 103856267 99291847 94956734
14232 94956734 91102283 87445595 83760550 80116225 77154357 73885610 70980884 68258029
14224 68258029 65708524 63331316 61089962 58669174 56799007 55152705 52998877 51041417
14216 51041417 49335447 47881871 46429637 45212509 43574518 42299242 41039859 39630761
14208 39630761 38499763 37721450 36762453 35723785 34249571 33639543 32692672 31907280 31031422
14199 31031422 30360085 29617915 28656054 27732215 26658752 26631961 25729922 25001911 24225323
14190 24225323 23699017 23146108 22482147 22262902 21611151 21109707 20247737 20513028 19516260
14181A9516260j47920n59149j28929n84648l01122l59632n49764l98012n03860
14172A5983224K11236k73569q09976n4819k19750l65881j22130n54445k91199
14163A3502691j97497j36438m81173J561J0408n47468N4575k99037k8542o51091
14153A1227989J2235l42895N1020o31442M94653o23556J53871l44953q6539j91500
14143I718883l44469j66711J39513k26708J38672n38314L95340m09165l24817
14134H382224j3057r3450P4974k22574k55400l74476N8862j88665J38917J21041
14124G628396l71140k32355J41162k05330K76491l55895l08587n31850J67205
14115F208097L99939j07294k10365m95936O07211n66410O3993P1201K54413p29687
$$ plain form
14181 19516260 19368340 18809191 18680262 18095614 17794492 17434860 16885096 16487084 15983224
14172 15983224 16194460 15920891 15110915 15056096 14836346 14470465 14348335 13793890 13502691
14163 13502691 13305194 13168756 12687583 12689144 12699552 12152084 12206659 11907622 11879080 11227989
14153 11227989 11240224 10897329 10948349 10316907 10811560 10188004 10341875 9996922 9910383 9718883
14143 9718883 9374414 9207703 9347216 9120508 9259180 8720866 9116206 8707041 8382224
14134 8382224 8369167 8275717 8350691 8128117 7872717 7498241 7557103 7368438 7507355 7628396
14124 7628396 7257256 7024901 7166063 6960733 7237224 6881329 6572742 6040892 6208097
14115 6208097 6608036 6500742 6290377 5794441 6401652 5835242 5899235 5970436 6224849 5495162
14105E495162j89196J17251K9563k3187P927j10777k18031K36134j45610j7670
14095E181566K10368p17191L15873k9152j81721Q2632p2387k0635j39431n63578
14085D066344N11426k35510J96722m08547P3529J06667m80244J08134L19478l30949
14075C927050j40968L28939k42624J63016k48663J59362j45084j4096k89647J53344
14065C650629l05852J88738k8135o7458P8226J54491k15456K23777l5538k29300
14055C414122O3746l36684M80584k62345k29849K1733k1225O6107k26771m1405
14045B928013j46963L21767k39703k36948N4558M16062m60723J61899L9434L5015
14035B872411m1064j00042l50358J73159K67592o9764L2066M8621k95913j93896
$$ plain form
14105 5495162 5305966 5423217 5452780 5429593 5437520 5326743 5108712 5344846 5199236 5181566
14095 5181566 5391934 4674743 4990616 4961464 4779743 4862375 4789988 4769353 4629922 4066344
14085 4066344 4577770 4342260 4538982 4130435 4203964 4310631 3830387 3938521 4257999 3927050
14075 3927050 3786082 4115021 3872397 4035413 3786750 3946112 3801028 3786932 3497285 3650629
14065 3650629 3344777 3533515 3505380 3437922 3516148 3670639 3455183 3678960 3643422 3414122
14055 3414122 3477868 3141184 3621768 3359423 3129574 3151307 3130082 3196189 2969418 2928013
14045 2928013 2781050 3102817 2863114 2626166 2680724 3096786 2636063 2797962 2837396 2872411
14035 2872411 2831347 2731305 2380947 2554106 2821698 2751934 2784000 2832621 2536708 2342812
14025B342812K44588l31872J61849J74013k98401K01650k19359r0285K20501k20081
14015B185415M9363N0281j02386K30769n19256R5454p653r2282K31647k40141
14005A881211m9380J64046j95398J09047J08572j92531O8536p4976p739k31288
13995A580100K42681r2186Q4083l10278K46043O89001P14893L442352P902332
13986A4499021J6188037P516146j2198554A2880984n516663k050332r61810n86954
13978C765225k45066n53138l39580q8254p8648P8634k71495j20660K19093m4917
13968B321194j13124j26473m6975J9892J73914l64042N9456L7139j85121L31543
13958B107403j05180j26811r941J94973l65441q8110j04317J75670J31607n9097
$$ plain form
14025 2342812 2587400 2255528 2417377 2591390 2292989 2494639 2275280 2184995 2405496 2185415
14015 2185415 2234778 2285059 2182673 2413442 1894186 1989640 1981987 1889705 2121352 1881211
14005 1881211 1831831 1995877 1800479 1909526 2018098 1825567 1894103 1819127 1811388 1580100
13995 1580100 1822781 1730595 1814678 1504400 1750443 2439444 3154337 6596689 14499021
13986 14499021 30687058 38203204 26004650 12880984 7364321 5313989 4352179 3765225
13978 3765225 3520159 2967021 2627441 2539187 2460539 2539173 2267678 2147018 2366111 2321194
13968 2321194 2208070 2081597 2034622 2054514 2228428 1864386 1923842 1960981 1775860 2107403
13958 2107403 2002223 1875412 1865471 2060444 1695003 1606893 1502576 1678246 1809853 1750756
13948A750756j65795Q1299N169m1812Q2709k60610K22425l26138O8331R4404k51352
13937A259386K35084j03682J68791j68772J14399r349l3763j27170j5200P6464
13927A396188o5188J96995j78287k5488J42183k04448Q3519L4020R378r9305k15065
13916A074502P05467k52559k01374J24247k65529K46281k35720J75580r3801r2445
13906A184649l7650k3469r9465o8463J59372L07452m7673l76197K00593J20086
13896A319235J05453k99024K195O5194k858o3223M9944J91544l12019K0534l685
13885A073290j16012Q6188k54521M04623l86239L00968j25676K3545k02858J57899
13875I61207K39202j83404k5527n9138Q8549o8824J34712k70903K86028l10746
$$ plain form
13948 1750756 1584961 1666260 1671429 1629617 1712326 1451716 1674141 1348003 1416334 1510738 1259386
13937 1259386 1494470 1390788 1559579 1390807 1505206 1495857 1462094 1334924 1319724 1396188
13927 1396188 1331000 1527995 1349708 1324220 1466403 1261955 1345474 1379494 1388872 1289567 1074502
13916 1074502 1779969 1527410 1326036 1450283 1184754 1431035 1195315 1370895 1277094 1184649
13906 1184649 1146999 1123530 1024065 955602 1114974 1422426 1374753 998556 1199149 1319235
13896 1319235 1424688 1125664 1127859 1193053 1190195 1126972 1176916 1368460 1056441 1076975 1073290
13885 1073290 957278 1043466 788945 1193568 807329 1108297 982621 1006166 803308 961207
13875 961207 1200409 1017005 991478 932340 1020889 952065 1086777 815874 1101902 791156
13865G91156n4239J78312L1867j09379R1164K0935O9956L008k22509m1532J43524
13854I02263r5852J00992j15858k2038L27649j65930q958j80144M81088E79762
13843A013722O6493D98760L60819j08291k40321K14577q561R6754N8646o5371
13833H07012M1175J34357k74973n317k22304L20362L67431n25853j5027J19452
13823G46315M3591k55957K91590J61335k39933L0910k04405L2168N79651n54866
13813F30399J6369l07194K75405o1753q8369K67800J74635K38486m50998k72300
13803D22480P06918m32024k02083L42294C62266K15226k40728K17577J48278J52736
13793H55355k91404L0263j58656K95608j82952J35298n2892L36834k27281m4826
$$ plain form
13865 791156 736917 915229 947096 837717 928881 949816 1019772 1022780 800271 758739 902263
13854 902263 806411 907403 791545 769507 1097156 931226 922268 742124 1223212 579762
13843 1013722 1080215 498760 859579 751288 510967 725544 716983 813737 872383 807012
13833 807012 848187 982544 707571 702254 479950 800312 1167743 641890 626863 746315
13823 746315 789906 533949 825539 986874 746941 777851 573446 605614 1185265 630399
13813 630399 646768 339574 614979 553226 464857 732657 907292 1145778 694780 422480
13803 422480 1129398 697374 495291 837585 362266 577492 336764 554341 702619 855355
13793 855355 563951 594214 435558 731166 548214 683512 630620 967454 740173 695347
13783F95347M1514J9234n6613j56634m298K80712k0163j13842J10044l83799N45872
13772I57374m49250j31594p1101L95276j9599N1651l51447I7819N82167j86784
13762D93202j28995o1669K17962P3960J00797J91603k85978J22182j32950J43034
13752G33148k41859J20475k51959L87107J3489k47206L75522D33307j06157Q3517
13742D10667L61930j06086j1172j30894M5068k31168J9338J10579B30591N43993
13732G74584j73933j56561j01761J57842K51604j70647j51743p9141m0959L68100
13722F77385k47950p601K37588C12939K59271o869J6317j33757K05425C2876M17304
13711D50180B23513K90906j19462k7262A23982M66680j33861M8384j71396L76875
$$ plain form
13783 695347 736861 756095 699482 542848 538550 819262 799099 685257 795301 411502 957374
13772 957374 508124 376530 305429 700705 681106 732757 381310 97819 679986 493202
13762 493202 364207 302538 520500 594460 695257 886860 600882 723064 590114 733148
13752 733148 491289 611764 359805 746912 760401 513195 888717 433307 327150 410667
13742 410667 772597 666511 655339 524445 569513 338345 357683 468262 230591 774584
13732 774584 600651 444090 342329 500171 751775 581128 429385 350244 309285 677385
13722 677385 429435 421834 659422 312939 572210 565341 581658 447901 653326 32876 450180
13711 450180 223513 514419 394957 367695 123982 590662 456801 505185 333789 710664
13701G10664B66312O5689A63173K63503O3603M3407R0857q0083J05297k53057
13691C96700K33591C05558L10636j33032K05538j54963J0019O6629j58121K5842
13681D78106F9107M58428j26293l1621A65573K12613K2608n0077L7890q6911J30036
13670D31732A80835a09982B01588m588J25265m1288L26026H9600M08834j91433
13660C07001J58225L9521j08612R0086O1487r607A97662K14973J10869j55204
13650C68300k3989K55285B85915Q241J70455h5322C4983K15771J69256l3675J12775
13639D99110k23727J42276d4409D16038P3632j725F5606M09252m1699L54317A96824
13627F14448p3204B39220J10720R5561m108j94141K9126J04650j1041A31764K09573
$$ plain form
13701 710664 266312 332001 163173 426676 490279 533686 624543 544460 649757 396700
13691 396700 630291 305558 616194 483162 688700 533737 543756 610385 452264 478106
13681 478106 69107 527535 401242 369621 165573 378186 400794 350717 388607 301696 431732
13670 431732 180835 -109982 201588 197000 322265 280977 607003 89600 498434 307001
13660 307001 465226 504747 396135 486221 547708 538101 197662 412635 523504 368300
13650 368300 344311 599596 285915 294156 464611 -85322 34983 250754 420010 386335 499110
13639 499110 275383 417659 -44409 416038 489670 487945 65606 474858 433159 787476 196824
13627 614448 541244 239220 349940 445501 441393 247252 276378 381028 369987 131764 341337
13616C41337A57325J29860K3828N0361A21271l2395J93727A10551L3173k0351
13606A23373a61539B60943J32345R5321l1586j3076j88208E7087J14437J26317
13596B97841p0962a28312F59882C5315K14958j20566J21534k8435K25194n3610
13586C94390J279N6543H3079J56653H6244J44876J6411a27938C49139A07932M1211
13575A49143L276J9253K62339B00370M41115o5702k56264M966A39705K28131G4435
13563C76326J17885j39610K12968o4264k36415A9948K91689A41414J86135j61724
13553A65825K19553l2242a26009C73469j58020R4430K0418p5598J5131j05457
13543A64373R0395Q8995c6645C26909L00966B5200K23214J24372J67557m338j45827
$$ plain form
13616 341337 157325 287185 311013 361374 121271 88876 282603 110551 143724 123373
13606 123373 -161539 260943 393288 488609 457023 443947 255739 57087 171524 297841
13596 297841 226879 -128312 659882 35315 250273 129707 251241 222806 448000 394390
13586 394390 395669 452212 83079 239732 86244 231120 247531 -127938 349139 107932 149143
13575 149143 152419 171672 434011 200370 641485 575783 319519 324485 139705 367836 74435
13563 376326 494211 354601 567569 503305 266890 19948 311637 141414 327549 165825
13553 165825 385378 353136 -126009 373469 215449 309879 330297 254699 269830 164373
13543 164373 254768 343763 -36645 326909 627875 25200 248414 372786 540343 536005 390178
13532C90178I2286K14072P968E8527L68515n7037M1250A77136q3355k1538K79363
13521C51606L8946J25626B09495I890J93440K01590j96487R0242p9151K9034p6660
13510A71898J08807h0827B66922K10939A79487K9181i8430A20341L03472p6490
13500C47323D4982Q6087n4395J62557E9704c6010F451L21449M3628c3218B58607
13488C56733L4159F2345L36329A10658J64905A12795K4987D2480L71626a4304
13477A68718K44472J13722A18088a06094C79128J10124A03370L81319e350o5096
13467g0446A62695A137P0583J59844J24247k3466j13266A4187K25142A14999K85928
13456D00927k9879A59177K24200C0555a4864B21743L7766I9700L12841H1481J72493
$$ plain form
13532 390178 92286 306358 314326 58527 427042 370005 411255 177136 93781 72243 351606
13521 351606 390552 516178 209495 9890 203330 404920 208433 298675 219524 248558 171898
13510 171898 280705 -80827 266922 477861 179487 208668 -98430 120341 423813 347323
13500 347323 44982 131069 76674 239231 59704 -36010 6451 327900 371528 -33218 258607
13488 356733 390892 62345 398674 110658 275563 112795 137782 42480 414106 -14304
13477 168718 413190 526912 118088 -106094 379128 489252 103370 484689 -5350 -70446
13467 -70446 162695 1137 71720 231564 355811 332345 219079 14187 239329 114999 400927
13456 400927 371048 159177 383377 30555 -14864 221743 259509 99700 412541 81481 253974
13445B53974L37926B48315r545b05973R1492C06931L1299j63202a14086G276J47429
13434A54705J24951J21314I3505J91395O2371a28766N8495B03748J82638g1340
13423D45491j06075L3975A66549J23392Q7709A87281O542D3134g0249l5811B00405
13411D3018K26246A17894R7203G7255J21868M9055m4540A4192g6184j25017B53478
13399A46365b313j45132f1824p6m1190H11K55119J32442o9080i6616E941K86515
13387B92456K63183A88057m9199k3128J8112o3046K644j7947O308J24519Q161
13376A94481d1461o976G5271B5129Q1354J91968j02264J47719H9893Q4470J79326
13365C53689E6376J69788J26191E1103a78079h5568k9739B91397j11269M9970
$$ plain form
13445 253974 591900 248315 238770 -205973 -114481 306931 338230 175028 -114086 7276 154705
13434 154705 279656 400970 93505 284900 347271 -128766 -70271 203748 386386 -71340
13423 445491 339416 373391 166549 289941 377650 187281 193823 43134 -70249 -106060 200405
13411 43018 269264 117894 215097 77255 199123 248178 203638 14192 -76184 -201201 253478
13399 146365 -2313 -147445 -61824 -61900 -103090 811 255930 388372 319292 -96616 5941 292456
13387 292456 555639 188057 138858 115730 133842 70796 73440 55493 61801 186320 194481
13376 194481 -41461 -48437 75271 25129 106483 298451 196187 343906 89893 174363 353689
13365 353689 56376 226164 352355 51103 -178079 -85568 -115307 291397 180128 230098
13355B30098k1461J44294q5352H5131J79726J59419r5241F1306P2612O3044P8327
13344B75289k0602R485O9728E7255K29276A01636K28169m3268L2590L4402j14095
13333B39434C0566J44052J10479P4267a5494C21484k5329A14738K62579A04037
13322c0068B7192P1101K02848I4628J12539r4876J78637E2307J63135H5588J76818
13311B62406J33499r1103A43492J41074r2542j572k3254J5189l6038K39697o7074
13300C18972K1927o724r912j59839e5659A91009d1794A40962k5735E2198K8641
13289H0839j7918M3847L9111L4530B5235J90739B0603K53615E2605J21261G2955
13277e5008j24954A59777j3955B1155a24148j7999A18016J79939A13475P8422
$$ plain form
13355 230098 208637 352931 267579 85131 264857 424276 329035 61306 133918 196962 275289
13344 275289 254687 264172 333900 57255 286531 101636 329805 286537 319127 353529 239434
13333 239434 30566 174618 285097 359364 -15494 321484 296155 114738 377317 104037
13322 -30068 27192 98293 301141 94628 207167 112291 290928 52307 215442 85588 262406
13311 262406 395905 304802 143492 284566 192024 190452 167198 182387 146349 386046 318972
13300 318972 340899 334175 324263 164424 -55659 191009 -41794 140962 115227 52198 80839
13289 80839 62921 106768 145879 180409 25235 215974 20603 274218 52605 173866 72955
13277 -55008 -179962 159777 145822 21155 -124148 -142147 118016 297955 113475 191897
13267A91897E6718J05527C2548K73354A22534a79168A09162L3919K8308B349f5224
13255a87675E3381i114B19657a11000e91C5058O2119N6762o9106M08005k45720
13244B47118e191A1230e8744B37684a02898A71408Q7590b2197B67308B4965J4059
13233C9024a54705B43355d7428A73861a81964m4275K3718f3837n6251B44266B834
13221I1082Q8455o4938G721a87191H6064J8891L8720A5189J02816L1749a5132
13209g7277n9179C14009j39691a16989l4721p0772I0661J2953B3793K09254E8098
13197D24954j07694k8050E5642a04498F9053R0705K57432a9566C45142A2173a03538
13185a6678n4965A42523P6239D1981i9723C108b18217A85565G2335K72642C7329
$$ plain form
13267 191897 56718 162245 32548 305902 122534 -179168 109162 143081 171389 2349 -65224
13255 -187675 53381 -9114 219657 -111000 -591 35058 97177 153939 84833 492838 247118
13244 247118 -5191 11230 -58744 237684 -102898 171408 258998 -22197 267308 24965 39024
13233 39024 -154705 243355 -47428 173861 -181964 -226239 -202521 -63837 -120088 244266 2834
13221 91082 179537 114599 7721 -187191 86064 104955 143675 15189 118005 149754 -15132
13209 -77277 -136456 314009 174318 -116989 -151710 -222482 90661 103614 23793 233047 58098
13197 424954 317260 289210 55642 -104498 69053 159758 417190 -19566 345142 12173 -103538
13185 -16678 -71643 142523 218762 41981 -99723 3108 -218217 185565 72335 344977 37329
13173H0173l321L85380A63700M728a20567M1058A4372b54279D1281a93933c6856
13161F33838a06239A2649a80047E46617D4432J21316D3048L4466C1682O6919d8826
13149B622a19105j35653A2129d62182A23153j9858b33768C5939K83173J547i9893
13137B02359B2274k722a2671A54582D5878D632b7525p5593C19927I205J39454
13126A48659d7724A19112E7980a22813b6797A6805C380K30541k0847l5199b1578
13114E9951a69120P2333a6960q4190K5434f74G4052g818F4275a13437d2098A81642
13101c312F22128b7752D2290J8686J09554p1690l0198J03483c1473B05101B2490
13089d1999j3647F8545j9799b11971k3483A57146O5553H8346L74525D8661L31758
$$ plain form
13173 80173 76852 462232 163700 168428 -120567 -79509 14372 -254279 41281 -193933 -36856
13161 633838 -106239 12649 -180047 546617 44432 165748 43048 77514 31682 98601 -48826
13149 2622 -119105 -254758 12129 -462182 123153 103295 -233768 35939 319112 320659 -99893
13137 202359 22274 19552 -12671 154582 45878 4632 -27525 -103118 319927 9205 148659
13126 148659 -47724 119112 57980 -122813 -26797 16805 3380 233921 213074 177875 -21578
13114 59951 -169120 -96787 -16960 -101150 -75716 -674 74052 -7818 64275 -113437 -42098 181642
13101 -3312 622128 -27752 42290 60976 170530 98840 68642 172125 -31473 205101 22490
13089 -41999 -55646 68545 48746 -211971 -235454 157146 222699 88346 462871 48661 380419
13078C80419A46305k5914b57787A35592a65353C34613j04569e277A51653K0305
13068A71958h4146j73699B0342c36468F6320K98745j38071l1363a24511A16549
13057a97070f6677C55770e3431A05089a25156c0966j95490B39247K31727A81661
13046a46403A8458J02334A885b1501B16991H8024m76e267j08399j10705c1378
13034C42587g8572A32060b7011A44139b27741A32986M6708j3732k4158k8974f2193
13022C16021D8565J41520e5948D8184c25359G1443a47269C23963d956H1648a78054
13010C47151A35885C7071J49938k9415K16092A68234a9939D2258J18483E9422
12999A67638G3974B9843a45488C50726a3284K741D13739I4188B1017g818C31143
$$ plain form
13078 380419 146305 120391 -257787 135592 -165353 334613 230044 -5277 151653 171958
13068 171958 -84146 -257845 20342 -336468 66320 365065 226994 195631 -124511 116549
13057 -197070 -66677 355770 -53431 105089 -125156 -30966 -226456 239247 470974 181661
13046 -146403 18458 120792 1885 -21501 216991 88024 87548 -5267 -113666 -224371 -31378
13034 342587 -78572 132060 -27011 144139 -227741 132986 179694 165962 141804 112830 -62193
13022 316021 48565 190085 -55948 48184 -325359 71443 -147269 323963 -4956 81648 -178054
13010 347151 135885 37071 187009 157594 373686 168234 -19939 42258 160741 59422
12999 167638 73974 29843 -145488 350726 -13284 -10543 413739 94188 21017 -7818 331143
12987A36853e9054m9579M9209j61837A13388B9248M16790h7385A50615a7280k79741
12976b97021B96869D1089K68762H3956b128A85035A4057g4431K907H5799d79759
12964A17595O0124B762F5i4497D22899a06165A24682m2590J5521b29822e9024
12952B07936n2817O5524a37520A67148c2593B27166c7603j10070j44593C42647
12941B93755E2021A519K53137r1227C4681n758i4990L1658A9403d2620E3504M4388
12929I7892P8728c6020C5333N9962c11567f9714a4198j36763A24177h0891C04298
12917G9970J6445c8033B36953e6367D12158p1679I3640e7832j30657B9206K31885
12906B61091B2255a620j99095i684B28013b8971k75798g1967q0002A08757a52889
$$ plain form
12987 136853 -59054 -108633 -59424 -221261 113388 29248 446038 -87385 150615 -17280 -297021
12976 -297021 296869 41089 309851 83956 -2128 185035 14057 -74431 -71524 85799 -479759
12964 117595 177719 2762 65 -94497 422899 -106165 124682 82092 97613 -229822 -59024
12952 207936 155119 220643 -137520 167148 -32593 227166 -37603 -147673 -292266 342647
12941 293755 52021 1519 254656 163429 34681 28923 -94990 -63332 19403 -42620 53504 97892
12929 97892 176620 -36020 35333 95295 -311567 -69714 -14198 -150961 124177 -80891 304298
12917 79970 96415 -38033 236953 -56367 412158 340479 93640 -57832 -188489 29206 261091
12906 261091 22255 -1620 -200715 -9684 228013 -28971 -304769 -71967 -151969 108757 -152889
12894C88783a02139C381R5233Q2405h8501G8153e0525k2771L3868A49943a8789
12882a03216F8313a89247f4211a9532A15696c9217B22737a89804o1390F4953h5599
12870B37359j9830q5537a39869A07925j1443J25873e3441B88479F6821b70932
12859B05365b71995J20902p663A7023J59446k3651C5636L62090a52244N4379A46842
12847a46612A72873h8268d0385E3404e9422G2643c81473a48188A5272c7739B13749
12835A23678a44151L3860j00949A05316A1765a44168A54797a74424A7194J09361
12825A26555j5136a22125G0845a70479N8171N1874R828P117l0205H8864b28221
12813D33104a51777r2284A43047K82697a06279C37610c29623F2096b84165g9158
$$ plain form
12894 388783 -102139 3381 98614 181019 -88501 78153 -50525 -73296 -39428 149943 -18789
12882 -103216 68313 -189247 -64211 -19532 115696 -39217 222737 -189804 -251194 64953 -85599
12870 237359 217529 131992 -139869 107925 96482 222355 -53441 288479 66821 -270932
12859 205365 -271995 -151093 -158756 17023 176469 152818 35636 397726 -152244 -97865 146842
12847 -146612 172873 -88268 -40385 53404 -59422 72643 -381473 -148188 15272 -37739 213749
12835 123678 -144151 -110291 -211240 105316 11765 -144168 154797 -174424 17194 126555
12825 126555 111419 -122125 70845 -170479 -112308 -60434 -50606 -43489 -73694 88864 -228221
12813 433104 -151777 -244061 143047 425744 -106279 337610 -329623 62096 -284165 -79158
12802i4576k23122D3126J91908a88831B28052a07692K3300j65831A74269m6305
12792A27964a62973G3632a42699A60147F3405P7580a2603A07399e521A75410F1842
12780B73391F6916K97013A53022M3520a79417A0798c09884C9118g7379j4513D94
12768E5503K57633a46071j03156a04982l8594A1365J18088b98944a46695c3210
12757A36216d8119l0126d389C024P4850J15978q7430k3053a94284A11905O2701
12746A74606C2606Q4303m7395J07755D5860J05893a66772B84900c4035C81772
12735F5510J12726J40334E4221J30122K0309c8171A93633j2117e5649m7166C0524
12723d7225A41940o0828b16473A8355M537i8929C43568a28580E18298a8935m288
$$ plain form
12802 -94576 -317698 43126 235034 -188831 228052 -107692 -84392 -250223 174269 127964
12792 127964 -162973 73632 -142699 160147 63405 140985 -12603 107399 -5521 175410 61842
12780 273391 66916 363929 153022 196542 -179417 10798 -309884 39118 -77379 -91892 494
12768 55503 313136 -146071 -249227 -104982 -143576 11365 129453 -298944 -146695 -33210
12757 136216 -48119 -78245 -4389 3024 77874 193852 106422 83369 -194284 111905 174606
12746 174606 32606 116909 69514 177269 45860 151753 -166772 284900 -34035 381772
12735 65510 178236 318570 54221 184343 204652 -38171 193633 181516 -55649 -102815 30524
12723 -47225 141940 81112 -216473 18355 22892 -98929 343568 -128580 518298 -18935 -23223
12712b3223A04852f7826a1558A43376b172F39909C12685D3803L59g7784B04725
12700A41350M951m4451l3500a016j34113A64962J47926e7710J5093A17524R5356
12689B12880d7250j53039E824J38825f2824J9510D1905K9006l5258J89091j03889
12678A20855B2029J95625c89339B39385o5334j3626K03662l1528B8305J9406j5601
12667C2110J72875a48A71071P7832m6513h4321B1140E952e03920A28553d9243
12655B04575b01513C09097o7882H682M4598b64749B50875e3532j85458A69426
12644h4213d0194E2897a73385e9782j13414A19283a50667B10917e7872a6097k02195
12633b18292e7434k00953A42637P4957l8210L03757f8823B90929K17713F6754
$$ plain form
12712 -23223 104852 -67826 -11558 143376 -2172 639909 312685 43803 44162 -77784 204725
12700 141350 146301 101850 68350 -1016 -135129 164962 312888 -57710 -42617 117524 212880
12689 212880 -47250 -200289 5824 144649 -62824 -43314 41905 70911 35653 224744 120855
12678 120855 22029 217654 -389339 239385 174051 160425 364087 332559 28305 47711 32110
12667 32110 204985 -148 171071 248903 202390 -84321 21140 5952 -503920 128553 -49243
12655 204575 -201513 309097 241215 8682 53280 -264749 250875 -53532 -238990 169426
12644 -84213 -40194 52897 -173385 -59782 -173196 119283 -150667 210917 -57872 -16097 -218292
12633 -218292 -57434 -258387 142637 217594 179384 483141 -68823 290929 508642 66754
12622I6734K4555m622k8190a3757l9555H1487H495a0807k95729B66147a5720A05365
12609b284D658J05626J34689D708J33481a23023C29291I4387c6421E2612a37892
12597B79982p7365h7769A12035K20189Q3447j54188J25200j30452a25305A13401
12586B363a62430O6398n9669j20558A35769m9293L6657J4678a63747G0717a00478
12574A01952J283K1835B2412N0393R0791n5132a57197p3580h6693B28055a42067
12562c74204F4454K9619b02514E0652J32871C3099c0861n9971H0559d1744E874
12550b36587G4896i4227B5072A0360J56675f8711A54698G1071a24156M9569j29961
12539b04548I7226K77370B9304K4289R8288b18071E1701k0451A1009n082J82693
$$ plain form
12622 96734 121289 116667 88477 -13757 -53312 81487 8495 -10807 -306536 266147 -15720 105365
12609 -2284 4658 110284 244973 4708 138189 -123023 329291 94387 -36421 52612 -137892
12597 279982 202617 -87769 112035 332224 415671 261483 386683 256231 -125305 113401
12586 2363 -162430 -96032 -155701 -276259 135769 86476 123133 137811 -163747 70717 -100478
12574 101952 103235 125070 22412 72805 163596 108464 -157197 -230777 -86693 228055 -142067
12562 -374204 64454 94073 -202514 50652 183523 33099 -30861 -90832 80559 -41744 5874
12550 -236587 74896 -94227 25072 10360 167035 -68711 154698 71071 -124156 -74587 -204548
12539 -204548 97226 374596 29304 53593 151881 -218071 51701 31250 11009 5927 188620
12528A88620a9549k10186B22335d0045B29807b4302o0679C17215G3849c9362k51805
12517b91167H575N3388R2533J6063a51188A14100b8755o5689B10295g2125o2061
12506a34186l8065a5299l6351F843K3717P8150J45531b32166a0325D43270I2203
12494A48153c3996A15811h3934b68C8942e1137A03819m4663a34400b6803j78224
12483b05027B2046J21504b09700R1438H9090K66917A16372g5905m5126N9239k6656
12472h8448K7289j2076A52871L1062c7093j81807L167C90990E0412b05606f7556
12460i5253c6137A612O3514a64187h1276I6983B002J31376i2172A76410a25505
12448A06513M7324P4123B0961a93541d8609k5177l62276B98518C5442K03933E0655
$$ plain form
12528 188620 -19549 -229735 222335 -40045 229807 -24302 -84981 317215 73849 -39362 -291167
12517 -291167 8575 61963 154496 170559 -151188 114100 -28755 -94444 210295 -72125 -134186
12506 -134186 -172251 -15299 -51650 6843 30560 108710 254241 -232166 -10325 443270 92203
12494 148153 -33996 115811 -83934 -268 38942 -51137 103819 59156 -134400 -26803 -205027
12483 -205027 22046 143550 -209700 -118262 89090 356007 116372 -75905 -121031 -61792 -88448
12472 -88448 -61159 -73235 152871 183933 -37093 -218900 -215733 390990 50412 -205606 -67556
12460 -95253 -36137 1612 65126 -164187 -81276 96983 2002 133378 -92172 176410 -125505
12448 106513 153837 227960 20961 -193541 -48609 -73786 -436062 298518 35442 239375 50655
12436B47352b38357C76549c55486H1215j4994f7406G0077R8775b08516a5396j32007
12425a47403A24912A7266b93269o2200c0213q6254k56741a30502B61875a68970
12414b79103C16048c37414A16800J57348a81320e7986A92645E5219R1438b54353
12403A12455h3099A45511A0388K27386a10264K1178A02164J4744c01491a05920
12392A53644D2205c37703J38317B62226p8903b95292J45701N9856C2410b70439
12381c7366p2172b7608E8997g8119A98363J45636d4891B0062a3631O116q8023
12370i5538a555C0740e2j5139j83776B13944E6726r041a31547B5763Q1085k6340
12358H0508h2366e845B057a2250j31495c5355A05907c31432F5234h3292A26403
$$ plain form
12436 247352 -238357 376549 -355486 81215 66221 -67406 70077 168852 -208516 -15396 -147403
12425 -147403 124912 17266 -293269 -355469 -30213 -116467 -373208 -130502 261875 -168970
12414 -279103 316048 -337414 116800 274148 -181320 -57986 192645 55219 146657 -254353
12403 112455 -83099 145511 10388 237774 -110264 -89086 102164 116908 -301491 -105920
12392 153644 42205 -337703 -199386 262226 183323 -295292 -149591 -89735 32410 -270439
12381 -37366 -109538 -27608 58997 -78119 198363 343999 -44891 20062 -13631 -7515 -95538
12370 -95538 -1555 30740 -52 -15191 -198967 213944 56726 47685 -131547 25763 106848 80508
12358 80508 -82366 -5845 2057 -12250 -143745 -35355 105907 -331432 65234 -83292 126403
12346H2381B7614g358j07827N0202k59959A73087E8571P5110m1641R1106b13928
12334f1807r4958A12359B7258H242d34990h1726l4114C53048a04232j898j62670
12323b68800A6280m12K11589a1945m7381Q099B47434e6210N67k11933H8706J97423
12311B86129b27874G9981a36404C05234j27994a74176A27367a3958A9817a45588
12300i3596r3315c6208j21762k36128a48781j8645H3543h863j42664N0287k7688
12289a28928r7281d9367E2030a3627A28822K1074N3405K2050f04A42950J74235
12278C17185D3852L04212j40713J00402D4257M3028M5151h2993a7510G2306a46141
12266B32730E5686L2498O3731A6066P2711J43977a01325B01571n8930J53996K06686
$$ plain form
12346 82381 27614 -7358 -115185 -64983 -324942 173087 58571 133681 92040 183146 -213928
12334 -61807 -156765 112359 27258 8242 -434990 -81726 -115840 353048 -104232 -106130 -268800
12323 -268800 16280 15868 227457 -11945 -59326 -51227 247434 -56210 -55643 -267576 88706 286129
12311 286129 -227874 79981 -136404 305234 177240 -174176 127367 -13958 19817 -145588
12300 -93596 -186911 -36208 -157970 -394098 -148781 -167426 83543 -8863 -151527 -101240 -128928
12289 -128928 -226209 -49367 52030 -13627 128822 149896 203301 225351 -604 142950 317185
12278 317185 43852 348064 207351 307753 44257 87285 132436 -82993 -17510 72306 -146141
12266 232730 55686 88184 151915 16066 88777 232754 -101325 201571 142641 296637 503323
12255E03323A761O3236i3526B44513l5180b39795a17530k1631B55415P5726a92391
12243A60552b50392B78380B3259L14979J50134A68994f7947A87624a0311B33614
12232a2478A3482Q9010h0989c0656C91102I5689k9392J56983o7987K69566A38373
12220a44049E33488D1057K56723h7379A03400B8398J45168i5688b2723B04904
12209i7292K0087C61754a57536C71590A07998N5351J73565k4625L6703A41598
12198C7149n029J26840o3155J20656E2322L3439j0504J86036b7601B39916j19553
12187A20363f7330B46394A734K09857K1260A9643L85721B1574g7704A66243c8119
12175e3194B77396F7189R3434d0254A56501E4563J7264a14646J7036L9256n1770
$$ plain form
12255 503323 1761 64997 -93526 244513 209333 -239795 -117530 -139161 255415 331141 -192391
12243 160552 -250392 278380 23259 338238 488372 168994 -67947 187624 -10311 233614
12232 -12478 13482 102492 -80989 -30656 391102 95689 66297 223280 155293 424859 138373
12220 -144049 533488 41057 297780 -87379 103400 28398 173566 -95688 -22723 204904
12209 -97292 -77205 361754 -157536 371590 107998 163349 336914 312289 348992 141598
12198 37149 32120 158960 95805 216461 52322 85761 75257 261293 -27601 239916 120363
12187 120363 -67330 246394 1734 211591 232851 19643 405364 21574 -77704 166243 -38119
12175 -53194 277396 67189 160623 -40254 156501 54563 71827 -114646 -97610 -58354 -110124
12164a10124G8797L72912N1733c8252j46192k5803B28025i2259B48379a42737
12153G4867Q8685L17195F7909A9787d2764n2716B63669m4065a26104n7074p7432
12142b60610A03662J1098f6048A70487E0055e269j66455a4868q4891j0559e463
12130C1611b47991B45647J9003d1727j44092B21011D3317M4052e2377o2889B99390
12118I183J73725a30081B1576N7328a99788K2147J6378A04476f9341B10382a14258
12106B12420a82823k17998A56141C1353J65564M018G3052a97695R6194m4217A45453
12094D17834h1692B0092J06716b97232a11498c8010j33488b2968k09012E6553
12083a2417m7869D5037a34727o7625C89486a82234Q3998A67340m4090j8720k7260
$$ plain form
12164 -110124 78797 451709 503442 -38252 -184444 -210247 228025 -92259 248379 -142737
12153 74867 163552 480747 67909 19787 -42764 -95480 263669 219604 -126104 -183178 -260610
12142 -260610 103662 114760 -66048 170487 50055 -5269 -171724 -14868 -99759 -110318 -5463
12130 31611 -247991 245647 264650 -41727 -185819 221011 43317 87369 -52377 -115266 299390
12118 9183 182908 -130081 21576 78904 -199788 -177641 -161263 104476 -69341 210382 -114258
12106 212420 -182823 -400821 156141 31353 196917 200935 73052 -197695 -101501 -145718 145453
12094 417834 -81692 20092 126808 -297232 -111498 -38010 -171498 -22968 -231980 56553
12083 -12417 -60286 45037 -134727 -202352 389486 -182234 -98236 167340 123250 104530 77270
12072G7270a3925j36074B13873a32130D17150q4323P60683M38204p59720l45350
12062D26644j92502a23687C35016G9360a11590F4993a44053O2747G8600J64882
12052B43482l5207a5671k18710E3413K38949q7205I5013M2523c28346a22052j47065
12041b69117A05062J66549d31584J95677C4383a87321A07346g2390A17180K44175
12031C61355I9503f0849n6247a298m97324E565c11302a18717D3481K92865r7503
12020B38843b67082b962B16551a23742c3984j11595B14560g7288k8796d7967j79023
12009b26990l3157d2188o2936J1377G4149J75051P2505A36276c03631A08373J11988
11998B20361a56807G77J43414c11377C28584l701f8628C68153c34483a01285B0458
$$ plain form
12072 77270 -13925 -149999 213873 -132130 417150 332827 1093510 1531714 771994 426644
12062 426644 234142 -123687 335016 79360 -111590 64993 -144053 -81306 78600 243482
12052 243482 208275 -15671 -234381 53413 292362 205157 95013 137536 -328346 -122052 -269117
12041 -269117 105062 271611 -431584 -235907 34383 -187321 107346 -72390 117180 361355
12031 361355 99503 -60849 -117096 -1298 -498622 5565 -311302 -118717 43481 336346 238843
12020 238843 -267082 -2962 216551 -123742 -33984 -145579 214560 -77288 -106084 -47967 -226990
12009 -226990 -260147 -42188 -105124 -93747 74149 249200 321705 136276 -303631 108373 220361
11998 220361 -156807 777 144191 -311377 328584 324883 -68628 368153 -334483 -101285 20458
11986E15O0287a28507A40807R9496f2764B30907e8799A70638C726b03475R7523
11975a05952q8915g2452D14081b9868k34746i3333K88e755E6529K92719E1647
11963B29670A04460f2200l0457B30826a6665D747e3896E0081Q1209c3142G6338
11951E13964B23943b06005B08388b52611E2879f383l56150J21215f2617k35938
11941b98555B81430G1593K83602d7500m49744b8408l1488k99423j85322B9546
11930g7812A41163d2526k37235b3234H450R7535G24b96220A16209J36571a62317
11918a83057A13808b72116F360M0002i41B7059Q0033J8882b85993B2768e1176
11906D3791a0690A0934L19043d03258A99651b14398A65132b40962f0760B94513
$$ plain form
11986 515 60802 -128507 140807 240303 -62764 230907 -58799 170638 3726 -203475 -105952
11975 -105952 -194867 -72452 414081 -29868 -264614 -93333 -93045 -5755 56529 349248 51647
11963 229670 104460 -62200 -92657 230826 -16665 4747 -53896 50081 131290 -33142 76338
11951 513964 223943 -206005 208388 -252611 52879 -6383 -362533 -241318 -62617 -298555
11941 -298555 281430 71593 355195 -47500 -497244 -28408 -59896 -359319 -544641 29546
11930 -77812 141163 -42526 -279761 -23234 8450 105985 724 -296220 116209 252780 -162317
11918 -183057 113808 -272116 6360 46362 -941 27059 107092 125974 -285993 22768 -51176
11906 43791 -10690 10934 329977 -403258 199651 -214398 165132 -240962 -60760 294513
11895A58496G2165e6360o1887a164A45868n1887a26822k47512i739n9250F0383
11883b06258d1787r0011L7570a5835E68271H8755a86837N0908n7757A02833N3618
11872A56451A3642g5190B55060J7174d09386J55033a19484B4421a49510b6832
11861a43179O0058l1839B33091b41029h4391A8707i966m73129G1853J63004n8294
11850A76563a21913C5844J77641a14646j8814A09048c05419J45582G1525b44521
11839b91483a17025q0237O5832n4761F1320F995e3886K1035A0319K63506i9351
11827B91827a49926L106B22761e1830K5890G7376c5697A51298g4949A78319b26593
11815e6121k2596r37j89508m9158f754D5828N0148c14380E1734b93940C05576
$$ plain form
11895 158496 72165 -56360 -118247 -1164 145868 93981 -126822 -374334 -9739 -68989 60383
11883 -206258 -41787 -131798 -94228 -15835 568271 88755 -186837 -135929 -193686 102833 156451
11872 156451 13642 -75190 255060 272234 -409386 -254353 -119484 24421 -149510 -26832
11861 -143179 -83121 -114960 233091 -241029 -84391 18707 -9966 -483095 71853 234857 176563
11850 176563 -121913 35844 213485 -114646 -133460 109048 -305419 -159837 71525 -244521
11839 -291483 -117025 -197262 -131430 -186191 61320 6995 -53886 -32851 10319 273825 -99351
11827 291827 -149926 -146820 222761 -51830 -25940 77376 -35697 151298 -74949 178319 -226593
11815 -56121 -78717 -79654 -269162 -318320 -6754 45828 95976 -314380 51734 -293940 305576
11803b42070J7302h7429l7894N838B21512A04622K26385g1324H4308a37979c2639
11791h4749B919b18148A68460D6240K96850j56172c29991P4099D00761a91545
11780C8142b82012G1311b00842R7206F3840N386b04071h534k78694J07970C00360
11768c22092A00440a35299A15950O9883I2155a98229C7839J4664b73815B28248
11757i3593j41803a06931G3262g8435c5273j53837d840B4437K13849c5549l8013
11746g3562j27634b8886j34102E9918e3632k47358A10667R3749l7654Q0400D9524
11734d5347J3661F0087i311E1842a55717D01756A2867J00972J6215a26508j44097
11723b70605B4814K892N7683L2628c05475E5997d7897A335J62791g0687k22693
$$ plain form
11803 -242070 -224768 -87429 -125323 -119485 221512 104622 331007 -71324 84308 -137979 -32639
11791 -84749 2919 -218148 168460 46240 343090 186918 -329991 -255892 400761 -191545
11780 38142 -282012 71311 -200842 -103636 63840 69226 -204071 -8534 -287228 -179258 300360
11768 -322092 100440 -135299 115950 185833 92155 -198229 37839 52503 -273815 228248
11757 -93593 -235396 -106931 73262 -78435 -35273 -189110 -4840 24437 238286 -35549 -73562
11746 -73562 -201196 -28886 -162988 59918 -53632 -300990 110667 204416 166762 247162 49524
11734 -45347 -31686 60087 -9311 51842 -155717 401756 12867 113839 130054 -126508 -270605
11723 -270605 24814 27706 85389 118017 -305475 55997 -47897 1335 164126 -70687 -293380
11712b93380B31896o1433g8498h617j9804D22621j73283p7193L2116a73236a5993
11700b09670A28956c5746r2953j06347A51469B2441a41523o4673A43164L20231
11690D63395o6051Q6740n7307D0202a08851B20551n5757a30103j34842A51195
11679a0494k63069O5115D2669a80047C31121a47904C8613b7966l0210A2595J26698
11668A39293a54828D91688B02925e7462D02873E7940b54434e003B59330f0966
11657C2283a91596C78852a34398a6236B02528J72145c6553C86802A68611g2205
11646b3658l09116J44946C30065C718a66612B29448e8504E45693A54116D4760
11635B49390A10263e3887A64714b00681B54808f8462H8090c25144i6818k973B81218
$$ plain form
11712 -293380 231896 170463 -78498 -8617 -28421 422621 249338 172145 204261 -173236 -15993
11700 -209670 128956 -35746 -128699 -235046 151469 22441 -141523 -206196 143164 463395
11690 463395 397344 484084 426777 40202 -108851 220551 164794 -130103 -264945 151195
11679 -10494 -273563 -208448 42669 -180047 331121 -147904 38613 -27966 -58176 12595 139293
11668 139293 -154828 491688 202925 -57462 402873 57940 -254434 -5003 259330 -60966
11657 32283 -191596 378852 -134398 -16236 202528 374673 -36553 386802 168611 -72205
11646 -23658 -332774 -187828 330065 3718 -166612 229448 -58504 545693 154116 44760
11635 249390 110263 -53887 164714 -200681 254808 -68462 88090 -325144 -96818 -99791 281218
11623B20350F7755a70530c4800j21528B8320f6787j86774e1970A43548R3913b81921
11611d0909A28151k1560B9807J80689Q1094f260j21078F2234g9732A64532a7792
11599H4237Q7628k184a42112d8177B08476P0611f275n5563B86773I6081A904O0037
11587F1941N15390A09602K00349L8791B5968K07483E5393P1334K92833b88717
11576H7139A2508a60324a1913j20343A7953K45768K28183h3202A63952c6416B69674
11564a4760j13911j1106A33518e1768A07555J74667A30967i3230A03079L6382
11554A39461K6208a87464j40258D16253e6065q1693a0045C85765A32196a68485
11543B70050H4074Q8098i0173J7921E1826o035K02818L6107c8273A46578e7276
$$ plain form
11623 220350 67755 -170530 -34800 -156328 28320 -66787 -253561 -51970 143548 237461 -281921
11611 -40909 128151 106591 29807 210496 291590 -6260 -127338 62234 -79732 164532 -17792
11599 84237 171865 169681 -142112 -48177 208476 279087 -6275 -61838 286773 96081 1904 61941
11587 61941 577331 109602 309951 348742 25968 233451 55393 126727 419560 -288717
11576 87139 12508 -160324 -11913 -132256 17953 263721 491904 -83202 163952 -36416 269674
11564 -14760 -128671 -139777 133518 -51768 107555 282222 130967 -93230 103079 139461
11554 139461 165669 -187464 -327722 416253 -56065 -137758 -10045 385765 132196 -168485
11543 270050 84074 172172 -90173 -72252 51826 45791 248609 284716 -38273 146578 -57276
11531b38383A2188a85917A70327E848a75326C50506I6124M72154B14351c2736
11520g3877A86599o2465b94348A01966K49440d9083E68805D669K25736C7126K12546
11509B49672o888Q0771j13389J28759L4164G4246Q035m0710c3592H7987E387K73467
11497B78854H4965J77932m8068L5282J95638a0396H5313J55685A10019M1028P307
11486A58354A6383K836N19982a26630H1348g7061A36787d9098H8435J11992h442
11474A03512k7569b357B11184J09139n3959N8773A6255o741L52840A26185a45967
11462a71681B04156M0912b91548A30778l5944c5847A50302K19291c60405E18729
11451C3923a88268B8967d6534k86035A19661L5632J2082a11343F1215a91675B3982
$$ plain form
11531 -238383 12188 -185917 170327 5848 -175326 350506 96124 568278 214351 -32736
11520 -73877 186599 124134 -294348 101966 351406 -49083 568805 4669 230405 37126 249672
11509 249672 242784 323555 210166 338925 373089 74246 82281 41571 -33592 87987 5387 278854
11497 278854 84965 262897 214829 250111 445749 -10396 85313 240998 110019 151047 158354
11486 158354 16383 19219 539201 -126630 81348 -77061 136787 -49098 88435 200427 -8442
11474 103512 75943 -2357 211184 320323 266364 325137 16255 9514 362354 126185 -145967
11462 -171681 204156 245068 -291548 130778 94834 -35847 150302 369593 -360405 518729
11451 33923 -188268 28967 -46534 -332569 119661 155293 167375 -111343 61215 -191675 23982
11439i5783k4191C917L28875a7767A1443a76485c9266A33706a0503l6847A19907
11427a48745e163o6498D769b52092O2075d7208k64700a05442J985H4176R9582
11416A83758Q0897i0284A78079h8299B01321D9695L41959a16149b6517F4831a26094
11404c4782A21746D6201J56437a13859i816j32494E0335J78068J07289j25475
11394B10217q7204a53929A8257B43a35565N678j44893J33127B76793a43166F6218
11382F8515b15521A43301d5132k1895B43249a70946P1319A7054c3752J3997B67900
11370H7100a47924N425B16409H9993J257B5217c8813B71565A17034L3436m7658
11359A02812h0972A67707F8128b17143F1039C824P7288C4204d3600A16994I43
$$ plain form
11439 -95783 -119974 3917 332792 -17767 11443 -176485 -39266 133706 -10503 -47350 119907
11427 -148745 -5163 -71661 4769 -252092 -190017 -47208 -311908 -105442 -103457 84176 183758
11416 183758 264655 -90284 178079 -88299 201321 49695 391654 -116149 -26517 64831 -126094
11404 -34782 121746 46201 202638 -113859 -9816 -142310 50335 228403 335692 210217
11394 210217 123013 -153929 18257 243 -135565 -129887 -274780 -141653 276793 -143166 66218
11382 68515 -215521 143301 -45132 -67027 243249 -170946 -99627 17054 -33752 -19755 267900
11370 87100 -147924 -142499 216409 89993 91250 25217 -38813 271565 117034 150470 102812
11359 102812 -80972 167707 68128 -217143 61039 3824 81112 34204 -43600 116994 943
11347a13108K7917J8291B6244b30374b3186M533C59568B2679a7065E9441N0210
11336A09651h319I3778a26981M4887C8360J1086J2607b54067b1456j33450O1079
11325i3827j27981N4408L7421m3971P4675H277J19631a86367j10549i9749j562
11314a01311j32473m68A49813B3955c8563k94383N5335a6643A93760f5563C5625
11302F3975J86027A18520C1829b530F032J95809p853d23861B7906e6073o287k9647
11290i2007A99092M8693C88b08946A20983a55865C5395J96692j04153c260j89176
11279a92436M0945d9949G916J07382j4077R6319b33401G8285b51265K7390e8977
11267A08872C8722f2435j62634A3601N3809a91892A48006d1974j18510A796g1973
$$ plain form
11347 -113108 -85191 -66900 26244 -230374 -23186 -18653 359568 22679 -17065 59441 109651
11336 109651 -8319 93778 -126981 -82094 38360 49446 62053 -254067 -21456 -154906 -93827
11325 -93827 -221808 -167400 -129979 -173950 -99275 8277 127908 -186367 -296916 -99749 -101311
11314 -101311 -233784 -234252 149813 23955 -38563 -332946 -277611 -16643 193760 -65563 35625
11302 63975 250002 118520 31829 -2530 6032 201841 193988 -423861 27906 -56073 -62360 -92007
11290 -92007 199092 247785 388 -208946 120983 -155865 35395 232087 127934 -3260 -192436
11279 -192436 -151491 -49949 7916 115298 101221 197540 -233401 78285 -251265 -223875 -58977
11267 108872 38722 -62435 -225069 13601 67410 -191892 148006 -41974 -160484 1796 -71973
11255a29077A79728N4145g0609k32385i5494j30055C0259a36870b345n1328A26505
11243A31571O6833B5743a29391A57013b77787b0633A56067j2509l9179M6076e0218
11231A94926k6224a98914A66369b28714j62687A11070c98883m727i647m1642j06016
11220a57305j99728a21524m2425B30745a80665B02730G1216a25286D2224i6009
11209a31076f0985A75029a64619M9615A08772g4122H6421c5200B41168K4601b47245
11197C13051c24472B88139d7904k0003N005J0135o433E2253J21871b0515l11896
11186c32411f3152k85291J4236j39232a34083e628C90014G4117B7262a09046E5530
11174b28850q8380B21291a12958A85128P7461j17808a19182b7985A56503A3181
$$ plain form
11255 -129077 179728 233873 -70609 -302994 -95494 -225549 30259 -136870 -2345 -53673 126505
11243 131571 198404 25743 -129391 157013 -277787 -20633 156067 143558 104379 150455 -50218
11231 194926 168702 -198914 166369 -228714 -391401 111070 -398883 -403610 -9647 -51289 -157305
11220 -157305 -357033 -121524 -163949 230745 -180665 202730 71216 -125286 42224 -96009
11209 -131076 -60985 175029 -164619 -115004 108772 -74122 86421 -35200 241168 265769 -247245
11197 313051 -324472 288139 -47904 -67907 -62902 -52767 -59200 52253 174124 -20515 -332411
11186 -332411 -63152 -348443 -334207 -473439 -134083 -5628 390014 74117 27262 -109046 55530
11174 -228850 -317230 221291 -112958 185128 262589 144781 -119182 -27985 156503 13181
11163b17084f2393G9429K1583a03270G6230J5198M5734c22730a0693k95590A93810
11151a92200g8237A4176h6080B34738a94356C7944a96491j35610A51419a19536
11140h3386D27362A37985a735L68o5902A64331B227P6343e2643a0738B9735c6513
11127C23125N7758E7532Q0005m3630a80206l1654B71446j26768k0332l9097J02615
11116A87864a79581Q7918a7489n1247C67783a1283A1855J71004n4671a01425A08523
11104I6041c07560H0087M4521J28640J06747C510P4425b9476A00955J46736a9683
11092B87791A08109j4518L14340j08484E1197J60922J44894C9685K16697n5928
11082B00454r0008J32926h1627B47399L67333B29700N1484o1805l4277P6431J4129
$$ plain form
11163 -217084 -62393 79429 101012 -103270 76230 91428 137162 -322730 -10693 -306283 193810
11151 -192200 -78237 14176 -86080 234738 -194356 37944 -196491 -332101 151419 -119536
11140 -83386 427362 137985 -1735 -1367 -67269 164331 2227 78570 -52643 -10738 29735 -36513
11127 323125 380883 57532 137537 93907 -180206 -211860 271446 144678 124346 85249 187864
11116 187864 -179581 -91663 -17489 -68736 367783 -11283 11855 182859 128188 -101425 108523
11104 96041 -307560 80087 124608 253248 359995 3510 77935 -29476 100955 247691 -19683
11092 287791 108109 93591 407931 299447 51197 212119 357013 39685 256382 200454
11082 200454 110446 243372 -81627 247399 614732 229700 281184 219379 185102 261533 275662
11071B75662A25811J44939J54775L9619k9638j15043K08029B1316N02459n1393
11061D72382j76880L08662k76841J9501j13076M79771j38745k01380J04765K16432
11051F94591k8537L70237m22808L36229D60329k9898J10101L96611j32477O9813
11041H74479j1286k08798j03120J1278K75601l26721K98781j86416K67232C89019
11030E49354o6333L01535p3744j73765Q0700J25396k43351L82906j3100k62175
11020F07423o6249J28496L4680q4580p0917J88568j68443k18369L57170J00820
11010H08599J7085l80172J21056b7321D82169j05446J04665J25455j2206L95424
11000I90061l28971R5519N3916k32784J32512J50755O0179K338l01511L01824
$$ plain form
11071 275662 125811 270750 425525 465144 435506 320463 528492 21316 523775 472382
11061 472382 295502 604164 327323 346824 233748 713519 574774 373394 478159 694591
11051 694591 666054 1036291 613483 949712 460329 430431 540532 937143 804666 874479
11041 874479 863193 654395 551275 562553 838154 511433 810214 623798 891030 389019
11030 549354 483021 784556 710812 537047 617747 743143 499792 882698 869598 607423
11020 607423 541174 669670 704350 619770 548853 737421 568978 350609 707779 808599
11010 808599 825684 445512 566568 -27321 482169 376723 481388 606843 594637 990061
11000 990061 661090 756609 810525 577741 710253 861008 921187 923525 622014 923838
10990I23838j17064r4100j44691J20610L66865j13674l47638N50372q3642J9864
10980A080740N317J81227L46319k22238N08285K70399K68352M08906k12239M56439
10970C091507l32015j33179j78556K9326m32945l05863L0991J03055O4424n53482
10960A383263K37247L21893j04435j2897J84741k43587L33504m98072n78300k0878
10950A002479Q5544m26545j82035q0820J74067B49968M50478A64264j7350Q5633
10940B32547k7003P8959L26319k67670A8367L85278j41413j20395Q8559g5032
10929A99590b24783d196D38751G961a34311I6134j0472K04809a64757L1361C93329
10917a78568f5311A25795B3916h0919H5301k2033g4529o5893K3482E8261J26582
$$ plain form
10990 923838 806774 712674 567983 688593 1055458 941784 594146 1144518 1060876 1080740
10980 1080740 1086057 1267284 1613603 1391365 1899650 2170049 2438401 2847307 2635068 3091507
10970 3091507 2759492 2626313 2447757 2477083 2044138 1738275 1769266 1872321 1936745 1383263
10960 1383263 1620510 1942403 1837968 1825071 2009812 1766225 2099729 1601657 1023357 1002479
10950 1002479 1088023 661478 479443 398623 572690 249968 700446 164264 146914 232547
10940 232547 205544 284503 610822 343152 18367 403645 262232 141837 230396 -75032
10929 199590 -224783 -4196 438751 7961 -134311 96134 85662 290471 -164757 -133396 393329
10917 -178568 -65311 125795 23916 -80919 85301 63268 -74529 -140422 -116940 58261 184843
10906A84843A4131g7772I4432f0057A44281P621l2430c83525A89354j6312a59569
10894B51770j03510b62901B38086f810k89601A35808a05940G8342J95069D238
10883A13110n3914P968A9880J41026d7583l43339a0343J720q057A18370A9925
10871b32923A39063L4343b8537B3007a80007N2049O3175A65791b62636a3915l12336
10860c26251A54169l5090a26171B29305a02568k15257i8815D1425K14865A20475
10849D3179J24040p2927i3725A51001c10725I2639l9004d27r8246C3863J25993
10838A59856a04353i065m1781C45669a30121C02468a45954j67959F3290g8666
10827c1341c136k0871a773m05380a1892H6083K5153g5206D0594a03581k66956
$$ plain form
10906 184843 14131 -77772 94432 -60057 144281 151902 119472 -383525 189354 173042 -159569
10894 251770 148260 -262901 238086 -6810 -296411 135808 -105940 78342 273411 4238
10883 113110 59196 67164 19880 160906 -47583 -390922 -10343 -8623 -16680 118370 19925
10871 -232923 139063 173406 -28537 23007 -180007 -127958 -64783 165791 -262636 -13915 -326251
10860 -326251 154169 119079 -126171 229305 -102568 -317825 -98815 41425 256290 120475
10849 43179 167219 94292 -93725 151001 -310725 92639 53635 -427 -98673 33863 159856
10838 159856 -104353 -9065 -50846 345669 -130121 302468 -145954 -313913 63290 -78666
10827 -31341 -3136 -24007 -1773 -407153 -11892 86083 111236 -75206 40594 -103581 -370537
10816c70537J54579m3744k585J06116q8035a21962A75968f9815F7949L6512b69536
10804f135B27461a70164C9679J46299K59964b36257f6649j67774b357k04196A19193
10792d52091H4385a00364c5037l1404C7929b11263b461j41914k40793a31543K0446
10781a11097c3081l43935B22505a85887O9409B52000q7804b82563N2762C8889
10770I2651K97726a69869B26333a27773G0101b1334j44500F4962a41716J3789
10760a27927N1563a4779k61087b4381j53090P6578I7346h3652G1638J74257G9677
10748a04877D9912J20316i7692p3684i856D9184J69616c98727H3940N8050g2697
10736a14006e1875A0906J08581d4867C16529f2433O558j28220A57532a96402m6251
$$ plain form
10816 -370537 -215958 -259702 -262287 -156171 -244206 -121962 175968 -69815 67949 104461 -269536
10804 -6135 227461 -170164 39679 185978 445942 -236257 -66649 -234423 -2357 -206553 119193
10792 -452091 84385 -100364 -35037 -66441 37929 -211263 -2461 -144375 -385168 -131543 -111097
10781 -111097 -33081 -377016 222505 -185887 -116478 252000 164196 -282563 -229801 38889
10770 92651 390377 -169869 226333 -127773 70101 -21334 -165834 64962 -141716 -127927
10760 -127927 -76364 -14779 -275866 -24381 -177471 -100893 97346 -83652 71638 245895 79677
10748 -104877 49912 170228 -97692 -171376 -9856 49184 218800 -398727 83940 141990 -72697
10736 -114006 -51875 10906 119487 -44867 316529 -62433 -55875 -184095 157532 -196402 -242653
10725b42653J06060D9645b16416B35235a75026l250A17888d51865a81136L841
10715a77295j18964h4647C47165C448b05976q923K5913G5283A3250K9016a51933
10703e35332b7701A9264O7152b28615g0974B2952J45377b26557G7382a60465H2871
10691A25825B4301b46264Q9765G0195R0946m7325i274B04080r0242K80902a37382
10679b94419k22A28136c77214J56514d6989I0741a35005K5380B30i5056D9821
10667B03805a0852j29828j06568j40505a10155B63093l90b6147k84377C15857
10656b00367P8437A18417b61359G131c1636k6410k782A84021N2244d5526j25048
10645a70574A81925a95654A68098a48729G4422a40485D3587J33241a62368J3420
$$ plain form
10725 -242653 -136593 49645 -216416 235235 -175026 -178276 117888 -451865 -181136 -177295
10715 -177295 -296259 -84647 347165 3448 -205976 -214899 -188986 75283 13250 42266 -151933
10703 -535332 -27701 19264 86416 -228615 -70974 22952 168329 -226557 77382 -160465 82871
10691 125825 24301 -246264 -156499 70195 161141 113816 -9274 204080 113838 394740 -137382
10679 -294419 -294641 128136 -377214 -220700 -46989 90741 -135005 -109625 230 -95056 49821
10667 203805 -10852 -140680 -247248 -387753 -110155 263093 262703 -26147 -310524 315857
10656 -200367 -121930 118417 -261359 7131 -31636 -58046 -60828 184021 236265 -45526 -170574
10645 -170574 181925 -195654 168098 -148729 74422 -140485 43587 176828 -162368 -148948
10635a48948k0448A6270Q8227a61731e1904A73416d5543j60176A52091a51963
10624a40420c9051k35027A69426b67319i0651r595P103j85567I231b45439B13621
10612b09539O0836e5046A28580P9100b58423B73132a857j89113C7565K19077A2022
10600a40143m398c945A48037D2553b25883G58J4443b01567J4698e9120H0554f7366
10587a7681J477k06340C1041M403Q6473E7518a06129j16130G4099b82195P3918
10576b08277C1369M559a04037q6052B53304g3273C94749a90996M9610r2463g4725
10564b39822A56963a52632b4436A44863n6412a13419M9027r5907B46117a08417
10553D8440c574B59462q4195i7733j59329B9290a82646F5327e5502L556e118j01154
$$ plain form
10635 -148948 -169396 16270 104497 -161731 -51904 173416 -45543 -205719 152091 -151963
10624 -140420 -39051 -274078 169426 -267319 -90651 -100246 -93143 -278710 9231 -245439 213621
10612 -209539 -148703 -55046 128580 207680 -258423 273132 -1857 -190970 37565 256642 12022
10600 -140143 -144541 -3945 148037 42553 -225883 758 15201 -201567 -186869 -59120 80554 -67366
10587 -17681 -16204 -222544 31041 35444 121917 57518 -106129 -222259 74099 -282195 -208277
10576 -208277 31369 35928 -104037 -190089 253304 -73273 394749 -190996 -141386 -233849 -74725
10564 -239822 156963 -152632 -24436 144863 88451 -113419 -64392 -160299 246117 -108417
10553 48440 -3574 259462 175267 -97733 -257062 29290 -182646 65327 -55502 -51946 -5118 -106272
10541a06272h394A05669c49339a46540r0848g7067B9049K10847L5492b33184d4665
10529D4533a87377l8240A13446a0438j99668A50778a88866A13967h8126B10246
10518c54712f5030C70362B4156R8659g7943C15451E8559b09958B9045b74260J28517
10507a45743a5649B46891a12894M9378B55494d6831A54344A0382b27585H5298
10496a11225o4547F3583K048e3128p8666j63388C20937b32726B77936k7630g8551
10484h5692A10000k720b19003G25725k02882j42286j25544J0571I2544J29030
10474B21574a46687D3713J02166a28830K6966d7806n4513c725A44430b35385D7114
10462b02639A42149a30831j69508j18818B49790G4718i5193G7214J01645m0744
$$ plain form
10541 -106272 -8394 105669 -349339 -146540 -237388 -77067 29049 239896 275388 -233184 -44665
10529 44533 -187377 -225617 113446 -10438 -210106 150778 -188866 113967 -88126 210246
10518 -354712 -65030 370362 24156 122815 -77943 315451 58559 -209958 29045 -274260 -145743
10507 -145743 -15649 246891 -112894 -63516 255494 -46831 154344 10382 -227585 85298
10496 -111225 -175772 63583 65631 -53128 -131794 -295182 320937 -232726 277936 250306 -78551
10484 -85692 110000 107280 -219003 725725 522843 380557 255013 265584 92544 221574
10474 221574 -146687 43713 145879 -128830 -101864 -47806 -102319 -3725 144430 -235385 47114
10462 -202639 142149 -130831 -300339 -419157 249790 74718 -95193 77214 178859 138115
10452A38115j8963i5889J0109A3016b05394C3645d3478A33344J34940a41915q9492
10441b31407G8556b43472e5943E9391b33530L7645a6346k3781A60641L0958J1541
10430B03140d1683B7501P6928h2091A25408C0349J25171J59633h0942A57409P909
10419A65318a94026b5969E1635R1034i2567K0003E6705c51873H2382J59797b69706
10407a89533C45594b63417C93487d2083k09268a08773F9926a03542j79214E34991
10396A77521K809F5356h1812B48667k7752l6303O1285N1971M6581A40724b88817
10384g1067A83163B0149K45402K5183e8476D4016L68742j98896D6995O7468d390
10372A43708F2088K36981R6975L10627j10798k72089l6657J73523o365j26999
$$ plain form
10452 138115 119152 -95889 -85780 13016 -205394 33645 -43478 133344 268284 -141915 -231407
10441 -231407 78556 -243472 -55943 59391 -233530 -195885 -16346 -40127 160641 191599 203140
10430 203140 -41683 27501 104429 -82091 125408 30349 155520 315153 -80942 157409 165318
10419 165318 -194026 -25969 51635 142669 -92567 -72564 56705 -351873 82382 242179 -269706
10407 -189533 345594 -263417 393487 -42083 -251351 -108773 69926 -103542 -282756 534991
10396 177521 180330 65356 -81812 248667 220915 184612 245897 297868 344449 140724 -288817
10384 -71067 183163 20149 265551 290734 -58476 44016 412758 213862 46995 114463 -4390
10372 143708 62088 299069 396044 706671 595873 323784 287127 460650 454285 327286
10362C27286J21171o4772j31545m9194G9131B7744L89731j90948K55051B16009
10351C65631M57755B55296P2650A52781Q9515J21539l2518K4823J46955I4518
10340b0463A2122K87977A4841b0759H8486K74768j02223l8081m5828J61727e6705
10328b14491B55975b64380B23010C8421a69386B58008j05869L5646J56255o0896
10318B83144q0462Q0274K1353b79263A87068G6524R2208l5384d35435B61654E2969
10306a02119B05899c7564G691a35432A32461e8726A89783a43422G389l272g5203
10294d82755B1011N2683e3931j7770A08780b06234G9135J26035p7339C0540h4077
10282d36k14354Q3386c6008B2211f321p7394K4119m01835a90425D3718a6350A13525
$$ plain form
10362 327286 448457 383685 252140 202946 79131 27744 417475 226527 481578 216009
10351 365631 823386 255296 327946 152781 242296 363835 331317 356140 503095 94518
10340 -20463 12122 300099 14841 -20759 88486 363254 261031 222950 177122 338849 -56705
10328 -214491 255975 -264380 223010 38421 -169386 258008 152139 187785 344040 283144
10318 283144 202682 282956 304309 -279263 187068 76524 168732 133348 -435435 261654 52969
10306 -102119 205899 -37564 7691 -135432 132461 -58726 189783 -143422 7389 4117 -75203
10294 -482755 21011 73694 -53931 -71701 108780 -206234 79135 205170 127831 30540 -84077
10282 -436 -214790 -131404 -36008 22211 -6321 -83715 -59596 -461431 -190425 43718 -16350 113525
10269E4645M0211J38521q8608K49455A45535a2537A18657d1332H6424O6585j4163
10258A38846C3987J25998J07785M7252a77482H0212O5764b6345A47165b0632m76968
10247d97600A39599a78964b7253D4143J01328a06711A16281m0037J14671E0716
10236b20616h1217g06j35633r5654e2279H0770k5443b2221k39673l5762a07409
10224g6275b2958k59828a2116k2741A15479e5075j33062f1492A02819B6410a0090
10212A39154E6523K15480e990B9142K56770d9262m7981j99107J23254A06362b9356
10200b29971j7049i1316k38092f988j20363A96465b99406j4606A37310a30981
10189b97944f6537A50205J83355c9623l0432A6814c68903A0078L96595D0116a07399
$$ plain form
10269 54645 94856 233377 144769 394224 145535 -12537 118657 -41332 86424 153009 138846
10258 138846 33987 159985 267770 315022 -177482 80212 145976 -26345 147165 -20632 -497600
10247 -497600 139599 -178964 -27253 44143 145471 -106711 116281 76244 190915 50716
10236 -220616 -81217 -706 -136339 -231993 -52279 80770 55327 -22221 -261894 -297656 -107409
10224 -76275 -22958 -282786 -12116 -34857 115479 -55075 -188137 -61492 102819 26410 -10090
10212 139154 56523 272003 -5990 29142 285912 -49262 -97243 -296350 -173096 106362 -29356
10200 -229971 -247020 -91316 -329408 -6988 -127351 196465 -299406 -314012 137310 -130981
10189 -297944 -66537 150205 333560 -39623 -70055 16814 -368903 10078 406673 40116 -107399
10177b56089C44263c23321O3654D3258l386b29219I1624e0723F6681e5096j0871
10166f5967D6630a53383C80248b42560A34558c22850J31889A45630j9304a52297
10155E9557c23160P7534N5333d6058B91380J41312a42859m0994j47496R4042P9825
10144a57482K1723L1519j05349A45394k9099c59619G3954b59808G0642M3901f9888
10132f3602J2703j03534d1613k49670J619a9734C1412c17743J53100A66764d1122
10120d1163n6915E5954h3123B20919a44626m21649a03532c2100q6761c0947k91162
10109c22109a23488A0474J75878a55603J8183L3315M219E2873a00002G6255a85510
10097h9906d2666E001K63363a2089k1017o4744j48300E9133g3863j24257B0614
$$ plain form
10177 -256089 344263 -323321 -259667 43258 39872 -229219 91624 -50723 66681 -55096 -65967
10166 -65967 46630 -153383 380248 -242560 134558 -322850 -190961 145630 126326 -152297
10155 59557 -323160 -245626 -190293 -46058 291380 432692 -142859 -183853 -331349 -237307 -157482
10144 -157482 -135759 -104240 -209589 145394 116295 -359619 73954 -259808 70642 114543 -69888
10132 -63602 -50899 -154433 -41613 -291283 -289664 -19734 31412 -317743 -164643 166764 -41122
10120 -41163 -98078 55954 -83123 220919 -144626 -566275 -103532 -32100 -118861 -30947 -322109
10109 -322109 -123488 10474 186352 -155603 -137420 -104105 -99886 52873 -100002 76255 -185510
10097 -89906 -42666 5001 268364 -12089 -33106 -97850 -246150 59133 -73863 -198120 20614
10085c6712G3846A504L3890J17755E9958B4398c38059a66329e6440r8284b7210
10073b6373F9496d07401a1018B00942C7111a70586C6108O7460J62680d2180o4713
10062a06893a7291A18084n5965J77544b02036A06929J29763a69538A49617a23449
10051f9862B35402H0874a97324F3389K03701a10544o3495J0456A25141j4674g8725
10039a02001A39145a53242e4674j86000n9472M433c6033E5449o145a61785P3113
10028h8672H7150H966b73128L4477G491c36154A77280a33103j34360A08039b76496
10016C19004j17891a00588A68543b27514j55915H9749b63324m0954e2310m6431
10006i8741M5980j12816G9458J78117a05142k06955j1262m3936O9611f9103j1192
$$ plain form
10085 -36712 73846 1504 35394 153149 59958 24398 -338059 -166329 -56440 -154724 -27210
10073 -26373 69496 -407401 -11018 200942 37111 -170586 36108 103568 266248 -42180 -106893
10062 -106893 -17291 118084 62119 239663 -202036 106929 236692 -169538 149617 -123449
10051 -69862 235402 80874 -197324 63389 267090 -110544 -174039 -163583 125141 110467 -78725
10039 -102001 139145 -153242 -54674 -240674 -300146 -295713 -36033 55449 49304 -161785 -88672
10028 -88672 87150 8966 -273128 -238651 7491 -336154 177280 -133103 -267463 108039 -276496
10016 319004 201113 -100588 168543 -227514 -383429 89749 -263324 -304278 -52310 -98741
10006 -98741 -52761 -165577 79458 257575 -105142 -312097 -323359 -367295 -297684 -69103 -80295
9995h0295C60120c16593J55573b5725m7221A00009a9349A30659e7130j38811A4460
9983a36779O02R548N5092p165D1663a01737k73912a54617J9168C26618c83617
9971A57334O1690b33486b7533E114J74602D077K13246a49310L4174p1780B28184
9959h2981c9420k47799J20645K2621M7122B73097e4037A1760a31064B3682L18529
9948C42211b16222J05313d6766r62l77584C91102a98158A74830G1097B3608a07946
9936a49147d2095A2600J05585Q613e2004k57587A58180i0924n0439m1725j9715
9925b02803B71395j25418J36690e1281j91824F6406J22841b82650i9085C2960
9914a63994l4657b4425H7278b76376d6098A35529a83819P5502a9118l5233b605
$$ plain form
9995 -80295 360120 -316593 -161020 -25725 -72946 100009 -19349 130659 -57130 -195941 14460
9983 -136779 -136177 -126629 -71537 -78702 41663 -101737 -375649 -154617 -135449 326618 -383617
9971 157334 219024 -233486 -27533 5114 179716 4077 217323 -149310 -115136 -186916 228184
9959 -82981 -39420 -287219 -166574 -143953 -96831 273097 -54037 11760 -131064 23682 342211
9948 342211 -216222 -110909 -46766 -47728 -425312 391102 -198158 174830 71097 23608 -107946
9936 -149147 -42095 12600 118185 126798 -52004 -309591 158180 -90924 -141363 -183088 -202803
9925 -202803 271395 145977 282667 -51281 -243105 66406 189247 -282650 -99085 32960
9914 -163994 -198651 -24425 87278 -276376 -46098 135529 -183819 -108317 -19118 -54351 -2605
9902G3383h7529j40304A44222e866j92749h8593A49546a4241m14441J71052I2966
9890c5672j02607B15450B3936b77030L9963B10120D2205J94927b08649b1702n7087
9879g8789r1363M5817G9438a77087B99337B4165n24O0544J1530P9419G8808J18705
9867A97513b70164a1754C4037a60451j25407H4943a78916k7888F8980L1254k5761
9856G4473a33937B61129h9828B42657a88953D0887a76076A28411D3740J33166
9846A76906n6570J3511C8266J65465e7778B41881d18035a2109l3386k35604A3866
9834a39627J7876M4652k9049B65214a89072j07452k5399J3069D38168A81695a45963
9822D5494A4895M7699J48849c23685A04325j598i3624A6083c77687A6315a23039
$$ plain form
9902 73383 -87529 -227833 144222 -5866 -198615 -88593 149546 -14241 -428682 -257630 92966
9890 -35672 -138279 215450 23936 -277030 -237067 210120 42205 237132 -208649 -21702 -78789
9879 -78789 -170152 -124335 79438 -177087 299337 24165 23641 84185 95715 175134 78808 197513
9867 197513 -270164 -11754 34037 -160451 -285858 84943 -178916 -206804 68980 100234 74473
9856 74473 -133937 261129 -89828 242657 -188953 40887 -176076 128411 43740 176906
9846 176906 120336 133847 38266 203731 -57778 241881 -418035 -12109 -45495 -281099 13866
9834 -139627 -121751 -77099 -106148 265214 -189072 -296524 -321923 -308854 438168 181695 -145963
9822 45494 14895 62594 211443 -323685 104325 102727 -93624 16083 -377687 16315 -123039
9810I2211a31416j52782a1467k9352k30681g4259B43830i3670G852b57523G0651
9798a5295j16053H6640O1281b13658G8467D588b59228e611n7127A55327b00271
9786A94634d00693d6607j55272d0428A99267a71062A02038a02812j41935C13195
9775I4110a47956B10218a78274p4508a241j48433O311O6165k5018k15308j96988
9764e14512C08563f022r0494k16646F4452b66518J10996N7721H9105l4357K17159
9753B71907b85659A52837c06124E902N2411a48567l5767O6945F6519b97020C8504
9741b3141R252n09629a56249c6980j58547I9642d126j32137A60386b43001J03039
9730a39962I3610b30790p1409J48449L5245e8051B16950D1842J48506a13564B9554
$$ plain form
9810 92211 -131416 -284198 -11467 -40819 -271500 -74259 243830 -93670 7852 -257523 70651
9798 -15295 -131348 86640 147921 -213658 78467 4588 -259228 -5611 -62738 155327 -200271
9786 194634 -400693 -46607 -201879 -40428 199267 -171062 102038 -102812 -244747 313195
9775 94110 -147956 210218 -178274 -252782 -1241 -149674 -143363 -77198 -102216 -317524 -514512
9764 -514512 308563 -6022 -96516 -313162 64452 -266518 -155522 -97801 89105 54748 271907
9753 271907 -285659 152837 -306124 5902 58313 -148567 -184334 -117389 66519 -297020 38504
9741 -23141 -13889 -523518 -156249 -36980 -195527 99642 -4126 -136263 160386 -243001 -139962
9730 -139962 93610 -230790 -302199 -153750 -118505 -58051 216950 41842 190348 -113564 29554
9718a99055o8749m13B30867A12420K5474B4341a37092E2351J64907d3884l05477
9707c49361J47552A55008K9341a25044f694k22735j26704a03860l9443B14961
9696a65012j74603E6759M1529a84049g3894J5415N06B23745B1204K03723h5006
9684c10j48563J867A39089M150g8574K90b8339p8760n8831g3914A52458O5662
9672B18120a64766A49993P3222e2913A79903k0442c03977H520a2688H5018b75082
9660B09219i3521c8927k32927c8282C5708P7859b13418F8575B5329e778A72732
9648a54673C9307a03553A38133c3320j35935l0236R4078M9202F2886K8325a51893
9636c02886J29751j70981A23538e1481j27771o6130e9320B29954H4844a53397
$$ plain form
9718 -199055 -267804 -268217 230867 112420 137894 24341 -137092 52351 217258 -43884 -349361
9707 -349361 -201809 155008 184349 -125044 -6694 -229429 -356133 -103860 -143303 214961
9696 -165012 -339615 56759 98288 -184049 -73894 -58479 -57973 223745 21204 224927 -85006
9684 -310 -148873 -147006 139089 143239 -78574 -78284 -28339 -107099 -165930 -73914 152458 218120
9672 218120 -164766 149993 223215 -52913 179903 159461 -303977 8520 -12688 85018 -275082
9660 209219 -93521 -38927 -271854 -38282 35708 113567 -213418 68575 25329 -5778 172732
9648 -154673 39307 -103553 138133 -33320 -169255 -199491 -105413 -56211 62886 91211 -151893
9636 -302886 -173135 -344116 123538 -51481 -179252 -245382 -59320 229954 84844 -153397
9625a87948A8427a09121n2963k68959J46206G5122d48187B4016b69530A08367
9614F2205K09284a60884b9168A47810b90417a21499j70065J02065A24582d3368
9603d650C453b47170C7533E430N6254a03285l9718r3119c914F4029b61325a02611
9590D5008b1887A35498a68539r3702G397Q3872b37282D1554a35174b467A49636
9578c39796a68472C32950r8334F8732l3126d75836B54495d1510n5266j13453e7152
9566c5340r8843A62527n4799L1048n21F3516b97568A06727d9621l28200a49668
9554A758a17875c2935F0384B7382g1802a6584A65652f259A71054k2233b1549B0354
9541a96512A2434h0846c191A93629I5662g2122C2105K82214e0628m06074A04432
$$ plain form
9625 -187948 18427 -109121 -162084 -431043 -284837 75122 -448187 24016 -269530 108367
9614 62205 271489 -160884 -29168 147810 -290417 -121499 -291564 -189499 124582 -43368
9603 -4650 3453 -247170 37533 5430 61684 -103285 -143003 -236122 -3914 64029 -261325 -102611
9590 45008 -21887 135498 -168539 -262241 7397 91269 -237282 41554 -135174 -2467 149636
9578 -339796 -168472 332950 234616 68732 35606 -475836 254495 -41510 -96776 -210229 -57152
9566 -35340 -134183 162527 107728 138776 138255 63516 -297568 106727 -49621 -377821 -149668
9554 1758 -117875 -32935 60384 27382 -71802 -16584 165652 -6259 171054 148821 -21549 20354
9541 -196512 12434 -80846 -3191 193629 95662 -72122 32105 314319 -50628 -456702 104432
9529d03314D6906O5118K462J82626C084J08941a60249F8668A5905h4359C70272
9517A04909a02106k02772i9321J3237p7749E1650L5479K4051C6412b62691Q3570
9506a79121P5751j37057h3701B30959A7445a87752k85843a9254j82018c9013j08551
9495a47564r8975I6961b5909j07631B63301D3997d41359b18458l9039Q3483K9294
9484a44720n6263j15372B8836Q739f5874H0263K206d28570J55775r8006A24456
9472a85389D2575f3233l05760c4392B51442G22a82288E7449d1159A10809m5239
9461F5570p995J35343L699a84681J3635A14513d9178A44818J1551B4204b166C40022
9448b12169I5150a02853A49546C6453b95837k540B16195a08035j3157E6802E769
$$ plain form
9529 -403314 46906 112024 114486 297112 3084 112025 -160249 68668 15905 -84359 370272
9517 104909 -102106 -304878 -99321 -86084 -163833 51650 87129 111180 36412 -262691 -179121
9506 -179121 -103370 -240427 -83701 230959 17445 -187752 -473595 -19254 -201272 -39013 -147564
9495 -147564 -246539 96961 -25909 -133540 263301 43997 -441359 -218458 -257497 -174014 -144720
9484 -144720 -200983 -316355 28836 37575 -65874 80263 82469 -428570 -272795 -370801 124456
9472 -185389 42575 -63233 -368993 -34392 251442 722 -182288 57449 -41159 110809 65570
9461 65570 57575 192918 196617 -184681 -171046 114513 -49178 144818 156369 24204 -2166 340022
9448 -212169 95150 -102853 149546 36453 -295837 -298377 216195 -108035 -121192 56802 5769
9436a11351A39046D845a17122C01315d19555E2057d13468C036K0937f3310o3969
9425a27279m050j53439m809A42999d50616J99179g7476j95602E8938a83682f0090
9413c76038G679a7987l8844J6461B7402c54649e3924p6037a6322A07244a8236
9401d1450j14141A39959a60267R846k4051C4536P1177K5409n559g6546B2814a01714
9388B72346a16084L1155e736m3173l17563i7846m6705B25819K4068b00468P6281
9377a24187A046a84305B0053b05701A00948K46010f1717D01326b44142Q3603G4591
9365b64079C7884b5399p1431A51380F7839a74865E6771b75664B90978b41514J01601
9354a39913k0650M2298K9136k32705D9541f0815j13992A55003a17641k45661A50246
$$ plain form
9436 -111351 139046 4845 -117122 301315 -419555 52057 -413468 3036 23973 -63310 -127279
9425 -127279 -131329 -284768 -289577 142999 -450616 -251437 -77476 -273078 58938 -183682 -60090
9413 -376038 7679 -17987 -56831 -40370 27402 -354649 -53924 -129961 -16322 107244 -18236
9401 -41450 -155591 139959 -160267 -150421 -174472 34536 105713 131122 125563 -76546 22814 -101714
9388 272346 -116084 -84929 -5736 -48909 -366472 -97846 -144551 225819 249887 -200468 -124187
9377 -124187 1046 -184305 20053 -205701 100948 346958 -61717 401326 -244142 -160539 74591
9365 -264079 37884 -25399 -96830 151380 67839 -174865 56771 -275664 290978 -241514 -139913
9354 -139913 -160563 -118265 -89129 -321834 49541 -60815 -174807 155003 -117641 -363302 150246
9342c38053Q6898c1173m92298a92497J3401p3224C5575K16220A23320P1431a44102
9330e8702I676L9449h3970A4592d7297A9256c13444D8745b51873A07453b45469
9318I8770g4431k05625J04741j9827j40096P9560Q2894A05128b38196C9928e528
9306a73980I534Q0665e2311B96879j24856a05330B03930F7004h1131C16025E2278
9294C05803c55807A51388K9242a45259A37411a72615H2348b17375d5988C3763
9283d4962a6356C6853b60745h2162q6063j40773b4965k67064a14132d077j56310
9272a60387j38996M6505a1803I0519A2194a85258M0931n3620n2486B8902E24K5363
9260B5887O8967a78246F604a69481k23641A5345M5061e04066a96535A58190c18140
$$ plain form
9342 -338053 -251155 -31173 -523471 -192497 -179096 -252320 35575 251795 123320 194751 -144102
9330 -58702 9676 49125 -83970 14592 -47297 19256 -313444 48745 -251873 107453 -245469
9318 98770 -74431 -280056 -175315 -195142 -335238 -255678 -172784 105128 -238196 39928 -5528
9306 -173980 9534 90199 -52311 296879 172023 -105330 203930 67004 -81131 316025 52278
9294 305803 -355807 151388 180630 -145259 137411 -172615 82348 -217375 -45988 33763
9283 -44962 -16356 36853 -260745 -82162 -168225 -308998 -24965 -292029 -114132 -4077 -160387
9272 -160387 -299383 -252878 -11803 90519 12194 -185258 -144327 -197947 -250433 28902 524 25887
9260 25887 94854 -178246 6604 -169481 -393122 15345 60406 -504066 -196535 158190 -318140
9248A29169J5509J61415b79021A34073B6565c05542a37786D3033a54031j14418
9238b68449e0412A71381a58030A9194f2654j4469j57029i8762A42503o3617l2294
9227D6592c27580D7370J87287I2285A9413a42290C1463b96478M130a25470B98389
9215a90291H8970D438J70311h0678q1239g019A65474c6386A32068j8854d4894
9203f8035A73511b66430a02431j05948J00287H896M9733M5496J9395j2960d068
9191g9864k24537g0828l6523q3600o6581B53568A03949i2572B35866b46407R2948
9180a53459K3582A92323c6656A09061b31820B12732A6177a28975m2140A8552b2866
9168a79893A21917b63350J07845P2971j56444H9472Q6560b90345G9079e2046A7572
$$ plain form
9248 129169 144678 306093 -279021 134073 26565 -305542 -137786 43033 -154031 -268449
9238 -268449 -50412 171381 -158030 19194 -62654 -77123 -234152 -98762 142503 78886 46592
9227 46592 -327580 47370 234657 92285 19413 -142290 31463 -296478 -292348 -125470 298389
9215 -190291 88970 4438 174749 -80678 -161917 -7019 165474 -36386 132068 113214 -44894
9203 -68035 173511 -266430 -102431 -208379 -108092 8896 58629 104125 123520 110560 -4068
9191 -79864 -304401 -70828 -107351 -190951 -257532 253568 103949 -92572 235866 -246407 -153459
9180 -153459 -129877 192323 -36656 109061 -231820 212732 16177 -128975 -171115 18552 -22866
9168 -179893 121917 -263350 -155505 -82534 -238978 89472 176032 -290345 79079 -52046 17572
9156A36110a00798E4510Q458b25752D9177O6601l915D8948c12403G4067b91542
9144g9719l5096A53013j9936B3837j735L1760a46743m6007A2340a42579f676l95037
9132d01713a79764E5474L210n637a43660M170H8021a69196C4399b30065D5997
9120a35622m0342K1809n037I0315c99457J55329j1432A0637O8833D861J17926
9109A22787c39212j32980A57140a54808B16287k901b54373F5730Q2295K9033c53919
9097A69515d1576j89749A2785N2289f3608B1687f0701o0348d4800p5395j52078
9086b72273d0553j6951n4407j6522c3120j53444A4265b63836O66A90818h8086
9074h3769k3394A72221c75668B38452A6612K20936b81846g2629k7760j09026B3254
$$ plain form
9156 136110 -100798 54510 62968 -225752 49177 115778 111863 48948 -312403 74067 -291542
9144 -79719 -114815 153013 133077 23837 22102 53862 -146743 -192750 12340 -142579 -6676 -401713
9132 -401713 -179764 55474 58684 53047 -143660 -139490 88021 -169196 34399 -230065 45997
9120 -135622 -175964 -154155 -159192 90315 -399457 -244128 -255560 10637 79470 4861 122787
9109 122787 -339212 -472192 157140 -154808 216287 213386 -254373 65730 148025 177058 -353919
9097 169515 -41576 -231325 12785 65074 -63608 21687 -60701 -121049 -44800 -120195 -272273
9086 -272273 -40553 -57504 -111911 -128433 -33120 -186564 14265 -263836 -263170 190818 -88086
9074 -83769 -107163 172221 -375668 238452 16612 237548 -281846 -72629 -100389 -209415 23254
9062c3771G7971a03522d8794J2192l90905J17915R4877B81159j10775n1629a57286
9050E6709p180J06482a95580j72622P2242B59609b71514B23662D0058N8813P8997
9039A77868b01903b5694n8847c1599l68720C0353c24669a8358P687l94065B8801
9027g6091J1728j9070A51844h1243j53435p2495m9934J17171A72231B4398P822
9016C2220a71086c4735A83024n5574c10249D1807J08747b10091b0752C4923a99528
9004g2727k53524B93466d28318a79512q1230q2263E9883A5086b62273a3594B25629
8992i884j16340J8789K5554k8725m3261B5999N3938c5600E7521d4420j75527j94779
8980d14726c3798j13606E1185a76498E587L82802a10101e1541A22283K31094A21136
$$ plain form
9062 -33771 77971 -103522 -48794 -36602 -427507 -309592 -214715 281159 170384 118755 -157286
9050 56709 49529 156011 -195580 -368202 -295960 259609 -271514 223662 40058 98871 177868
9039 177868 -201903 -25694 -84541 -31599 -400319 30353 -324669 -18358 -10671 -404736 28801
9027 -76091 -64363 -83433 151844 -81243 -234678 -307173 -357107 -239936 172231 24398 32220
9016 32220 -171086 -34735 183024 127450 -310249 41807 150554 -210091 -20752 34923 -199528
9004 -72727 -326251 293466 -428318 -179512 -260742 -343005 59883 15086 -262273 -13594 225629
8992 -9884 -126224 -107435 -81881 -110606 -153867 25999 79937 -35600 57521 -44420 -219947 -414726
8980 -414726 -33798 -147404 51185 -176498 5587 388389 -110101 -51541 122283 353377 121136
8968e6572k5645o5620j73604J05467A48272g5912B75418A8483N3121J82340c37428
8956a01442J3170d3305A7303d013j34970j4415N5309A92099a11235N3673C8239
8944b09010G8222a43043c8828o4294k9390l7965D59104d27156H252O3038a59271
8932C472J65929j6175G5705a64701A17169e8309A05557b0718A47639N47452R98150
8921A693241o90574C59816D2710b61571F2509A5285K9386B0284P7321Q1400a1075
8909A20522Q9081E515b47112j4040c4283E9127K8127e519j40128A28478C53N0081
8897E0434J4269c54403R9161g2917A69519J37839j42552g5067C3909b02940B11405
8885B4004b5553a2134j3361j76359K4109j16021B46553a32705L4002E4127a42889
$$ plain form
8968 -56572 -82217 -147837 -321441 -215974 148272 -75912 275418 18483 71604 253944 -337428
8956 -101442 -88272 -43305 17303 -4013 -138983 -153398 -98089 192099 -111235 -57562 38239
8944 -209010 78222 -143043 -38828 -103122 -132512 -170477 459104 -427156 8252 71290 -159271
8932 3472 169401 153226 75705 -164701 117169 -58309 105557 -20718 147639 695091 1693241
8921 1693241 1002667 359816 42710 -261571 62509 15285 44671 20284 97605 179005 -11075
8909 120522 209603 5515 -247112 -261152 -34283 59127 87254 -5519 -145647 128478 353 50434
8897 50434 64703 -354403 -255242 -72917 169519 307358 164806 -75067 33909 -202940 211405
8885 24004 -25553 -12134 -25495 -201854 -177745 -293766 246553 -132705 -98703 54127 -142889
8873b77837g5787C29492b91813H463b64291b7178o9297l14335C05779m9395d2337
8861a59041b7624A07827L4259b23456j80802a15485B9413b91824c3454j04232
8851a37686j37432C09860a20879j74725E8475c7677j38523B47752G3829P2604
8841A46433B1197f1841B2622L0612a82584A2454K2856h3764j38933k0176f6457
$$ plain form
8873 -277837 -75787 329492 -291813 8463 -264291 -27178 -96475 -410810 305779 256384 -42337
8861 -159041 -27624 107827 142086 -223456 -404258 -115485 29413 -291824 -33454 -137686
8851 -137686 -275118 309860 -120879 -295604 58475 -37677 -176200 247752 73829 146433
8841 146433 21197 -61841 22622 53234 -182584 12454 35310 -83764 -222697 -242873 -66457
$$ [...]
##END NTUPLES=NMR SPECTRUM
##END=
