##TITLE=AC1454_BRAAS13253_7818987_Mzxv30Hp8H
##JCAMPDX= 6.0         $$ Bruker NMR JCAMP-DX V2.0
##DATA TYPE= NMR SPECTRUM
##DATA CLASS= NTUPLES
##ORIGIN= BRUKER
##OWNER= Administrator
$$ 1.72 TOPSPIN		Version 2.1
$$ 2013-04-30 18:54:35.545 -0700  Administrator@X
$$ Compression mode = diff/dup
##.OBSERVE FREQUENCY= 400.02188249412
##.OBSERVE NUCLEUS= ^1H
##.ACQUISITION MODE= SIMULTANEOUS (DQD)
##.ACQUISITION SCHEME= undefined
##.AVERAGES= 64
##.DIGITISER RES= 22
##SPECTROMETER/DATA SYSTEM= spect
##.PULSE SEQUENCE= noesygpps1d.comp
##.SOLVENT NAME= COFFEE_meoh
##.SHIFT REFERENCE= INTERNAL, COFFEE_meoh, 1, 14.96081
##AUDIT TRAIL= $$ (NUMBER, WHEN, WHO, WHERE, PROCESS, VERSION, WHAT)
$$ ##TITLE= Audit trail, TOPSPIN		Version 2.1
$$ ##JCAMPDX= 5.01
$$ ##ORIGIN= Bruker BioSpin GmbH
$$ ##OWNER= Administrator
$$ $$ E:\/data/COFFEE/nmr/AC1454_BRAAS13253_7818987_Mzxv30Hp8H/12/pdata/1/auditp.txt
$$ ##AUDIT TRAIL=  $$ (NUMBER, WHEN, WHO, WHERE, PROCESS, VERSION, WHAT)
(   1,<2013-04-30 18:54:30.310 -0700>,<Administrator>,<X>,<go>,<TOPSPIN 2.1>,
      <created by zg
	started at 2013-04-30 18:43:00.560 -0700,
	POWCHK enabled, PULCHK disabled,
       configuration hash MD5:
       F7 49 AB AC A2 8D 51 76 73 8D C1 9A A6 38 9F DE
       data hash MD5: 64K
       B8 35 D3 01 90 01 FF 38 5F 64 D7 FC B2 C1 95 D6>)
(   2,<2013-04-30 18:54:33.545 -0700>,<Administrator>,<X>,<proc1d>,<TOPSPIN 2.1>,
      <Start of raw data processing
       efp LB = 0.3 FT_mod = 6 PKNL = 1 PHC0 = 0 PHC1 = 0 SI = 128K 
       data hash MD5: 128K
       81 E4 04 09 D4 77 56 B1 72 E7 7A 8D A0 02 F3 86>)
(   3,<2013-04-30 18:54:34.529 -0700>,<Administrator>,<X>,<proc1d>,<TOPSPIN 2.1>,
      <pk PHC0 = -78.38745 PHC1 = 0 
       data hash MD5: 128K
       B3 61 7E 9A 00 67 CF 77 07 19 CE DE C7 FC 8F 7B>)
(   4,<2013-04-30 18:54:34.998 -0700>,<Administrator>,<X>,<proc1d>,<TOPSPIN 2.1>,
      <abs ABSG = 1 
       data hash MD5: 128K
       1A 37 67 C8 E9 7F 39 54 D1 25 1B 24 91 5E C8 92>)
(   5,<2013-04-30 18:54:35.092 -0700>,<Administrator>,<X>,<proc1d>,<TOPSPIN 2.1>,
      <abs ABSG = 2 
       data hash MD5: 128K
       79 C0 93 64 C6 5A 6D E3 38 24 F4 46 5E 10 73 89>)
(   6,<2013-04-30 18:54:35.185 -0700>,<Administrator>,<X>,<proc1d>,<TOPSPIN 2.1>,
      <abs ABSG = 3 
       data hash MD5: 128K
       E4 B3 CE B2 6C D0 9B 21 1B EF 63 93 B8 4E 6F A7>)
(   7,<2013-04-30 18:54:35.263 -0700>,<Administrator>,<X>,<proc1d>,<TOPSPIN 2.1>,
      <abs ABSG = 4 
       data hash MD5: 128K
       0C 6F 53 FA EE 83 45 65 58 5F B8 53 30 4A 68 55>)
(   8,<2013-04-30 18:54:35.373 -0700>,<Administrator>,<X>,<proc1d>,<TOPSPIN 2.1>,
      <abs ABSG = 5 
       data hash MD5: 128K
       70 BF 18 FB 35 D5 2B 33 64 21 4F 9E 18 E3 44 27>)
$$ ##END=
$$ 
$$ $$ hash MD5
$$ $$ 2E A9 36 DA 6A 32 27 C9 B4 87 BD 48 9A 1F 8A F5
##$RELAX= 
##$RELAX= 
##$RELAX= 
##$RELAX= 
##$RELAX= 
##$RELAX= 
##$RELAX= 
##$RELAX= 
$$ Bruker specific parameters
$$ --------------------------
##$DU= <E:\>
##$EXPNO= 12
$$ [...]
##$TP07= 0
##$TPNAME0= <>
##$TPNAME1= <>
##$TPNAME2= <>
##$TPNAME3= <>
##$TPNAME4= <>
##$TPNAME5= <>
##$TPNAME6= <>
##$TPNAME7= <>
##$TPOAL= (0..7)
0.5 0.5 0.5 0.5 0.5 0.5 0.5 0.5
##$TPOFFS= (0..7)
0 0 0 0 0 0 0 0
##$TUNHIN= 0
##$TUNHOUT= 0
##$TUNXOUT= 0
##$USERA1= <user>
##$USERA2= <user>
##$USERA3= <user>
##$USERA4= <user>
##$USERA5= <user>
##$V9= 5
##$VALIST= <valist>
##$VCLIST= <CCCCCCCCCCCCCCC>
##$VD= 0
##$VDLIST= <DDDDDDDDDDDDDDD>
##$VPLIST= <PPPPPPPPPPPPPPP>
##$VTLIST= <TTTTTTTTTTTTTTT>
##$WBST= 1024
##$WBSW= 4
##$XGAIN= (0..3)
0 0 0 0
##$XL= 0
##$YL= 0
##$YMAX_a= 6022385
##$YMIN_a= -12634060
##$ZGOPTNS= <>
##$ZL1= 120
##$ZL2= 120
##$ZL3= 120
##$ZL4= 120
##$ABSF1= 14.96081
##$ABSF2= -5.597372
##$ABSG= 5
##$ABSL= 3
##$ALPHA= 0
##$AQORDER= 0
##$ASSFAC= 0
##$ASSFACI= 0
##$ASSFACX= 0
##$ASSWID= 0
##$AUNMP= <proc_prof1d_extract.lims>
##$AXLEFT= 0
##$AXNAME= <>
##$AXNUC= <1H>
##$AXRIGHT= 0
##$AXTYPE= 0
##$AXUNIT= <>
##$AZFE= 0.1
##$AZFW= 0.1
##$BCFW= 0
##$BC_mod= 0
##$BYTORDP= 0
##$COROFFS= 0
##$CY= 15
##$DATMOD= 1
##$DC= 0
##$DFILT= <>
##$DTYPP= 0
##$F1P= 0
##$F2P= 0
##$FCOR= 0.5
##$FTSIZE= 131072
##$FT_mod= 6
##$GAMMA= 0
##$GB= 0
##$INTBC= 1
##$INTSCL= 1
##$ISEN= 128
##$LB= 0.3
##$LEV0= 0
##$LPBIN= 0
##$MAXI= 10000
##$MC2= 0
##$MEAN= 0
##$ME_mod= 0
##$MI= 0
##$NCOEF= 0
##$NC_proc= -2
##$NLEV= 6
##$NOISF1= 0
##$NOISF2= 0
##$NSP= 0
##$NTH_PI= 0
##$NZP= 0
##$OFFSET= 14.96081
##$PC= 1
##$PHC0= -78.38745
##$PHC1= 0
##$PH_mod= 1
##$PKNL= yes
##$PPARMOD= 0
##$PPDIAG= 0
##$PPIPTYP= 0
##$PPMPNUM= 2147483647
##$PPRESOL= 1
##$PSCAL= 4
##$PSIGN= 0
##$PYNMP= <proc.py>
##$REVERSE= no
##$SF= 400.020009713691
##$SI= 131072
##$SIGF1= 0
##$SIGF2= 0
##$SINO= 400
##$SIOLD= 131072
##$SPECTYP= <>
##$SREGLST= <1H.CDCl3>
##$SSB= 0
##$STSI= 131072
##$STSR= 0
##$SW_p= 8223.68421052631
##$SYMM= 0
##$S_DEV= 0
##$TDeff= 65536
##$TDoff= 0
##$TI= <>
##$TILT= no
##$TM1= 0
##$TM2= 0
##$TOPLEV= 0
##$USERP1= <user>
##$USERP2= <user>
##$USERP3= <user>
##$USERP4= <user>
##$USERP5= <user>
##$WDW= 1
##$XDIM= 131072
##$YMAX_p= 335300410
##$YMIN_p= -11203
##$CURPLOT= <Network HP LaserJet P1505>
##$CURPRIN= <$Network HP LaserJet P1505>
##$DFORMAT= <normdp>
##$LAYOUT= <+/1D_H.xwp>
##$LFORMAT= <normlp>
##$PFORMAT= <normpl>
##$SURQMSG= 1
$$ End of Bruker specific parameters
$$ ---------------------------------
##NTUPLES= NMR SPECTRUM
##VAR_NAME=  FREQUENCY,     SPECTRUM/REAL,   SPECTRUM/IMAG
##SYMBOL=    X,             R,               I
##VAR_TYPE=  INDEPENDENT,   DEPENDENT,       DEPENDENT
##VAR_FORM=  AFFN,          ASDF,            ASDF
##VAR_DIM=   131072,        131072,          131072
##UNITS=     HZ,            ARBITRARY UNITS, ARBITRARY UNITS
##FACTOR=    0.0627417313425164, 1,          1
##FIRST=     8223.62146879497, 2360,         -59185
##LAST=      0,             4539,            -58527
##MIN=       0,             -11203,          0
##MAX=       8223.62146879497, 335300410,    0
$$ Real data points
##PAGE= N=1
##DATA TABLE= (X++(R..R)), XYDATA
$$ [...]
61700D98837l766l293l382l737l549k588j568j333j993l025l923m478m553m075
$$ 498837 495071 491778 488396 484659 481110 478522 476954 475621 473628 470603 466680 462202 457649 453574
61686D53574l319k824k786k781k377j714j222r23n67k48l37p07o86o8M08M1p60
$$ 453574 450255 447431 444645 441864 439487 437773 436551 435628 435061 434813 434476 433769 433083 433015 433423 433464 432704
61669D32704r60k54O42R67O90K13j45k81k64l20n14m94J26J024J366Q70K60L13
$$ 432704 431744 431490 432132 433099 433789 434002 433857 433576 433312 432992 432478 431984 432110 433134 434500 435370 435630 435943
61651D35943R08J395J592J851K308K612K515K270K201K181J798R59P8l84m05k74
$$ 435943 436851 438246 439838 441689 443997 446609 449124 451394 453595 455776 457574 458533 458611 458227 457822 457548
61635D57548j57m5r4o03j507k195k190j825j779k218k773l269l803m152l840k904
$$ 457548 457391 457346 457252 456649 455142 452947 450757 448932 447153 444935 442162 438893 435090 430938 427098 424194
61619D24194k011j489r60k19J91j48p20q74r11j592k832l760l987l992m153m214
$$ 424194 422183 420694 419734 419515 419706 419558 418838 417964 417053 415461 412629 408869 404882 400890 396737 392523
61603C92523l983l897m403n181n388m624l410k705k987l802m253m009l604l590
$$ 392523 388540 384643 380240 375059 369671 365047 361637 358932 355945 352143 347890 343881 340277 336687
61589C36687l751l528k959k658k902l275l215k553j546p77r45k231l798m450l835
$$ 336687 332936 329408 326449 323791 320889 317614 314399 311846 310300 309523 308578 306347 302549 298099 294264
61574B94264k621j521p43l54m67q32q83n15k56m04n85m96m72p58q78l37M23O03
$$ 294264 291643 290122 289379 289025 288558 287726 286843 286328 286072 285668 285083 284587 284115 283357 282479 282142 282565 283168
61556B83168L01L40R23J264P39j88n97j67P07J577K303K785K785K105R33j40n27
$$ 283168 283469 283809 284732 285996 286735 286547 285950 285783 286490 288067 290370 293155 295940 298045 298978 298838 298311
61539B98311r8P06J256J266R74Q40J084J548J984K258K149J224n66k300k749j951
$$ 298311 298213 298919 300175 301441 302415 303255 304339 305887 307871 310129 312278 313502 312936 310636 307887 305936
61523C05936j400k199l568l990l299k644k602k571k110j642j451j002LQ36P56
$$ 305936 304536 302337 298769 294779 291480 288836 286234 283663 281553 279911 278460 277458 277461 278297 279053
61508B79053J78j8K38M04L88N17P06N65J48p4L1K24M67Q71J156R23L98K52N36
$$ 279053 279231 279213 279451 279855 280243 280760 281466 282031 282179 282105 282136 282360 282827 283698 284854 285777 286175 286427 286963
61489B86963N55q4q93j228j033o69l92k53j64J04O40J085R71N07M35J023J685
$$ 286963 287518 287434 286541 285313 284280 283611 283219 282966 282802 282906 283546 284631 285602 286109 286544 287567 289252
61472B89252J894J880K029K078J465L41m22k48M46Q15N66J53j4k04r23j930k219
$$ 289252 291146 293026 295055 297133 298598 298939 298517 298269 298715 299530 300096 300249 300235 300031 299108 297178 294959
61455B94959j256K08R93Q34L79J00n2l1M17J056J125L75m24m04M07J467K466L196
$$ 294959 293703 293911 294904 295738 296117 296217 296165 296134 296551 297607 298732 299107 298683 298279 298686 300153 302619 305815
61437C05815L147K026N89J59J210K835L807L750L172K660K321J883J135K32m14
$$ 305815 308962 310988 311577 311736 312946 315781 319588 323338 326510 329170 331491 333374 334509 334741 334327
61422C34327n38k58J08L96O39R30J318J777K170K292K079J661J147M64m21j240
$$ 334327 333789 333531 333639 334035 334674 335604 336922 338699 340869 343161 345240 346901 348048 348512 348091 346851
61406C46851j619j535j376j499j820j982j859j783k101k620k747k224j477r86
$$ 346851 345232 343697 342321 340822 339002 337020 335161 333378 331277 328657 325910 323686 322209 321223
61392C21223o32k9O82R74P70N52N70O12P32J365K319K486J330M0J45J414K272
$$ 321223 320591 320562 321244 322218 322988 323540 324110 324722 325454 326819 329138 331624 332954 332994 333139 334553 336825
61375C36825K097J810K050K210J851J760K591L470L181K155J813K292K270J209
$$ 336825 338922 340732 342782 344992 346843 348603 351194 354664 357845 360000 361813 364105 366375 367584
61361C67584K86N58J420J735J593J912K829L548L581L312L305L775M715N958P034
$$ 367584 367870 368428 369848 371583 373176 375088 377917 381465 385046 388358 391663 395438 400153 406111 413145
61346D13145P455P182O510N600M540L719L518L697L640L200K755K490K273K151
$$ 413145 420600 427782 434292 439892 444432 448151 451669 455366 459006 462206 464961 467451 469724 471875
61332D71875K232K081J093l72j214j234j505k562l344k790j581j126j423j217
$$ 471875 474107 476188 477281 476909 475695 474461 472956 470394 467050 464260 462679 461553 460130 458913
61318D58913p7J071J558J935K935M290N202N419N428N836O875Q270R491J0263
$$ 458913 458836 459907 461465 463400 466335 470625 475827 481246 486674 492510 499385 507655 517146 527409
61304E27409J0862J1647J2390J2444J1497R785P678N443L358J578p9j822l479
$$ 527409 538271 549918 562308 574752 586249 596034 603712 609155 612513 614091 614012 612190 608711
61291F08711m761n807o893p775p987p731p706p996p910p061n884m905m178l701
$$ 608711 603950 598143 591250 583475 575488 567757 560051 552055 544145 537084 531200 526295 522117 518416
61277E18416l596l492k526m52J824L323L997M240M083L581L400M080N098N434
$$ 518416 514820 511328 508802 508350 510174 513497 517494 521734 525817 529398 532798 536878 541976 547410
61263E47410M973M586M872N502N860N754N342M818M344M046L912L874L913L949
$$ 547410 552383 556969 561841 567343 573203 578957 584299 589117 593461 597507 601419 605293 609206 613155
61249F13155L765L188K277J092m08j995l034l140k799k868l533m207m363m049
$$ 613155 616920 620108 622385 623477 623069 621074 618040 614900 612101 609233 605700 601493 597130 593081
61235E93081l585l171k860k645k456k286k217k089j360L01K345L807M449M950
$$ 593081 589496 586325 583465 580820 578364 576078 573861 571772 570412 570713 573058 576865 581314 586264
61221E86264N782O463O301N462M846M964N459N809O097O716P518P726O851N434
$$ 586264 592046 598509 604810 610272 615118 620082 625541 631350 637447 644163 651681 659407 666258 671692
61207F71692M497M388M475M065L253K702K871L728M995O361P554Q472R306J0346
$$ 671692 676189 680577 685052 689117 692370 695072 697943 701671 706666 713027 720581 729053 738359 748705
61193G48705J1692J3169J4472J5217J5035J3828J1939R934Q153O533M833K983
$$ 748705 760397 773566 788038 803255 818290 832118 844057 853991 862144 868677 873510 876493
61181H76493J231l4o96j153j970l262m607n620o393p224q097q675q750q546q556
$$ 876493 877724 877690 876994 875841 873871 870609 866002 860382 853989 846765 838668 829993 821243 812697 804141
61166H04141r083r979j0826j1353j1595j1665j1619j1674j2121j2743j2710j1613
$$ 804141 795058 785079 774253 762900 751305 739640 728021 716347 704226 691483 678773 667160
61154F67160j0274r853j0315j0553r909q667p053m858k393q13q02j766k873m099
$$ 667160 656886 647033 636718 626165 616256 607589 600536 595678 593285 592472 591670 589904 587031 582932
61140E82932n606o830p182p019p016o964o152m615l082j854o74M90J380K203L559
$$ 582932 577326 570496 563314 556295 549279 542315 536163 531548 528466 526612 525938 526428 527808 530011 533570
61125E33570N553P633R369J0848J2227J3558J5010J6736J8490J9904K1034K2095
$$ 533570 539123 546756 556125 566973 579200 592758 607768 624504 642994 662898 683932 706027
61113G06027K2931K3328K3672K4459K5351K5583K5209K4934K4742K3705K1451
$$ 706027 728958 752286 775958 800417 825768 851351 876560 901494 926236 949941 971392
61102I71392J8752J6316J3899J1081Q084N217K168j515n730r977j3820j6844j8725
$$ 971392 990144 1006460 1020359 1031440 1039524 1044741 1046909 1045394 1039664 1029687 1015867 999023 980298
61089I80298j9714k0610k1841k3045k3755k3945k3634k2665k1295k0311k0067
$$ 980298 960584 939974 918133 895088 871333 847388 823754 801089 779794 759483 739416
61078G39416k0001j9535j8774j7789j6065j3509j1304j0612j0820j0218q302o301
$$ 739416 719415 699880 681106 663317 647252 633743 622439 611827 601007 590789 582487 576186
61066E76186n312m897l954k251n57M00O42P38J169J880K522L066L947N408P026
$$ 576186 570874 565977 562023 559772 559215 559615 560257 560995 562164 564044 566566 569632 573579 578987 586013
61051E86013Q218R007R829J0816J1732J2537J3525J4792J6119J7479J9169K1267
$$ 586013 594231 603238 613067 623883 635615 648152 661677 676469 692588 710067 729236 750503
61039G50503K3251K4495K4983K5290K6002K7283K8964L0832L2734L4507L5947
$$ 750503 773754 798249 823232 848522 874524 901807 930771 961603 994337 1028844 1064791
61028A064791L6996L7950L9311M1271M3460M5332M6756M8135M9989N2535N5743
$$ 1064791 1101787 1139737 1179048 1220319 1263779 1309111 1355867 1404002 1453991 1506526 1562269
61017A562269N9706O4803P1456P9916R0488J03876J20939J42127J67666J98392
$$ 1562269 1621975 1686778 1758234 1838150 1928638 2032514 2153453 2295580 2463246 2661638
61007B661638K35791K80947L34360L97247M71985N60130O61070P74185R01039
$$ 2661638 2897429 3178376 3512736 3909983 4381968 4942098 5603168 6377353 7278392
60998G278392J042631J194665J348553J496267J628130J722807J746876J675214
$$ 7278392 8321023 9515688 10864241 12360508 13988638 15711445 17458321 19133535
60990A9133535J513637J294027J044302P71197M79565K00726j5473j44358k14649
$$ 19133535 20647172 21941199 22985501 23756698 24236263 24436989 24421516 24277158 24062509
60981B4062509k84744l94200n45779p29928r48943j205167j472316j693747j815771
$$ 24062509 23777765 23383565 22837786 22107858 21158915 19953748 18481432 16787685 14971914
60972A4971914j820240j725701j565748j371662j168961r77826q10506o70132
$$ 14971914 13151674 11425973 9860225 8488563 7319602 6341776 5531270 4861138
60964D861138n54385m59845l83097l20502k69168k27681j95084j69753j49748
$$ 4861138 4306753 3846908 3463811 3143309 2874141 2646460 2451376 2281623 2131875
60955B131875j33535j19830j07494r6016q5580p6329o8109o1042n5527n1393m7824
$$ 2131875 1998340 1878510 1771016 1675000 1589420 1513091 1444982 1383940 1328413 1277020 1229196
60944A229196m4455m1785m0147l9033l7858l6566l5084l3022l0390k7870k5784
$$ 1229196 1184741 1142956 1102809 1063776 1025918 989352 954268 921246 890856 862986 837202
60933H37202k3592k0996j8739j7549j6970j6152j5142j4417j3680j2241j0313
$$ 837202 813610 792614 773875 756326 739356 723204 708062 693645 679965 667724 657411
60922F57411q871q265p948p518p189p060o832o385n933n461m712l910l722m246
$$ 657411 648540 640275 632327 624809 617620 610560 603728 597343 591410 585949 581237 577327 573605 569359
60908E69359m711m537m061l771l424k619j749j615k233k724k540k148k211k598
$$ 569359 564648 560111 556050 552279 548855 546236 544487 542872 540639 537915 535375 533227 531016 528418
60894E28418k638k178j773j791j864j585j242j372j772j675r73m83p74j311j248
$$ 528418 525780 523602 521829 520038 518174 516589 515347 513975 512203 510528 509555 509072 508298 506987 505739
60879E05739n99L5M55R56J578K007K187K435K856L197L366L568L815L781L415
$$ 505739 505140 505175 505630 506586 508164 510171 512358 514793 517649 520846 524212 527780 531595 535376 538791
60864E38791L287M032N662P573R093R895J0075R973R807R538R122Q724Q367P704
$$ 538791 542078 546110 551772 559345 568438 578333 588408 598381 608188 617726 626848 635572 643939 651643
60850F51643O649O010O688Q253R161Q676P800P757Q321Q339P419O325N799N853
$$ 651643 658292 664302 670990 679243 688404 697080 704880 712637 720958 729297 736716 743041 748840 754693
60836G54693O152O548P020P513Q027Q589R159R745J0562J1737J2969J3766J4082
$$ 754693 760845 767393 774413 781926 789953 798542 807701 817446 828008 839745 852714 866480 880562
60823H80562J4367J4963J5676J5963J5317J3523J0818P808M978K304l87k833m587
$$ 880562 894929 909892 925568 941531 956848 970371 981189 988997 993975 996279 995892 993059 988472
60810I88472n844p495r998j2679j4513j5410j6223j7470j8571j8606j7591j6500
$$ 988472 982628 975133 965135 952456 937943 922533 906310 888840 870269 851663 834072 817572
60798H17572j6023j5781j5089j4081j3488j3406j3105j2233j1408j1167j1041
$$ 817572 801549 785768 770679 756598 743110 729704 716599 704366 692958 681791 670750
60787F70750j0380r559r427r850r806q887p801p245p189p390p761p915p237n882
$$ 670750 660370 650811 641384 631534 621728 612841 605040 597795 590606 583216 575455 567540 560303 554421
60773E54421m900m883n181n086m978n477o112n913m977m403m719n303n410n003
$$ 554421 549521 544638 539457 534371 529393 523916 517804 511891 506914 502511 497792 492489 487079 482076
60759D82076m426l943l791m100m538m507l895l243l005l096l229l301l219k856
$$ 482076 477650 473707 469916 465816 461278 456771 452876 449633 446628 443532 440303 437002 433783 430927
60745D30927k333k022k019k007j823j772k099k456k240j347l56j8o13j665k229
$$ 430927 428594 426572 424553 422546 420723 418951 416852 414396 412156 410809 410453 410435 409822 408157 405928
60730D05928j727n45L89O35N57N91O62N16K01q1l51o95r52q88o39o67j222k069
$$ 405928 404201 403656 404045 404680 405237 405828 406490 407006 407207 407126 406775 406080 405128 404240 403601 402934 401712 399643
60712C99643k743l017l051l250l884m825n604n790n329m523l731l011k149j131
$$ 399643 396900 393883 390832 387582 383698 378873 373269 367479 362150 357627 353896 350885 348736 347605
60698C47605m68p45j739k458k279j681j441j523j296o07N4L55M05L23J28P5M28
$$ 347605 347137 346392 344653 342195 339916 338235 336794 335271 333975 333368 333422 333777 334182 334505 334633 334708 335136
60681C35136Q97R64P90J062J803K225K056K040K680L308L110K397K093K432K938
$$ 335136 336033 336997 337787 338849 340652 342877 344933 346973 349653 352961 356071 358468 360561 362993 365931
60666C65931L255L346L130K627K250K328K530K324J805J496J546J690J814K011
$$ 365931 369186 372532 375662 378289 380539 382867 385397 387721 389526 391022 392568 394258 396072 398083
60652C98083K174K125K008K113K400K650K915L294L466K991J883M74j072k560
$$ 398083 400257 402382 404390 406503 408903 411553 414468 417762 421228 424219 426102 426576 425504 422944
60638D22944l413l320k944l257m208m847m706m281m087m061m008l894l521k638
$$ 422944 419531 416211 413267 410010 405802 400955 396249 391968 387881 383820 379812 375918 372397 369759
60624C69759j526q31o84o18m50m83p29p60n75p23j274j487r65k75J6J17K16j57
$$ 369759 368233 367402 366718 366100 365650 365167 364438 363678 363103 362380 361106 359619 358654 358379 358395 358512 358728 358571
60606C58571j180j908j439k99L19K59K77N09L15l88p51k57N49R82J097J224J314
$$ 358571 357391 355483 354044 353745 354064 354323 354600 355109 355424 355036 354285 354028 354577 355559 356656 357880 359194
60589C59194J211J174J566K252K671K393J430J61q32j104p30j82K54P36J478K418
$$ 359194 360405 361579 363145 365397 368068 370461 371891 372052 371220 370116 369386 369204 369458 370194 371672 374090
60573C74090L423M490N478N980N879N758O268P242P929Q076Q159Q426Q360P464
$$ 374090 377513 382003 387481 393461 399340 405098 411366 418608 426537 434613 442772 451198 459558 467022
60559D67022O131N098M359L254J584o3j201k034k814l226k823j761n45P13K239
$$ 467022 473153 478251 482610 485864 487448 487385 486184 484150 481336 478110 475287 473526 472981 473694 475933
60544D75933L933N315O160O767P543Q608R900J1208J2148J2412J2144J1709J1098
$$ 475933 479866 485181 491341 498108 505651 514259 524159 535367 547515 559927 572071 583780 594878
60531E94878R940Q130O000L696R21k403n594p686q294p797o902o230o027o008
$$ 594878 604818 612948 618948 622644 623565 621162 615568 607882 599588 591791 584889 578659 572632 566624
60517E66624n623m724l720k958k285j496p92l39L04J730L740N495O608P562Q958
$$ 566624 561001 556277 552557 549599 547314 545818 545026 544687 544991 546721 550461 555956 562564 570126 579084
60502E79084J0871J3191J6071J9577K3226K6378K9014L1644L4430L6862L8470
$$ 579084 589955 603146 619217 638794 662020 688398 717412 749056 783486 820348 858818
60491H58818L9385L9864L9551L7681L3960K8704K2101J3965M507n237j4234k2443
$$ 858818 898203 938067 977618 1015299 1049259 1077963 1100064 1114029 1118536 1113299 1099065 1076622
60479A076622l0371l7800m3600m6890m7814m7072m5179m2425l9141l5562l1730
$$ 1076622 1046251 1008451 964851 917961 870147 823075 777896 735471 696330 660768 629038
60468F29038k7768k4087k1017j8443j6021j3682j1699j0302r399q620p604o361
$$ 629038 601270 577183 556166 537723 521702 508020 496321 486019 476620 468000 460396 454035
60456D54035n339m905m834m572m070l886m340m964n137m887m599m261l508k320
$$ 454035 448696 443791 438957 434385 430315 426429 422089 417125 411988 407101 402502 398241 394733 392413
60442C92413j250p94q80j046r34n19l3K79L55K97K02J24J53L61N81M66j05q71
$$ 392413 391163 390369 389489 388443 387509 386990 386957 387236 387591 387888 388090 388214 388367 388728 389309 389775 389670 388799
60424C88799j467j701j471p90J3M22L47K57M96P90P89P51J149J783J901J263N81
$$ 388799 387332 385631 384160 383370 383383 383805 384152 384409 384905 385695 386484 387235 388384 390167 392068 393331 393912
60407C93912O67J464K148K109J590J317J551J743J258L56k2N38J423J944K240
$$ 393912 394579 396043 398191 400300 401890 403207 404758 406501 407759 408115 408093 408631 410054 411998 414238
60392D14238K727L182L053K494K273K609K811K327J505J047J064J175J160J139
$$ 414238 416965 420147 423200 425694 427967 430576 433387 435714 437219 438266 439330 440505 441665 442804
60378D42804J234J444J791K326K857K949K312J176J71k34k05l04p78j243j168
$$ 442804 444038 445482 447273 449599 452456 455405 457717 458893 459064 458830 458625 458321 457543 456300 455132
60363D55132n84p9j16n80r33o85K42J420K188K213J911K075L053M392N303N401
$$ 455132 454548 454469 454353 453773 452840 452155 452397 453817 456005 458218 460129 462204 465257 469649 474952 480353
60347D80353M953M546M548M883N202N267N089M701L974K774J184n29k093l290
$$ 480353 485306 489852 494400 499283 504485 509752 514841 519542 523516 526290 527474 526945 524852 521562
60333E21562m017m411m859n603o423o826o500n531m258l104k385k119k078k082
$$ 521562 517545 513134 508275 502672 496249 489423 482923 477392 473134 470030 467645 465526 463448 461366
60319D61366k146k251k148j589o28M76J460K100K253K124K222K822L668M434N220
$$ 461366 459220 456969 454821 453232 452604 453080 454540 456640 458893 461017 463239 466061 469729 474163 479383
60304D79383O311P705R243J0925J2636J3754J3624J2374J0771R242P520N220K277
$$ 479383 485694 493399 502642 513567 526203 539957 553581 565955 576726 585968 593488 598708 600985
60291F00985j215n001q388j0500j1115j0929j0720j0544r958q742p166n750m906
$$ 600985 599770 594769 586381 575881 564766 553837 543117 532573 522615 513873 506707 500957 496051
60278D96051m654m601m401m234m487m998n005m094k826k154k371k945l225l131
$$ 496051 491397 486796 482395 478161 473674 468676 463671 459577 456751 454597 452226 449281 446056 442925
60264D42925l138l638m347m497l774k753k096j590o28N20P78j94j317j420o58
$$ 442925 439787 436149 431802 427305 423531 420778 418682 417092 416464 416984 417762 417568 416251 414831 414173
60249D14173m7p6m12o38o10k34M98J272J669J668J574J531J422J234J084R48O85
$$ 414173 414126 414050 413638 413000 412390 412156 412654 413926 415595 417263 418837 420368 421790 423024 424108 425056 425741
60232D25741L81L30O58J226J898K647L345L758L809L630L406L275L361L636L839
$$ 425741 426122 426452 427110 428336 430234 432881 436226 439984 443793 447423 450829 454104 457465 461101 464940
60217D64940L747L514L471L714M164M898N947O864P078O777O854P725Q711Q923
$$ 464940 468687 472201 475672 479386 483550 488448 494395 501259 508337 515114 521968 529693 538404 547327
60203E47327Q326P492O698N889N292N338N950O405O117N180M025K894J875J099
$$ 547327 555653 563145 569843 575732 581024 586362 592312 598717 604834 610014 614039 616933 618808 619907
60189F19907N92R6o95j754k740l306l347l069k923l303m123m877n205n235n194
$$ 619907 620499 620595 619900 618146 615406 612100 608753 605684 602761 599458 595335 590458 585253 580018 574824
60174E74824m984m466l972l978m378m541m198l742l491l195k631k268k637l296
$$ 574824 569840 565374 561402 557424 553046 548505 544307 540565 537074 533879 531248 528980 526343 523047
60160E23047l110j768l53om19k84Q59J975J923R88M06O80J179J440J981L205M252
$$ 523047 519937 518169 517816 517810 517391 517107 517966 519941 521864 522852 523258 523938 525117 526557 528538 531743 535995
60143E35995L922K545J820K604L774L910L236L061L778M440M342M031M390N382
$$ 535995 539917 542462 544282 546886 550660 554570 557806 560867 564645 569085 573427 577458 581848 587230
60129E87230O167O125N295M025K736J917J906K443K719K184J211O42P85J091R82
$$ 587230 593397 599522 604817 608842 611578 613495 615401 617844 620563 622747 623958 624600 625385 626476 627458
60114F27458O36P30J531K539K972K426J103l04j074j055q12r75j590k393l363
$$ 627458 628094 628824 630355 632894 635866 638292 639395 639091 638017 636962 636150 635175 633585 631192 627829
60099F27829m446m966m248k835k203k838l563l250k349j909j860j291m7J058J502
$$ 627829 623383 618417 614169 611334 609131 606293 602730 599480 597131 595222 593362 592071 592024 593082 594584
60084E94584J541J410R79M16L02P98J322J353J017N78n6r76j896k609l464m926
$$ 594584 596125 597535 598514 598930 599232 600030 601352 602705 603722 604300 604244 603268 601372 598763 595299 590373
60068E90373o777q171q484p914p260p148p481p636p167o215n154m125l167k553
$$ 590373 583596 575425 566941 559027 551767 544619 537138 529502 522335 516120 510966 506841 503674 501121
60054E01121k536k884k980k438j338j9J011J228O55J28N66J973L644N143O509
$$ 501121 498585 495701 492721 490283 488945 488926 489937 491165 491820 491948 492514 494487 498131 503274 509783
60039E09783P646Q191Q042P443O509N267M095L424K965K030O48l70p50j210k357
$$ 509783 517429 525620 533662 541105 547614 552881 556976 560400 563365 565395 566043 565673 564923 563713 561356
60024E61356l917n449p009q593r740j0233j0507j0719j0194q548o686n763n551
$$ 561356 557439 551990 544981 536388 526648 516415 505908 495189 484995 476447 469761 463998 458447
60011D58447m862l286j596n34q3k1l14q45j258j320j047m44L89J016J019O40N62
$$ 458447 453585 450299 448703 448169 448086 448065 447751 446906 445648 444328 443281 442837 443226 444242 445261 445901 446463
59994D46463R68J334J281J120J363K051K854L485L841L953M051M388M887N107
$$ 446463 447431 448765 450046 451166 452529 454580 457434 460919 464760 468713 472764 477152 482039 487146
59980D87146M741L983L222K552J812J017L78j34r53k333l803m453l855k441r52
$$ 487146 491887 495870 499092 501644 503456 504473 504851 504717 503764 501431 497628 493175 489320 486879 485927
59965D85927J87Q94J248J580K332L389L900L307K287J969K370K460J778J062R51
$$ 485927 486114 487008 488256 489836 492168 495557 499457 502764 505051 507020 509390 511850 513628 514690 515641
59950E15641R42K72q09j365j115p17p41r38o85L4L36o43k535l862l752l149l527
$$ 515641 516583 516855 516046 514681 513566 512849 512108 511170 510485 510519 510855 510212 507677 503815 500063 496914 493387
59933D93387m773n312m379k948k086j549p08J83N82P54J362K374L229L667L732
$$ 493387 488614 483302 478923 475975 473889 472340 471632 471815 472397 473151 474513 476887 480116 483783 487515
59918D87515L423K990L081L901M743N085N407O189O805O582O195O631P286O705
$$ 487515 490938 493928 497009 500910 505653 510738 516145 522334 529139 535721 541916 548547 555833 562538
59904E62538N029L966M158M232L000J099l09j237k336l550m393m870n191n017
$$ 562538 567567 571533 575691 579923 582923 584022 583713 582476 580140 576590 572197 567327 562136 557119
59890E57119l851k046n62J96P43J666K874L842M323M631N182N776N680M647L575
$$ 557119 553268 551222 550660 550856 551599 553265 556139 559981 564304 568935 574117 579893 585573 590220 593795
59875E93795L590M528M980M030K335J197J065J270R24l21k157l941n104n489n261
$$ 593795 597385 601913 606893 610923 613258 614455 615520 616790 617714 617393 615236 611295 606191 600702 595441
59860E95441m642l878l321l112k914k269j253l85P6L42O36J013J598K519L589
$$ 595441 590799 586921 583600 580488 577574 575305 574052 573667 573743 574085 574721 575734 577332 579851 583440
59845E83440M485N231N948O248N526L978K554J763J158K65o50j115j165j138j191
$$ 583440 587925 593156 599104 605352 610878 614856 617410 619173 620331 620596 619946 618831 617666 616528 615337
59830F15337j357j697k128k523l180m575o415p583p458o674o145n898n487m949
$$ 615337 613980 612283 610155 607632 604452 599877 593462 585879 578421 571747 565602 559704 554217 549268
59816E49268m642m464l995l217k471j829j090l20J77L58M27L80J0o16j111j313
$$ 549268 544626 540162 536167 532950 530479 528650 527560 527240 527417 527775 528202 528582 528592 527976 526865 525552
59800E25552j464j836k374k839l102l266l639m430n404n925n594m694l882l519
$$ 525552 524088 522252 519878 517039 513937 510671 507032 502602 497198 491273 485679 480985 477103 473584
59786D73584l480l423l077k399j707j466j771k143k026j413p87n82q47j265j379
$$ 473584 470104 466681 463604 461205 459498 458032 456261 454118 452092 450679 449892 449310 448463 447198 445819
59771D45819r10k9Q52J544K167K729K994K973L090L595M173M505M830N495O171
$$ 445819 444909 444880 445732 447276 449443 452172 455166 458139 461229 464824 468997 473502 478332 483827 489998
59756D89998O120N198M124L663L922M525N198N899O554O923O821O448O259O418
$$ 489998 496118 501316 505440 509103 513025 517550 522748 528647 535201 542124 548945 555393 561652 568070
59742E68070O478N927M899L949L225K337J185L04J22L67N93Q11J136J258Q74K70
$$ 568070 574548 580475 585374 589323 592548 594885 596070 596374 596496 596863 597456 598267 599403 600661 601535 601805
59726F01805o8j91m01m92j28K37k47j360j710n69J025J580J062O16P90R59N19
$$ 601805 601737 601546 601145 600653 600525 600762 600515 599155 597445 596876 597901 599481 600543 601159 601949 602908 603427
59709F03427j69l95m2M70Q43J108J418K033L210M685N491M931L644L106L898N112
$$ 603427 603258 602863 602821 603291 604134 605242 606660 608693 611903 616588 622079 627010 630654 633760 637658 642770
59693F42770N627N403N071M817M270L171J594k47j918k748k498j870j804k352
$$ 642770 648397 653800 658871 663688 667958 671129 672723 672476 670558 667810 665312 663442 661638 659286
59679F59286k828k879k817k932l187l570m136m685m939n054n333n515n104m394
$$ 659286 656458 653579 650762 647830 644643 641073 636937 632252 627313 622259 616926 611411 606307 601913
59665F01913m243m744m959m270l077j892o79M09P16J99k3R18K336L006K871K772
$$ 601913 597670 592926 587967 583697 580620 578728 578049 578458 579174 579373 579350 580268 582604 585610 588481 591253
59649E91253K950K856K256J508P99mp48j065j187j898l453n102o013o188o218
$$ 591253 594203 597059 599315 600823 601622 601618 600870 599805 598618 596720 593267 588165 582152 575964 569746
59634E69746o427o576o200n096l512j978r06l98l95q21j513k293l133m050m751
$$ 569746 563319 556743 550543 545447 541935 539957 539051 538653 538258 537437 535924 533631 530498 526448 521697
59619E21697m827m354l881l692l569l452l612l927l697k692j649j161p33K28J128
$$ 521697 516870 512516 508635 504943 501374 497922 494310 490383 486686 483994 482345 481184 480451 480679 481807
59604D81807R38j59r19o88rM35N38M06M8l55m72k45Pl3n59j575k547k492j115
$$ 481807 482745 482586 481667 480979 480970 481405 481943 482349 482397 482042 481570 481325 481332 481299 480740 479165 476618 474126 473011
59585D73011M77R54L75k04m18q17j558k044k069k197k694l020k793k411k311k336
$$ 473011 473488 474442 474817 474613 474195 473378 471820 469776 467707 465510 462816 459796 457003 454592 452281 449945
59569D49945k274k249k204j718q21k86n81j163j383j401j574j558q51K13Q30Q87
$$ 449945 447671 445422 443218 441500 440679 440393 439812 438649 437266 435865 434291 432733 431882 432095 432925 433812
59553D33812R74J356J644J560J476J942K999M130M765M812M760N165O007O750
$$ 433812 434786 436142 437786 439346 440822 442764 445763 449893 454658 459470 464230 469395 475402 482152
59539D82152P116P516Q531J0214J2063J3407J3642J2487J0309P884N555K921k67
$$ 482152 489268 496784 505315 515529 527592 540999 554641 567128 577437 585321 590876 593797 593530
59526E93530l187m542l965k401j026j90M63J221J914K150J779J047L83m1n74j790
$$ 593530 590343 585801 581836 579435 578409 578219 578682 579903 581817 583967 585746 586793 587176 587135 586561 584771
59510E84771l893o351q212q904q696q321q180q100p841p478p084o456n439m281
$$ 584771 580878 574527 566315 557411 548715 540394 532214 524114 516273 508795 501711 495255 489816 485535
59496D85535l365k671j894r78k15R5r6m40j91J184K999L626K464J071J376L133
$$ 485535 482170 479499 477605 476627 476412 476507 476411 475971 475780 476964 479963 483589 486053 487124 488500 491633
59480D91633M371M212L834M380N316N532M997M399L961L490L000K524J793Q12
$$ 491633 496004 500216 504050 508430 513746 519278 524275 528674 532635 536125 539125 541649 543442 544254
59466E44254K27M25P54M57j34k21J15J92J38Q63K658M741O358P479Q271Q703Q951
$$ 544254 544481 544906 545660 546117 545983 545762 545877 546069 546207 547070 549728 554469 560827 568306 576577 585280 594231
59449E94231R416J0052J0298R942R376Q733P484N274K559j36k945o038q743j0153
$$ 594231 603647 613699 623997 633939 643315 652048 659532 664806 667365 667229 664284 658246 649503 639350
59435F39350j0403j0497j0918j1091j0404r105p838o779n632m227k690j172L17
$$ 639350 628947 618450 607532 596441 586037 576932 569094 562315 556683 552456 549766 548594 548911
59422E48911J802L329M982O744Q430R941J1521J3456J5549J7245J8303J9011J9524
$$ 548911 550713 554042 559024 565768 574198 584139 595660 609116 624665 641910 660213 679224 698748
59409F98748J9355J7807J4742J0599N841P96m051q059j0853j2441j2800j1733
$$ 698748 718103 735910 750652 761251 767092 767888 763837 755778 744925 732484 719684 707951
59397G07951r386o643m687m151m883o425q536j1175j4160j6953j8809j9162j7933
$$ 707951 698565 691922 687235 683084 678201 671776 663240 652065 637905 620952 602143 582981 565048
59384E65048j5522j2633r963p914o427n144l827k533j361k54P72J394J327Q80
$$ 565048 549526 536893 526930 519016 512589 507445 503618 501085 499724 499470 500242 501636 502963 503843
59370E03843Q27J585K753L531L506K984K642K880L510M071M433M887N613O354
$$ 503843 504670 506255 509008 512539 516045 519029 521671 524551 528061 532132 536565 541452 547065 553419
59356E53419O887P490Q601J0122J1512J2446J3100J3782J4670J5795J6956J7711
$$ 553419 560306 567796 576397 586519 598031 610477 623577 637359 652029 667824 684780 702491
59344G02491J7918J8129J8934J9942K0112J9132J7766J6564J5012J2425R125O028
$$ 702491 720409 738538 757472 777414 797526 816658 834424 850988 866000 878425 887550 893578
59332H93578L396O96k438n695q586j0937j2767j3990j4551j4714j4949j5528j6194
$$ 893578 896974 897670 895232 889537 880951 870014 857247 843257 828706 813992 799043 783515 767321
59319G67321j6356j5665j4342j2884j1545j0284r123q211p526o836n997n072m080
$$ 767321 750965 735300 720958 708074 696529 686245 677122 668911 661385 654549 648552 643480 639400
59306F39400k928j660m75O25J875L373M941O455Q031R643J0934J1610J1730J1405
$$ 639400 636472 634812 634337 634962 636837 640210 645151 651606 659637 669280 680214 691824 703554 714959
59292G14959J0473Q750O451L981J470j284m352p352r610j0578j0182q780o794
$$ 714959 725432 734182 740633 744614 746084 744800 740448 733096 723486 712908 702726 693946 687152
59279F87152m479k148l08P69J458K381L718N269P020R003J0689J1283J0783J0040
$$ 687152 682673 680525 680217 680986 682444 684825 688543 693812 700832 709835 720524 731807 742590 752630
59265G52630R498Q568O653M152J932K87j132k719m739p234r711j1304j1779j1971
$$ 752630 762128 770696 777349 781501 783433 783720 782588 779869 775130 767896 758185 746881 735102 723131
59251G23131j2701j3633j3825j3010j1725j0424r162q005o974n724l908j907n26
$$ 723131 710430 696797 682972 669962 658237 647813 638651 630646 623672 617948 614040 612133 611607
59238F11607K7L12P77J268J565J802K144K442K449K085J405N51k02p08j275k428
$$ 611607 611634 611946 612723 613991 615556 617358 619502 621944 624393 626478 627883 628434 628232 627524 626249 623821
59222F23821m235o176p743q826r440r434q674p293n679m317l597l481l381k712
$$ 623821 619586 613410 605667 596841 587401 577967 569293 562000 556321 552004 548407 544926 541545 538833
59208E38833j590o43j20L78J125J764J887J756J947K531L051L271L504M072M821
$$ 538833 537243 536600 536480 536858 537983 539747 541634 543390 545337 547868 550919 554190 557694 561766 566587
59193E66587N352N450N107M394L633L475M321N690O540O419N909N728N819N662
$$ 566587 571939 577389 582496 586890 590523 593998 598319 604009 610549 616968 622877 628605 634424 640086
59179F40086N106M486M043L815L859M106M052L250K122J651K151K962L511M003
$$ 640086 645192 649678 653721 657536 661395 665501 669553 672803 674925 676576 678727 681689 685200 689203
59165F89203M689N141M864M185L888M152M380L952K800J335J11n69j000j883l559
$$ 689203 693892 699033 703897 708082 711970 716122 720502 724454 727254 728589 728700 728131 727131 725248 721689
59150G21689n601p329q467r060r149q869q577q471q271p651o776o019n403m662
$$ 721689 716088 708759 700292 691232 682083 673214 664637 656166 647895 640244 633468 627449 622046 617384
59136F17384l684k556j328j56N50N44K72N48J754L520N072N769N567N181N493
$$ 617384 613700 611144 609816 609660 610210 610754 611026 611574 613328 616848 621920 627689 633256 638437 643930
59121F43930O497P241P082O587O710P466Q108Q264Q206Q113P791P235O789O619
$$ 643930 650427 657668 664750 671337 678047 685513 693621 701885 710091 718204 725995 733230 740019 746638
59107G46638O386N638M257K497Q54j32l08j43k63q08j472k023k509l055l701m343
$$ 746638 753024 758662 762919 765416 766270 766138 765830 765687 765424 764616 763144 761121 758612 755557 751856 747513
59091G47513m700m570m233m202m461m401l847l517l993m804n217n337n696o211
$$ 747513 742813 738243 734010 729808 725347 720946 717099 713582 709589 704785 699568 694231 688535 682324
59077F82324o443o538o905p277p062o468o246o389o206n705n734o465o938o532
$$ 682324 675881 669343 662438 655161 648099 641631 635385 628996 622790 617085 611351 604886 597948 591416
59063E91416n877n729n814n474m751m133l756l510l502l811m101m027l750l554
$$ 591416 585539 579810 573996 568522 563771 559638 555882 552372 548870 545059 540958 536931 533181 529627
59049E29627l283k607j669r61o68n14j84L08O09L37m07q57l08Q53J389P51j13
$$ 529627 526344 523737 522068 521107 520439 519925 519741 520049 520658 520995 520588 519731 519423 520276 521665 522416 522303
59032E22303R5J462L005M008M654N402O379P459Q572R628J0393J0688J0645J0637
$$ 522303 522398 523860 526865 530873 535527 540929 547308 554767 563339 572967 583360 594048 604693 615330
59018F15330J0900J1231J1192J0569R542Q301O769M899L023J569M44q46k388l543
$$ 615330 626230 637461 648653 659222 668764 677065 683834 688733 691756 693325 693769 692923 690535 686992
59004F86992l584k544j205l16J36Q43K292L998M908M642L920L526L294K614J535
$$ 686992 683408 680864 679659 679343 679479 680322 682614 686612 691520 696162 700082 703608 706902 709516 711051
58989G11051O58J33m85j314j856j802j602j848k435k701k216j221l12K81J087
$$ 711051 711709 711842 711357 710043 708187 706385 704783 702935 700500 697799 695583 694362 694050 694331 695418
58974F95418K736M919O469O838P023Q301J0455J2074J2369J1876J1413J1265J1448
$$ 695418 698154 703073 709542 716380 723403 731704 742159 754233 766602 778478 789891 801156 812604
58961H12604J1846J1842J0628Q286N858L972K086n25l655o519q762j0618j2357
$$ 812604 824450 836292 846920 855206 861064 865036 867122 866597 862942 856423 847661 837043 824686
58948H24686j3981j5212j5627j5051j3964j3130j2722j2208j1236j0076r012p896
$$ 824686 810705 795493 779866 764815 750851 737721 724999 712791 701555 691479 682467 674571
58936F74571o580n262m064k735j125L91J251J160J06j544k870k907j755p02q32
$$ 674571 667991 662729 658665 655930 654805 655196 656447 657607 657713 656169 653299 650392 648637 647935 647103
58921F47103j935l007l409l146k482j771j371j363j453j353j016m54L44J211J931
$$ 647103 645168 642161 638752 635606 633124 631353 629982 628619 627166 625813 624797 624343 624687 625898 627829
58906F27829K648L673M887N865O664P775R241J0516J1492J2728J4377J5695J6161
$$ 627829 630477 634150 639037 644902 651566 659341 668582 679098 690590 703318 717695 733390 749551
58893G49551J6216J6316J6098J5259J4537J4877J6132J7438J8452J9329J9783
$$ 749551 765767 782083 798181 813440 827977 842854 858986 876424 894876 914205 933988
58882I33988J9164J7442J5253J2979J0444P461M164O98k853o256r194j1589j3512
$$ 933988 953152 970594 985847 998826 1009270 1016731 1020895 1021593 1018740 1012484 1003290 991701 978189
58869I78189j4918j5754j6163j6266j5954j5239j4497j4004j3458j2471j1240
$$ 978189 963271 947517 931354 915088 899134 883895 869398 855394 841936 829465 818225
58858H18225j0245r492q632p743p401p907q822r350r051q196p559p730q454q904
$$ 818225 807980 798488 789856 782113 774712 766805 757983 748633 739582 731386 723827 716097 707643 698739
58844F98739q687q214p948p768p403o962o600o073n239m558m549m986n249n255
$$ 698739 690052 681838 673890 666122 658719 651757 645157 639084 633845 629287 624738 619752 614503 609248
58830F09248n340n456n099m115k982k162j553p13N69K012K986L068K623K518L157
$$ 609248 603908 598452 593353 589238 586256 584094 582541 581828 582397 584409 587395 590463 593086 595604 598761
58815E98761L980M203L692K889K183J724J496J251O47j97o72n35m52j138k410
$$ 598761 602741 606944 610636 613525 615708 617432 618928 620179 620826 620629 619957 619422 618970 617832 615422
58800F15422l471l894l800l368k818k604l053l889m558m878m956m666l796k564
$$ 615422 611951 608057 604257 600889 598071 595467 592414 588525 583967 579089 574133 569467 565671 563107
58786E63107j478o77K08J555L330N113O274O390N691M913M530M401M287M196L943
$$ 563107 561629 560952 561160 562715 566045 571158 577432 583822 589513 594426 598956 603357 607644 611840 615783
58771F15783K933R08j549l691n352o613p278p242o963o908o928o735o482o231
$$ 615783 618716 619624 618075 614384 609032 602419 595141 587899 580936 574028 567100 560365 553883 547652
58757E47652n327l231o24J176J784J938K268K677K877K860K794K924L525M486
$$ 547652 542325 539094 538470 539646 541430 543368 545636 548313 551190 554050 556844 559768 563293 567779
58743E67779N180N209N008N181N627N954O354P205Q171Q504Q118P554P017O327
$$ 567779 572959 578168 583176 588357 593984 599938 606292 613497 621668 630172 638290 645844 652861 659188
58729F59188N642N371N377N067M281L346K325J007l77j267j680k163k824l146
$$ 659188 664830 670201 675578 680645 684926 688272 690597 691604 691227 689960 688280 686117 683293 680147
58715F80147k878k324j662p09M97J519K071K192J800P34q04k376l869n314o356
$$ 680147 677269 674945 673283 672574 673071 674590 676661 678853 680653 681387 680583 678207 674338 669024 662668
58700F62668o755p164q452j0334j1675j2191j2625j3160j2964j1807j0757j0544
$$ 662668 655913 648749 640297 629963 618288 606097 593472 580312 567348 555541 544784 534240
58688E34240j0275q799o485m684l889l559l335l464l959m199l659k589j733j543
$$ 534240 523965 515166 508681 503997 500108 496549 493214 489750 485791 481592 477933 475344 473611 472068
58674D72068j736j595p03O14J740K566L503M767O036O908P357P590P821Q210Q677
$$ 472068 470332 468737 468034 468648 470388 472954 476457 481224 487260 494168 501525 509115 516936 525146 533823
58659E33823Q680P626N598L370J512j57k087m298o322p566p668o748n411m325
$$ 533823 542503 550129 555727 559097 560609 560452 558365 554067 547745 540179 532511 525763 520352 516027
58645E16027l756l627l830m175m232l695k848k219j841j290l24R01K142L080L242
$$ 516027 512271 508644 504814 500639 496407 492712 489864 487645 485804 484514 484190 485091 487233 490313 493555
58630D93555K529J720J694K213K224J434O77N22M36j38o49j79J082J986J934J627
$$ 493555 496084 497804 499498 501711 503935 505369 506046 506568 507004 506866 506217 506038 507120 509106 511040 512667
58614E12667K102L469M881N588N660N631N649N348M457L189J950J038O53P79R71
$$ 512667 514769 518238 523119 528707 534367 539998 545647 550995 555452 558641 560591 561629 562282 563061 564032
58599E64032O61j10q45j482k427l437l491k269q70k41K08J481L275M600N444O545
$$ 564032 564693 564583 563738 562256 559829 556392 552901 550632 549762 549521 549729 551210 554485 559085 564529 571074
58583E71074P886Q727Q992R361J0020J0440J0367J0064R632R053Q749Q990R031
$$ 571074 578960 587687 596679 606040 616060 626500 636867 646931 656563 665616 674365 683355 692386
58570F92386Q038O747O768Q260R738J0450J1410J3632J6635J9355K1392K2766
$$ 692386 700424 707171 713939 722199 731937 742387 753797 767429 784064 803419 824811 847577
58558H47577K3386K3437K3387K3107K1738J8922J5399J1972Q693N415K307n81
$$ 847577 870963 894400 917787 940894 962632 981554 996953 1008925 1017618 1023033 1025340 1024759
58546A024759l460o056p658q327r186j0948j2958j4323j5194j6297j7836j9506
$$ 1024759 1021299 1015243 1007585 999258 990072 979124 966166 951843 936649 920352 902516 883010
58534H83010k1054k2201k2507k1845k0720j9636j8511j6912j4656j1947r298p321
$$ 883010 861956 839755 817248 795403 774683 755047 736536 719624 704968 693021 683723 676402
58522F76402o186n305m096k879k339k298j937j167p36r04j050q28o87r47j252
$$ 676402 670216 664911 660815 657936 655597 653299 651362 650195 649459 648555 647505 646677 645990 645043 643791
58507F43791j275j167j053q69r09j606k626l016k456j524o87QK39l74j187r22
$$ 643791 642516 641349 640296 639427 638518 636912 634286 631270 628814 627290 626603 626611 626850 626476 625289 624367
58491F24367N89K182L072L569L916L831L688M654O918R120J0239J0948J2300J4169
$$ 624367 624956 627138 630210 633779 637695 641526 645214 649868 656786 665906 676145 687093 699393 713562
58477G13562J5721J6531J6564J5882J4879J3944J2576R863O079K580j71l003o102
$$ 713562 729283 745814 762378 778260 793139 807083 819659 829522 835601 838181 838010 835007 828905
58464H28905q284q893q800q724q077o448m626l124j148J719M229N278N650O585
$$ 828905 820621 811728 802928 794204 786127 779679 775053 771929 770781 772500 776729 782007 787657 794242
58450G94242P730Q006P466O711N328K550j150m517p152r368j0923j1181j0331
$$ 794242 801972 809978 817444 824155 829483 832033 830883 826366 819214 809846 798923 787742 777411
58437G77411r302q592p933o947n483l635j784k17J457L763O113P173O866O701
$$ 777411 768109 759517 751584 744637 739154 735519 733735 733518 734975 738738 744851 752024 758890 765591
58423G65591P676R009R619R484Q855P494N491L560J793n45l256m916n159n571
$$ 765591 773267 782276 791895 801379 810234 817728 823219 826779 828572 828027 824771 819855 814696 809125
58409H09125p168q723q883q314q278q570q408p969p557o573m753l124k330j452
$$ 809125 801957 793234 784351 776037 767759 759189 750781 742812 735255 728682 723929 720805 718475 717023
58395G17023Q2J135J005J148K799M598M714L770L263K659P19j471j716k06R63
$$ 717023 717105 718240 719245 720393 723192 727790 732504 736274 739537 742196 742915 741444 739728 739522 740485
58380G40485J176J585K382K451J730J490K118K742L120M025N622P206Q535R838
$$ 740485 741661 743246 745628 748079 749809 751299 753417 756159 759279 763304 768926 776132 784667 794505
58366G94505J0725J0665J0344J0862J1904J2323J2212J2644J3652J4182J3847
$$ 794505 805230 815895 826239 837101 849005 861328 873540 886184 899836 914018 927865
58355I27865J3112J2000J0145P871N812L846J776M07L85P00Q5p60j92J757L609
$$ 927865 940977 952977 963122 970993 976805 980651 982427 982834 983219 983919 984004 983244 983052 984809 988418
58340I88418M769N758O615P029P651R356J1537J2844J3267J3786J4480J4705J4620
$$ 988418 993187 998945 1005560 1012589 1020240 1029596 1041133 1053977 1067244 1081030 1095510 1110215 1124835
58327A124835J4669J4184J2301R770Q056P145N966M320K674R06r07j413L45K988
$$ 1124835 1139504 1153688 1165989 1175759 1183815 1190960 1196926 1201246 1203920 1204826 1203919 1202506 1202851 1205839
58313A205839M502M907N303N516M994M875O554R106J0659J1371J2519J3701J3750
$$ 1205839 1210341 1215248 1220551 1226067 1231061 1235936 1242490 1251596 1262255 1273626 1286145 1299846 1313596
58300A313596J3448J4397J5995J6413J5849J5892J6418J6194J5774J6667J8267
$$ 1313596 1327044 1341441 1357436 1373849 1389698 1405590 1422008 1438202 1453976 1470643 1488910
58289A488910J8750J8474J9257K0826K1296K0763K1109K2566K3659K4254K5491
$$ 1488910 1507660 1526134 1545391 1566217 1587513 1608276 1629385 1651951 1675610 1699864 1725355
58278A725355K7053K7609K7568K8340K9513K9868L0331L2554L5532L7203L8385
$$ 1725355 1752408 1780017 1807585 1835925 1865438 1895306 1925637 1958191 1993723 2030926 2069311
58267B069311M1227M4847M6707M7470M9934N3878N6578N7963O0470O4005O5881
$$ 2069311 2110538 2155385 2202092 2249562 2299496 2353374 2409952 2467915 2528385 2592390 2658271
58256B658271O5673O5527O5775O4838O3325O3396O4399O3995O3263O5515P0419
$$ 2658271 2723944 2789471 2855246 2920084 2983409 3046805 3111204 3175199 3238462 3303977 3374396
58245C374396P4649P8026Q3358R0430R6209J01006J08253J17959J26556J33587
$$ 3374396 3449045 3527071 3610429 3700859 3797068 3898074 4006327 4124286 4250842 4384429
58235D384429J42250J53024J63100J72506J84185J97868K10542K23156K39694
$$ 4384429 4526679 4679703 4842803 5015309 5199494 5397362 5607904 5831060 6070754
58226F070754K59528K78261K96293L18626L45983L74589M04890M41587M84594
$$ 6070754 6330282 6608543 6904836 7223462 7569445 7944034 8348924 8790511 9275105
58217I275105N29497N77433O34681P02055P75245Q56374R54035J071314J206081
$$ 9275105 9804602 10382035 11016716 11718771 12494016 13350390 14304425 15375739 16581820
58208A6581820J364221J560162J803729K100248K463949K915627L465979M117759
$$ 16581820 17946041 19506203 21309932 23410180 25874129 28789756 32255735 36373494
58200C6373494M885038N791929O851559Q065966R444604J0997176J2708764J4550050
$$ 36373494 41258532 47050461 53902020 61967986 71412590 82409766 95118530 109668580
58192A09668580J6505081J8543372K0558916K2378397K3813826K4615564K4363676
$$ 109668580 126173661 144717033 165275949 187654346 211468172 236083736 260447412
58185B60447412K2564745J9009880J3996570Q074726J613898n215918j2032582
$$ 260447412 283012157 302022037 316018607 324093333 325707231 320491313 308458731
58178C08458731j8031280k2356566k4642760k5115515k4260492k2536921k0358494
$$ 308458731 290427451 268070885 243428125 218312610 194052118 171515197 151156703
58171A51156703j8124572j6119691j4409568j2897538j1473410j0093165q764771
$$ 151156703 133032131 116912440 102502872 89605334 78131924 68038759 59273988
58164E9273988p517602o387428n399902m558569l853098l271403k796951k405858
$$ 59273988 51756386 45368958 39969056 35410487 31557389 28285986 25489035 23083177
58156B3083177k077910j804366j579129j390865j229967j094644r83636q90335
$$ 23083177 21005267 19200901 17621772 16230907 15000940 13906296 12922660 12032325
58148A2032325q09154p40114o82183o29430n78248n31279m89955m50244m09857
$$ 12032325 11223171 10483057 9800874 9171444 8593196 8061917 7571962 7121718 6711861
58139F711861l72606l41288l12833k84617k59304k39260k22111k05824j92528
$$ 6711861 6339255 5997967 5685134 5400517 5141213 4901953 4679842 4474018 4281490
58130D281490j83477j75578j66576j58504j52592j45891j36470j26956j19554
$$ 4281490 4098013 3922435 3755859 3597355 3444763 3298872 3162402 3035446 2915892
58121B915892j12303j03673r6073r1268q6843q0793p5305p2409o9879o5146n9706
$$ 2915892 2803589 2699916 2603843 2512575 2425732 2344939 2269634 2197225 2127346 2062200 2002494
58110B002494n6109n3780n1116m8685m7212m5282m1919l8898l7777l7294l6032
$$ 2002494 1946385 1892605 1841489 1792804 1745592 1700310 1658391 1619493 1581716 1544422 1508390
58099A508390l4967l5130l5337l4527l3694l3452l2365k9746k7394k6548k5775
$$ 1508390 1473423 1438293 1402956 1368429 1334735 1301283 1268918 1239172 1211778 1185230 1159455
58088A159455k3785k1656k0352j8832j6516j4867j4637j4330j3242j3072j4528
$$ 1159455 1135670 1114014 1093662 1074830 1058314 1043447 1028810 1014480 1001238 988166 973638
58077I73638j5378j4162j2903j3721j5441j6083j6124j6743j7172j6420j5412
$$ 973638 958260 944098 931195 917474 902033 885950 869826 853083 835911 819491 804079
58066H04079j5093j4451j2728j1425j1786j2338j1365r789r223r155q452p825
$$ 804079 788986 774535 761807 750382 738596 726258 714893 705104 695881 686726 678274 670449
58054F70449q321r043q721q065q324q981q930q452q058p033n150m046m795n811
$$ 670449 662128 653085 644364 636299 627975 618994 610064 601612 593554 586521 581371 577325 572530 566719
58040E66719n350m338m476n273n457n565o554p320o434n037n198o443o700n927
$$ 566719 561369 557031 552555 547282 541825 536260 529706 522386 515952 510915 505717 499274 492574 486647
58026D86647n961p212q200q120p558o821n699m749m769n201m769l602k922k978
$$ 486647 480686 473474 465274 457154 449596 442775 437076 432327 427558 422357 417588 413986 411064 408086
58012D08086k947k684k776l089k806j891j068n55n2K63Q6q1M11J086R98L05o6
$$ 408086 405139 402455 399679 396590 393784 391893 390825 390270 390218 390481 390567 390486 390897 391983 392981 393286 393220
57995C93220J00L37N38P86O46r1n45J13J163J345Q00N96P48L08q85k047k856l650
$$ 393220 393320 393657 394195 394981 395627 395536 394991 395104 396267 397612 398412 399008 399756 400064 399179 397132 394276 390626
57977C90626m295m191l362k486j880j471j483k049k452j930r99p04p84J4J811
$$ 390626 386331 382140 378778 376292 374412 372941 371458 369409 366957 365027 364028 363324 362540 362554 364365
57962C64365L124K873J603M26l12p62p89j50Q72J558J445P94L36M53P92Q49Q17
$$ 364365 367489 370362 371965 372391 372079 371317 370528 370378 371250 372808 374253 375047 375383 375836 376628 377477 378294
57945C78294J269K204L080L770M644N638O253O587P285Q244Q610Q292Q172Q355
$$ 378294 379563 381767 384847 388617 393261 398899 405152 411739 419024 427268 435878 444170 452342 460697
57931D60697P755O081M580L818K443o02m022n954o561p267q315q902q938r155
$$ 460697 468452 474533 479113 482931 485374 484772 480750 474796 468235 460968 452653 443751 434813 425658
57917D25658r745j0323j0763j0927j0103p991n665m341l775l040k195j803j483
$$ 425658 415913 405590 394827 383900 373797 365806 360141 355800 352025 348985 346790 344987 343504
57904C43504m73P80J164O68K05j1m84j050r40j19O13R00J053J173J107J132J596
$$ 343504 343031 343811 344975 345643 345848 345837 345353 344303 343363 343244 343857 344757 345810 346983 348090 349222 350818
57887C50818K138K176J892J745J443N01o62j372j983l253m839n751n985o248o448
$$ 350818 352956 355132 357024 358769 360212 360713 360051 358679 356696 353443 348604 342853 336868 330620 324172
57872C24172n902m839m190l992l497k751k530k666k095p81ql18n66L33J961L234
$$ 324172 318270 313431 309241 305249 301752 299001 296471 293805 291710 290929 290921 290603 290037 290370 292331 295565
57856B95565L702L574L216L147L695M399M409L633K803K349K035J724J543J232
$$ 295565 299267 302841 306057 309204 312899 317298 321707 325340 328143 330492 332527 334251 335794 337026
57842C37026K92j075k013k179k058k019j947j889k119k447k276j573r32n49R7
$$ 337026 337318 336243 334230 332051 329993 327974 326027 324138 322019 319572 317296 315723 314791 314242 314339
57827C14339J335K791L927M482M386L873L551L762M024L803L400L254K903J734
$$ 314339 315674 318465 322392 326874 331260 335133 338684 342446 346470 350273 353673 356927 359830 361564
57813C61564L88K9M38L32o21j577k318l614n537p078p874q691r628r442p613n605
$$ 361564 361952 361981 362419 362751 362130 360553 358235 354621 349084 342006 334132 325441 315813 306371 298758 293153
57797B93153m936n116m648l284k045j576j603j746j879j745r03P95K861M359M571
$$ 293153 288217 283101 278453 275169 273124 271548 269945 268199 266320 264575 263672 264467 267328 271687 276258
57782B76258L809L392M169N351N613N150N395O624P329O432M827L836L350K484
$$ 276258 280067 283459 287628 292979 298592 303742 309137 315761 323090 329522 334349 338185 341535 344019
57768C44019J226K35m30j231k093k451k310k433l320m592n473n561n038m326l616
$$ 344019 345245 345480 345050 343819 341726 339275 336965 334532 331212 326620 321147 315586 310548 306222 302606
57753C02606k740j586n24j27n09j237j812j922j395m48J21l43j445k112j808q82
$$ 302606 299866 298280 297756 297629 297120 295883 294071 292149 290754 290306 290427 290084 288639 286527 284719 283837
57737B83837J63R26Q72k18j451j533n01K41p5n80k15P09J118O46j68o73n87j05
$$ 283837 284000 284926 285798 285580 284129 282596 282095 282336 282261 281681 281466 282175 283293 283939 283771 283098 282511 282406
57719B82406J52l28j224j717j639j567j649j335n89l55j171k262k691k684k894
$$ 282406 282558 282230 281006 279289 277650 276083 274434 273099 272510 272155 270984 268722 266031 263347 260453
57704B60453l079k481j175j25Q3j73k10K28Q64J225J123Q95R70J194R91K46n62
$$ 260453 257374 254893 253718 253593 253676 253503 253293 253521 254385 255610 256733 257628 258598 259792 260783 261029 260467
57687B60467j153j697k053j537J09K212M059N706P525R586J2001J5169J9156K3387
$$ 260467 259314 257617 255564 254027 254136 256348 260407 266113 273638 283224 295225 310394 329550 352937
57673C52937K7500L1901L6894M1964M6520N0643N4217N5956N4242M8580L9400
$$ 352937 380437 412338 449232 491196 537716 588359 642576 698532 752774 801354 840754
57662H40754K6896J1241o260k3287l7937m9292n6673n9404n7699n2991m6901m0271
$$ 840754 867650 878891 872631 849344 811407 762115 705442 646038 588339 535348 488447 448176
57650D48176l3475k7138k2010j8283j5458j2932j0564q596p170o119n247m601
$$ 448176 414701 387563 365553 347270 331812 318880 308316 299720 292550 286431 281184 276583
57638B76583m214l768k897j758r48p39q26q58q27q03p03n87p45j289j917k259
$$ 276583 272369 268601 265704 263946 262998 262259 261433 260575 259748 258945 258242 257655 256910 255621 253704 251445
57622B51445k222j929j630j671k157k645k548j881j122m84J25N08L19k09n18p24
$$ 251445 249223 247294 245664 243993 241836 239191 236643 234762 233640 233156 233281 233789 234108 233899 233381 232657
57606B32657j436k387k455j384m26o22j469j992k197k525k699k165j164m33k48
$$ 232657 231221 228834 226379 224995 224569 223947 222478 220486 218289 215764 213065 210900 209736 209303 209055
57591B09055n27j339k471l034k428j400j138j679k084j952j713j598j320p98l43
$$ 209055 208528 207189 204718 201684 199256 197856 196718 195039 192955 191003 189290 187692 186372 185574 185231
57576A85231m5K82M57J9r61j760j953j913k208k851l268k912j808o69k40m64o56
$$ 185231 185186 185468 185925 185944 184983 183223 181270 179357 177149 174298 171030 168118 166310 165641 165401 164937 164281
57559A64281n96p97j350j360k80R48J061L11N2P47J498J549J182R28P66M76J44
$$ 164281 163685 162888 161538 160178 159898 160846 161907 162218 162270 163017 164515 166064 167246 168174 168940 169416 169560
57542A69560L9K70O88Q54L64m72o41K78J303J298O40N65J193J416P61N0l2J94
$$ 169560 169599 169869 170557 171411 171775 171303 170662 170940 172243 173541 174181 174746 175939 177355 178116 178166 178134 178328
57524A78328M42J175K514L403K774J087j92k90L09P79P59L59j07l61m24o10j054
$$ 178328 178770 179945 182459 185862 188636 189723 189531 189241 189550 190329 191088 191447 191340 190979 190555 189945 188891
57507A88891j412j347j119j375k323l398l858l569l027k655k308j668r26n94p08
$$ 188891 187479 186132 185013 183638 181315 177917 174059 170490 167463 164808 162500 160832 159906 159312 158604
57492A58604p61o11q12j608k204j738n48L00M87O47J190J780J973J713J099K57
$$ 158604 157843 157232 156420 154812 152608 150870 150322 150622 151109 151756 152946 154726 156699 158412 159511 159768
57476A59768n12r76j352j867k123j688j118j411k339k543j540n14n56j205j526
$$ 159768 159256 158280 156928 155061 152938 151250 150132 148721 146382 143839 142299 141785 141229 140024 138498
57461A38498j643k156k693k332j161k58j24j41K13N22K47l26n09k25k0j94m14
$$ 138498 136855 134699 132006 129674 128513 128255 128131 127990 128203 128725 128972 128646 128137 127912 127892 127698 127284
57444A27284k74J40M77O57R03J278J539J532J426J376J259R59P08Q00J078J159
$$ 127284 127010 127150 127627 128284 129187 130465 132004 133536 134962 136338 137597 138556 139264 140064 141142 142301
57428A42301R69P74P26P46Q14R22Q37L33l34o27m52k32k55l95n24p03p59l34N05
$$ 142301 143270 144044 144770 145516 146330 147252 148089 148422 148088 147461 147009 146777 146522 146127 145603 144900 144141 143807 144312
57409A44312J149J252J145J179J111N52k72p35n97k14q4l85q54r94n52J01L71
$$ 144312 145461 146713 147858 149037 150148 150700 150428 149693 149096 148882 148798 148413 147559 146565 146013 146114 146485
57392A46485K82M80J282K159K485K340K202K187K104J941J843J785J728J846K179
$$ 146485 146767 147247 148529 150688 153173 155513 157715 159902 162006 163947 165790 167575 169303 171149 173328
57377A73328K252J533K16r59j647k121k552k559j797o36L1l12j220j651j011J38
$$ 173328 175580 177113 177329 176370 174723 172602 170050 167491 165694 165058 165089 164777 163557 161906 160895 161033
57361A61033O10q7j183j608j238p11l30K64J276K245K536K052J204N05L58R14
$$ 161033 161643 161556 160373 158765 157527 156816 156486 156750 158026 160271 162807 164859 166063 166568 166926 167840
57345A67840J810K268J804P27k07n42l03K86R22J158P13p0m15L7P54Q80J47r16
$$ 167840 169650 171918 173722 174449 174242 173700 173397 173683 174605 175763 176476 176406 175991 176028 176782 177662 177809 176893
57327A76893j543j388o96m4J60M9R1M91Q70P52K32j13O6N12P78P95Q21R50R06
$$ 176893 175350 173962 173266 173222 173382 173431 173522 174013 174883 175635 175867 175754 175820 176332 177110 177905 178726 179676 180582
57308A80582M18l21p18m50R7K38j36m51k91Q4K84M28P69J012P11J24m7K41K83
$$ 180582 181000 180679 179961 179511 179608 179846 179710 179259 178968 179052 179336 179764 180533 181545 182256 182380 182333 182574 182857
57289A82857j93n95m55j35o8j5L36N96K61l61n85m14l89n62l61M42J433K279L141
$$ 182857 182664 182069 181614 181479 181411 181396 181732 182328 182589 182228 181643 181229 180840 180278 179917 180359 181792 184071 187212
57270A87212M139M946N232N068M672M053L204K418K096K352K829K979K557J892
$$ 187212 191351 196297 201529 206597 211269 215322 218526 220944 223040 225392 228221 231200 233757 235649
57256B35649J589J848K258K374K260K190K187K174K308K664K838K413J720J523
$$ 235649 237238 239086 241344 243718 245978 248168 250355 252529 254837 257501 260339 262752 264472 265995
57242B65995J999K556K707K587K520K583K732K921L014K940K969L344L687L363
$$ 265995 267994 270550 273257 275844 278364 280947 283679 286600 289614 292554 295523 298867 302554 305917
57228C05917K572K358L255M419M614L651K466J987K309K848L015K708K350K400
$$ 305917 308489 310847 314102 318521 323135 326786 329252 331239 333548 336396 339411 342119 344469 346869
57214C46869K863L327L499L465L522L960M879N988O678O700O602P053P876Q307
$$ 346869 349732 353059 356558 360023 363545 367505 372384 378372 385050 391750 398352 405405 413281 421588
57200D21588Q180Q141Q618R266R680J0091J0930J2175J3397J4209J4485J4495
$$ 421588 429768 437909 446527 455793 465473 475564 486494 498669 512066 526275 540760 555255
57188E55255J4862J5884J6885J6886J5931J5027J4636J4244J3704J3900J5317
$$ 555255 570117 586001 602886 619772 635703 650730 665366 679610 693314 707214 722531
57177G22531J6947J7612J7626J8065J9003J9585J9561J9466J9560J9664J9989
$$ 722531 739478 757090 774716 792781 811784 831369 850930 870396 889956 909620 929609
57166I29609K0930K2007K2258K1833K2046K3417K4871K5427K5591K6292K7352
$$ 929609 950539 972546 994804 1016637 1038683 1062100 1086971 1112398 1137989 1164281 1191633
57155A191633K8056K8500K9331L0453L1109L1120L1139L1611L2198L2386L2097
$$ 1191633 1219689 1248189 1277520 1307973 1339082 1370202 1401341 1432952 1465150 1497536 1529633
57144A529633L1632L1370L1585L2187L2728L3046L3635L4945L6641L8166L9697
$$ 1529633 1561265 1592635 1624220 1656407 1689135 1722181 1755816 1790761 1827402 1865568 1905265
57133A905265M1642M3481M4293M4435M5488M8069N0912N2776N4248N6878O1255
$$ 1905265 1946907 1990388 2034681 2079116 2124604 2172673 2223585 2276361 2330609 2387487 2448742
57122B448742O6784P2769P8791Q4631R0506R7071J04504J12165J19812J28350
$$ 2448742 2515526 2588295 2667086 2751717 2842223 2939294 3043798 3155963 3275775 3404125
57112C404125J38717J50863J64894J82223K04333K31148K62175K98603L42814
$$ 3404125 3542842 3693705 3858599 4040822 4245155 4476303 4738478 5037081 5379895
57103E379895L96525M61311N40506O38524P58184R00132J064446J251122J459832
$$ 5379895 5776420 6237731 6778237 7416761 8174945 9075077 10139523 11390645 12850477
57094A2850477J691537J949460K235235K544015K865736L189781L504380L792550
$$ 12850477 14542014 16491474 18726709 21270724 24136460 27326241 30830621 34623171
57086C4623171M034489M213357M311053M298398M144316L846956L449224L008467
$$ 34623171 38657660 42871017 47182070 51480468 55624784 59471740 62920964 65929431
57078F5929431K547536K042010J453690P66762p466q43897j708359k554766l329919
$$ 65929431 68476967 70518977 71972667 72739429 72731963 71888066 70179707 67624941 64295022
57069F4295022l984880m480948m790939m904567m835190m616780m291657l900363
$$ 64295022 60310142 55829194 51038255 46133688 41298498 36681718 32390061 28489698
57061B8489698l478629l056046k653591k283664j953053j664668j417187j206330
$$ 28489698 25011069 21955023 19301432 17017768 15064715 13400047 11982860 10776530
57053A0776530j027819q78190p53373o48874n61769m90666m33498l87116l49347
$$ 10776530 9748711 8870521 8117148 7468274 6906505 6415839 5982341 5595225 5245878
57044E245878l19564k96803k78875k63732k50111k36480k20969k03023j83861
$$ 5245878 4926314 4629511 4350636 4086904 3836793 3600313 3379344 3176321 2992460
57035B992460j64780j46142j28275j11900r7047q2882o9080n6173m4033l1436
$$ 2992460 2827680 2681538 2553263 2441363 2344316 2261434 2192354 2136181 2092148 2060712
57025B060712j7938m886O298J5527K2614K5736K2917J4405J923j4225l5486o1897
$$ 2060712 2042774 2037888 2044186 2059713 2082327 2108063 2130980 2145385 2147308 2133083 2097597 2035700
57013B035700q9659j12831j27134j31865j28744j20008j07771r4204q1229o9772
$$ 2035700 1946041 1833210 1706076 1574211 1445467 1325459 1217688 1123484 1042255 972483
57003I72483n9810n1262m4350l8990l4495l0313k6561k3422k0534j7509j4534
$$ 972483 912673 861411 817061 778071 743576 713263 686702 663280 642746 625237 610703
56992F10703j1891r339o731m694l722k995j147J829M412N344M693L005M32k923
$$ 610703 598812 589473 582742 578048 574326 571331 570184 572013 576425 581769 586462 589467 589899 586976
56978E86976o507r724j2505j5027j7167j8440j8422j7174j5272j3286j1126q233
$$ 586976 580469 570745 558240 543213 526046 507606 489184 472010 456738 443452 432326 424093
56966D24093m635j223J361L582O100Q602J0376J1566J2834J3992J4084J2695J0240
$$ 424093 419458 418235 419596 423178 429278 437880 448256 459822 472656 486648 500732 513427 523667
56953E23667O934K513k858q269j2935j6581j8911j9542j8716j7309j5720j3434
$$ 523667 530601 533114 530256 521987 509052 492471 473560 454018 435302 417993 402273 388839
56941C88839r987n802j713J839M902P693J0433J3175J5690J7749J9279J9858J8447
$$ 388839 378852 373050 371337 373176 378078 385771 396204 409379 425069 442818 462097 481955 500402
56928E00402J4404Q561K450l481r915j6930k3222k7403k9229k9212k7785k5367
$$ 500402 514806 523367 525817 522336 512421 495491 472269 444866 415637 386425 358640 333273
56916C33273k2617k0092j7921j5997j4163j2221j0221q688p994p587o575n090
$$ 333273 310656 290564 272643 256646 242483 230262 220041 211353 203359 195772 189197 184107
56904A84107m220m393m676l969k253k71J394K627L738N393Q059J1355J4373J6738
$$ 184107 179887 175494 170818 166849 164596 164325 165719 168346 172084 177477 185536 196891 211264 228002
56890B28002J8836K0969K2962K4631K5893K6260K5002K2016J7908J3126P744K186
$$ 228002 246838 267807 290769 315400 341293 367553 392555 414571 432479 445605 453349 455535
56878D55535k755o775j0048j2185j2168r848o523l486p32K427O247J0576J5342
$$ 455535 452780 446005 435957 423772 411604 401756 395233 391747 391015 393442 399689 410265 425607
56865D25607K0309K4924K8851L2265L5245L7415L8311L7508L4207K7632J8266
$$ 425607 445916 470840 499691 531956 567201 604616 642927 680435 714642 742274 760540
56854G60540P833k389j2345k1793k9183l2852l2631k9498k4263j7454r888k330
$$ 760540 768373 765984 753639 731846 702663 669811 637180 607682 583419 565965 556077 553747
56842E53747N229J3260K1802L0414L8692M6389N3254N9096O3576O5644O3735N7066
$$ 553747 558976 572236 594038 624452 663144 709533 762787 821883 885459 951103 1014838 1071904
56830A071904M6276L2439J6046k484k1813l9841n4564o4477o8796o7869o2973
$$ 1071904 1118180 1150619 1166665 1164181 1142368 1102527 1047963 983486 914690 846821 783848
56819G83848n5263m5306l3897k2460j2067k619O374J4796K2352K9278L5861M1547
$$ 783848 728585 683279 649382 626922 614855 612236 618610 633406 655758 685036 720897 762444
56807G62444M5135M5524M1942L4066K2519Q817n721k0501l4737m6779n5006n8836
$$ 762444 807579 853103 895045 929111 951630 960447 954726 934225 899488 852709 797703 738867
56795G38867n8425n4232m7461l9988l2866k5610j7819j0548m960m16M695J0601
$$ 738867 680442 626210 578749 538761 505895 480285 462466 451918 446958 446542 451237 461838
56783D61838J6007J9925K2360K3177K1644J7368J0847K975n445j3663k1182k7832
$$ 461838 477845 497770 520130 543307 564951 582319 593166 596141 590696 577033 555851 528019
56771E28019l3221l6439l6974l5518l3148l0171k6617k3196k0656j8588j6062
$$ 528019 494798 458359 421385 385867 352719 322548 295931 272735 252079 233491 217429
56760B17429j3250j1149r902q692p264o251n837n410m765m443m512m154k990j810
$$ 217429 204179 193030 183128 174436 167172 160921 155084 149674 144909 140466 135954 131800 128810 127000
56746A27000j397j449j294r30p43p61p99r09j136j202q53k73J40K32J21nj5M6
$$ 127000 125603 124154 122860 121930 121187 120426 119627 118718 117582 116380 115527 115254 115394 115626 115747 115742 115727 115773
56728A15773o9m13n15O9R40J150L96n55q09k83M87J062J410J699K003K154J938
$$ 115773 115704 115291 114776 114845 115785 116935 117331 116776 115967 115684 116171 117233 118643 120342 122345 124499 126437
56711A26437J460J125J049Q86N01L62P69J198R92L55n0j10j26L3O89J388J247
$$ 126437 127897 129022 130071 130957 131458 131820 132589 133787 134779 135134 135084 134974 134848 134881 135570 136958 138205
56694A38205L86j7O50J550J543N62n40j020p32l2N19N64K95J61K83M29M45K77
$$ 138205 138591 138574 139224 140774 142317 142879 142339 141319 140587 140555 141074 141638 141933 142094 142377 142806 143251 143528
56676A43528l20j504k724l022k115p46J77L88J36l11p70j059j059p63k92J16K80
$$ 143528 143208 141704 138980 135958 133843 133097 133274 133662 133798 133487 132717 131658 130599 129836 129544 129660 129940
56659A29940M19R81J962K735K904K875L175L630L769L665L683L772L652L466L524
$$ 129940 130359 131340 133302 136037 138941 141816 144991 148621 152390 156055 159738 163510 167162 170628 174152
56644A74152L652L509L279L365L535L200K380J650J217P82K84M9K35O43J062J284
$$ 174152 177804 181313 184592 187957 191492 194692 197072 198722 199939 200721 201005 201054 201289 201932 202994 204278
56628B04278J027L42k20l87o51j393k079k164k167k837l789m137m032m250m591
$$ 204278 205305 205647 205427 205040 204389 202996 200917 198753 196586 193749 189960 185823 181791 177541 172950
56613A72950m144k945k019j833j973k279k832k979j915l16K05n37j107p94m57
$$ 172950 168806 165861 163842 162009 160036 157757 154925 151946 150031 149715 149920 149383 148276 147482 147025
56598A47025n93m10L95O96j95j222j251p23m72j74P34J578J385N79L82R69J468
$$ 147025 146432 146022 146417 147113 146918 145696 144445 143722 143250 143076 143810 145388 146773 147352 147734 148703 150171
56581A50171J489J511J833K066J758R65K20J68J034K217K857K933L178L797M113
$$ 150171 151660 153171 155004 157070 158828 159793 160013 160181 161215 163432 166289 169222 172400 176197 180310
56566A80310L891L992N080O524P354P618P989Q581Q936Q872Q618Q314P877P101
$$ 180310 184201 188193 193273 199797 207151 214769 222758 231339 240275 249147 257765 266079 273956 281057
56552B81057N639L359R09o77j227j607k383l084l204l125l379l781l835l520l055
$$ 281057 286696 290055 290964 290287 289060 287453 285070 281986 278782 275657 272278 268497 264662 261142 258087
56537B58087k509k105k357l368m567n412n786n519m436l136k731l271l507k770
$$ 258087 255578 253473 251116 247748 243181 237769 231983 226464 222028 218892 216161 212890 209383 206613
56523B06613j921j835k092k083k153k585k512j198M47J001N23J16O6k02o86p23
$$ 206613 204692 202857 200765 198682 196529 193944 191432 190234 190681 191682 192205 192321 192387 192185 191499 190776
56507A90776k00K61L73M42O63R17J195J457J261L15q28j309j030o22m95n69o97
$$ 190776 190576 190837 191210 191652 192315 193232 194427 195884 197145 197460 196632 195323 194293 193671 193176 192607 191910
56490A91910q41r87j253j730k001j455l71J36l16p84n44j30m8L19J398K131J410
$$ 191910 191069 190082 188829 187099 185098 183643 183272 183408 183092 182308 181764 181634 181586 181905 183303 185434 186844
56473A86844Rm61J45P08Q41J136J644J735J327R43N97q5p65p17j74J1q6L15R84
$$ 186844 186853 186392 186537 187245 188086 189222 190866 192601 193928 194871 195468 195383 194618 193901 193727 193738 193652 193967 194951
56454A94951P59l72q47J79J496J579N86k42l52j50j0J10K41K12j20o16r35q32
$$ 194951 195710 195338 194491 194670 196166 197745 198331 198089 197737 197587 197577 197687 197928 198140 198020 197404 196469 195637
56436A95637n07m48p38q28l51J71k2q23j398j247o03P4M58L87J8k16j84k57n65
$$ 195637 195130 194682 193944 193116 192765 192936 192914 192091 190693 189446 188843 188917 189375 189762 189780 189564 189380 189123 188558
56417A88558n40K06J091J334J001O33L51J79O56K011L255L170K035J167J047J011
$$ 188558 188018 188224 189315 190649 191650 192283 192634 192813 193469 195480 198735 201905 203940 205107 206154 207165
56401B07165P00N10N30K17n37j019p76k41R3M12J115K074K749K832K594K594K961
$$ 207165 207865 208375 208905 209122 208585 207566 206790 206549 206642 207054 208169 210243 212992 215824 218418 221012 223973
56384B23973L011K032M82k94J19O40M24R4L72N97j53j288j511q39l57l41j01N03
$$ 223973 226984 229016 229498 229204 229323 229963 230387 230481 230853 231450 231297 230009 228498 227659 227302 226961 226860 227363
56366B27363Q39P10N79N91N55P72J631K507K338J315O97R15J164R63Q56J201J470
$$ 227363 228202 228912 229491 230082 230637 231409 233040 235547 237885 239200 239897 240812 241976 242939 243795 244996 246466
56349B46466J186O24K75L03P63J571K245K323K000J745J589J446J710K540L112
$$ 246466 247652 248276 248551 248854 249617 251188 253433 255756 257756 259501 261090 262536 264246 266786 269898
56334B69898K676J892J904K521K724K499K669L179L171K620K340K406K141J607
$$ 269898 272574 274466 276370 278891 281615 284114 286783 289962 293133 295753 298093 300499 302640 304247
56320C04247J511J664J207L51J82O68O84J24J65J147K022K288K549K800K150Q19
$$ 304247 305758 307422 308629 308980 309162 309830 310514 310638 310803 311950 313972 316260 318809 321609 323759 324578
56304C24578M04J412K423K550K766L772M452L850K997L212L967L956L253K911
$$ 324578 324982 326394 328817 331367 334133 337905 342357 346207 349204 352416 356383 360339 363592 366503
56290C66503L164L328L014K460K130K562L959N485N975N741O458Q641J0597J0726
$$ 366503 369667 372995 376009 378469 380599 383161 387120 392605 398580 404321 410779 419420 430017 440743
56276D40743R673R131R675J0834J2286J3852J4997J5446J5697J6242J6968J7893
$$ 440743 450416 459547 469222 480056 492342 506194 521191 536637 552334 568576 585544 603437
56264F03437J9600K2265K5175K7879L0903L4673L8799M3124M8383N4921O1778
$$ 603437 623037 645302 670477 698356 729259 763932 802731 845855 894238 949159 1010937
56253A010937O7984P3910Q0460Q7748R5467J03616J11968J19582J25697J30401
$$ 1010937 1078921 1152831 1233291 1321039 1416506 1520122 1632090 1751672 1877369 2007770
56243B007770J33678J34633J32541J27896J21537J13287J02191Q7650O9856M9712
$$ 2007770 2141448 2276081 2408622 2536518 2658055 2771342 2873533 2961183 3031039 3080751
56233C080751K8808Q647j0545k9564m8524o6239q1536r4100j03829j10585j14913
$$ 3080751 3109559 3118206 3107661 3078097 3029573 2963334 2881798 2787698 2683869 2573284 2458371
56222B458371j17781j19164j18176j14946j10907j06770j01772r5541q9062q3122
$$ 2458371 2340590 2221426 2103250 1988304 1877397 1770627 1668855 1573314 1484252 1401130
56212A401130p7348p1542o6333o1686n6514n0679m5675m2257l9234l5652l2385
$$ 1401130 1323782 1252240 1185907 1124221 1067707 1017028 971353 929096 889862 854210 821825
56201H21825l0141k7800k4362k0891j8828j7673j6125j4186j2522j0909r083p919
$$ 821825 791684 763884 739522 718631 699803 682130 666005 651819 639297 628388 619305 611386
56189F11386q077q432p552n779m400l689l226l123l393l169k026j026j051j203
$$ 611386 603309 594877 587325 581546 577146 573457 570231 567108 563715 560546 558520 557494 556443 555240
56175E55240m06O67Q90P18J142J743J693J607K554M047M927N402O343P384P617
$$ 555240 554834 555501 556391 557109 558251 559994 561687 563294 565848 569895 574822 580224 586567 593951 601568
56160F01568P479Q040R045R513R747J0938J3173J5536J7781K0344K3125K5712
$$ 601568 609047 617087 626132 635645 645392 656330 669503 685039 702820 723164 746289 772001
56148G72001K8460L2021L6319M1149M7050N4363O2233O9732P7044Q4386R0828
$$ 772001 800461 832482 868801 909950 957000 1011363 1073596 1143328 1220372 1304758 1395586
56137A395586R5442R8365R9506R7658R2523Q5970P9538P2269O3032N3357M5546
$$ 1395586 1491028 1589393 1688899 1786557 1879080 1965050 2044588 2116857 2179889 2233246 2278792
56126B278792L9368L3067K6439K0320J4050O223k713j1266j9688k9443m0340n0647
$$ 2278792 2318160 2351227 2377666 2397986 2412036 2418259 2415546 2404280 2384592 2355149 2314809 2264162
56114B264162n9753o8552p7393q5598r2609r7769r9613r7339r2266q6014p8264
$$ 2264162 2204409 2135857 2058464 1972866 1880257 1782488 1682875 1585536 1493270 1407256 1328992
56103A328992o8271n7415m7838l9592l1607k4459j9436j5846j2059q492o777o516
$$ 1328992 1260721 1203306 1155468 1115876 1084269 1059810 1040374 1024528 1012469 1003977 997200 990684
56091I90684n748m117k822j936n25R81J330J004J519K623K889K636L429N062N890
$$ 990684 984936 980819 977997 976061 975536 976517 977847 978851 980370 982993 985882 988518 991947 997009 1002899
56076A002899N814O116O746O640O404P646R925J1307J1703J2715J4394J5200J5033
$$ 1002899 1008713 1014829 1021575 1028215 1034619 1042265 1052190 1063497 1075200 1087915 1102309 1117509 1132542
56063A132542J5349J6334J6878J7166J8332J9781J9826J8749J8313J8491J7743
$$ 1132542 1147891 1164225 1181103 1198269 1216601 1236382 1256208 1274957 1293270 1311761 1329504
56052A329504J6255J5668J5885J5307J4106J4042J5179J5995J6449J7757J9444
$$ 1329504 1345759 1361427 1377312 1392619 1406725 1420767 1435946 1451941 1468390 1486147 1505591
56041A505591J9883J9473K0020K1377K2031K2449K4329K7114K8823K9710L1388
$$ 1505591 1525474 1544947 1564967 1586344 1608375 1630824 1655153 1682267 1711090 1740800 1772188
56030A772188L3264L3804L4268L6848M0125M1071M0644M2309M5766M7577M7582
$$ 1772188 1805452 1839256 1873524 1910372 1950497 1991568 2032212 2074521 2120287 2167864 2215446
56019B215446M9028N2426N4967N6189N8583O2248O4573O5654O8351P2564P5169
$$ 2215446 2264474 2316900 2371867 2428056 2486639 2548887 2613460 2679114 2747465 2820029 2895198
56008B895198P6156P8952Q4091Q8464R1444R5751J01659J06493J10415J16467
$$ 2895198 2971354 3050306 3134397 3222861 3314305 3410056 3511715 3618208 3728623 3845090
55998C845090J24410J31031J36901J45866J57538J67639J76252J87845K02592
$$ 3845090 3969500 4100531 4237432 4383298 4540836 4708475 4884727 5072572 5275164
55989E275164K15938K27730K43047K62749K82192L00743L23345L51000L79284
$$ 5275164 5491102 5718832 5961879 6224628 6506820 6807563 7130908 7481908 7861192
55980G861192M08117M43120M85283N29717N76718O33179P00851P74737Q55684
$$ 7861192 8269309 8712429 9197712 9727429 10304147 10937326 11638177 12412914 13268598
55971A3268598R52477J069062J202922J359208J553063J795289K090654K452951
$$ 13268598 14221075 15290137 16493059 17852267 19405330 21200619 23291273 25744224
55963B5744224K904738L458454M115768M889360N805207O879345Q114273R520720
$$ 25744224 28648962 32107416 36223184 41112544 46917751 53797096 61911369 71432089
55955G1432089J1114469J2885740J4801707J6839901J8971495K1095984K3037219
$$ 71432089 82546558 95432298 110234005 127073906 146045401 167141385 190178604
55948A90178604K4604906K5566991K5518439K3910957K0390135J5111796Q616525
$$ 190178604 214783510 240350501 265868940 289779897 310170032 325281828 333898353
55941C33898353J402057o232103j3879788k0754582k5915751k8785585k9399555
$$ 333898353 335300410 329068307 315188519 294433937 268518186 239732601 210333046
55934B10333046k8221545k5837055k2797072j9573260j6509296j3789126j1471792
$$ 210333046 182111501 156274446 133477374 113904114 97394818 83605692 72133900
55927G2133900r549875p977924o689659n627538m756810m048226l465400k978388
$$ 72133900 62584025 54606101 47916442 42288904 37532094 33483868 30018468 27040080
55919B7040080k573376k239144j957471j714639j508831j337944j191712j062461
$$ 27040080 24466704 22227560 20270089 18555450 17046619 15708675 14516963 13454502
55911A3454502r52074q61417p83423p12586o51236o00418n54199n08649m67409
$$ 13454502 12502428 11641011 10857588 10145002 9493766 8893348 8339149 7830500 7363091
55902G363091m32919m00713l67624l37297l12401k89237k65081k43339k26499
$$ 7363091 6930172 6529459 6161835 5824538 5512137 5222900 4957819 4714480 4487981
55893D487981k11095j94433j79507j68575j58380j46394j35500j27952j20688
$$ 4487981 4276886 4082453 3902946 3734371 3575991 3429597 3294097 3166145 3045457
55884C045457j11168j02121r6032r0379q2802p5780p1779o8688o4309o0734o0079
$$ 3045457 2934289 2832168 2736136 2645757 2562955 2487175 2415396 2346708 2282399 2221665 2161586
55873B161586o0336n9571n9805o2624o5027o3905o0910n8850n6865n3088m8767
$$ 2161586 2101250 2041679 1981874 1919250 1854223 1790318 1729408 1670558 1613693 1560605 1511838
55862A511838m5795m3172l9558l6514l5632l5225l3197l0667k9626k9451k8699
$$ 1511838 1466043 1422871 1383313 1346799 1311167 1275942 1242745 1212078 1182452 1153001 1124302
55851A124302k7901k7747k6931k4536k2263k1683k1652k0868k0432k1396k2165
$$ 1124302 1096401 1068654 1041723 1017187 994924 973241 951589 930721 910289 888893 866728
55840H66728k0961j8695j7021j5712j4124j3057j2993j2737j1763j1541j2687
$$ 866728 845767 827072 810051 794339 780215 767158 754165 741428 729665 718124 705437
55829G05437j3353j2359j1225j1065j0383q239o645p210q247p940p691r276j1199
$$ 705437 692084 679725 668500 657435 647052 638813 632168 624958 616711 608771 601080 591804 580605
55816E80605j1080r597q900q895q126o792n952n187l720k475k526k873k212j332
$$ 580605 569525 559928 551028 542133 534007 527215 521263 516076 512356 509881 507355 504482 502270 500938
55802E00938j367j239N27K920L942L717L583L447K564J656J645J410n14l074m152
$$ 500938 499571 498332 498859 501779 505721 509438 513021 516468 519032 520688 522333 523743 523229 520155 516003
55787E16003l962m380n684o549o667o812o819n869m534m273n047n511n323n310
$$ 516003 512041 507661 501977 495428 488761 481949 475130 469261 464727 460454 455407 449896 444573 439263
55773D39263n488m895l369j797o13N60J763K539K760K603J897M30j454l351n276
$$ 439263 433775 428880 425511 423714 423101 423661 425424 427963 430723 433326 435223 435653 434199 430848 425572
55758D25572o984p735p608p928r390j0854j1084j0483r914r180q027p373p888
$$ 425572 418588 410853 403245 395317 385927 375073 363989 353506 343592 334412 326385 319012 311124
55745C11124q482p909o796o461o655o219n109m052l047j846j177j721k610k602
$$ 311124 302642 294733 287937 281476 274821 268602 263493 259441 256394 254548 253371 251650 249040 246438
55731B46438k023j985k362k326k164k721l594l617k868k414k422k108j439j291
$$ 246438 244415 242430 240068 237742 235578 232857 229263 225646 222778 220364 217942 215834 214395 213104
55717B13104j947k700k879k305r64P98K154K750L206L890M034L127K092J862J732
$$ 213104 211157 208457 205578 203273 202309 203107 205261 208011 211217 215107 219141 222268 224360 226222 227954
55702B27954O22r53j799k104k921m084m477l971l514l496l465l238l046k756k104
$$ 227954 228576 227623 225824 223720 220799 216715 212238 208267 204753 201257 197792 194554 191508 188752 186648
55687A86648j345o73M03K070L258L034K187K148K927L438L299K914K334J406O09
$$ 186648 185303 184630 185033 187103 190361 193395 195582 197730 200657 204095 207394 210308 212642 214048 214657
55672B14657M53N55M41M72Q68P35n11j726j602p34m32m85R7R39R76N19O35J039
$$ 214657 215110 215665 216106 216578 217446 218181 217670 215944 214342 213608 213176 212691 212788 213727 214703 215222 215857 216896
55654B16896P49J87M93J217R79J01Q8P25J81j841l507l770l597l845m027l880
$$ 216896 217645 217832 218325 219542 220521 220622 220710 221435 221616 219775 216268 212498 208901 205056 201029 197149
55638A97149m070m662m720m109l913m413m411l341k378k506l031k935k354j821
$$ 197149 193079 188417 183697 179588 175675 171262 166851 163510 161132 158626 155595 152660 150306 148485
55624A48485j253n63k52n40q70q42p53p73o02l85p95j756k236j838j449j704j962
$$ 148485 147232 146669 146417 145877 145007 144165 143412 142639 142037 141652 140857 139101 136865 135027 133578 131874 129912
55607A29912j521q18n99p98r85j170j558j996k252k270j903r93L5L86l9n10n43
$$ 129912 128391 127573 126974 126176 125191 124021 122463 120467 118215 115945 114042 113049 113084 113470 113431 112921 112378
55590A12378l68k61k01k85n90o18J63J271J751J765K323L381L661K766K022K525
$$ 112378 112010 111749 111548 111263 110673 110055 110218 111489 113240 115005 117328 120709 124370 127136 129158 131683
55574A31683L638M213M230M352M744N152N499N673N314M357L266K309J174l07
$$ 131683 135321 139534 143764 148116 152860 158012 163511 169184 174498 178855 182121 184430 185604 185297
55560A85297j755k924m052n110n507m950m090l795m218m831m928m118k762j878
$$ 185297 183542 180618 176566 171456 165949 160999 156909 153114 148896 144065 139137 135019 132257 130379
55546A30379k023k394j900p58l2J74O89J521J681R97N57Q68J067N87J83M49P06
$$ 130379 128356 125962 124062 123304 123272 123446 124135 125656 127337 128334 128891 129759 130826 131413 131596 132045 132751
55529A32751L10j33N1K26n39j890k763k940k943k845k310j498j009j043j299j600
$$ 132751 133061 132928 132979 133205 132666 130776 128013 125073 122130 119285 116975 115477 114468 113425 112126 110526
55513A10526k008k485k859k987k746k129j516j434j821j985j550q67m14k53k97
$$ 110526 108518 106033 103174 100187 97441 95312 93796 92362 90541 88556 87006 86139 85725 85472 85175
55498H5175m87n20m3P04J086J039J104J361J243N68o0k57l03l84l13k93q73j768
$$ 85175 84688 84168 84125 84829 85915 86954 88058 89419 90662 91230 91170 90913 90610 90226 89913 89620 88747 86979
55480H6979j791o11N63P08L54M61Q80Q90M35o9n12q76q44m08k19o38j072r76p51
$$ 86979 85188 84577 85140 85848 86202 86663 87543 88433 88868 88799 88287 87411 86567 86159 85940 85302 84230 83254 82503
55461H2503q49q21j75N34N17J18K09O67N96j43o94m91R7M33K36m20j096j114k28
$$ 82503 81654 80833 80658 81192 81709 81827 82036 82703 83299 83156 82462 81971 82068 82501 82737 82317 81221 80107 79879
55442G9879Q62J201O25k02o44n17P5P43R38M72j54l12N4N22P02M65lk01K41R14
$$ 79879 80741 81942 82567 82365 81721 81204 81279 82022 82960 83432 83278 82966 83020 83542 84244 84709 84706 84505 84746 85660
55422H5660R91L58k32l22k47k04K42J128J608J176N59N06N48m4p77o55J36M95
$$ 85660 86651 87009 86777 86455 86208 86004 86246 87374 88982 90158 90717 91223 91771 91727 90950 90295 90431 90926
55404I0926J05k94k80l00p32j348j802k001j772r11K79J027Q92K38j96L0P56J291
$$ 90926 91031 90737 90457 90157 89425 88077 86275 84274 82502 81591 81870 82897 83789 84027 83831 83861 84617 85908
55386H5908R97L0p14o52j40J85L13N89J006J237J122O36k53j241j590r14J64P50
$$ 85908 86905 86935 86221 85569 85429 85614 85927 86516 87522 88759 89881 90517 90264 89023 87433 86519 86683 87433
55368H7433P18N36M29L20K87M19M33J26r5K37P66P03J1n24m36j67k63n90n75j
$$ 87433 88151 88687 89116 89436 89723 90142 90575 90701 90606 90843 91609 92312 92323 91799 91363 91196 90933 90343 89768 89767
55348H9767P05Q83L51m08q55j096j535j968j653m55P05R57M68q1m10o07o55n78
$$ 89767 90472 91355 91706 91298 90443 89347 87812 85844 84191 83736 84441 85398 85866 85785 85375 84768 84113 83535
55330H3535o22q34q70n75l12k89j35M21R73J071Q67O63L80mj51j2j05n54o18J33
$$ 83535 82913 82079 81209 80634 80322 80033 79898 80319 81292 82363 83230 83893 84273 84269 84118 84106 84001 83447 82829 82962
55310H2962R18Q85L54J18J57J10K26P15Q61J23n38J30J501J749N19o64p50l80
$$ 82962 83880 84765 85119 85237 85394 85504 85730 86445 87306 87429 86891 87021 88522 90271 90790 90126 89376 88996
55292H8996m39p74q83p07k18P74J884K128J209Q7k40O2K27K3k17k65j99j51j51
$$ 88996 88557 87783 86900 86193 85975 86749 88633 90761 91970 92057 91817 91879 92106 92129 91912 91647 91448 91297 91146
55273I1146j79k28m20r08j434j314l83M29R7j024j528p09O71J468J349Q18N69
$$ 91146 90967 90739 90319 89411 87977 86663 86280 86709 86806 85782 84254 83545 84216 85684 87033 87851 88420
55256H8420Q65J233Q50l54j301r94J30P84M74k10o11n27J37J177J753J195J48
$$ 88420 89285 90518 91368 91014 89713 88719 88849 89633 90107 89897 89286 88759 88896 90073 91826 93021 93169
55239I3169o9P44J481J318N43l06r74j068k26R66J281N16j98j43oo05j547j960
$$ 93169 93100 93844 95325 96643 97186 96880 95906 94838 94612 95578 96859 97375 97177 97034 97028 96423 94876 92916
55221I2916j728j292q70m98l28k96k5M75N54j27r70j276j157j008o94N9R31J358
$$ 92916 91188 89896 89026 88528 88200 87904 87879 88354 88908 88781 87811 86535 85378 84370 83676 83735 84666 86024
55203H6024J330J202J023O25J76L8J77K47J49Q2J20R2q6k48j69J49M04K01m93
$$ 86024 87354 88556 89579 90204 90380 90418 90595 90842 90991 91073 91193 91285 91199 90951 90782 90931 91335 91536 91043
55184I1043j182j328r38m03Q6N38P90O81N44Q17J225J066L32j79q9Q5j10m02m66
$$ 91043 89861 88533 87595 87192 87278 87816 88606 89287 89831 90648 91873 92939 93271 93092 93003 93088 92978 92576 92110
55165I2110m86n53k69N38J244J178M86k27o68p94m86J84P71R90J074J205J076
$$ 92110 91624 91071 90802 91340 92584 93762 94248 94021 93353 92559 92073 92257 93028 94018 95092 96297 97373
55148I7373M53l25q32j035q84m3J356K245J773M35o44j156j515j659j079N2P34
$$ 97373 97826 97501 96669 95634 94750 94707 96063 98308 100081 100516 99872 98716 97201 95542 94463 94515 95249
55131I5249L96m21q59p47n28n93q33p15J88J524K253J781P70L21M83L31n45j365
$$ 95249 95645 95224 94365 93618 93090 92497 91664 90949 91137 92661 94914 96695 97465 97786 98269 98600 98055 96690
55113I6690j294n84j01j23j26L49J070J464J291Q62N98O21P05O26M43L67N06P15
$$ 96690 95396 94812 94711 94588 94462 94811 95881 97345 98636 99498 100096 100717 101422 102048 102491 102858 103364 104079
55095A04079P63O06N49R76J803K351J983Q25l92j148j436j348q19K4O93P78L92
$$ 104079 104842 105448 105997 106973 108776 111127 113110 113935 113543 112395 110959 109611 108792 108816 109509 110287 110679
55078A10679o0l27l61j65J43K99R4l97r20j216j150q09n31n23m73N6Q64J219Q76
$$ 110679 110619 110292 109931 109766 109909 110208 110302 109905 108985 107769 106619 105810 105279 104756 104283 104339 105203 106422 107298
55059A07298M76N92R47R90P62O16L66m66j683k309j740n01L58L99N2o3J39K44
$$ 107298 107774 108366 109313 110303 111065 111681 112047 111581 109898 107589 105849 105348 105706 106105 106157 106094 106233 106477
55041A06477q4o66j002q89o76q61j486k034j947j203l19K54N74R09J127Q59K68
$$ 106477 106393 105727 104725 103836 103160 102299 100813 98779 96832 95629 95310 95564 96138 97047 98174 99033 99301
55024I9301O7M55O16j12j102j238n43p7l12o06l91N5L62P00J174J403J216J139
$$ 99301 99368 99823 100439 100327 99225 97987 97444 97367 97055 96449 96058 96113 96475 97175 98349 99752 100968 102107
55006A02107J555J914J482M79j98j41L18Q08J302J799K057J798J033J80j18L79
$$ 102107 103662 105576 107058 107537 107339 107198 107516 108324 109626 111425 113482 115280 116313 116493 116375 116754
54990A16754J083J135M86r7j67r2j61L1P18J140M51r40j740j354m50L8p0l17k32
$$ 116754 117837 118972 119458 119361 119194 119102 118941 118972 119690 120830 121281 120341 118601 117247 116797 116835 116765 116448 116216
54971A16216K04N60M02j89p49j066j287j299o40O07J585J748J604J721J693R45
$$ 116216 116420 116980 117382 117193 116444 115378 114091 112792 112152 112759 114344 116092 117696 119417 121110 122055
54955A22055m7l63j21k12p13p81j17N60P09O22N63K85k00l06J49M81K79J91Q24
$$ 122055 122008 121645 121524 121312 120599 119818 119701 120261 120970 121592 122155 122440 122240 121934 122083 122564 122843 123034 123858
54936A23858J574J452O11K1mJ9j06P2O76J149J207J340J956K723L264L885M962
$$ 123858 125432 126884 127495 127516 127512 127531 127425 127497 128173 129322 130529 131869 133825 136548 139812 143697 148659
54919A48659O033O341O003N847O157O284N674M567L435K270Q65o85k149l500m707
$$ 148659 154692 161033 167036 172883 179040 185324 190998 195565 199000 201270 202135 201450 199301 195801 191094
54904A91094n517n783n773n826n908n794n397m634l389j970j187j424j985j937
$$ 191094 185577 179794 174021 168195 162287 156493 151096 146462 143073 141103 139916 138492 136507 134570
54890A34570j282o92m08j69N8Q6J76P93J824K687L304M058M863N208N162N377
$$ 134570 133288 132596 132188 132019 132077 132163 132339 133132 134956 137643 140947 145005 149868 155076 160238 165615
54874A65615N909O059N627N302N400N175L971K237P37m81j771l172m634o309p998
$$ 165615 171524 177583 183210 188512 193912 199087 203058 205295 206032 205551 203780 200608 195974 189665 181667
54859A81667q909q585p524o406n303m164l386l182l037k455j715j240q70m51l90
$$ 181667 172758 164173 156649 150243 144940 140776 137390 134208 131171 128716 127001 125761 124891 124440 124050
54844A24050q92j336j259j225j701j912j063K6%q02q33L4K39q91j935j498j46
$$ 124050 123158 121822 120563 119338 117637 115725 114662 114688 114688 113886 113053 113087 113326 112435 110500 109002 108856
54827A08856O75O83O76J009J217R60N40L55M12M57L41J05j98n38p67n92M2O22
$$ 108856 109531 110214 110890 111899 113116 114076 114616 114971 115383 115840 116181 116286 116088 115550 114783 114191 114233 114855
54809A14855O00K11K10O70Q17M01K66R52J561J034j29n95j36L52M51N40O23K23
$$ 114855 115455 115666 115876 116546 117363 117764 118030 118982 120543 121577 121448 120853 120717 121069 121520 122060 122683 122906
54791A22906l99k59P52J476J194O51P08R71N76l78j037j004n83r8L32N53M87N11
$$ 122906 122507 122248 123000 124476 125670 126321 127029 128000 128576 128198 127161 126157 125574 125476 125808 126361 126848 127359
54773A27359J219K715M401N548N970O046O175O348O357O331O607P000O773N677
$$ 127359 128578 131293 135694 141242 147212 153258 159433 165781 172138 178469 185076 192076 198849 204526
54759B04526M442L763L276K296J000nr26k485m470n766o066o353p321q214p902
$$ 204526 208968 212731 216007 218303 219303 219298 218372 215887 211417 205651 199585 193232 185911 177697 169795
54744A69795o404m738l677l191k793k095j115k78O7J08K07K92J18o4K05P07P85
$$ 169795 163391 158653 154976 151785 148992 146897 145782 145504 145571 145679 145886 146178 146296 146232 146437 147144 147929
54727A47929N58R80K402L968M783N016N255N501N401M987M606M339L955L232K103
$$ 147929 148487 149467 151869 155837 160620 165636 170891 176392 181793 186780 191386 195725 199680 202912 205015
54712B05015P21n16j332k010l043m313n179n464n675o099o370o122n428m404l062
$$ 205015 205736 205220 203888 201878 198835 194522 189343 183879 178204 172105 165735 159613 154185 149781 146719
54697A46719j809j252j202p62K03N91k94j525j806j248r10j165j498j577j500
$$ 146719 144910 143658 142456 141694 141897 142488 142194 140669 138863 137615 136705 135540 134042 132465 130965
54682A30965j210n64k4l21j326j909j271P3R07O69o7l65LL68R2m88m75K90Q87
$$ 130965 129755 129191 129167 128846 127520 125611 124340 124413 125320 125989 125922 125557 125560 125928 126020 125532 125057 125347 126234
54663A26234M99n80j404j482j055o00l76l06p8M40Q54O71M0l96m53n38p90q15
$$ 126234 126733 126153 124749 123267 122212 121612 121236 120930 120852 121292 122146 122817 122857 122461 122008 121470 120680 119865
54645A19865n14k49O4J045K486K970J738K2n96l63o30j498j717p82L39P83Q56
$$ 119865 119351 119102 119166 120211 122697 125667 127405 127427 126831 126468 125838 124340 122623 121841 122180 122963 123819
54628A23819J051J146Q60N81P04Q56M35l92r69j124j284j639j702r60L40J354
$$ 123819 124870 126016 126876 127457 128161 129017 129452 129060 128091 126967 125683 124044 122342 121382 121722 123076
54612A23076J498R69L25k26q37j444j586r89o5M59L05j94n65n72k32L27R61J507
$$ 123076 124574 125543 125868 125642 124805 123361 121775 120786 120721 121180 121485 121291 120726 120154 119922 120249 121210 122717
54594A22717J740J457P40O6j26L3N5j94m24n37p94j188j224o45L9J48k74n75k52
$$ 122717 124457 125914 126654 126720 126594 126627 126682 126488 126064 125527 124733 123545 122321 121676 121715 121863 121589 121014 120762
54575A20762N99J447J658J018J17j06N65J271J103J61o86p93k26N30R99R84O28
$$ 120762 121361 122808 124466 125484 125601 125495 126060 127331 128434 128595 127909 127116 126890 127420 128419 129403 130031
54558A30031J77l18q32j026n79J89N92N21N04P00O25J52m7M75J175J349J063P61
$$ 130031 130208 129890 129058 128032 127453 127642 128234 128755 129259 129959 130584 130736 130689 131164 132339 133688 134751 135512
54540A35512M70J21J9L58P10P03P04J160J645J437O99K88M95P31M71r4l77m9N85
$$ 135512 135982 136103 136122 136480 137190 137893 138597 139757 141402 142839 143538 143826 144321 145052 145523 145429 145052 145003 145588
54521A45588P48j2j022j136l67n0r09j895j768r24n96r00r66n42k12j19J78O50
$$ 145588 146336 146324 145302 144166 143799 143749 142840 140945 139177 138253 137657 136757 135791 135249 135037 134918 135096 135746
54503A35746O88K32o7Q6K93L22M35O62O01J50k87m79n34l64K85J039J013J9j011
$$ 135746 136434 136666 136599 136685 136978 137300 137735 138397 138998 139148 138861 138382 137848 137484 137769 138808 139821 139840 138829
54484A38829j108k52R02J716J739Q60m34j267j139k84P18J266R11k23j212j127
$$ 138829 137721 137469 138371 140087 141826 142686 142252 140985 139846 139562 140280 141546 142457 142234 141022 139895
54468A39895p8J013J582J792J841J646J273R85P53K63m53r37q86m10J89M66n0
$$ 139895 139817 140830 142412 144204 146045 147691 148964 149949 150702 150965 150512 149575 148689 148279 148468 148934 148884
54451A48884j174j836j296k81pl92l72J94L54j99n43j35L22J37l19m54m29n72
$$ 148884 147710 145874 144578 144297 144290 143898 143526 143720 144074 143875 143332 143197 143519 143656 143337 142883 142454 141882
54433A41882o97n70m45m93l67Q4L77J61j15J11P02J153J239R42L46k5M87J630
$$ 141882 141185 140615 140170 139677 139310 139394 139771 139932 139817 139928 140630 141783 143022 143964 144310 144285 144772 146402
54415A46402K190J559O01M04P71P04j60j243j819j511m19P85J265R53O37Q01R99
$$ 146402 148592 150151 150752 151156 151927 152631 152471 151228 149409 147898 147479 148264 149529 150482 151119 151920 152919
54398A52919Q32P52J197J589J066j76j056r38p9R26J577J577J095P27P92R07O36
$$ 152919 153751 154503 155700 157289 158355 158179 157123 156185 156106 157032 158609 160186 161281 162008 162800 163707 164343
54381A64343J39k80q00j631k305k079q91N49J434J331L55p39j055n53p5r5r8L52
$$ 164343 164482 164202 163402 161771 159466 157387 156496 157045 158479 159810 160165 159426 158371 157818 157743 157648 157550 157902
54363A57902O86K72m41n98k31M0K12P45J506J817J562J306J344J391J184P90K88
$$ 157902 158588 158860 158419 157821 157590 157630 157842 158587 160093 161910 163472 164778 166122 167513 168697 169487 169775
54346A69775k20l83j0N12P43R34J574K426K774K445J829J092K19l46q2N63M91
$$ 169775 169555 169172 169162 169674 170417 171351 172925 175351 178125 180570 182399 183491 183710 183364 183282 183845 184336
54329A84336n16j487j677j492j680k308k895k992k397j313m57m95j111j285o03
$$ 184336 183820 182333 180656 179164 177484 175176 172281 169289 166892 165579 165122 164627 163516 162231 161628
54314A61628K73N60K05m29j092j546j572j321j166r81k57Q23J227M29p20j112
$$ 161628 161901 162461 162666 162237 161145 159599 158027 156706 155540 154559 154302 155125 156352 156781 156061 154949
54298A54949p94n60n84k93M96J181J196P25L08J81K20L14M81P02P97O22L08J97
$$ 154949 154155 153595 153011 152718 153214 154395 155591 156316 156624 156805 157025 157339 157820 158522 159319 159941 160249 160446
54280A60446M25O72N08p8o04o22j27M97P66M27l14r41j085q17l81R4M52L58k12
$$ 160446 160871 161543 162051 161973 161369 160747 160620 161117 161883 162310 161996 161055 159970 159153 158772 158866 159318 159676 159464
54261A59464n80m1J073J568Q50k97o85r7O22O87J55l63m71l29j87P9P16J469J623
$$ 159464 158884 158843 159916 161484 162334 162037 161352 161255 161877 162564 162719 162356 161885 161556 161369 161448 162164 163633 165256
54242A65256R67K42K13O48P14J56n43j080j642k204k256j526n40j9r5l98o54q03
$$ 165256 166223 166465 166678 167326 168040 168196 167653 166573 164931 162727 160471 158945 158405 158386 158291 157893 157239 156436
54224A56436p30k95L76Q21O31j44r92j447j566j708j860j502l71J000J823J893
$$ 156436 155706 155411 155787 156608 157239 157095 156103 154656 153090 151382 149522 148020 147649 148649 150472 152365
54208A52365J544J072O24L81L14J8o52j030m24P17J281R85N36L03j23q34j078
$$ 152365 153909 154981 155605 155986 156300 156318 155666 154636 154212 154929 156210 157195 157731 158034 157911 157077 155999
54191A55999l33Q68J716J973J626M77j253k562k700k112j678j457r40j30M58P17
$$ 155999 155666 156534 158250 160223 161849 162326 161073 158511 155811 153699 152021 150564 149624 149494 149952 150669
54175A50669R98J306J196N67o5k57r6J60M66P92R00N77j17q72j403j582j490j251
$$ 150669 151667 152973 154169 154736 154671 154414 154318 154478 154944 155736 156636 157213 157096 156224 154821 153239 151749 150498
54157A50498q71l14K01L10l0l90m08j82O7L15N25M54J17J0M42R04O85r4o46n63
$$ 150498 149627 149313 149514 149824 149794 149404 148996 148814 148881 149196 149721 150175 150292 150302 150744 151648 152333 152239 151593 151030
54137A51030j56J68L55M86O65J080J729K117J723P93J21L6J31O8J3J06J31M7K51
$$ 151030 150874 151042 151397 151883 152548 153628 155357 157474 159197 159990 160111 160147 160278 160346 160359 160465 160596 160643 160894
54118A60894R02J434J274P42O74J276J852J646O63m14q68n48M2K26j71p33r90
$$ 160894 161796 163230 164504 165246 165920 167196 169048 170694 171357 170943 170075 169527 169569 169795 169624 168891 167901
54101A67901q37l83K72R03J135Q32L44L5j84n24p22l17N21R62M79n34j267j325
$$ 167901 167064 166681 166953 167856 168991 169823 170167 170202 170018 169494 168772 168455 168976 169938 170417 169883 168616 167291
54083A67291q61j76N42J166J648J954J982J608R47M52N05R29J128P56Q8k56P8
$$ 167291 166430 166254 166796 167962 169610 171564 173546 175154 176101 176553 177058 177987 179115 179871 179959 179703 179781
54066A79781Q93J664J983J817J414R78N31R5j29L5M27P10Q42J203K023K927L313
$$ 179781 180674 182338 184321 186138 187552 188530 189061 189156 189027 189062 189489 190199 191041 192244 194267 197194 200507
54049B00507L098K805K827K988K992L035L594M716N889O691P262P939Q738R443
$$ 200507 203605 206410 209237 212225 215217 218252 221846 226562 232451 239142 246404 254343 263081 272524
54035B72524J0016J0491J0546R641P722N481L662K329J109q2r35j277j336j373
$$ 272524 282540 293031 303577 313218 320940 326421 330083 332412 333521 333439 332504 331227 329891 328518
54021C28518j351j132p71m94m71o92r65j057j003j291k389m042n372n825n741
$$ 328518 327167 326035 325264 324770 324299 323607 322642 321585 320582 319291 316902 312860 307488 301663 295922
54006B95922n670n576n120m435m034m026m053l983m043m179l871k932j978j653
$$ 295922 290252 284676 279556 275121 271087 267061 263008 259025 254982 250803 246932 244000 242022 240369
53992B40369j815j854j563j218j053j132j575k389l143l306k850k124j275l04
$$ 240369 238554 236700 235137 233919 232866 231734 230159 227770 224627 221321 218471 216347 215072 214768
53978B14768L46Q5q09j212n76K85L41k54n73l34j20l22o53p58p15o85n82k91J44
$$ 214768 215114 215199 214390 213178 212602 212887 213228 212974 212401 212067 211947 211625 210972 210214 209499 208814 208232 207941 208085
53959B08085O44J147J407J232R40J133J862K508K680K668K762K670K166J738K019
$$ 208085 208729 209876 211283 212515 213455 214588 216450 218958 221638 224306 227068 229738 231904 233642 235661
53944B35661K863L642M165M732N372N737N729N578N338M819M092L513L112K534
$$ 235661 238524 242166 246331 251063 256435 262172 267901 273479 278817 283636 287728 291241 294353 296887
53930B96887J745J244J347J731J983K170K578L183L758M235M736N378O243P250
$$ 296887 298632 299876 301223 302954 304937 307107 309685 312868 316626 320861 325597 330975 337218 344468
53916C44468P994Q045P567P323P850Q899R851J0327J0286R879R447R191Q671P053
$$ 344468 352462 360507 368074 375397 383247 392146 401997 412324 422610 432489 441936 451127 459798 466851
53902D66851M224J240p76j735k285k837l454m278n403o474p052p178p135o803
$$ 466851 471075 472315 471539 469804 467519 464682 461228 456950 451547 445073 438021 430843 423708 416905
53888D16905n896m724m019l959l939l423k461j270J26J557K451K349J396P4j397
$$ 416905 411009 406285 402266 398307 394368 390945 388484 387214 387340 388897 391348 393697 395093 395167 393770
53873C93770l150n303p658r791j1397j2471j3078j2996j1878r960q220p449p373
$$ 393770 390620 385317 377659 367868 356471 344000 330922 317926 306048 296088 287868 280419 273046
53860B73046p123o397n686n368n185m714l910k996k170j552j196j032r75j099
$$ 273046 265923 259526 253840 248472 243287 238573 234663 231667 229497 227945 226749 225717 224742 223643
53846B23643j442j687j389o20%M0k92n26m97l96m12n70p42p67o45n66o69p86n96
$$ 223643 222201 220514 219125 218505 218505 218545 218253 217727 217230 216834 216422 215852 215110 214343 213698 213132 212463 211677 211081
53827B11081k1P00J188J176O99J95J71N99R57J027J224J775K161J918J536J715
$$ 211081 211060 211760 212948 214124 214823 215018 215189 215788 216745 217772 218996 220771 222932 224850 226386 228101
53811B28101K155K024J465J492K353L096L092K928L309L986M409M703N192N590
$$ 228101 230256 232280 233745 235237 237590 240686 243778 246706 250015 254001 258410 263113 268305 273895
53797B73895N450N011M826M840M556L999L751L998M159L691K814K176K002J882
$$ 273895 279345 284356 289182 294022 298578 302577 306328 310326 314485 318176 320990 323166 325168 327050
53783C27050J367N78m2m85j288k603l661l679l046k792l141l413l358l584m393
$$ 327050 328417 328995 328953 328468 327180 324577 320916 317237 314191 311399 308258 304845 301487 297903 293510
53768B93510n171n394n349n356n108m446m008m197m264l305j769r27j165j750
$$ 293510 288339 282945 277596 272240 267132 262686 258678 254481 250217 246912 245143 244216 243051 241301
53754B41301k024j952j562q60k20p8j74J02N81L88o78j633j555o88N3J91q2m10
$$ 241301 239277 237325 235763 234903 234683 234605 234431 234533 235114 235502 234824 233191 231636 230948 231001 231192 231110 230700
53736B30700o15p30q77j017q50k13M79O25K67R4N12J131J389J242J042R79R81
$$ 230700 230085 229355 228478 227461 226611 226398 226877 227502 227769 227863 228375 229506 230895 232137 233179 234158 235139
53719B35139R53R44J063J361J709J799J444Q33L75L18O62J289K001K527K731K766
$$ 235139 236092 237036 238099 239460 241169 242968 244412 245245 245620 245938 246600 247889 249890 252417 255148 257914
53703B57914K827K914L009L203L440L369K860K383K372K485K059J215Q15J307
$$ 257914 260741 263655 266664 269867 273307 276676 279536 281919 284291 286776 288835 290050 290865 292172
53689B92172K175K658K538K041J458R90O69K62l77r55j117j073j311j691j547
$$ 292172 294347 297005 299543 301584 303042 304032 304701 304963 304586 303631 302514 301441 300130 298439 296892
53674B96892p89k12l70q20r05p28p99j120j259j068q11o72n37l05j12k11p03j304
$$ 296892 296103 295891 295521 294701 293796 293068 292269 291149 289890 288822 288011 287339 286802 286497 286385 286174 285471 284167
53656B84167j416p14K92O83K35l18l01J18M46O38Q52R03O14L58O34J235J490J227
$$ 284167 282751 282037 282329 283012 283247 282929 282628 282746 283192 283830 284682 285585 286199 286557 287191 288426 289916 291143
53638B91143R12Q17P47O42Q29J389J851J818J548J497J646J702J685J854K159
$$ 291143 292055 292872 293619 294261 295090 296479 298330 300148 301696 303193 304839 306541 308226 310080 312239
53623C12239K250K037J911K247K973L757M358M693M729M496M125L747L418L164
$$ 312239 314489 316526 318437 320684 323657 327414 331772 336465 341194 345690 349815 353562 356980 360144
53609C60144L016K971K974L107L536M172M556M304L523K627J809J061N30M77Q45
$$ 360144 363160 366131 369105 372212 375748 379920 384476 388780 392303 394930 396739 397800 398330 398807 399652
53594C99652J236J368J258Q76J20p25j058p06k49k43n46p74r65j272j401j003
$$ 399652 400888 402256 403514 404390 404510 403785 402727 402021 401772 401529 400983 400209 399244 397972 396571 395568
53578C95568l85j17o8L47J057J243N70k89o85q75j359j903j913j487j388j956
$$ 395568 395183 395066 394998 395345 396402 397645 398215 397926 397241 396366 395007 393104 391191 389704 388316 386360
53562C86360k583k438j397q5P82R45O37K44M4J50N09R00J060R62Q88J083J474
$$ 386360 383777 381339 379942 379857 380639 381584 382221 382465 382509 382659 383168 384068 385128 386090 386978 388061 389535
53545C89535J883K272K590K630K425K504L342M536N202N130N007N465O346P172
$$ 389535 391418 393690 396280 398910 401335 403839 407181 411717 416919 422049 427056 432521 438867 446039
53531D46039P765Q192Q574R202J0309J1533J2081J1902J2032J3261J4840J5352
$$ 446039 453804 461996 470570 479772 490081 501614 513695 525597 537629 550890 565730 581082
53519E81082J4639J4094J4960J6979J8994K0314K1074K1559K1747K1723K2078
$$ 581082 595721 609815 624775 641754 660748 681062 702136 723695 745442 767165 789243
53508G89243K3397K5263K6308K5762K4611K4482K5496K6040K4917K2838K1301
$$ 789243 812640 837903 864211 889973 914584 939066 964562 990602 1015519 1038357 1059658
53497A059658K0795K0852K1138K1550K1593K0798J9653J9139J9348J9470J9192
$$ 1059658 1080453 1101305 1122443 1143993 1165586 1186384 1206037 1225176 1244524 1263994 1283186
53486A283186J9050J9184J8849J7675J6536J6336J6691J6547J5543J3999J2045
$$ 1283186 1302236 1321420 1340269 1357944 1374480 1390816 1407507 1424054 1439597 1453596 1465641
53475A465641R733P581O124M970L264R01j550l974o720r432j1129j1733j2404
$$ 1465641 1475374 1482955 1489079 1494049 1497313 1498214 1496664 1492690 1485970 1476538 1465409 1453676 1441272
53462A441272j3760j4893j4950j4658j5237j6596j7821j8829k0075k1059k0741
$$ 1441272 1427512 1412619 1397669 1383011 1367774 1351178 1333357 1314528 1294453 1273394 1252653
53451A252653j9510j9072k0007k0881k0474j9451j8932j8624j7629j6119j4852
$$ 1252653 1233143 1214071 1194064 1173183 1152709 1133258 1114326 1095702 1078073 1061954 1047102
53440A047102j3603j1573r010p026n867m635k936j477p41j72Q10J919K755L642
$$ 1047102 1033499 1021926 1012916 1005890 1000023 995388 992452 990975 990234 990062 990872 992791 995546 999188
53426I99188N093P015Q971J0766J2267J3171J3559J4180J5626J7539J9209K0611
$$ 999188 1004281 1011296 1020267 1031033 1043300 1056471 1070030 1084210 1099836 1117375 1136584 1157195
53414A157195K2234K4168K6003K7542K8968L0381L1696L3115L5113L7777M0470
$$ 1157195 1179429 1203597 1229600 1257142 1286110 1316491 1348187 1381302 1416415 1454192 1494662
53403A494662M2432M3558M4439M5759M7659M9696N1314N2389N3231N4158N5229
$$ 1494662 1537094 1580652 1625091 1670850 1718509 1768205 1819519 1871908 1925139 1979297 2034526
53392B034526N6302N7077N7115N6248N4940N3858N2945N1507M9346M7212M5588
$$ 2034526 2090828 2147905 2205020 2261268 2316208 2370066 2423011 2474518 2523864 2571076 2616664
53381B616664M3760M0740L6713L2735K9259K5698K1475J6711J1716O559J272m008
$$ 2616664 2660424 2701164 2737877 2770612 2799871 2825569 2847044 2863755 2875471 2882030 2883302 2879294
53369B879294r334j4915k0619k5983l0891l5725m0593m4983m8498n1398n3876
$$ 2879294 2869960 2855045 2834426 2808443 2777552 2741827 2701234 2656251 2607753 2556355 2502479
53358B502479n5372n5286n4230n3612n3887n3905n2382m9533m6813m5277m4706
$$ 2502479 2447107 2391821 2337591 2283979 2230092 2176187 2123805 2074272 2027459 1982182 1937476
53347A937476m4262m3500m2510m1478m0407l9267l8070l6742l5107l3109l0990
$$ 1937476 1893214 1849714 1807204 1765726 1725319 1686052 1647982 1611240 1576133 1543024 1512034
53336A512034k9087k7471k5872k3961k1688j9374j7462j6195j5465j4939j4338
$$ 1512034 1482947 1455476 1429604 1405643 1383955 1364581 1347119 1330924 1315459 1300520 1286182
53325A286182j3608j2957j2657j2713j2733j2290j1478j0899j0856j0824r974
$$ 1286182 1272574 1259617 1246960 1234247 1221514 1209224 1197746 1186847 1175991 1165167 1155193
53314A155193q108n760l499j548MJ117J988K995M237N516O845Q532J0559J2365
$$ 1155193 1147085 1141325 1137826 1136278 1136282 1137399 1139387 1142382 1146619 1152135 1158980 1167512 1178071 1190436
53300A190436J3551J4466J5679J7235J8836K0450K2255K4105K5571K6437K6820
$$ 1190436 1203987 1218453 1234132 1251367 1270203 1290653 1312908 1337013 1362584 1389021 1415841
53289A415841K6834K6488K5828K4912K3701K2241K0793J9419J7690J5191J2178
$$ 1415841 1442675 1469163 1494991 1519903 1543604 1565845 1586638 1606057 1623747 1638938 1651116
53278A651116R189O220K896n55l282n047o759r336j2480j5116j6790j8084j9743
$$ 1651116 1660305 1666525 1669421 1668866 1665584 1660537 1653778 1644442 1631962 1616846 1600056 1581972 1562229
53265A562229k1806k3748k5178k6215k7228k8286k9030k9153k8890k8773k8957
$$ 1562229 1540423 1516675 1491497 1465282 1438054 1409768 1380738 1351585 1322695 1293922 1264965
53254A264965k9065k8738k8051k7352k6962k7101k7680k8037k7315k5459k3501
$$ 1264965 1235900 1207162 1179111 1151759 1124797 1097696 1070016 1041979 1014664 989205 965704
53243I65704k2475k2304k2157k1621k0985k0475j9840j8842j7648j6536j5535
$$ 965704 943229 920925 898768 877147 856162 835687 815847 797005 779357 762821 747286
53232G47286j4564j3640j2777j1849j0813r832r100q724q791r298r882j0071j0005
$$ 747286 732722 719082 706305 694456 683643 673811 664711 655987 647196 637898 628016 617945 607940
53219F07940j0458j1813j3344j4049j3921j3768j3889j3686j2636j1061r656q766
$$ 607940 597482 585669 572325 558276 544355 530587 516698 503012 490376 479315 469659 460893
53207D60893q404q496q755q692q165p642p613p968q296q459q528q350p691o653
$$ 460893 452489 443993 435238 426546 418381 410739 403126 395158 386862 378403 369875 361525 353834 347181
53193C47181n581m662l915l423l233l163l057l064l301l508l427l283l359l360
$$ 347181 341600 336938 333023 329600 326367 323204 320147 317083 313782 310274 306847 303564 300205 296845
53179B96845k800j892j358j367j386j170j135j539j916j691r20j07L44L49J10
$$ 296845 294045 292153 290795 289428 288042 286872 285737 284198 282282 280591 279671 279564 279908 280257 280367
53164B80367J1J56K5q63k042k525k181j873j985j814r09p1k24r91j285r25o80
$$ 280367 280378 280534 280559 279696 277654 275129 272948 271075 269090 267276 266367 266296 266072 265081 263796 262871 262191
53147B62191r71j372j366r57m84k97n84j127j290p24Q6M13K36J66N05R30J068
$$ 262191 261220 259848 258482 257525 257041 256744 256160 255033 253743 253019 253105 253518 253754 253920 254425 255355 256423
53130B56423R19O16K01l06q26j228j283p58J78Q65Q01K19k01j03L06N61K72n94
$$ 256423 257342 257958 258159 257853 257027 255799 254516 253758 253936 254801 255602 255821 255620 255517 255823 256384 256656 256062
53112B56062j488j692j204q42j103j463j240p04o03r18r04k50M87O49J50o21j144
$$ 256062 254574 252882 251678 250836 249733 248270 247030 246326 245723 244805 243901 243651 244138 244787 244937 244316 243172
53095B43172j059m89K5K04L81P58Q14j2j268j894j459l94P43J562J673J046M31
$$ 243172 242113 241624 241649 241853 242234 242992 243806 243794 242526 240632 239173 238779 239522 241084 242757 243803 244234
53078B44234O34J383J710J287O21K9o26j126r19j58K29r8l64N3N92M07l48p84
$$ 244234 244868 246251 247961 249248 249869 249898 249272 248146 247227 247069 247298 247200 246836 246889 247481 247888 247540 246756
53060B46756m75J10K30m08j385j886j459n02K80P59J267J756J714R98J39k89j68
$$ 246756 246281 246391 246621 246213 244828 242942 241483 240981 241261 242020 243287 245043 246757 247755 247894 247605 247437
53043B47437L09P85P93K43k25q8R7n37j567j654n97K15j53r12r78n29l35m09k85
$$ 247437 247746 248531 249324 249567 249342 249254 249351 248814 247247 245593 244996 245211 245058 244146 243168 242639 242304 241895 241610
53024B41610j9R3K84R59J870K346K180J673J084N15J15q3l07o80r96j071r66o34
$$ 241610 241591 241684 241968 242927 244797 247143 249323 250996 252080 252595 252710 252627 252320 251640 250644 249573 248607 247973
53006B47973M0O65M97m14j013o19J77N78P28J061J314J073O59N64N13O7l31O0
$$ 247973 248013 248678 249175 248761 247748 247129 247306 247884 248612 249673 250987 252060 252719 253283 253796 253863 253532 253592
52988B53592R72J472J355J205J242J122Q51Q69J189J302J101J081J459J808J779
$$ 253592 254564 256036 257391 258596 259838 260960 261811 262680 263869 265171 266272 267353 268812 270620 272399
52973B72399J603J602J686J544J047L85N9N43J651K441K186J199K97k62p08r86
$$ 272399 274002 275604 277290 278834 279881 280266 280325 280868 282519 284960 287146 288345 288642 288380 287672 286686
52957B86686p80k21J64J50k9j28j2M02P80K87j393l223l871l365k838k771k500
$$ 286686 285906 285685 285849 285999 285970 285842 285830 286232 287012 287299 285906 282683 278812 275447 272609 269838 267338
52940B67338j502j17J139K057K279J335m37j818k027j499j016p04l65j49l13o76
$$ 267338 265836 265719 266858 268915 271194 272529 272092 270274 268247 266748 265732 265028 264663 264514 264201 263525
52924B63525q31p18o47q53j243j423j027j86M19L59Q1K89Q53J010N31l2l36o19
$$ 263525 262694 261976 261329 260476 259233 257810 256783 256597 257016 257375 257456 257745 258598 259608 260139 260107 259771 259152
52906B59152r94j092p40l28k08k74m41q68j441j621j168m84M1M43O54K91n93j128
$$ 259152 258158 257066 256326 255998 255790 255516 255075 254207 252766 251145 249977 249493 249534 249977 250631 250922 250329 249201
52888B49201o18N13J250J157O13K08K97Q54J406J360O51j98p47r97r64n04K35
$$ 249201 248583 249096 250346 251503 252116 252324 252621 253475 254881 256241 256892 256694 255947 254950 253986 253482 253717
52871B53717P74R89J282J768J989J762J617J886K084J770J353J326J327P84n5
$$ 253717 254491 255480 256762 258530 260519 262281 263898 265784 267868 269638 270991 272317 273644 274428 274373
52856B74373n36o88q97r34l25M38K47r89k037k041j631j892k857l598l489k867
$$ 274373 273837 273149 272252 271318 270993 271431 271678 270689 268652 266611 264980 263088 260231 256633 253144 250277
52840B50277k488k635k869k621j956j446j322j135n61n4j55n40m50J01L45o9n77
$$ 250277 247789 245154 242285 239664 237708 236262 234940 233805 233244 233190 233035 232495 232045 232146 232491 232422 231845
52823B31845n68o6N89J141J217M08j068k217k277j491o16N5O73J210J445J431
$$ 231845 231277 231211 231800 232941 234158 234566 233498 231281 229004 227513 226897 226952 227625 228835 230280 231711
52807B31711J493J680J605J017K17k14K7P17J272J128J37j214k111k128j589j173
$$ 231711 233204 234884 236489 237506 237723 237509 237536 238253 239525 240653 240790 239576 237465 235337 233748 232575
52791B32575j160j283j225j052r47q07l19M87J140J248R46O64N26K49k96o32q6
$$ 232575 231415 230132 228907 227855 226908 226101 225782 226269 227409 228657 229603 230267 230793 231042 230746 230114 230028
52774B30028J292K450K327J059j73n46m34n79r00p78k44o9n98j192j166o56j90
$$ 230028 231320 233770 236097 237156 236983 236437 236003 235424 234524 233746 233502 233433 232835 231643 230477 229821 229631
52757B29631J42N66J016J186J072Q96O63J95l70o09m00j73l24p04p74k37P16J658
$$ 229631 229773 230339 231355 232541 233613 234509 235172 235367 234997 234388 233988 233815 233491 232787 232013 231776 232492 234150
52739B34150K303K626K658K309J553P26L85P60J482J982K017J678J186Q17Q51
$$ 234150 236453 239079 241737 244046 245599 246325 246710 247470 248952 250934 252951 254629 255815 256632 257483
52724B57483J244J501J143K94m67q04r28j170j513j693j571j238q13k97K65O88
$$ 257483 258727 260228 261371 261665 261198 260394 259466 258296 256783 255090 253519 252281 251468 251171 251436 252124
52708B52124Q17P61P61Q21O51J25m92r00j089j084p09j1M02Rp25q16r7N78N97
$$ 252124 252941 253702 254463 255284 255935 256060 255568 254668 253579 252495 251786 251775 252177 252186 251461 250645 250548 251126 251723
52689B51723L11K43K38Qj07M42J467K142J947J152M23J89L41L14l09j196j620
$$ 251723 252034 252277 252515 252523 252416 252858 254325 256467 258414 259566 259989 260178 260519 260833 260524 259328 257708
52672B57708j468j401j745j876j188q5O64J078J680K332K312J457M53o8q4J68
$$ 257708 256240 254839 253094 251218 250030 249945 250609 251687 253367 255699 258011 259468 259921 259853 259769 259937
52656B59937N40P89P40O89J097J792K039J590J103J177J505J340M60p37j772k409
$$ 259937 260477 261266 262006 262695 263792 265584 267623 269213 270316 271493 272998 274338 274798 274061 272289 269880
52640B69880k577k346j953j618j322q60j61N00O17Qq41j162p65k12%L9K30M75
$$ 269880 267303 264957 263004 261386 260064 259204 259043 259543 260160 260168 259327 258165 257400 257188 257188 257227 257457 257932
52622B57932N87Q03J264J411P04k35k00Q50J629J327N99L80N39L68k42q47j189
$$ 257932 258519 259322 260586 261997 262701 262466 262266 263116 264745 266072 266671 267051 267590 267958 267716 266869 265680
52605B65680j258r21k16L37K76k0K22J028J595J403Q83P36J035J270J082O44L35
$$ 265680 264422 263501 263285 263622 263898 263878 264100 265128 266723 268126 269009 269745 270780 272050 273132 273776 274111
52588B74111K61K20J06J39N47J060J052K98o56j011n27L80J125J415J294R25L77
$$ 274111 274372 274592 274698 274837 275384 276444 277496 277794 277138 276127 275600 275980 277105 278520 279814 280739 281116
52571B81116l62j152j592j399q37n31p56j165j351j401j656k059k031j088M62
$$ 281116 280754 279602 278010 276611 275774 275243 274487 273322 271971 270570 268914 266855 264824 263736 264198
52556B64198J567J316p7j329j349l29O17O96j1j022j869k087j428l37L56M39N12
$$ 264198 265765 267081 267004 265675 264326 263997 264614 265310 265299 264277 262408 260321 258893 258556 258912 259351 259863
52539B59863R34J134N08n05q73l20L82M44o5m36j11P88J536J446N38m40p63l53
$$ 259863 260797 261931 262439 261934 261061 260741 261123 261567 261502 261066 260955 261743 263279 264725 265263 264823 264060 263707
52521B63707L92J073J417J294R30Q80J416K064K140J630J202J386K037K620K783
$$ 263707 264099 265172 266589 267883 268813 269693 271109 273173 275313 276943 278145 279531 281568 284188 286971
52506B86971K621K481K499K335J559K73r38j799k625l650m477m594m050l236k354
$$ 286971 289592 292073 294572 296907 298466 298739 297801 296002 293377 289727 285250 280656 276606 273370 271016
52491B71016j530j095j145j110l85P26J357J228Q56O76O05N87Q54J435J917J954
$$ 271016 269486 268391 267246 266136 265751 266477 267834 269062 269918 270594 271199 271786 272640 274075 275992 277946
52475B77946J633J174O09nm47n16j47O76J756K494K359J626J153J335J775K067
$$ 277946 279579 280753 281362 281357 280910 280394 280247 280923 282679 285173 287532 289158 290311 291646 293421 295488
52459B95488K308K586K632K297J833J281J43j766l649m515m352l979l881l843
$$ 295488 297796 300382 303014 305311 307144 308425 308568 306802 303153 298638 294286 290307 286426 282583
52445B82583l568l109k629k140j606r45j24N82N73l55j464j691q77P6K97k11q45
$$ 282583 279015 275906 273277 271137 269531 268586 268462 269044 269617 269262 267798 266107 265230 265306 265603 265392 264547
52428B64547j115r20m65q9K3K4K04N73Q77J016J117J194J038O38M23Q38J785K676
$$ 264547 263432 262512 262047 261958 261981 262005 262209 262782 263659 264675 265792 266986 268024 268662 269085 269923 271708 274384
52410B74384L061L117L440M331N391N997O182O585P386P782O991N377L906K750
$$ 274384 277445 280562 284002 288333 293724 299721 305903 312488 319874 327656 334647 340024 343930 346680
52396C46680J195j010l121m446n215n945o523o428n494m013k361r70l27n08r23
$$ 346680 347875 346865 343744 339298 334083 328138 321615 315187 309693 305680 303319 302349 302022 301514 300591
52381C00591r15m52J68R35J973K964L365L142K826K836L187L767M387M602M032
$$ 300591 299676 299224 299392 300327 302300 305264 308629 311771 314597 317433 320620 324387 328774 333376 337408
52366C37408L010K403K592L082L224K876K164J082k40j318j711j517j181r53p96
$$ 337408 340418 342821 345413 348495 351719 354595 356759 357841 357601 356283 354572 353055 351874 350921 350125
52351C50125n72r0Q34K059L015L256K958K624K426K161J791J676K141L058L992
$$ 350125 349553 349463 350297 352356 355371 358627 361585 364209 366635 368796 370587 372263 374404 377462 381454
52336C81454M674N211N865O664P398P978Q635R573J0624J1584J2732J4477J6487
$$ 381454 386128 391339 397204 403868 411266 419244 427879 437452 448076 459660 472392 486869 503356
52323E03356J7764J7865J7519J7613J8089J8330J8236J8213J8327J8195J7672
$$ 503356 521120 538985 556504 574117 592206 610536 628772 646985 665312 683507 701179
52312G01179J7077J6704J6646J7103J8237J9616K0403K0325J9963J9841J9706
$$ 701179 718256 734960 751606 768709 786946 806562 826965 847290 867253 887094 906800
52301I06800J9073J7982J6835J5737J4424J2780J0942R040P071M975K751N02j502
$$ 906800 925873 943855 960690 976427 990851 1003631 1014573 1023613 1030684 1035659 1038410 1038912 1037410
52288A037410k996m039m946n816o382o552o710p189p676p584o791n664m458l128
$$ 1037410 1034414 1030375 1025429 1019613 1013231 1006679 999969 992780 985104 977520 970729 965065 960607 957479
52274I57479j703l68Q89K330M050N822P474R122J0871J2474J3528J3872J3683
$$ 957479 955776 955408 956297 958627 962677 968499 975973 985095 995966 1008440 1021968 1035840 1049523
52261A049523J3262J2864J2666J2768J3146J3650J3972J3862J3477J3408J3956
$$ 1049523 1062785 1075649 1088315 1101083 1114229 1127879 1141851 1155713 1169190 1182598 1196554
52250A196554J4481J3833J1656Q870O573M847L007P77j391l114m672o498q388
$$ 1196554 1211035 1224868 1236524 1245394 1251967 1256814 1259821 1260598 1259207 1256093 1251421 1244923 1236535
52237A236535r643r905r657r829j0872j2279j3025j2591j1497j0645j0352j0258
$$ 1236535 1226892 1216987 1207330 1197501 1186629 1174350 1161325 1148734 1137237 1126592 1116240 1105982
52225A105982j0096r947r713q904p351n695m647m119l581k961k526k138j398m95
$$ 1105982 1095886 1085939 1076226 1067322 1059971 1054276 1049629 1045510 1041929 1038968 1036442 1034304 1032906 1032411
52211A032411l7L7N58J808L021L602L981M661N252N272N196N644O098N659M721
$$ 1032411 1032374 1032411 1032969 1034777 1037798 1041400 1045381 1050042 1055294 1060566 1065762 1071406 1077504 1083163 1087884
52196A087884M573N329N694N039M380M672N375N548N324N308N196M213K499J001
$$ 1087884 1092457 1097786 1103480 1108519 1112899 1117571 1122946 1128494 1133818 1139126 1144322 1148535 1151034 1152035
52182A152035J03o79j740k969m309n897p506q558q859q771q554q101p447o890
$$ 1152035 1152138 1151459 1149719 1146750 1142441 1136544 1129038 1120480 1111621 1102850 1094296 1086195 1078748 1071858
52168A071858o411n537m072k407q99N06J717K207J782J160J159J604J642R58J14
$$ 1071858 1065447 1059910 1055838 1053431 1052532 1053038 1054755 1056962 1058744 1059904 1061063 1062667 1064309 1065267 1065381
52153A065381k48p3K84M18R2n27q47m30L71P73N94N37J190K245K956L027K683
$$ 1065381 1065133 1065060 1065344 1065762 1065854 1065327 1064480 1064050 1064421 1065194 1065788 1066325 1067515 1069760 1072716 1075743 1078426
52136A078426K088J256M80L80J271K737M146N400O984R221J1770J3971J5659J7337
$$ 1078426 1080514 1081770 1082250 1082630 1083901 1086638 1090784 1096184 1103168 1112389 1124159 1138130 1153789 1171126
52122A171126J9486K1902K4000K5635K7239K8951L0106K9977K8882K7890K7379
$$ 1171126 1190612 1212514 1236514 1262149 1289388 1318339 1348445 1378422 1407304 1435194 1462573
52111A462573K6464K4210K0965J7984J6020J4808J3877J3127J2478J1526J0064
$$ 1462573 1489037 1513247 1534212 1552196 1568216 1583024 1596901 1610028 1622506 1634032 1644096
52100A644096Q516P418O651N693M469L377K394Q30j761m826p414r289j1015j3037
$$ 1644096 1652612 1660030 1666681 1672374 1676843 1680220 1682614 1683444 1681683 1676857 1669443 1660154 1649139 1636102
52086A636102j5141j6867j7991j8478j8286j7467j6230j4706j2853j0804q991
$$ 1636102 1620961 1604094 1586103 1567625 1549339 1531872 1515642 1500936 1488083 1477279 1468288
52075A468288p573n946l382j40K651M305N299O478Q078R905J1929J4046J5602
$$ 1468288 1460715 1454769 1451387 1451247 1453898 1458203 1463502 1469980 1478058 1487963 1499892 1513938 1529540
52062A529540J5928J5346J4955J5225J5404J4592J2894J1109R770Q866Q293P925
$$ 1529540 1545468 1560814 1575769 1590994 1606398 1620990 1633884 1644993 1654763 1663629 1671922 1679847
52050A679847P345O045M035J926J69j559l980p254j0620j3190j4940j6670j8814
$$ 1679847 1687192 1693237 1697272 1699198 1699367 1697808 1693828 1686574 1675954 1662764 1647824 1631154 1612340
52037A612340k0675k1191k0373j9358j8973j8787j7963j6512j5198j4422j3881
$$ 1612340 1591665 1570474 1550101 1530743 1511770 1492983 1475020 1458508 1443310 1428888 1415007
52026A415007j3269j2691j2262j1786j1164j0671j0542j0456r871q802p874p570
$$ 1415007 1401738 1389047 1376785 1364999 1353835 1343164 1332622 1322166 1312295 1303493 1295619 1288049
52014A288049p713p816p799q058q852r905j0741j1329j2119j3469j5199j6838
$$ 1288049 1280336 1272520 1264721 1256663 1247811 1237906 1227165 1215836 1203717 1190248 1175049 1158211
52002A158211j8150j9313k0617k2103k3450k4214k4139k3273k1824k0051j8393
$$ 1158211 1140061 1120748 1100131 1078028 1054578 1030364 1006225 982952 961128 941077 922684
51991I22684j7419j7250j7249j6644j5464j4444j3936j3471j2619j1721j1379
$$ 922684 905265 888015 870766 854122 838658 824214 810278 796807 784188 772467 761088
51980G61088j1657j2192j2774j3334j3682j3741j3775j3866j3515j2290j0629
$$ 761088 749431 737239 724465 711131 697449 683708 669933 656067 642552 630262 619633
51969F19633r263q076o352m054j967m70Q95K414L649M357N000N775N944M899L268
$$ 619633 610370 602294 595942 591888 589921 589451 590346 592760 596409 600766 605766 611541 617485 622384 625652
51954F25652K085J288L2j779l247l787l739l608l393k893k026o33J382L544N051
$$ 625652 627737 629025 629057 627278 624031 620244 616505 612897 609504 606611 604585 603952 605334 608878 613929
51939F13929N806O593P894R177R808J0004J0213J0058Q777O495M147K109k15l221
$$ 613929 619735 626328 634222 643399 653207 663211 673424 683482 692259 698754 702901 705010 704795 701574
51925G01574o343q862j0894j2980j5108j6706j7462j7549j7144j6215j4873j3508
$$ 701574 695231 686369 675475 662495 647387 630681 613219 595670 578526 562311 547438 533930
51913E33930j2347j1215r804q015n983l931k112o29O91K095L521M744N861P192
$$ 533930 521583 510368 500564 492549 486566 482635 480523 479894 480585 482680 486201 490945 496806 503998
51899E03998Q600R422R378R081R148R198Q377O662M897L535K225Q00n4K46J102
$$ 503998 512598 522020 531398 540479 549627 558825 567202 573864 578761 582296 584521 585321 585267 585513 586615
51884E86615J370Q11J97m7n44j999m027n457n671n131m562m035l108j644q8J000
$$ 586615 587985 588796 588993 588946 588402 586403 582376 576919 571248 566117 561555 557520 554412 552768 552680 553680
51868E53680J411J173L24j003k426l537m274m857n452o014o380o300n544m194
$$ 553680 555091 556264 556588 555585 553159 549622 545348 540491 535039 529025 522645 516345 510801 506607
51854E06607k743j638q07N3Q55J250J269J209Q73l75k476m271m876m859n344o324
$$ 506607 503864 502226 501419 501472 502327 503577 504846 506055 506928 506553 504077 499806 494930 490071 484727 478403
51838D78403o737o075n066m540m386l961l004j752n48K91N83N63P75J356J745
$$ 478403 471666 465591 460525 455985 451599 447638 444634 442882 442334 442625 443208 443771 444546 445902 447647
51823D47647J424O68Q2l51j141k263k932k562j520o27k42j38m2P4K12M94J031
$$ 447647 449071 449739 449821 449470 448329 446066 443134 440572 439052 438425 438183 438045 438003 438077 438289 438783 439814
51806D39814J715K230K278J813J068L37k88q61j365j665j677j423r36l40Pk61
$$ 439814 441529 443759 446037 447850 448918 449255 448967 448106 446741 445076 443399 441976 441040 440700 440707 440446
51790D40446j039j761k078k254k658l146l319l126k745k112j064N2N69L72O7R4
$$ 440446 439407 437646 435568 433314 430656 427510 424191 421065 418320 416208 415144 415196 415765 416137 416204 416298
51774D16298K69M59J045K196L227L447L278L747N000O169O764P302Q232Q961Q624
$$ 416298 416567 417026 418071 420267 423494 426941 430219 433966 438966 445135 451899 459201 467433 476394 485018
51759D85018P269N608L886J785o57k776m172n302o752q310r209r108q414p654
$$ 485018 492287 497895 501781 503566 502909 500133 495961 490659 483907 475597 466388 457280 448866 441212
51745D41212o856n768m320k718j195J80J478K863M470O195P688Q731R512J0320
$$ 441212 434356 428588 424268 421550 420355 420535 422013 424876 429346 435541 443229 451960 461472 471792
51731D71792J1032J1199J0720J0050R530Q810P296N147L352K747L125L483L028
$$ 471792 482824 494023 504743 514793 524323 533133 540429 545576 548928 551675 554800 558283 561311
51718E61311J749J26j508l176m875o287p030p140p045o995o771o151n347m851
$$ 561311 563060 563186 561678 558502 553627 547340 540310 533170 526125 519130 512359 506208 500861 496010
51704D96010m797m821m512l798k877j943j100m40j18k26o01q52p56n91q09j370
$$ 496010 491213 486392 481880 478082 475205 473262 472162 471722 471604 471378 470777 469925 469169 468578 467769 466399
51688D66399j726j562j176j015j157j614k659m306n735n888m606k681q09R41K555
$$ 466399 464673 463111 461935 460920 459763 458149 455490 451184 445449 439561 434955 432274 431465 432406 434961
51673D34961L658M019M055M413N270O244O909P251P686Q627R896J0670J0310R058
$$ 434961 438619 442638 446693 451106 456376 462620 469529 476780 484466 493093 502989 513659 523969 533027
51659E33027P526N697L103j42l294o059q753j1023j1541r754p129n569n146m496
$$ 533027 540553 546250 549353 549211 545917 539858 531105 520082 508541 498787 491658 486089 480943 476447
51645D76447l133j996j759j936k116k864m651o758q140q714q946q632p191n000
$$ 476447 473314 471318 469559 467623 465507 462643 457992 451234 443094 434380 425434 416802 409611 404611
51631D04611l336k780k592k006j261q44m40N29J686K069J614J354J948K789K969
$$ 404611 401275 398495 395903 393897 392636 391792 391352 391881 393567 395636 397250 398604 400552 403341 406310
51616D06310K469J819J140K21p67j335j482j747k426l235l792l930l464k203m68
$$ 406310 408779 410598 411738 411959 411192 409857 408375 406628 404202 400967 397175 393245 389781 387578 387110
51601C87110Q91J392J520K135L524N306O983Q253Q955R082Q816Q410Q040P775
$$ 387110 388001 389393 390913 393048 396572 401878 408861 417114 426069 435151 443967 452377 460417 468192
51587D68192P526O896N402L042M45j636k835l104k446r68J059L395N874Q148R796
$$ 468192 475718 482614 488016 491058 491503 489867 487032 483928 481482 480514 481573 484968 490842 498990 508786
51572E08786J0871J2033J3788J5835J7485J8443J8902J9176J9609K0546K1957
$$ 508786 519657 531690 545478 561313 578798 597241 616143 635319 654928 675474 697431
51561F97431K3217K3698K3530K3429K3921K4999K6298K7247K7131K5478K2306
$$ 697431 720648 744346 767876 791305 815226 840225 866523 893770 920901 946379 968685
51550I68685J7770J1803M479l491j1198j8271k4756l0376l4521l6977l8135l8329
$$ 968685 986455 998258 1002737 999246 988048 969777 945021 914645 880124 843147 805012 766683
51538G66683l7437l5313l2239k8753k5288k2085j9221j6638j4263j2117j0251
$$ 766683 729246 693933 661694 632941 607653 585568 566347 549709 535446 523329 513078
51527E13078q740p790p551p660p376o491n652n358n128m354l460l271l593l499
$$ 513078 504338 496548 488997 481337 473961 467470 461818 456460 451332 446978 443518 440247 436654 433155
51513D33155k904k680l040l092k361j668j868k596l003k973k838k489j678p75
$$ 433155 430251 427571 424531 421439 419078 417410 415542 412946 409943 406970 404132 401643 399965 399190
51499C99190l82m05k22L95J126J755K407L132L702L901L703L285K989L091L391
$$ 399190 398808 398403 398181 398576 399702 401457 403864 406996 410698 414599 418302 421587 424576 427667 431058
51484D31058L320K717K093J839J583P16p51k264l330l689l349k867l152m448n898
$$ 431058 434378 437095 439188 441027 442610 443326 442575 440311 436981 433292 429943 427076 423924 419476 413578
51469D13578o624o805p002o999o229m998m215m038l791l198k679k355j750p94
$$ 413578 406954 400149 393147 386148 379919 374921 370706 366668 362877 359679 357000 354645 352895 352101
51455C52101j49j53k14K86J214K158K986L498L349K842L075M653O855Q698J0233
$$ 352101 351952 351799 351585 351871 353085 355243 358229 361727 365076 367918 370993 375646 382501 391199 401432
51440D01432J1916J3344J3651J2914J2030J1312J0134Q132N776L500J128j434
$$ 401432 413348 426692 440343 453257 465287 476599 486733 494865 500641 504141 505269 503835
51428E03835l559m580m704m775n388o525p798q659q680p986p209o704o048m710
$$ 503835 500276 495696 490992 486217 480829 474304 466506 457847 449167 441181 433972 427268 421220 416510
51414D16510l017j881j644j741j559j187r63p69j48R64K012K371J994J443J343
$$ 416510 413493 411612 409968 408227 406668 405481 404518 403749 403601 404565 406577 408948 410942 412385 413728
51399D13728J810K383K587K500K679L450M557N511O171O764P560Q739J0452J2747
$$ 413728 415538 417921 420508 423008 425687 429137 433694 439205 445376 452140 459700 468439 478891 491638
51385D91638J5441J8239K1006K3819K6852L0360L4545L9157M3315M6114M7448
$$ 491638 507079 525318 546324 570143 596995 627355 661900 701057 744372 790486 837934
51374H37934M7832M7406M5599M1896L6510K9975K2465J3863M299n806j6051k5983
$$ 837934 885766 933172 978771 1020667 1057177 1087152 1109617 1123480 1127779 1121973 1105922 1079939
51362A079939l4858m1877m6756m9751n1173n1116m9723m7329m4223m0506l6293
$$ 1079939 1045081 1003204 956448 906697 855524 804408 754685 707356 663133 622627 586334
51351E86334l1864k7523k3449j9744j6463j3568j1024r013p784p191o620n569
$$ 586334 554470 526947 503498 483754 467291 453723 442699 433686 425902 418711 412091 406522
51339D06522m225l189k737k549k262j989k097k560k801k335j369n72l50n37p68
$$ 406522 402297 399108 396371 393822 391560 389571 387474 384914 382113 379778 378409 377837 377487 376950 376182
51324C76182q28o35j98J97J61l17q01j088j527k323k904k578j623j025j162j404
$$ 376182 375354 374719 374521 374718 374879 374562 373761 372673 371146 368823 365919 363341 361718 360693 359531 358127
51308C58127j129m58K59J020J777K006J273k3j043j464j531j375q87k70q7m56
$$ 358127 356998 356540 356799 357819 359596 361602 362875 362852 361809 360345 358814 357439 356552 356282 356195 355739
51292C55739p06j88Q29J452J308J024J461K714M067M812M908M748M559M236L711
$$ 355739 355033 354845 355674 357126 358434 359458 360919 363633 367700 372512 377420 382168 386727 390963 394674
51277C94674L137K665K259J866J463R03oj042j564j297q75j076j721j932j437
$$ 394674 397811 400476 402735 404601 406064 406967 406961 405919 404355 403058 402183 401107 399386 397454 396017
51262C96017r25q31n85L91J440J243m22k284l093k928k673k740k798k548k195
$$ 396017 395092 394261 393676 394067 395507 396750 396328 394044 390951 388023 385350 382610 379812 377264 375069
51247C75069k083k184k177j832j248p18l57N9P94J632J909J294L36o5L08Q16Q17
$$ 375069 372986 370802 368625 366793 365545 364827 364470 364529 365323 366955 368864 370158 370494 370429 370737 371553 372370
51230C72370K97m10j104j658j831j481q29j98M21J208K040K501K355J772J065
$$ 372370 372667 372257 371153 369495 367664 366183 365354 365156 365577 366785 368825 371326 373681 375453 376518
51215C76518M24l5k30k02j21o6Q4M38R15J300J491J619J935K491K965K924K363
$$ 376518 376942 376907 376677 376475 376354 376288 376372 376810 377725 379025 380516 382135 384070 386561 389526 392450 394813
51198C94813J765J511J472J357J194J111R38N06J26K04M07l1j070j617r30L57
$$ 394813 396578 398089 399561 400918 402112 403223 404161 404667 404793 404997 405404 405373 404303 402686 401756 402113
51182D02113J067R09M26m3o61j474k186k593k756k651k166j529j217j285j206
$$ 402113 403180 404089 404515 404472 403811 402337 400151 397558 394802 392151 389985 388456 387239 385954 384748
51167C84748o64m3J88J92M18P99Q82O32N25P35Q46O54P18J560K637K888K166J428
$$ 384748 384084 384041 384229 384421 384839 385638 386520 387152 387677 388412 389258 389912 390630 392190 394827 397715 399881 401309
51149D01309J267J140M52k93k38L51M07l20r39q81p84j385k363k824k493j758
$$ 401309 402576 403716 404168 403875 403637 403988 404395 404075 403136 402255 401471 400086 397723 394899 392406 390648
51133C90648r92l82j30k06j33M63J304J909K289K654K771K307J607J285J266J005
$$ 390648 389656 389274 389144 388938 388805 389268 390572 392481 394770 397424 400195 402502 404109 405394 406660 407665
51117D07665N90O67J228J411Q53L03M59R93J256J237J217J102Q35R01J674K597
$$ 407665 408255 408922 410150 411561 412414 412717 413176 414169 415425 416662 417879 418981 419816 420717 422391 424988
51101D24988K796K283J843J887K087K131K078J947J570R76N05M01O42J167J852
$$ 424988 427784 430067 431910 433797 435884 438015 440093 442040 443610 444586 445091 445492 446134 447301 449153
51086D49153K309K164J572R86M48m04j552k359k395j944j439q38J4P38P07q2q48
$$ 449153 451462 453626 455198 456184 456632 456228 454676 452317 449922 447978 446539 445701 445715 446453 447160 447078 446230
51069D46230q04J46J564L030M375N464O179O682P514Q980J0558J1309J1038J0533
$$ 446230 445426 445572 447136 450166 454541 460005 466184 472866 480380 489360 499918 511227 522265 532798
51055E32798J0504J0682J0406R624Q776Q104P694P973R275J0997J1972J1883J1456
$$ 532798 543302 553984 564390 574014 582790 590894 598588 606561 615836 626833 638805 650688 662144
51042F62144J1130J0310Q338N546K767L48j786l574m880n923p084q460r947j1575
$$ 662144 673274 683584 691922 697468 700235 700583 698797 695223 690343 684420 677336 668876 658929 647354
51028F47354j3349j4998j6167j6676j6334j4836j2249r307o777m781l046j470
$$ 647354 634005 619007 602840 586164 569830 554994 542745 533438 526661 521880 518834 517364
51016E17364j5J567L260M370M341L782L891M930O011O444O550O879P401P772P931
$$ 517364 517349 518916 522176 526546 530887 534669 538560 543490 549501 555945 562495 569374 576775 584547 592478
51001E92478Q076Q407R149J0406J1753J2424J2188J1717J1810J2554J3485J4237
$$ 592478 600554 608961 618110 628516 640269 652693 664881 676598 688408 700962 714447 728684
50989G28684J4691J4785J4493J3888J3019J1948J1001J0635J0864J1184J1352
$$ 728684 743375 758160 772653 786541 799560 811508 822509 833144 844008 855192 866544
50978H66544J1782J2800J3924J4439J4456J4806J5940J7572J9425K1775K4993
$$ 866544 878326 891126 905050 919489 933945 948751 964691 982263 1001688 1023463 1048456
50967A048456K8923L3030L6951M0757M4750M9120N3700N7962O1393O3881O5649
$$ 1048456 1077379 1110409 1147360 1188117 1232867 1281987 1335687 1393649 1455042 1518923 1584572
50956A584572O6793O7073O6123O3742N9994N5227N0007M4773L9444L3609K7198
$$ 1584572 1651365 1718438 1784561 1848303 1908297 1963524 2013531 2058304 2097748 2131357 2158555
50945B158555K0768J4955R937N661K363L52o65j640l288n457p599r648j2038j4997
$$ 2158555 2179323 2194278 2204215 2209876 2212239 2212591 2211926 2210286 2206998 2201541 2193942 2184294 2172256 2157259
50931B157259j8171k1088k3674k6199k8903l1842l5016l8469m2232m6193m9987
$$ 2157259 2139088 2118000 2094326 2068127 2039224 2007382 1972366 1933897 1891665 1845472 1795485
50920A795485n3099n5213n6475n7188n7319n6568n4919n2790n0487m7889m4818
$$ 1795485 1742386 1687173 1630698 1573510 1516191 1459623 1404704 1351914 1301427 1253538 1208720
50909A208720m1326l7499l3339k9205k5878k3706k1995j9838j7276j5094j3618
$$ 1208720 1167394 1129895 1096556 1067351 1041473 1017767 995772 975934 958658 943564 929946
50898I29946j2442j1222j0074r095q184p393o837o110m575k467r40o29p97l93
$$ 929946 917504 906282 896208 887113 878929 871536 864699 858589 854014 851547 850607 849978 849181 848788
50884H48788O03J485J917K118K316K689L576N041O421O942O808P055Q359J0390
$$ 848788 849391 850876 852793 854911 857227 859916 863492 868533 874954 881896 888704 895759 904118 914508
50870I14508J2377J3796J4520J4806J5249J6395J8263K0544K3156K6243K9661
$$ 914508 926885 940681 955201 970007 985256 1001651 1019914 1040458 1063614 1089857 1119518
50859A119518L2993L6238L9962M4577M9780N5088O0640O7154P5180Q4554R4519
$$ 1119518 1152511 1188749 1228711 1273288 1323068 1378156 1438796 1505950 1581130 1665684 1760203
50848A760203J04197J13061J21090J28563J35638J42159J47775J52158J55024
$$ 1760203 1864400 1977461 2098551 2227114 2362752 2504911 2652686 2804844 2959868
50839B959868J55983J54413J49629J41428J30469J17825J03948Q8379P0735N1789
$$ 2959868 3115851 3270264 3419893 3561321 3691790 3809615 3913563 4001942 4072677 4124466
50829D124466L3084J5731K2j3831k5144l3259l8163m0323m0113l7744l3636k8624
$$ 4124466 4157550 4173281 4173303 4159472 4134328 4101069 4062906 4022583 3982470 3944726 3911090 3882466
50817C882466k3723j9775j7344j6865j8912k4136l2752m4095n6867o9989q3101
$$ 3882466 3858743 3838968 3821624 3804759 3785847 3761711 3728959 3684864 3627997 3558008 3474907
50806C474907r6150j08569j19173j26946j31841j34598j35725j34937j31693j25963
$$ 3474907 3378757 3270188 3151015 3024069 2892228 2757630 2621905 2486968 2355275 2229312
50796B229312j18171j08605r7570q5989p5143o5491n6341m7103l8293l0831k4803
$$ 2229312 2111141 2002536 1904966 1818977 1743834 1678343 1622002 1574899 1536606 1505775 1480972
50785A480972j9641j5170j1700r215p240n561m426l949l911m221n004o098p047
$$ 1480972 1461331 1446161 1434461 1425246 1418006 1412445 1408019 1404070 1400159 1395938 1390934 1384836 1377789
50772A377789p808q918j0655j2515j3806j4431j4795j5336j6345j7844j9360k0143
$$ 1377789 1369981 1361063 1350408 1337893 1324087 1309656 1294861 1279525 1263180 1245336 1225976 1205833
50760A205833j9959j9339j8813j8248j7243j5809j4221j2471j0330p819n181k511
$$ 1205833 1185874 1166535 1147722 1129474 1112231 1096422 1082201 1069730 1059400 1051581 1046400 1043889
50748A043889L01L286O359R466J2542J5479J8398K1799K6005L0596L4810L8529
$$ 1043889 1044190 1047476 1053835 1063301 1075843 1091322 1109720 1131519 1157524 1188120 1222930 1261459
50736A261459M2472M7287N2770N8209O3232O8018P2762P7205Q0786Q3105Q4196
$$ 1261459 1303931 1351218 1403988 1462197 1525429 1593447 1666209 1743414 1824200 1907305 1991501
50725A991501Q4383Q3955Q2918Q0948P7604P2706O6513N9357N1133M1436L0319
$$ 1991501 2075884 2159839 2242757 2323705 2401309 2474015 2540528 2599885 2651018 2692454 2722773
50714B722773J8567O991m218j5058k4909l2802l8332m1731m2937m1424l7192l1356
$$ 2722773 2741340 2748331 2744113 2729055 2704146 2671344 2633012 2591281 2548344 2506920 2469728 2438372
50702B438372k5271j9461j3888q922n469m231n333q567j3600j9920k7042l4846
$$ 2438372 2413101 2393640 2379752 2370830 2365361 2361130 2355797 2347230 2333630 2313710 2286668 2251822
50690B251822m3387n2250o0349o6616p0750p3085p3768p2357o8418o2402n5564
$$ 2251822 2208435 2156185 2095836 2029220 1958470 1885385 1811617 1739260 1670842 1608440 1552876
50679A552876m8862m2127l4636k6334j8077j0655m036K223Q211J3599J8155K1906
$$ 1552876 1504014 1461887 1427251 1400917 1382840 1372185 1368149 1370372 1378583 1392182 1410337 1432243
50667A432243K4904K7047K8239K8524K8034K6801K4744K1971J9097J7007J6107
$$ 1432243 1457147 1484194 1512433 1540957 1568991 1595792 1620536 1642507 1661604 1678611 1694718
50656A694718J5924J5667J5053J4335J3808J3716J4397J5920J7676J8943J9954
$$ 1694718 1710642 1726309 1741362 1755697 1769505 1783221 1797618 1813538 1831214 1850157 1870111
50645A870111K1722K4712K8306L1788L5133L8543M1845M4838M7629N0202N2132
$$ 1870111 1891833 1916545 1944851 1976639 2011772 2050315 2092160 2136998 2184627 2234829 2286961
50634B286961N3206N3703N3602N2146M8921M4812M1069L7787L4132K9722K4754
$$ 2286961 2340167 2393870 2447472 2499618 2548539 2593351 2634420 2672207 2706339 2736061 2760815
50623B760815J8964J1593K571p099j6468k5411l3975m1457m6578m8205m5907m0259
$$ 2760815 2779779 2791372 2793943 2786844 2770376 2744965 2710990 2669533 2622955 2574750 2528843 2488584
50611B488584l2803k5224j8350j2215p129m072l755n849r499j4298k0327k7546
$$ 2488584 2455781 2430557 2412207 2399992 2392863 2388791 2385036 2379187 2369688 2355390 2335063 2307517
50599B307517l5516m3651n1401n8280o3921o8171p1009p2412p2319p0728o7804
$$ 2307517 2272001 2228350 2176949 2118669 2054748 1986577 1915568 1843156 1770837 1700109 1632305
50588A632305o3903n9417n4468m9021m3348l8182l4015l0454k6709k2590j8621
$$ 1632305 1568402 1508985 1454517 1405496 1362148 1323966 1289951 1259497 1232788 1210198 1191577
50577A191577j5206j2207r374o746m453k524j003P2R29J923K991L697L983M520
$$ 1191577 1176371 1164164 1154790 1148044 1143591 1141067 1140064 1140136 1141065 1142988 1145979 1149676 1153659 1158179
50563A158179N961Q203J0673J3108J5695J8541K1365K3706K5354K6604K8069L0146
$$ 1158179 1164140 1172343 1183016 1196124 1211819 1230360 1251725 1275431 1300785 1327389 1355458 1385604
50551A385604L2567L4632L5844L6173L5742L4609L2960L1208K9786K8980K9028
$$ 1385604 1418171 1452803 1488647 1524820 1560562 1595171 1628131 1659339 1689125 1718105 1747133
50540A747133L0084L2021L4616L7938M2289M7614N3423N9438O5904P3013Q0434
$$ 1747133 1777217 1809238 1843854 1881792 1924081 1971695 2025118 2084556 2150460 2223473 2303907
50529B303907Q7703R4749J01676J08298J14317J19730J24562J28422J30702J31196
$$ 2303907 2391610 2486359 2588035 2696333 2810650 2930380 3054942 3183364 3314066 3445262
50519C445262J30063J27124J21690J13174J01591Q7348P0920N2877L3941J4674
$$ 3445262 3575325 3702449 3824139 3937313 4038904 4126252 4197172 4250049 4283990 4298664
50509D298664m767k4282m3310o0907p6288q9070r8915j05248j07510j05579r9800
$$ 4298664 4293897 4269615 4226305 4165398 4089110 4000040 3901125 3795877 3688367 3582788 3482988
50498C482988r0730p9057o5602n1054l5746k0058n011P895J7660K4123K7228K6376
$$ 3482988 3392258 3313201 3247599 3196545 3160799 3140741 3135730 3143625 3161285 3185408 3212636 3239012
50486C239012K0963J1208j957j7584l4977n3393p1881q9239j03967j14668j21033
$$ 3239012 3259975 3271183 3269226 3251642 3216665 3163272 3091391 3002152 2898185 2783517 2662484
50475B662484j24063j24816j23307j19159j12926j05805r8313r0259q1930p4252
$$ 2662484 2538421 2413605 2290298 2171139 2058213 1952408 1854095 1763836 1681906 1607654
50465A607654o7498o0911n4031m7460m1816l6826l1996k7496k3574j9827j5768
$$ 1607654 1540156 1479245 1425214 1377754 1335938 1299112 1267116 1239620 1216046 1196219 1180451
50454A180451j1697q225n332k594%K180M010N731P230Q338R422J0947J2615J3688
$$ 1180451 1168754 1160529 1155197 1152603 1152603 1154783 1158793 1164524 1171754 1180092 1189514 1200461 1213076 1226764
50440A226764J4080J4433J5095J5637J5513J4575J2946J0878Q855P319O215N181
$$ 1226764 1240844 1255277 1270372 1286009 1301522 1316097 1329043 1339921 1348776 1356095 1362310 1367491
50428A367491M282M031M702O014P614R387J1340J3575J6433K0102K4060K7510
$$ 1367491 1371773 1375804 1380506 1386520 1394134 1403521 1414861 1428436 1444869 1464971 1489031 1516541
50416A516541L0522L4112L8912M4283M9181N3354N7247O1045O4442O7224O9454
$$ 1516541 1547063 1581175 1620087 1664370 1713551 1766905 1824152 1885197 1949639 2016863 2086317
50405B086317P0962P1059O9115O5328O0600N5536M9753M2407L3337K3339J3138
$$ 2086317 2157279 2228338 2297453 2362781 2423381 2478917 2528670 2571077 2604414 2627753 2640891
50394B640891K602q714k0553l2036m2573n2144o0674o7630p2357p4492p3978p1067
$$ 2640891 2643493 2634779 2614226 2582190 2539617 2487473 2426799 2359169 2286812 2212320 2138342 2067275
50382B067275o6262n9922n1984m2498l2309k2621j3899n865J414P174J0882J2738
$$ 2067275 2001013 1941091 1889107 1846609 1814300 1791679 1777780 1771915 1773329 1780503 1791385 1804123
50370A804123J2843J0590N502j823j0183j8795k7350l5416m2443m8101n2162n4305
$$ 1804123 1816966 1827556 1833058 1831235 1821052 1802257 1774907 1739491 1697048 1648947 1596785 1542480
50358A542480n4568n3694n2451n0867m8696m6248m4025m1774l8867l5511l2677
$$ 1542480 1487912 1434218 1381767 1330900 1282204 1235956 1191931 1150157 1111290 1075779 1043102
50347A043102l0629k8542k5838k3033k0701j8379j5298j1767q903p184n910m205
$$ 1043102 1012473 983931 958093 935060 914359 895980 880682 868915 860012 852828 846918 842713
50335H42713j974K59K034L236M001M555N082N654O269O944P669Q405R233J0388
$$ 842713 840739 840998 843032 846268 850269 854824 859906 865560 871829 878773 886442 894847 904080 914468
50321I14468J1975J3681J5016J5848J6449J7019J7336J6983J5731J3584J0608
$$ 914468 926443 940124 955140 970988 987437 1004456 1021792 1038775 1054506 1068090 1078698
50310A078698P000L251m6k683m979p195q907r282q122o314n005m395l682k085
$$ 1078698 1085698 1088949 1088903 1086220 1081241 1074046 1065139 1055857 1047735 1041421 1036416 1032021 1028339 1026254
50296A026254K44K443L797M336M786N969Q000J0087J1374J1994J2997J5127J8042
$$ 1026254 1026498 1028941 1032738 1037074 1041860 1047829 1055829 1065916 1077290 1089284 1102281 1117408 1135450
50283A135450K0910K3235K4673K4513K1999J7170J0871L854l672j1510j8868k4530
$$ 1135450 1156360 1179595 1204268 1228781 1250780 1267950 1278821 1282675 1279003 1267493 1248625 1224095
50271A224095k7510k7595k5446k2238j8896j5680j2491r458o940n126m008l611
$$ 1224095 1196585 1168990 1143544 1121306 1102410 1086730 1074239 1064781 1057841 1052715 1048707 1045096
50259A045096l845m147l901l228k801k805k667k045j389j183j211j154j321k045
$$ 1045096 1041251 1037104 1033203 1029975 1027174 1024369 1021702 1019657 1018268 1017085 1015874 1014720 1013399 1011354
50245A011354k740k334o07J555L257M325M985N437O021P248R287J1617J3426J4282
$$ 1011354 1008614 1006280 1005673 1007228 1010485 1014810 1019795 1025232 1031253 1038501 1047788 1059405 1072831 1087113
50231A087113J4428J4608J5591J7578J9973K1919K3007K3288K2777K1409J9513
$$ 1087113 1101541 1116149 1131740 1149318 1169291 1191210 1214217 1237505 1260282 1281691 1301204
50220A301204J7792J6606J5529J3910J1669R371P607O490N596M277K046j259n570
$$ 1301204 1318996 1335602 1351131 1365041 1376710 1386081 1393688 1400178 1405774 1410051 1412097 1410838 1405268
50207A405268j0632j5862k0506k4281k7649l1025l3796l4683l3170l0151k6939
$$ 1405268 1394636 1378774 1358268 1333987 1306338 1275313 1241517 1206834 1173664 1143513 1116574
50196A116574k4047k1196j8179j5318j3233j2397j2906j4443j6498j8661k0705
$$ 1116574 1092527 1071331 1053152 1037834 1024601 1012204 999298 984855 968357 949696 928991
50185I28991k2432k3654k4270k4199k3309k1627j9534j7466j5425j3183j0879
$$ 928991 906559 882905 858635 834436 811127 789500 769966 752500 737075 723892 713013
50174G13013r040p919p239o649o092n536m799l861l046k598k319j862j169m44
$$ 713013 703973 696054 688815 682166 676074 670538 665739 661878 658832 656234 653915 652053 650884 650440
50160F50440J26N19R08J568K513L287L494L485L965M920N581N651N804O584P407
$$ 650440 650566 651085 651993 653561 656074 659361 662855 666340 670305 675225 680806 686457 692261 698845 706252
50145G06252P282O085M532L221K285J693J313P97m9q80j183r06k82P20K278M108
$$ 706252 713534 719619 724151 727372 729657 731350 732663 733460 733411 732531 731348 730442 730160 730880 733158 737266
50129G37266N554O348O863P582Q584R665J0672J1718J3159J5265J7852K0385K2580
$$ 737266 742820 749168 756031 763613 772197 781862 792534 804252 817411 832676 850528 870913 893493
50116H93493K4664K6913K9311L1891L4994L8772M2790M6507M9883N3031N5649
$$ 893493 918157 945070 974381 1006272 1041266 1080038 1122828 1169335 1219218 1272249 1327898
50105A327898N7199N7505N6662N4764N2174M9704M7792M5835M2997L9361L5509
$$ 1327898 1385097 1442602 1499264 1554028 1606202 1655906 1703698 1749533 1792530 1831891 1867400
50094A867400L1174K5392J7900R439N03r132j9323k9034l7395m4534n0669n5082
$$ 1867400 1898574 1923966 1941866 1951305 1951808 1942676 1923353 1894319 1856924 1812390 1761721 1706639
50082A706639n6826n6048n3888n1254m8299m4971m1356l7444l3032k8172k3482
$$ 1706639 1649813 1593765 1539877 1488623 1440324 1395353 1353997 1316553 1283521 1255349 1231867
50071A231867j9826j7621j6537j5832j5076j4524j4615j5133j5213j4290j2872
$$ 1231867 1212041 1194420 1177883 1162051 1146975 1132451 1117836 1102703 1087490 1073200 1060328
50060A060328j2040j2292j3010j3151j2373j1328j0827j0849j0649r849q934q479
$$ 1060328 1048288 1035996 1022986 1009835 997462 986134 975307 964458 953809 943960 935026 926547
50048I26547q212p328n500l144q54J057K556L874N397P162Q561Q990Q671Q340
$$ 926547 918335 911007 905507 902363 901509 902566 905122 908996 914393 921555 930116 939106 947777 956117
50034I56117Q300Q350Q518R041R584R340Q246P323P289P465O637M563K035k12
$$ 956117 964417 972767 981285 990326 999910 1009250 1017496 1024819 1032108 1039573 1046210 1050773 1052808 1052596
50020A052596k003l312m084m572n374o821q553r927j0731j1273j1730j1708j0785
$$ 1052596 1050593 1047281 1043197 1038625 1033251 1026430 1017877 1007950 997219 985946 974216 962508 951723
50007I51723r332q328q167q068p011m874k299J96K480M562O753R776J4006J8734
$$ 951723 942391 934063 925896 917828 910817 905943 903644 903840 906320 910882 917635 927411 941417 960151
49993I60151K2885K6323K9551L2369L3908L4117L4001L3979L3129L0731K7596
$$ 960151 983036 1009359 1038910 1071279 1105187 1139304 1173305 1207284 1240413 1271144 1298740
49982A298740K4959K2775K0069J6577J3058J0148P694N265K687j32l462p699j3054
$$ 1298740 1323699 1346474 1366543 1383120 1396178 1406326 1414020 1419285 1421972 1421840 1418378 1410679 1397625
49969A397625j9263k5616l1533l6970m1953m5771m7405m6800m5004m2740l9693
$$ 1397625 1378362 1352746 1321213 1284243 1242290 1196519 1149114 1102314 1057310 1014570 974877
49958I74877l5585l1073k6900k2922j8770j4878j1832r230o207k914l88J017K065
$$ 974877 939292 908219 881319 858397 839627 824749 812917 803687 797480 794566 794178 795195 797260
49945G97260L337M365M425L559K423J521Q76K12p75k176l785n346o859q559j0582
$$ 797260 800597 804962 809387 812946 815369 816890 817766 817978 817203 815027 811242 805896 799037 790478 779896
49930G79896j2757j4668j5872j6262j6176j5871j5025j3233j0974r260q215o848
$$ 779896 767139 752471 736599 720337 704161 688290 673265 660032 649058 639798 631583 624735
49918F24735m647k546j546j225m78Q60K067K784L164L201K922K956L861N048N493
$$ 624735 620088 617542 615996 614771 614293 615153 617220 620004 623168 626369 629291 632247 636108 641156 646649
49903F46649N417O101P984J0050J1316J1863J2074J1952J1617J1479J1377J0313
$$ 646649 652066 658167 666151 676201 687517 699380 711454 723406 735023 746502 757879 768192
49891G68192P754M487J655n10k453m321n947p358q753j0137j1437j2682j3773
$$ 768192 775946 780433 782088 781578 779125 774804 768857 761499 752746 742609 731172 718490 704717
49878G04717j4333j4152j3527j2828j2047j1096j0153r371q551p466o271n199
$$ 704717 690384 676232 662705 649877 637830 626734 616581 607210 598659 591193 584922 579723
49866E79723m122k797j381k53N75J511K857M477N987P121P978Q906J0100J1211
$$ 579723 575601 572804 571423 571170 571745 573256 576113 580590 586577 593698 601676 610582 620682 631893
$$ [...]
##END NTUPLES=NMR SPECTRUM
##END=
