##TITLE=AC1455_pasto13261_8026336_IqQmTIRiNe
##JCAMPDX= 6.0         $$ Bruker NMR JCAMP-DX V2.0
##DATA TYPE= NMR SPECTRUM
##DATA CLASS= NTUPLES
##ORIGIN= BRUKER
##OWNER= Administrator
$$ 1.72 TOPSPIN		Version 2.1
$$ 2013-07-11 14:24:07.153 -0700  Administrator@X
$$ Compression mode = diff/dup
##.OBSERVE FREQUENCY= 400.02188249412
##.OBSERVE NUCLEUS= ^1H
##.ACQUISITION MODE= SIMULTANEOUS (DQD)
##.ACQUISITION SCHEME= undefined
##.AVERAGES= 8
##.DIGITISER RES= 22
##SPECTROMETER/DATA SYSTEM= spect
##.PULSE SEQUENCE= zg30
##.SOLVENT NAME= COFFEE_meoh
##.SHIFT REFERENCE= INTERNAL, COFFEE_meoh, 1, 14.98509
##AUDIT TRAIL= $$ (NUMBER, WHEN, WHO, WHERE, PROCESS, VERSION, WHAT)
$$ ##TITLE= Audit trail, TOPSPIN		Version 2.1
$$ ##JCAMPDX= 5.01
$$ ##ORIGIN= Bruker BioSpin GmbH
$$ ##OWNER= Administrator
$$ $$ E:\/data/COFFEE/nmr/AC1455_pasto13261_8026336_IqQmTIRiNe/10/pdata/1/auditp.txt
$$ ##AUDIT TRAIL=  $$ (NUMBER, WHEN, WHO, WHERE, PROCESS, VERSION, WHAT)
(   1,<2013-07-11 14:24:00.216 -0700>,<Administrator>,<X>,<go>,<TOPSPIN 2.1>,
      <created by zg
	started at 2013-07-11 14:22:54.387 -0700,
	POWCHK enabled, PULCHK disabled,
       configuration hash MD5:
       C8 4E 4E 5D D3 5C D8 9E 9F 52 82 E0 59 8A DE 15
       data hash MD5: 64K
       3F E8 68 CE BC A7 07 D1 EF 58 2C D2 1A 14 F4 62>)
(   2,<2013-07-11 14:24:03.231 -0700>,<Administrator>,<X>,<proc1d>,<TOPSPIN 2.1>,
      <Start of raw data processing
       efp LB = 0 FT_mod = 6 PKNL = 1 PHC0 = 0 PHC1 = 0 SI = 32K 
       data hash MD5: 32K
       D0 CB 24 18 C9 3E 01 EC B7 32 A3 06 05 F4 3A 7E>)
(   3,<2013-07-11 14:24:03.544 -0700>,<Administrator>,<X>,<proc1d>,<TOPSPIN 2.1>,
      <pk PHC0 = 96.15784 PHC1 = 0 
       data hash MD5: 32K
       4A 88 A2 CC 0C 23 2B D1 3E C5 FD E4 FD 06 44 07>)
(   4,<2013-07-11 14:24:03.669 -0700>,<Administrator>,<X>,<proc1d>,<TOPSPIN 2.1>,
      <abs ABSG = 1 
       data hash MD5: 32K
       55 DA 8C 28 B6 12 4F 6D 4F EB 3E 8E DF 40 D8 C1>)
(   5,<2013-07-11 14:24:03.809 -0700>,<Administrator>,<X>,<proc1d>,<TOPSPIN 2.1>,
      <abs ABSG = 2 
       data hash MD5: 32K
       EC 95 3C 2D 1E 7E 4B 9E 14 6C D4 6B DB FD B6 BC>)
(   6,<2013-07-11 14:24:03.887 -0700>,<Administrator>,<X>,<proc1d>,<TOPSPIN 2.1>,
      <abs ABSG = 3 
       data hash MD5: 32K
       7C AE 9F 65 A3 9B 8C 19 80 57 69 A8 8D 49 F3 7F>)
(   7,<2013-07-11 14:24:03.950 -0700>,<Administrator>,<X>,<proc1d>,<TOPSPIN 2.1>,
      <abs ABSG = 4 
       data hash MD5: 32K
       4A BB 13 B8 9B F0 BE 6F 73 43 8A 0D 32 B7 43 4C>)
(   8,<2013-07-11 14:24:03.997 -0700>,<Administrator>,<X>,<proc1d>,<TOPSPIN 2.1>,
      <abs ABSG = 5 
       data hash MD5: 32K
       1D AB 71 59 74 0B 58 9B EB 52 8B 2A 17 A1 5C 2A>)
$$ ##END=
$$ 
$$ $$ hash MD5
$$ $$ D9 ED 4F A4 0F 71 A1 EA 80 81 C9 B9 CE 69 4A DD
##$RELAX= 
##$RELAX= 
##$RELAX= 
##$RELAX= 
##$RELAX= 
##$RELAX= 
##$RELAX= 
$$ Bruker specific parameters
$$ --------------------------
##$DU= <E:\>
##$EXPNO= 10
##$NAME= <AC1455_pasto13261_8026336_IqQmTIRiNe>
$$ [...]
##$TP= (0..7)
150 150 150 150 150 150 150 150
##$TP07= 0
##$TPNAME0= <>
##$TPNAME1= <>
##$TPNAME2= <>
##$TPNAME3= <>
##$TPNAME4= <>
##$TPNAME5= <>
##$TPNAME6= <>
##$TPNAME7= <>
##$TPOAL= (0..7)
0.5 0.5 0.5 0.5 0.5 0.5 0.5 0.5
##$TPOFFS= (0..7)
0 0 0 0 0 0 0 0
##$TUNHIN= 0
##$TUNHOUT= 0
##$TUNXOUT= 0
##$USERA1= <user>
##$USERA2= <user>
##$USERA3= <user>
##$USERA4= <user>
##$USERA5= <user>
##$V9= 5
##$VALIST= <valist>
##$VCLIST= <CCCCCCCCCCCCCCC>
##$VD= 0
##$VDLIST= <DDDDDDDDDDDDDDD>
##$VPLIST= <PPPPPPPPPPPPPPP>
##$VTLIST= <TTTTTTTTTTTTTTT>
##$WBST= 1024
##$WBSW= 4
##$XGAIN= (0..3)
0 0 0 0
##$XL= 0
##$YL= 0
##$YMAX_a= 639070
##$YMIN_a= -542726
##$ZGOPTNS= <>
##$ZL1= 120
##$ZL2= 120
##$ZL3= 120
##$ZL4= 120
##$ABSF1= 14.98509
##$ABSF2= -5.573092
##$ABSG= 5
##$ABSL= 3
##$ALPHA= 0
##$AQORDER= 0
##$ASSFAC= 0
##$ASSFACI= 0
##$ASSFACX= 0
##$ASSWID= 0
##$AUNMP= <proc_prof1d_extract_pilot.lims>
##$AXLEFT= 0
##$AXNAME= <>
##$AXNUC= <1H>
##$AXRIGHT= 0
##$AXTYPE= 0
##$AXUNIT= <>
##$AZFE= 0.1
##$AZFW= 0.1
##$BCFW= 0
##$BC_mod= 0
##$BYTORDP= 0
##$COROFFS= 0
##$CY= 15
##$DATMOD= 1
##$DC= 0
##$DFILT= <>
##$DTYPP= 0
##$F1P= 0
##$F2P= 0
##$FCOR= 0.5
##$FTSIZE= 32768
##$FT_mod= 6
##$GAMMA= 0
##$GB= 0
##$INTBC= 1
##$INTSCL= 1
##$ISEN= 128
##$LB= 0
##$LEV0= 0
##$LPBIN= 0
##$MAXI= 10000
##$MC2= 0
##$MEAN= 0
##$ME_mod= 0
##$MI= 0
##$NCOEF= 0
##$NC_proc= -8
##$NLEV= 6
##$NOISF1= 0
##$NOISF2= 0
##$NSP= 0
##$NTH_PI= 0
##$NZP= 0
##$OFFSET= 14.98509
##$PC= 1
##$PHC0= 96.15784
##$PHC1= 0
##$PH_mod= 1
##$PKNL= yes
##$PPARMOD= 0
##$PPDIAG= 0
##$PPIPTYP= 0
##$PPMPNUM= 2147483647
##$PPRESOL= 1
##$PSCAL= 4
##$PSIGN= 0
##$PYNMP= <proc.py>
##$REVERSE= no
##$SF= 400.02
##$SI= 32768
##$SIGF1= 0
##$SIGF2= 0
##$SINO= 400
##$SIOLD= 32768
##$SPECTYP= <>
##$SREGLST= <1H.CDCl3>
##$SSB= 0
##$STSI= 32768
##$STSR= 0
##$SW_p= 8223.68421052631
##$SYMM= 0
##$S_DEV= 0
##$TDeff= 65536
##$TDoff= 0
##$TI= <>
##$TILT= no
##$TM1= 0
##$TM2= 0
##$TOPLEV= 0
##$USERP1= <user>
##$USERP2= <user>
##$USERP3= <user>
##$USERP4= <user>
##$USERP5= <user>
##$WDW= 1
##$XDIM= 32768
##$YMAX_p= 439444527
##$YMIN_p= -740121
##$CURPLOT= <Network HP LaserJet P1505>
##$CURPRIN= <$Network HP LaserJet P1505>
##$DFORMAT= <normdp>
##$LAYOUT= <+/1D_H.xwp>
##$LFORMAT= <normlp>
##$PFORMAT= <normpl>
##$SURQMSG= 1
$$ End of Bruker specific parameters
$$ ---------------------------------
##NTUPLES= NMR SPECTRUM
##VAR_NAME=  FREQUENCY,     SPECTRUM/REAL,   SPECTRUM/IMAG
##SYMBOL=    X,             R,               I
##VAR_TYPE=  INDEPENDENT,   DEPENDENT,       DEPENDENT
##VAR_FORM=  AFFN,          ASDF,            ASDF
##VAR_DIM=   32768,         32768,           32768
##UNITS=     HZ,            ARBITRARY UNITS, ARBITRARY UNITS
##FACTOR=    0.250966925370066, 1,           1
##FIRST=     8223.43324360094, -196203,      -334649
##LAST=      0,             -123914,         29563
##MIN=       0,             -740121,         0
##MAX=       8223.43324360094, 439444527,    0
$$ Real data points
##PAGE= N=1
##DATA TABLE= (X++(R..R)), XYDATA
$$ [...]
$$ plain form
19550 -204520 -381022 -67105 109491 260044 229716 -138620 -117115 -261128 -17133 -115570
19540 -115570 479385 -174073 -97011 63860 -68832 140183 134296 278763 85085 165841 124728
19529 124728 -32844 99934 -282433 93621 -8622 -264530 43404 -29251 -248044 -75926 19634
19517 -114012 15976 -308640 59011 -175345 -3137 -255297 121821 -67837 -124875 -200175 13020
19505 -171318 -206568 216650 68999 46552 -65012 -181205 -88037 -437574 -282805 -53520 -176717
19494 -176717 79517 -40513 138141 -44469 164262 -143847 -196694 -25326 71161 -137859 11647
19482 -172577 -70725 62294 -129427 -381836 -129521 -105977 -33668 312329 -239038 -132012
19472 -132012 40822 -283471 33449 -42284 184975 -151619 6542 -162651 -161985 96741 -38551
$$ packed form
19550b04520j76502f7105A09491J50553l0328a38620K1505j44013a7133r8437
19540a15570D79385a74073P7062F3860f8832A40183n887J44467H5085Q0756m1113
19529A24728c2844I9934b82433I3621h622k55908D3404b9251k18793g5926A9634
19517a14012A5976c08640E9011a75345c137k52160A21821f7837n7038p5300A3020
19505a71318l5250B16650F8999k2447f5012j16193h8037l49537J54769e3520j23197
19494a76717G9517d0513A38141d4469A64262a43847n2847b5326G1161a37859A1647
19482a72577g0725F2294a29427k52409a29521K3544c3668C12329b39038J07026
19472a32012D0822b83471C3449d2284A84975a51619F542a62651O66I6741c8551
$$ plain form
19460 -211393 -241582 256872 -120618 -255196 -54421 -238806 178172 -278154 147444 82588
19450 82588 -153822 -174838 -116429 -1738 52194 -122447 -56723 13489 -168859 -82581 -64012
19439 -64012 1331 -56031 -10590 23208 274673 235333 253043 412773 63607 -160801 162589
19427 23391 14452 -122090 -163848 -127744 -79711 -47308 -153081 474 -45345 117089 -159466
19415 -71015 -64845 36767 53749 20843 -132012 -271546 -389078 -11358 22905 -98337 -114993
19404 -114993 -349057 129505 -138012 115660 -66007 -91649 -138014 124699 -236848 -74332
19393 -127660 -56974 -111127 122877 47417 -66930 -126839 -61387 -44537 -69314 -75821 143478
19381 8467 116687 166925 31442 -245502 -455584 203456 62884 -6389 -11734 -266618 -387067
$$ packed form
19460b11393l0189B56872a20618j34578e4421j84385A78172b78154A47444o4856
19450H2588a53822k1016N8409a738E2194a22447e6723A3489a68859h2581J8569
19439f4012A331e6031a0590B3208K51465l9340J7710J59730F3607a60801A62589
19427B3391q939a22090m1758L6104M8033L2403j05773D74d5345A17089a59466
19415g1015O170C6767J6982B0843a32012j39534j17532a1358B2905i8337j6656
19404a14993k34064A29505a38012A15660f6007k5642m6365A24699b36848g4332
19393a27660e6974n4153A22877D7417f6930n9909f1387J6850k4777o507A43478
19381H467J08220N0238C1442b45502k10082B03456F2884f389n345k54884j20449
$$ plain form
19370 -387067 8026 -164820 264023 -361461 -315533 -112468 -203240 15924 253599 -214066
19359 34686 -197042 -242852 84449 4052 -198740 -37227 -51560 -59653 315684 22699 336350
19348 336350 88347 -46970 -166331 161444 -9740 -268113 -44571 -202747 -219780 -53003 -245787
19337 -245787 -108078 -143953 13157 -148261 37468 -352288 -207176 81956 -68532 13479 279383
19326 279383 247797 -246974 -72225 -247098 -128758 -110620 -315660 44414 -258042 223264
19315 -85193 95377 -394 -33311 -22867 -213996 -162100 -88008 -124842 -219164 -162602 371297 61019
19302 -425517 -148214 102816 24493 44203 127614 -66512 238969 177524 -171567 29501 228141
19291 228141 -189335 -185865 -282266 -462334 -288279 -369984 -111347 -34769 -74537 125367 -211862
$$ packed form
19370c87067H026a64820B64023c61461M5928a12468r0772A5924K37675b14066
19359C4686a97042m5810H4449D052a98740c7227j4333q093C15684B2699L13651
19348C36350H8347d6970j19361A61444i740k58373d4571j58176j7033e3003j92784
19337b45787a08078l5875A3157a48261C7468c52288J45112H1956f8532A3479K65904
19326B79383l1586b46974g2225j74873J18340J8138k05040D4414b58042B23264
19315h5193I5377c94l2917J0444j91129N1896P4092l6834r4322N6562C71297F1019
19302d25517a48214A02816B4493J9710Q3411f6512B38969o1445a71567B9501J98640
19291B28141a89335L470r6401j80068J74055q1705a11347c4769l9768A25367b11862
$$ plain form
19279 -84322 -103797 -293516 206459 -316732 -295331 216668 -390136 2217 -412648 -295642
19269 -295642 115560 42183 -165145 -113967 224015 49762 -132014 146307 -11872 54031
19258 52164 -85239 -188807 -196017 -164228 219984 -133757 111603 166372 13432 -244189 117864
19246 -133773 -77474 -280210 -76283 301440 136875 -237603 -81578 -7356 -82087 -1069 -64785
19235 -64785 -90116 -28919 -157888 -238416 -116887 41829 -206850 -47043 111566 123487 -240606
19223 29726 116825 -28992 450800 -24359 20742 178867 -8122 289199 217672 -285471 26363
19211 218187 145486 82349 56920 2494 96595 -299242 -87327 -221831 -124864 -304697 -79139
19199 170233 -130969 -335792 -45215 104561 26623 -74156 -206554 68587 -109770 53542
$$ packed form
19279h4322j9475j89719B06459c16732K1401B16668c90136B217d12648J17006
19269b95642A15560D2183a65145N1178B24015D9762a32014A46307a1872E4031
19258E2164h5239j03568p210L1789B19984a33757A11603N4769A3432b44189A17864
19246a33773N6299k02736g6283C01440A36875b37603h1578g356p4731a069o3716
19235f4785k5331b8919j28969q0528a16887D1829b06850d7043A11566J1921b40606
19223B9726Q7099b8992D50800b4359B0742J58125h122B89199p1527b85471B6363
19211B18187p2701o3137k5429B494R4101b99242h7327j34504R6967j79833g9139
19199A70233a30969k04823d5215A04561B6623g4156j32398F8587a09770E3542
$$ plain form
19188 -202551 -69329 148446 -306588 -307013 -80166 -1404 -138041 95417 -220180 -21845 -37759
19177 -37759 -301137 -205953 -327206 6266 -126003 -74833 -338133 -124757 -65699 -65788 -28815
19165 -100316 -196581 20239 5201 -3858 -37206 -237954 133648 -184359 -351293 241581 -127643
19153 -110786 -178638 -214286 246524 -70029 74475 -812 -127008 -419339 -132314 106457 298609
19142 298609 -116504 19530 -208269 -48099 348388 -321438 72559 -178183 58513 -239812
19131 56050 -183333 -164090 55450 58983 175710 -285559 -249177 -217691 -76546 -151804 -179736
19120 -179736 228442 7707 -144016 198485 92247 -22231 36337 103015 -174360 -103865 -123652
19109 -123652 1950 -2824 383069 -50342 303190 -75655 -266397 -38384 234403 -7139 6375
$$ packed form
19188b02551f9329A48446c06588m25h0166a404j36637I5417b20180b1845j5914
19177c7759k63378R5184j21253F266a26003N1170k63300a24757N9058q9b8815
19165a00316r6265B0239E201c858l3348k00748A33648a84359j66934B41581a27643
19153a10786o7852l5648B46524g0029G4475h12j26196k92331a32314A06457J92152
19142B98609a16504A9530b08269d8099C48388c21438G2559a78183E8513b39812
19131E6050a83333J9243E5450L533J16727b85559L6382L1486g6546p5258k7932
19120a79736B28442G707a44016A98485I2247b2231C6337O6678a74360P0495j9787
19109a23652A950b824C83069e0342C03190g5655j90742c8384B34403g139F375
$$ plain form
19097 -344065 -29000 -14506 112685 -17770 72042 163546 85247 214234 -141917 -237813 -186011
19086 -186011 177747 46867 30792 -65867 -369908 -13531 77176 -185591 -30942 -178529 -73721
19074 -381445 27882 70957 70592 -14836 -263964 -3736 -71439 205746 174085 -13765 212214
19062 126101 -197437 48114 -261863 66700 -286240 245224 -249983 125790 169163 -148983
19051 -59881 -97120 148527 -93803 -6680 23432 -15255 -36998 -133381 -10378 55193 -334872
19039 -352893 -149003 -279221 110550 -313114 7600 -232135 65856 -86907 -34477 341382
19028 -279516 187832 17590 169635 -3897 -21535 250694 -147202 231261 5586 182805 -220051
19016 -61137 39411 269711 98167 64075 67195 80111 14291 -108190 267809 -171548 36195
$$ packed form
19097c44065b9000J4494A12685a7770G2042R1504p8299J28987a41917r5896N1802
19086a86011A77747D6867j6075f5867l04041a3531G7176a85591c0942j47587g3721
19074c81445B7882M3075l65a4836k49128c736o7703B05746l1661a3765B12214
19062A26101a97437D8114b61863F6700b86240B45224b49983A25790M3373a48983
19051e9881l7239A48527i3803f680B3432a5255k1743r6383a0378E5193c34872
19039c52893a49003j30218A10550c13114G600b32135F5856h6907c4477C41382
19028b79516A87832A7590J52045c897j7638B50694a47202B31261E586J77219b20051
19016f1137C9411K30300I8167l4092L120J2916A4291a08190B67809a71548C6195
$$ plain form
19004 140499 106890 147601 29708 -192975 -59234 -284855 -36817 -68806 269615 -67701 -156734
18993 -156734 291445 3660 -274223 -237436 103744 13047 -6234 -193733 -45944 -162220 -128225
18982 -128225 140143 305535 -226746 -49599 -464616 36793 -5197 -207410 -162554 -415121
18972 -415121 -78747 71310 -51676 61024 -40850 -342959 -46387 250198 -82254 -55327 -90144
18961 -90144 -449649 -248567 55784 177761 70866 -1868 161907 -273080 -413188 -91093 251001
18949 -245637 -164886 161474 -215448 136941 -52164 154872 -105660 -155823 -236667 178713
18938 19019 34666 -190968 -44405 107677 132275 168052 -47028 -14280 200701 -35710 163418
18926 -153114 302906 77213 -41876 -56292 -38504 -90987 328793 161791 -94761 -134762 10821
$$ packed form
19004A40499l3609M0711B9708a92975e9234k25621c6817l1989B69615f7701q9033
18993a56734B91445C660b74223L6787A03744A3047f234j87499d5944j16276L3995
18982a28225A40143J65392b26746d9599m15017C6793e197k02213M4856k52567
18972d15121g8747G1310e1676F1024d0850l02109d6387B50198h2254K6927l4817
18961i0144l59505K01082E5784J21977G0866a868A61907b73080j40108i1093B51001
18949b45637Q0751A61474b15448A36941e2164A54872a05660n0163q0844A78713
18938A9019J5647a90968d4405A07677K4598L5777d7028a4280B00701c5710A63418
18926a53114C02906G7213d1876j4416J7788n2483C28793A61791i4761m0001A0821
$$ plain form
18914 -169949 -93383 -49089 111872 -82125 71829 39244 83039 86958 -194947 -101199 365 -190759
18901 65631 -73090 20647 -68854 -258491 255869 114298 77344 -18800 -252673 215316 -88202
18889 46783 -198412 -189438 -279659 296473 -283163 -90504 31609 -216422 121249 -429150 -75019
18877 88003 -218609 -32573 -29031 -26550 -307803 4348 -265495 65877 -2925 -186574 -339185
18866 -339185 -60901 -245475 192582 -355167 -94951 124108 -92489 -228764 192456 468962
18856 468962 -174706 -151516 -99429 -188487 -18024 39494 43974 2717 104617 199054 51985
18844 223996 138341 -168168 -31023 -248492 80273 19209 27897 9107 -215416 -206165 -131509
18833 -131509 -45176 230232 -37860 -21655 58263 -300629 43084 -137593 43055 -338449 -5694
$$ packed form
18914a69949P6566M4294A11872h2125G1829l2585M3795L919a94947R3748C65a90759
18901F5631g3090B0647f8854j89637B55869A14298l6954a8800k33873B15316h8202
18889D6783a98412Q974r0221B96473b83163i0504C1609b16422A21249d29150g5019
18877H8003b18609c2573L542K481k81253D348b65495F5877b925j83649j52611
18866c39185f0901j84574A92582c55167i4951A24108i2489j36275A92456K76506
18856D68962a74706K3190N2087q9058a8024C9494M480B717J01900R4437E1985
18844B23996q5655a68168c1023k17469H0273A9209Q688I107b15416R251P4656
18833a31509d5176B30232c7860J6205E8263c00629D3084a37593D3055c38449e694
$$ plain form
18821 40800 -155627 129992 -173225 -82424 -92408 -71821 127522 -124197 220537 15007 323672
18810 323672 32469 288282 7407 -211218 -83944 165925 15594 214241 117142 10954 -327565
18798 -241352 -228827 -56843 -55627 342493 -158831 145562 88147 -72607 87356 -36450 -174674
18787 -174674 -139422 254335 40844 -324738 170462 249981 -291813 -93072 31503 18459 287075
18776 287075 337823 -252784 -18003 -45486 85932 -246569 -235246 111545 -318226 -206854
18766 -206854 -135772 106239 -118613 -186675 -231039 -86236 -96217 -192072 -59571 -74301 164943
18754 -242520 147219 -95560 -15213 207346 188404 23266 35534 -119407 -42680 68357 -323273
18742 -109556 -13010 164034 -170034 -139808 -81468 88541 -98539 -111772 -78224 -352131 -315879
$$ packed form
18821D0800a55627A29992a73225h2424r984K0587A27522a24197B20537A5007L08665
18810C23672C2469K55813G407b11218h3944A65925A5594J98647r7099A0954c27565
18798b41352J2525e6843J216C42493a58831A45562n7415g2607H7356c6450j38224
18787a74674L5252B54335D0844c24738A70462P9519b91813i3072C1503j3044K68616
18776B87075N0748b52784a8003k7483H5932b46569J1323A11545c18226J11372
18766b06854P1082A06239a18613o8062m4364h6236r981r5855e9571j4730A64943
18754b42520A47219i5560a5213B07346j8942B3266J2268a19407d2680F8357c23273
18742a09556a3010A64034a70034L0226N8340H8541i8539j3233L3548k73907L6252
$$ plain form
18731 -315879 25233 -58893 -242177 193609 85071 151558 51890 -79621 -34515 -56830 -140219
18720 -140219 151979 224394 -229714 255942 -213893 -380878 -21232 -2009 153914 4769 280339
18709 280339 92606 -38847 35705 -97657 -221978 -147119 448341 -196987 -100137 -98313 -241863
18698 -241863 50091 -27925 -241919 -161530 -333069 -112124 -9732 29842 -431000 -50398 -78658
18687 -78658 -132470 -446767 -182309 -95893 7957 -247762 -78806 -25436 -367723 232048 -68375
18675 -486191 55921 -15541 46241 -270935 291440 -11178 18653 -122027 -151753 -287547 139979
18663 -156274 -239956 -55212 -153690 -69581 113133 -28687 -66931 -84547 -130999 -30957 26951
18651 -233644 -21025 -262788 -121101 -425118 173227 -85963 255329 -202154 10833 -50995
$$ packed form
18731c15879B5233e8893j83284A93609H5071O6487E1890g9621c4515k2315q3389
18720a40219A51979P2415b29714B55942b13893j66985b1232b009A53914D769K75570
18709B80339I2606c8847C5705i7657j24321P4859D48341a96987R6850J824j43550
18698b41863E0091b7925k13994Q0389j71539a12124i732B9842d31000e0398k8260
18687g8658n3812l14297a82309Q6416G957b47762g8806b5436l42287B32048f8375
18675d86191E5921a5541D6241b70935B91440a1178A8653a22027k9726j35794A39979
18663a56274q3682e5212r8478f9581A13133b8687l8244j7616m6452c0957B6951
18651b33644b1025k41763a21101l04017A73227h5963B55329b02154A0833e0995
$$ plain form
18640 -40070 -17545 156764 -31342 -154909 -4458 -127443 -240763 -47756 -292441 13499 47359
18629 47359 -114096 -170150 78895 -92780 -209693 69963 40102 -113408 188421 32324 -547133
18617 -87367 29807 -280839 57025 -200862 91893 -191117 -73845 -75915 -153086 -111240 221562
18605 -18364 -105649 88372 27202 -224705 91102 81297 3548 -14013 -62754 7193 289368 8643
18592 272436 -331608 -171892 -4619 110806 68567 177889 80430 -263299 68497 -136387
18581 -245092 -60744 19241 -172202 81339 232473 -118754 65725 -187051 96901 119302 -213181
18569 -254318 193326 202916 -175411 238926 60381 217235 -182442 -190458 -155194 -138116 -201470
18558 -201470 -236652 139818 -249067 -6002 157984 -122437 187674 -394325 -238550 290079
$$ packed form
18640d0070a7545A56764c1342j23567d458j22985j13320d7756k44685A3499L3860
18629D7359a14096n6054G8895i2780j16913F9963k9861a13408A88421C2324e47133
18617h7367B9807b80839E7025b00862I1893a91117g3845k070p7171M1846B21562
18605a8364q7285H8372B7202b24705I1102r805C548a4013m8741G193K82175H643
18592B72436c31608J59716d619A10806m2239J09322H0430b63299F8497a36387
18581b45092f0744A9241a72202H1339J51134a18754F5725a87051I6901K2401b13181
18569b54318A93326R590a75411B38926F0381J56854a82442q016L5264J7078o3354
18558b01470l5182A39818b49067f002A57984a22437A87674c94325J55775B90079
$$ plain form
18547 141605 179042 -201970 119403 -237534 184626 345924 103972 -5046 -48163 37326
18536 -151929 -23521 -31812 110619 -231771 -191425 -207984 -281351 59931 -127192 -47761 196776
18524 122324 -142253 -83467 -77109 -119142 95735 166303 24330 -512916 203245 -74906 -126026
18513 -126026 45966 10610 126866 -189216 -313914 -255110 -122478 45870 -195081 31806
18502 -31179 -45918 68695 115695 84587 -327856 -31445 -110420 -232778 -25575 112436 -130888
18490 -214071 -21276 47588 -509357 -47062 -431357 -82561 -136953 -178502 -224551 -7793 -106232
18479 -106232 158141 -31332 -5750 -175634 -143101 19223 -36241 172676 -72416 106020 -291766
18467 122279 217654 130141 -15602 312 18648 69287 -24784 65132 168271 -76727 196575
$$ packed form
18547A41605L7437b01970A19403b37534A84626J61298A03972e046m3117C7326
18536a51929b3521q291A10619b31771M0346j6559p3367E9931a27192d7761A96776
18524A22324a42253N8786O358m2033I5735P0568B4330e12916B03245g4906n1120
18513a26026D5966A0610J16256a89216j24698N8804a22478D5870a95081C1806
18502c1179j4739F8695M7000l1108c27856c1445p8975j22358b5575A12436a30888
18490b14071b1276D7588e09357d7062l84295h2561n4392m1549m6049g793r8439
18479a06232A58141c1332e750j69884L2533A9223c6241A72676g2416A06020b91766
18467A22279R5375q7513a5602C12J8336N0639b4784F5132J03139g6727A96575
$$ plain form
18455 -249280 19272 -85867 -111886 -107096 123107 185467 62338 323554 -13702 145955 -54373
18443 218793 36659 -33946 -10761 -37930 -88960 -32273 135363 -20673 102317 -107241 -158896
18432 -158896 -325502 -60052 -95396 -32799 12791 -147966 -204250 -57737 -153776 63048 113799
18421 113799 -3154 -25822 254752 59904 -309655 -110978 -38310 -268496 -167765 -139883 52897
18409 39724 -184570 112959 271014 319540 -111702 -195455 25702 -190369 71378 95367 -257819
18397 -291099 120631 -123941 -15045 105862 -64185 272701 -164028 -241095 -81204 255710
18386 177838 -41218 -124111 -85327 200365 8500 163032 -15953 -57643 65270 61639 241889
18375 241889 -62747 -129383 177478 -330589 22276 -34244 66361 76293 163833 -58051 -312001
$$ packed form
18455b49280A9272h5867k6019M790A23107O2360F2338K61216a3702A45955e4373
18443B18793C6659c3946a0761k7169n1030c2273A35363b0673A02317a07241n1655
18432a58896j66606f0052l5344c2799A2791a47966n6284e7737r6039F3048N0751
18421A13799c154k2668B54752E9904c09655a10978c8310k30186J00731K7882E2897
18409C9724a84570A12959J58055M8526a11702q3753B5702a90369G1378K3989b57819
18397b91099A20631a23941a5045A05862f4185B72701a64028p7067h1204B55710
18386A77838d1218q2893L8784B00365H500J54532a5953m1690F5270l631J80250
18375B41889f2747o6636A77478c30589B2276c4244F6361R932Q7540e8051k53950
$$ plain form
18364 -312001 -262615 -3071 130559 203083 -159066 -90964 37864 -298779 -91812 -173078 -38558
18352 -125447 -397489 -283425 -190263 14743 116959 58095 -165217 108989 -389668 -95152
18341 -133420 221899 291996 -171122 -11410 21176 104702 48273 197243 96738 -138109 279176
18329 -138008 4325 92988 122284 15038 -120230 -99993 16454 191373 48793 99399 -209101
18317 -169044 -179451 907 -200626 189363 -354052 61008 -165458 -61204 -246269 69544 -78409
18305 -6145 -20587 -195811 -61897 109475 -168611 -168589 -140356 257504 143348 -272611 1783
18293 -160917 103567 -109537 -229297 46356 -165937 -93718 -122497 -58154 226223 -173383
18282 15200 -190651 -6456 45439 93637 -62069 -150024 92742 -266004 37623 -36531 28633
$$ packed form
18364c12001M9386c071A30559P2524a59066O8102C7864b98779i1812q1266c8558
18352a25447k72042J14064R3162A4743J02216E8095a65217A08989c89668i5152
18341a33420B21899P0097a71122a1410B1176Q3526D8273J48970I6738a38109B79176
18329a38008D325Q8663K9296A5038a20230K0237A6454J74919D8793N0606b09101
18317a69044j0407I07b00626A89363c54052F1008a65458f1204j85065F9544g8409
18305f145j4442j75224f1897A09475a68611K2K8233B57504j14156b72611A783
18293a60917A03567a09537j19760D6356a65937P2219k8779e8154B26223a73383
18282A5200a90651f456D5439M8198f2069q7955I2742b66004C7623c6531B8633
$$ plain form
18270 334033 117054 162180 -49536 248827 -106131 256838 24027 99662 52149 -5529 6121
18258 -86532 123144 -135927 -333723 143821 64911 131503 -185466 47507 81024 73223 -201662
18246 309971 10092 -52483 -129559 -165616 265432 -497147 -89808 65386 5166 -17435 -70321
18235 -70321 -131894 152768 -115069 243194 -154205 67991 3891 76365 -136388 122370 -229768
18223 -75079 132089 172537 -7444 89323 -255352 96694 129336 -280041 -272458 306832 -7258
18211 -90749 -7890 -153005 -296996 -59644 113281 -179067 17765 -4557 -57478 -95197 -183353
18200 -183353 -142426 385387 -78638 -157729 -380199 -170626 324353 61771 -17058 113800
18189 -46969 103359 -119732 138159 -130802 53986 -263457 -57455 -468012 -4937 -20338 30280
$$ packed form
18270C34033A17054M5126d9536B48827a06131B56838B4027P5635m7513e529F121
18258h6532A23144a35927j97796A43821F4911O6592a85466D7507L3517p801b01662
18246C09971A0092e2483p7076l6057B65432d97147h9808F5386E166a7435n2886
18235g0321o1573A52768a15069B43194a54205F7991C891P2474a36388A22370b29768
18223g5079A32089M0448g444H9323b55352I6694L2642b80041P583C06832g258
18211i0749g890j45115j43991e9644A13281a79067A7765d557n2921l7719q8156
18200a83353M0927C85387g8638p9091k22470a70626C24353F1771a7058A13800
18189d6969A03359a19732A38159a30802E3986b63457e7455m10557d937j5401C0280
$$ plain form
18177 -193297 71164 84970 88584 -169651 87166 135245 -170583 240168 -413679 -233660 -33937
18165 -7746 -49480 -137126 7120 -111709 -80115 -231311 172568 -18309 -185219 -167290 113756
18153 58915 -90595 98445 -92443 7117 -98811 16134 153661 220549 2448 -377011 109682
18141 -155223 38541 -135723 -53753 -35222 124609 24422 -326465 -109223 6715 4383 12865
18130 12865 -42823 -51321 70663 226715 -100581 185911 106781 -267301 24304 7061 -101373
18118 -247080 28337 412958 -8679 -65799 -60788 -38737 -41047 -242898 239120 -207511 158791
18106 67123 81804 -25235 -90205 18839 -368603 -59397 -81835 36534 -3499 134018 -54432
18094 113706 57516 133918 -324077 220682 6227 166500 -163168 215784 243982 -78518 25323
$$ packed form
18177a93297G1164J3806L614a69651H7166M8079a70583B40168d13679J80019c3937
18165g746m1734q7646G120a11709L1594j51196A72568a8309j66910J7929A13756
18153E8915i0595I8445i2443G117i8811A6134J37527O6888B448c77011A09682
18141a55223C8541a35723e3753J8531A24609B4422c26465a09223F715k332Q482
18130A2865d2823q498G0663J56052a00581A85911p9130b67301B4304G061a01373
18118b47080B8337L84621h679n7120N011K2051k310k01851B39120b07511A58791
18106F7123J4681b5235o4970A8839c68603e9397k2438C6534c499A34018e4432
18094A13706n6190P6402c24077B20682F227J60273a63168B15784K8198g8518B5323
$$ plain form
18082 -48955 -62859 -59352 74971 -88215 78262 92375 46041 358877 96171 42159 -326589
18070 -229377 -288881 -188050 102115 -72669 -56498 -196221 -244384 -196396 -147855 -139748 -274071
18059 -274071 -115150 -100484 223219 -134133 23619 -162918 9027 -51058 160877 103159 -201289
18047 208068 145747 58912 -22025 115115 -27999 489460 -331699 -13739 -122043 -23545 25019
18035 -318483 -229763 36045 -144906 36029 20230 82974 268249 26915 -205137 -67660 -193306
18024 -193306 157347 19672 15771 205997 -252230 -106946 -27941 -430188 -180339 -134930
18014 -134930 12780 -55864 -136877 -245070 111644 -85823 274970 -294493 -151775 92620
18003 1857 -295255 -283552 6436 216701 152168 -138242 -202883 19815 142336 123503 -127121
$$ packed form
18082d8955j3904L507G4971h8215G8262J4113D6041L12836I6171D2159c26589
18070b29377n9504J00831A02115g2669J6171j39723m8163M7988M8541Q107j34323
18059b74071a15150J4666B23219a34133B3619a62918I027e1058A60877n7718b01289
18047B08068o2321E8912b2025A15115b7999D89460c31699a3739j08304b3545B5019
18035c18483Q8720C6045a44906C6029j5799O2744J85275B6915b05137f7660j25646
18024a93306A57347A9672l901J90226b52230a06946b7941m02247a80339M5409
18014a34930A2780e5864q1013j08193A11644h5823B74970b94493J42718I2620
18003A857b95255J1703F436K10265o4533a38242o4641A9815J22521j8833a27121
$$ plain form
17991 52763 54547 -40855 -356153 -39471 -4345 -225922 -62163 277605 -25475 -144214 13061
17979 -70463 211287 -120448 -11859 -127042 160189 -175397 129449 -59558 -204658 -141868
17969 -141868 243136 -188027 1768 37984 255729 -23685 -84089 4213 -9898 145732 174585
17958 174585 129855 48303 174443 9046 256775 -151298 -185613 -207014 224906 -97566 -262440
17947 -262440 -97989 -122381 130783 -211640 228069 -168301 -209135 57297 -233491 -273952
17937 -273952 -607493 -251583 45977 -159171 29399 30590 -226297 -485326 -142476 215824
17926 130023 389686 53509 -5598 139069 -370695 253516 50576 -186362 -81225 -189719
17916 -189719 -183409 -338529 323388 -28280 172057 176319 -197657 -53919 20713 -49253 -117147
$$ packed form
17991E2763J784d0855l15298c9471d345k21577f2163B77605b5475j18739A3061
17979g0463B11287a20448a1859j15183A60189a75397A29449e9558j45100O2790
17969a41868B43136a88027A768L6216K17745b3685o0404D213i898A45732K8853
17958A74585m4730D8303J26140I046K47729a51298l4315k1401B24906i7566j64874
17947b62440i7989k4392A30783b11640B28069a68301m0834E7297b33491m0461
17937b73952l33541b51583D5977a59171B9399J191b26297k59029a42476B15824
17926A30023K59663E3509e598A39069c70695B53516E0576a86362h1225j08494
17916a89719O310j55120C23388b8280A72057M262a97657e3919B0713d9253o7894
$$ plain form
17905 -117147 65729 -114718 -15588 -189855 -85770 -6208 -147847 -84122 -139519 -318211 -123921
17893 -47323 141152 145523 162053 31774 -123005 -79136 146499 112084 -112822 -168561 88460
17881 151035 -92693 21920 15762 -94045 184951 -143336 -151596 40501 115488 -64204 -71295 -225393
17869 -225393 207422 80438 -43390 -248868 -18103 55134 25635 -142814 3845 25924 135227
17858 135227 -55136 204977 -42322 18717 -137474 28739 -113773 42334 -276866 -35510 58644
17846 58513 -205160 -311992 242679 -63833 -93278 -52825 -141376 50597 -148037 -22010 155618
17834 130668 56436 284119 -256657 179006 -101542 -32180 165970 -32855 112291 -165814
17823 -152577 -117793 -50780 229835 127774 228037 -62185 269797 29457 -226023 -17756
$$ packed form
17905a17147F5729a14718a5588j74267h5770f208j41639O3725n5397j78692a23921
17893d7323A41152M371J6530C1774a23005M3869A46499l4415a12822n5739H8460
17881A51035i2693B1920o158i4045A84951a43336q260D0501P4987f4204p091j54098
17869b25393B07422H0438d3390k05478a8103E5134B5635a42814C845K2079J09303
17858A35227e5136B04977d2322A8717a37474B8739a13773D2334b76866c5510E8644
17846E8513b05160j06832B42679f3833k9445M0453q8551E0597a48037b2010A55618
17834A30668E6436K27683b56657A79006a01542c2180A65970c2855A12291a65814
17823a52577L4784e0780B29835j02061J00263f2185B69797B9457b26023a7756
$$ plain form
17812 -126028 -108532 242283 131291 357330 181357 -228896 183612 -61230 -254765 29046
17801 26352 -30443 88486 -1089 201618 122884 173468 -193921 -173343 137012 115032 -102804
17789 10585 56797 -106186 -42806 -289455 145682 -377436 148055 -66106 68330 112038 -63702
17777 2107 9631 341158 -120028 122700 34688 306790 -15895 248472 187214 96395 189713
17766 189713 -27425 219498 18186 -136805 42036 -149427 160103 317459 277820 -240477
17755 -141627 -92902 162224 -291351 -18135 -16548 334751 15333 125907 -49316 -49279 62056
17743 -198774 255383 491816 -115155 -205017 -608 -66963 86423 -109459 -186348 172436 -170439
17731 -21999 -152208 -220000 -95105 138907 -18126 -92384 269871 281347 120530 -92705 -174500
$$ packed form
17812a26028J7496B42283j10992K26039j75973b28896A83612f1230j93535B9046
17801B6352c0443H8486a089B01618p8734N0584a93921K0578A37012k1980a02804
17789A0585M6212a06186d2806k46649A45682c77436A48055f6106F8330M3708f3702
17777B107P524L31527a20028A22700C4688K72102a5895B48472o1258r0819R3318
17766A89713b7425B19498A8186a36805D2036a49427A60103J57356l9639b40477
17755a41627M8725A62224b91351a8135J587C34751A5333J10574d9316L7F2056
17743a98774B55383K36433a15155q9862f08o6355H6423a09459p6889A72436a70439
17731b1999j30209o7792i5105A38907a8126p4258B69871J1476A20530i2705q1795
$$ plain form
17720 -174500 144220 -23713 -57824 248170 -15819 20915 31270 299925 -49738 -163333 234783
17708 -6679 -270805 -312042 164263 64810 150612 90539 -21518 232381 -405940 56073 -73764
17696 52312 50708 29208 223017 167184 -78067 14018 -165020 3038 121608 150438 61132
17684 492878 -323887 150127 182637 -46100 245008 -167457 70187 -109562 223093 -97151
17673 141444 26301 363650 -96916 182983 244040 273009 -122354 148519 60721 -185507
17662 -57167 185228 48695 116218 71061 73678 -230861 -214388 -368043 -183737 133087 -33867
17650 -114622 -215643 -24118 -253041 207693 106736 -11862 -116766 -200732 100857 -5448
17639 12770 -35121 42827 -110579 69504 -194408 -53689 -60043 198521 92006 157463 101603
$$ packed form
17720a74500A44220b3713l4111B48170a5819B0915J0355K68655d9738j13595B34783
17708f679k64126m1237A64263F4810Q5802o0073b1518B32381d05940E6073g3764
17696E2312j604k1500J93809n5833g8067A4018a65020C038J18570K8830F1132
17684D92878c23887A50127L2510d6100B45008a67457G0187a09562B23093i7151
17673A41444B6301L37349i6916A82983O1057K8969a22354A48519F0721a85507
17662e7167A85228D8695O7523m5157K617b30861J6473j53655a83737A33087c3867
17650a14622j01021b4118k28923B07693j00957a1862j04904q3966A00857e448
17639A2770c5121D2827a10579F9504a94408e3689o354A98521I2006O5457n5860
$$ plain form
17628 101603 117128 1515 -20458 -167877 97535 369887 -51949 143228 -172542 -109970 -159659
17617 -159659 -38284 188973 277808 170143 158313 -44327 72278 253500 -31426 -26015 205382
17605 185071 275207 -4795 19830 -206027 -278150 -183108 -102968 -171875 130444 -105703 148757
17593 -60615 -10826 213707 -42478 -89643 100969 -125371 180133 434570 239032 97929
17582 -90701 -141503 -44649 327915 -69985 288150 61057 15368 47677 123416 298866 429181
17571 429181 106485 120480 212543 106398 -103076 321133 262578 291391 -25421 42121 222140
17560 222140 -20861 205025 -185394 164439 215026 124663 -239037 138539 -10266 151900
17549 -192474 166342 296133 -78947 104388 83214 253452 153350 -49539 -110266 100091
$$ packed form
17628A01603J5525A515b0458j47419I7535K72352e1949A43228a72542O2572m9689
17617a59659c8284A88973Q8835j07665j1830d4327G2278J81222c1426N411B05382
17605A85071R0136d795A9830b06027p2123R5042Q0140o8907A30444a05703A48757
17593f0615a0826B13707d2478m7165A00969a25371A80133K54437j95538I7929
17582i0701n0802d4649C27915f9985B88150F1057A5368L2309P5739J75450J30315
17571D29181A06485J3995R2063j06145a03076C21133n8555K8813b5421D2121J80019
17560B22140b0861B05025a85394A64439N0587r0363b39037A38539a0266A51900
17549a92474A66342J29791g8947A04388k1174J70238j00102d9539o0727A00091
$$ plain form
17538 148772 54114 142610 -110121 128618 -166005 -41239 97168 142756 -138843 -311556
17528 -311556 174711 -196137 -216025 277994 -142798 230270 239339 -17175 121649 14461
17517 162350 39153 162024 488174 114685 266308 185696 40584 -43569 -139575 140899
17506 210863 -257664 394147 -627875 222949 200110 -273779 120041 -110008 344080 177710
17496 177710 144027 228579 149685 71451 244242 159303 50397 -46439 -55248 141504 214846
17485 214846 122001 50215 211335 -70807 440496 129561 358691 279416 539428 14693
17474 -150559 480174 145809 63430 83854 444586 200942 -211426 321678 186269 97514
17464 97514 -28117 46643 -73947 130314 315857 215913 7105 490645 193374 -258408 344598
$$ packed form
17538A48772E4114Q8496a10121A28618a66005d1239I7168M5588a38843j72713
17528c11556A74711a96137j9888B77994a42798B30270R069a7175A21649A4461
17517A62350C9153J22871L26150A14685J51623q0612D0584d3569r6006A40899
17506B10863b57664C94147f27875B22949k2839b73779A20041a10008C44080j66370
17496A77710l3683Q4552p8894G1451J72791q4939E0397d6439q809A41504P3342
17485B14846r2845E0215J61120g0807D40496A29561K29130p9275K60012A4693
17474a50559D80174A45809F3430K0424L60732B00942b11426C21678j35409q8755
17464I7514b8117D6643g3947A30314J85543r9944G105M83540A93374b58408C44598
$$ plain form
17452 225355 427768 133315 300004 183788 151812 95749 184960 133286 -268069 251417
17441 264584 47959 375120 26117 393136 125951 100236 166859 238323 272069 171433 174087
17430 174087 128939 290823 152071 -18043 189788 138371 250923 154835 198493 427073
17420 427073 214655 66870 118909 36822 -11719 178121 242259 232405 268913 -120239 288899
17408 339468 122172 159780 314615 448086 -117890 132937 -110169 120245 358219 218105
17398 218105 -232022 18568 297572 118974 362230 227018 162858 246350 89452 115162
17388 115162 232552 20444 456640 -19332 -26946 163203 63835 302639 59139 149418 186249
17377 186249 124089 73086 -58591 77217 -15087 -72376 -44678 18087 58215 -76568 185474
$$ packed form
17452B25355K02413A33315J66689j16216l1976n6063Q9211n1674b68069B51417
17441B64584D7959L27161B6117L67019A25951k5715O6623P1464L3746j00636K654
17430A74087m5148J61884j38752a8043A89788n1417J12552r6088M3658K28580
17420D27073k12418F6870N2039C6822a1719A78121O4138r854L6508a20239B88899
17408C39468A22172L7608J54835J33471a17890A32937a10169A20245K37974j40114
17398B18105b32022A8568K79004A18974K43256j35212o4160Q3492H9452K5710
17388A15162J17390B0444M36196a9332p614A63203F3835K38804E9139R0279L6831
17377A86249o2160n1003e8591G7217a5087n7289K7698A8087M0128g6568A85474
$$ plain form
17365 47978 171543 73105 113839 325056 8304 355542 362335 -103821 -278489 162060 -69067
17353 -54748 -167203 384798 342322 -194426 234032 153951 267848 170831 -57684 -244886
17343 -244886 -99501 154627 226053 409623 245391 -204948 62668 64495 -104883 211498
17332 448568 178534 104157 -180356 76676 264524 96935 105191 499834 426768 148432 482257
17321 482257 271305 103535 106246 352098 262231 213795 318715 365956 156471 -70447 -145558
17310 -145558 -139929 247816 -195169 159880 152894 422111 360406 -70787 -60738 122863 14579
17298 322320 524835 424150 133206 186822 325137 374747 555561 54399 45946 46988 72140
17287 72140 370082 171803 269857 373678 -78373 151827 180870 -39503 156703 306137
$$ packed form
17365D7978J23565G3105M0734K11217H304L47238O793a03821j74668A62060f9067
17353e4748j12455C84798m2476a94426B34032q0081J13897r7017e7684j87202
17343b44886i9501A54627P1426J83570j64232b04948F2668J827a04883B11498
17332D48568A78534p4377a80356G6676J87848I6935Q256L94643p3066A48432L33825
17321D82257k10952A03535K711K45852q9867m8436J04920M7241A56471g0447p5111
17310a45558N629B47816a95169A59880o986K69217o1705g0787J0049A22863A4579
17298C22320K02515j00685A33206N3616J38315M9610J80814E4399q453J042K5152
17287G2140K97942A71803R8054J03821g8373A51827K9043c9503A56703J49434
$$ plain form
17277 306137 -84287 154908 266997 332616 291322 212315 80672 114686 360192 -303765 251557
17265 351403 146837 430677 -88584 106064 297533 314047 24616 366503 295754 178634
17255 178634 242014 490260 400298 116053 -716 302903 -8272 289616 13485 266830 345553
17244 345553 -258919 173373 253769 219267 176905 29644 336425 535068 188803 62293
17233 364192 424247 -60300 379377 171404 197375 147897 381009 28727 305639 326565 420793
17222 420793 78560 189544 71695 250132 199570 -22833 421069 43917 298675 221223 179519
17211 179519 147153 155041 84191 214871 340632 312732 490662 322313 345545 -78578 364969
17199 483018 476542 487946 235099 99832 98821 178946 264612 72615 108617 106576 206805 226898
$$ packed form
17277C06137h4287A54908J12089O5619m1294p9007H0672L4014K45506c03765B51557
17265C51403A46837K83840h8584A06064J91469J6514B4616L41887p0749j17120
17255A78634O3380K48246q9962A16053g16C02903h272B89616A3485K53345P8723
17244C45553b58919A73373Q0396l4502m2362B9644L06781J98643A88803F2293
17233C64192O0055f0300C79377A71404K5971m9478K33112B8727K76912K0926R4228
17222D20793G8560J10984G1695J78437n0562b2833D21069D3917K54758p7452m1704
17211A79519l2366P888p0850J30680J25761k7900J77930j68349K3232g8578C64969
17199D83018o476J1404B35099I9832j011Q0125Q5666G2615L6002k041J00229K0093
$$ plain form
17187 226898 333083 269274 -181644 526707 461944 -18434 546725 506205 433832 53905 107909
17176 107909 360859 57674 520544 486101 267209 280966 302338 548806 214213 5707 84166
17165 84166 366229 -20956 384130 42756 343887 317342 364735 102025 183254 166490 406459
17154 406459 301532 561716 649640 53491 217338 163735 79218 434894 153801 302315
17144 302315 533912 334409 199711 373783 283002 401322 226752 368487 105015 386746
17134 386746 298516 568589 422554 476255 390727 234839 368612 429437 765911 523692
17124 523692 397143 463710 391341 242576 266674 325536 139832 391361 460782 381454 390747
17113 390747 327310 -25208 198238 537745 347085 433453 433318 606883 418946 362732 9655
$$ packed form
17187B26898J06185o3809a81644E26707o4763a8434E46725m0520p2373E3905N4004
17176A07909K52950E7674M62870l4443k18892J3757K1372K46468B14213E707P8459
17165H4166K82063b0956C84130D2756L01131k6545M7393A02025Q1229j6764K39969
17154D06459j04927K60184Q7924E3491J63847n3603G9218L55676A53801J48514
17144C02315K31597j99503j34698J74072r0781J18320j74570J41735A05015K81731
17134C86746q8230K70073j46035N3701q5528j55888J33773O0825L36474k42219
17124E23692j26549O6567p2369j48765K4098N8862A39832K51529O9421p9328R293
17113C90747o3437b5208A98238L39507j90660Q6368j35J73565j87937n6214I655
$$ plain form
17101 104272 429556 190927 699510 644299 123666 585012 245211 335164 475976 302889
17091 302889 720820 96273 533125 617516 643241 596011 770771 521401 922799 421723
17080 483232 166920 388896 650802 502912 479438 576371 550164 350448 203520 360503
17070 360503 581142 269872 555416 715758 345679 550849 513059 332920 555307 410916
17060 410916 636170 598424 837884 381655 630455 579259 607943 464282 744079 601867
17050 601867 469353 738271 724759 779781 729676 452914 379609 681126 453257 752111
17040 752111 521298 578610 761250 551933 612815 578233 739137 551654 662377 689552
17030 689552 838901 617776 465323 607049 992477 328279 608100 806468 509512 506907
$$ packed form
17101A04272L25284A90927N08583n5211A23666M61346B45211Q9953J40812j73087
17091C02889M17931I6273M36852Q4391K5725m7230J74760k49370M01398D21723
17080D83232A66920K21976K61906j47890k3474R6933k6207j99716j46928J56983
17070C60503K20639B69872K85544J60342C45679K05170l7790j80139K22387j44391
17060D10916K25254l7746K39460C81655K48800n1196K8684j43661K79797j42212
17050F01867j32514K68918j3512N5022n0105k76762p3305L01517k27869K98854
17040G52111k30813N7312J82640k09317O0882l4582J60904j87483J10723K7175
17030F89552J49349k21125j52453J41726L85428C28279K79821J98368k96956k605
$$ plain form
17020 506907 531267 1008344 724047 305405 854908 828116 991984 705081 619856 692825
17010 692825 565344 728487 736300 620654 838170 934039 844973 647252 564311 794224
17000 794224 860627 532556 906467 527039 707712 706461 951250 844201 681310 1065514
16990 1065514 927528 755087 715781 1210548 979798 703073 1292219 919149 742574 939986
16980 939986 940258 842418 983069 1402050 801743 922101 865914 914254 990284 819230 1109845
16969 1109845 907029 1278287 1049640 1058806 813519 904252 1015924 1152367 963532 1260084
16959 1260084 1147099 1116237 1344140 1122802 1250674 913553 1182203 1254439 1245731 723094
16949 723094 1255247 1149561 926133 953536 1331073 1140600 1385449 992426 1186834 1307667
$$ packed form
17020E06907K4360M77077k84297C05405N49503k6792J63868k86903q5225P2969
17010F92825j27481J63143P813j15646K17516R5869q9066j97721q2941K29913
17000G94224O6403l28071L73911l79428J80673j251K44789j07049j62891L84204
16990A065514j37986j72441l9306M94767k30750k76725N89146l73070j76575J97412
16980I39986K72r7840J40651M18981o00307J20358n6187M8340P6030j71054K90615
16969A109845k02816L71258k28647R166k45287R0733J11672J36443j88835K96552
16959A260084j12985l0862K27903k21338J27872l37121K68650P2236q708n22637
16949G23094N32153j05686k23428K7403L77537j90473K44849l93023J94408J20833
$$ plain form
16939 1307667 1553222 1165008 1470980 1273790 1497006 1527259 1051168 1217298 1413053 1430465
16929 1430465 1541657 1465289 1308206 1507033 1680644 1272416 1407438 1573542 1524681 1803165
16919 1803165 1636951 1710808 1489938 1339844 1475988 1730441 1544740 1628248 1365448 1554468
16909 1554468 1654504 1907634 1363811 1744094 1559262 1933995 1654487 1826526 1744185 1825597
16899 1825597 2029963 1840446 1785070 2085764 1780422 2052001 2258617 2305602 2174892 2405797
16889 2405797 2171118 2183716 2273453 2268006 2584185 1971687 2161807 2309709 2247289 2234112
16879 2234112 2689062 2598996 2583613 2989852 2501327 2075641 2633425 2865067 2852579 2579704
16869 2579704 2877767 2592816 2960563 2931462 2969814 3099947 2943081 3143552 3143222 3001014
$$ packed form
16939A307667K45555l88214L05972j97190K23216L0253m76091J66130J95755J7412
16929A430465J11192p6368j57083J98827J73611m08228J35022J66104m8861K78484
16919A803165j66214P3857k20870j50094J36144K54453j85701Q3508k62800J89020
16909A554468J00036K53130n43823L80283j84832L74733k79508J72039q2341Q1412
16899A825597K04366j89517n5376L00694l05342K71579K06616M6985j30710K30905
16889B405797k34679J2598Q9737n447L16179o12498J90120J47902o2420j3177
16879B234112M54950r0066j5383M06239m88525m25686N57784K31642j2488k72875
16869B579704K98063k84951L67747k9101L8352J30133j56866K00471l30j42208
$$ plain form
16859 3001014 2774353 3381593 3276436 2974326 3436803 3516547 3393846 3230268 3569879 3585624
16849 3585624 3769394 3566058 3771561 3666195 3990026 3802491 3758157 4157234 3779921 3990114
16839 3990114 3956349 4215791 4341135 4667042 4466829 4651640 4624357 4769461 4558071 5209999
16829 5209999 5049864 4707752 5056283 5194629 5281163 5517524 5394958 5626935 5505162 5907160
16819 5907160 6235196 5992003 6273819 6051544 6308342 6268116 6431560 6921378 6850268 7289623
16809 7289623 7070747 7368350 7088554 7729707 7760962 8008900 7844089 8470721 8480892 8938757
16799 8938757 9053114 9447062 9408483 9532207 9938985 10247571 10427787 10552994 11062923 11343425
16789 11343425 11849557 11963113 12354385 12236880 12908982 13509149 13687225 14456332 14636619
$$ packed form
16859C001014k26661O07240j05157l02110M62477P9744j22701j63578L39611J5745
16849C585624J83770k03336K05503j05366L23831j87535m4334L99077l77313K10193
16839C990114l3765K59442J25344L25907k00213J84811k7283J45104k11390O51928
16829E209999j60135l42112L48531J38346Q6534K36361j22566K31977j21773M01998
16819E907160L28036k43193K81816k22275K56798m0226J63444M89818p1110M39355
16809G289623k18876K97603k79796O41153L1255K47938j64811O26632J0171M57865
16799H938757J14357L93948l8579J23724M06778L08586J80216J25207N09929K80502
16789A1343425N06132J13556L91272j17505O72102O00167J78076P69107J80287
$$ plain form
16780 14636619 14957011 15392971 15741685 16348792 17063789 17094507 17797551 18535703 19197879
16771 19197879 19667806 20574645 21046769 21739436 22589627 23473297 24581452 25325691 26373260
16762 26373260 27302743 28583459 29889482 30876166 32279520 33647930 35138209 36270709
16754 36270709 38175154 39883832 41476183 43156212 45606492 47433605 49939428 52726624
16746 52726624 55201461 58354317 61379668 64080281 67777020 71566185 74887808 79155312
16738 79155312 83536269 88011249 92958057 97946273 103445127 108865168 114671025 120622034
16730 120622034 127152005 133062890 139082758 145123112 151332143 156676254 161862742 166531849
16722 166531849 170816144 173689596 176055693 177692894 177873349 176969336 175087233 172763194
$$ packed form
16780A4636619L20392M35960L48714O07107P14997L0718P03044P38152O62176
16771A9197879M69927R06839M72124O92667Q50191Q83670J108155P44239J047569
16762B6373260R29483J280716J306023R86684J403354J368410J490279J132500
16754C6270709J904445J708678J592351J680029K450280J827113K505823K787196
16746E2726624K474837L152856L025351K700613L696739L789165L321623M267504
16738G9155312M380957M474980M946808M988216N498854N420041N805857N951009
16730A20622034O529971N910885O019868O040354O209031N344111N186488M669107
16722A66531849M284295K873452K366097J637201J80455r04013j882103k324039
$$ plain form
16714 172763194 169500055 165175335 160326997 154688263 148804469 142514458 136239099 130134933
16706 130134933 123773490 117520770 111746097 105369593 99945057 94408478 89011704 84572138
16698 84572138 79741317 75478077 71598339 67508615 64007924 60874255 57640040 54625692
16690 54625692 51998584 49116676 46817718 44456200 42497449 40338147 38586512 37068136
16682 37068136 35319117 33714108 31915485 30615588 29384260 28340996 27175777 26134967
16674 26134967 24941245 23744814 23233739 22547690 21612833 20491478 19934144 19247508 18542804
16665 18542804 17706465 17192188 16636558 16148249 15451219 15323410 14693538 14522622 14047143
16656 14047143 13268597 12728213 12236396 11969733 11806708 11629994 11190208 10603430 10705907
$$ packed form
16714A72763194l263139m324720m848338n638734n883794o290011o275359o104166
16706A30134933o361443o252720n774673o376504n424536n536579n396774m439566
16698H4572138m830821m263240l879738m089724l500691l133669l234215l014348
16690E4625692k627108k881908k298958k361518j958751k159302j751635j518376
16682C7068136j749019j605009j798623j299897j231328j043264j165219j040810
16674B6134967j193722j196431n11075o86049r34857j121355n57334o86636p04704
16665A8542804q36339n14277n55630m88309o97030j27809o29872j70916m75479
16656A4047143p78546n40384m91817k66663j63025j76714m39786n86778J02477
$$ plain form
16647 10705907 10253973 10127732 9552514 9188405 9118162 8910487 8743512 8563443 8226114
16638 8226114 8471012 7642464 7767993 7423131 7484145 7195488 7177646 7190951 6984593 6555508
16628 6555508 6532974 6277843 6228657 5969363 5715232 5566888 5427731 5544841 5251078 5216296
16618 5216296 5111761 5217151 5039470 5035019 4725092 4393511 4689270 4232787 4482417 4535528
16608 4535528 4477833 4012170 4331913 3975928 3951597 3730558 3755039 3782816 3545064 3956206
16598 3956206 3611546 3523344 3405652 3116078 3545185 3056769 3369677 3219763 3219355 3095167
16588 3095167 2960672 3198932 2755729 2814236 2721399 2950254 2838222 2616614 2363644 2745326
16578 2745326 2353296 2447852 2510823 2634837 2162328 2433126 2080561 2285677 2279537 2398614
$$ packed form
16647A0705907m51934j26241n75218l64109p0243k07675j66975j80069l37329
16638H226114K44898q28548J25529l44862O1014k88657j7842J3305k06358m29085
16628F555508k2534k55131m9186k59294k54131j48344j39157J17110k93763l4782
16618E216296j04535J05390j77681m451l09927l31581K95759m56483K49630N3111
16608D535528n7695m65663L19743l55985k4331k21039K4481K7777k37752M11142
16598C956206l44660q8202j17692k89574M29107m88416L12908j49914m08j24188
16588C095167j34495K38260m43203N8507r2837K28855j12032k21608k52970L81682
16578B745326l92030R4556O2971J24014m72509K70798l52565K05116o140J19077
$$ plain form
16568 2398614 2132721 2214399 2415449 2125203 2246599 1762129 1861310 2033056 1836899 1858326
16558 1858326 1985977 1785612 1523334 1878519 1918150 1967059 2039142 1574605 1715665 1392205
16548 1392205 1852496 1540175 1565101 1586241 1528185 1420004 1568087 1560643 1493027 1337101
16538 1337101 1529977 1450409 1309664 1521586 1418642 1487019 1628258 1293375 1351527 1190856
16528 1190856 1429707 1396915 947718 1057962 1437255 1154849 1145943 1250061 1390494 1219565
16518 1219565 1315160 1323649 1167375 1134381 1277622 1019421 922557 1166914 902063 1245219
16508 1245219 1008037 1257610 1213917 928817 995053 1200595 1120101 764740 1217446 884976
16498 884976 1308050 1312831 855189 1270811 981285 1301324 812715 912651 878772 872033 990769
$$ packed form
16568B398614k65893Q1678K01050k90246J21396m84470R9181J71746j96157K1427
16558A858326J27651k00365k62278L55185L9631M8909P2083m64537J41060l23460
16548A392205M60291l12321K4926K1140n8056j08181J48083p444o7616j55926
16538A337101J92876p9568j40745K11922j02944O8377J41239l34883N8152j60671
16528A190856K38851l2792m49197J10244L79293k82406q906J04118J40433j70929
16518A219565R5595Q489j56274l2994J43241k58201r6864K44357k64851L43156
16508A245219k37182K49573m3693k85100O6236K05542q0494l55361M52706l32470
16498H84976M23074M781m57642M15622k89526L20039m88609R9936l3879o739J18736
$$ plain form
16487 990769 492858 1033308 618592 856969 777117 759658 663420 901988 908412 757451
16477 757451 1032897 816086 748068 953811 949192 893003 626112 584931 663186 653820 521886
16466 521886 847927 775226 764955 646866 885326 799130 421677 449358 531268 797399
16456 797399 468465 200212 855944 533522 578601 466188 539903 785122 834686 575686
16446 575686 484454 320411 342160 520111 822510 415833 271327 838331 330451 391023
16436 391023 616961 483270 837875 644696 723598 350055 491386 299374 468905 480784
16426 480784 470969 461272 472577 304592 242247 397969 659035 433644 517184 392395 306778
16415 306778 219665 386881 452274 214543 240883 409062 451160 419842 385631 422099 234912
$$ packed form
16487I90769D92858N40450m14716K38377p9852j7459r6238K38568O424j50961
16477G57451K75446k16811o8018K05743m619n6189k66891m1181P8255r366j31934
16466E21886L26041p2701j0271j18089K38460q6196l77453K7681Q1910K66131
16456G97399l28934B00212O55732l22422M5079j12413P3715K45219M9564k59000
16446E75686r1232j64043K1749J77951L02399m06677j44506N67004C30451O0572
16436C91023K25938j33691L54605j93179P8902C50055J41331j92012J69531J1879
16426D80784r815r697J1305j67985o2345J55722K61066k25391Q3540j24789q5617
16415C06778q7113J67216O5393B14543K6340J68179M2098l1318l4211L6468j87187
$$ plain form
16404 234912 288290 398542 285213 316238 308868 464825 101232 -140319 261921 267877 125563
16392 195567 419480 518057 656464 298614 584760 232658 398302 685543 446311 606986
16382 606986 248054 145743 264543 196007 575747 177578 65685 151830 540197 485602
16372 485602 478269 222246 562552 229796 331266 389546 435598 138419 175433 75139 352452
16361 352452 381640 346983 198898 366165 115795 12358 375860 340016 199984 515264
16351 515264 61200 565463 73686 108375 263542 299254 384252 333466 24226 120557 378823
16340 378823 321176 114726 93961 368911 44697 9771 104287 427296 185881 231425 117724
16329 117724 344290 218919 105607 221726 -56791 58643 14816 89563 312215 125360
$$ packed form
16404B34912N3378J10252j13329L1025p370J55957A01232a40319B61921N956A25563
16392A95567K23913R8577J38407B98614K86146B32658J65644K87241k39232J60675
16382F06986B48054j02311J18800o8536L79740A77578F5685Q6145L88367n4595
16372D85602p333B22246L40306B29796J01470N8280M6052A38419L7014G5139K77313
16361C52452K9188l4657j48085J67267A15795A2358L63502l5844j40032L15280
16351E15264F1200N04263G3686L4689J55167L5712Q4998n0786B4226R6331K58266
16340C78823n7647A14726k0765K74950D4697I771R4516L23009A85881M5544j13701
16329A17724K26566j25371A05607J16119e6791E8643A4816P4747K22652A25360
$$ plain form
16318 65619 279150 51735 62345 372541 81618 367014 -42585 113782 93073 100519 312903
16307 312903 83536 265556 89803 -34150 192667 307659 314434 394422 116214 73416 -197542
16295 -107902 161331 518989 31737 258988 -39146 398939 127388 415302 182409 303322
16285 303322 66806 313739 19565 320099 -24107 138197 160709 485691 592143 130960
16274 -53210 -40041 304862 -83936 171636 294326 81407 -42202 -80848 -173017 182138 321583
16263 321583 339439 -212570 69195 63922 74564 348079 -199115 85535 -75752 -22187 345697
16251 -45562 66908 117921 325841 340398 97348 153403 155228 977 215816 -60093 -117447 -194635
16239 -194635 95708 -18292 -72572 164704 308653 65977 261417 -47722 -8999 -27253 78393
$$ packed form
16318F5619K13531E1735J0610L10196H1618K85396d2585A13782k0709P446K12384
16307C12903H3536J82020H9803c4150A92667J14992O775P9988A16214m2798a97542
16295a07902A61331L57658C1737K27251c9146C98939A27388K87914A82409J20913
16285C03322F6806K46933A9565L00534b4107A38197K2512L24982J06452A30960
16274e3210J3169C04862h3936A71636J22690H1407d2202l8646r2169A82138J39445
16263C21583J7856b12570F9195n273J0642K73515a99115H5535g5752b2187C45697
16251d5562F6908N1013K07920J4557I7348N6055J825I77K14839f0093n7354p7188
16239a94635I5708a8292n4280A64704J43949F5977J95440d7722h999j8254G8393
$$ plain form
16227 55799 1951 83745 -17614 64166 -245192 143429 170834 64594 170365 195231 -199132
16215 437324 -8103 -93223 472539 11290 194829 160869 3030 -63568 -21872 141092 195219
16204 195219 -24648 88307 536814 63890 272066 249568 139787 -47896 -84421 64159 17593
16192 358293 57065 73364 -121176 -32122 -1539 77641 91781 -21301 238499 149878 -133268
16180 -261222 68487 -37037 326 -87497 -102140 36610 111801 154617 54850 -18883 -23120 162981
16167 115494 127443 -101222 -127568 182364 81304 50547 280247 -266009 -54370 -69087 -55732
16156 -55732 -230138 88008 -143007 -69950 -80802 148866 -8403 137606 223374 35714 35550
16145 35550 230060 -27286 290673 100747 4854 198549 321742 148088 148398 -43242 114380
$$ packed form
16227E5799A951Q1794a7614F4166b45192A43429K7405F4594J05771K4866a99132
16215D37324h103q5120D72539A1290J83539l3960C030f3568b1872A41092N4127
16204A95219b4648H8307M48507F3890K08176k2498j09781d7896l6525F4159A7593
16192C58293E7065J6299a21176c2122a539G7641J4140b1301B38499q8621a33268
16180b61222F8487c7037C26h7497j4643C6610P5191M2816E4850a8883m237A62981
16167A15494J1949a01222k6346A82364H1304l0757K29700b66009e4370j4717J3355
16156e5732j74406H8008a43007f9950j0852A48866h403A37606Q5768C5714j64
16145C5550J94510b7286B90673A00747D854J93695J23193A48088L10d3242A14380
$$ plain form
16133 81526 -190522 -481357 382381 -345989 32833 -178311 279273 38349 4221 276683
16123 276683 101674 17928 179619 117019 32978 141325 -45132 -120045 41694 -153238 218679
16111 -183008 12594 38730 170630 -118172 82584 -122867 -63973 81251 42247 -95760 71192
16099 343906 65563 280838 148259 -132495 -75964 101152 -94228 13865 -202755 185665
16088 209332 -228626 11795 -38118 156178 -30655 131776 -14861 -115811 50484 -287904
16077 -162287 123688 171315 205046 -118927 304561 207868 299052 51712 56281 114649 -128157
16065 49142 155668 -143772 29248 276544 -239819 -156347 264236 125649 68534 35304
16055 35304 63227 -133994 -42961 -67589 -110520 27527 142743 14772 178409 -109666 7649
$$ packed form
16133H1526a90522k90835C82381c45989C2833a78311B79273C8349D221K72462
16123B76683A01674A7928J61691o2600C2978J08347d5132p4913D1694a53238B18679
16111a83008A2594K6136J31900a18172H2584a22867N8894H1251l9004i5760G1192
16099C43906F5563K15275j32579a32495N6531A01152i4228A3865b02755A85665
16088B09332b28626A1795c8118A56178c0655A31776a4861j00950E0484b87904
16077a62287A23688M7627L3731a18927C04561r6693R1184E1712M569N8368a28157
16065D9142J06526a43772B9248K47296b39819Q3472B64236A25649n7115l3230
16055C5304K7923a33994d2961k4628m2931B7527J15216A4772J63637a09666G649
$$ plain form
16043 69179 100474 8145 -49376 -164358 21593 -4903 -92412 -186353 112969 -299933 -22692
16031 3909 -239546 115821 46923 -272788 46852 234107 -48709 -193868 -21526 370332 86831
16019 47191 -259067 60207 -121710 -205697 -260939 335394 77718 92964 212179 55610 225625
16008 225625 -28201 125798 320782 165995 171417 110398 -138362 -272587 -34078 -181794
15998 -181794 -5057 -238987 -20995 -61496 -306449 414376 34982 221319 -79518 -6798 -290700
15987 -290700 93252 260718 224335 239021 519796 295606 57705 -263296 -115560 -116566 8235
15975 103839 -16594 -47462 81531 -184995 -97143 191879 -265556 -118775 177549 -82253
15964 26525 53778 190769 -359894 -156562 -255064 141821 146313 -249678 42540 -319468 222728
$$ packed form
16043F9179L1295H145d9376j14982B1593d903q7509r3941A12969b99933b2692
16031C909b39546A15821D6923b72788D6852J87255d8709j45159b1526C70332H6831
16019D7191b59067F0207a21710q3987n5242C35394G7718J5246J19215E5610J70015
16008B25625b8201A25798J94984j54787N422o1019a38362j34225c4078j47716
15998a81794e057k33930b0995m0501k44953D14376C4982J86337g9518f798k83902
15987b90700I3252J67466l6383J4686K80775k24190E7705b63296a15560j006H235
15975A03839a6594l0868H1531a84995Q7852A91879b65556a18775A77549h2253
15964B6525K7253J36991c59894a56562r8502A41821M492b49678D2540c19468B22728
$$ plain form
15952 -107245 -312211 -310569 193125 130066 -94574 -83424 167139 -109708 92375 238949 -16272
15940 -19152 -216183 -243461 -288 -146290 -134258 -25698 -73233 121689 52539 139052 182994
15929 182994 37527 -220578 161371 -7568 38387 -219649 -62819 57077 319423 -207087 6976
15917 30876 100745 -154408 -7558 55309 -229881 -12483 -72914 24016 -211064 62457 -143353
15905 -102063 -156477 258573 167662 149799 76732 166266 131909 65524 -97155 -111845 185584
15893 317999 93475 28488 -204636 -251692 154728 21742 -127764 241279 117615 -172277
15882 -272925 597 -46876 -162653 -41215 -147477 -77827 -57414 185217 -629779 261191 -71566
15870 -116603 -78394 377758 70806 -479725 -128255 -390236 -263819 -53040 73631 182282
$$ packed form
15952a07245k04966J642A93125o3059i4574J1150A67139a09708I2375J46574a6272
15940a9152j97031k7278b88j46002J2032b5698m7535A21689E2539Q6513M3942
15929A82994C7527b20578A61371g568C8387b19649f2819E7077K62346b07087F976
15917C0876O9869a54408g558E5309b29881a2483o0431B4016b11064F2457a43353
15905a02063n4414B58573r0911j7863p3067Q9534l4357F5524i7155j4690A85584
15893C17999I3475B8488b04636m7056A54728B1742a27764B41279A17615a72277
15882b72925E97d6876j15777d1215j06262O9650K0413A85217f29779B61191g1566
15870a16603L8209C77758G0806d79725a28255k61981J26417e3040G3631J08651
$$ plain form
15860 182282 -28219 -109369 -53017 19698 61776 13562 -179571 329324 9076 126009 -178943
15848 186023 -138774 -29025 -161444 -12623 -192269 -140860 304059 6940 140219 57196 156875
15837 156875 300383 -223002 120353 -144397 21777 348407 -13328 -78023 -35394 -141054
15827 -141054 6733 -109915 -56356 44218 -51602 49771 13817 19283 -302581 -80729 -61328
15816 -61328 -70403 -248526 -110123 -204664 -89264 -202817 -222482 -395310 -448242 77054 -32731
15804 87818 90646 47328 -250252 109149 -88160 35514 -227273 158241 -330691 101864 -224139
15792 -68249 -197433 16188 -108741 48020 -156570 -187173 -19158 -9329 -222530 264402 -122765
15780 -9011 137705 -89062 -230849 90639 -167463 -104940 -125198 24868 -99146 -48410 69695
$$ packed form
15860A82282b8219q1150e3017A9698M2078A3562a79571C29324I076J16933a78943
15848A86023a38774b9025j32419a2623j79646N1409C04059F940J33279E7196R9679
15837A56875J43508b23002A20353a44397B1777L26630a3328o4695c5394j05660
15827a41054F733a09915N3559D4218e1602D9771A3817N466c02581h0729J9401
15816f1328r075j78123a10123r4541h9264j13553j9665j72828n2932G7054c2731
15804H7818K828m3318b50252A09149h8160C5514b27273A58241c30691A01864b24139
15792f8249j29184A6188a08741D8020a56570l0603a9158i329k13201B64402a22765
15780i011A37705h9062j41787I0639a67463O2523k0258B4868i9146d8410F9695
$$ plain form
15768 -336797 383838 29689 -161516 -364262 -163787 -304441 -192106 -88443 -32211 -67872
15758 -67872 -89754 139861 267633 124883 -165359 430218 72822 42195 -319231 -7456 -106749
15747 -106749 159293 -248119 -238242 45531 27857 -290875 -75608 68255 -296127 8153 34497
15736 34497 -57269 -71571 -162737 -180432 8520 21530 -152456 117514 -93214 109219 9673
15724 -121250 56398 -337 141482 -283084 37331 -227170 -86228 -421615 -67410 40331 -281640
15712 -140883 -275174 203053 -39684 -465554 -56999 221059 -52312 -84591 -88825 -195677 224377
15700 162777 -154858 -116409 -354640 14726 57544 -140786 -52452 98245 69524 308676 224627
15689 224627 -35841 182203 93132 16490 398804 54031 15101 -7041 -388676 13958 -127943
$$ packed form
15768c36797C83838B9689a61516k02746a63787j40654J12335h8443c2211l5661
15758f7872k1882A39861J27772A24883a65359D30218G2822l0627c19231g456r9293
15747a06749A59293b48119R877D5531j7674b90875g5608F8255b96127H153K6344
15736C4497e7269j4302r1166j7695H520J3010a52456A17514i3214A09219I673
15724a21250E6398c37A41482b83084C7331b27170h6228l35387f7410D0331b81640
15712a40883j34291B03053c9684m25870e6999B21059e2312l2279m234j06852B24377
15700A62777a54858L8449k38231A4726M2818a40786e2452I8245k8721K39152q4049
15689B24627c5841A82203q9071A6490L82314E4031A5101g041l81635A3958a27943
$$ plain form
15677 -113434 103992 -5985 -186873 -191300 66649 -217842 337153 -4706 196512 -44020 224144
15665 -142241 141255 -35372 46325 214233 567943 -64467 96022 -179925 -352109 120551
15654 -169571 -251267 136627 83567 147354 225107 -17432 103082 119661 55361 -88764 -26148
15642 124999 80464 38772 108175 -240533 -46955 191349 84268 23080 30853 -106357 -137571
15631 -137571 -125125 -193132 -120213 201160 -319295 -270325 -105740 215053 -193346 61846
15620 -157538 -113838 126411 -269541 110998 -39019 322773 99008 -180526 130554 -72338
15609 -290513 95918 -53533 -119902 -30781 135035 -32825 263545 162437 312800 60346 -59730
15597 110042 -235651 229412 49101 91112 176069 34786 -228251 -164222 -153266 -19120 -7909
$$ packed form
15677a13434A03992e985j80888m427F6649b17842C37153d706A96512d4020B24144
15665a42241A41255c5372D6325J67908L53710f4467I6022a79925j72184A20551
15654a69571q1696A36627n3060O3787P7753a7432A03082J6579E5361h8764b6148
15642A24999m4535C8772O9403b40533d6955A91349H4268B3080P773a06357l1214
15631a37571J2446o8007P2919B01160c19295M8970a05740B15053a93346F1846
15620a57538M3700A26411b69541A10998c9019C22773I9008a80526A30554g2338
15609b90513I5918e3533o6369c0781A35035c2825B63545j01108J50363F0346e9730
15597A10042b35651B29412D9101M2011Q4957C4786b28251O4029J0956a9120g909
$$ plain form
15585 -110266 -33582 -544733 -149277 298293 -32709 -30901 -294720 131760 -230673 -224339 -225748
15574 -225748 -89829 -202510 63937 118858 -140285 339498 -93270 -99768 -49440 -379432 97357
15562 47360 305154 44530 157697 84958 17754 -206670 31495 132008 25198 -84919 179193
15550 -60203 -67832 -295283 19326 46845 -7126 -57568 13479 51002 196097 94212 53662 -278574
15537 -26161 79452 34337 181968 315254 261599 -65986 141125 15471 18422 127697 -105620
15525 150890 -119455 -153122 -86760 -95942 -82922 62783 -98652 -80020 -343954 -5221 -165800
15514 -165800 -3055 10770 106789 -97290 -71566 68393 52804 8920 -97504 134267 -83045 -90250
15502 -90250 53460 -72693 137178 -85299 -174298 110148 -281680 -132142 -141303 26958 -70298
$$ packed form
15585a10266c3582n11151a49277B98293c2709J808k63819A31760b30673O334j409
15574b25748h9829j12681F3937N4921a40285C39498i3270o498d9440l29992I7357
15562D7360K57794D4530J13167p2739A7754b06670C1495J00513B5198h4919A79193
15550f0203p629k27451A9326K7519g126n0442A3479L7523J45095I4212m0550b78574
15537b6161G9452C4337J47631J33286n3655f5986A41125A5471K951J09275a05620
15525A50890a19455l3667O6362r182J3020F2783i8652J8632k63934e221j60579
15514a65800c055A0770R6019i7290K5724F8393j5589H920i7504A34267h3045p205
15502i0250E3460g2693A37178h5299q8999A10148b81680a32142r161B6958g0298
$$ plain form
15490 -141414 25265 -16520 22259 -316001 79151 84361 270556 162338 -281866 87831 224797
15479 224797 -69422 316843 146904 150436 199650 -34214 103590 -153158 -42354 -32511 -264344
15468 -264344 198663 6817 -50752 49541 -21145 135326 309629 -43165 -43121 -305075 -248069
15457 -248069 301119 341407 -158118 39517 173160 68097 -416317 162181 19010 -1158 79212
15445 -263033 194428 131812 -188391 210830 143358 -104178 155032 62153 -95198 -57984
15435 -57984 402628 51528 133337 -2165 90476 -45707 19384 -358399 88441 36646 -141440
15423 -36312 -193231 -287183 64709 11956 -200968 142360 13903 259271 -21748 -78065 158970
15411 -22547 -244993 -255069 -144443 -28984 -28429 98986 -50384 54862 -156881 -60653 99182
$$ packed form
15490a41414B5265a6520B2259c16001G9151N210J86195j08218b81866H7831J36966
15479B24797f9422C16843A46904L532M9214c4214A03590a53158d2354R843k31833
15468b64344A98663F817e0752D9541b1145A35326J74303d3165M4k61954N7006
15457b48069C01119M0288a58118C9517J33643F8097d16317A62181A9010a158G9212
15445b63033A94428o2616a88391B10830o7472a04178A55032F2153i5198L7214
15435e7984D02628E1528Q1809b165I0476d5707A9384c58399H8441C6646a41440
15423c6312j56919r3952F4709A1956b00968A42360A3903K45368b1748n6317A58970
15411b2547k22446j0076J10626b8984N55I8986e0384E4862a56881f0653I9182
$$ plain form
15399 61046 -135195 74645 -414458 -18959 22380 -150424 35742 -77006 56079 -86412 -66420
15388 -66420 -208122 40589 -54213 -74369 42030 -27688 105072 74020 5537 -272499 -3578
15376 -18294 -190032 309518 337579 54083 76212 272495 2074 211507 -57527 196908 -241110
15364 117291 144688 -372477 147490 -94155 26451 -23266 251168 109044 133471 -153017
15353 60097 -23676 -243355 -299542 90006 -96659 -99305 -65525 -277533 -63304 40088 -216012
15341 20194 107493 -3793 68309 90494 477555 -250162 -211592 214913 303089 -45251 -36494
15330 -36494 159880 44696 -9741 -161249 -26738 -36595 1700 476061 13550 -42161 -11221 106873
15317 72223 -309787 -47185 -38701 149180 69056 59834 27961 20245 304806 59329 -114766
$$ packed form
15399F1046a35195G4645d14458a8959B2380a50424C5742g7006E6079h6412J9992
15388f6420j41702D0589e4213k0156D2030b7688A05072l1052E537b72499c578
15376a8294j71738C09518K8061E4083K2129J96283B074K09433e7527A96908b41110
15364A17291K7397c72477A47490i4155B6451b3266B51168A09044K4427a53017
15353F0097b3676k19679n6187I0006i6659k646L3780k12008f3304D0088b16012
15341B0194Q7299c793F8309K2185L87061b50162L8570B14913Q8176d5251Q757
15330c6494A59880D4696i741j51508b6738r857A700M74361A3550d2161a1221A06873
15317G2223c09787d7185Q484A49180F9056r222B7961p716K84561E9329a14766
$$ plain form
15305 260142 140165 -79607 -3546 -35226 -170825 89047 55977 21455 404424 202303 -189767
15293 -108480 -11064 -87340 110034 111660 -188413 26079 111740 -90682 -260180 146895 156020
15282 156020 140633 -59161 90037 73019 -98585 151854 113912 374479 -117555 -39739 135795
15270 283880 153830 79706 60656 127023 311166 388797 -196908 194563 112671 36115 135161
15259 135161 -37034 -5771 66032 412703 120146 114191 -264594 381341 243932 390205 828420
15248 828420 1799189 1093421 1495214 990205 557191 93418 -27340 240508 -231873 -39163
15237 -118773 -1714 42685 1131 32297 -105383 -86099 -44222 143783 -107470 168412 125529
15226 125529 211415 -72448 -11638 167539 -140320 1280 -82456 445236 447925 -205964 22149
$$ packed form
15305B60142j19977g9607c546l1680j35599H9047l3070B1455L82969k02121a89767
15293a08480a1064p6276A10034J626a88413B6079Q5661i0682j69498A46895R125
15282A56020j5387e9161I0037j7018i8585A51854l7942K60567a17555c9739A35795
15270B83880j30050p4124j9050O6367J84143P7631a96908A94563q1892C6115R9046
15259A35161c7034e771F6032L46671A20146n955b64594C81341j37409J46273M38215
15248H28420R70769p05768M01793n05009m33014I3418b7340B40508b31873c9163
15237a18773a714D2685A131L1166a05383J9284M1877A43783a07470A68412m2883
15226A25529Q5886g2448a1638A67539a40320A280h2456D45236K689b05964B2149
$$ plain form
15214 107812 127789 375245 115461 124515 78238 -173539 168811 -147667 -394636 -180268
15203 91773 34616 161509 -144724 63616 8125 -129403 -136577 210849 452572 399588 20928
15191 355325 107357 -104089 306698 -63430 278611 160187 178679 182366 -116564 220263
15180 229389 274334 69502 222805 291290 92745 -37216 177001 -90823 225801 -19851 36838
15168 392683 4454 47148 80020 90535 -112498 -59900 -60098 -22447 313819 451646 79358
15156 235187 -116005 -79433 18601 -2221 274111 -64956 -155751 214388 188661 83353 -58815
15144 -38568 78581 -83877 117676 155226 -137824 165894 128548 81441 -51204 336555 -19638
15132 466725 266674 477908 212352 22145 218001 110733 -74507 334662 157034 -106007
$$ packed form
15214A07812J9977K47456A15461R054m6277a73539A68811a47667k46969a80268
15203I1773C4616J26893a44724F3616H125a29403p174B10849K41723n2984B0928
15191C55325A07357a04089C06698f3430B78611j18424J8492L687a16564B20263
15180B29389M4945F9502J53303O8485I2745c7216A77001i0823B25801a9851C6838
15168C92683D454M2694L2872J0515a12498N2598j98b2447C13819J37827G9358
15156B35187a16005L6572A8601b221B74111f4956r0795B14388k5727H3353e8815
15144c8568G8581h3877A17676L7550a37824A65894l7346m7107e1204C36555a9638
15132D66725k00051K11234B12352B2145J95856j07268g4507C34662A57034a06007
$$ plain form
15121 49694 81879 311821 158285 132102 443975 413855 272403 234803 365711 2121 -344996
15109 -147372 556731 133210 156908 384614 -84360 290779 418359 -93719 31496 351478
15099 351478 166620 91845 159165 150274 -114966 -43307 125127 188112 64271 339910 293260
15088 293260 106650 -97757 129792 -89357 197446 153355 140170 77191 281271 273738 314047
15077 314047 -117049 87110 114555 81290 304649 -138818 299075 466230 123275 154327
15067 154327 419673 135252 282766 42460 346571 375854 485584 269783 8084 95301
15057 95301 128057 351470 -21270 139155 -78606 199678 255506 179481 219504 -233578 334614
15045 285902 260307 200328 57842 320247 101865 231918 -132531 143268 21118 38430
$$ packed form
15121D9694L2185K29942j53536k6183L11873l0120j41452l7600J30908B121c44996
15109a47372E56731A33210K3698K27706h4360B90779J27580i3719C1496L19982
15099C51478A66620p4775O7320q891a14966d3307A25127O2985F4271K75639m6650
15088B93260A06650i7757A29792h9357A97446m4091j3185o2979K04080p533M0309
15077C14047a17049H7110K7445l3265K23359a38818B99075J67155A23275L1052
15067A54327K65346A35252J47514D2460L04111K9283J09730k15801H084Q7217
15057I5301L2756K23413b1270A39155g8606A99678N5828p6025M0023b33578C34614
15045B85902k5595n9979E7842K62405A01865J30053a32531A43268B1118J7312
$$ plain form
15035 38430 377623 59049 -153347 30861 118592 166410 273846 77259 283726 13862 38298
15024 38298 253426 265624 278871 68692 226381 699729 41316 35979 395218 185311 187469
15013 187469 -159567 160986 134672 -1066 -101014 364785 -50434 188364 153997 33205 97524
15002 97524 311226 72139 188114 154135 189326 169790 162334 -90571 52396 520034 448736
14991 448736 536531 182683 -19092 82068 458345 420764 183239 123454 143122 74873 124986
14980 124986 27318 492387 155155 209595 426414 66451 95235 584800 220066 421313
14970 421313 266600 12412 207257 356589 394970 223980 389140 345993 310062 189185
14960 189185 205737 -218481 33968 82652 158529 318221 150938 246253 274150 197842 126774
$$ packed form
15035C8430L39193E9049a53347C0861Q7731M7818J07436G7259K06467A3862K4436
15024C8298K15128J2198J3247F8692J57689M73348D1316n337L59239A85311K158
15013A87469a59567A60986k6314a066r9948C64785e0434A88364l4367C3205O4319
15002I7524K13702G2139J15975l3979L5191j9536p456i0571E2396M67638p1298
14991D48736Q7795A82683a9092H2068L76277l7581A83239n9785J9668o8249N0113
14980A24986B7318M65069A55155N4440K16819F6451K8784M89565B20066K01247
14970D21313j54713A2412J94845J49332L8381j70990J65160m3147l5931j20877
14960A89185J6552b18481C3968M8684P5877J59692A50938R5315K7897p6308p1068
$$ plain form
14949 126774 150703 214815 90275 169030 344382 314427 535440 316852 40599 -9338 381200
14937 230475 321145 276400 219505 461016 301484 457854 492144 260853 221357 461050
14927 461050 132859 318663 103195 96519 542621 480884 305112 262760 363932 381188
14917 381188 431551 122355 607831 170276 -72354 409550 490602 359327 90895 346694
14907 346694 390554 -177897 281542 389895 192401 357401 -209820 307755 159657 341416
14897 341416 209093 558786 172233 442972 158208 352504 251895 178732 401066 190983
14886 225538 556124 541579 293526 202954 120531 598587 714963 326612 325633 369778 127017
14874 464440 230997 226037 270155 157285 600187 294844 257665 -17047 57637 152264 333793
$$ packed form
14949A26774K3929O4112I0275P8755J75352k9955K21013k18588D0599i338C81200
14937B30475R0670m4745n6895K41511j59532J56370L4290k31291l9496K39693
14927D61050A32859J85804A03195o676M46102o1737j75772m2352J01172J7256
14917C81188N0363A22355M85476A70276g2354D09550Q1052j31275I0895K55799
14907C46694M3860a77897B81542J08353A92401J65000b09820C07755j48098J81759
14897C41416j32323L49693A72233K70739A58208J94296j00609p3163K22334A90983
14886B25538L30586j4545k48053r0572q2423M78056J16376C26612r79M4145A27017
14874D64440B30997m960M4118j12870M42902B94844l7179a7047E7637R4627J81529
$$ plain form
14863 333793 660551 542825 481194 116310 402102 493690 295388 483847 461696 472542
14853 472542 415328 493528 511923 395445 611617 496050 271846 846228 268689 541115
14843 541115 424855 540056 477718 405739 263343 385796 721212 736111 337519 234767
14833 234767 584285 657153 300816 459176 583513 452652 516488 326730 414713 445341
14823 445341 760823 627544 413364 597168 445193 698766 535205 511956 584710 557534
14813 557534 533132 837283 571732 493658 554569 604588 601869 591119 729674 812149 344519
14801 588204 540737 564795 445672 123815 557832 607373 458575 476294 532035 596631 203309
14789 596713 613746 345554 600128 523923 489724 273087 282514 571627 667211 653404 720827
$$ packed form
14863C33793L26758j17726o1631A16310K85792R1588j98302J88459k2151J0846
14853D72542n7214P8200J8395j16478K16172j15567k24204N74382B68689K72426
14843E41115j16260J15201o2338p1979j42396J22453L35416J4899C37519j02752
14833B34767L49518P2868C00816J58360J24337j30861O3836j89758Q7983L0628
14823D45341L15482j33279k14180J83804j51975K53573j63561k3249P2754k7176
14813E57534k4402L04151k65551p8074O0911N0019k719j0750J38555Q2475C44519
14801E88204m7467K4058j19123A23815M34017M9541j48798J7719N5741O4596B03309
14789E96713J7033k68192K54574p6205l4199k16637R427K89113R5584j3807O7423
$$ plain form
14778 720827 509697 392579 870994 870628 500243 302675 674818 375493 422917 385351
14768 385351 911735 520402 621085 566526 631244 483895 689742 742635 652575 823795
14758 823795 619779 814386 426536 822079 536703 829890 912885 932442 732095 667309
14748 667309 591449 430034 832911 788297 470564 1182779 760215 473884 920399 858355
14738 858355 812071 579724 780689 792969 632795 944138 504048 747325 818774 596644
14728 596644 464255 794497 925533 792808 820087 571662 648369 731630 891316 789042
14718 789042 907293 840912 733524 697707 1029336 848952 959796 782911 686381 1212959
14708 1212959 538599 854928 750332 889730 499930 770267 658122 730645 878664 744459
$$ packed form
14778G20827k11130j17118M78415l66l70385j97568L72143k99325M7424l7566
14768C85351N26384l91333J00683n4559O4718j47349K05847N2893r0060J71220
14758H23795k04016J94607l87850L95543k85376K93187Q2995J9557k00347o4786
14748F67309p5860j61415M02877m4614l17733P12215m22564k86331M46515o2044
14738H58355m6284k32347K00965J2280j60174L11343m40090K43277P1449k22130
14728E96644j32389L30242J31036j32725K7279k48425P6707Q3261J59686j02274
14718G89042J18251o6381j07388l5817L31629j80384J10844j76885r6530N26578
14708A212959E38599L16329j04596J39398l89800K70337j12145P2523J48019j34205
$$ plain form
14698 744459 798039 968646 565850 1220436 959640 1167089 1015784 721405 1080975 1043294
14688 1043294 858407 801468 1016286 1150178 907396 1012905 922190 962073 1425916 689742
14677 764477 823903 918574 770524 1192726 961463 1240452 978449 1243717 1116838 1210442
14667 1210442 988647 1160962 1072762 1124799 1429188 1216901 1074454 1040392 1051724 1417753
14657 1417753 1015428 1087630 1052853 1402408 1191633 591941 858100 960362 1356260 1560653
14647 1560653 1448628 1344860 1204796 1090827 1172641 1334360 1306639 1289426 990423 1195376
14637 1195376 1268342 1231074 1480406 1731783 888226 1448143 1218888 1644222 1640106 1261116
14627 1261116 1563242 1292277 1021294 1392433 1227982 1432853 1520062 1358714 1633928 1382896
$$ packed form
14698G44459N3580J70607m02796O54586k60796K07449j51305k94379L59570l7681
14688A043294j84887n6939K14818J33892k42782J05509r0715L9883M63843F89742
14677G64477N9426R4671j48050M22202k31263K78989k62003K65268j26879R3604
14667A210442k21795J72315q8200N2037L04389k12287j42447l4062J1332L66029
14657A417753m02325P2202l4777L49555k10775E91941K66159J02262L95898K04393
14647A560653j12025j03768j40064j13969Q1814J61719k7721j7213k99003K04953
14637A195376P2966l7268K49332K51377q43557N59917k29255M25334m116l78990
14627A261116L02126k70965k70983L71139j64451K04871Q7209j61348K75214k51032
$$ plain form
14617 1382896 1361310 1509450 1701978 1576460 1092883 1475111 1505483 1527337 1612512 1525009
14607 1525009 1574030 1588765 1441397 1586664 1879430 1835726 1654807 1549235 1746673 1616377
14597 1616377 1858780 1875355 1827860 1527604 2041096 2122719 1585537 1784244 1538952 1932014
14587 1932014 1942833 1935151 2079492 1963647 1822338 1798002 2369218 2003186 2234494 1974348
14577 1974348 1863613 2237079 2098746 2208445 2155241 2406426 2351133 2080056 2318037 2081690
14567 2081690 2669446 2545417 2361825 2762118 2538453 2366830 3003223 2553551 2638723 2646484
14557 2646484 2810524 3209174 3250645 3805654 3645586 4245817 5195547 5608383 7920507
14548 7920507 12173130 21258900 40430101 43242247 19629997 9263726 5005461 3380499
$$ packed form
14617A382896k1586J48140J92528j25518m83577L82228L0372K1854Q5175q7503
14607A525009M9021J4735j47368J45267K92766m3704j80919j05572J97438j30296
14597A616377K42403J6575m7495l00256N13492Q1623n37182J98707k45292L93062
14587A932014J0819p682J44341j15845j41309k4336N71216l66032K31308k60146
14577A974348j10735L73466j38333J09699n3204K51185n5293k71077K37981k36347
14567B081690N87756j24029j83592M00293k23665j71623O36393m49672Q5172P761
14557B646484J64040L98650M1471N55009j60068O00231R49730M12836K312124
14548G920507M252623R085770J9171201K812146A9629997I263726m258265j624962
$$ plain form
14540 3380499 2598116 2286729 2184470 1935332 1890657 2327038 2064869 2219691 1748870 2164545
14530 2164545 2228203 2208352 2330685 2312998 2281138 2389425 2328206 2346621 2654671 2484436
14520 2484436 2743339 2536239 2621903 2456132 2882608 2946379 2743232 2666367 2888874 2834160
14510 2834160 2719299 2870749 2826448 2961926 2898989 2690356 2944707 2982264 3303818 3074077
14500 3074077 3272798 3408465 3258211 3203233 3488503 3150182 3380356 3342165 3513945 3350465
14490 3350465 3495374 3882366 3717599 3612503 3607840 3826549 3943515 3885898 3823608 4130582
14480 4130582 3821692 3847614 4047779 4218106 4205884 4072934 4025385 4156913 4414550 4411489
14470 4411489 4445476 4463112 4350343 4668143 4839779 4500385 4566651 4878169 4704954 4741814
$$ packed form
14540C380499p82383l11387j02259k49138m4675M36381k62169J54822m70821M15675
14530B164545O3658j9851J22333j7687l1860J08287o1219J8415L08050j70235
14520B484436K58903k07100Q5664j65771M26476O3771k03147p6865K22507n4714
14510B834160j14861J51450m4301J35478o2937k08633K54351L7557L21554k29741
14500C074077J98721J35667j50254n4978K85270l38321K30174l8191J71780j63480
14490C350465J44909L86992j64767j05096m663K18709J16966n7617o2290L06974
14480D130582l08890K5922K00165J70327j2222j32950m7549J31528K57637l061
14470D411489L3987J7636j12769L17800J71636l39394O6266L11518j73215L6860
$$ plain form
14460 4741814 4777781 4859776 5019654 5117553 5168551 5332513 5317376 5459169 5685107 5271627
14450 5271627 5429844 5510573 5484256 5608046 5722845 5762471 6134598 6001460 6235871 6163734
14440 6163734 6294278 6234783 6017463 6346400 6545853 6847195 6516103 6784467 6993496 7404769
14430 7404769 7175716 7058295 7591833 7547355 7753733 7243869 7893443 7945238 7846487 7918150
14420 7918150 8492094 8100631 8217940 8439575 8658980 8933850 8976613 8964735 9344350 9519843
14410 9519843 9242560 9663494 9818603 9761595 9668796 10219458 10513190 10598297 10605298 10530028
14400 10530028 10906328 10923205 11388900 11385169 11830773 11776168 11920411 12166872 12401072 12708375
14390 12708375 12699649 13327927 13095412 13589779 13599532 13816385 13951576 14474185 14626739 14831100
$$ packed form
14460D741814L5967Q1995J59878R7899N0998J63962j5137J41793K25938m13480
14450E271627J58217Q0729k6317J23790J14799L9626L72127j33138K34411p2137
14440F163734J30544n9495k17320L28937J99453L01342l31092K68364K09029M11273
14430G404769k29053j17421N33538m4478K06378n09864O49574N1795r8751P1663
14420G918150N73944l91463J17309K21635K19405K74870M2763j1878L79615J75493
14410I519843k77283M20934J55109n7008r2799N50662K93732Q5107P001p5270
14400A0530028L76300J6877M65695l731M45604n4605J44243K46461K34200L07303
14390A2708375q726O28278k32515M94367R753K16853J35191N22609J52554K04361
$$ plain form
14380 14831100 15461039 15332498 15776881 16105288 16691580 16272803 16920534 17579952 17789387
14371 17789387 18036902 18555249 18490926 19252115 19378003 19926781 20278460 20465532 21223231
14362 21223231 21472974 22149556 22432780 22809866 23455891 23747387 24510298 25160663 25543043
14353 25543043 26373373 26967232 27661342 28088646 28741370 29538495 30369185 31239597 32153373
14344 32153373 32728686 33724107 34255016 35629174 36338560 37126787 38298030 39824046 40825733
14335 40825733 41642368 42945413 44257724 45566293 47041206 48569694 49936560 51659486
14327 51659486 53454293 55251474 57012010 58949288 61073664 62894886 65031730 67194779
14319 67194779 69689898 71830735 75001136 77528052 80439262 83811377 87340781 90175292
$$ packed form
14380A4831100O29939j28541M44383L28407N86292m18777O47731O59418K09435
14371A7789387K47515N18347o4323P61189J25888N48778L51679J87072P57699
14362B1223231K49743O76582K83224L77086O46025K91496P62911O50365L82380
14353B5543043Q30330N93859O94110M27304O52724P97125Q30690Q70412R13776
14344C2153373N75313R95421N30909J374158P09386P88227J171243J526016J001687
14335D0825733Q16635J303045J312311J308569J474913J528488J366866J722926
14327E1659486J794807J797181J760536J937278K124376J821222K136844K163049
14319F7194779K495119K140837L170401K526916K911210L372115L529404K834511
$$ plain form
14311 90175292 93952767 97931953 101958044 106058661 110192764 115249605 119989556 125393299
14303 125393299 130862958 136763965 142885868 149268865 156266425 163357764 170973714 179614456
14295 179614456 188033729 196998134 207049388 217031889 227531941 238355812 249618905
14288 249618905 261770004 274313167 287210097 300160989 313499050 327320489 341141252
14281 341141252 354619401 368024483 381114543 393848890 405512441 416145474 425452358
14274 425452358 432923068 437320588 439444527 439271200 439308750 438855999 434231563 430063106
14266 430063106 424738683 417061741 408796601 398292849 386298329 373719757 360542215
14259 360542215 346358857 331775942 317398182 303145824 289811069 276333515 263402134
$$ packed form
14311I0175292L777475L979186M026091M100617M134103N056841M739951N403743
14303A25393299N469659N901007O121903O382997O997560P091339P615950Q640742
14295A79614456Q419273Q964405J0051254R982501J0500052J0823871J1263093
14288B49618905J2151099J2543163J2896930J2950892J3338061J3821439J3820763
14281C41141252J3478149J3405082J3090060J2734347J1663551J0633033R306884
14274D25452358P470710M397520K123939j73327L7550m52751m624436m168457
14266D30063106n324423p676942q265140j0503752j1994520j2578572j3177542
14259C60542215j4183358j4582915j4377760j4252358j3334755j3477554j2931381
$$ plain form
14252 263402134 250445450 238612161 227069229 216153752 205720342 195980364 186693735
14245 186693735 177721456 169766971 161862408 154606545 147251343 140795249 134571680 128915403
14237 128915403 123589828 118039630 112908144 108256258 103799931 99654773 96149205 92442809
14229 92442809 88942896 85376713 81555348 78744324 75956445 73125056 70418132 67953843
14221 67953843 65729638 63868032 61515623 59475347 57199847 55800566 53691607 52467447
14213 52467447 51134742 49408227 47594370 46371911 45164195 43634949 43625563 41705287
14205 41705287 40457538 39288425 38120040 37205288 36174713 35704569 34661763 33251127
14197 33251127 32283250 31680162 30799700 30244745 29561413 28698211 28102001 27488474 26680697
$$ packed form
14252B63402134j2956684j1833289j1542932j0915477j0433410r739978r286629
14245A86693735q972279p954485p904563p255863p355202o456094o223569n656277
14237A28915403n325575n550198n131486m651886m456327m145158l505568l706396
14229I2442809l499913l566183l821365k811024k787879k831389k706924k464289
14221F7953843k224205j861606k352409k040276k275500j399281k108959j224160
14213E2467447j332705j726515j813857j222459j207716j529246r386j920276
14205D1705287j247749j169113j168385r14752j030575m70144j042806j410636
14197C3251127r67877o03088q80462n54955o83332q63202n96210o13527q07777
$$ plain form
14188 26680697 25937848 25393852 24840605 24375083 23750404 23029870 22997612 22505343 21819899
14179 21819899 21313306 20626799 20752657 20262093 19672584 19407087 19195530 18463142 18224434
14170 18224434 17558093 17603265 17159556 16879168 16740981 16231969 16105278 15609167 15545627 15065536
14160 15065536 15041240 14596662 14119345 13974319 13688571 13605999 13249678 12794681 12662049 12830541
14150 12830541 12511262 12156403 12230106 12141524 11426707 11411720 11512353 11189614 10878780 10791518
14140 10791518 10752881 10486615 10534746 10091630 10164832 9746995 9542508 9576530 9671041 9371317
14130 9371317 9076871 9439820 8977449 8724623 8690653 8736356 8334898 8422667 8392666 8284482
14120 8284482 8024099 7924315 7806992 7301505 7473003 7449066 7474357 7312364 7079721 7184279
$$ packed form
14188B6680697p42849n43996n53247m65522o24679p20534l2258m92269o85444
14179B1819899n06593o86507J25858m90564n89509k65497k11557p32388k38708
14170A8224434o66341M5172m43709k80388j38187n09012j26691m96111o3540m80091
14160A5065536k4296m44578m77317j45026k85748q2572l56321m54997j32632J68492
14150A2830541l19279l54859P3703q8582p14817j4987J00633l22739l10834q7262
14140A0791518l8637k66266M8131m43116P3202m17837k04487L4022R4511k99724
14130I371317k94446L62949m62371k52826l3970M5703m01458Q7769l0001j08184
14120H284482k60383r9784j17323n05487J71498k3937K5291j61993k32643J04558
$$ plain form
14110 7184279 6969977 6747322 7059435 6746191 6822394 6496910 6646575 6523710 6628564 6250204
14100 6250204 6332766 6367176 5857560 6069077 6070145 5714825 6063027 5844784 5667084 5723978
14090 5723978 5565849 5724722 5798715 5394847 5334155 4982520 5040072 5203704 4710712 4841228
14080 4841228 4858606 4735933 4726881 5080708 4347459 4589684 4850744 4627901 4636359 4403532
14070 4403532 4555515 4538030 4383953 4412318 4323927 4277358 4533404 4371440 4233570 4110731
14060 4110731 3999703 4019448 4021919 4339401 4077032 4172817 3908486 3826057 3748627 3999438
14050 3999438 3640501 3543481 3576427 3518029 3821271 3594294 3419860 3353587 3407062 3411877 3093759
14039 3093759 3103439 3199033 3424179 2849582 3282794 3300488 3027719 3209223 3323211 3126855
$$ packed form
14110G184279k14302k22655L12113l13244P6203l25484J49665j22865J04854l78360
14100F250204Q2562L4410n09616K11517J068l55320L48202k18243j77700N6894
14090E723978j58129J58873P3993m03868o0692l51635N7552J63632m92992J30516
14080D841228J7378j22673r052L53827p33249K42225K61060k22843Q458k32827
14070D403532J51983j7485j54077K8365q8391m6569K56046j61964j37870j22839
14060D110731j11028J9745K471L17482k62369R5785k64331q2429p7430K50811
14050C999438l58937r7020L2946n8398L03242k26977j74434o6273N3475M815l18118
14039C093759R680R5594K25146n74597M33212J7694k72769J81504J13988j96356
$$ plain form
14029 3126855 2987525 2989444 2776623 3063275 3059053 2927111 3024467 3180227 2758790 2682879
14019 2682879 2811287 3011466 2896973 2440845 2747276 2666053 2840095 2897144 2546396 2455068
14009 2455068 2284548 2435059 2590006 2203875 2277289 2286483 2429510 2242869 1901970 2109505
13999 2109505 2186003 2305868 1962151 2109326 1985298 2138788 2039140 2425942 2312380 2799963
13989 2799963 3749504 6417849 13754543 31940309 45292768 24707754 13862180 8825194
13981 8825194 6327044 5057327 4189159 3844232 3656206 3286570 2994104 2982316 2780867
13972 2780867 2426643 2522788 2615263 2552505 2474526 2687551 2449152 2476049 2174492 2340056
13962 2340056 2242970 2371592 2345832 1988045 1941691 2144028 2259222 1736703 2187069 1988542
$$ packed form
14029C126855j39330J919k12821K86652m222j31942R7356J55760m21437p5911
14019B682879J28408K00179j14493m56128L06431q1223J74042N7049l50748r1328
14009B455068j70520J50511J54947l86131P3414R194J43027j86641l40899K07535
13999B109505P6498J19865l43717J47175j24028J53490r9648L86802j13562M87583
13989B799963R49541K668345P336694J8185766J3352459k0585014j0845574n036986
13981H825194k498150j269717q68168l44927j88026l69636k92466j1788k01449
13972B780867l54224R6145R2475o2758p7979K13025k38399K6897l01557J65564
13962B340056r7086J28622k5760l57787m6354K02337J15194n22519M50366j98527
$$ plain form
13952 1988542 2165624 2020970 1950066 1663687 1849810 2143281 1952569 1875963 1868999 1537602
13942 1537602 1800988 1717444 1526152 1755580 1843802 1954251 1884986 1706355 1364589 1681659
13932 1681659 1798181 1419351 1817534 1663724 1420748 1853136 1555684 1842405 1505035
13923 1505035 1767240 1713162 1570608 1941847 1410452 1491029 1678456 1379596 1364592 1322099
13913 1322099 1330710 1508112 1373582 1573179 1328981 1522320 1582553 1131543 1128356 1287085
13903 1287085 1396668 1422980 1616519 1547715 1128303 1237488 1336958 1394776 1491085 1487649 1206133
13892 1206133 1351553 1292524 1235231 979013 1154773 1143513 1447832 1107959 1442563 1099744
13882 1099744 1305381 1337324 916086 1366732 1385086 1306146 1059728 1098972 913400 1244659
$$ packed form
13952A988542J77082j44654p0904k86379J86123K93471j90712p6606o964l31397
13942A537602K63386q3544j91292K29428Q8222J10449o9265j78631l41766L17070
13932A681659J16522l78830L98183j53810k42976M32388k97452K86721l37370
13923A505035K62205n4078j42554L71239n31395Q0577J87427k98860j5004m2493
13913A322099Q611J77402j34530J99597k44198J93339O0233m51010l187J58729
13903A287085J09583K6312J93539o8804m19412J09185R9470N7818R6309l436k81516
13892A206133J45420n9029n7293k56218J75760j1260L04319l39873L34604l42819
13882A099744K05637L1943m21238M50646J8354p8940k46418L9244j85572L31259
$$ plain form
13872 1244659 1371251 1299900 897112 1122333 1428720 1002340 1484279 1314712 1224048 1337011
13862 1337011 1105536 1096551 1190148 1061926 1086445 1097249 1230615 983419 1075546 1395978
13852 1395978 968029 1356314 829441 1145565 1536299 1139234 1183727 796635 1387873 749627
13842 749627 1136064 881223 820474 1082772 1018402 1143419 1204233 866045 1128485 1202893
13832 1202893 944858 957195 822089 1240335 759160 816942 847190 800268 885537 1115567
13822 1115567 946953 1301536 697085 1082284 872156 863184 952325 551223 1027084 838975
13812 838975 867071 894673 829508 891981 841453 932856 586257 876405 645048 439705 1158561
13801 1158561 1014805 840222 1025104 648703 708399 694771 1037878 893638 648068 662935
$$ packed form
13872A244659J26592p1351m02788K25221L06387m26380M81939j69567r0664J12963
13862A337011k31475q985R3597j28222K4519J0804J33366k47196R2127L20432
13852A395978m27949L88285n26873L16124L90734l97065M4493l87092N91238o38246
13842G49627L86437k54841o0749K62298o4370J25017O0814l38188K62440P4408
13832A202893k58035J2337j35106M18246m81175N7782L0248m6922Q5269K30030
13822A115567j68614L54583o04451L85199k10128q972Q9141m01102M75861j88109
13812H38975K8096K7602o5165O2473n0528R1403l46599K90148k31357k05343P18856
13801A158561j43756j74583J84882l76401N9696j3628L43107j44240k45570J4867
$$ plain form
13791 662935 880650 710723 933273 486977 754974 671303 665359 709451 1001221 754408
13781 754408 581203 982969 818221 656711 680252 617906 936897 833079 782542 412934
13771 412934 880682 623232 604104 779079 683622 763125 626745 587973 866012 1056638
13761 1056638 755513 615557 435682 642084 664081 655470 683893 299617 612712 502375
13751 502375 190836 582552 751547 552137 781332 423829 725704 868888 657138 636814
13741 636814 557597 627280 333700 472554 520766 547162 937139 455467 595623 611863
13731 611863 607707 672371 378340 701549 532224 618858 746415 598423 710096 469910
13721 469910 451857 691842 434541 760991 184489 470437 566556 609754 644618 531952
$$ packed form
13791F62935K17715j69927K22550m46296K67997q3671n944M4092K91770k46813
13781G54408j73205M01766j64748j61510K3541o2346L18991j03818n0537l69608
13771D12934M67748k57450j9128J74975r5457P9503j36380l8772K78039J90626
13761A056638l01125j39956j79875K06402K1997q611K8423B99617L13095j10337
13751E02375A90836L91716J68995j99410K29195l57503L01875J43184k11750k0324
13741F36814p9217O9683k93580J38854M8212K6396L89977D55467J40156J6240
13731F11863m156O4664k94031L23209j69325Q6634J27557j47992J11673k40186
13721D69910j8053K39985k57301L26450A84489K85948R6119M3198L4864j12666
$$ plain form
13711 531952 679470 529886 612729 777304 380659 685003 489269 659538 523728 540493
13701 540493 739237 716128 651520 504185 290506 725127 581594 475429 525907 201334
13690 532213 469527 550939 412322 391260 704574 488769 584508 566361 591442 641966 325704
13679 325704 441827 563221 513392 754047 577606 607475 567629 901407 646866 636499
13669 636499 469244 674994 326486 444407 310265 210710 607862 323863 428182 580697
13659 580697 596619 339211 516481 392893 430069 599677 529411 489402 569809 559556 421669
13648 421669 450944 336099 322866 184304 496608 520208 303020 469046 283906 330940
13638 330940 514474 628817 318854 357531 661153 123619 577980 126088 464288 337173
$$ packed form
13711E31952J47518j49584Q2843J64575C80659L04344j95734J70269j35810J6765
13701E40493J98744k3109o4608j47335k13679M34621j43533j06165N0478B01334
13690E32213o2686Q1412j38617k1062L13314k15805R5739j8147K5081N0524l16262
13679C25704J16123J21394m9829K40655j76441K9869l9846L33778k54541j0367
13669F36499j67255K05750C26486J17921j34142r9555L97152k83999J04319J52515
13659E80697J5922k57408J77270j23588L7176J69608p0266m0009Q0407j0253j37887
13648D21669K9275j14845j3233j38562L12304K3600k17188J66026j85140M7034
13638C30940J83534J14343l09963L8677L03622A23619M54361A26088L38200j27115
$$ plain form
13628 337173 458022 914388 333399 528959 527065 176653 210526 80102 631228 393112
13618 393112 635444 296748 349438 142434 580692 455597 244197 47794 616441 526932
13608 526932 349273 401757 495149 538688 340683 356047 620196 119276 264145 347641
13598 347641 259969 151873 573273 592824 210378 331201 173380 515321 446773 330091
13588 330091 433524 564620 275182 430643 601445 391786 297808 262689 232157 166128
13578 166128 498222 274749 417312 671972 554113 479451 -103927 181264 -114005 272162
13567 317823 -118433 555128 424649 324132 579375 284729 369190 495194 78965 560618
13557 560618 615877 102499 374705 365032 193410 -197910 354001 424791 370708 416714 342722
$$ packed form
13628C37173J20849M56366C33399J95560j894A76653L3873H0102N51126k38116
13618C93112K42332B96748N2690A42434M38258j25095k11400D7794N68647q9509
13608E26932j77659N2484R3392M3539j98005J5364K64149A19276J44869Q3496
13598C47641q7672j08096M21400J9551B10378J20823j57821L41941o8548j16682
13588C30091J03433J31096B75182J55461J70802k09659r3978l5119l0532o6029
13578A66128L32094k23473J42563K54660j17859p4662a03927A81264a14005B72162
13567C17823a18433E55128j30479j00517K55243B84729Q4461J26004G8965M81653
13557E60618N5259A02499K72206r673j71622a97910C54001P0790n4083M6006p3992
$$ plain form
13546 342722 42427 126151 348735 547759 62265 -93066 280079 396871 157035 -30463
13535 479611 458868 301520 407819 231234 65116 179946 226089 368252 169198 435217
13525 435217 247586 95550 166919 203631 403793 321363 438436 92907 275169 235898 144756
13514 144756 229636 194360 287242 261538 129670 552390 300198 237109 201295 421335 232291
13503 232291 222112 245619 437160 119710 127927 262430 308831 160778 359188 288698 389165
13492 389165 353151 416512 351087 437399 319186 454737 633000 241755 334375 -42815 368929
13480 67338 348904 309751 373385 389372 280634 409630 358710 473593 364975 65484 242929
13469 242929 173990 97429 274459 213541 264836 293476 467346 249308 190176 162200 66570
$$ packed form
13546C42722D2427Q3724K22584J99024F2265i3066B80079J16792A57035c0463
13535D79611k0743j57348J06299j76585F5116J14830M6143J42163A69198K66019
13525D35217j87631I5550P1369L6712K00162q2430J17073I2907J82262l9271r1142
13514A44756Q4880l5276R2882k5704A29670M22720k52192o3089l5814K20040j89044
13503B32291j0179K3507J91541A19710Q217J34503M6401j48053J98410p0490J00467
13492C89165l6014O3361o5425Q6312j18213J35551J78263B41755R2620d2815C68929
13480F7338K81566l9153O3634J5987j08738J28996n0920J14883j08618F5484J77445
13469B42929o8939p6561J77030o0918N1295K8640J73870k18038n9132k7976F6570
$$ plain form
13457 448040 350827 248043 -157252 240531 425140 649806 293118 13049 451453 113873
13446 118147 180927 85609 -197660 147939 66197 373460 93047 634181 42690 87361 259325
13435 259325 269591 345288 319147 -92273 -45325 -33249 97573 317328 328618 202637 65385
13423 129328 191391 217238 170016 223885 76649 387525 40197 57703 369766 69652 492710
13412 492710 195731 147875 292243 272508 233391 456127 153818 265104 377265 177346
13401 115179 77548 -32323 261448 107116 377348 411698 166299 135797 79402 233780
13391 233780 215006 15854 326142 351001 316137 70521 293365 157911 63636 255302 329740
13380 329740 18444 169923 101840 83571 498184 487023 368670 337213 210276 402474
$$ packed form
13457D48040r7213j02784a57252B40531J84609K24666B93118A3049M38404A13873
13446A18147O2780H5609a97660A47939F6197L07263I3047N41134D2690M4671J71964
13435B59325J0266P5697k6141i2273d5325J2076I7573K19755J1290j25981F5385
13423A29328O2063K5847m7222N3869G6649L10876D0197J7506L12063F9652M23058
13412D92710A95731m7856J44368j9735l9117K22736A53818J11286J12161A77346
13401A15179l7631c2323B61448A07116K70232L4350A66299l0502n6395J54378
13391B33780j8774A5854L10288K4859l4864G0521K22844j35454F3636J91666P4438
13380C29740A8444J51479o8083j8269M14613j1161j18353l1457j26937J92198
$$ plain form
13370 402474 278195 200768 222229 340562 467805 161754 196494 444239 82777 293896
13360 293896 257823 317564 204039 313739 -24880 307565 398879 -228121 164387 341129
13350 341129 417866 264083 -18251 116640 195529 282398 77496 231374 135628 155333 139243
13339 139243 576228 249145 379681 58974 250175 186380 -80750 290317 -7987 -21038 81614
13327 47100 341647 196799 261448 242103 125954 117752 209439 126955 431497 297209 183755
13316 183755 247386 84279 508035 -307354 342674 300990 -972 311749 33744 103077 249592
13305 249592 -22544 456687 227220 481372 319195 329071 298268 263702 430572 197123
13294 -283130 389802 317134 -51040 351353 170717 38245 327203 -60098 125419 -86718
$$ packed form
13370D02474j24279p7427K1461J18333J27243A61754L4740K47745H2777K11119
13360B93896l6073N9741j13525J09700b4880C07565R1314b28121A64387J76742
13350C41129P6737j53783a8251A16640P8889Q6869G7496J53878r5746J9705j6090
13339A39243M36985B49145J30536E8974J91201o3795h0750B90317g987j3051H1614
13327D7100K94547j44848O4649j9345j16149q202R1687q2484L04542j34288j13454
13316A83755O3631H4279M23756c07354C42674m1684i72C11749C3744O9333J46515
13305B49592b2544D56687B27220K54152j62177R876l0803l4566J66870A97123
13294b83130C89802p2668e1040C51353A70717C8245K88958f0098A25419h6718
$$ plain form
13283 386937 -356669 -69507 153089 -1364 106988 286580 132280 -49032 11455 23476 219717
13272 219717 254828 93142 -63274 301788 160089 -7303 14783 320086 -13100 -6249 77711
13260 238964 104125 295886 56600 -293217 73286 107683 -55643 62335 62805 127761 -50968
13248 566136 492612 377123 86216 97215 342403 -8582 279287 -118031 63484 17592 135074
13237 135074 -16298 -85062 -165820 163620 -74056 178361 -136097 -113717 497478 -62890 374834
13225 440415 165776 98152 149825 53939 77911 67406 -69970 165375 99036 74616 193762
13214 193762 153824 198185 -50298 45559 -63468 369853 239240 190597 382603 96994 -226901
13202 -56404 -201627 98354 96998 75214 201628 128249 29502 -235786 -81225 295150 73611
$$ packed form
13283C86937c56669f9507A53089a364A06988J79592A32280d9032A1455J2021J96241
13272B19717L5111I3142f3274C01788j41699g303A4783L05303a3100f249G7711
13260B38964A04125J91761E6600b93217G3286L4397e5643F2335M70O4956e0968
13248E66136p3524j15489H6216J0999K45188h582B79287a18031F3484A7592J17482
13237A35074a6298o8764q0758A63620g4056A78361a36097K2380D97478f2890C74834
13225D40415A65776o7624N1673E3939K3972j0505f9970A65375o6339k4420J19146
13214A93762l9938M4361e0298D5559f3468C69853j30613m8643J92006I6994b26901
13202e6404j45223I8354j356k1784J26414p3379B9502b35786h1225B95150G3611
$$ plain form
13190 108139 117843 -161588 -31270 218700 183109 128761 245536 315180 -24281 -189121 254056
13178 237794 596561 296817 293417 -25521 355126 467 154711 -45284 169028 -1729 11285
13166 339229 291425 216150 199739 -51206 91255 -61821 -190209 -55991 -252086 140186 50388
13154 -63539 83109 284432 270465 126433 89946 263555 31511 330789 -129220 14602 228578
13143 228578 -121794 -67190 33961 61241 311834 153624 -94487 45461 138906 -108175 246418
13131 323541 -173037 188073 248896 290698 228371 96445 -233677 -6092 -107948 5387 2476
13119 -94864 80700 -121267 89227 -183640 -254513 155630 40294 185959 -77265 218239 -186093
13107 -152641 -24326 175941 375443 94812 71877 -83075 -149490 -29057 252959 211056 139594
$$ packed form
13190A08139R704a61588c1270B18700l5591n4348J16775O9644b4281j64840B54056
13178B37794L58767B96817l400b5521C55126D67J54244d5284A69028a729A1285
13166C39229m7804p5275j6411e1206I1255f1821j28388e5991j96095A40186E0388
13154f3539H3109K01323j3967A26433l6487J73609C1511K99278a29220A4602K13976
13143B28578a21794N4604C3961K7280K50593A53624i4487D5461R3445a08175B46418
13131C23541a73037A88073O0823M1802o2327I6445b33677f092j01856E387B476
13119i4864H0700a21267H9227a83640p0873A55630D0294J45665g7265B18239a86093
13107a52641b4326A75941J99502I4812k2935h3075o6415b9057B52959m1903p1462
$$ plain form
13096 139594 9883 4791 274569 -18772 -668 160101 78835 64514 -56746 310794 -138236
13084 72728 -44387 -13772 -123779 150488 89758 318601 445862 228477 45417 331274
13074 331274 8411 -58642 141413 201932 246529 -104719 172586 126809 135671 402000 162727
13062 150649 10360 160914 47186 119479 54947 94289 -47921 48445 240271 362360 -2232
13050 258160 257401 218566 566726 95741 56397 146277 206709 390560 -249720 28933 -16241
13038 132272 97432 -222077 10803 252333 -23566 -17725 439639 133499 227527 694908 -11472
13026 51426 -255892 98369 25206 324052 92300 88916 102174 -28266 265511 -14680 248697
13014 5935 16568 355556 311323 197575 260153 -16783 235274 134957 -16241 185298 316881
$$ packed form
13096A39594I883D791K69778a8772f68A60101G8835j4321e6746C10794a38236
13084G2728d4387a3772j10007A50488o0730K28843J27261k17385D5417K85857
13074C31274H411e8642A41413O0519M4597a04719A72586m5777Q862K66329A62727
13062A50649A0360J50554D7186P2293E4947L9342d7921D8445J91826J22089b232
13050B58160p59l8835L48160I5741l9344Q9880O0432J83851b49720B8933a6241
13038A32272l4840b22077A0803K41530b3566N841D39639A33499R4028M67381a1472
13026E1426b55892I8369B5206K98846I2300l384J3258b8266B65511a4680B48697
13014E935J0633L38988m4233j13748O2578a6783B35274j00317a6241A85298J31583
$$ plain form
13003 316881 120253 49663 68634 213542 -104198 -110831 222869 -43076 -177516 -57100 68276
12991 -69675 297216 10896 -18183 36971 225435 129416 -260472 -35413 188312 387396 295227
12980 295227 126573 270146 -221727 220537 264882 -46230 -39587 74739 -94104 -269058 141060
12968 -110800 338314 -97830 34349 172754 -208212 252325 52367 47578 56888 123683 252445
12957 252445 60956 -314478 105770 86384 -66740 -13783 15269 163816 54956 299575 266662
12946 266662 -196314 113439 -166065 -183035 -74729 -64560 -3206 201038 -379666 -16427 -79475
12935 -79475 -201467 165087 -133184 78273 -38824 58995 -207991 -26499 59942 175054 215536
12924 215536 108129 125546 395117 478625 236202 -275470 57013 264545 -118161 4511
$$ packed form
13003C16881A20253D9663J8971J44908a04198o633B22869d3076j34440e7100F8276
12991f9675B97216A0896a8183C6971J88464r6019b60472c5413A88312J99084r2169
12980B95227A26573J43573b21727B20537M4345d6230O643G4739i4104j74954A41060
12968a10800C38314i7830C4349J38405b08212B52325E2367m789R310O6795J28762
12957B52445F0956c14478A05770j9386f6740a3783A5269J48547E4956K44619l2913
12946B66662a96314A13439a66065j6970g4729J0169c206B01038c79666a6427o3048
12935g9475j21992A65087a33184G8273c8824E8995b07991b6499E9942J15112M0482
12924B15536j07407J7417K69571Q3508B36202b75470E7013K07532a18161D511
$$ plain form
12913 157945 -61676 11336 -31988 -143135 290258 112428 319641 360003 -157693 -29582
12902 -98166 -69513 -252163 113010 -81749 292417 -227430 348462 -89954 50516 -42887 62394
12890 233833 38446 177734 -124948 181645 182773 17955 -9219 -1492 76917 -160645 274406
12878 -103349 -342931 -234996 -347366 -138550 203907 65336 21090 229903 -1046 231225
12867 180848 -225186 24974 224459 -203227 203129 155839 3226 217005 133079 231514 24339
12855 -288309 167450 -188021 215965 317744 66404 215196 -103254 18810 -292283 107726
12844 69276 11636 -287591 -182244 39595 371660 68385 281853 -89099 161408 -282555
12833 8247 326205 -174043 -215710 56798 -72193 -238783 41909 -160431 70048 258439 -58382
$$ packed form
12913A57945f1676A1336c1988j11147B90258A12428K07213M0362a57693b9582
12902i8166K8653j82650A13010h1749B92417b27430C48462h9954E0516d2887F2394
12890B33833C8446J39288a24948A81645J128A7955i219a492G6917a60645B74406
12878a03349k39582J07935j12370a38550B03907F5336B1090K08813a046B31225
12867A80848b25186B4974J99485b03227B03129m7290C226K13779q3926R8435B4339
12855b88309A67450a88021B15965J01779F6404J48792a03254A8810b92283A07726
12844F9276A1636b87591J05347C9595L32065F8385K13468h9099A61408b82555
12833H247L17958a74043m1667E6798g2193j66590D1909a60431G0048J88391e8382
$$ plain form
12821 -4809 -92689 86737 47057 -68679 -407346 -135295 -370088 -114258 -400500 -21210 -231500
12810 -231500 118268 -188450 22808 -24287 146249 -125933 71531 33267 365892 186671
12800 186671 -15492 -357438 -79257 65851 36440 -184525 -674749 187633 97091 -96323 -55674
12789 -55674 177489 48949 -25064 138690 441536 392160 172557 -221239 -17460 -179614
12779 -179614 -136135 160712 -318498 -21729 84326 260352 -26438 102831 -206791 23880
12768 -278448 -569818 -25285 -136234 244803 -132704 271772 194774 84751 -74794 257062
12757 133474 54634 286918 52045 -18957 -68321 268874 -166102 -18730 -132722 -112331 136330
12745 312222 115383 -345329 314824 268267 155074 518827 288251 -55831 262005 21520
$$ packed form
12821d809q7880H6737l9680f8679l38667a35295k34793a14258k86242b1210k10290
12810b31500A18268a88450B2808b4287A46249a25933G1531C3267L32625j79221
12800A86671a5492l41946g9257F5851k9411a84525m90224A87633r0542i6323M0649
12789e5674A77489D8949b5064A38690L02846m9376A72557b21239a7460j62154
12779a79614M3479A60712c18498b1729H4326J76026b6438A02831b06791B3880
12768b78448k91370b5285j10949B44803a32704B71772p6998H4751g4794B57062
12757A33474E4634K32284E2045a8957m9364B68874a66102a8730j13992K0391A36330
12745C12222A15383c45329C14824m6557j13193L63753k30576e5831B62005B1520
$$ plain form
12734 80474 -62100 188725 -20338 214180 -84692 -26167 273928 77630 -302224 -53651 126677
12722 -145076 -89018 51206 393508 174241 -18768 58232 246349 -19850 -10262 207620 -262677
12710 52678 67608 221080 271018 -96070 66602 -35665 35562 109912 450793 -54875 -82678
12699 -82678 113513 61749 266145 -350407 125131 161827 216014 -76987 94528 159519 -55650
12687 -148985 -38699 -138179 -4112 604182 228500 -135503 337041 185459 -16977 -81860 75806
12675 242364 186529 73562 327403 -136392 122898 -42289 87906 123141 81419 4913 -53372
12663 83947 -1290 98610 265863 -142166 -231504 291281 2004 78277 4725 72572 121863 190975
12651 190975 -20769 30208 -212299 112272 105223 1048 -75503 -23957 -18312 207285 25497
$$ packed form
12734H0474f2100A88725b0338B14180h4692b6167B73928G7630c02224e3651A26677
12722a45076N6058E1206L42302A74241a8768E8232J88117a9850R588B07620b62677
12710E2678J4930J53472M9938i6070F6602c5665C5562P4350L40881e4875k7803
12699h2678A13513n1764K04396c50407A25131L6696N4187g6987I4528O4991e5650
12687a48985c8699r9480d112F04182B28500a35503C37041j51582a6977o4883G5806
12675B42364n5835G3562K53841a36392A22898d2289H7906L5235m1722D913e3372
12663H3947a290I8610J67253a42166q9338B91281B004P6273D725O7847M9291O9112
12651A90975b0769C0208b12299A12272p049A048g5503b3957N645B07285B5497
$$ plain form
12639 -38061 317137 123518 15984 223409 98299 190064 331591 -44650 367312 87377 10010
12627 508986 61256 355808 153676 120675 -445 -206432 113876 -116885 -222071 330276
12616 78925 23479 223598 318940 48344 98842 104072 -251044 44553 40849 27053 310991
12605 310991 25368 28260 7326 290215 156003 70083 -306189 35136 -40212 -114681 -140684
12594 -140684 66373 -213399 161128 24966 623801 341222 -76568 -61817 -1153 -95483 -7746
12582 -91753 178368 4595 34593 99627 -155108 -135090 28286 -145839 77354 9721 74628
12571 74628 89777 -30353 -116044 -52468 104953 -60261 -192557 -25926 74082 164543 250417
12560 250417 76017 151170 -132708 121284 -22329 9700 -9341 -28649 146188 109963 -155942
$$ packed form
12639c8061C17137A23518A5984K07425I8299R1765J41527d4650C67312H7377A0010
12627E08986F1256K94552A53676l3001d45k05987A13876a16885j05186C30276
12616G8925B3479K00119R5342D8344N0498N230b51044D4553l704j3796K83938
12605C10991B5368K892G326K82889j34212G0083c06189C5136d0212p4469k6003
12594a40684F6373b13399A61128B4966N98835k82579g6568J4751a153r4330g746
12582i1753A78368D595K9998O5034a55108K0018B8286a45839G7354I721O4907
12571G4628J5149c0353q5691e2468A04953f0261j32296b5926G4082R0461Q5874
12560B50417G6017P5153a32708A21284b2329I700i341j9308A46188l6225a55942
$$ plain form
12548 240409 -276617 -24991 -215492 -25339 -262281 117416 167827 106792 166776 169564 77178
12536 -225625 32347 -55864 61319 -156612 -122253 156315 108836 74684 -29487 48007 36350
12525 36350 -34451 -213194 21905 49218 215503 100966 -122304 -31630 -163798 -61822 -113643
12514 -113643 268662 -13428 40906 165143 -127090 -102257 40260 199916 183116 184420 537055
12503 537055 -63558 45998 77381 59555 146995 172775 76860 -120283 -4453 -225397 8248
12491 238537 25103 12108 -47512 -77965 67415 38060 -13117 -27852 134415 123216 -169758
12479 -164372 -290942 -62732 148278 -4323 208947 -338545 -68628 -265892 -49780 88669 -261027
12467 -206108 -233837 -36621 152635 -29004 140734 97680 -282784 -47778 -333710 -24585 283691
$$ packed form
12548B40409b76617b4991j90501b5339k36942A17416N0411o1035N9984K788G7178
12536b25625C2347e5864F1319a56612L4359A56315m7479l4152b9487D8007j1657
12525C6350c4451j78743B1905K7313J66285A00966a22304c1630j32168f1822n1821
12514a13643B68662a3428D0906J24237a27090K4833D0260J59656j6800J304L52635
12503E37055f3558D5998L1383j7826Q7440K5780G6860a20283d453k20944H248
12491B38537B5103A2108d7512l0453F7415k9355a3117j4735A34415j1199a69758
12479a64372j26570f2732A48278d323B08947c38545f8628j97264d9780H8669b61027
12467b06108k7729c6621A52635b9004A40734m3054b82784d7778k85932b4585B83691
$$ plain form
12455 30724 12019 289391 -25467 33641 187613 203254 -129510 -25025 -203020 -10884 -99259
12444 -99259 -214374 -122631 23343 13252 144179 176 20010 -30254 -103595 69388 52595 193451
12432 193451 103186 -161206 -249982 292107 94294 -14756 -506215 -30585 104570 53265 108024
12421 108024 -98017 107310 -256820 109020 -319140 135197 132662 -19256 -18174 -210245 104213
12409 -217289 -304968 -191912 111133 -339673 -268371 132429 -589468 295896 116698 -100711
12398 -296095 259922 402275 11639 239821 -86689 -261241 140911 -60143 -139880 -47643
12387 -28181 32992 54763 -36334 113719 20346 -272178 -202081 32886 -195941 58531 31928
12376 31928 67331 103921 170298 6218 -19559 124957 249854 111742 97568 -146205 20963
$$ packed form
12455C0724A2019K77372b5467C3641J53972J5641a29510b5025j77995a0884q8375
12444i9259j15115R1743B3343j0091J30927A76J9834c0254p3341F9388j6793J40856
12432A93451r0265a61206q8776B92107I4294a4756m91459c0585A04570n1305N4759
12421A08024i8017A07310b56820A09020c19140A35197k535a9256J082j92071A04213
12409b17289q7679J13056A11133c39673P1302A32429e89468B95896A16698a00711
12398b96095B59922J42353A1639K28182h6689j74552A40911f0143p9737d7643
12387b8181C2992K1771c6334A13719B0346b72178P0097C2886a95941E8531k6603
12376C1928L5403L6590O6377F218a9559A24957J24897A11742j4174a46205B0963
$$ plain form
12364 90460 158184 -56632 76476 104337 -246121 130510 -154124 -238543 132959 -316912 288697
12352 -53801 -171366 -200880 67006 -2917 55013 -35676 3267 -148784 -57577 -51641 204471 472757
12340 472757 -36652 124869 30943 108659 -30284 -62609 254839 -110526 349094 -243454
12329 -130359 252078 -9796 54467 -131931 320536 97384 -1299 158511 -303556 -65409 -11857
12317 -115463 -138625 -88531 196683 14397 -11069 -110737 -216873 -75661 -77408 -193209 5146
12305 -131861 108794 -185770 -121125 19630 -81300 230105 34499 -44111 -161471 -207540 122656
12293 -133005 143300 278291 -185854 -380325 117108 249703 -4146 -230989 239625 19540
12282 240008 -158864 -48635 -36351 53994 24528 -77595 -51997 60694 322615 424431 110185
$$ packed form
12364I0460O7724e6632G6476K7861b46121A30510a54124q4419A32959c16912B88697
12352e3801j17565k9514F7006b917E5013c5676C267a48784e7577N936B04471K68286
12340D72757c6652A24869C0943P7716c0284l2325B54839a10526C49094b43454
12329a30359B52078i796E4467a31931C20536I7384a299A58511c03556f5409a1857
12317a15463k3162N0094A96683A4397a1069r9668j06136g5661j747j15801E146
12305a31861A08794a85770O4645A9630h1300B30105C4499d4111j17360m6069A22656
12293a33005A43300J34991a85854j94471A17108J32595d146k26843B39625A9540
12282B40008a58864d8635J2284E3994B4528g7595K5598F0694K61921J01816A10185
$$ plain form
12270 175244 172140 50134 -56625 152897 179282 6113 126151 262275 105828 231370 110047
12258 15300 -33532 -143693 214666 82773 81708 28635 135270 337424 292070 155775 -249191
12246 333366 346784 82892 204614 66670 110884 -51336 307168 -288227 74385 248621 -205937
12234 132017 230399 -62902 91482 128596 54734 -21925 381825 298269 -234818 192925 262443
12223 262443 40234 -43745 448263 142097 51290 65813 177304 218127 151198 138871 485776
12212 485776 -21101 127827 115863 256324 99728 -109555 32591 72761 -56986 105482 129187
12201 129187 -21273 357446 144028 132480 153769 356400 141338 53227 223703 314473
12191 314473 263425 232212 306496 220216 -14435 -2812 160677 99852 -1732 -119204 -120793 141731
$$ packed form
12270A75244l104E0134e6625A52897K6385F113J20038J36124A05828J25542A10047
12258A5300c3532j10161B14666H2773j065B8635J06635K02154m5354j36295b49191
12246C33366J3418H2892J21722F6670M4214e1336C07168b88227G4385J74236b05937
12234A32017R8382f2902I1482L7114E4734b1925C81825q3556b34818A92925O9518
12223B62443D0234d3745D48263A42097E1290J4523J11491M0823o6929j2327L46905
12212D85776b1101A27827j1964J40461I9728a09555C2591M0170e6986A05482K3705
12201A29187b1273C57446A44028j1548K1289K02631A41338E3227J70476R0770
12191C14473n1048l1213P4284q6280a4435b812A60677o0825a732j17472j589A41731
$$ plain form
12178 44933 152207 -123001 104756 86387 379718 37477 141841 258634 96379 456070
12168 456070 -124844 57929 228331 385181 -141971 241830 -2231 -3913 117142 30496 -124507
12156 -25772 437415 32259 261003 80994 119439 -72048 -61649 -187580 73011 50641 -202242
12144 248399 -57620 -178398 -190558 -28582 262812 401854 223265 -106562 -163162 -7456 54963
12132 130672 -858 34636 187343 -140437 124203 -126350 32043 -218762 -121882 -253659 -59725
12120 194793 44370 273317 127152 -307230 77730 22925 36829 227142 -243695 -261279
12110 -261279 -145608 164067 -77118 -202893 -344476 -101538 -34863 350904 111345 127668
12100 127668 -321961 204681 194392 139688 -214170 -348467 67681 -63401 107452 292680
$$ packed form
12178D4933J07274a23001A04756j8369K93331C7477J04364J16793I6379L59691
12168D56070a24844E7929J70402J56850a41971B41830b231j682A17142C0496a24507
12156b5772D37415C2259K28744H0994L8445g2048J0399j25931G3011k2370b02242
12144B48399e7620j20778j2160b8582B62812J39042j78589a06562n6600g456E4963
12132A30672h58C4636J52707a40437A24203a26350C2043b18762R6880j31777e9725
12120A94793D4370K28947A27152c07230G7730B2925J3904J90313b43695j7584
12110b61279J15671A64067g7118j25775j41583a01538c4863C50904A11345J6323
12100A27668c21961B04681j0289n4704b14170j34297F7681f3401A07452J85228
$$ plain form
12090 292680 -171545 211619 83732 -113267 -21544 -41591 353082 45797 -68609 184328
12079 -30988 279275 1547283 1622004 601518 376930 -122018 -87680 177143 285751 4158
12068 -253224 10989 12409 -15023 125007 -134225 -258701 -21779 -542 496875 54930 221625
12057 221625 -265278 -224782 -354050 33927 -103311 -199808 -123394 283776 -368848 113531
12046 129698 35315 -194652 282114 -252486 120131 -147686 -221763 -309082 311288 9894
12035 110443 38930 -1451 204646 97655 -121658 72973 -16562 79885 -10974 187340 86220
12023 110524 83511 -218012 -68168 77192 -43708 -201300 141690 274059 69059 -37619 -85342
12012 -85342 165492 -137630 137842 -13265 12121 294811 -37650 266146 1670 -126950 14133
$$ packed form
12090B92680a71545B11619H3732a13267b1544k0047C53082D5797f8609A84328
12079c0988B79275J268008P4721F01518k24588a22018L4338A77143J08608D158
12068b53224A0989J420a5023A25007a34225j24476b1779e42D96875E4930J66695
12057B21625b65278M0496j29268C3927a03311r6497P6414B83776c68848A13531
12046A29698C5315a94652B82114b52486A20131a47686p4077q7319C11288I894
12035A10443C8930a451B04646I7655a21658G2973a6562G9885a0974A87340H6220
12023A10524k7013b18012f8168G7192d3708j57592A41690J32369F9059c7619m7723
12012h5342A65492a37630A37842a3265A2121K82690c7650B66146A670a26950A4133
$$ plain form
12000 31877 30129 -132123 107082 42229 -67714 413812 124475 64330 309672 151276 29098
11988 126170 175217 246243 -45073 49019 137764 -170963 -35196 -51075 188726 -172418 169179
11976 -84592 170574 -202982 -128482 159620 -160491 280346 -164306 5310 -240422 116717
11965 53289 -3951 104517 108985 102096 -102420 -76495 15288 -208529 -69773 -368716 -295304
11954 -295304 48658 342443 -82116 306560 -243750 -96497 17812 14753 128582 -309789 -17479
11942 103603 -3655 -10578 9341 -156398 -45533 88985 -13780 150876 199612 59647 252599
11931 252599 24455 -10729 35452 -171140 -132598 346728 26624 -65049 262699 160297 156756
11920 156756 -182639 -97903 -13481 -184927 178728 -187190 -85204 432750 -24684 -117323
$$ packed form
12000C1877j748a32123A07082D2229f7714D13812A24475o0145K45342A51276B9098
11988A26170M9047P1026d5073D9019Q8745a70963c5196j5879A88726a72418A69179
11976h4592A70574b02982P4500A59620a60491B80346a64306E310b40422A16717
11965E3289c951A04517M468o889a02420K5925A5288b08529f9773k98943P3412
11954b95304D8658K93785h2116C06560b43750i6497A7812l059J13829c09789a7479
11942A03603c655o923I341a56398d5533H8985a3780A50876M8736E9647J92952
11931B52599B4455a0729C5452a71140L8542C46728B6624f5049B62699j02402l541
11920A56756a82639Q4736a3481j71446A78728a87190h5204D32750b4684r2639
$$ plain form
11910 -117323 147495 209350 -127106 -8411 -120829 80927 -109530 403626 168912 -318171
11899 30119 10855 54022 -112669 -111290 -101580 173215 208080 56273 -6728 -87504 -263698 -110885
11886 -160267 13718 -62392 128606 -235104 -129831 152382 -6801 -263888 294190 -210680
11875 -251407 314839 371850 -283210 -366018 -194180 217093 159051 -290148 271756 -176875
11864 -207182 -73223 -13958 -154724 -186506 157017 -22074 -166217 25540 -126373 -265196
11854 -265196 -228615 79728 29993 -181134 133160 -100038 -128421 -222612 65344 58441 -70499
11842 4337 -342311 -325523 48721 -215803 106706 178610 139402 169553 -30323 -263716 202717
11830 -109614 -1970 -47958 146611 -227029 -168160 -216400 47559 49450 -156043 296095 -83925
$$ packed form
11910a17323A47495O1855a27106h411j12418H0927a09530D03626A68912c18171
11899C0119A0855M3167a12669J379R710A73215L4865E6273f728q0776j76194a10885
11886a60267A3718f2392A28606b35104J05273A52382f801k57087B94190b10680
11875b51407C14839N7011b83210q2808J71838B17093n8042b90148B71756a76875
11864b07182g3223a3958j40766l1782A57017b2074j44143B5540a26373j38823
11854b65196L6581G9728B9993a81134A33160a00038k8383r4191F5344o903g0499
11842D337c42311J6788D8721b15803A06706P1904l9208L0151c0323k33393B02717
11830a09614a970m5988A46611b27029N8869m8240D7559J891a56043B96095h3925
$$ plain form
11818 -71728 -107798 167324 81735 57394 32910 9058 24212 -224442 -281848 -129416 -206729
11807 -206729 -117946 62332 -67505 -153170 217753 -293346 -24571 300606 164565 159474 -30415
11795 -66092 -31772 -89983 -345379 -47307 -183571 -14567 -49025 -364765 -18761 -184462 221379
11783 233421 21210 57838 -38741 138523 -109713 -194909 37498 -392759 -125172 -74041 1545
11771 1790 -37725 -16507 -213912 74528 207762 -187371 33791 -86936 -99799 -63335 -44383
11760 -44383 -9150 -144768 -386829 -310134 -218484 -150357 52711 70054 105543 117499 235766
11749 235766 -62640 409350 148719 189311 -207090 35670 -105182 66425 159033 251429 284419
11738 284419 8618 108798 -215574 67689 -210261 174245 29977 -19132 125885 168941 223179
$$ packed form
11818g1728l6070A67324H1735k4341k4484I058J5154b24442n7406a29416p7313
11807b06729Q8783F2332f7505q5665B17753b93346b4571C00606j36041n091c0415
11795f6092c1772n8211k55396d7307j36264a4567l4458l15740a8761j65701B21379
11783B33421B1210L6628c8741A38523a09713q5196C7498c92759a25172N1131A545
11771A790c7725a6507j97405G4528J33234a87371C3791h6936j2863L6464J8952
11760d4383i150j35618k42061P6695R1650O8127E2711J7343L5489J1956J18267
11749B35766f2640D09350A48719M0592b07090C5670a05182F6425R2608R2396L2990
11738B84419H618J00180b15574F7689b10261A74245B9977a9132A25885M3056N4238
$$ plain form
11727 223179 148446 -299502 -171167 -97583 159182 -245196 -110315 -206284 78588 50309
11717 50309 250853 58710 260900 86962 369983 -84428 -75487 185389 277028 323316 -114886
11705 125237 -149778 5752 -316929 -27986 -136765 61101 -234569 -113632 -261579 134076
11694 195203 -292588 252618 38422 62333 110281 -168190 -120710 47230 89206 52344 273718
11683 273718 -16537 -74074 88450 -282400 -119251 -23244 275964 415317 -303836 -150496
11672 -9442 -380195 -25985 -109164 -192274 93369 132995 171612 -229190 64748 309540 -141287
11660 -29406 -171311 -192492 -330208 -147070 -291187 122737 39361 -214023 329753 188115
11650 188115 66329 107415 -108405 231721 66164 -1554 -23382 123411 -34405 -66436 -84466
$$ packed form
11727B23179p4733b99502J28335P3584A59182b45196a10315r5969G8588k8279
11717E0309K00544E8710K02190H6962K83021h4428Q941A85389R1639M6288a14886
11705A25237a49778E752c16929b7986j08779F1101b34569a13632j47947A34076
11694A95203b92588B52618C8422K3911M7948a68190M7480D7230M1976l6862K21374
11683B73718a6537n7537H8450b82400a19251b3244B75964J39353c03836a50496
11672i442l70753b5985q3179q3110I3369L9626L8617b29190F4748K44792a41287
11660b9406j41905k1181j37716a47070j44117A22737C9361b14023C29753j41638
11650A88115F6329M1086a08405B31721F6164a554k1828A23411c4405l2031j8030
$$ plain form
11639 -84466 61545 -234391 -153261 -81543 215294 21335 -121748 225828 92499 238074 -214665
11627 -117418 -89316 -113924 -109281 149652 129727 -66266 151792 -238523 84662 -76617 -81851
11616 -81851 -78635 165283 131087 40397 128579 76810 -183100 314805 216727 5264 -15368
11604 257279 161926 47951 335710 82667 39012 -38721 -8034 240478 -80353 150531 -105821
11592 -110509 16641 -355841 229443 -41289 -144881 99408 143541 119741 25411 226001 -106010
11580 179081 508359 -146450 -9045 -150945 120829 16433 -32599 -135652 -93770 283502
11569 240922 207213 340879 338187 -209838 227537 333434 268746 443322 264568 -245594
11558 -43804 -41835 169071 210002 9054 12125 -85258 157135 -28166 126385 72377 -36211 288000
$$ packed form
11639h4466F1545b34391Q1130P1718B15294B1335a21748B25828I2499J45575b14665
11627a17418K8102k4608M643A49652j9925f6266A51792b38523H4662g6617n234
11616h1851L216A65283l4196D0397Q8182n1769a83100C14805r8078E264a5368
11604B57279r5353D7951K87759H2667C9012c8721h034B40478h0353A50531a05821
11592a10509A6641c55841B29443d1289j03592I9408M4133k3800B5411K00590a06010
11580A79081L29278a46450i045j41900A20829A6433c2599j03053M1882B83502
11569B40922l3709J33666k692b09838B27537J05897o4688J74576j78754b45594
11558d3804J969A69071M0931I054L071h5258A57135b8166A26385n4008c6211B88000
$$ plain form
11545 329844 -69264 121701 -68151 170010 298891 -142324 368421 342832 -143745 193664
11534 -148331 -11408 88982 -90768 -19152 -184320 65767 -109019 198669 -382773 -44265 271047
11522 43220 7387 -166682 262622 193651 62086 154857 -26002 -66332 111215 195431 -95111
11510 27672 56382 109249 122840 183665 155154 340300 -27726 35457 -103569 -121748 128879
11498 75143 -107709 278491 388029 180873 -49183 137084 154281 -50902 293649 156153
11488 156153 -1791 204733 53890 137685 249853 -92546 302395 43384 229117 226754 56865
11476 236734 121254 492798 161729 -145758 74251 92700 114439 267072 363410 -41096
11465 47789 10685 -87983 315657 347739 68392 92524 191061 -245419 30448 285893 -68692
$$ packed form
11545C29844f9264A21701f8151A70010J28881a42324C68421k5589a43745A93664
11534a48331a1408H8982i0768a9152j65168F5767a09019A98669c82773d4265B71047
11522D3220G387a66682B62622o8971F2086R2771b6002m0330A11215Q4216i5111
11510B7672K8710N2867J3591O0825k8511J85146b7726C5457a03569j8179A28879
11498G5143a07709B78491J09538A80873d9183A37084J7197e0902B93649j37496
11488A56153a791B04733E3890Q3795J12168i2546C02395D3384J85733k363E6865
11476B36734j15480L71544A61729a45758G4251J8449K1739J52633R6338d1096
11465D7789A0685h7983C15657L2082F8392K4132R8537b45419C0448K55445f8692
$$ plain form
11453 -221015 -254018 7533 133705 39038 50707 -55513 -64687 18796 53315 60625 144241 56256
11440 373610 116397 -136850 139234 64697 -77874 -61759 98221 -127032 -39455 -17463 159417
11428 -81869 -4209 179835 -19723 -201595 -127616 18561 7000 -12281 42596 79787 -123681
11416 -201154 -58003 -193068 -28429 -355238 143849 -137592 97440 305086 -233406 -265723
11406 -265723 -490995 -92082 189861 -5847 125898 109691 28104 146472 99290 187665 -141093
11394 -61117 -242800 -189922 -50121 -39138 1998 -344475 14459 -91979 -193245 74992 54963
11383 54963 217809 -94452 -239960 -7012 206244 -118651 24329 200168 244321 -47982 -72409
11372 -72409 77414 -298867 21076 166363 271748 477086 2677 299468 -61634 6369 -282682
$$ packed form
11453b21015l3003G533J26172C9038J1669e5513r174A8796L4519P310Q3616E6256
11440C73610A16397a36850A39234F4697g7874J6115I8221a27032c9455a7463A59417
11428h1869d209A79835a9723j81872P3979A8561G000a2281D2596L7191a23681
11416b01154e8003j35065b8429l26809A43849a37592I7440K07646b33406l2317
11406b65723k25272i2082A89861e847A25898j6207B8104J18368m7182Q8375a41093
11394f1117j81683N2878e0121J0983A998c44475A4459i1979j01266G4992k0029
11383E4963J62846i4452j45508g012B06244a18651B4329J75839M4153d7982k4427
11372g2409G7414b98867B1076J45287J05385K05338B677K96791f1634F369b82682
$$ plain form
11360 -100429 -48253 251224 50146 -241425 7233 164439 -19713 208086 -315909 181363
11349 -120116 -80127 69947 79652 -109405 -260230 -173288 -296910 27668 91586 -302281 89401
11337 30535 179141 96409 -52371 -77852 -74990 55520 24369 -193617 -11834 -403549 -289982
11326 -289982 -366484 -11234 -165968 248691 68047 -4198 185018 -288066 165555 -26067 8215
11314 -97820 -121215 89589 117480 102707 55563 -401282 -72491 -347131 59606 119931 -127272
11302 -233354 72362 -178995 -183622 -95473 -18558 201125 66114 -284308 205849 -78389 115985
11290 16493 -13796 -120572 -50357 -330540 90793 103701 -147740 2442 -329247 -132609 -265290
11279 -265290 -33226 179988 114380 130477 -17193 -67560 -277615 -75412 -19251 31520 58641
$$ packed form
11360a00429d8253B51224E0146b41425G233J57206a9713B08086c15909A81363
11349a20116L9989F9947R705a09405j50825Q6942j23622B7668O3918c02281H9401
11337C0535J48606q2732e2371k5481K862E5520B4369a93617a1834l91715J13567
11326b89982p6502a1234j54734B48691F8047d198A85018b88066A65555b6067H215
11314i7820k3395H9589K7891j4773m7144d01282g2491k74640E9606O0325a27272
11302b33354G2362a78995m627Q8149a8558B01125F6114b84308B05849g8389A15985
11290A6493a3796j06776e0357k80183I0793J2908a47740B442c29247a32609j32681
11279b65290c3226A79988o5608J6097a7193n0367k10055g5412a9251C1520K7121
$$ plain form
11268 58641 -11535 -237065 -117221 39201 74115 142623 -29077 -70841 32160 -217728 86348
11256 342160 -74434 -117611 -102240 189564 -28813 151790 -52141 -590083 -121039 137073
11245 90130 33359 -23423 -25528 -13737 179927 -185473 56116 -62762 33928 -181683 -57916
11233 124959 -38119 -269033 331100 -121883 47248 -141901 -458063 -344051 -275255 205599
11222 -452961 9934 79952 -316616 -183198 102282 2737 226828 74376 -281030 122776 142669
11211 142669 -123221 -245475 -212924 124379 -212527 79408 -205024 -43250 -108708 -163912
11201 -163912 14448 -19167 78224 -73058 -25655 -196549 93214 -11821 143970 -28851 -2468
11189 -266946 279009 -28393 -183780 -50244 -16406 -49504 -274221 -116508 128671 -246518
$$ packed form
11268E8641a1535k25530a17221C9201L4914O8508b9077m1764C2160b17728H6348
11256C42160g4434m3177J5371A89564b8813A51790e2141n37942a21039A37073
11245I0130C3359b3423k105J1791A79927a85473E6116f2762C3928a81683e7916
11233A24959c8119k30914C31100a21883D7248a41901l16162J14012O8796B05599
11222d52961I934P0018c16616J33418A02282B737K24091G4376b81030A22776J9893
11211A42669a23221j22254L2551A24379b12527G9408b05024d3250o5458n5204
11201a63912A4448a9167G8224g3058b5655j70894I3214a1821A43970b8851b468
11189b66946B79009b8393j55387e0244a6406l3098k24717a16508A28671b46518
$$ plain form
11178 -32363 -166773 -229512 -285507 -163517 -32851 85237 -41943 -74881 61362 162958 -290110
11166 66208 -155543 52355 -65195 -81281 124484 -153903 -120175 99003 -77115 62995 -16879
11154 -152741 116987 -16452 -376536 238912 -20083 -253373 -352200 222859 -225447 -3045
11143 -290302 -190775 -99055 77208 119310 -163763 92103 55612 438458 332514 22443 114650
11132 114650 165502 -151184 114619 -15083 171507 -172789 313751 154841 -54447 19816
11121 297894 6034 103583 155811 214048 -36173 -426208 147979 -151314 10821 202635 23697
11109 240412 -22214 72424 103861 304245 358827 107579 205869 242648 -280369 77129 201037
11098 201037 203678 324696 84179 81334 108563 331832 -7534 -99592 23366 285827 367737
$$ packed form
11178c2363j34410o2739n5995J21990c2851H5237d1943l2938F1362J01596b90110
11166F6208a55543E2355f5195j6086A24484a53903L3728I9003g7115F2995a6879
11154a52741A16987a6452l60084B38912b0083k33290r8827B22859b25447c045
11143b90302R9527R1720G7208M2102a63763I2103l6491L82846j05944B2443R2207
11132A14650N0852a51184A14619a5083A71507a72789C13751A54841e4447A9816
11121B97894F034R7549N2228N8237c6173l90035A47979a51314A0821J91814B3697
11109B40412b2214G2424L1437K00384N4582A07579R8290L6779b80369G7129J23908
11098B01037K641J21018H4179k845K7229K23269g534r2058B3366K62461Q1910
$$ plain form
11087 367737 158775 14928 65878 74966 312902 369888 230371 399816 373908 382448 26810
11075 378880 173129 -99022 474984 174871 413505 -39355 320268 174143 346856 277390
11065 277390 327434 345538 249266 243623 352288 230522 349752 382888 614492 777165 534655
11054 534655 510429 775535 854948 920054 687522 953041 509218 326314 464386 591932
11044 591932 586356 579144 534433 641865 712003 825021 971401 614420 582639 846709 421878
11032 555915 804142 819491 415061 721369 650784 621943 879474 671263 524624 632901
11022 632901 515006 606053 493250 989929 663855 659716 627887 353723 527638 308945
11012 308945 498627 498945 240685 749067 405733 542410 444185 446730 459602 926175 233831
$$ packed form
11087C67737A58775A4928N0950R088K37936N6986j39517J69445k5908Q540B6810
11075C78880A73129i9022D74984A74871K38634c9355C20268j46125J72713o9466
11065B77390N0044J8104r6272n643J08665j21766J19230L3136K31604J62673k42510
11054E34655k4226K65106P9413O5106k32532K65519m43823j82904J38072J27546
11044E91932n576p212m4711J07432P0138J13018J46380l56981l1781K64070D21878
11032E55915K48227J5349m04430L06308p0585k8841K57531k08211j46639J08277
11022F32901j17895R1047j12803M96679l26074m139l1829k74164J73915k18693
11012C08945J89682L18B40685N08382l43334J36677r8225K545J2872M66573B33831
$$ plain form
11000 647307 756493 644533 369183 680916 970730 536687 365309 482311 631541 963143
10990 963143 763565 850314 894089 894170 770781 1017902 1023866 940303 1157593 1089602 1270993
10979 1270993 1028460 1595516 1614891 1475712 1762832 2111971 2651802 2817424 2691151 2591028
10969 2591028 2570228 2610172 2113364 1901017 1857573 1391877 1554318 1306560 1632650 1159438
10959 1159438 1656340 1570510 1710728 1550877 1586077 1274434 1162950 988969 686924 990349
10949 990349 595677 627187 289496 468990 584520 534963 384131 11712 165543 -11972
10938 300400 181787 81889 84196 13859 225151 234813 75439 267513 -10891 147487 62270
10926 180099 76121 -409162 -12674 79833 76330 -47338 -193943 183025 -27123 282702 294416
$$ packed form
11000F47307J09186j11960k75350L11733K89814m34043j71378J17002J49230L31602
10990I63143j99578Q6749M3775Q1j23389K47121N964q3563K17290o7991J81391
10979A270993k42533N67056J9375j39179K87120L49139N39831J65622j26273j00123
10969B591028k0800L9944m96808k12347m3444m65696J62441k47758L26090m73212
10959A159438M96902q5830J40218j59851L5200l11643j11484j73981l02045L03425
10949I90349l94672L1510B89496J79494J15530m9557j50832A1712J53831a1972
10938C00400j18613H1889K307A3859K11292R662G5439J92074a0891A47487F2270
10926A80099G6121d09162a2674G9833l503d7338j46605A83025b7123B82702J1714
$$ plain form
10915 294416 40174 202775 -386585 -163139 15195 322802 35151 -126425 90349 -29973
10904 -75062 20878 -192193 -426501 -136112 -7645 -214781 -195968 -145381 -199203 -186855 206
10892 -397417 -61512 -324872 98968 -113891 34674 17908 -156821 259197 -98199 236970
10881 43732 116065 -64188 57741 -169244 -244033 76998 114178 30553 -124149 -25944 -129736
10870 -129736 90316 -696 122056 28294 -72581 -422638 -96089 -49211 -106965 -412135 105902
10858 117385 -45731 -21648 10897 42499 -111463 53660 -392113 131548 74017 -34388 -119694
10847 -119694 -25466 -153521 269952 -114016 -83794 219779 -140627 -194873 -134185 -250325
10837 -250325 81618 289250 -60570 -26815 250426 -287640 -370299 -160061 51024 -333965
$$ packed form
10915B94416D0174J62601c86585a63139A5195L07607C5151a26425I0349b9973
10904g5062B0878a92193k34308a36112g645k07136J8813N0587n3822J2348B06
10892c97417f1512k63360I8968a13891C4674j6766a56821B59197i8199B36970
10881D3732P2333f4188E7741a69244p4789G6998L7180C0553a24149b5944j03792
10870a29736I0316f96A22056B8294g2581l50057i6089M6878n7754l05170A05902
10858A17385d5731b1648A0897L1602a11463E3660c92113A31548n7531c4388q5306
10847a19694b5466j28055B69952a14016L0222B19779a40627n4246O0688j16140
10837b50325H1618K07632f0570b6815B50426b87640q2659a60061E1024c33965
$$ plain form
10826 -116069 -31298 -162709 -168831 -202694 22702 -42204 -134126 -51250 -156646 -256803 -185148
10815 -185148 45698 -118204 22241 136854 81537 -150261 -31234 -106309 389516 -135777
10804 -163768 243979 -506401 -38362 94638 337451 -221560 -30753 264372 -137006 -32170
10793 -142674 -237811 -9078 382114 32633 271952 280206 -105294 187025 125986 -25136 76316
10781 -32600 -54732 88348 -154560 101960 -136130 -27163 -313626 38718 -55314 -28245 -208068
10770 -208068 -33916 -109745 -2025 66712 3898 234584 -41028 86828 -134126 184543 -452770
10758 42930 -156109 -127050 -125737 16792 -378736 -10265 462287 10616 -292060 106934 -116090
10746 129654 113755 146773 85581 76946 -159884 71441 68287 -183261 101388 -200998 173374
$$ packed form
10826a16069c1298j31411o122l3863B2702d2204r1922e1250j05396j00157P1655
10815a85148D5698a18204B2241J14613n5317a50261c1234p5075C89516a35777
10804a63768B43979e06401c8362I4638K42813b21560c0753B64372a37006c2170
10793a42674r5137i078C82114C2633K39319Q254a05294A87025o1039b5136G6316
10781c2600k2132H8348a54560A01960a36130b7163k86463C8718e5314K7069j79823
10770b08068c3916p5829b025F6712C898K30686d1028H6828a34126A84543d52770
10758D2930a56109K9059J313A6792c78736a0265D62287A0616b92060A06934a16090
10746A29654j5899L3018o1192q635a59884G1441l154a83261A01388b00998A73374
$$ plain form
10734 -413676 -63626 -46064 -76532 -262484 80678 -268829 196562 -139141 141532 -128444
10723 -108784 71158 263375 446913 -110075 254331 139986 26877 408315 12486 -91853
10712 204951 -102170 143382 120019 75084 -92984 -222765 -197654 -20551 -463741 198927
10701 -400303 21066 328968 -197758 151000 102120 133851 -122375 -110199 -351955 -8576 222930
10689 217693 -290737 -71465 -341436 -58228 6732 2127 52904 -372532 -80576 -360251 8595
10677 -151068 -111683 -439728 -123093 24218 25308 -14133 3627 -56143 -205682 -5611 297538
10665 130164 -210678 -320762 42292 290410 -407566 -262938 -144464 -91668 94487 145763
10655 145763 87579 37151 37196 151505 -52218 -264815 -163380 2868 178468 122348 105718
$$ packed form
10734d13676f3626J7562l0468j85952H0678b68829A96562a39141A41532a28444
10723a08784G1158J92217J83538a10075B54331j14345B6877L81438A2486i1853
10712B04951a02170A43382k3363m4935i2984j29781K5111b0551m43190A98927
10701d00303B1066L07902a97758A51000m8880L1731a22375J2176k41756h576B22930
10689B17693b90737g1465k69971e8228F732B127N0777c72532h0576k79675H595
10677a51068L9385l28045a23093B4218J090a4133C627e6143j49539e611B97538
10665A30164b10678j10084D2292K48118d07566J44628J18474N2796I4487N1276
10655A45763n8184C7151M5J14309e2218k12597J01435B868J75600n6120j6630
$$ plain form
10644 105718 -125008 50892 -225945 60080 -66559 120874 -286286 139789 -339172 196676
10633 49208 -388681 -166913 115334 -298496 -19117 34928 266023 214840 -92653 -90997 -298801
10622 -298801 -55257 -155207 104124 -451608 223 136862 -194059 -18046 -174211 193025 159550
10611 159550 -249724 105847 68602 -19126 -68268 262721 -370037 6689 -277010 35007 -321780
10599 -51208 -866 415306 -220435 10335 -297516 -125602 5745 93143 -17820 -285785 -106815
10587 194776 -409478 -60079 142199 -441049 69464 -87877 -22389 -79531 -73502 -102063 -235025
10576 -235025 33560 213199 105815 -271634 77384 -75078 3137 -251114 -15017 -56606 -306047
10565 -306047 -15320 -88268 10463 104130 288213 232964 -240740 294432 -116720 449343
$$ packed form
10644A05718a25008E0892b25945F0080f6559A20874b86286A39789c39172A96676
10633D9208c88681a66913A15334b98496a9117C4928K31095n1183i2653J656k07804
10622b98801e5257r9950A04124d51608B23J36639a94059a8046j56165A93025l3475
10611A59550b49724A05847l7245a9126m9142B62721c70037F689b77010C5007c21780
10599e1208h66D15306b20435A0335b97516a25602E745Q7398a7820k67965a06815
10587A94776d09478f0079A42199d41049F9464h7877b2389n7142O029k8561j32962
10576b35025C3560J79639A05815b71634G7384g5078C137b51114a5017m1589k49441
10565c06047a5320p2948A0463R3667J84083n5249b40740B94432a16720D49343
$$ plain form
10554 140460 -38108 15715 -77861 146026 70064 101656 -148339 -233298 279740 -164542 -47502
10542 -179390 154682 43792 -173640 -9824 -102577 -73182 -147875 -29595 152361 -180062 -184279
10531 -184279 -149564 -137569 18880 337988 -319843 -272114 -89667 205676 135732 -173431 -173517
10520 -173517 -157540 1358 -2031 109559 103539 -151483 398280 -52046 138278 295433 -368397
10508 -460142 42326 -134224 32883 -127116 -121986 253222 -188537 211255 32101 36455 109210
10497 109210 -212549 134828 365604 -199746 -32456 34407 56111 103905 -115091 113159
10486 394425 -125954 -97816 257016 -73334 55062 451608 568142 484621 371571 56269
10475 186378 -146168 -7904 -53257 -334519 -21746 -72922 9059 135662 21694 -74126 236872
$$ packed form
10554A40460c8108A5715g7861A46026G0064L1592a48339q4959B79740a64542d7502
10542a79390A54682D3792a73640i824r2753K9395p4693b9595A52361a80062m217
10531a84279L4715J1995A8880L19108c19843M7729h9667B05676o9944a73431q6
10520a73517J5977A358b031A09559o020a51483C98280e2046A38278J57155c68397
10508d60142D2326a34224C2883a27116N130B53222a88537B11255C2101M354P2755
10497A09210b12549A34828K30776a99746c2456C4407K1704M7794a15091A13159
10486C94425a25954K8138B57016g3334E5062L96546J16534q3521j13050E6269
10475A86378a46168g904m5353k81262b1746n1176I059J26603B1694g4126B36872
$$ plain form
10463 103231 141955 -159609 106139 254956 90171 124605 92093 -36739 25631 -349482 -262140
10452 -262140 -267301 179834 -279903 -232033 -188044 334843 -174096 28379 -397455 187679
10441 -244987 -341813 -55743 -31415 -382449 -181134 4594 -162887 16977 -5696 -88624 -77156
10430 -77156 -114845 242155 -250666 -276881 81613 210311 -102900 -248406 273980 -43717
10419 -71787 -228519 133935 -190496 106076 154649 64079 -192493 -24604 -164717 -278845
10409 -278845 -154514 110097 -100706 125016 -187891 120906 208581 235337 -4562 122816
10398 -107267 -82731 -93174 60125 240131 -69266 137093 168557 307363 253884 269000 360727
10387 360727 28602 22846 -116713 29407 -91736 106191 128559 179249 -24751 460629 267038
$$ packed form
10463A03231L8724a59609A06139J48817I0171L4434l2512c6739B5631c49482Q7342
10452b62140n161A79834b79903M7870M3989C34843a74096B8379c97455A87679
10441b44987r6826e5743K4328l51034a81134D594a62887A6977e696q2928J1468
10430g7156l7689B42155b50666k6215H1613J28698a02900j45506B73980d3717
10419g1787j56732A33935a90496A06076M8573F4079a92493b4604j40113j14128
10409b78845J24331A10097a00706A25016a87891A20906Q7675K6756d562A22816
10398a07267K4536j0443F0125J80006f9266A37093L1464J38806n3479J5116R1727
10387C60727B8602n756a16713B9407i1736A06191K2368N0690b4751D60629j93591
$$ plain form
10376 267038 254433 149331 315909 450638 274620 343223 426055 147836 58284 535069
10366 535069 475009 681157 321694 11917 99126 416738 15702 49357 96354 184937 228735
10355 228735 108254 88697 369471 387100 304467 361488 409005 367497 376094 187017 55366
10343 -30550 115447 402986 517049 209852 167742 186510 68932 -109773 73740 238829
10333 238829 101910 31124 331461 4478 -311331 1933 -147050 244301 197317 188776 279815
10322 279815 241485 -260702 -25277 -16031 -270249 202448 122555 137587 24123 28424 -166845
10310 -43127 42306 152813 154896 -31906 -23825 123459 135796 191161 117181 44011 -243120
10298 39723 65188 -160767 -110166 -114774 158810 64084 44852 -249988 268990 306976 57356
$$ packed form
10376B67038j2605j05102J66578J34729j76018O8603Q2832A47836E8284M76785
10366E35069o0060K06148C21694A1917Q7209L17612A5702L3655M6997Q8583M3798
10355B28735A08254j9557K80774J7629q2633N7021M7517m1508Q597A87017E5366
10343c0550A15447K87539J14063B09852m2110J8768F8932a09773G3740J65089
10333B38829A01910C1124L00337D478c11331A933a47050B44301m6984q541R1039
10322B79815l8330b60702b5277R246k54218B02448p9893J5032B4123M301a66845
10310d3127D2306J10507K083c1906Q081A23459J2337N5365p3980D4011b43120
10298C9723K5465a60767N0601m608A58810F4084j9232b49988B68990L7986E7356
$$ plain form
10286 -26575 25547 -343131 71673 -80555 -92429 35043 -100321 -205176 -38085 45117 -207872
10274 206110 163659 -38862 -232969 -330731 114994 -234965 45159 -81488 -383473 -99354 187162
10262 -49988 -63424 77638 146221 341917 469288 387704 112831 -19454 -53466 -191382 -35590
10250 90925 -114565 -37758 79464 -46658 112881 -38771 -80703 381180 -42326 -14173 137795
10238 159711 -185849 -37236 71873 -149581 -305858 -64447 -4756 -351455 -172007 -20265 -100159
10227 -100159 -458307 87223 -31225 80076 -27655 -379672 -58701 -47818 125044 -250562 -69633
10215 -210137 217999 -149936 -62790 180843 149900 -50930 -68293 -35422 -157530 -232362 72148
10203 12318 58290 -189248 340775 273267 136381 63837 -148193 -121652 -155690 212189 -107627
$$ packed form
10286b6575B5547c43131G1673h0555j1874C5043a00321j04855c8085D5117b07872
10274B06110m2451c8862j94107r7762A14994b34965D5159h1488l01985i9354A87162
10262d9988j3436G7638O8583J95696J27371q1584A12831a9454l4012j37916c5590
10250I0925a14565c7758G9464d6658A12881c8771m1932C81180d2326a4173A37795
10238A59711a85849c7236G1873a49581j56277f4447d756l46699a72007b0265p9894
10227a00159l58148H7223c1225H0076b7655l52017e8701J0883A25044b50562f9633
10215b10137B17999a49936f2790A80843l0943e0930j7363L2871j22108p4832G2148
10203A2318M5972a89248C40775o7508A36381F3837a48193K6541l4038B12189a07627
$$ plain form
10191 180597 -61053 152587 -109755 176506 36514 -206275 -576462 -199992 -63844 254251
10180 -50809 152051 -36994 48 -119473 -123215 -99402 147451 320820 168210 126533 -53692
10168 275531 106031 170071 -81598 -47001 -89040 32500 -3940 -36479 -4076 -123963 2581 182539
10156 182539 88375 -31473 -261212 88237 188684 -29971 -307088 -33124 66570 -117061 -169099
10145 -169099 -231419 78064 -3126 49764 -5966 -57409 72136 -181331 -298009 -91313 118723
10133 -90863 291648 -41024 255558 35599 -160231 41069 27771 -73960 31189 -308568 -174826
10122 -174826 -105652 121219 8242 -69922 126342 -103926 63525 -85888 -315758 -8622 174097
10110 -20766 119920 -103035 -131013 25606 242572 -133802 105789 194170 -48130 181325
$$ packed form
10191A80597f1053A52587a09755A76506C6514b06275l70187a99992f3844B54251
10180e0809A52051c6994D8a19473l742K3813A47451J73369j52610m1677e3692
10168B75531A06031O4040h1598L4597m2039C2500c940l2539d076j19887B581J79958
10156A82539H8375c1473k29739H8237J00447b9971k77117c3124F6570a17061n2038
10145a69099o2320G8064c126D9764e966n1443G2136a81331j16678i1313A18723
10133i0863B91648d1024B55558C5599a60231D1069j3298g3960C1189c08568J33742
10122a74826O9174A21219H242f9922A26342a03926F3525h5888k29870h622A74097
10110b0766A19920a03035k7978B5606K16966a33802A05789Q8381d8130A81325
$$ plain form
10099 -291757 -12896 -507058 -109115 32951 -441295 59407 -68185 12433 -98215 -84968 -144315
10088 -144315 -206759 118778 -159418 -26611 -93348 -272824 164309 -208800 -127525 5064 -10478
10076 -403521 -117332 129 -274750 127029 -96076 37562 -227826 -201328 120002 1594 -167773
10064 -103744 -250258 229142 13287 20137 194079 -28917 140768 53391 -66182 -50474 -114533
10053 -114533 -78604 65620 82701 177366 -164655 177325 -180507 -414945 -321763 115049
10042 247175 -82277 -8939 -72868 144990 -281666 -118001 -533215 -176328 233198 -60262
10031 210899 -119302 -122154 290260 -65411 -195757 310967 18709 -220983 -143479 56245 55592
10020 55592 -101990 14972 -576269 230358 -258480 51596 122400 -51687 50703 -167764 181415
$$ packed form
10099b91757a2896m94162a09115C2951d41295E9407f8185A2433i8215J3247n9347
10088a44315o2444A18778a59418b6611o6737j79476A64309b08800Q1275E064a0478
10076d03521a17332A29b74750A27029i6076C7562b27826K6498A20002A594a67773
10064a03744j46514B29142A3287O850J73942b8917A40768E3391f6182J5708o4059
10053a14533L5929F5620J7081R4665a64655A77325a80507k34438R3182A15049
10042B47175h2277h939o3929A44990b81666a18001m15214a76328B33198f0262
10031B10899a19302k852B90260f5411j30346C10967A8709b20983P7504E6245o53
10020E5592a01990A4972e76269B30358b58480E1596P0804e1687E0703a67764A81415
$$ plain form
10008 -347903 -47376 46393 78678 180031 -200423 -179962 56375 30466 -207785 -251836 -79764
9996 145429 -249626 -60481 7816 89468 -323324 -237420 -348583 428107 302519 16874 -116156
9984 117189 -135778 -108229 105829 -62902 -132358 -329110 344844 -39820 44291 -44069 -147136
9973 -147136 -25036 -160132 78210 -63930 24173 116442 38607 231347 -149690 -36458 127986
9961 -220612 21906 -255825 -241224 -106515 -28169 29170 72265 -142628 -40575 -98470 -103162
9950 -103162 -247953 129886 -166014 -81590 -98128 187727 46924 115374 -101659 165013
9939 -130695 -155994 -153915 5677 -313049 -163192 219941 15510 -21374 406613 -222999 39405
9927 13872 -35324 -255840 -257224 -187391 -45098 36715 -197753 -179393 24551 -194540 -34939
$$ packed form
10008c47903d7376D6393L2285J01353b00423K0461E6375k5909b07785m4051g9764
9996A45429b49626f0481G816Q1652c23324Q5904j11163D28107j25588A6874a16156
9984A17189a35778K7549A05829f2902o9456j96752C44844c9820D4291d4069j03067
9973a47136b5036j35096G8210f3930B4173R2269C8607J92740a49690c6458A27986
9961b20612B1906b55825J4601a06515b8169B9170M3095a42628d0575n7895m692
9950a03162j44791A29886a66014h1590j6538A87727D6924O8450a01659A65013
9939a30695k5299K079E677c13049J49857B19941A5510b1374D06613b22999C9405
9927A3872c5324k20516j384O9833d5098C6715a97753J8360B4551a94540c4939
$$ plain form
9915 -181199 -66502 110434 -203399 76223 -250478 -39177 93413 -134087 -327598 -173458
9905 -173458 -217711 -95673 101126 -289623 168990 110327 -124810 70585 -90278 11469 -75850
9893 -53787 58384 101370 -75654 -99223 366314 -231368 -351771 -219540 -41868 52246 -166030
9881 -219265 -323771 112119 -24464 -35997 -151146 13148 142381 -250569 -453956 125612
9870 -321817 141242 211917 -71210 -56512 -165135 -113740 -55157 235436 360002 -39580 -32140
9859 -32140 -100514 -180500 -482800 -17332 -141228 -133734 35713 -302865 -276442 -39081 -163472
9848 -163472 -360984 410447 -162686 -253504 -131622 41023 106277 55779 -96599 124078 -307781
9836 -177295 -195538 -294251 -361923 -44108 -66434 -241742 -96251 237299 119216 80390 117068
$$ packed form
9915a81199f6502A10434b03399G6223b50478c9177I3413a34087j93511J54140
9905a73458m4253i5673A01126b89623A68990n8663a24810G0585i0278A1469g5850
9893e3787E8384M2986g5654k3569C66314b31368j20403J32231d1868E2246a66030
9881b19265j04506A12119b4464j1533j15149A3148J29233b50569k03387A25612
9870c21817A41242P0675g1210J4698j08623N1395e5157B35436J24566c9580P440
9859c2140o8374p9986l02300a7332j23896P494C5713c02865K6423c9081j24391
9848a63472j97512D10447a62686r0818J21882D1023O5254n0498i6599A24078c07781
9836a77295j8243r8713o7672d4108k2326j75308i6251B37299j18083l8826L6678
$$ plain form
9825 117068 56088 -284984 -117203 -207267 13740 -62897 2061 16152 115292 291232 -56334
9813 -217191 -164898 -290028 -71092 134009 93516 -453364 -140392 73364 -183853 -206672 -104167
9802 -104167 -28577 -51307 -199493 -65953 310941 -262725 -71841 20752 88242 -107634 -28745
9790 139088 52023 -148412 -193144 36846 129 -189949 -90094 -112044 229416 -339012 -161196
9778 157397 -75126 -73725 -182125 -147672 -18210 -244034 68231 -83223 308837 -61049 -54432
9767 -54432 -141944 -237499 134659 42231 -86396 -92947 -367358 150341 -360257 -219169 -146613
9756 -146613 -5889 -59705 -128264 -45553 -187119 -90540 -112072 -22729 66327 -423087 -49979
9744 -61146 -1558 -164950 -33983 -92941 -112485 -300989 133402 122416 -141004 -30138 -82398
$$ packed form
9825A17068E6088b84984a17203r0064A3740f2897B061J4091R9140J75940e6334
9813b17191N2293j25130g1092A34009m0493d53364a40392G3364a83853k2819J02505
9802a04167b8577k2730j48186f5953C10941b62725g1841B0752O7490a07634b8745
9790A39088E2023a48412m4732C6846A29a89949i0094k1950B29416c39012a61196
9778A57397g5126J401j08400L4453a8210k25824F8231h3223C08837f1049O617
9767e4432q7512r5555A34659D2231h6396o551k74411A50341c60257J41088P2556
9756a46613e889n3816o8559d5553j41566i0540k1532b2729F6327d23087d9979
9744f1146a558j63392c3983n8958j9544j88504A33402j0986a41004c0138n2260
$$ plain form
9733 -82398 -335685 27478 -92237 -107719 3121 -169517 -288178 -75521 -227385 -433648 -80299
9721 -108749 -107457 80431 -256108 85841 278556 58008 -4756 -213313 148153 -133734 151937
9709 17098 -157628 -59966 -2229 136671 70604 -158411 79893 86180 48360 -60841 -227715
9698 -227715 -392113 -66139 7081 -175402 -196746 236368 57647 -16884 207527 85535 35625
9686 -2657 -485773 -61475 -50910 -540140 -303125 43388 -256580 -199015 -314467 57537 -153657
9674 257906 -290121 21656 -17041 -150564 -92196 -10650 -140224 9177 182270 81450 240939
9663 240939 -95029 95702 -152852 -20324 -57475 -188606 -165593 51467 -40468 -21515 227828
9651 -32303 -250150 108650 60685 -296778 -161516 -208224 -75404 87508 96827 -63650 -177398
$$ packed form
9733h2398k53287B7478i2237j5482C121a69517j18661g5521j51864k06263h0299
9721a08749J292H0431b56108H5841J92715E8008d756k08557A48153a33734A51937
9709A7098a57628e9966b229A36671o6067a58411G9893O287l7820f0841j66874
9698b27715j64398f6139G081a75402k1344B36368E7647a6884B07527H5535C5625
9686b657m83116f1475J0565m89230K37015D3388b56580N7565j15452E7537a53657
9674B57906b90121B1656a7041j33523N8368a0650j29574I177J73093H1450J59489
9663B40939i5029I5702a52852b0324l7151j31131K3013E1467d0468J8953B27828
9651c2303k17847A08650m7965b96778J35262m6708g5404H7508R319f3650j13748
$$ plain form
9640 -177398 140507 163338 -100823 -181699 -85830 -11506 24850 246804 183734 -56487 -171508
9629 -171508 -56593 -169631 -249320 -261597 7049 77071 -190941 112491 116710 181828 -58898
9617 124691 297335 -223957 -19194 -259355 11192 -127789 144495 -180967 -309220 243889
9606 20304 135619 4010 -80751 8805 16306 -504077 300460 4341 -99335 -86375 -97416 350
9593 130448 -138160 44358 -178692 183610 -44248 -180156 -47729 -150397 -170209 90488 -256519
9581 12412 125930 -307464 -118580 -10476 78343 -323194 -241475 71111 88473 22048 130006
9570 130006 -202734 -166124 -262177 -158992 -111118 -118725 -300532 -58546 -61058 223544 -30295
9558 34313 117631 -185000 51581 -142741 -295694 -119057 -79659 101662 -31220 159469 31322
$$ packed form
9640a77398A40507K2831a00823q0876h5830a1506B4850K21954o3070e6487j15021
9629a71508e6593j13038p9689j2277G049P0022a90941A12491M219O5118e8898
9617A24691J72644b23957a9194k40161A1192a27789A44495a80967j28253B43889
9606B0304J15315D010h0751H805P501e04077C00460D341i9335J2960j1041C50
9593A30448a38160D4358a78692A83610d4248j35908d7729j02668j9812I0488b56519
9581A2412J13518c07464a18580a0476G8343c23194Q1719G1111J7362B2048J07958
9570A30006b02734L6610r6053J03185M7874p607j81807e8546k512B23544c0295
9558C4313Q3318a85000E1581a42741j52953a19057L9398A01662c1220A59469C1322
$$ plain form
9546 233545 -70211 -172964 -162575 -146482 91312 -377475 -157178 -466051 -30768 -105593 -115282
9535 -115282 -80376 -234027 -278614 -226122 -488376 156910 126727 -100248 -177085 -119790 -104126
9524 -104126 -199895 138760 -42670 90878 -472512 -173688 55573 -74890 -209088 -109803 -129116
9513 -129116 51054 97067 -340948 -230412 10247 -217552 -245117 11722 67912 160117 -368142
9501 -89419 -128598 26373 72085 56548 41011 175115 -14959 324144 58520 -2792 300591
9489 -158298 -27130 -386127 161644 -66832 185145 157769 -121437 -66412 -331253 80998 66671
9478 66671 -393095 259121 63668 -224680 -285361 -146512 -28138 -190964 -355005 7412 170261
9467 170261 70771 -75233 18193 -390274 -122149 -273094 -19817 -129375 -79354 -50279 -29187
$$ packed form
9546B33545g0211j02753J0389J6093I1312c77475a57178l08873c0768p4825r689
9535a15282L4906j53651m4587N2492k62254A56910l0183a00248p6837N7295J5664
9524a04126r5769A38760d2670I0878d72512a73688E5573g4890j34198R9285j9313
9513a29116E1054M6013c40948J10536A0247b17552k7565A1722N6190R2205c68142
9501h9419l9179B6373M5712j5537j5537J34104a4959C24144E8520b792C00591
9489a58298b7130l58997A61644f6832A85145k7376a21437N5025k64841H0998j4327
9478F6671c93095B59121F3668b24680o0681J38849b8138j62826j64041G412J62849
9467A70261G0771g5233A8193c90274a22149j50945a9817j09558N0021K9075K1092
$$ plain form
9456 -29187 -219247 23894 -45599 21915 -467957 23832 64564 128629 144323 -173683 50455
9444 -162965 -397044 134683 -274327 -132380 95791 -247255 129156 -93205 -246454 169 104987
9433 104987 209486 -187859 32983 -105072 -12915 192603 214222 69586 155800 -94613 228623
9421 -293389 -97002 201698 -24469 -24866 -120077 -238445 68208 148505 -132494 -154036 132168
9409 -162461 -76400 297953 34788 -155126 -374080 51551 -97853 8497 -335906 235743 -108155
9397 -150204 95382 125643 57499 218995 -307984 107243 -39174 -67715 34745 -277405 -40896
9385 -18737 131031 29376 36469 -168569 -25610 151868 -29954 -40536 -244541 79995 -319542
9373 22375 -306333 -192701 -291337 49138 40782 -150326 -421632 -36236 100509 173388 -77145
$$ packed form
9456b9187j90060B3894d5599B1915d67957B3832M0732O4065J5694a73683E0455
9444a62965k34079A34683b74327a32380I5791b47255A29156i3205j53249A69J04818
9433A04987J04499a87859C2983a05072a2915A92603K1619F9586Q6214i4613B28623
9421b93389i7002B01698b4469l97r5211j18368F8208Q0297a32494k1542A32168
9409a62461g6400B97953C4788a55126k18954E1551i7853H497c35906B35743a08155
9397a50204I5382L0261E7499J61496c07984A07243c9174k8541C4745b77405d0896
9385a8737A31031B9376P093a68569b5610A51868b9954j0582k04005G9995c19542
9373B2375c06333J13632r8636D9138q356a50326k71306c6236A00509P2879g7145
$$ plain form
9361 -116874 -73618 -66251 28520 -55722 -32596 -332442 93259 101148 -8767 99144 73479 42836
9349 42836 -87222 43470 48641 159498 113846 361341 -22699 -137696 -195083 -58817 126102
9337 229914 21977 -62396 -27548 17884 156184 97444 60886 -222650 19392 -238686 48073
9325 -50527 -140502 349761 -36933 -212536 -35630 -347790 16145 -138937 -211 -324205 20621
9313 82231 -272456 -148557 -15510 -56245 49598 -336635 -74689 -226001 192692 130275 370689
9302 370689 90017 145411 107629 -36220 -87499 -349145 -190970 -85495 -106021 -117899 -478927
9291 -478927 -235329 71174 -1264 -42863 -21954 123761 -248485 -585985 213571 -165606 -292488
9280 -292488 -60141 -214683 -45881 -45878 -322716 279220 -72409 39173 54998 278472 -9114 124785
$$ packed form
9361a16874M3256P367B8520e5722K3126k99846I3259P889h767I9144k5665l0643
9349D2836h7222D3470N171J10857m5652K47495b2699j14997n7387e8817A26102
9337B29914B1977f2396b7548A7884J38300n8740l6558b22650A9392b38686D8073
9325e0527q9975C49761c6933j75603c5630l12160A6145a38937b11l23994B0621
9313H2231b72456J23899a5510m0735D9598c36635g4689j51312A92692o2417K40414
9302C70689I0017N5394l7782c6220n1279k61646J58175h5495k0526j1878l61028
9291d78927b35329G1174a264m1599K0909A23761b48485l37500B13571a65606j26882
9280b92488f0141j54542d5881Lk76838B79220g2409C9173J5825K23474i114A24785
$$ plain form
9267 -128149 630 96395 -170815 -119952 -100140 -182707 -107815 -189568 -261233 -335113 -181788 -283616
9255 -283616 104289 276660 -195226 -145745 -93757 69951 -434982 -55184 102354 49209 -37805
9243 -188517 14061 -211338 -87070 -213592 106012 -169742 40070 -58903 105842 -245815
9232 -343103 -113824 -109837 396781 -75055 -226514 84213 -347976 59347 -151211 7595 -91500
9220 13303 79893 -280867 -232068 -280338 -33247 -207909 -166845 156281 63612 -186116 -5984
9208 -281895 166078 -293766 185610 153579 -69531 99909 -174807 47801 -123776 81747 -177172
9196 -17526 25840 -96816 156422 -258049 -150161 -74887 197535 174061 98215 -335873 1294
9184 155571 35963 -131710 286175 -128695 -168439 -96535 -237175 49530 -22892 42391 91784
$$ packed form
9267a28149F30R5765a70815N0863J9812q2567P4892q1753p1665p3880J53325j01828
9255b83616A04289J72371a95226M9481N1988F9951d34982e5184A02354D9209c7805
9243a88517A4061b11338h7070j26522A06012a69742D0070e8903A05842b45815
9232c43103a13824L987C96781g5055j51459H4213c47976E9347a51211G595i1500
9220A3303O6590b80867M8799m8270c3247j74662M1064A56281F3612a86116e984
9208b81895A66078b93766A85610l2031f9531I9909a74807D7801a23776H1747a77172
9196a7526B5840i6816A56422b58049J07888g4887A97535k3474p5846c35873A294
9184A55571C5963a31710B86175a28695l9744P1904j40640D9530b2892D2391M9393
$$ plain form
9173 91784 72583 -195615 -212134 51967 189584 -209598 121548 -95659 302527 -59470 -392972
9162 -392972 217780 280131 126934 97347 132929 -393500 -90206 37848 -142797 -228367 211707
9150 -350439 92776 -62901 66051 -48058 47846 -192046 -55329 -199167 -611264 79418 198324
9139 198324 -158610 -99673 -179142 -35602 10681 231866 50875 41605 -188419 -135180 309569
9127 117984 72458 211223 148002 -317128 -114804 -75675 -233138 -134492 104035 -334575
9116 -196606 -30824 113948 -249697 -64739 -270788 432 -323127 -88088 -101306 61669 -72208
9104 -79910 297463 175244 62438 79599 -117844 160383 -151929 -70195 -29372 -167947 -38855
9092 31693 4336 -61482 27941 -98628 105035 -95487 282745 121263 -222417 41120 123791
$$ packed form
9173I1784j9201a95615j6519E1967J37617b09598A21548i5659C02527e9470l33502
9162c92972B17780O2351A26934k9587L5582c93500i0206C7848a42797q5570B11707
9150c50439I2776f2901F6051d8058D7846a92046e5329j43838m12097G9418J18906
9139A98324a58610N8937p9469c5602A0681K21185E0875r270a88419N3239C09569
9127A17984m5526J38765o3221c17128a14804L9129j57463R8646A04035c34575
9116a96606c0824A13948b49697f4739k06049D32c23127h8088j3218F1669g2208
9104g9910B97463j22219F2438J7161a17844A60383a51929g0195b9372j38575c8855
9092C1693D336f1482B7941i8628A05035i5487B82745A21263b22417D1120Q2671
$$ plain form
9081 123791 -455273 -294306 -110020 -37394 220786 -24048 -55968 133392 -33312 7264 -265382
9069 -325191 -73886 -141405 -213351 161496 -64578 -236954 -56557 -83334 104929 -164610 -150520
9058 -150520 52762 -170738 -32053 257028 152757 -263544 -66712 -95588 -341779 -221010
9048 -221010 26933 -184341 46876 161760 -278284 -208722 -106807 -200984 -237024 -46898 -210747
9037 -210747 36808 106500 -304627 -48185 -171180 -88716 57487 -55555 138722 49065 -102992
9025 76359 -134681 -285578 -133665 194423 177016 12995 -194308 -34321 -274852 148608
9014 -122704 -153336 359162 -99646 -20265 39589 -314772 -314336 158720 109124 -124308 -59393
9002 -20771 -200370 -186665 -176635 -281107 -201803 -264112 -701 48070 -247064 126626 211398
$$ packed form
9081A23791d55273J60967a10020c7394B20786b4048l1920A33392c3312G264b65382
9069c25191g3886o7519p1946A61496f4578j72376e6557k6777A04929a64610J4090
9058a50520E2762a70738c2053B57028j04271b63544f6712k8876k46191J20769
9048b21010B6933a84341D6876J14884b78284O9562J01915r4177l6040d6898j63849
9037b10747C6808O9692c04627d8185j22995Q2464E7487e5555A38722D9065a02992
9025G6359a34681j50897a33665A94423j7407A2995a94308c4321k40531A48608
9014a22704l0632C59162i9646b0265C9589c14772M36A58720m9596a24308e9393
9002b0771j79599J3705J0030j04472P9304o2309g01D8070b47064A26626Q4772
$$ plain form
8991 211398 219638 -211482 201760 -63419 46086 80184 -323404 106028 23024 -298040 225528
8979 3478 143517 -97338 -89373 170785 115533 94150 196153 -100739 -49656 110896 164153
8968 164153 -114500 14418 -107575 -49243 13543 -185018 -297152 113935 217542 36358
8957 151851 26206 -178713 -272580 105738 -218701 82360 -5371 112304 -334422 164628 -104307
8945 -135912 101559 -287088 56167 -133546 -242234 128725 -135947 235504 208891 -172446
8934 12936 228011 -59902 295882 205208 -245002 -240219 -47879 -73778 18989 -54883 163280
8922 386119 548244 713400 424872 55690 -180730 -38701 -38192 -241074 93332 -8065 -414719
8911 -414719 -194840 -120844 -195399 -432150 -93140 -34476 -264827 -195239 -74280 -127404 134915
$$ packed form
8991B11398Q240b11482B01760f3419D6086L4098c23404A06028B3024b98040B25528
8979C478J40039i7338P965A70785n5252k1383J02003a00739d9656A10896N3257
8968A64153a14500A4418a07575d9243A3543a85018j12134A13935J03607C6358
8957A51851B6206a78713r3867A05738b18701H2360e371A12304c34422A64628a04307
8945a35912A01559b87088E6167a33546j08688A28725a35947B35504k6613a72446
8934A2936K15075e9902B95882r0674b45002M783d7879k5899A8989e4883A63280
8922C86119J62125J65156k88528E5690a80730c8701N09k02882I3332h065m06654
8911d14719a94840P3996p4555k36751i3140c4476k30351O9588g4280n3124A34915
$$ plain form
8899 229084 171491 -79058 -92005 70351 -336570 234420 -380064 -135850 -83344 -100811 -153887
8888 -153887 -111470 44918 -185906 -139186 145435 262642 93136 -202748 6969 112770 -23538
8876 -228616 -65757 -247230 -152936 -107921 -71329 395 -103091 151427 -75172 142384 -185781
8864 -311143 50290 -198377 -157117 -71333 6323 -137628 127490 -53783 -141278 -265837 62886
8852 -154605 -72138 -204806 -3171 -126542 -70932 -75431 -303512 117237 122716 -42163 -137989
$$ packed form
8899B29084n7593g9058j2947G0351c36570B34420c80064a35850N2506j7467n3076
8888a53887M2417D4918a85906M6720A45435J17207I3136b02748F969J05801b3538
8876b28616f5757j81473R4294M5015L6592C95a03091A51427g5172A42384a85781
8864c11143E0290a98377M1260g1333F323a37628A27490e3783q7495j24559F2886
8852a54605g2138j32668c171j23371N5610m499k28081A17237N479d2163r5826
$$ [...]
##END NTUPLES=NMR SPECTRUM
##END=
