##TITLE=AC1455_pasto13261_8026336_IqQmTIRiNe
##JCAMPDX= 6.0         $$ Bruker NMR JCAMP-DX V2.0
##DATA TYPE= NMR SPECTRUM
##DATA CLASS= NTUPLES
##ORIGIN= BRUKER
##OWNER= Administrator
$$ 1.72 TOPSPIN		Version 2.1
$$ 2013-07-11 14:37:05.827 -0700  Administrator@X
$$ Compression mode = diff/dup
##.OBSERVE FREQUENCY= 400.02188249412
##.OBSERVE NUCLEUS= ^1H
##.ACQUISITION MODE= SIMULTANEOUS (DQD)
##.ACQUISITION SCHEME= undefined
##.AVERAGES= 64
##.DIGITISER RES= 22
##SPECTROMETER/DATA SYSTEM= spect
##.PULSE SEQUENCE= noesygpps1d.comp
##.SOLVENT NAME= COFFEE_meoh
##.SHIFT REFERENCE= INTERNAL, COFFEE_meoh, 1, 14.96097
##AUDIT TRAIL= $$ (NUMBER, WHEN, WHO, WHERE, PROCESS, VERSION, WHAT)
$$ ##TITLE= Audit trail, TOPSPIN		Version 2.1
$$ ##JCAMPDX= 5.01
$$ ##ORIGIN= Bruker BioSpin GmbH
$$ ##OWNER= Administrator
$$ $$ E:\/data/COFFEE/nmr/AC1455_pasto13261_8026336_IqQmTIRiNe/12/pdata/1/auditp.txt
$$ ##AUDIT TRAIL=  $$ (NUMBER, WHEN, WHO, WHERE, PROCESS, VERSION, WHAT)
(   1,<2013-07-11 14:37:00.983 -0700>,<Administrator>,<X>,<go>,<TOPSPIN 2.1>,
      <created by zg
	started at 2013-07-11 14:25:31.325 -0700,
	POWCHK enabled, PULCHK disabled,
       configuration hash MD5:
       C8 4E 4E 5D D3 5C D8 9E 9F 52 82 E0 59 8A DE 15
       data hash MD5: 64K
       31 3A F7 C1 13 C0 84 A7 7F AD 72 F8 A0 F2 19 F2>)
(   2,<2013-07-11 14:37:03.889 -0700>,<Administrator>,<X>,<proc1d>,<TOPSPIN 2.1>,
      <Start of raw data processing
       efp LB = 0.3 FT_mod = 6 PKNL = 1 PHC0 = 0 PHC1 = 0 SI = 128K 
       data hash MD5: 128K
       CF 73 53 39 36 51 C7 85 73 92 E2 F6 88 E5 4A 1D>)
(   3,<2013-07-11 14:37:04.858 -0700>,<Administrator>,<X>,<proc1d>,<TOPSPIN 2.1>,
      <pk PHC0 = -81.69983 PHC1 = 0 
       data hash MD5: 128K
       8E BD A8 19 14 82 F2 6D 62 3E 03 13 DA 72 E4 A3>)
(   4,<2013-07-11 14:37:05.280 -0700>,<Administrator>,<X>,<proc1d>,<TOPSPIN 2.1>,
      <abs ABSG = 1 
       data hash MD5: 128K
       98 38 A5 F0 9C A3 BD 62 F2 7F 97 8D 5B 5B 7F C7>)
(   5,<2013-07-11 14:37:05.374 -0700>,<Administrator>,<X>,<proc1d>,<TOPSPIN 2.1>,
      <abs ABSG = 2 
       data hash MD5: 128K
       94 EF FD 56 38 69 ED E1 98 6D 62 FB 1B 55 B7 72>)
(   6,<2013-07-11 14:37:05.467 -0700>,<Administrator>,<X>,<proc1d>,<TOPSPIN 2.1>,
      <abs ABSG = 3 
       data hash MD5: 128K
       B7 B5 09 DE 8E 72 BE CF CC 55 8C 0F 0E 40 7C F6>)
(   7,<2013-07-11 14:37:05.530 -0700>,<Administrator>,<X>,<proc1d>,<TOPSPIN 2.1>,
      <abs ABSG = 4 
       data hash MD5: 128K
       87 78 DC 04 93 08 51 5E BC 4B C7 81 AB C3 15 5E>)
(   8,<2013-07-11 14:37:05.624 -0700>,<Administrator>,<X>,<proc1d>,<TOPSPIN 2.1>,
      <abs ABSG = 5 
       data hash MD5: 128K
       68 A4 B6 2A 7D 9F 34 A0 5C 18 DC CC BE DA 00 CF>)
$$ ##END=
$$ 
$$ $$ hash MD5
$$ $$ FB BD 41 1A 2E 3D C0 54 48 39 AE 84 8C 79 EB A2
##$RELAX= 
##$RELAX= 
##$RELAX= 
##$RELAX= 
##$RELAX= 
##$RELAX= 
##$RELAX= 
##$RELAX= 
$$ Bruker specific parameters
$$ --------------------------
##$DU= <E:\>
##$EXPNO= 12
$$ [...]
##$TP07= 0
##$TPNAME0= <>
##$TPNAME1= <>
##$TPNAME2= <>
##$TPNAME3= <>
##$TPNAME4= <>
##$TPNAME5= <>
##$TPNAME6= <>
##$TPNAME7= <>
##$TPOAL= (0..7)
0.5 0.5 0.5 0.5 0.5 0.5 0.5 0.5
##$TPOFFS= (0..7)
0 0 0 0 0 0 0 0
##$TUNHIN= 0
##$TUNHOUT= 0
##$TUNXOUT= 0
##$USERA1= <user>
##$USERA2= <user>
##$USERA3= <user>
##$USERA4= <user>
##$USERA5= <user>
##$V9= 5
##$VALIST= <valist>
##$VCLIST= <CCCCCCCCCCCCCCC>
##$VD= 0
##$VDLIST= <DDDDDDDDDDDDDDD>
##$VPLIST= <PPPPPPPPPPPPPPP>
##$VTLIST= <TTTTTTTTTTTTTTT>
##$WBST= 1024
##$WBSW= 4
##$XGAIN= (0..3)
0 0 0 0
##$XL= 0
##$YL= 0
##$YMAX_a= 6192765
##$YMIN_a= -12205450
##$ZGOPTNS= <>
##$ZL1= 120
##$ZL2= 120
##$ZL3= 120
##$ZL4= 120
##$ABSF1= 14.96097
##$ABSF2= -5.597212
##$ABSG= 5
##$ABSL= 3
##$ALPHA= 0
##$AQORDER= 0
##$ASSFAC= 0
##$ASSFACI= 0
##$ASSFACX= 0
##$ASSWID= 0
##$AUNMP= <proc_prof1d_extract.lims>
##$AXLEFT= 0
##$AXNAME= <>
##$AXNUC= <1H>
##$AXRIGHT= 0
##$AXTYPE= 0
##$AXUNIT= <>
##$AZFE= 0.1
##$AZFW= 0.1
##$BCFW= 0
##$BC_mod= 0
##$BYTORDP= 0
##$COROFFS= 0
##$CY= 15
##$DATMOD= 1
##$DC= 0
##$DFILT= <>
##$DTYPP= 0
##$F1P= 0
##$F2P= 0
##$FCOR= 0.5
##$FTSIZE= 131072
##$FT_mod= 6
##$GAMMA= 0
##$GB= 0
##$INTBC= 1
##$INTSCL= 1
##$ISEN= 128
##$LB= 0.3
##$LEV0= 0
##$LPBIN= 0
##$MAXI= 10000
##$MC2= 0
##$MEAN= 0
##$ME_mod= 0
##$MI= 0
##$NCOEF= 0
##$NC_proc= -2
##$NLEV= 6
##$NOISF1= 0
##$NOISF2= 0
##$NSP= 0
##$NTH_PI= 0
##$NZP= 0
##$OFFSET= 14.96097
##$PC= 1
##$PHC0= -81.69983
##$PHC1= 0
##$PH_mod= 1
##$PKNL= yes
##$PPARMOD= 0
##$PPDIAG= 0
##$PPIPTYP= 0
##$PPMPNUM= 2147483647
##$PPRESOL= 1
##$PSCAL= 4
##$PSIGN= 0
##$PYNMP= <proc.py>
##$REVERSE= no
##$SF= 400.020009649478
##$SI= 131072
##$SIGF1= 0
##$SIGF2= 0
##$SINO= 400
##$SIOLD= 131072
##$SPECTYP= <>
##$SREGLST= <1H.CDCl3>
##$SSB= 0
##$STSI= 131072
##$STSR= 0
##$SW_p= 8223.68421052631
##$SYMM= 0
##$S_DEV= 0
##$TDeff= 65536
##$TDoff= 0
##$TI= <>
##$TILT= no
##$TM1= 0
##$TM2= 0
##$TOPLEV= 0
##$USERP1= <user>
##$USERP2= <user>
##$USERP3= <user>
##$USERP4= <user>
##$USERP5= <user>
##$WDW= 1
##$XDIM= 131072
##$YMAX_p= 418945818
##$YMIN_p= -11298
##$CURPLOT= <Network HP LaserJet P1505>
##$CURPRIN= <$Network HP LaserJet P1505>
##$DFORMAT= <normdp>
##$LAYOUT= <+/1D_H.xwp>
##$LFORMAT= <normlp>
##$PFORMAT= <normpl>
##$SURQMSG= 1
$$ End of Bruker specific parameters
$$ ---------------------------------
##NTUPLES= NMR SPECTRUM
##VAR_NAME=  FREQUENCY,     SPECTRUM/REAL,   SPECTRUM/IMAG
##SYMBOL=    X,             R,               I
##VAR_TYPE=  INDEPENDENT,   DEPENDENT,       DEPENDENT
##VAR_FORM=  AFFN,          ASDF,            ASDF
##VAR_DIM=   131072,        131072,          131072
##UNITS=     HZ,            ARBITRARY UNITS, ARBITRARY UNITS
##FACTOR=    0.0627417313425164, 1,          1
##FIRST=     8223.62146879497, 120,          -54033
##LAST=      0,             1820,            -54830
##MIN=       0,             -11298,          0
##MAX=       8223.62146879497, 418945818,    0
$$ Real data points
##PAGE= N=1
##DATA TABLE= (X++(R..R)), XYDATA
$$ [...]
63955H02726M5623N2875O1407P1163Q1741R3188J06096J20678J36400J52767J69729
63944A894393J86931K03200K17351K29027K38347K45107K48740K48494K43240
63935C954830K31679K13379J89292J60838J28906R4207N7949K1269j5639n3057
63925D983653r0384j25925j57870j85025k06787k23001k33832k39409k39794k35648
63915C045978k28480k19535k08665j95016j78738j61316j44343j28596j14290
63906A466999j01351q9418p8246o8254o0055n3427m7405m1545l6320l2131k8657
63895H30190k5546k3070k1550k0699j9999j9379j9025j8884j8769j8611j8222
63884F06436j7121j5062j2493j0097q074o211m406k633p19J352L136M240N043
$$ plain form
63955 802726 848349 901224 962631 1033794 1115535 1208723 1314819 1435497 1571897 1724664 1894393
63944 1894393 2081324 2284524 2501875 2730902 2969249 3214356 3463096 3711590 3954830
63935 3954830 4186509 4399888 4589180 4750018 4878924 4973131 5031080 5052349 5036710 4983653
63925 4983653 4893269 4767344 4609474 4424449 4217662 3994661 3760829 3521420 3281626 3045978
63915 3045978 2817498 2597963 2389298 2194282 2015544 1854228 1709885 1581289 1466999
63906 1466999 1365648 1276230 1197984 1129730 1069675 1016248 968843 927298 890978 858847 830190
63895 830190 804644 781574 760024 739325 719326 699947 680922 662038 643269 624658 606436
63884 606436 589315 574253 561760 551663 543589 537378 532972 530339 529620 530972 534108 538348 543391
63871E43391O294Q036R567J0557J1491J2705J3610J3476J2575J1895J1806J1614
63859F77017J0590Q852O981N212L412J605o4j748l738n735o958p255p712r458
63845F71001j2229j4645j5888j6384j6826j7258j7467j7661j8130j8637j8698
63834D87178j8308j7773j7045j5839j4430j3586j3526j3514j2821j1589j0340
63823C28407r159p909o852o322n976n131l916l273l574l956l494k439j745j720
63809B62941j843j715j508j438j411j338j402j802k467l110l365k965k074j349
63795B35154j293j605j584j123p65q00r40j003j252j749k017j748j364j364j595
63780B14952j615j413j204r01l28K62M97M69M58K96l24j096j361j098r34j089
$$ plain form
63871 543391 549685 557721 567288 577845 589336 602041 615651 629127 641702 653597 665403 677017
63859 677017 687607 696459 703440 708652 712064 713669 713605 711857 708119 702384 695426 688171 680459 671001
63845 671001 658772 644127 628239 611855 595029 577771 560304 542643 524513 505876 487178
63834 487178 468870 451097 434052 418213 403783 390197 376671 363157 350336 338747 328407
63823 328407 319248 311339 304487 298165 292189 287058 283142 279869 276295 272339 268845 266406 264661 262941
63809 262941 261098 259383 257875 256437 255026 253688 252286 250484 248017 244907 241542 238577 236503 235154
63795 235154 233861 232256 230672 229549 228784 227984 227044 226041 224789 223040 221023 219275 217911 216547 214952
63780 214952 213337 211924 210720 209819 209491 209753 210250 210719 211177 211473 211149 210053 208692 207594 206660 205571
63764B05571j013l28M95P08K01n10q72o59m9N03O52N27N70R47J416J714J754J444
63746B13071P85J77J79P84J390J659J905K391K727K384J516Q34Q39J401K020K250
63730B36312K083K009K457L131L237K565J865J943K756L710M387M608M262L557
63716B78882L078L030K733J558or43j184j551k305k713k356j864j881k027j666
63701B70785j042q52j016p85P0R63J465J825K328K767K921L063L519M063M133
63686B94207L497K358J063M1k53J64N27O8r55j544j267p37n85n87k44L39O93P67
63668B97552Q57R30O76K44K93J065J928K117J572P59q9j141k482l796m653m913
63652B90919m763m350l598k519j564j282j504j299j74J012J005j14q41j17J400
$$ plain form
63764 205571 204558 204230 204725 205433 205634 205124 204252 203593 203544 204047 204699 205226 205796 206743 208159 209873 211627 213071
63746 213071 213856 214033 214212 214996 216386 218045 219950 222341 225068 227452 228968 229802 230641 232042 234062 236312
63730 236312 238395 240404 242861 245992 249229 251794 253659 255602 258358 262068 266455 271063 275325 278882
63716 278882 281960 284990 287723 289281 289275 288332 287148 285597 283292 280579 278223 276359 274478 272451 270785
63701 270785 269743 268891 267875 267090 267160 268123 269588 271413 273741 276508 279429 282492 286011 290074 294207
63686 294207 297704 300062 301125 301166 300913 301077 301604 301672 300717 299173 297906 297169 296584 295997 295753 296092 296785 297552
63668 297552 298409 299339 300015 300259 300552 301617 303545 305662 307234 307993 307904 306763 304281 300485 295832 290919
63652 290919 286156 281806 278208 275689 274125 272843 271339 270040 269866 270878 271883 271769 270928 270811 272211
63637B72211K360K455K503L120M023M647M847M822M715M662M972N983P647R439
63623C38406J0733J1340J1672J2316J3430J4647J5657J6691J8259K0420K2586
63612E06157K4148K5206K6442K8288L0379L1939L2541L2184L0673K7365K1911
63601H17233J4992Q018K077k500n737p685q587q962r244r548r961j0755j2164
63588G57177j4146j6553j9315k2183k4510k5557k5079k3459k1371j9339j7467
63577E28198j5504j3319j1230r651q385o736m411j923J65J890L486M797N631O339
63563D79347P451Q872R994J0519J0644J0601J0533J0814J1853J3594J5664J8090
63551F17976K1287K5258K9426L3408L7246M0514M1785L9589L3725K5297J5843
$$ plain form
63637 272211 274571 277026 279529 282649 286672 291319 296166 300988 305703 310365 315337 321320 328967 338406
63623 338406 349139 360479 372151 384467 397897 412544 428201 444892 463151 483571 506157
63612 506157 530305 555511 581953 610241 640620 672559 705100 737284 767957 795322 817233
63601 817233 832225 840243 842320 839820 834083 826398 817811 808849 799605 790057 780096 769341 757177
63588 757177 743031 726478 707163 684980 660470 634913 609834 586375 565004 545665 528198
63577 528198 512694 499375 488145 478494 470109 463373 458962 457039 457204 459094 462580 467377 473008 479347
63563 479347 486798 495670 505664 516183 526827 537428 547961 558775 570628 584222 599886 617976
63551 617976 639263 664521 693947 727355 764601 805115 846900 886489 920214 945511 961354
63540I61354O735r58o646j0269j1939j1801j0432q930q070p685p420p794r785
63527H66360j3414j7559k1283k4626k7786l0240l1263l0933l0033k9095k7999
63516E82129k6429k4350k2030j9869j8165j6857j5533j3929j2268j0860r599q222
63504C84018o927o220o048n639m505l161k463k464k424j852j075o47n93n42l94
63489C39064m73r28j319j058j95N31N58K38M21J455K876M034M694M883M556L666
63473C63003K467J394N94k06j311k587l454l397k555j730j643k206k697k684k426
63458C40562k284k121j583p17J03P86J635K884M379N679O342O192N576N314O046
63443C78793P673R594J1400J3069J4662J6297J8326K0992K3832K5791K6108K4755
$$ plain form
63540 961354 968089 967131 960485 950216 938277 926476 916044 907114 899044 891359 883939 876145 866360
63527 866360 852946 835387 814104 789478 761692 731452 700189 669256 639223 610128 582129
63516 582129 555700 531350 509320 489451 471286 454429 438896 424967 412699 401839 392240 384018
63504 384018 377091 370871 364823 359184 354679 351518 349055 346591 344167 342315 341240 340593 340000 339458 339064
63489 339064 338591 337663 336344 335286 335091 335622 336180 336418 336839 338294 341170 345204 349898 354781 359337 363003
63473 363003 365470 366864 367458 367252 365941 363354 359900 356503 353948 352218 350575 348369 345672 342988 340562
63458 340562 338278 336157 334574 333857 333960 334746 336381 339265 343644 349323 355665 361857 367433 372747 378793
63443 378793 386466 396060 407460 420529 435191 451488 469814 490806 514638 540429 566537 591292
63431E91292K1993J8062J3572R716P604P501Q940J1338J4271J7354K0355K3376
63419G65374K6724L0487L4313L7548L9435L9365L7033L2442K5868J7944R747K448
63407A098728l280p348r856j0938j1010j0791j0869j1556j3194j6177k0391k4994
63395I48324k9090l2352l4762l6138l6260l5219l3283l0620k7508k4512k2056
63384F06524j9987j7927j5816j3772j1620r105o413l986j858L64K835N184P022
63371E21445Q424R781J1334J2961J4327J5311J6306J7887K0071K2261K4134K6144
63359G20386K8777L1688L4101L5769L6867L7178L6071L3199K8653K2536J5152
63348A060377P559J070l899p845j0922j2606j2826j2549j2681j3192j3939j5577
$$ plain form
63431 591292 613285 631347 644919 654635 662239 669740 678680 690018 704289 721643 741998 765374
63419 765374 792098 822585 856898 894446 933881 973246 1010279 1042721 1068589 1086533 1096280 1098728
63407 1098728 1095448 1088100 1078244 1067306 1056296 1045505 1034636 1023080 1009886 993709 973318 948324
63395 948324 919234 886882 852120 815982 779722 744503 711220 680600 653092 628580 606524
63384 606524 586537 568610 552794 539022 527402 518297 511884 507898 506040 506404 509239 514423 521445
63371 521445 529869 539650 550984 563945 578272 593583 609889 627776 647847 670108 694242 720386
63359 720386 749163 780851 814952 850721 887588 924766 960837 994036 1022689 1045225 1060377
63348 1060377 1067936 1069006 1065107 1057262 1046340 1033734 1020908 1008359 995678 982486 968547 952970
63336I52970j8772k2951k6729k9402l1205l2300l2405l1428k9751k7582k4762
63325F45683k1402j8147j5337j2443q893n321l370m170p293j1278j4801j7168
63313E06060j8050j7314j5309j2935j1100j0109r607r008p877o127m126k489j512
63300C80497r37m41k13o24j567k533l242l718l810l332k724k827l688m265l770
63285C42806k680j954j804j863k037k382k513k017j302j187j654j901j635j414
63271C16463j480j176q7J035J213N84J24L00P35J051J315J669K058K432K797K985
63255C32018K821K604K897L728M392M431M282M627N394O017O406P044Q099R093
63241D03853R692J0274J1329J2725J4019J5256J6831J8639J9965K0371K0306K0553
$$ plain form
63336 952970 934198 911247 884518 855116 823911 791611 759206 727778 698027 670445 645683
63325 645683 624281 606134 590797 578354 569461 564140 560770 556600 549307 538029 523228 506060
63313 506060 488010 470696 455387 442452 431352 421243 411636 402628 394751 388624 384498 382009 380497
63300 380497 379560 379119 378906 378282 376715 374182 370940 367222 363412 360080 357356 354529 350841 346576 342806
63285 342806 340126 338172 336368 334505 332468 330086 327573 325556 324254 323067 321413 319512 317877 316463
63271 316463 314983 313807 313720 314755 315968 316552 316676 316976 317711 318762 320077 321746 323804 326236 329033 332018
63255 332018 334839 337443 340340 344068 348460 352891 357173 361800 367194 373211 379617 386661 394760 403853
63241 403853 413545 423819 435148 447873 461892 477148 493979 512618 532583 552954 573260 593813
63229E93813K1415K2605K3608K3987K3590K2811K2295K2155K1748K0694J9787
63218H38508K0176K1735K2963K2796K1748K0844K0012J8261J5083J0900O155P84
63206A039965n199j1231j6682k1362k5225k7960k9388k9878k9822k8902k6561
63195G87755k3166k0032j8012j6596j4745j2159r309o528l686o90K208M679O694
63182F76413Q464J0188J1829J3026J3357J2921J2551J3051J4195J4901J4542J3670
63170H29108J3171J3087J2697J1592J0127Q719P179M934J696k381o934j1472j5293
63157H76230j7872j9402k0746k2555k4585k6017k6276k5390k3788k2019k0556
63146F27024j9442j8114j5976j3167j0554q833q035p875q112q283p631n803l443
$$ plain form
63229 593813 615228 637833 661441 685428 709018 731829 754124 776279 798027 818721 838508
63218 838508 858684 880419 903382 926178 947926 968770 988782 1007043 1022126 1033026 1039181 1039965
63206 1039965 1034766 1023535 1006853 985491 960266 932306 902918 873040 843218 814316 787755
63195 787755 764589 744557 726545 709949 695204 683045 673736 667208 663522 662832 665040 669719 676413
63182 676413 684877 695065 706894 719920 733277 746198 758749 771800 785995 800896 815438 829108
63170 829108 842279 855366 868063 879655 889782 898501 905680 910614 912310 909929 902995 891523 876230
63157 876230 858358 838956 818210 795655 771070 745053 718777 693387 669599 647580 627024
63146 627024 607582 589468 573492 560325 549771 540938 532903 525028 516916 508633 501002 495199 491756
63133D91756j676j033j108j110m72Q33K277L269L929N031O761Q000P557N934M874
63118E34822N128N603N066L846L119L073K695J338k86r75m57L26L36m91j298j357
63102E60488p19Q5P03J006Q36J54o59j132j284j474j698j593j136p45n41j04P44
63085E52931J522J763J636J529J491J511J888K797L864M642N234N933O608O972
63071F00321P212P777Q694R624J0402J1065J1538J1886J2627J4180J6202J8087
63059G39615J9969K2440K5395K8045L0188L2573L5700L9059M1981M4488M6858
63048A106311M8962N0682N2406N4382N5921N6006N4626N2855N1644N1021N0541
63037A685357M9988M9449M9092M9029M9170M9040M7894M5134M0536L4175K6308
$$ plain form
63133 491756 490080 489047 487939 486829 486357 487190 489467 492736 496665 501696 508457 516457 524014 529948 534822
63118 534822 539950 545553 550619 554465 557584 560657 563352 564690 564404 563429 562972 563298 563634 563143 561845 560488
63102 560488 559769 559854 560557 561563 562399 562553 561894 560762 559478 558004 556306 554713 553577 552832 552291 552187 552931
63085 552931 554453 556216 557852 559381 560872 562383 564271 567068 570932 575574 580808 586741 593349 600321
63071 600321 607533 615310 624004 633628 644030 655095 666633 678519 691146 705326 721528 739615
63059 739615 759584 782024 807419 835464 865652 898225 933925 972984 1014965 1059453 1106311
63048 1106311 1155273 1205955 1258361 1312743 1368664 1424670 1479296 1532151 1583795 1634816 1685357
63037 1685357 1735345 1784794 1833886 1882915 1932085 1981125 2029019 2074153 2114689 2148864 2175172
63026B175172J7320P418l558j5730k8446m0333n0305n8257o4537o9001p1121p0850
63014A727772o8884o5904o2030n7217n1728m5879l9642l3039k6563k0670j4988
63003A241228q769k121L973Q909J3019J6557J9119K0583K1823K3564K5154K5516
62991A408555K4932K4722K5248K5499K4772K3567K2350K0530J7394J3219Q686
62980A639474L767j980q479j5296k2432l0023l7362m3064m6386m7889m8628m9135
62968A292567m9244m8485m6550m3643m0467l7642l5221l2969l0884k9058k7224
62957H71180k5043k2750k1017k0110j9681j9399j9173j8669j7389j5515j4041
62946F58393j3633j3748j3418j2482j1522j0919j0574j0286r831q835p194n663
$$ plain form
63026 2175172 2192492 2199910 2196352 2180622 2152176 2111843 2061538 2003281 1938744 1869743 1798622 1727772
63014 1727772 1658888 1592984 1530954 1473737 1422009 1376130 1336488 1303449 1276886 1256216 1241228
63003 1241228 1232459 1230338 1234311 1243220 1256239 1272796 1291915 1312498 1334321 1357885 1383039 1408555
62991 1408555 1433487 1458209 1483457 1508956 1533728 1557295 1579645 1600175 1617569 1630788 1639474
62980 1639474 1643241 1641261 1632782 1617486 1595054 1565031 1527669 1484605 1438219 1390330 1341702 1292567
62968 1292567 1243323 1194838 1148288 1104645 1064178 1026536 991315 958346 927462 898404 871180
62957 871180 846137 823387 802370 782260 762579 743180 724007 705338 687949 672434 658393
62946 658393 644760 631012 617594 605112 593590 582671 572097 561811 551980 543145 535951 530288
62934E30288n264n949o411n595l959k793k588k626k089j084l89n01j194j886k200
62919D85760k153j999j972k107k239k151j856j617j642j825j954k061k353k731
62905D57100k810k486k164k170k217j880j286q92p15l64J40K64j23l26K34J066
62889D41371J155K05j100j985k227j978j415p46j85K71Q13J542K299K832K923
62874D43775K380J168l44j528j988j818j379j007r27j153j399j287q00k94nK03
62858D33597N29R36J316J656J856J745J518J808K864L894L766K392Q88K70M21
62843D59456N28J69m17q43j022j034r10o58m27m56p64r72o59L3L33l14j444j911
62825D48688j083N76K167L209L667L598L178K905L187L718L762L173K702L003
$$ plain form
62934 530288 525024 519075 512664 507069 503110 500317 497729 495103 493014 491930 491541 491040 489846 487960 485760
62919 485760 483607 481608 479636 477529 475290 473139 471283 469666 468024 466199 464245 462184 459831 457100
62905 457100 454290 451804 449640 447470 445253 443373 442087 441195 440480 440116 440256 440520 440397 440071 440305 441371
62889 441371 442526 442731 441631 439646 437419 435441 434026 433280 433095 433366 434179 435721 438020 440852 443775
62874 443775 446155 447323 446979 445451 443463 441645 440266 439259 438332 437179 435780 434493 433693 433399 433394 433597
62858 433597 434126 435062 436378 438034 439890 441635 443153 444961 447825 451719 455485 457877 458765 459035 459456
62843 459456 459984 460153 459736 458893 457871 456837 455927 455269 454842 454386 453622 452650 451991 452024 452357 452043 450599 448688
62825 448688 447605 448181 450348 453557 457224 460822 464000 466905 470092 473810 477572 480745 483447 486450
62811D86450L752M199M269M508N027N203M693M188M646O053P496Q325Q727R111
62797E66647R508R802J0202J1052J2380J3945J5657J7657K0066K2852K5980K9465
62785G65213L3319L7617M2552M8166N4007N9391O4146O8839P3970P9171Q3473
62774A409864Q6279Q7702Q7895Q6472Q2780P6547O7968N7268M4528L0013J4409
62763B131725j392j6653l0843m3525n4423o3611p1428p7983q2745q4890q4221
62752A520011q1723p8858p6197p3076o8795o3831n9314n5590n1921m7673m3114
62741H19919l8804l4850l1186k8013k5370k2772j9882j7151j5102j3322j1078
62730E62389q702p265o890o449n302m261m168m449l889k302n04R62K208L288L992
$$ plain form
62811 486450 490202 494401 498670 503178 508205 513408 518101 522289 526935 532988 540484 548809 557536 566647
62797 566647 576155 585957 596159 607211 619591 633536 649193 666850 686916 709768 735748 765213
62785 765213 798532 836149 878701 926867 980874 1040265 1104411 1173250 1247220 1326391 1409864
62774 1409864 1496143 1583845 1671740 1758212 1840992 1917539 1985507 2042775 2087303 2117316 2131725
62763 2131725 2130333 2113680 2082837 2039312 1984889 1921278 1849850 1771867 1689122 1604232 1520011
62752 1520011 1438288 1359430 1283233 1210157 1141362 1077531 1018217 962627 910706 863033 819919
62741 819919 781115 746265 715079 687066 661696 638924 619042 601891 586789 573467 562389
62730 562389 553687 546422 539532 533083 527781 523520 519352 514903 511014 508712 508208 509170 511378 514666 518658
62715E18658M383M913N866P178Q844J0980J3414J5686J7658J9701K2132K4790
62703F74203K7419L0151L3382L7268M1449M5228M8050N0043N2059N4877N8267
62692A152396O1028O1984O0769N7616N2722M6038L7608K7819J7311O676l720j3718
62680A564529k3240l2253m0710m8317n4394n8301o0112o0581o0223n8833n6162
62669A011403n2742m9479m6569m3428l9726l5948l2746l0173k7763k5119k2187
62658F05523j9234j6765j5222j4522j3992j3038j1772j0817j0563j0692j0498
62647D58408r497p808n992m589l710l055k247j226l04J32L1k48l22k22k54n12
62631D18585p43p69p40q27r35q67n91k07K12O25J045J629K482L282L539L333L328
$$ plain form
62715 518658 523041 527954 533820 540998 549842 560822 574236 589922 607580 627281 649413 674203
62703 674203 701622 731773 765155 802423 843872 889100 937150 987193 1039252 1094129 1152396
62692 1152396 1213424 1275408 1336177 1393793 1446515 1492553 1530161 1557980 1575291 1581967 1578247 1564529
62680 1564529 1541289 1509036 1468326 1420009 1365615 1307314 1247202 1186621 1126398 1067565 1011403
62669 1011403 958661 909182 862613 819185 779459 743511 710765 680592 652829 627710 605523
62658 605523 586289 569524 554302 539780 525788 512750 500978 490161 479598 468906 458408
62647 458408 448911 441103 435111 430522 426812 423757 421510 420284 419980 420112 420143 419895 419573 419351 419097 418585
62631 418585 417842 417073 416333 415506 414571 413704 413113 412906 413118 413743 414788 416417 418899 422181 425720 429053 432381
62614D32381L808M234M219M285N080O257O977P177P520Q269R077R892J1200J3207
62600E33583J5519J7840K0340K3105K5936K8847L2126L5601L8521M0491M1900
62589H53809M3001M3180M1665L8470L4121K8914K2988J6733J0453L810l747j1959
62577A121438j9643k5661k9774l2599l4957l7157l8737l8996l7894l6184l4492
62566G55344l2673l0363k7812k5672k4131k2738k0996j8762j6102j3211j0568
62555E12316q791q107q069p897p113n878m793m271m080l525k201m89P11P56j97
62540D48372j278j625j191p29q18j124r53k93K74N67J029J890K817L613M532N651
62524D60734O584P341Q701J1143J3921J5954J7266J8778K0977K3558K6171K8759
$$ plain form
62614 432381 436189 440423 444642 448927 454007 460264 467241 474418 481938 490207 499284 509176 520376 533583
62600 533583 549102 566942 587282 610387 636323 665170 697296 732897 771418 811909 853809
62589 853809 896810 939990 981655 1020125 1054246 1083160 1106148 1122881 1133334 1137144 1133397 1121438
62577 1121438 1101795 1076134 1046360 1013761 978804 941647 902910 863914 826020 789836 755344
62566 755344 722671 692308 664496 638824 614693 591955 570959 552197 536095 522884 512316
62555 512316 503525 495418 487349 479452 472339 466461 461668 457397 453317 449792 447591 447102 447813 448569 448372
62540 448372 447094 445469 444278 443549 442731 441607 440654 440361 440635 441202 442231 444121 446938 450551 455083 460734
62524 460734 467318 474659 483360 494503 508424 524378 541644 560422 581399 604957 631128 659887
62512F59887L1146L3045L4541L5973L7250L7822L7373L6043L3882L0586K6092
62501A033640K0922J5778J1017O675K686j027m382o885p831o943m627j461K296
62488A059858O588J1213J5896K0540K5226K9926L4433L8479M1765M3685M3203
62477A370812L9431L2588K4221J6072Q651J199p129j6447k6462l6800m6523n4038
62465A305575n8230n9652n9899n9912n9360n7635n4797n1293m7230m2377l6781
62454G18409l1129k6353k2838k0083j7261j4093j0966q271o025m223k985k096
62442E52086q63J055L121M666N792O908P753P654O582N163L680J834l67k294l543
62427E99227m470n525o589p319p770q198q593q739q625q433q187p711o945o193
$$ plain form
62512 659887 691033 724078 758619 794592 831842 869664 907037 943080 976962 1007548 1033640
62501 1033640 1054562 1070340 1081357 1088032 1090718 1089691 1085309 1078424 1070593 1063650 1059023 1057562 1059858
62488 1059858 1066446 1077659 1093555 1114095 1139321 1169247 1203680 1242159 1283924 1327609 1370812
62477 1370812 1410243 1442831 1467052 1483124 1491775 1492974 1485845 1469398 1442936 1406136 1359613 1305575
62465 1305575 1247345 1187693 1127794 1067882 1008522 950887 896090 844797 797567 755190 718409
62454 718409 687280 660927 638089 618006 600745 586652 575686 567415 561390 557167 554182 552086
62442 552086 551223 552278 555399 560065 565857 572765 580518 588172 594754 599917 603597 605431 605064 602770 599227
62427 599227 594757 589232 582643 575324 567554 559356 550763 542024 533399 524966 516779 509068 502123 495930
62413D95930n888o100o289n796m645l607l277l397l365l074k718k117r74L39J029
62398D46051R92R23J161J215Q28P22J580K833L280K708K144K397L078L362L214
62383D76488L408M405N729O571O767O852P313Q095Q849R360R551R456R388R875
62369E82107J1156J2877J4568J6165J7877J9809K2046K4794K8010L1221L4210
62358H14840L7598M2131M7493N2460N6114N8292N8931N7677N4268M8703M1033
62347A369540L1605K1571J2406M678k119q477j4315j9677k5071l0696l5923m0031
62335A263491m2897m4548m4645m2961l9963l6460l2934k9611k6696k4110k1441
62324H77225j8609j6199j4725j3988j3568j3493j3894j4543j5216j6020j6719
$$ plain form
62413 495930 490042 483942 477653 471857 467212 463605 460328 456931 453566 450492 447774 445657 444683 445022 446051
62398 446051 447043 447966 449127 450342 451170 451892 453472 456305 459585 462293 464437 466834 469912 473274 476488
62383 476488 479896 484301 490030 496601 503368 510220 517533 525628 534477 543837 553388 562844 572232 582107
62369 582107 593263 606140 620708 636873 654750 674559 696605 721399 749409 780630 814840
62358 814840 852438 894569 942062 994522 1050636 1108928 1167859 1225536 1279804 1328507 1369540
62347 1369540 1401145 1422716 1435122 1439800 1437681 1429204 1414889 1395212 1370141 1339445 1303522 1263491
62335 1263491 1220594 1176046 1131401 1088440 1048477 1012017 979083 949472 922776 898666 877225
62324 877225 858616 842417 827692 813704 800136 786643 772749 758206 742990 726970 710251
62313G10251j6348j4388j1908j0527j0364j0040q697p042o108n839n411m365l022
62300E96192k140k397l818n541o440o161n224m105k802j452o56p29j066q76k10
62285E52575L05N66J145K298L453L958L919L964M403M975N325N463N740O566Q062
62270F12717R855J1236J1835J2127J2983J4638J6554J8403K0755K4288K8736L3200
62258H27327L7410M1952M7149N2331N6508N9305O0870O1153N9694N6046N0119
62247A409864M2241L3050K3334J3872N306k104q814j5895k3981l2383l9707m5407
62235A359376n0065n4054n6671n7087n5480n2643m9022m4790m0533l6945l3952
62224H28134l0853k7354k3927k1020j8511j6081j3746j1767j0256r053p873o636
$$ plain form
62313 710251 693903 679515 667607 657080 646716 636676 627979 620937 614829 608990 603579 599214 596192
62300 596192 594052 591655 587837 582296 575856 569695 564471 560366 557564 556112 555456 554727 553661 552785 552575
62285 552575 552880 553446 554591 556889 560342 564300 568219 572183 576586 581561 586886 592349 598089 604655 612717
62270 612717 622572 633808 645643 657770 670753 685391 701945 720348 741103 765391 794127 827327
62258 827327 864737 906689 953838 1006169 1062677 1121982 1182852 1244005 1303699 1359745 1409864
62247 1409864 1452105 1485155 1508489 1522361 1527667 1525563 1516749 1500854 1476873 1444490 1404783 1359376
62235 1359376 1309311 1255257 1198586 1141499 1086019 1033376 984354 939564 899031 862086 828134
62224 828134 797281 769927 746000 724980 706469 690388 676642 664875 654619 645566 637693 631057
62212F31057n690n451n670n399m075k289j019l53L47J282K012K438L081M095M855
62197F19221M982N105N996P328Q051P766P143P029P622Q561R369R736R692R643
62183G27244J0002J0693J1173J0954R973Q534P134O315O350O935P549Q214R575
62170H40645J2018J5040J7923K0772K4387K9074L4076L8300M1207M2716M2672
62159A158830M0792L7008L1536K4733J7159R662K994k620p418j1718j5865k0320
62147A264773k5312l0397l4653l7399l8478l7999l6262l3885l1470k9041k6117
62136I03760k2555j8854j5579j2872j0705r146q125p349o702o426o569o668o254
62123G65956n316l978k079M06K835M364M795M475L509J682p62k842l723l588l284
$$ plain form
62212 631057 625367 619916 614246 608847 604772 602483 601464 601111 601458 602740 604752 607190 610271 614366 619221
62197 619221 624203 629308 635304 642632 650683 658449 665592 672621 680243 688804 698173 707909 717601 727244
62183 727244 737246 747939 759112 770066 780039 788573 795707 802022 808372 815307 822856 831070 840645
62170 840645 852663 867703 885626 906398 930785 959859 993935 1032235 1073442 1116158 1158830
62159 1158830 1199622 1236630 1268166 1292899 1310058 1319720 1322714 1320094 1312676 1300958 1285093 1264773
62147 1264773 1239461 1209064 1174411 1137012 1098534 1060535 1024273 990388 958918 929877 903760
62136 903760 881205 862351 846772 833900 823195 814049 805924 798575 791873 785447 778878 772210 765956
62123 765956 760640 756662 754583 754989 757824 762188 766983 771458 774967 776649 775887 773045 769322 765734 762450
62108G62450l251l222l048l406n217q348j1404j3023j3074j2194j0616q097m950
62095F62600k296j034r95j322j332q21M1Q51J280J424J633K131L033M550O562
62080F76305Q246Q966R454J1042J3651J5747J6576J7122J8226J9231J9474J9853
62068H53893K1495K3822K5529K6832K9045L2205L4786L5731L5261L3518K9934
62057A182051K4452J8092J1778N588l37n236q719j1600j5010j9205k3742k8275
62045A129837l2625l6450l9307m0903m1158m0326l9048l7805l6303l4006l1179
62034G20727k8752k6971k5064k2432j9407j6606j4224j2345j1111j0287r346q369
62022E15813q021q299q186p170o229o454p401p720o946n799n018m694m562m247
$$ plain form
62108 762450 759199 755977 752929 749523 744306 735958 724554 711531 698457 686263 675647 667550 662600
62095 662600 660304 659270 658275 656953 655621 654800 654841 655692 656972 658396 660029 662160 665193 669743 676305
62080 676305 684551 693517 702971 714013 727664 743411 759987 777109 795335 814566 834040 853893
62068 853893 875388 899210 924739 951571 980616 1012821 1047607 1083338 1118599 1152117 1182051
62057 1182051 1206503 1224595 1236373 1241961 1241624 1236388 1227669 1216069 1201059 1181854 1158112 1129837
62045 1129837 1097212 1060762 1021455 980552 939394 899068 860020 822215 785912 751906 720727
62034 720727 691975 665004 639940 617508 598101 581495 567271 554926 543815 533528 524182 515813
62022 515813 507792 499493 491307 484137 477908 471454 464053 456333 449387 443588 438570 433876 429314 425067
62008D25067l378k043r34m83k00N89J737K622L197L801M166L625K313J328J409
61993D42816K032K162J416K23q10j457k018l006m512n895o416o142n852n975o049
61978D00517n391m009k593j719j399j335j377j558j734j522p98p6J1m78q90r08
61962C74741q65j020j115q91n46k47K27R18J242Q08K38M62J470K470L078L517
61946C84487L856L978M309N559P438Q663Q744Q920J0571J3333J5611J6565J6690
61933E08724J6513J5788J4228J2364J1075J0581J0296R570Q168O149L632Q84j659
61920F26313l639n015n912o360o331n963n408m489k803l75K135M098N666P457
61906E99374R546J1188J1707J1284J0613R917Q673O405L418N42j710l470n040
$$ plain form
62008 425067 421689 419646 418712 418229 418029 418618 420355 422977 426174 429975 434141 437766 440079 441407 442816
61993 442816 444848 447010 448426 448649 447839 446382 444364 441358 436846 430951 424535 418393 412541 406566 400517
61978 400517 395126 391117 388524 386805 385406 384071 382694 381136 379402 377880 377082 377006 377017 376539 375649 374741
61962 374741 373876 372856 371741 370850 370304 370057 370284 371202 372444 373252 373490 373952 375422 377892 380970 384487
61946 384487 388343 392321 396630 402189 409627 418290 427034 435954 446525 459858 475469 492034 508724
61933 508724 525237 541025 555253 567617 578692 589273 599569 609139 617307 623456 627088 627972 626313
61920 626313 622674 617659 611747 605387 599056 593093 587685 583196 580393 580018 582153 586251 591917 599374
61906 599374 608920 620108 631815 643099 653712 663629 672302 678707 682125 682667 680957 677487 672447
61893F72447o438p539q387r098r596r715r475r003q289p339o468o107o256o549
61879E62188o838p316p968q384q373q309q484q540p899o598n205m078l100k063
61865D69033q93M81K073L588M586N038N483O487Q028R610J0867J1987J3464J5485
61851E65317J7649J9428K0757K1996K3307K4384K4809K4404K3091K0801J7770
61840H03713J4557J1462Q190M406M06l164o016q195r540r701q716p028m925k346
61826G83103O53L668O359Q700J0596J1667J1615J0537Q586N614J587k832o628
61813H53225r420j1752j4237j6730j8560j9371j9408j9074j8603j8193j8062j8119
61801F51696j7813j6683j5011j3563j2722j2121j1162r712q248p393p291p292
$$ plain form
61893 672447 666009 658470 650083 640985 631389 621674 612199 603196 594907 587568 581100 574993 568737 562188
61879 562188 555350 548034 540066 531682 523309 515000 506516 497976 490077 483479 478274 474196 471096 469033
61865 469033 468140 468621 470694 474282 478868 483906 489389 495876 503904 513514 524381 536368 549832 565317
61851 565317 582966 602394 623151 645147 668454 692838 717647 742051 765142 785943 803713
61840 803713 818270 829732 837922 842328 842734 839570 833554 825359 815819 806118 797402 790374 785449 783103
61826 783103 783756 787424 793783 802483 813079 824746 836361 846898 855484 861098 862685 859853 853225
61813 853225 843805 832053 817816 801086 782526 763155 743747 724673 706070 687877 669815 651696
61801 651696 633883 617200 602189 588626 575904 563783 552621 542909 534661 527268 519977 512685
61789E12685o514m922l575l307l511k947j655j058j896l066l109k102j183q64
61775D72976p36n95p47j179j323q82k28K01L56K95O4M6P76K112L080L033K496
61758D79745K504L375M564N401N537M883L564J983N68n03j270j839k412l230m176
61743D98694m721m566m189m228m533m383l649l033k924k751j916q31l40m13k57
61728D55960L70P42L13m04m95K91J455K401K718K269J373P11O15P21O16M28L27
61711D70411l4q75j528j273p02j111k574l764l970m051m769n443n136m351m321
61696D26509n107n572n082m174l550l216k845k318j735j362j573k470l471l765
61682C80269l172k199j354q28p09r69j225j070o78n96r49j350j564j737j827j442
$$ plain form
61789 512685 506171 501249 497674 494367 490856 487909 486254 485196 483300 480234 477125 475023 473840 472976
61775 472976 472240 471645 470898 469719 468396 467514 467286 467487 467843 468138 468202 468248 469024 471136 474216 477249 479745
61758 479745 482249 485624 490188 495589 501126 506009 509573 511556 512124 511621 510351 508512 506100 502870 498694
61743 498694 493973 489407 485218 480990 476457 472074 468425 465392 462468 459717 457801 456970 456630 456217 455960
61728 455960 456330 457072 457385 456981 456486 456777 458232 460633 463351 465620 466993 467704 468319 469040 469656 470084 470411
61711 470411 470377 469502 467974 466701 465999 464888 462314 458550 454580 450529 445760 440317 435181 430830 426509
61696 426509 421402 415830 410748 406574 403024 399808 396963 394645 392910 391548 389975 387505 384034 380269
61682 380269 377097 374898 373544 372716 372007 371038 369813 368743 368065 367469 366520 365170 363606 361869 360042 358600
61666C58600m61O55J394J750J981K247K592K997L250L122K792K732L036L197K798
61651C92682K029J316P47J98k30k39L20J316K405L097K984K145J196P55R07J285
61635D12913J504J482J352J253J117P14m7r70j894k958m251n304n432m604l561
61620C91314k991k858k748k394j788j099p19j002j727k142j838j327j377k038
61606C65266k696k966l097l509m173m635m498l822l058k563k241j825j377j204
61592C23602j360j554j677j955k389k481j942j303j304j881k287k141j734j311
61578B98283p46j65k55j329k500k497j246P1N89P28J231J903J973J358Q17Q13
61562B99028R71Q21M81L39N01R07J545K160K193J472P43R19J967K965L156K505
$$ plain form
61666 358600 358139 358794 360188 361938 363919 366166 368758 371755 375005 378127 380919 383651 386687 389884 392682
61651 392682 394711 396027 396774 396972 396742 396503 396823 398139 400544 403641 406625 408770 409966 410721 411628 412913
61635 412913 414417 415899 417251 418504 419621 420335 420288 419318 417424 414466 410215 404911 399479 394875 391314
61620 391314 388323 385465 382717 380323 378535 377436 376717 375715 373988 371846 370008 368681 367304 365266
61606 365266 362570 359604 356507 352998 348825 344190 339692 335870 332812 330249 328008 326183 324806 323602
61592 323602 322242 320688 319011 317056 314667 312186 310244 308941 307637 305756 303469 301328 299594 298283
61578 298283 297537 297372 297117 295788 293288 290791 289545 289616 290205 290933 292164 294067 296040 297398 298215 299028
61562 299028 299999 300820 301301 301640 302141 303048 304593 306753 308946 310418 311161 312080 314047 317012 320168 322673
61546C22673J342K1j033j454j259p43j7R90K026K467J963Q99L0j61K50P60P92
61529C29546K11m97p18m35j97l83q04j097j175j186j241j333j402j337j088p53
61513C16111m70k23Q8L95N04L71K01K43N63R44R82M99r1r4O37J532K143K647L253
61494C30235L586L272K654K321K233K005J739J827K132K152J882J714J621J312
61480C60685J038J307J785J562N87j95m29r06k052l022k958k242j713j414r48
61465C51085m70m50q32j224j586k018k244j896j192o59m48l22j13K13O90J084
61449C39618R12J34m90k51O43J455J839J881J732J650K063K931L462L063K198
61434C62840J719J761J925K137K529K787K462J718J096P43N59P70J502K090J827
$$ plain form
61546 322673 324015 324036 323003 321549 320290 319547 319530 320520 322546 325013 326976 327875 327905 327744 327994 328754 329546
61529 329546 329757 329260 328542 328107 327910 327527 326723 325626 324451 323265 322024 320691 319289 317952 316864 316111
61513 316111 315641 315418 315506 315901 316405 316776 316977 317220 317783 318727 319709 320208 320117 320023 320660 322192 324335 326982 330235
61494 330235 333821 337093 339747 342068 344301 346306 348045 349872 352004 354156 356038 357752 359373 360685
61480 360685 361723 363030 364815 366377 366964 366769 366340 365434 363382 360360 357402 355160 353447 352033 351085
61465 351085 350615 350165 349333 348109 346523 344505 342261 340365 339173 338514 338066 337744 337631 337844 338534 339618
61449 339618 340530 340664 340174 339923 340566 342021 343860 345741 347473 349123 351186 354117 357579 360642 362840
61434 362840 364559 366320 368245 370382 372911 375698 378160 379878 380974 381717 382276 383046 384548 386638 388465
61419C88465J163J151J766K005J592J354J598J443L57q33j187j009j032j094o83
61404C95056j93m80j387j786j189l53j12l83o42p14o29j07J108K597L437L130
61388C97353K088J115O27N39O52R00J219J429J321Q33R8n75q42n96j17J74J39
61371D06357OOJ08J70J78K53N25R52J174P39k86j064q43K9N23M17O51J911L595
61352D15401M690N091N391N742N698M991L865K677J728J319J493J791J800J787
61338D63464K269L057L375K952K315J940J695J360J094J055R88N76m4m35m01j46
61322D85114N5J26K10M60Q66J320J849K594L438L987M138M385N177O283P259Q268
61306E35529R860J1922J3506J3840J3007J1538R751P749N623L449J260p52k249
$$ plain form
61419 388465 389628 390779 392545 394550 396142 397496 399094 400537 400894 400061 398874 397865 396833 395739 395056
61404 395056 394863 394383 392996 391210 390021 389668 389556 389173 388531 387817 387188 387081 388189 390786 394223 397353
61388 397353 399441 400556 401183 401722 402374 403274 404493 405922 407243 408076 408174 407599 406757 406161 406044 406218 406357
61371 406357 406363 406369 406477 406647 406825 407078 407603 408555 409729 410468 410182 409118 408275 408304 408827 409244 409895 411806 415401
61352 415401 420091 425182 430573 436315 442013 447004 450869 453546 455274 456593 458086 459877 461677 463464
61338 463464 465733 468790 472165 475117 477432 479372 481067 482427 483521 484576 485564 486140 486096 485661 485260 485114
61322 485114 485169 485295 485505 485965 486831 488151 490000 492594 496032 500019 504157 508542 513719 520002 527261 535529
61306 535529 545389 557311 570817 584657 597664 609202 618953 626702 632325 635774 637034 636282 634033
61293F34033l100l511l782m117m661n475o420p328q255r257r952r729q510o893
61279E43043n500m430l497k574j574m45N46Q49K50p08j216j061p23o02m04N44
61263E22498K370M273N296N415N427N756N872N225M218L622L424K948K058J400
61249E79802J348J431J037J95o70j328j776k018k097k140k136j907j496j255j380
61234E65610j570j402q88l68K2N56J539K824L820M072L860L973M778N768O273
61219E98867O350O540P011P424P590P694P870P964P783P231O201M810L633L213
61205F90181L339L305K942K777L160L840M610N712P299Q983J0349J1443J2460
61192G70400J3212J3265J2349J0457P902N363L496K275J082l69j705k629l488
$$ plain form
61293 634033 630933 627422 623640 619523 614862 609387 602967 595639 587384 578127 568175 558446 549936 543043
61279 543043 537543 533113 529616 527042 525468 525023 525569 526418 526668 525960 524744 523683 522960 522358 521954 522498
61263 522498 524868 529141 534437 539852 545279 551035 556907 562132 566350 569972 573396 576344 578402 579802
61249 579802 581150 582581 583618 583813 583143 581815 580039 578021 575924 573784 571648 569741 568245 566990 565610
61234 565610 564040 562638 561750 561382 561404 561960 563499 566323 570143 574215 578075 582048 586826 592594 598867
61219 598867 605217 611757 618768 626192 633782 641476 649346 657310 665093 672324 678525 683335 686968 690181
61205 690181 693520 696825 699767 702544 705704 709544 714154 719866 727165 736148 746497 757940 770400
61192 770400 783612 796877 809226 819683 827585 832948 836444 838719 839801 839432 837727 835098 831610
61179H31610m711o183p503q500r164r471r586r822j0029r590q463p723q369r943
61165G12553j1021j0847r916r059q645q619q708q492p740o758o009n414m377k595
61151F04353m70J358K539L010K867K319J517L28j411l387m826n231m811l981k786
61136E91388j100P38J988K286K127K369L414N022O786Q453R903J1079J2109J3217
61122F69779J4388J5396J6325J7734J9960K2509K4581K6005K7175K8166K8554
61111I10572K8221K7758K7770K8134K8265K7785K6724K5250K3511K1585J9425
61100A195000J6971J4387J1998R943Q097O433N144M256L350J958J54j421k166
61087A274104k160k165k816l784m042l292k679l502n448o908p046o776p353q744
$$ plain form
61179 831610 826899 820716 813213 804713 795549 786078 776492 766670 756641 747051 738588 730865 722496 712553
61165 712553 701532 690685 680769 671710 663065 654446 645738 637246 629506 622748 616739 611325 606948 604353
61151 604353 603883 605241 607780 610790 613657 615976 617493 617821 616410 613023 608197 602966 598155 594174 591388
61136 591388 590288 591026 593014 595300 597427 599796 603210 608232 615018 623471 633374 644453 656562 669779
61122 669779 684167 699563 715888 733622 753582 776091 800672 826677 853852 882018 910572
61111 910572 938793 966551 994321 1022455 1050720 1078505 1105229 1130479 1153990 1175575 1195000
61100 1195000 1211971 1226358 1238356 1248299 1256396 1262829 1267973 1272229 1275579 1277537 1277691 1276270 1274104
61087 1274104 1271944 1269779 1266963 1263179 1259137 1255845 1253166 1249664 1244216 1237308 1230262 1223486 1216133 1207389
61073A207389r931j0331j0291j0413j0956j1868j3026j4254j5209j5415j4588
61062A071107j3091j1840j1428j1494j1257j0514r639q754p574o053m481k879
61050I62103r98R35K227K778L413M762O499Q122R794J1811J3810J5281J6465J8008
61036A075010J9887K1447K2528K3920K6432K9860L3071L5132L6161L6956L7909
61025A398313L8615L8880L9594M2128M7009N3795O1973P1243Q1036R0662J00104
61014B063352J10192J22225J38091J60316J90790K29755K77189L34744M04871
61005D031525M89052N89359P10982Q59755J037766J245649J485310J743300J958133
60996A4150831K015857J811045J338788P28475J74359j77533k86075j88048M7933
$$ plain form
61073 1207389 1197458 1187127 1176836 1166423 1155467 1143599 1130573 1116319 1101110 1085695 1071107
61062 1071107 1058016 1046176 1034748 1023254 1011997 1001483 991844 983090 975516 969463 964982 962103
61050 962103 961105 962040 964267 967045 970458 975220 981719 989841 999635 1011446 1025256 1040537 1057002 1075010
61036 1075010 1094897 1116344 1138872 1162792 1189224 1219084 1252155 1287287 1323448 1360404 1398313
61025 1398313 1436928 1475808 1515402 1557530 1604539 1658334 1720307 1791550 1872586 1963248 2063352
61014 2063352 2173544 2295769 2433860 2594176 2784966 3014721 3291910 3626654 4031525
61005 4031525 4520577 5109936 5820918 6680673 7718439 8964088 10449398 12192698 14150831
60996 14150831 16166688 17977733 19316521 20044996 20219355 20041822 19755747 19567699 19615632
60987A9615632L26231N11102M60946J13992m52757j060364j535069j793724j849990
60978A4335999j765583j604408j414993j228811j060703r12487p81183o65148
60970D902683n63778m75617l99370l35267k83580k42732k10004j83200j60772
60961B048363j41345j24239j09675r7658q7151p7049o7252n8166m9906m2692l7339
60950A155891l4397l3206l2373l1027k9148k7078k5137k3396k1588j9558j7807
60939H61176j7018j6983j6798j6240j6035j6442j6593j5790j4559j3740j3330
60928F87648j2926j2562j2320j1764j0591r302q468p827o932o126n993o242o077
60915E70518n438m948m807m569m009l373k795k175j641j488j570j413j012r58
$$ plain form
60987 19615632 19941863 20452965 20913911 21027903 20575146 19514782 17979713 16185989 14335999
60978 14335999 12570416 10966008 9551015 8322204 7261501 6349014 5567831 4902683
60970 4902683 4338905 3863288 3463918 3128651 2845071 2602339 2392335 2209135 2048363
60961 2048363 1907018 1782779 1673104 1575446 1488295 1411246 1343994 1285828 1235922 1193230 1155891
60950 1155891 1121494 1088288 1055915 1024888 995740 968662 943525 920129 898541 878983 861176
60939 861176 844158 827175 810377 794137 778102 761660 745067 729277 714718 700978 687648
60928 687648 674722 662160 649840 638076 627485 618183 609715 601888 594956 588830 582837 576595 570518
60915 570518 565080 560132 555325 550756 546747 543374 540579 538404 536763 535275 533705 532292 531280 530322
60901E30322j553k318k588k282j898j985k689l613m114l973l702l891m423m627
60887D86666m213l634l455l685l919l946m020m500n275n687n208m102l104k464
60873D29454j797r39l56k95j58O62J699J954J319P50R53J725K643L692M754N126
60857D51186M276K803J912J962K120J692J187J519K514K953K111O07n67j218j713
60842D73344k088k159k244k948m270n514o208o477o478o169n779n751n983n808
60828D05468n018m252l883l423k533j933k392l406l805l409l074l217l311k951
60814C58861k515k459k641k734k795k940k883k225j116j93R4q5j76K38J078J838
60798C39347K023J600J005P37R81J526J963J916J336O18L16O25J153J347J115
$$ plain form
60901 530322 528769 526451 523863 521581 519683 517698 515009 511396 507282 503309 499607 495716 491293 486666
60887 486666 482453 478819 475364 471679 467760 463814 459794 455294 450019 444332 439124 435022 431918 429454
60873 429454 427657 426718 426362 426067 425909 426571 428270 430224 431543 432293 433246 434971 437614 441306 446060 451186
60857 451186 455462 458265 460177 462139 464259 465951 467138 468657 471171 474124 476235 476842 476275 475057 473344
60842 473344 471256 469097 466853 463905 459635 454121 447913 441436 434958 428789 423010 417259 411276 405468
60828 405468 400450 396198 392315 388892 386359 384426 382034 378628 374823 371414 368340 365123 361812 358861
60814 358861 356346 353887 351246 348512 345717 342777 339894 337669 336553 336360 336454 336369 336193 336431 337509 339347
60798 339347 341370 342970 343975 344712 345693 347219 349182 351098 352434 353052 353368 353993 355146 356493 357608
60783C57608Q78R51J000M12p88j789j942j597j541j873j928j369p26o22q51o46
60767C45177L09J422J798J154J06n03n41o23j143j597j311m87N2Rj72k08l53o50
60749C42439o30kQ92J679K375K884K702J628K93o14j140j697k280k680k965l195
60733C39689k988k060r45m45n98p72o49m80m24k99l4K31N02R29J431J790K087
60716C36965K543K939K758J991J293J080R81L86p22j778k179j696n83M76P07j32
60700C45029j452k278k085j223n12m09o80r33j197j633j884j352k14N00J59o56
60684C29180r81o33m9N41J142J562J646J757K342L115L340K907K491K536K675
60669C53571K354J507M17o93j685k341k474k116j538j126j135j393j411r19j76
$$ plain form
60783 357608 358486 359437 360437 360849 360061 358272 356330 354733 353192 351319 349391 348022 347296 346674 345823 345177
60767 345177 345486 346908 348706 349860 349966 349463 348922 348299 347156 345559 344248 343761 343813 343822 343650 343442 343089 342439
60749 342439 341809 341807 342699 344378 346753 349637 352339 353967 354260 353646 352506 350809 348529 345849 342884 339689
60733 339689 336701 334641 333696 333251 332653 331881 331232 330752 330328 330029 329995 330226 330728 331657 333088 334878 336965
60716 336965 339508 342447 345205 347196 348489 349569 350550 350936 350214 348436 346257 344561 343978 344454 345161 345029
60700 345029 343577 341299 339214 337991 337479 337070 336390 335457 334260 332627 330743 329391 329177 329677 329836 329180
60684 329180 328199 327566 327517 328058 329200 330762 332408 334165 336507 339622 342962 345869 348360 350896 353571
60669 353571 355925 357432 357849 357156 355471 353130 350656 348540 347002 345876 344741 343348 341937 341018 340842
60654C40842M27Q08J029J046R41J171K057L249M057M164L641K579J193k2q05j556
60638C64821k661l602l589k843k387k526k506j816r51m91k49J25M05K71LP6L59
60621C42439L39l1k44P4P56J383J670J631J485J387J170N34l92r48o23L14J134
60604C52078J480J592J747J827J576J043N15R6l10n73k75N94J204P18n27j237
60588C61548o97M83J334J558J291N89k71n48J14J025J302J079J131J649K184K628
60572C76399L339M364N331O115O897P609Q140Q886J0245J1552J1513R825P417
60559D77632N001K453j25j885k446k690l590m887n546n072l748k088n25P20J872
60544D55076L312M783N529N577O156Q267J1421J4375J6544J8122J9355K0350K1127
$$ plain form
60654 340842 341269 342077 343106 344152 345093 346264 348321 351570 355627 359791 363432 366011 367204 367182 366377 364821
60638 364821 362160 358558 354969 352126 349739 347213 344707 342891 341940 341449 341200 341325 341730 342001 342004 342080 342439
60621 342439 342778 342747 342503 342577 343333 344716 346386 348017 349502 350889 352059 352593 352201 351253 350630 350944 352078
60604 352078 353558 355150 356897 358724 360300 361343 361858 361954 361644 361071 360796 361390 362594 363312 362785 361548
60588 361548 360851 361334 362668 364226 365517 366106 365835 365287 365401 366426 367728 368807 369938 371587 373771 376399
60572 376399 379738 384102 389433 395548 402445 410054 418194 427080 437325 448877 460390 470215 477632
60559 477632 482633 485086 484961 483076 480630 477940 474350 469463 463917 458845 455097 453009 452484 453204 455076
60544 455076 458388 463171 468700 474277 480433 488700 500121 514496 531040 549162 568517 588867 609994
60531F09994K1188J9528J5816J1146O873L060j081n456q837j0365j0513j0342
60519F41011j0349j0284r761q768p708o869n942m352k207m23L78O20J090K068
60505E78504L581N950R273J2850J5891J8609K1834K5732K9615L2927L5676L7956
60493H28398L9680M0705M0709L9142L5952L2137K8794K5723K1798J6609J0765
60482A160412M555k651j1304k0781k9977l8082m4466m8510n0056m9621m7837m5138
60470G76544m2039l9014l5840l1847k7157k2945j9955j7616j5263j3369j2601
60459D98898j2312j1174r134p510p088p132o632n621m789m396m153l802l297k639
60445D09219j957j609j836k351k533k066j203m54k16o01j383k098k367k163j717
$$ plain form
60531 609994 631182 650710 666526 677672 684545 687605 686524 681068 672231 661866 651353 641011
60519 641011 630662 620378 610617 601849 594141 587272 581330 576978 574771 574348 574726 575346 576436 578504
60505 578504 582085 588035 597308 610158 626049 644658 666492 692224 721839 754766 790442 828398
60493 828398 868078 908783 949492 988634 1024586 1056723 1085517 1111240 1133038 1149647 1160412
60482 1160412 1164967 1162316 1151012 1130231 1100254 1062172 1017706 969196 919140 869519 821682 776544
60470 776544 734505 695491 659651 627804 600647 577702 557747 540131 524868 511499 498898
60459 498898 486586 475412 466278 458768 451680 444548 437916 432295 427506 423110 418957 415155 411858 409219
60445 409219 407262 405653 403817 401466 398933 396867 395664 395210 394994 394393 393010 390912 388545 386382 384665
60430C84665j170n32L4K24j0k81k36rRk14l40j95mL6J40O00J355K026K358K403
60410C90859K337K255K099J768J291R32Q98J003Q89O78R75J911K638K281J245
60395D14059Q93J864L294L919L473K659K104J856J768J845K064K176J985J714
60381D45673J804K304K731K675K376K363K685K885K765K666K773K672J974J079
60367D79425O79P74P67M92M82J140K135K892L201L259L414M092N466P015P894
60352E23127P982Q078Q665Q966P910N648L388J799L49j605l776n378o155o502
60338E52496o742o762o312n417m398l648l383l496l631l540l319l207l229l157
60324D92255k863k539k422k419k139j334j78R86K037L147M451N845P171Q404R502
$$ plain form
60430 384665 383495 382963 382997 383221 383211 382930 382694 382685 382694 382480 382140 381945 381941 381977 382117 382717 384072 386098 388456 390859
60410 390859 393196 395451 397550 399318 400609 401541 402439 403442 404331 405009 405984 407895 410533 412814 414059
60395 414059 414952 416816 420110 424029 427502 430161 432265 434121 435889 437734 439798 441974 443959 445673
60381 445673 447477 449781 452512 455187 457563 459926 462611 465496 468261 470927 473700 476372 478346 479425
60367 479425 480104 480878 481645 482137 482619 483759 485894 488786 491987 495246 498660 502752 508218 515233 523127
60352 523127 531109 539187 547852 556818 564728 570376 573764 575563 575912 574307 570531 565153 558998 552496
60338 552496 545754 538992 532680 527263 522865 519217 515834 512338 508707 505167 501848 498641 495412 492255
60324 492255 489392 486853 484431 482012 479873 478539 478361 479347 481384 484531 488982 494827 501998 510402 519904
60309E19904J0161J0083R439Q815Q536Q311P811P303P245P317O499M270J279j516
60295F15457l982o639r607j2224j3718j3811j2719j0958r138p572o050m384l097
60282E01558k918l539l691k816j966k400l790m715m583m208m393m832m728l883
60268D49096k782j932j555j629j961k256k291j998j403o38k8J65J26K62N54N49
60252D32279J31j18L37J220J778J690J291J063J226J668K003J805J037J57l93
60237D47174o63q52q64n82l25m17m58L19J891L272L751L658L627L638L302K650
60221D69121K146K177K895M259N827O807O852O514O452O507O251O092O834Q189
60207E46923Q797Q019O789O206O182O098N997O236O512O238N580N117M718L727
$$ plain form
60309 519904 530065 540148 549587 558402 566938 575249 583060 590363 597608 604925 611424 615694 616973 615457
60295 615457 611475 604836 595229 583005 569287 555476 542757 531799 522661 515089 509039 504655 501558
60282 501558 498640 495101 491410 488594 486628 484228 480438 475723 471140 466932 462539 457707 452979 449096
60268 449096 446314 444382 442827 441198 439237 436981 434690 432692 431289 430651 430623 430788 430914 431176 431730 432279
60252 432279 432410 432292 432629 433849 435627 437317 438608 439671 440897 442565 444568 446373 447410 447567 447174
60237 447174 446511 445659 444795 444213 443888 443471 443013 443332 445223 448495 452246 455904 459531 463169 466471 469121
60221 469121 471267 473444 476339 480598 486425 493232 500084 506598 513050 519557 525808 531900 538734 546923
60207 546923 555720 563739 570528 576734 582916 589014 595011 601247 607759 613997 619577 624694 629412 633139
60193F33139K219J041M55k57j501k683l284l732m556n391n644n558n716n937n610
60178E86985m902m634m994n267n022m613m279l603k326j036m59n51r02j495k405
60163E40497l068k734j590p42q54j433j610j139l16O25J613K444K790K509J818
60148E38810J133Q00Q30Q57N57J71L45J328K643L779M832O151P611Q652Q969Q732
60132E96200Q197P518O900O498O103N341M240L217K430J569M78m51p20l45K58
60117F47433P52J052J227J338J270P37k50j025q74p2K44n08j706k483k747k837
60101F41551k787k504k176j919j537j112j307k316l141k811j825j327j238m81
60087F15070J007J855J162k97j251j329q90k72J91J73j00Q1P59Q80m51k777m926
$$ plain form
60193 633139 635358 636399 636854 636597 635096 632413 629129 625397 620841 615450 609806 604248 598532 592595 586985
60178 586985 582083 577449 572455 567188 562166 557553 553274 549671 547345 546309 545850 545299 544397 542902 540497
60163 540497 537429 534695 533105 532363 531509 530076 528466 527327 527011 527636 529249 531693 534483 536992 538810
60148 538810 539943 540743 541573 542430 542987 543158 543503 544831 547474 551253 556085 562236 569847 578499 587468 596200
60132 596200 604397 611915 618815 625313 631416 636757 640997 644214 646644 648213 648691 648240 647520 647175 647433
60117 647433 648185 649237 650464 651802 653072 653809 653559 652534 651660 651588 651832 651324 649618 647135 644388 641551
60101 641551 638764 636260 634084 632165 630628 629516 628209 625893 622752 619941 618116 616789 615551 615070
60087 615070 616077 617932 619094 618797 617546 616217 615327 615055 615246 615419 615319 615400 616159 617039 616588 613811 608885
60070F08885o334p178p625p615p275p008p177p808q446q329p101n384m149l548
60056E13908l074k756l132l837l422j318J066K137K097K162K604K779K645K890
60042E14749L748M695N331N647N524M830L971L470L086K157P91j72l97m25p00
60027E56305j093j588k620m402o507q359r618j0004r287p753o234n401n308n569
60013D72562n638n096m102l397l333l157k016m14K57l59j245j651j996k718l281
59998D34416k966j895n78Q25K247L234L443L269L352L688L794L475K986K576K339
59983D64205K346K590K847K803K219J006o10j903k138j429p32p39j158j296r68
59968D67043m83j01J74N12J154K191L281L934M129M308M646M820M611M242L819
$$ plain form
60070 608885 602551 595373 587748 580133 572858 565850 558673 550865 542419 534090 526989 521605 517456 513908
60056 513908 510834 508078 504946 501109 497687 496369 497435 499572 501669 503831 506435 509214 511859 514749
60042 514749 518497 523192 528523 534170 539694 544524 548495 551965 555051 557208 557999 557827 557430 557005 556305
60027 556305 555212 553624 551004 546602 540095 531736 522118 512114 502827 495074 488840 483439 478131 472562
60013 472562 466924 461828 457726 454329 450996 447839 445823 445409 445666 445307 444062 442411 440415 437697 434416
59998 434416 431450 429555 428977 429802 432049 435283 438726 441995 445347 449035 452829 456304 459290 461866 464205
59983 464205 466551 469141 471988 474791 477010 478016 477406 475503 473365 471936 471204 470465 469307 468011 467043
59968 467043 466560 466459 466633 467145 468299 470490 473771 477705 481834 486142 490788 495608 500219 504461 508280
59953E08280L049J743J54j474l060m150l997k655j361j120j474j389q52p47j464
59938D89483k468l118l185k656j698p80k82Q0R03K259L648M690N350N589N309
59923E03124M671L915K892J273p72k524l393l237k121k74J620K731K891K784L158
59908E16738M120N191N846N835N363M914M649M061K561M00j439k281k329k134
59894E51495j934j678j321r10n05j01N32J751L453M748M783L884L279L574M162
59879E75212M390M530N116N827N868N164M471M259M153L540K334R16l26j105j184
59864F23165n29N15J398J748J559J131Q16Q00J017J301J601J938K208K281K394
59849F43343L151M785O528P066N770L246O25j397k698l292l141k353j298m84m23
$$ plain form
59953 508280 511329 513072 513226 511752 508692 504542 500545 497890 496529 495409 493935 492546 491694 490947 489483
59938 489483 487015 483897 480712 478056 476358 475578 475296 475376 476279 478538 482186 486876 492226 497815 503124
59923 503124 507795 511710 514602 515875 515103 512579 509186 505949 503828 503554 505174 507905 510796 513580 516738
59908 516738 520858 526049 531895 537730 543093 548007 552656 556717 559278 559678 558239 555958 553629 551495
59894 551495 549561 547883 546562 545652 545147 545046 545578 547329 550782 555530 560313 564197 567476 571050 575212
59879 575212 579602 584132 589248 595075 600943 606107 610578 614837 618990 622530 624864 625780 625454 624349 623165
59864 623165 622636 623151 624549 626297 627856 628987 629803 630603 631620 632921 634522 636460 638668 640949 643343
59849 643343 646494 651279 657807 664873 670643 673889 674514 673117 670419 667127 663986 661633 660335 659851 659428
59834F59428j450l418n639p322q042p700o401m658l404l212l598l664l324l287
59820E94309l799m205l987l542l441l501l145k306j399o79j74l0l47p62p19j79
59804E62094L46M54K71J79L75P05P61K54n72j075j073j185j980l036l421k936
59788E50161k318k216k524k816k967l058l056k911k752k795l067l277l034k229
59774E11141j269p01n00l4J006K088K635K966L734M685M890M198L634L985M783
59759E47241N160N088N198N819O761P877R150J0304J0926J1012J1021J1263J1522
59746F58342J1427J0916J0250R665R160Q501P469O157M964M131L341K025J56j542
59732G44962k317k225j962k017k285k523k877l603m551n231n392n223m937m498
$$ plain form
59834 659428 657978 654560 648921 641599 633557 625857 619456 614798 611394 608182 604584 600920 597596 594309
59820 594309 590510 586305 582318 578776 575335 571834 568689 566383 564984 564305 564131 564101 563754 562992 562273 562094
59804 562094 562440 562894 563165 563344 563719 564424 565185 565439 564867 563792 562719 561534 559554 556518 553097 550161
59788 550161 547843 545627 543103 540287 537320 534262 531206 528295 525543 522748 519681 516404 513370 511141
59774 511141 509872 509171 508671 508637 509643 511731 514366 517332 521066 525751 530641 534839 538473 542458 547241
59759 547241 552401 557489 562687 568506 575267 583144 592294 602598 613524 624536 635557 646820 658342
59746 658342 669769 680685 690935 700600 709760 718261 725730 731887 736851 740982 744323 746348 746504 744962
59732 744962 742645 740420 738458 736441 734156 731633 728756 725153 720602 715371 709979 704756 699819 695321
59718F95321l848l198k851k917l265l618l614l006k003j143o42r5R15K174L073
59703F71283L334L199L070L289M056N115N637M974L643L029L889N382N839M360
59689G30099J592r85k363k752l051l678m145l886l225k999l513m268m796n183
59675F86847n724o398o990p317p264o768n956n101m366l808l549l635l685l161
59661F13125k032q78j22L71Q52J344J945K956M252N057M844M178L987M297M249
59646F48425L288J683j87k341m741o817p945q154q010p855p542o857o000n378
59632E81569n055m604l668k575k171k927m365n513n786n364m863m795n250n799
59618E18834n808n122m309m010m087l839l030k225j886j665r65J02R09J288J696
$$ plain form
59718 695321 691473 688275 685424 682507 679242 675624 672010 669004 667001 665858 665216 665121 666036 668210 671283
59703 671283 674617 677816 680886 684175 688231 693346 698983 703957 707600 710629 714518 719900 725739 730099
59689 730099 731691 730706 728343 725591 722540 718862 714717 710831 707606 704607 701094 696826 692030 686847
59675 686847 681123 674725 667735 660418 653154 646386 640430 635329 630963 627155 623606 619971 616286 613125
59661 613125 611093 610215 610093 610464 611316 612660 614605 617561 621813 626870 631714 635892 639879 644176 648425
59646 648425 651713 653396 653209 650868 646127 639310 631365 623211 615201 607346 599804 592947 586947 581569
59632 581569 576514 571910 568242 565667 563496 560569 556204 550691 544905 539541 534678 529883 524633 518834
59618 518834 513026 507904 503595 499585 495498 491659 488629 486404 484518 482853 481888 481990 482899 484187 485883
59603D85883K317K632K206J455J141J344J505J400J487K071K709K810K490K339
59589E13789K464K273J319k9r83j139p71m58o15j252k028k593k932l308l746l834
59573D96157l242k316j788j930k290k321j980j518j007l72K49N60N14M17N49Q95
59557D80577J245J398J247Q13L20N1Q9L38P75J479K328K966L207L317L750M696
59541E08596O024P583R445J2006J5570J9438K1450J9294J2762M359k809p301r323
59528F17094r336p750n564l968l090k100p11L37N38M26N68O33N9r90k053l162
59512E80931m473n545n814n537n516o007o508o561o137n336m320l508l320l636
59498E08713l913l792l247k300j084j07J50n2M9P03J372J593J620J946K558K995
$$ plain form
59603 485883 488200 490832 493038 494493 495634 496978 498483 499883 501370 503441 506150 508960 511450 513789
59589 513789 516253 518526 519845 519816 518833 517694 516923 516465 515850 514598 512570 509977 507045 503737 499991 496157
59573 496157 492915 490599 488811 486881 484591 482270 480290 478772 477765 477393 477642 478202 478716 479133 479682 480577
59557 480577 481822 483220 484467 485280 485600 485651 485740 486078 486853 488332 490660 493626 496833 500150 503900 508596
59541 508596 514620 522203 531648 543654 559224 578662 600112 619406 632168 636527 633718 626417 617094
59528 617094 607758 600008 594444 590476 587386 585286 584575 584912 585450 585876 586444 587077 587136 586146 584093 580931
59512 580931 576458 570913 565099 559562 554046 548039 541531 534970 528833 523497 519177 515669 512349 508713
59498 508713 504800 501008 497761 495461 494377 494270 494420 494368 494417 495120 496492 498085 499705 501651 504209 507204
59482E07204K948K591K406K739L422L885L801L545L756M484N104N049M347L376
59468E58657K411J534P92L11K31N16Q08P02L16K84R73J959K585K798L060L635
59452E81572M380N125N731N992N853N593N343M605K883O71r31j575j956k665l469
59437F17152l985m325m659m702m165l294k516j817r40K5P55J325K309M127O504
59422F01794Q678J0102J0951J1963J3709J6066J8415K0363K2211K4760K8418L2142
59410H19572L3204K8800J8660N960m826j1017j2656j1192q090m258K35N918J2303
59397H72613J6510J4824O450n077j4800k0273k2209k2304k1463j9869j7638j5108
59385G51656j2763j1067j0074r352q465p388o324n330m355l456k743k297k151
$$ plain form
59482 507204 510152 512743 515149 517888 521310 525195 528996 532541 536297 540781 545885 550934 555281 558657
59468 558657 561068 562602 563394 563705 563936 564452 565260 565962 566278 566562 567535 569494 572079 574877 577937 581572
59452 581572 585952 591077 596808 602800 608653 614246 619589 624194 627077 627748 626817 625242 623286 620621 617152
59437 617152 613167 608842 604183 599481 595316 592022 589506 587689 586749 586774 587529 588854 591163 595290 601794
59422 601794 610472 620574 631525 643488 657197 673263 691678 712041 734252 759012 787430 819572
59410 819572 852776 881576 900236 906196 901370 890353 877697 866505 858415 854157 854392 860310 872613
59397 872613 889123 903947 910397 905320 890520 870247 848038 825734 804271 784402 766764 751656
59385 751656 738893 727826 717752 708400 699935 692547 686223 680893 676538 673082 670339 668042 665891
59372F65891k154j810p50O00J334J265J257J957K832L015K627K578L329M525N708
59357F92204O750P586Q094Q376Q752R400J0239J1199J2239J3137J3560J3468J3198
59344H28202J3014J2778J2091J0784R168P787O782N579L459M56k607n090p181
59331H95222r355j1576j3353j4415j4935j5229j5487j5700j5659j5103j4071j2926
59319G27413j1850j0599r032p541o607o110n545m782m169l895l648l083k202j164
59305F47186R6J805M001O435Q799J0882J2330J2294R721M386k394q490j2511j4498
59291F80042j5115j4653j3086j0726q351o647n719n043l908k018J92J993L153
59278F00114M047N004N942O751P669Q896J0173J1092J1699J2413J3355J4099J4089
$$ plain form
59372 665891 663737 661927 661177 661777 663111 664376 665633 667590 670422 673437 676064 678642 681971 686496 692204
59357 692204 698954 706540 714634 723010 731762 741162 751401 762600 774839 787976 801536 815004 828202
59344 828202 841216 853994 866085 876869 886037 893824 900606 906185 909644 910100 907493 902403 895222
59331 895222 885867 874291 860938 846523 831588 816359 800872 785172 769513 754410 740339 727413
59319 727413 715563 704964 695932 688391 681784 675674 670129 665347 661178 657283 653635 650552 648350 647186
59305 647186 647282 649087 653088 659523 668322 679204 691534 703828 713549 717935 715541 707051 694540 680042
59291 680042 664927 650274 637188 626462 618111 611464 605745 600702 596794 594776 594968 596961 600114
59278 600114 604161 609165 615107 621858 629527 638423 648596 659688 671387 683800 697155 711254 725343
59265G25343J3175J1707J0211R020Q126P300O225M586K336%j634k394k952l810
59251G87239m428l982k701j650j296j133p69n10o47r52j223j580j958k034j985
59236G60391k550l887n120n548n574n857o271o422o540p043p711q051q036p843
59222F73938p316o456n915o168o634o418n575m772m084l157k224j913k079j901
59208F09326j169n24l05j01L98R10J206J485J827J939J708J455J426J548J795
59193F22924K190K334J617K22p62n75K93Q52P97N65M78L62Ol71k39N80J428J316
59175F34017O4j300j672j141o47o59q70r99j184j391j267p43k35K2K57M68J03
59158F22823j135k604l425l585l897m901o240p068o908o023n120m678m593m476
$$ plain form
59265 725343 738518 750225 760436 769456 777582 784882 791107 795693 798029 798029 796395 794001 791049 787239
59251 787239 782811 778829 776128 774478 773182 772049 771280 770770 770123 769171 767948 766368 764410 762376 760391
59236 760391 757841 753954 748834 743286 737712 731855 725584 719162 712622 705579 697868 689817 681781 673938
59222 673938 666622 660166 654251 648083 641449 635031 629456 624684 620600 617443 615219 613306 611227 609326
59208 609326 608157 607633 607328 607227 607625 608535 609741 611226 613053 614992 616700 618155 619581 621129 622924
59193 622924 625114 627448 629065 629287 628525 627950 628243 629095 629892 630457 630935 631297 631303 630932 630693 631273 632701 634017
59175 634017 634081 632781 631109 629968 629321 628662 627792 626793 625609 624218 622951 622208 621973 621995 622252 622720 622823
59158 622823 621688 619084 615659 612074 608177 603276 597036 589968 583060 577037 571917 567239 562646 558170
59144E58170m220m016l946l860l739l848m328m821m743l887k665j725j314j019
59130E10039k29J154K587L445L542L091K525K445L268M681N759N978N815O044
59116E60144O846P936R090J0080J0495J0247R929J0018J0052R269P800O457N558
59103F73921M753L922L346K921K111Q18m26j421k624m223n536n792n002l713k410
59088F60645j480j239j594j958k008k121k744l589m016l957m053m749n689o168
59074F15280n926n366m960m743m423l880l289k851k640k739l194l766m092m118
59060E59293l991l546k519j359j098j983k993l155k655k055j286j88O35N38q1
59045E33557m14m84p24p63P9J355J839J303P74R43J445J853K250K605K669K684
$$ plain form
59144 558170 553950 549934 545988 542128 538389 534541 530213 525392 520649 516762 514097 512372 511058 510039
59130 510039 509810 510964 513551 516996 520538 523629 526154 528599 531867 536548 542307 548285 554100 560144
59116 560144 566990 574926 584016 594096 604591 614838 624767 634785 644837 654106 661906 668363 673921
59103 673921 678674 682596 685942 688863 690974 691792 691366 689945 687321 683098 677562 671770 666768 663055 660645
59088 660645 659165 657926 656332 654374 652366 650245 647501 643912 639896 635939 631886 627137 621448 615280
59074 615280 609354 603988 599028 594285 589862 585982 582693 579842 577202 574463 571269 567503 563411 559293
59060 559293 555302 551756 549237 547878 546780 544797 541804 538649 535994 533939 532653 532465 533100 533638 533557
59045 533557 533143 532659 531935 531172 531251 532606 534445 535748 536522 537465 538910 540763 543013 545618 548287 550971
59029E50971L281M401N297N818O699Q330J0262J2177J4269J6276J7231J6717J5418
59016F87147J3913J1824Q785N309K072r58l979o634q379r092q875p844o423n153
59002F71713l877j996K07J489J420J107J474J854J310L28j1J31l14j460k195j812
58986F69368r36o27j195k056k330j615l48O76J283K108L582N301O693P868R249
58971F97021J0805J2094J2827J2959J2577J1952J1363J0681R550Q180P303P078
58959H24390O705N511L762J933q3k526n130p554r838j1852j2953j2874j2371j2320
58945G54800j2589j2528j2028j1398j0579r232p367n309l386k028j666k044k117
58932F62529j259n1O66R78J450K018K121J578P31ql48k60k75j043k250k776k384
$$ plain form
59029 550971 554252 558653 563950 569768 576467 584797 595059 607236 621505 637781 655012 671729 687147
59016 687147 701060 712884 721669 726978 729050 728092 724113 717479 709100 700008 691133 683289 676866 671713
59002 671713 667836 665840 666047 667536 668956 670063 671537 673391 674701 675029 675018 675149 674835 673375 671180 669368
58986 669368 668432 667805 666610 664554 662224 660609 660261 660937 662220 664328 667910 673211 679904 687772 697021
58971 697021 707826 719920 732747 745706 758283 770235 781598 792279 801829 810009 817312 824390
58959 824390 831095 836606 840368 842301 842218 839692 834562 827008 817170 805318 792365 779491 767120 754800
58945 754800 742211 729683 717655 706257 695678 686446 679079 673770 670384 668356 666690 664646 662529
58932 662529 661270 661219 661885 662863 664313 666331 668452 670030 670761 670753 670405 670145 669870 668827 666577 663801 661417
58915F61417k154k658k892k023r61q58j053j61J576K831L532M860P045Q978J0113
58900F87592J1056J1964J2011J0952R792R333R228R140R675J1295J3207J4260
58888H19505J4419J4641J5604J7012J7933J7477J5463J2622R898P528N194K860
58876I70156Q93p13k410m381o293p913r274j0166j0139r223p977o641m905k856
58862H88158j387j228k080l164m187n335o652p881q833r505r873r807r241q380
58848H00605p659p332p088o393n339m790n384o786q275r675j1084j2120j2229
58835F96451j1556j0854j0464j0095r486q726p829o640n219l856k661j511m30
58822F07124M34J107J659J969K054K418L398M378M390L469K656K603K864K755
$$ plain form
58915 661417 659263 656605 653713 651690 650729 649871 648818 648657 650233 653064 656596 661456 668501 677479 687592
58900 687592 698648 710612 722623 733575 743367 752700 761928 771068 780743 792038 805245 819505
58888 819505 833924 848565 864169 881181 899114 916591 932054 944676 954574 962102 967296 970156
58876 970156 971049 970336 967926 963545 957252 949339 940065 929899 919760 910537 902560 895919 891014 888158
58862 888158 886771 885543 883463 880299 876112 870777 864125 856244 847411 837906 828033 818226 808985 800605
58848 800605 792946 785614 778526 772133 766794 762004 756620 749834 741559 731884 720800 708680 696451
58835 696451 684895 674041 663577 653482 643996 635270 627441 620801 615582 611726 609065 607554 607124
58822 607124 607558 608665 610324 612293 614347 616765 620163 624541 628931 632400 635056 637659 640523 643278
58808F43278K238J663J103L37p86k127l335m084m387m554m728m761m719n015n714
58793F04409o192n996n526n304n017m055k589j351o43l02j68J23J326L562N563
58778E77840O067N631N821O785P036N664L443J405m06k342m291n914o961p093
58764E92685o209n091m762m981m407k638j020q34j613j930j111M76K197L495L841
58749E68098L082J693L92l69m97j93J09J45K00O62J388K032K766L946N214N828
58733E94496N810N824N960N760N474N972P123P495O310M589L592L187K570J843
58719F66005J824K753M110N469O813Q169R355J0042R856Q680O942N208L425J084
58705G49735j766m381o370q159j0144j2120j3904j5747j7621j8750j8497j7190
$$ plain form
58808 643278 645516 647179 648282 648619 647833 645706 642371 638287 633900 629346 624618 619857 615138 610123 604409
58793 604409 598217 592221 586695 581391 576374 572319 569730 568379 567736 567434 567266 567389 568715 572277 577840
58778 577840 583907 589538 595359 602144 609180 614844 618287 619692 619286 616944 612653 606739 599778 592685
58764 592685 586476 581385 576623 571642 567235 564597 563577 562743 561130 559200 558089 558565 560762 564257 568098
58749 568098 571180 572873 573265 572896 572399 572206 572315 572460 572660 573322 574710 576742 579508 583454 588668 594496
58733 594496 600306 606130 612090 617850 623324 629296 636419 643914 650224 654813 658405 661592 664162 666005
58719 666005 667829 670582 674692 680161 686974 695143 704498 714540 724396 733076 740018 745226 748651 749735
58705 749735 747969 743588 737218 729059 718915 706795 692891 677144 659523 640773 622276 605086
58693F05086j5649j4237j2860j1506j0303r310q527p927p339o572n704m972m406
58680D85774l976l858m058l986l182k160j653j305k07J409K424K785L724N692
58666D77423P554Q505R342J0912J2506J2744J1271Q585N096J274k019m250n769
58653E53174o928p331o704n816n640o145o593o545n949m838l595k967l101l140
58639D77882k350j119j61M97J133J544J455J084O75N1o99q74l03j0q52k129k551
58622D73273j963j125m09K36N05J65o5Q20K595M018M502M656N106N613N495M457
58606E07879K890J653J427K003K458K238J660J121N30j26m22l03m48j129j487
58591E19944p61N40J611K719M456O261P011O748O619P256Q278R288J0198J0651
$$ plain form
58693 605086 589437 575200 562340 550834 540531 531221 522694 514767 507428 500856 495152 490180 485774
58680 485774 481798 477940 473882 469896 466714 464554 462901 461596 461389 462798 465222 468007 471731 477423
58666 477423 484977 493482 502824 513736 526242 538986 550257 558842 563938 565212 563193 558943 553174
58653 553174 546246 538915 532211 526395 520755 514610 508017 501472 495523 490685 487090 484123 481022 477882
58639 477882 475532 474413 474252 474749 475882 477426 478881 479965 480640 480691 479992 479118 478815 478805 477953 475824 473273
58622 473273 471310 470185 469776 470012 470517 470682 470617 471437 474032 478050 482552 487208 492314 497927 503422 507879
58606 507879 510769 512422 513849 515852 518310 520548 522208 523329 523859 523733 523311 523008 522560 521431 519944
58591 519944 519183 519723 521334 524053 528509 534770 541781 548529 555148 562404 570682 579970 590168 600819
58577F00819J0168Q989P940P384P042O846P136Q002R154J0491J2142J3940J5535
58564G25588J7032J8918K1321K3877K6216K8074K9002K8508K6456K2941J8040
58553I85973J2222O668K458m60k904n238p054p960q087p912q007q869j0505j2370
58539I27955j4063j5793j7852j9971k1670k2751k3012k2024j9834j7396j5518
58528G18071j3904j1996j0243r542r697r472q196o451n163m657m665m687m367
58515F15031l871l732l911l534k119o10l10j104j685j345o97n44r02j309j516
58500E87842j572j543j371q94j33M92N83M80J008K291L531M200M784N794O809
58485F12301P201P220P646Q839J0651J2778J4670J5682J5854J5924J6068J5370
$$ plain form
58577 600819 610987 619976 627916 635300 642342 649188 656324 664326 673480 683971 696113 710053 725588
58564 725588 742620 761538 782859 806736 832952 861026 890028 918536 944992 967933 985973
58553 985973 998195 1004863 1007321 1006861 1003957 998719 991665 983705 975618 967706 959699 950830 940325 927955
58539 927955 913892 898099 880247 860276 838606 815855 792843 770819 750985 733589 718071
58528 718071 704167 692171 681928 672386 662689 653217 645021 638570 633407 628750 624085 619398 615031
58515 615031 611160 607428 603517 599983 597864 597254 596944 595840 594155 592810 592113 591569 590667 589358 587842
58500 587842 586270 584727 583356 582462 582329 582821 583404 583884 584892 587183 590714 594914 599698 605492 612301
58485 612301 619502 626722 634368 643207 653858 666636 681306 696988 712842 728766 744834 760204
58473G60204J3184J0103O929L560j89l605n928p453q740r435q982p760o469m940
58459G30479k716j57K126M322O807R147J0812J2122J3227J2980J0332O245K570
58446H18296m48l867p644j0341j1289j1341j1305j0972r991q578p054n526m149
58433G15791k975j738m19M62Q35J683L559N407O125O464P771R468R726Q220O298
58418G76677M544K133j180m217n984o706p001p210p705q600r032q027o114m810
58404G06768m536m316l528k576j691n71O14J211J334J874L044M054M411M413M237
58389G14742L693K951K491K214J666J051J029J604K304L202M619O149P197Q108
58375G63020R389J0254R566P850O703O436O043N342N226N755N921N595N952P624
$$ plain form
58473 760204 773388 783491 790420 793980 793791 790186 784258 776805 768065 758630 749648 741888 735419 730479
58459 730479 727763 727606 729732 734054 740861 750008 760820 772942 786169 799149 809481 815726 818296
58446 818296 817848 813981 806337 795996 784707 773366 762061 751089 741098 732520 725466 719940 715791
58433 715791 712816 711078 710659 711121 711956 713639 717198 722605 728730 735194 742965 752433 762159 770379 776677
58418 776677 781221 783354 782174 777957 771973 765267 758266 751056 743351 734751 725719 717692 711578 706768
58404 706768 702232 697916 694388 691812 690121 689550 690164 691375 692709 694583 697627 701681 706092 710505 714742
58389 714742 718435 721386 723877 726091 727757 728808 729837 731441 733745 736947 741566 747715 754912 763020
58375 763020 772409 782663 792229 800079 806782 813218 819261 824603 829829 835584 841505 847100 853052 860676
58361H60676R940J2293J4727J6900J7918J7551J6392J4615J1835Q178M338O66
58349A006029k563m374m082k706j870j590p02R79K659M195N923P334P979R067
58335A026278J1934J5352J6835J6314J5925J6367J6127J4430J2299J0405Q336
58324A180602O317N203M605L368K000K095L339L757L118L197M477N546O124P549
58310A241297R736J0775J0354J0541J2225J3830J4437J5193J6590J7231J6571
58299A388780J6051J6455J6776J6736J7621J9571K0863K0906K1135K2004K2123
58288A599021K1274K1257K2546K3291K2804K2864K4372K5943K6996K8872L1620
58277A870860L3149L3051L3717L6178L8384L9204M0409M2918M4909M5525M6730
$$ plain form
58361 860676 870616 882909 897636 914536 932454 950005 966397 981012 992847 1001025 1005363 1006029
58349 1006029 1003466 999092 995010 992304 990434 988844 988142 989121 991780 995975 1001898 1009232 1017211 1026278
58335 1026278 1038212 1053564 1070399 1086713 1102638 1119005 1135132 1149562 1161861 1172266 1180602
58324 1180602 1186919 1192122 1196727 1200095 1202095 1204190 1207529 1211286 1214404 1217601 1222078 1227624 1233748 1241297
58310 1241297 1251033 1261808 1272162 1282703 1294928 1308758 1323195 1338388 1354978 1372209 1388780
58299 1388780 1404831 1421286 1438062 1454798 1472419 1491990 1512853 1533759 1554894 1576898 1599021
58288 1599021 1620295 1641552 1664098 1687389 1710193 1733057 1757429 1783372 1810368 1839240 1870860
58277 1870860 1904009 1937060 1970777 2006955 2045339 2084543 2124952 2167870 2212779 2258304 2305034
58266B305034M9453N1726N2769N4970N9422O3447O5063O6135O8381P0017O9248
58255B975665O7630O7109O7093O6965O8095P0836P3134P4521P7734Q3994R0650
58244C783426R5968J01958J09945J17764J24171J31469J40937J50262J58396J68061
58234E082357J80458J92653K03198K15010K29577K44123K57831K74551K95685
58225G175443L16952L36333L58315L85893M15643M45492M79851N21796N67998
58216A1003716O16931O73954P42442Q18574R01067R96826J110576J239128J382953
58207A9486167J552344J754485J986898K252753K570056K957177L424597L990937
58199C9975414M689674N549197O587875P843126R381475J1264360J3533104J6242597
$$ plain form
58266 2305034 2354487 2406213 2458982 2513952 2573374 2636821 2701884 2768019 2836400 2906417 2975665
58255 2975665 3043295 3110404 3177497 3244462 3312557 3383393 3456527 3531048 3608782 3692776 3783426
58244 3783426 3879394 3981352 4091297 4209061 4333232 4464701 4605638 4755900 4914296 5082357
58234 5082357 5262815 5455468 5658666 5873676 6103253 6347376 6605207 6879758 7175443
58225 7175443 7492395 7828728 8187043 8572936 8988579 9434071 9913922 10435718 11003716
58216 11003716 11620647 12294601 13037043 13855617 14756684 15753510 16864086 18103214 19486167
58207 19486167 21038511 22792996 24779894 27032647 29602703 32559880 35984477 39975414
58199 39975414 44665088 50214285 56802160 64645286 74026761 85291121 98824225 115066822
58191A15066822J9464267K3226078K7492178L2180025L6964828M0794339M1662287
58184C36850824L7350888K6949626J1893094m536878j8889889k9038451l4551602
58177C26027612l6161068l5050753l2381758k9051297k5613530k2338711j9337111
58170A26093384j6646415j4265282j2177261j0371017q834043p536521o438718
58163D9824127n510224m729493m072005l513800l042129k649808k322980k045178
58155B1938510j808904j612209j447498j303631j175852j064445r66278q76029
58147A1683664p93106p19635o53769n91747n34001m82976m37675l96290l61183
58138F713282l34992l14444k94011k73235k54952k38839k22574k07024j94579
$$ plain form
58191 115066822 134531089 157757167 185249345 217429370 254394198 295188537 336850824
58184 336850824 374201712 401151338 413044432 408507554 389617665 360579214 326027612
58177 326027612 289866544 254815791 222434033 193382736 167769206 145430495 126093384
58170 126093384 109446969 95181687 83004426 72633409 63799366 56262845 49824127
58163 49824127 44313903 39584410 35512405 31998605 28956476 26306668 23983688 21938510
58155 21938510 20129606 18517397 17069899 15766268 14590416 13525971 12559693 11683664
58147 11683664 10890558 10170923 9517154 8925407 8391406 7908430 7470755 7074465 6713282
58138 6713282 6378290 6063846 5769835 5496600 5241648 5002809 4780235 4573211 4378632
58129D378632j84066j72574j60684j50977j42987j34416j25778j19202j14027
58120C073921j07894j01054r5489r1055q6271q1580p8209p5121p0730o6164o3358
58109B156996o1323n7788n3175m9561m7066m4619m2870m2949m3526m2455m0240
58098A631424l8835l8176l6909l5220l3980l2388k9480k6683k5731k5406k3495
58087A285121k0704j9329j9170j8179j6353j5603j6305j7027j7272j7670j7936
58076A089573j7329j6620j7066j7976j7723j6506j5699j5308j4573j4100j4780
58065I11893j5446j4385j2398j1555j1642j0793r052q303q965r633r860j0471
58053G79390j1260j1048j0059r668r745q827o948n802n980o408o608p130p685
$$ plain form
58129 4378632 4194566 4021992 3861308 3710331 3567344 3432928 3307150 3187948 3073921
58120 3073921 2966027 2864973 2769484 2678429 2592158 2510578 2432369 2357248 2286518 2220354 2156996
58109 2156996 2095673 2037885 1984710 1935149 1888083 1843464 1800594 1757645 1714119 1671664 1631424
58098 1631424 1592589 1554413 1517504 1482284 1448304 1415916 1386436 1359753 1334022 1308616 1285121
58087 1285121 1264417 1245088 1225918 1207739 1191386 1175783 1159478 1142451 1125179 1107509 1089573
58076 1089573 1072244 1055624 1038558 1020582 1002859 986353 970654 955346 940773 926673 911893
58065 911893 896447 882062 869664 858109 846467 835674 826622 818319 809354 799721 789861 779390
58053 779390 768130 757082 747023 737355 727610 718783 711835 706033 700053 693645 687037 679907 672222
58040F72222p243o252o342p519p937o879n743n548n605n316n289n949o772p511
58026E82317q630r936j0400r837r342r533r695r130q145p288o727o535o571o039
58012D64509m385k472j634j771j811j732k484l929m690m267l629l424l117k372
57998D22792j819j961k439k696k380j150Q28K286K113J070Q00J328J204J07n93
57983D19490j49M99M89K13O9m24j517k508k849k828k570j545K36J654J851J359
57967D11470J138J311J383J092O23M65J198K695L584K505j9j959k317k172k910
57952D18087m429n655n948n411m450l513k880k444j961j457r28J7J528K864L328
57937C86748L530M650O612Q100Q405Q024P402O320M731L103J577j82k104l630
$$ plain form
58040 672222 664979 658727 652385 644866 636929 630050 624307 618759 613154 607838 602549 596600 589828 582317
58026 582317 573687 563751 553351 543514 534172 524639 514944 505814 497669 490381 483654 477119 470548 464509
58012 464509 460124 457652 456018 454247 452436 450704 448220 444291 439601 435334 431705 428281 425164 422792
57998 422792 420973 419012 416573 413877 411497 410347 411175 413461 415574 416644 417444 418772 419976 420083 419490
57983 419490 419341 419840 420329 420542 420611 420187 418670 416162 413313 410485 407915 406370 406606 408260 410111 411470
57967 411470 412608 413919 415302 416394 417017 417482 418680 421375 424959 427464 427445 425486 423169 420997 418087
57952 418087 413658 408003 402055 396644 392194 388681 385801 383357 381396 379939 379011 379028 380556 383420 386748
57937 386748 390278 394928 401540 409640 418045 426069 433471 439791 444522 447625 449202 449020 446916 443286
57923D43286m694n821p060p789p835p764p845p608o739n582m557l840l635l970
57909C58547m171l469k152j112m35N07J556J721P40m64j215j741k222k329k064
57894C41697j933j921j386k67O91J149J520J813J458O28M58J276J873J254R5l77
57878C48028m5L36L69K41J95L60O90R21R45J220K109L018L086K672K885L741M064
57861C74835L438K904L284M115M612M517L632J864J24k04P35J199K93q88j244
57846D03216j237j641k212k620l348m541n150m415l106k242j656r80p95j476j972
57831C65825j236J7M61L00P12J753K393K349K394K975L714M184M260L832L020
57816C96953K431K388K252J234n25k455m471o553q044q399q143q075q005p308
$$ plain form
57923 443286 438592 432771 425711 417922 410087 402323 394478 386870 380131 374549 369992 366152 362517 358547
57909 358547 354376 350907 348755 347643 347208 347715 349271 350992 351732 351268 350053 348312 346090 343761 341697
57894 341697 339764 337843 336457 336190 336881 338030 339550 341363 342821 343449 343907 345183 347056 348310 348405 348028
57878 348028 347983 348319 348688 348929 349124 349484 350174 351095 352040 353260 355369 358387 361473 364145 367030 370771 374835
57861 374835 378273 381177 384461 388576 393188 397705 401337 403201 403325 403121 403856 405055 405348 404460 403216
57846 403216 401979 400338 398126 395506 392158 387617 382467 378052 374946 372704 371048 370068 369273 367797 365825
57831 365825 364589 364606 365067 365367 366079 367832 370225 372574 374968 377943 381657 385841 390101 393933 396953
57816 396953 399384 401772 404024 405258 404733 402278 397807 391254 383210 374811 366668 358593 350588 343280
57802C43280o218n492n200m893m552m335l887k952k158k039j844o48Q43J151L24
57787C01380k39n3O2j02L79J717K735K651K280K609L343L711L746L903M033L629
57771C35784K682J567L61j148k864m226m678m199l429l182l621m070l894l255
57757C01828k613j879p54M20R51Q52Q18J181J712K379L397M445M751M256L783
57742C25527L809L857L470L006K998L305L473L398L155K616J691O37k71j063j749
57727C57859j987j490o10q8l00r48j451j467j130q40p97p71m94j40j78p85j662
57710C42721k379k647k390j814j307j037p80l57N4M05J178K688M301N053M859
57695C48548M355L728K581J058j7l58p22j660k576k640k041j690j960k402k433
$$ plain form
57802 343280 337062 331570 326370 321477 316925 312590 308703 305751 303593 301554 299710 299062 299905 301056 301380
57787 301380 301141 301088 301150 301048 301427 303144 305879 308530 310810 313419 316762 320473 324219 328122 332155 335784
57771 335784 338466 340033 340394 339246 336382 332156 327478 323279 319850 316668 313047 308977 305083 301828
57757 301828 299215 297336 296582 297002 297953 298805 299623 300804 302516 304895 308292 312737 317488 321744 325527
57742 325527 329336 333193 336663 339669 342667 345972 349445 352843 355998 358614 360305 360942 360671 359608 357859
57727 357859 355872 354382 353772 353684 353384 352436 350985 349518 348388 347548 346751 345980 345486 345346 345168 344383 342721
57710 342721 340342 337695 335305 333491 332184 331147 330367 330010 330064 330469 331647 334335 338636 343689 348548
57695 348548 352903 356631 359212 360270 360253 359895 359173 357513 354937 352297 350256 348566 346606 344204 341771
57680C41771j807n24J251L221N208P281R516J1825J4348J7694K2453K8554L5472
57667D96263M2891N0556N7137N9558N4133L9087J6410q669l0376m5042n1988n2672
57655F27288m9402m4382l9068l4045k9408k5179k1288j7572j4249j1977j0970
57644C29748j0243q548n935l683k555j985j293q30j229k092k288j459n18n01j331
57629B85258k002j775r85n74r95j753k123k081k159k576k956k931k533j892j039
57614B56884k64k14j149k297k486j430p2M50on94n12J49O34M47j66o17o25l30
57596B47802k5j6n38j498k370k672k474k224k154k120j993j811j632j476j435
57581B23364j517j421q84j41K66K00l9l14q17j516j990k023j936k020k022j588
$$ plain form
57680 341771 339964 339440 340691 343912 349120 356401 365917 377742 392090 409784 432237 460791 496263
57667 496263 539154 589710 646847 706405 760538 799625 816035 807366 776990 731948 679960 627288
57655 627288 577886 533504 494436 460391 430983 405804 384516 366944 352695 340718 329748
57644 329748 319505 310957 305022 301339 298784 296799 295506 294676 293447 291355 289067 287608 287090 286589 285258
57629 285258 283256 281481 280496 279922 278927 277174 275051 272970 270811 268235 265279 262348 259815 257923 256884
57614 256884 256620 256406 255257 252960 250474 249044 248972 249422 249416 248822 248310 248459 249093 249540 249374 248757 248132 247802
57596 247802 247777 247761 247223 245725 243355 240683 238209 235985 233831 231711 229718 227907 226275 224799 223364
57581 223364 221847 220426 219542 219401 219667 219867 219828 219514 218697 217181 215191 213168 211232 209212 207190 205602
57565B05602r23n71p16j002j053q68o14l51NM38P79Q82Q11P57P82Q16Q86J152
57547B06812J582J871J787J384P72N4m17j40P50J317R49K41O0K13j46j031j581
57530B14477j527j550j913j765m67J204J931J536R60Q64R77Q11M80N20J125J839
57514B19502K043J702J394J499J632J259N93L60P41J192J297J165R01L03o21j426
57498B33536j770j794j723j590j477j547j578j068r8N06J46q51j773k187j838
57483B14894o75O74J149N97J04M14P73J80q99j143l42L86K44l91p85p12l99k35
57465B13834o13j517k227k042j170l91N1N15J041J200R60Q54J108J304J201J184
57449B15292J482J665J351Q78P35P80N74J40k07n10j004j371q65O11K053K387
$$ plain form
57565 205602 204679 204108 203392 202390 201337 200469 199855 199504 199509 199947 200726 201608 202419 203176 203958 204774 205660 206812
57547 206812 208394 210265 212052 213436 214208 214262 213845 213705 214455 215772 216721 216962 217022 217235 217089 216058 214477
57530 214477 212950 211400 209487 207722 207255 208459 210390 211926 212886 213750 214727 215538 216018 216538 217663 219502
57514 219502 221545 223247 224641 226140 227772 229031 229624 229984 230725 231917 233214 234379 235280 235583 234962 233536
57498 233536 231766 229972 228249 226659 225182 223635 222057 220989 220891 221397 221543 220692 218919 216732 214894
57483 214894 214219 214893 216042 216639 216743 217157 217930 218110 217211 216068 215726 216112 216356 215965 215180 214468 214069 213834
57465 213834 213221 211704 209477 207435 206265 205874 205925 206440 207481 208681 209641 210495 211603 212907 214108 215292
57449 215292 216774 218439 219790 220668 221403 222183 222757 222897 222690 222180 221176 219805 218940 219551 221604 223991
57433B23991J717J162J459K125K199J514P98N83O04M59M00R33J891K486K240J423
57417B45984N92J13J81P77J451J566J032N41P75J592K190J972J038n9q64j307
57401B57574j537j590j384j033q88j026r44j61J023J805J900J811K010K327K341
57386B62228J991J629J646K227L166L851L740L015K406K289K349K236K068J932
57372B96773J510O89J06M15J247J587J109M50K38N28J239K413L724M428M277M027
57356C24760M458N258N444M725L795L359L482L932M625N392N797N605N189N141
57342C90962N523N835N666N096M486M092L982M124M328M232L511K296J274J205
57328D46612K147L264L578K933K079J811K255L059L942M799N471N741N644N526
$$ plain form
57433 223991 225708 226870 228329 230454 232653 234167 234965 235548 236152 236611 237011 237944 239835 242321 244561 245984
57417 245984 246576 246689 246870 247647 249098 250664 251696 252237 253012 254604 256794 258766 259804 259745 258881 257574
57401 257574 256037 254447 253063 252030 251142 250116 249172 249011 250034 251839 253739 255550 257560 259887 262228
57386 262228 264219 265848 267494 269721 272887 276738 280478 283493 285899 288188 290537 292773 294841 296773
57372 296773 298283 298972 299078 299493 300740 302327 303436 303886 304124 304652 305891 308304 312028 316456 320733 324760
57356 324760 329218 334476 339920 344645 348440 351799 355281 359213 363838 369230 375027 380632 385821 390962
57342 390962 396485 402320 407986 413082 417568 421660 425642 429766 434094 438326 441837 444133 445407 446612
57328 446612 448759 452023 455601 458534 460613 462424 464679 467738 471680 476479 481950 487691 493335 498861
57314D98861N804O685Q039R410J0253J0310R785R085Q554Q464Q953R708J0030
57301F13941R585Q941Q925R612J0335J0633J0666J0677J0608J0424J0315J0366
57289G35028J0362J0173J0042J0189J0395J0203R449Q388P472P015O958O914O782
57276H49370P194Q961J1976J5166J7678J9586K1151K2024K1700K0392J8823J7372
57264A051393J5984J4773J4098J4035J4208J4238J4062J3847J3931J4750J6390
57253A211709J8165J9080J8910J8432J8417J8684J8504J7741J7083J7086J7415
57242A411226J7387J6990J6899J7554J8782K0504K3089K6544K9825L1735L2276
57231A662811L2460L2953L3692L4625L5753L6443L5741L3824L2064L1215L0482
$$ plain form
57314 498861 504665 511350 519389 528799 539052 549362 559147 568232 576786 585250 594203 603911 613941
57301 613941 623526 632467 641392 651004 661339 671972 682638 693315 703923 714347 724662 735028
57289 735028 745390 755563 765605 775794 786189 796392 805841 814229 821701 828716 835674 842588 849370
57276 849370 856564 865525 877501 892667 910345 929931 951082 973106 994806 1015198 1034021 1051393
57264 1051393 1067377 1082150 1096248 1110283 1124491 1138729 1152791 1166638 1180569 1195319 1211709
57253 1211709 1229874 1248954 1267864 1286296 1304713 1323397 1341901 1359642 1376725 1393811 1411226
57242 1411226 1428613 1445603 1462502 1480056 1498838 1519342 1542431 1568975 1598800 1630535 1662811
57231 1662811 1695271 1728224 1761916 1796541 1832294 1868737 1904478 1938302 1970366 2001581 2032063
57220B032063K9061K7603K7256K8040K9234L0693L2680L4915L6944L9106M1967
57209B389562M4974M6967M7919M8945N0439N1504N1505N0955N0364M9342M7573
57198B930049M5769M4786M4491M4273M4214M4750M5579M5764M4956M3753M2785
57187C421169M1996M1084M0250M0137M1019M2314M3083M3051M2877M3264M4029
57176C884273M4444M4287M4022M3937M3749M3213M2604M2222M1886M1257M0328
57165D356222L9242L7947L6390L4756L3094L0959K7877K4088K0295J6756J3091
57154D670717R060N121J926m53k401l975m659m059k559r06O80K605N064P666J0091
57139D693918J2692J5992J9823K3476K6507K8823L0027K9206K5622J9331J1107
$$ plain form
57220 2032063 2061124 2088727 2115983 2144023 2173257 2203950 2236630 2271545 2308489 2347595 2389562
57209 2389562 2434536 2481503 2529422 2578367 2628806 2680310 2731815 2782770 2833134 2882476 2930049
57198 2930049 2975818 3020604 3065095 3109368 3153582 3198332 3243911 3289675 3334631 3378384 3421169
57187 3421169 3463165 3504249 3544499 3584636 3625655 3667969 3711052 3754103 3796980 3840244 3884273
57176 3884273 3928717 3973004 4017026 4060963 4104712 4147925 4190529 4232751 4274637 4315894 4356222
57165 4356222 4395464 4433411 4469801 4504557 4537651 4568610 4596487 4620575 4640870 4657626 4670717
57154 4670717 4679777 4684898 4686824 4686371 4683970 4679995 4675336 4671277 4668718 4667812 4668492 4671097 4676161 4683827 4693918
57139 4693918 4706610 4722602 4742425 4765901 4792408 4821231 4851258 4880464 4906086 4925417 4936524
57128D936524K153o088j2286j5677j6083j3455p710Q74J1291K1984L1325L8151
57116D971003M2355M5099M8175N2846N9402O7701P7791Q9855J04059J20891J41631
57105E820808J68041K01446K42385K91441L50365M22125N09938O16798P45999
57096I369346R01366J086188J302093J549098J825686K127263K444578K764286
57088B3369904L070627L345752L570237L726335L800155L777098L635987L355682
57080E1651777K934083K398290J790021J141215M68296k11120q64431j451719
57072E7856412j944183k332920k624523k833754k978084l071821l121083l124701
57064C5825343l080120k987769k851375k677622k476622k260737k041310j826569
$$ plain form
57128 4936524 4938677 4932589 4920303 4904626 4888543 4875088 4867378 4868252 4879543 4901527 4932852 4971003
57116 4971003 5013358 5058457 5106632 5159478 5218880 5286581 5364372 5454227 5558286 5679177 5820808
57105 5820808 5988849 6190295 6432680 6724121 7074486 7496611 8006549 8623347 9369346
57096 9369346 10270712 11356900 12658993 14208091 16033777 18161040 20605618 23369904
57088 23369904 26440531 29786283 33356520 37082855 40883010 44660108 48296095 51651777
57080 51651777 54585860 56984150 58774171 59915386 60383682 60172562 59308131 57856412
57072 57856412 55912229 53579309 50954786 48121032 45142948 42071127 38950044 35825343
57064 35825343 32745223 29757454 26906079 24228457 21751835 19491098 17449788 15623219
57056A5623219j622213j432482j260044j105885r69994q51717p49501o61242n85345
57047F384796n20914m66837m21306l82468l48975l19774k93867k70363k48357
57038C111935k26787k04978j83262j62411j42432j22478j02045q1672o1968m2382
57028A781520k1766r39J5090J8421L741k6309o1563r0944j08843j15710j14360
57017A278338j07444r7579q7437p8512p0537o2699n4975m8049m2401l7918l4155
57006E56632l0727k7525k4593k1877j9329j7273j6186j5867j5334j3947j2149
56995C41825j0663r523q342p035n584l664j138J499L875O431R515J2367J3919
56982C43482J4084J3232J0810N886j040p918j2997j5876j6840j6273j4841j3289
$$ plain form
57056 15623219 14001006 12568524 11308480 10202595 9232601 8380884 7631383 6970141 6384796
57047 6384796 5863882 5397045 4975739 4593271 4244296 3924522 3630655 3360292 3111935
57038 3111935 2885148 2680170 2496908 2334497 2192065 2069587 1967542 1885870 1823902 1781520
57028 1781520 1759754 1758815 1773905 1792326 1796067 1769758 1708195 1617251 1508408 1392698 1278338
57017 1278338 1170894 1073315 985878 907366 836829 774130 719155 671106 628705 590787 556632
57006 556632 525905 498380 473787 451910 432581 415308 399122 383255 367921 353974 341825
56995 341825 331162 321639 313297 306262 300678 297014 295876 297375 301250 307681 317196 329563 343482
56982 343482 357566 370798 381608 387494 386454 378536 365539 349663 332823 316550 301709 288420
56970B88420j1751r908p805n786l715j173J645M229O812J0135J4139J7986K1405
56957C24633K4751K7426K7481K3291J4932L761q157j8090k3593k4495k3117k1737
56945C27086k0533j8536j5629j2594r782o738l003J286N566R328J2609J6182K0836
56932C06078K6360L1552L5091L5775L2029K2623Q524o774j9497k7914l2218l3189
56920C78440l1709k8966k6087k3536k1201j8881j6465j3971j1674r898q565p428
56908A60059o711o806p235o868n466m090l487l023j840k24J044K001L230M761
56894A25345O175P467R003J0741J2263J3584J5289J7824K0926K3631K4533K2367
56882C09148J6843Q962L69p424j3202j6172j6385j4716j2118r085n910k832L28
$$ plain form
56970 288420 276669 266761 258956 253170 249455 248282 249927 254156 260968 271103 285242 303228 324633
56957 324633 349384 376810 404291 427582 442514 446275 438118 420028 396435 371940 348823 327086
56945 327086 306553 288017 272388 259794 250012 243274 240271 241557 247123 256451 269060 285242 306078
56932 306078 332438 363990 399081 434856 466885 489508 498032 491258 471761 443847 411629 378440
56920 378440 346731 317765 291678 268142 246941 228060 211595 197624 185950 176052 167487 160059
56908 160059 153348 146542 139307 132439 126973 122883 119396 116373 114533 114309 115353 117354 120584 125345
56894 125345 131520 138987 147990 158731 170994 184578 199867 217691 238617 262248 286781 309148
56882 309148 325991 334953 335322 327898 314696 298524 282139 267423 255305 246220 240310 237478 237806
56869B37806M050Q292J2371J6147K0642K6828L4326M1963M9199N6109O2010O4700
56857F34443O1287M9854L0958Q059j3826l0546m0461m4143m3193l9374l4042k7794
56845E11222k0788j3461o411M96Q112J6806K6028L5413M5575N7276P0451Q4231
56833H14950R6785J04360J01604Q4541N3778J4741k4718n7173p7971q6723q6660
56822I37514q1805p4572o5962n6768m7577l8222k8361j8286q420J528J2109K3260
56810E54438L4691M6643N9222P1029P9059P9673O9673M7794J6715j6807m5267
56799I96863o4333p3633p4941p0845o4245n7186m9832m1527l2710k4704j8021
56788D24886j2055o329q37M794J1178J8176K5111L1752L7657M0505L6866K5441
$$ plain form
56869 237806 241856 250148 262519 278666 299308 326136 360462 402425 451624 507733 569743 634443
56857 634443 695730 745584 776542 784601 770775 740229 699768 655625 612432 573058 539016 511222
56845 511222 490434 476973 470562 471058 479170 495976 522004 557417 602992 660268 730719 814950
56833 814950 911735 1016095 1117699 1202240 1256018 1270759 1246041 1188868 1110897 1024174 937514
56822 937514 855709 781137 715175 658407 610830 572608 544247 525961 517541 519069 531178 554438
56810 554438 589129 635772 694994 766023 845082 924755 994428 1042222 1058937 1042130 996863
56799 996863 932530 858897 783956 713111 648866 591680 541848 500321 467611 442907 424886
56788 424886 412831 406502 405665 410459 421637 439813 464924 496676 534333 574838 611704 637145
56776F37145Q667r266k5051l6802m3594m5620m4246m1105l7358l3827l1026k8610
56764B69307k5631k1784j7899j4811j2440j0370q691p665p100o630o245o062n839
56751A18140n137l886k529j615j317j355j386j501k013k665k698j993j478j744
56737H6823k001j307k57j60r36j220n17J67P5k64j68K45O88J267J885J978J460
56720H7758J099J397J863J882J576J277Q64K48j02K26R25J397J548J692K047K590
56704A08287L060K956K025Q37K61K82Q8n33p67r2Q60J269J168J028R49Q83R87
56687A23548J219J164P12L82M07J84p62j803j929j064q2K47j02n74n01K33Q59
56670A22138N49l22n16K73R36O77K15N04J177J234O16K1l54q16j246j176o59k29
$$ plain form
56776 637145 645812 636546 611495 574693 531099 485479 441233 400128 362770 328943 297917 269307
56764 269307 243676 221892 203993 189182 176742 166372 157681 150016 142916 136286 130041 123979 118140
56751 118140 113003 109117 106588 104973 103656 102301 100915 99414 97401 94736 92038 90045 88567 86823
56737 86823 84822 83515 83258 83098 82162 80942 80425 80592 80667 80403 80235 80480 81168 82435 84320 86298 87758
56720 87758 88857 90254 92117 93999 95575 96852 97716 97964 97862 98088 99013 100410 101958 103650 105697 108287
56704 108287 111347 114303 116328 117165 117426 117708 117796 117263 116496 116404 117264 118533 119701 120729 121678 122561 123548
56687 123548 124767 125931 126643 127025 127432 127616 126854 125051 123122 122058 121976 122223 122121 121547 121046 121279 122138
56670 122138 122687 122365 121849 122122 123058 123735 123950 124454 125631 126865 127481 127502 127148 126332 125086 123910 123251 123022
56652A23022l8J52K88J26r8J35O91Q44L62j21l3M16O92O72O20O77O57L19k65o61
56632A28457m70J90P91J001R08O03k4r18j630j791j550j211p87k20K12J14n10
56615A23165j195j376q05K11R04P53J29j43Q1J61j75l29J65P67O95O4l47j22M68
56596A23071J008J298J294J059P06K20m48r95r32k72M20Q30J171J470J242L62
56580A31504m43n11n7M63J115J956K366J845R77P54J218J661J816K013K343K696
56564A51716L461N205P483Q997R240R178R871J1004J1278R863P077L853R61j266
56550B47921k803l630l692l104k218j485j256j731k723l473l249k311j806k332
56536B12108l170l385l196l445m095m172l178j770p92l46q4J21K15L06O05J081
$$ plain form
56652 123022 122984 123136 123424 123550 123452 123587 124278 125122 125484 125363 125330 125746 126438 127110 127730 128407 129064 129383 129118 128457
56632 128457 127987 128177 128968 129969 130877 131480 131456 130538 128908 127117 125567 124356 123569 123349 123561 123675 123165
56615 123165 121970 120594 119789 120000 120904 121657 121786 121643 121724 121885 121710 121381 121546 122313 123008 123072 122725 122603 123071
56596 123071 124079 125377 126671 127730 128436 128656 128208 127213 126281 126009 126429 127259 128430 129900 131142 131504
56580 131504 131061 130550 130493 130956 132071 134027 136393 138238 139215 139969 141187 142848 144664 146677 149020 151716
56564 151716 155177 160382 167865 176862 186102 195280 205151 216155 227433 237296 244373 248226 249187 247921
56550 247921 245118 241488 237796 234692 232474 230989 229733 228002 225279 221806 218557 216246 214440 212108
56536 212108 208938 205553 202357 198912 194817 190645 187467 185697 184905 184559 184475 184596 184811 185117 185722 186803
56520A86803J419J293O08m08j309j706j600j361j326j454j468j304j300j733k325
56505A72829k521k269k041j983j589o62L4j96p98p14rL28O9%M23O49L86L40Q75
56486A63151J197P00N1qj3p76j720j525j72R22Q40J97Q7P45J578J961J758J296
56468A70269R92R40R60R94J096J008L23p29j279r56l50k3K63P98J167R21L88O3
56450A76845j56l77l8J113J951J168o42j428l37J158J229n4j084p77L19Q96M24
56433A80210m03o88m18j81j22J07M38K77m35q74m94K10N66N80M71J61j47K49J400
56414A80907K127J519L52K2O56J310J495J446J269Q97O67R20J233R42K11k43k38
56397A95492q8J99P81J377J645J871K354K513J633K37l87J69J172J999K534K521
$$ plain form
56520 186803 188222 189515 190123 189715 188406 186700 185100 183739 182413 180959 179491 178187 176887 175154 172829
56505 172829 170308 168039 165998 164015 162426 161764 161798 161602 160804 160090 160081 160409 160478 160478 160901 161550 161936 162276 163151
56486 163151 164348 165048 165099 165091 165078 164302 162582 161057 160885 161807 162647 162844 162931 163676 165254 167215 168973 170269
56468 170269 171261 172201 173161 174155 175251 176259 176582 175853 174574 173618 173268 173245 173508 174306 175473 176394 176782 176845
56450 176845 176689 176312 176274 177387 179338 180506 179864 178436 178099 179257 180486 180432 179348 178571 178890 179786 180210
56433 180210 179807 179119 178701 178520 178398 178505 178943 179220 178785 177911 177417 177627 178193 178773 179244 179405 179258 179507 180907
56414 180907 183034 184553 184905 184927 185583 186893 188388 189834 191103 192000 192667 193587 194820 195762 195973 195730 195492
56397 195492 195404 195603 196384 197761 199406 201277 203631 206144 207777 208014 207627 207796 208968 210967 213501 216022
56381B16022J620J78r98j564j616r79M60J943K414J846J007J40r80j833j369L35
56365B16626J812J992J324Q34R04J263J457J165N66L71R05J431J188P05J041J980
56349B35564K301J714J156J054P12j61o74p5J181K269K984L353L129K320J582
56334B58409J541K181L112L954M186L412K042J188J501K550L469L751L299K325
56320B96920J332P46N02K92J32J86K65J61J88O95J340J564J518J727K123K319
56304C12010K520L167L998M450M756N488O307O426O040O031O356O170N497N298
56290C84514N783O136O117O458P304P729P300O835P019P522P953Q593R518J0156
56276D88937J0276J0468J1200J2197J3171J4191J5096J5589J6158J7806K0461
$$ plain form
56381 216022 217642 217820 216822 215258 213642 212663 213123 215066 217480 219326 220333 220473 219493 217660 216291 216626
56365 216626 218438 220430 221754 222588 223492 224755 226212 227377 227943 228314 229219 230650 231838 232543 233584 235564
56349 235564 237865 239579 240735 241789 242501 242340 241666 241591 242772 245041 248025 251378 254507 256827 258409
56334 258409 259950 262131 265243 269197 273383 276795 278837 280025 281526 284076 287545 291296 294595 296920
56320 296920 298252 298998 299500 299792 299924 300110 300375 300536 300724 301419 302759 304323 305841 307568 309691 312010
56304 312010 314530 317697 321695 326145 330901 336389 342696 349122 355162 361193 367549 373719 379216 384514
56290 384514 390297 396433 402550 409008 416312 424041 431341 438176 445195 452717 460670 469263 478781 488937
56276 488937 499213 509681 520881 533078 546249 560440 575536 591125 607283 625089 645550
56265F45550K2901K4605K6413K8900L1438L3592L6291M0629M6489N3146O0390
56254A050344O8329P6742Q5372R4353J03836J13682J23726J33719J42898J50415
56244B143416J56275J60913J63741J63256J58716J50595J39049J23296J02990
56235C462247P9077N2827K5154k650k8768n2209p3331r2456j08863j21706j30933
56224C008389j36840j39656j40090j39185j37160j33293j27425j20578j13683
56215A820479j06804r9999r3733q7878q1532p4530o8047o2964n8632n3968m8870
56204I83522m3906l9365l5291l1732k8511k5312k2284j9868j8039j6524j5566
56193F87124j5394j5104j3525j1084r272q338p228n820n217n456n091l653k579
$$ plain form
56265 645550 668451 693056 719469 748369 779807 813399 849690 890319 936808 989954 1050344
56254 1050344 1118673 1195415 1280787 1375140 1478976 1592658 1716384 1850103 1993001 2143416
56244 2143416 2299691 2460604 2624345 2787601 2946317 3096912 3235961 3359257 3462247
56235 3462247 3541324 3594151 3619305 3616655 3587887 3535678 3462347 3369891 3261028 3139322 3008389
56224 3008389 2871549 2731893 2591803 2452618 2315458 2182165 2054740 1934162 1820479
56215 1820479 1713675 1613676 1519943 1432065 1350533 1276003 1207956 1144992 1086360 1032392 983522
56204 983522 939616 900251 864960 833228 804717 779405 757121 737253 719214 702690 687124
56193 687124 671730 656626 643101 632017 622745 614407 607179 601359 596142 590686 585595 581942 579363
56180E79363k786l174k562j400n82l7N17P86P59J002J499J564J464K377M242N532
56164E88564N819O523Q237R482R257Q783R351J0403J1158J2255J4238J6176J7308
56151G27554J8527K0669K2993K4856K7360L1690L7334M3495N0796N9931O9955
56140A135160P9488Q8308R6182J01386J01938R7399Q8439P6130O2881N2331M6625
56129B026267M4769M4523M4303M2350L6468K6459J5178N472k300q656j3319j7185
56117B244329k3597l5077n0179o5614p9843r2382j01453j05146j03820r9073r1395
56106A396750q0941o9424n8918m9657m0943l3179k7134k2273j7747j3979j1481
56095I71074r286o370l508j965j538j361j353j355m00J619L234L808M724O622
$$ plain form
56180 579363 576577 573403 570841 569441 568859 568822 569339 570125 570884 571886 573385 574949 576413 578790 583032 588564
56164 588564 594383 600906 609143 618625 627882 636665 646016 656419 667577 679832 694070 710246 727554
56151 727554 746081 766750 789743 814599 841959 873649 910983 954478 1005274 1065205 1135160
56140 1135160 1214648 1302956 1399138 1500524 1602462 1699861 1788300 1864430 1927311 1979642 2026267
56129 2026267 2071036 2115559 2159862 2202212 2238680 2265139 2280317 2285789 2283489 2274833 2261514 2244329
56117 2244329 2220732 2185655 2135476 2069862 1990019 1897637 1796184 1691038 1587218 1488145 1396750
56106 1396750 1315809 1246385 1187467 1137810 1096867 1063688 1036554 1014281 996534 982555 971074
56095 971074 961788 955418 951910 949945 948407 947046 945693 944338 943938 945557 948791 952599 957323 963945
56081I63945P785P134O497P691R649J0691J1289J2215J2398J1310J1116J3472
56069A085192J6422J7411J7173J7653J8295J7713J6927J7488J8308J7769J7063
56058A277414J8055J9649J9750J9008J9160J9470J8483J7372J7904J8904J8526
56047A483695J8113J9851K2361K2834K1950K2502K4571K6219K7522K9812L2250
56036A751680L3167L3497L4985L6516L6284L5872L7935M1512M3852M5186M7276
56025B177762M9188M9081M8494N0093N2906N4440N5594N8604O2125O3473O3853
56014B785613O6155O9556P1624P3640P8250Q3939Q7591R0349R5090J00467J03670
56003C705944J06647J13026J21256J27635J33588J42826J53810J62588J70639
$$ plain form
56081 963945 971730 978864 985361 993052 1002701 1013392 1024681 1036896 1049294 1060604 1071720 1085192
56069 1085192 1101614 1119025 1136198 1153851 1172146 1189859 1206786 1224274 1242582 1260351 1277414
56058 1277414 1295469 1315118 1334868 1353876 1373036 1392506 1410989 1428361 1446265 1465169 1483695
56047 1483695 1501808 1521659 1544020 1566854 1588804 1611306 1635877 1662096 1689618 1719430 1751680
56036 1751680 1784847 1818344 1853329 1889845 1926129 1962001 1999936 2041448 2085300 2130486 2177762
56025 2177762 2226950 2276031 2324525 2374618 2427524 2481964 2537558 2596162 2658287 2721760 2785613
56014 2785613 2851768 2921324 2992948 3066588 3144838 3228777 3316368 3406717 3501807 3602274 3705944
56003 3705944 3812591 3925617 4046873 4174508 4308096 4450922 4604732 4767320 4937959
55994D937959J82058J95384K06428K16741K30819K47398K62357K77605K97802
55985G054551L20805L41248L61068L86389M16556M46851M79249N19351N65556
55976A0891624O13040O65278P29349Q03409Q82102R70399J077783J203123J341086
55967A9177193J499011J690626J918379K180995K493283K878445L347458L908617
55959C9094007M589661N425668O436597P648529R125864J0946723J3160846J5811926
55951A12239821J8973752K2700885K6966167L1690509L6665051M1089019M3076230
55944C33401434M0064986L0422858J5056540k599250j8399825k9575513l5514147
55937C32857083l7139535l5887425l3061306k9610189k6098935k2781899j9744651
$$ plain form
55994 4937959 5120017 5315401 5521829 5738570 5969389 6216787 6479144 6756749 7054551
55985 7054551 7375356 7716604 8077672 8464061 8880617 9327468 9806717 10326068 10891624
55976 10891624 11504664 12169942 12899291 13702700 14584802 15555201 16632984 17836107 19177193
55967 19177193 20676204 22366830 24285209 26466204 28959487 31837932 35185390 39094007
55959 39094007 43683668 49109336 55545933 63194462 72320326 83267049 96427895 112239821
55951 112239821 131213573 153914458 180880625 212571134 249236185 290325204 333401434
55944 333401434 373466420 403889278 418945818 416346568 397946743 368371230 332857083
55937 332857083 295717548 259830123 226768817 197158628 171059693 148277794 128533143
55930A28533143j7015380j4596136j2469705j0621587r044728p717018o596686
55923E0471903n647317m848700m179987l613436l130225k724313k385708k096149
55915B1846068j844791j632222j455100j301500j164852j048326r51594q66138
55907A1581545p87095p17596o58062o02477n48429n00155m58698m19214l80531
55898F509288l47451l20865k95260k68681k45840k28612k12424j94996j80159
55889D215000j69758j59748j47575j36057j27001j17962j08360j02087j01052
55880C045400j01885j01674j01219j00495r6855r0118q4059q0599p7559p3739
55870B137198p0926o9199o5765o0314n6239n4613n2232m7495m3215m1385m0084
$$ plain form
55930 128533143 111517763 96921627 84451922 73830335 64785607 57068589 50471903
55923 50471903 44824586 39975886 35795899 32182463 29052238 26327925 23942217 21846068
55915 21846068 20001277 18369055 16913955 15612455 14447603 13399277 12447683 11581545
55907 11581545 10794450 10076854 9418792 8816315 8267886 7767731 7309033 6889819 6509288
55898 6509288 6161837 5840972 5545712 5277031 5031191 4802579 4590155 4395159 4215000
55889 4215000 4045242 3885494 3737919 3601862 3474861 3356899 3248539 3146452 3045400
55880 3045400 2943515 2841841 2740622 2640127 2543272 2453154 2369095 2288496 2210937 2137198
55870 2137198 2066272 1997073 1931308 1870994 1814755 1760142 1707910 1660415 1617200 1575815 1535731
55859A535731l7761l6012l5900l5714l4390l3202l2404l0253k6901k5115k5628
55848A182451k5860k4732k4496k6118k7070k5672k3679k2686k1724k0201j9562
55837I20651k0129j9768j7540j5372j4572j3884j2472j1525j1478j0998r974j0078
55825G52861j1162j0748q522p510r108j0782j0641j0505j2149j3917j3664j2052
55813F22101j0517q676o177m499m590m904l948k616k077j491K42K408L928N104
55799E84288O293O744O137N491N255M380K373K95j337l481o356q512r157r193
55785E83220r080q109o831p475j0575j3697j4919j5062j5001j3466r386m091P53
55772D56281N399J0400J4532J6005J4165Q910M55r011j5796j8371j8777j9094
$$ plain form
55859 1535731 1497970 1461958 1426058 1390344 1355954 1322752 1290348 1260095 1233194 1208079 1182451
55848 1182451 1156591 1131859 1107363 1081245 1054175 1028503 1004824 982138 960414 940213 920651
55837 920651 900522 880754 863214 847842 833270 819386 806914 795389 783911 772913 762939 752861
55825 752861 741699 730951 722429 714919 705811 695029 684388 673883 661734 647817 634153 622101
55813 622101 611584 602908 596731 592232 587642 582738 578790 576174 574097 572606 572848 575256 579184 584288
55799 584288 590581 597325 603462 608953 614208 618588 620961 621256 619919 616438 610082 601570 592413 583220
55785 583220 574140 566031 559200 551725 541150 527453 512534 497472 482471 469005 459619 455528 456281
55772 456281 461680 472080 486612 502617 516782 525692 526147 517136 501340 482969 464192 445098
55760D45098j8811j6997j4612j2798j1016q766p127o783o448n077l839m044m915
55747C23865n175n078n080m362k527j045j040j281l37Q93P45n77j890l086m324
55732B89701m620l284j604j175j685k059k533l678m608m266l393l375l944l803
55718B45674k745j450q7J294J972J722J820L281N064N622N148M597L663J593q37
55703B76331k229k742l562m809n732o384p343q177p991p037o271n640m447k980
55689B00987k151j759p30R99K258K401K027J909K202K732L240L411L323L564M334
55674B28747M777L930J885m87k473l651l795l274k870k732k175r91J10P59J529
55659B19289K599L131K738K310K504K640K099J492J401J186L03n08n49n17j184
$$ plain form
55760 445098 426287 409290 394678 381880 370864 362098 354971 348188 341740 336663 332824 328780 323865
55747 323865 318690 313612 308532 304170 301643 300598 299558 298277 297940 298833 299578 299001 297111 294025 289701
55732 289701 285081 281797 280193 279018 277333 275274 272741 269063 264455 260189 256796 253421 249477 245674
55718 245674 242929 241479 241392 242686 244658 246380 248200 251481 256545 262167 267315 271912 275575 277168 276331
55703 276331 274102 271360 267798 262989 257257 250873 243530 235353 227362 220325 214054 208414 203967 200987
55689 200987 198836 197077 196347 197346 199604 202005 204032 205941 208143 210875 214115 217526 220849 224413 228747
55674 228747 233524 237454 239339 238852 236379 232728 228933 225659 222789 220057 217882 216891 217001 217760 219289
55659 219289 221888 225019 227757 230067 232571 235211 237310 238802 240203 241389 241692 241184 240635 240118 238934
55644B38934j915j916j832k666m063n139n983o944p443p024o526o699o613n151
55630A69020l097k007j840j487q53n68l86K18N07m67j796j721m03L06k43q96r72
55613A53315j201k035k798k988l053l403l724l657l235k459j329l24k6k67l96
55598A22420k20mJ37P5n65j632k039j163NJ85k77j21P59J386J411J395J579J684
55580A25015J691J729J521J033J163K533M192M879N060O116P973R198R173Q481
55566A89757P282N067K131l75k071l579n037n826n951o252o936p220o690n803
55552A48497m903l965l388l709m343l955k368q20j24J55M11L08k13n11k83P7M78
55535A21344J321K287K270J057j02k71k6l08j043j625j893j928j599j083j119
$$ plain form
55644 238934 237019 235103 233271 230605 226542 221403 215420 208476 201033 194009 187483 180784 174171 169020
55630 169020 165923 163916 162076 160589 159736 159168 158782 159000 159507 159040 157244 155523 155120 155426 155183 154287 153315
55613 153315 152114 150079 147281 144293 141240 137837 134113 130456 127221 124762 123433 123109 123083 122816 122420
55598 122420 122200 122196 122333 122408 121843 120211 118172 117009 117014 117199 116922 116801 117560 118946 120357 121752 123331 125015
55580 125015 126706 128435 129956 130989 132152 134685 138877 143756 148816 154932 162905 172103 181276 189757
55566 189757 197039 202106 204237 203862 201791 198212 193175 187349 181398 175146 168210 160990 154300 148497
55552 148497 143594 139629 136241 132532 128189 124234 121866 121046 120922 121077 121488 121796 121583 121072 120789 120866 121344
55535 121344 122665 124952 127222 128279 128177 127906 127880 127572 126529 124904 123011 121083 119484 118401 117282
55520A17282k081l260l642l040k020j165p65q65j279j755k188k424k055j009j14
55505H9620k47j038j239m66L65M45mm24o89q26p43n72o45q50o15J52P65O74J47
55486H3810k16j53K76R08J434J568J418J335J385J312R50L22m61j064r71k10L75
55469I2018J91k62l67n92j654k937l100k066j064p40n26p1J40j17k88r7l2k80
55451G8156k49L58R31R30O46M45J59l02m49j8M60M11K4j56M0M82J034J409J243
55432H5554O15L5k42m14n57n03l90n40o75j08J005J505P81l36o57k2R36J635J705
55413H9327R29m04j433j535r32k15K26J75m00j016r52k27K81L1m52m30KK47J06
55394H3328j96m62o06n26l05k43m19m81j83J68Q9l93p93o78q8N19O57L21m2k17
$$ plain form
55520 117282 115201 111941 108299 105259 103239 102074 101309 100444 99165 97410 95222 92798 90743 89734 89620
55505 89620 89373 88335 87096 86630 86995 87440 87436 87012 86323 85497 84754 84182 83537 82687 82072 82224 82989 83663 83810
55486 83810 83594 83441 83717 84625 86059 87627 89045 90380 91765 93077 94027 94349 93888 92824 91853 91643 92018
55469 92018 92209 91947 91580 90988 89334 86397 83297 81231 80167 79427 78901 78830 78970 78853 78565 78468 78436 78156
55451 78156 77907 78265 79196 80126 80772 81217 81376 81074 80625 80607 81067 81478 81502 81346 81386 81868 82902 84311 85554
55432 85554 86169 86204 85962 85548 84991 84488 84098 83558 82883 82775 83780 85285 86066 85730 85073 85051 85987 87622 89327
55413 89327 90256 89852 88419 86884 85952 85737 85963 86138 85738 84722 83770 83543 83824 83855 83403 82973 82975 83222 83328
55394 83328 83132 82670 82064 81538 81233 80990 80571 80090 79907 80075 80164 79771 78978 78300 78212 78731 79388 79709 79667 79450
55374G9450o41j710k876l071j913p4J583K642L055K951K563J919P44q02j720j245
55358H0855q5L75p9m13q6L37L97M57P75R19N90J69r6n92j450j893j194K41J359
55339H0586J666J411R48M27n3m03n74n25l47l73q20j338j333p58j00L51P11R91
55321H0467R50N19r7p07j159j232j005r95j371j341k41J167J523P46j3j38r0j60
55303G6823J4M49O12M50N31Q60P46J20j85J00J38n57j318j493j325j034j91J214
55285G5954K216K114J446R24L46o05j359j183l21M18O84N71J94j75j47J21M6k37
55267H1007K00J479K285J665M56jK81L70J4k70j83J86P29J133Q04k83j172j127
55249H7573o61o93j219j549j330o06M84J438J399K34r89j301r42n16J29J207J971
$$ plain form
55374 79450 78809 77099 74223 71152 69239 69165 70748 73390 76445 79396 81959 83878 84622 83820 82100 80855
55358 80855 80770 81145 81066 80653 80567 80904 81301 81758 82533 83452 84042 84211 84115 83523 82073 80180 78986 79227 80586
55339 80586 82252 83663 84611 85038 84985 84582 84008 83483 83136 82763 81943 80605 79272 78514 78414 78765 79476 80467
55321 80467 81417 81936 81839 81132 79973 78741 77736 76741 75370 74029 73788 74955 76478 77224 77211 77073 76983 76823
55303 76823 76837 77286 77898 78348 78879 79739 80485 80605 80420 80520 80658 80101 78783 77290 75965 74931 74740 75954
55285 75954 78170 80284 81730 82654 83000 82395 81036 79853 79532 79950 80634 81205 81399 81224 81077 81198 81244 81007
55267 81007 81207 82686 84971 86636 87092 87091 87372 87742 87756 87486 87303 87489 88218 89351 90155 89872 88700 87573
55249 87573 86912 86219 85000 83451 82121 81515 81999 83437 84836 85070 84081 82780 81838 81322 81451 82658 84629
55232H4629J598M91k96n39o96q18o03k70l02n87o74n68m50j32M15M72l95j258
55214H0017r23K15O48j12j045j161m78N33J439J693J008j6l98J6N44P06N90L30
55196H3606O0K03Q99J363P01o75j399r12K9O20Q40Q89P67N95O70R01Q12K98j73
55177I0094k69j75j95l72n70n20J6P94J078O69M41J144K072J922P31j77j40J06
55159I6649j88o83p14k90R4J50o9l55m20j78Rk31o80q49p89r20j207j224r95r89
55139H6121j143p95K32J163J260O63r4p90j388j653j332n08L63P31K41q66j778
55122H0427j912j577j455j557j281m31M68R84J276J665K177K644K895K728K130
55107H9181J488J210J181J004O94O26Q12Q38M96K8k93l47k2O27J122R79M07K6
$$ plain form
55232 84629 86227 86718 86422 85883 85187 84369 83766 83496 83194 82607 81933 81365 80915 80783 81198 81670 81275 80017
55214 80017 79094 79309 79957 79845 78800 77639 77161 77694 79133 80826 81834 81818 81420 81436 81980 82686 83276 83606
55196 83606 83666 83869 84768 86131 86832 86157 84758 83846 83875 84495 85335 86224 86991 87586 88256 89157 89969 90267 90094
55177 90094 89825 89650 89455 89083 88513 87993 88009 88803 89881 90550 90991 92135 94207 96129 96860 96683 96543 96649
55159 96649 96461 95778 95064 94774 94868 95018 94949 94594 94174 93996 94005 93774 93094 92245 91456 90536 89329 88105 87110 86121
55139 86121 84978 84183 84415 85578 86838 87501 87407 86617 85229 83576 82244 81736 82099 82830 83071 82205 80427
55122 80427 78515 76938 75483 73926 72645 72214 72682 73666 74942 76607 78784 81428 84323 87051 89181
55107 89181 90669 91879 93060 94064 94758 95384 96196 97034 97530 97558 97265 96918 96896 97523 98645 99624 100031 100057
55089A00057j4q0k74k47J71O74Q91O55q0j037j495j038k87j82o16o26N0N58L29
55070I7409j08n6M15Q87J222J239M79j003k136j862m92O14O40N2k86k46m13j061
55052I5294j551j022M48J732J903J190M23nk25l06k55k99n65o13K9R80J365J004
55034I9527N20K42j40p34j033p21k44j98n71r43j045q56m07K20Q64J380J582J205
55016I8648K43p33r59k55Q25J487J206K2j242j465m87M60K12q11j283q25j67K83
54998I5159Q55J515J498N06o62j126q74l58J61M80L77O5J51P62J243J054M60l5
54980A01231l76o97q42n54Q7P33J010P28J09j37M62J358J508P64K4l1K88M26L84
54961A06475N01R03J460J865J661O74m95j027q94o86n16NO90P01j81j166j643
$$ plain form
55089 100057 100043 99963 99689 99442 99613 100287 101178 101833 101753 100716 99221 98183 97896 97714 97098 96472 96522 97080 97409
55070 97409 97301 97245 97660 98547 99769 101008 101487 100484 98348 96486 95994 96608 97248 97300 97014 96768 96355 95294
55052 95294 93743 92721 93169 94901 96804 97994 98417 98412 98187 97881 97626 97327 96762 96149 96178 97158 98523 99527
55034 99527 100047 100289 100149 99415 98382 97661 97417 97219 96648 95705 94660 93804 93397 93617 94481 95861 97443 98648
55016 98648 98891 98158 97199 96944 97769 99256 100462 100484 99242 97777 97290 97750 97962 97151 95868 95043 94876 95159
54998 95159 96014 97529 99027 99533 98871 97745 96871 96513 96674 97154 97531 97596 97747 98509 99752 100806 101266 101231
54980 101231 100855 100158 99316 98762 98849 99582 100592 101320 101429 101292 101754 103112 104620 105384 105408 105377 105665 106091 106475
54961 106475 106976 107879 109339 111204 112865 113539 113044 112017 111123 110437 109921 109926 110616 111317 111136 109970 108327
54944A08327j802j807j297k79M92N79M82O09N52K6l79j42L47O25J014J761K203
54927A11311J800J292J698K749L453L731M271N080N520N609N989O512O103M328
54913A69446K099L68j020k624m311n435n734n484m977m278l414k505j723j223
54899A29185j095j297j654j912j834j345o59j18J06J06mj63k10N9N88J066J399
54882A22218J862K703L789M794N456N611N291M840M581M333L670K673J838J173
54868A74832N5j662l145l665l617l854m422m625m138l450l196l426l615l246k387
54853A26439j668j489j389p27J83K98o33j623j831j644j804k181k102j472q32
54838A07525n40n04n47n72n33n26o90q37n20K66R67J250J353J360Q45k60j139
$$ plain form
54944 108327 106525 104718 103421 103142 103634 104213 104695 105304 105856 105882 105503 105361 105708 106333 107347 109108 111311
54927 111311 113111 114403 116101 118850 122303 126034 130305 135385 140905 146514 152503 159015 165118 169446
54913 169446 171545 171913 170893 168269 163958 158523 152789 147305 142328 138050 134636 132131 130408 129185
54899 129185 128090 126793 125139 123227 121393 120048 119389 119271 119377 119483 119479 119316 119106 119165 119753 120819 122218
54882 122218 124080 126783 130572 135366 140822 146433 151724 156564 161145 165478 169148 171821 173659 174832
54868 174832 174887 173225 170080 166415 162798 158944 154522 149897 145759 142309 139113 135687 132072 128826 126439
54853 126439 124771 123282 121893 121166 121349 121647 121014 119391 117560 115916 114112 111931 109829 108357 107525
54838 107525 106985 106481 105934 105362 104829 104303 103613 102776 102256 102522 103489 104739 106092 107452 108297 108037 106898
54821A06898j081m60o4K8J89L81L24K36N37J072J266R05J72q19j928k676k619
54804A02361j886r03J11R70J309J120J067J593K142J936J069J67n44j076j099
54789A08337m41K64M16M47J040J753J635Q71N36Q25R11N69N91J273J811J669J392
54772A23899J611K120K565L133L973M681M974N237N850O531O777O472N643M158
54758A87624K092m9j901l530m896n516n162m373l904l954m254m491m335l521k303
54743A37527j444j377j727j883j672j265q04m71m33m78j42N19Q41O06M87J035
54727A29319J820K232K552L429M651N359N306N067N007M822M221L339K172L28
54713A79624k239m643n808n664n172n142n387n189m294l184k408k016j803j760
$$ plain form
54821 106898 105817 105357 105293 105321 105510 105891 106215 106451 106988 108060 109326 110231 110403 109584 107656 104980 102361
54804 102361 100475 99572 99683 100653 101962 103082 104149 105742 107884 109820 110889 111056 110512 109436 108337
54789 108337 107896 108160 108576 109023 110063 111816 113451 114322 114858 115683 116594 117163 117754 119027 120838 122507 123899
54772 123899 125510 127630 130195 133328 137301 141982 146956 152193 158043 164574 171351 177823 183466 187624
54758 187624 189716 189667 187766 184236 179340 173824 168662 164289 160385 156431 152177 147686 143351 139830 137527
54743 137527 136083 134706 132979 131096 129424 128159 127355 126884 126451 125973 125831 126350 127191 127797 128284 129319
54727 129319 131139 133371 135923 139352 144003 149362 154668 159735 164742 169564 173785 177124 179296 179624
54713 179624 177385 172742 166934 161270 156098 150956 145569 140380 136086 132902 130494 128478 126675 124915
54699A24915j939k064j728j042o21p67j074j046p97p32q30o91k00K37K12k52q04
54682A10777j095r92n61l0L55M47J93l63r53j150p29K6O09Q56R54R35M90m71j401
54663A07897j599j045m04j77k14j84r9j11r3J53M05K50k41m92j86L17N32M76M95
54644A05680P59J138J423J430J040L57k72n49m34o8L40M68L9q01j477j507r28
54627A06638q6P08J217J319J126Q89O04R3m98p08m53k45l98n49l36j3R8K53P82
54608A10441J319J276P76L38l1o53j223j006o7O15M80N3l2M9j40m94o39o06o39
54589A09817n59N6J114J907J848R77k43j308j710j011O38K165K310R85m88q58
54573A15640m09l19q83j207p17j2K56L86Q60J232Q07n3k76L56R27P52J99p2KQ2
$$ plain form
54699 124915 122976 120912 119184 118142 117521 116754 115680 114634 113837 113105 112275 111584 111384 111621 111833 111581 110777
54682 110777 109682 108690 108129 108099 108454 108901 109094 108731 107778 106628 105899 105925 106534 107390 108344 109279 109769 109298 107897
54663 107897 106298 105253 104849 104672 104458 104274 104175 104064 103971 104124 104529 104779 104538 104046 103860 104177 104709 105185 105680
54644 105680 106439 107577 109000 110430 111470 111827 111555 111006 110572 110504 110844 111312 111351 110550 109073 107566 106638
54627 106638 106552 107260 108477 109796 110922 111811 112415 112508 112010 111302 110849 110604 110206 109657 109321 109308 109406 109659 110441
54608 110441 111760 113036 113812 114150 114119 113466 112243 111237 111170 111785 112265 112318 112286 112335 112195 111701 111062 110456 109817
54589 109817 109258 109314 110428 112335 114183 115160 114917 113609 111899 110888 111526 113691 116001 116986 116498 115640
54573 115640 115231 114912 114029 112822 112105 112093 112349 112735 113595 114827 115634 115581 115305 115661 116588 117340 117539 117467 117469 117551
54553A17551P4J92N87J050J107N21k20k37O88J707J954J532J097Q42N69L22K21
54536A29557j5n98j038p96l00l84q74q87l99l03p92r13j95N03L49k33m01j41O4
54517A22204J55L16M40M19N36Q61P92j40j371j914j557q34j02O28J105R31K93
54500A22762l7L74J083J301P19k85r73q04J58J198J549J013P4o15p14l60N4K51
54482A26748K40J89K10M01Q54J415J601J114L63L8K74O79J073J604K134K129J428
54465A42494O08K73M10O34O85M72l2o66j122j292j319j281j146j076j297j556
54449A34789j272l75M46O04K47j63m79p48r25r75r93r61p22l17K3K77N42N25j87
54430A29336j220j481n19Q53J663J853J846J691J310R45P53L38o02j567j769j179
$$ plain form
54553 117551 117625 117817 118404 119454 120561 121082 120862 120625 121313 123020 124974 126506 127603 128445 129014 129336 129557
54536 129557 129542 128944 127906 127110 126810 126426 125552 124665 124266 123963 123171 122258 122063 122566 122915 122682 122281 122140 122204
54517 122204 122359 122675 123115 123534 124070 124931 125723 125583 124212 122298 120741 119907 119805 120433 121538 122469 122762
54500 122762 122725 123099 124182 125483 126202 125917 124944 124140 124298 125496 127045 128058 128132 127517 126803 126443 126497 126748
54482 126748 126988 127177 127387 127788 128642 130057 131658 132772 133135 133173 133447 134126 135199 136803 138937 141066 142494
54465 142494 143102 143375 143785 144419 145104 145576 145544 144878 143756 142464 141145 139864 138718 137642 136345 134789
54449 134789 133517 133142 133588 134192 134439 134276 133797 133049 132124 131149 130156 129195 128473 128156 128179 128456 128998 129523 129336
54430 129336 128116 126635 126116 126969 128632 130485 132331 134022 135332 136277 137030 137368 136766 135199 133430 132251
54414A32251m08Q7K67J69r0j56J87O37P77O88P69J120J468J552J253O16Qm2M82
54395A41635R28Q15M71L98N06M49K84J84q6p35j267r63O2R60J219J072R08Q46
54377A47686Q54Q82Q25O81O83R96J509K106K779L220K836J669P71R38J571J511
54361A71517O88M0kJ8m03j126j820k291k252j476l35L99L57l20j482k877l654
54344A54981l013j444m41o73j241j104m28Lk3j53k01k02j37k3q3l89o23m96j44
54325A44166J85M83O99N45k0m74m09j67k97o57o93l87k73n08o77n74n44p22o04
54306A39072J55J004J138O26K35K27M3o80j431j576j214q26m39K23R80J259R00
54289A39696L18k22p82j157q15K27J087J067N18J95J75P0j21l0L21M76K70N2P9
$$ plain form
54414 132251 131843 131930 132197 132366 132276 132120 132307 132944 133721 134409 135178 136298 137766 139318 140571 141187 141195 141153 141635
54395 141635 142563 143378 143849 144247 144753 145202 145486 145670 145584 144849 143582 142619 142681 143641 144860 145932 146840 147686
54377 147686 148540 149422 150247 150928 151611 152607 154116 156222 159001 162221 165057 166726 167497 168435 170006 171517
54361 171517 172205 172245 172243 172261 171858 170732 168912 166621 164369 162893 162558 162957 163314 162994 161512 158635 154981
54344 154981 151968 150524 150083 149410 148169 147065 146637 146640 146617 146464 146263 146061 145924 145901 145818 145429 144806 144310 144166
54325 144166 144351 144834 145533 146078 146058 145584 145175 145008 144711 144054 143361 142974 142701 142193 141516 140942 140398 139676 139072
54306 139072 139227 140231 141369 141995 142230 142457 142500 141820 140389 138813 137599 136773 136334 136557 137537 138796 139696
54289 139696 140014 139792 139010 137853 137038 137265 138352 139419 139937 140132 140307 140377 140256 140226 140547 141023 141293 141345 141424
54270A41424J68N4j40oP07J727K313J889Q31K46P00J467J483O86j07l92l77k87
54252A52386o1K21K82J60K24M78M04j80o24k58O28J087O08m25j216j206l73P71
54234A52906J412J014j74j261j517j004m30l65p44j125j177q09k7R41J477J024
54218A50141k30j430j981j996j708r89J59J116J179M18m78j023j225j218j071
54203A39664r03q07o42k46K16L61O4l69m28J92J210J785J319L20m8M65Q25K89
54185A43267m42l34L76P34P01J053J862K289K002J625J550J307N82r1k13k03p24
54168A55341j621k174k083j664j231q11m14k36m40q88j112p51n7K13k45p56n34
54151A40537J63L72j59o80n94j80J30M31Q58J031O05j9j06M06Q35O35M0k58R8
$$ plain form
54270 141424 141592 141646 141506 141500 142207 143934 146247 148136 148967 149213 149913 151380 152863 153549 153442 153050 152673 152386
54252 152386 152325 152546 152828 152988 153212 153690 154094 153914 153290 153032 153660 154747 155355 154930 153714 152508 152135 152906
54234 152906 154318 155332 155158 153897 152380 151376 150946 150581 149837 148712 147535 146726 146699 147640 149117 150141
54218 150141 149911 148481 146500 144504 142796 141807 141966 143082 144261 144679 144201 143178 141953 140735 139664
54203 139664 138761 137954 137312 137066 137282 137643 137707 137338 136910 137102 138312 140097 141416 141736 141688 142153 142978 143267
54185 143267 142825 142491 142867 143601 144302 145355 147217 149506 151508 153133 154683 155990 156572 156481 156268 156065 155341
54168 155341 153720 151546 149463 147799 146568 145757 145343 145107 144667 143779 142667 141916 141859 142072 141827 141071 140537
54151 140537 140700 141072 140913 140233 139639 139459 139589 140020 140878 141909 142514 142495 142389 142795 143630 144265 144305 144047 144145
54132A44145P38R65N46m4k86k25j54K8O24J472K036K174K183K075J565Q44P33
54115A59419J659L067M169M776N060N036M737M437M202L566K116J25j783l309
54101A97277m425m973m739l896k955k327k151k338k535k296j615j091j213j666
54087A59057j701j061j81M11N20K54r1j12L36Q16P15P3l20J53J201K040K298K120
54069A66528J578N76n70j044n06K55K81k40l09K77O32K49k17j56l1l86o31J57
54051A66443J608K420K160J610J406J392J490K105L316M497N106N178M837M096
54037B07664L420L610M654N530N553N199N058M769L799K621K169K439K541K055
54023B61081J544J591J987K040J391K96p17j308j527j600j696j991k717l791m584
$$ plain form
54132 144145 144883 145848 146394 146350 146064 145839 145685 145713 146337 147809 149845 152019 154202 156277 157842 158686 159419
54115 159419 161078 164145 168314 173090 178150 183186 187923 192360 196562 200128 202244 202369 200586 197277
54101 197277 192852 187879 183140 179244 176289 173962 171811 169473 166938 164642 163027 161936 160723 159057
54087 159057 157356 156295 156114 156525 157045 157299 157208 157096 157432 158248 158963 159036 158716 158869 160070 162110 164408 166528
54069 166528 168106 168682 168112 167068 166562 166817 167098 166858 166549 166826 167458 167707 167490 167334 167303 166917 166286 166443
54051 166443 168051 170471 172631 174241 175647 177039 178529 180634 183950 188447 193553 198731 203568 207664
54037 207664 211084 214694 219348 224878 230431 235630 240688 245457 249256 251877 254046 256485 259026 261081
54023 261081 262625 264216 266203 268243 269634 269930 269213 267905 266378 264778 263082 261091 258374 254583 249999
54008B49999m577m160m203m818n156m631l622k731k013j330r26j109j721k293
53994B06709k513k284j662r88o94p67p68m54L3O47J512K364K694K614K903L839
53978B13185M801N395O140P345Q054O986M036K62l226n776p097p347p022o322
53964B19414n069l565k758k945l098k294j089m96k74N27J740K145J326K86O8O95
53948B04613J604K295K394J802J077J045J842K789L202K979K430K080K480L609
53934B36241M584M545L754L245L536M213M647M486L682K736K649L805N123N209
53920B92455M257L701M137M730M856N040N776O569O818O735O609N989M427K485
53906C64584J134M87l1n70p43n35n63j249k263l032l423l690l980m176m259m542
$$ plain form
54008 249999 245422 241262 237059 232241 227085 222454 218832 216101 214088 212758 211832 210723 209002 206709
53994 206709 204196 201912 200250 199262 198568 197801 197033 196579 196612 197259 198771 201135 203829 206443 209346 213185
53978 213185 217986 223381 229521 236866 244920 251906 255942 256204 252978 247202 240105 232758 225736 219414
53964 219414 214345 210780 208022 205077 201979 199685 198596 198100 197826 198353 200093 202238 203564 203850 203918 204613
53948 204613 206217 208512 210906 212708 213785 214830 216672 219461 222663 225642 228072 230152 232632 236241
53934 236241 240825 245370 249124 252369 255905 260118 264765 269251 272933 275669 278318 282123 287246 292455
53920 292455 296712 300413 304550 309280 314136 319176 324952 331521 338339 345074 351683 357672 362099 364584
53906 364584 365718 366205 366174 365604 364861 364326 363763 362514 360251 357219 353796 350106 346126 341950 337691 333149
53890C33149n353o428p018o728o074n862o222o570o439n872n099m283l628l311
53876B54262l169k855k375k138k409k980l474l639l357k756k318k467k977l187
53862B14161k813k206j723j382j180j219j358j268j017j103j624j936j465m70
53848A93397L77P74P61L15n66j485j843j387l73P70J607J840J517J047Q01P83
53832A98335Q45R62J109R61K09q86j544j266m29O8j75n89k98P93J818J987J517
53815B03417J234J464J743J620J261J123J383J909K547L159L562L673L684L934
53801B35713M533N173N369M959M370M225M667N208N317M899M122L105K063J411
53787B95134J266J126M71m72j082j324j784k692l554l921m020m308m722m815m437
$$ plain form
53890 333149 327796 321368 314350 307622 301548 295686 289464 282894 276455 270583 265484 261201 257573 254262
53876 254262 251093 248238 245863 243725 241316 238336 234862 231223 227866 225110 222792 220325 217348 214161
53862 214161 211348 209142 207419 206037 204857 203638 202280 201012 199995 198892 197268 195332 193867 193397
53848 193397 193774 194548 195309 195624 195058 193573 191730 190343 189970 190740 192347 194187 195704 196751 197552 198335
53832 198335 199180 200142 201251 202212 202421 201535 199991 198725 198296 198364 198189 197600 197302 198095 199913 201900 203417
53815 203417 204651 206115 207858 209478 210739 211862 213245 215154 217701 220860 224422 228095 231779 235713
53801 235713 240246 245419 250788 255747 260117 264342 269009 274217 279534 284433 288555 291660 293723 295134
53787 295134 296400 297526 297997 297525 296443 295119 293335 290643 287089 283168 279148 274840 270118 265303 260866
53772B60866m047m226m972n502m994l559k203j659j633j497j298j491j994k252
53758B19539k130k043k134k078j781j598j660j570j075m81j24J01L90O74Q52R74
53742B05856R16L53n91j145p37K19P90O03P6k17o7M14R76J341J285Q17L04L16
53724B11509J113K155K491J834J001Q72J281J424J108Q47R36J161J415J858K351
53709B33356K543K563K896L451L566L173L022L409L597L013K232K083K512L024
53695B74440L601M367M833M366L222K316K053J993J586P47k84j184j711j908k031
53680B96406k094j771r74k11N4m8j51k59n38q70j032j051r61n87O1M99L22j97
53662B86598n04m52j85K49P07P94L96M0J14J71l53j087j143l22P50J515J857J815
$$ plain form
53772 260866 256819 252593 247621 242119 237125 233566 231363 229704 228071 226574 225276 223785 221791 219539
53758 219539 217409 215366 213232 211154 209373 207775 206115 204545 203470 202989 202865 202966 203356 204030 204882 205856
53742 205856 206772 207125 206534 205389 204652 204871 205661 206264 206340 206123 206056 206470 207446 208787 210072 210889 211193 211509
53724 211509 212622 214777 217268 219102 220103 220975 222256 223680 224788 225635 226571 227732 229147 231005 233356
53709 233356 235899 238462 241358 244809 248375 251548 254570 257979 261576 264589 266821 268904 271416 274440
53695 274440 278041 282408 287241 291607 294829 297145 299198 301191 302777 303524 303240 302056 300345 298437 296406
53680 296406 294312 292541 291567 291356 291410 291362 291211 290952 290414 289544 288512 287461 286500 285913 285974 286473 286795 286598
53662 286598 286094 285642 285457 285706 286413 287207 287603 287643 287757 287928 287575 286488 285345 285023 285773 287288 289145 290960
53644B90960J636J867K648L180K637J460Q39J067J387J418J669K405L034L001
53630C19208K577K245K047J837J632J359Q27L17M84J343K035K097K239L198M389
53615C47834M616L770K921K849L297L723M018M237M198L737L062K532K287K319
53601C95400K675L326L876L734K724J396N26L42L30j14j006j816k099j834j265
53586D06195o73m21q42j896l025l567l360k754k108j489q88n49q19j637k376k319
53570C77472j395l36l1o77j553j718r76j27m9o80j187j120r40j118j222n61O35
53553C64417J391J407J347J591J527O76k56k32O16J225J160J098J707K757L617
53538C84048M129M523M914N230N514N940O485O918P199P703Q764J0041J0698J0488
$$ plain form
53644 290960 292596 294463 297111 300291 302928 304388 305227 306294 307681 309099 310768 313173 316207 319208
53630 319208 321785 324030 326077 327914 329546 330905 331732 332049 332533 333876 335911 338008 340247 343445 347834
53615 347834 352450 356220 359141 361990 365287 369010 373028 377265 381463 385200 388262 390794 393081 395400
53601 395400 398075 401401 405277 409011 411735 413131 413657 413999 414329 414215 413209 411393 409294 407460 406195
53586 406195 405522 405101 404259 402363 399338 395771 392411 389657 387549 386060 385172 384623 383804 382167 379791 377472
53570 377472 376077 375741 375710 375033 373480 371762 370786 370659 370610 369930 368743 367623 366683 365565 364343 363782 364417
53553 364417 365808 367215 368562 370153 371680 372356 372100 371868 372484 373709 374869 375967 377674 380431 384048
53538 384048 388177 392700 397614 402844 408358 414298 420783 427701 434900 442603 451367 461408 472106 482594
53524D82594J0237J0854J2071J2834J2851J2964J3832J5051J5952J6557J7184
53513F32981J7808J8465J9696K1714K3586K4222K3897K3902K4702K5440K5288
53502H81701K4469K3638K3041K2549K1995K1197K0121J9127J8579J8236J7611
53491A112264J6949J7016J7759J8088J7459J6794J7150J8123J8423J7697J6896
53480A304618J6923J7584J7983J7467J6041J4126J2121J0127Q127O313M953L776
53468A450159J907j256n234q878j1361j2659j3228j3602j4136j4788j5234j5406
53456A326284j5785j6872j8489j9944k0783k1140k1333k1523k1708k1781k1477
53445A105449k0510j8899j7043j5357j3954j2660j1240r568p716n937m442l199
$$ plain form
53524 482594 492831 503685 515756 528590 541441 554405 568237 583288 599240 615797 632981
53513 632981 650789 669254 688950 710664 734250 758472 782369 806271 830973 856413 881701
53502 881701 906170 929808 952849 975398 997393 1018590 1038711 1057838 1076417 1094653 1112264
53491 1112264 1129213 1146229 1163988 1182076 1199535 1216329 1233479 1251602 1270025 1287722 1304618
53480 1304618 1321541 1339125 1357108 1374575 1390616 1404742 1416863 1426990 1435117 1441430 1446383 1450159
53468 1450159 1452066 1450810 1445576 1436698 1425337 1412678 1399450 1385848 1371712 1356924 1341690 1326284
53456 1326284 1310499 1293627 1275138 1255194 1234411 1213271 1191938 1170415 1148707 1126926 1105449
53445 1105449 1084939 1066040 1048997 1033640 1019686 1007026 995786 986218 978502 972565 968123 964924
53433I64924k039r87k34L05J140K654M490N788O184O294P052Q697J0645J2266
53419A027179J3507J4737J6281J8240K0497K2657K4191K4959K5513K6528K7961
53408A262250K9056K9373K9478L0450L2720L5600L8018L9572M0835M2595M4976
53397A654923M7449M9544N1240N2642N3712N4449N5047N5513N5503N4850N4055
53386B238927N3722N3618N2856N1032M8702M6473M4149M1072L7115L2887K9021
53375B729574K5525K1903J7803J3351Q862M350m95n836j1522j7507k4060l1152
53363B730796l7951m3389m7257n0193n2608n4135n4387n3797n3265n3195n3209
53352B177410n2773n1722n0181m8213m5881m3623m2271m2280m2992m3042m1732
$$ plain form
53433 964924 962885 961898 961664 961969 963109 965763 970253 976041 982225 988519 995571 1004268 1014913 1027179
53419 1027179 1040686 1055423 1071704 1089944 1110441 1133098 1157289 1182248 1207761 1234289 1262250
53408 1262250 1291306 1320679 1350157 1380607 1413327 1448927 1486945 1526517 1567352 1609947 1654923
53397 1654923 1702372 1751916 1803156 1855798 1909510 1963959 2019006 2074519 2130022 2184872 2238927
53386 2238927 2292649 2346267 2399123 2450155 2498857 2545330 2589479 2630551 2667666 2700553 2729574
53375 2729574 2755099 2777002 2794805 2808156 2817018 2821368 2820873 2815037 2803515 2786008 2761948 2730796
53363 2730796 2692845 2649456 2602199 2552006 2499398 2445263 2390876 2337079 2283814 2230619 2177410
53352 2177410 2124637 2072915 2022734 1974521 1928640 1885017 1842746 1800466 1757474 1714432 1672700
53341A672700l9677l7816l6246l4443l2320l0341k8582k6517k3877k1189j9077
53330A342615j7509j6042j4487j2984j1761j1109j1318j2262j3223j3486j3049
53319A195385j2448j1964j1358j0313q863p339o081n190m474l605k460j277l17
53306A109696N75J903L868O024P689Q719R659J1072J2964J4999J7058J9225K1286
53293A244737K2753K3569K4295K5329K6268K6481K6020K5445K4896K3906K2134
53282A515833J9854J7546J5440J3499J1533R213O315L060k7k672n055p447r896
53269A587196j2339j4776j7270j9850k2424k4679k6256k7184k7906k8644k9054
53258A336814k8884k8605k8844k9437k9719k9530k9252k8958k8354k7491k6752
$$ plain form
53341 1672700 1633023 1595207 1558961 1524518 1492198 1461857 1433275 1406758 1382881 1361692 1342615
53330 1342615 1325106 1309064 1294577 1281593 1269832 1258723 1247405 1235143 1221920 1208434 1195385
53319 1195385 1182937 1170973 1159615 1149302 1140439 1133100 1127019 1121829 1117355 1113750 1111290 1110013 1109696
53306 1109696 1110271 1112174 1116042 1122066 1129755 1138474 1148133 1159205 1172169 1187168 1204226 1223451 1244737
53293 1244737 1267490 1291059 1315354 1340683 1366951 1393432 1419452 1444897 1469793 1493699 1515833
53282 1515833 1535687 1553233 1568673 1582172 1593705 1602918 1609233 1612293 1612266 1609594 1604539 1597092 1587196
53269 1587196 1574857 1560081 1542811 1522961 1500537 1475858 1449602 1422418 1394512 1365868 1336814
53258 1336814 1307930 1279325 1250481 1221044 1191325 1161795 1132543 1103585 1075231 1047740 1020988
53247A020988k6077k5085k4050k3798k4316k4485k3668k2592k2049k1574k0351
53236G62943j8686j7546j6969j5982j4059j1819j0148r287q860q397p704p034
53224F16452o912p548q526r234r517r688j0025j0548j1092j1446j1567j1757j2276
53211D86316j2731j2322j0947r521q826q595q085p132o106n343n167n997p638
53198C77906q853q528p106o151o511p589q290q045o926n506m631m683m979m487
53184B85621l178k143k227l138m042m404m123l353k514k077k085k137j970j743
53170B46487j603j393r69n00k23j77k35k73j82L0J51k3m65j031j639k098j996
53153B33861j256n42m93p58m89L14Q09O96O08Q20O37l71j361j310n13qN4M54J360
$$ plain form
53247 1020988 994911 969826 945776 921978 897662 873177 849509 826917 804868 783294 762943
53236 762943 744257 726711 709742 693760 679701 667882 657734 648447 639587 631190 623486 616452
53224 616452 609540 601992 593466 584232 574715 565027 555002 544454 533362 521916 510349 498592 486316
53211 486316 473585 461263 450316 440795 431969 423374 415289 408157 402051 396708 391541 385544 377906
53198 377906 369053 360525 353419 347268 340757 333168 324878 316833 309907 304401 299770 295087 290108 285621
53184 285621 282443 280300 278073 274935 270893 266489 262366 259013 256499 254422 252337 250200 248230 246487
53170 246487 244884 243491 242522 242022 241799 241622 241387 241114 240932 240962 241113 241090 240625 239594 237955 235857 233861
53153 233861 232605 232063 231570 230812 230323 230637 231446 232142 232750 233570 234207 233836 232475 231165 230652 230644 230698 231152 232512
53134B32512J847J218J13k75M27J501K082J889J221N30R6n8RL82J192K214K792
53117B49692K416J363N17M94J055J453J165K41q75j641j706j171n22j46J6J17
53101B52468k4o27j375j720j726j986k561k717k056j225j001j169j041n89l88
53086B32263o14q88r42q42o15l36m00j017j497r04N06J414J207P56R98J518J248
53069B31855K4j229j673j267n07L0n9p32j362j229k85O98Q43L5r64j288q15j54
53051B21921K23N20J117J829K097J749J071K92m88j009j064r89j259j589j185
53036B23236p4O68L72l04m23l9K24K89M99P79P33M15K63L40L00J01J01L55M20
53017B28255N3l47l19j0J6m91j168j426j013j81O16J138J447J629J600J200M16
$$ plain form
53134 232512 234359 235577 235690 235415 235842 237343 239425 241314 242535 243065 243161 243103 243112 243494 244686 246900 249692
53117 249692 252108 253471 253988 254482 255537 256990 258155 258396 257521 255880 254174 253003 252481 252335 252351 252468
53101 252468 252444 251817 250442 248722 246996 245010 242449 239732 237676 236451 235450 234281 233240 232651 232263
53086 232263 231649 230761 229819 228977 228362 228026 227626 226609 225112 224208 224714 226128 227335 228091 229089 230607 231855
53069 231855 231879 230650 228977 227710 227203 227233 227174 226442 225080 223851 223566 224264 225107 225142 224178 222890 222075 221921
53051 221921 222144 222664 223781 225610 227707 229456 230527 230819 230331 229322 228258 227269 226010 224421 223236
53036 223236 223162 223830 224202 223898 223475 223436 223660 223949 224448 225227 225960 226375 226638 226978 227278 227379 227480 227835 228255
53017 228255 228308 227961 227642 227632 227648 227157 225989 224563 223550 223369 223985 225123 226570 228199 229799 230999 231415
53000B31415n04j055p52L28J341J447P44J29J54N34Q33J103J467J664J383P78
52984B41009K19j22j30M31J474K343K449J920J254O71J82o1JR5L9Q5L36L41j21
52965B52415l64K20R90Q52Ol08K74P75N19O0M%m73j159j591j935k485k851k433
52946B42516j373l63K35M98M11j23q25j184j063p88o41o01n45m28k22P3M19P96
52928B36792J146J152M61p19j512j266k96N09O57L45K1nL04O74P61N81M90N76
52910B40671M48o8n23n20l45m50o55n19k05k48o26p62m20N7L95O51P78N21o1n18
52890B37601n36j68M88J297J789J482N78k30o98j127j449j102l2R37J206J150
52874B41186J316J565J585J618K008K478K533K206J817J365Q05N18P20P42k45
$$ plain form
53000 231415 230911 229856 229104 229432 230773 232220 232964 233093 233247 233781 234614 235717 237184 238848 240231 241009
52984 241009 241228 241106 240976 241407 242881 245224 247673 249593 250847 251518 251700 251639 251640 251735 251774 251859 252195 252536 252415
52965 252415 252051 252271 253261 254113 254119 253811 254085 254860 255379 255439 255443 255443 254970 253811 252220 250285 247800 244949 242516
52946 242516 241143 240780 241015 241513 241924 241801 240976 239792 238729 237941 237300 236699 236154 235726 235504 235577 235996 236792
52928 236792 237938 239090 239551 238832 237320 236054 235758 236267 236924 237269 237290 237285 237589 238263 239024 239605 240095 240671
52910 240671 241119 241051 240528 240008 239663 239213 238558 238039 237834 237586 236960 236198 235778 235835 236230 236881 237659 238180 238119 237601
52890 237601 237065 236897 237385 238682 240471 241953 242531 242301 241603 240476 239027 237925 237893 238830 240036 241186
52874 241186 242502 244067 245652 247270 249278 251756 254289 256495 258312 259677 260482 261000 261720 262462 262217
52859B62217j929l111l212k775k491k436k422k404k315k055j761j717j890k024
52845B29675k091k161j950j146k03K9m12n21J96R59R31M29K82N65P31N95M94N95
52827B26997O63M60n9q32j599j911j579j024q08r88j194j129o66K93J567K511
52811B20702K590K048J584J445J266P11j87j281k374l011k741j739p89m81p37
52796B17006j136j356j156l81P60J656J818J274M12l97r11j056r67q14n43jO39
52779B14847R09O38J85q3j98k57o7N07J082J142P29L13J2n34j386j938j600o17
52761B13684J80K63j81n86m91K22J243J963J953J408R01P42P97R45J197J326R00
52744B26466N2k18Q25K508L387K884J734P95J97k02k50J49O47Q38P86P48P35O13
$$ plain form
52859 262217 260288 257177 253965 251190 248699 246263 243841 241437 239122 237067 235306 233589 231699 229675
52845 229675 227584 225423 223473 222327 222124 222153 221741 221220 221416 222375 223306 223735 224017 224582 225313 225908 226402 226997
52827 226997 227660 228120 228061 227229 225630 223719 222140 221116 220308 219320 218126 216997 216331 216624 218191 220702
52811 220702 223292 225340 226924 228369 229635 230346 230159 228878 226504 223493 220752 219013 218224 217743 217006
52796 217006 215870 214514 213358 212977 213737 215393 217211 218485 218897 218500 217589 216533 215566 214752 214209 214208 214847
52779 214847 215756 216394 216579 216496 216298 216041 215974 216481 217563 218705 219434 219747 219759 219225 217839 215901 214301 213684
52761 213684 213864 214127 213946 213360 212869 213091 214334 216297 218250 219658 220559 221301 222098 223043 224240 225566 226466
52744 226466 226518 226300 227125 229633 233020 235904 237638 238433 238630 238428 238178 238327 238974 239812 240598 241346 242081 242694
52726B42694L20k66j212k082k067j116l10n39j244j266n22L6n9l10k82j36J6L96
52708B32051Q93R42M66J72M27N67l9q37q78k36J47r7l53j54Q1k39r19j200o91
52689B30103K01P39N84N8k33NM99Q20Q23N93Q5q18j848k329j843p67J13M84P09
52670B27978J181J789K156K101J628P48l34j018q07M9Q24J281J848K726L426L505
52654B49081L157K704K066J213O33N81L53q00k319k830k018j013p87j058j111
52639B47852r15q92j124j299j106l93P27J712J943J504J188J524K182K565K427
52624B57895J665K02j516k448k037r17n0M02P55Q03N4j250k125k028j399r46q26
52607B46234o93k14N09R43N82l59j000q16l13k19l67pR26J637J587J140Q53O99
$$ plain form
52726 242694 243014 242748 241536 239454 237387 236271 235961 235422 234178 232912 232390 232426 232367 232057 231775 231639 231655 232051
52708 232051 232944 233886 234352 234524 234951 235518 235479 234642 233764 233528 233675 233578 233225 233071 233152 232913 231994 230794 230103
52689 230103 230304 231043 231627 231685 231452 231457 231956 232776 233599 234192 234277 233459 231611 229282 227439 226672 226785 227269 227978
52670 227978 229159 230948 233104 235205 236833 237581 237247 236229 235422 235471 236295 237576 239424 242150 245576 249081
52654 249081 252238 254942 257008 258221 258854 259435 259788 258988 256669 253839 251821 250808 250021 248963 247852
52639 247852 246937 246045 244921 243622 242516 242123 242850 244562 246505 248009 249197 250721 252903 255468 257895
52624 257895 259560 259762 258246 255798 253761 252844 252794 253196 253951 254754 254808 253558 251433 249405 248006 247060 246234
52607 246234 245541 245327 245836 246779 247361 247002 246002 245186 244873 244654 244287 244280 245206 246843 248430 249570 250423 251122
52589B51122L40k24o02m57K27J106J647J593J278J294J752K142K011J391N39m06
52573B64753j261j679j463q78m20l55o16j010j312j378j284j244j269j067m90
52558B49027J06J76l98j199j697j600q85J63R76J068N35m0k67k75j89K64J182
52541B46947J825J243l27j430j119j85m6q30j298o02O86J438J334J007J159J784
52525B51586K117J331m73k023k033o07R12J491J283R10O02L71L96P72J279J843
52509B59757K740L916M599M165K997J901J040Q2r46j669k044k306k411k190j919
52494B67712k029k328k258j910j918k311k283j435l78J67K63K96K66P1oL19Q14
52477B53052J088J190J393J640J701J625J589J474J080O26N35P90J045J307J953
$$ plain form
52589 251122 251462 251238 250636 250179 250406 251512 253159 254752 256030 257324 259076 261218 263229 264620 265159 264753
52573 264753 263492 261813 260350 259472 259052 258697 258081 257071 255759 254381 253097 251853 250584 249517 249027
52558 249027 249133 249309 248911 247712 246015 244415 243530 243693 244669 245737 246272 246232 245965 245690 245501 245765 246947
52541 246947 248772 250015 249688 248258 247139 246954 246908 246078 244780 244178 244864 246302 247636 248643 249802 251586
52525 251586 253703 255034 254561 252538 250505 249898 250810 252301 253584 254494 255096 255467 255863 256635 257914 259757
52509 259757 262497 266413 271012 275177 278174 280075 281115 281197 280251 278582 276538 274232 271821 269631 267712
52494 267712 265683 263355 261097 259187 257269 254958 252675 251240 250862 251029 251292 251588 251854 251925 251919 252238 253052
52477 253052 254140 255330 256723 258363 260064 261689 263278 264752 265832 266458 266993 267783 268828 270135 272088
52462B72088K955L627L476K822K206J602O60n23j493k231l135m083m222l144j708
52447B68897j062j186j163o29j67k04m91q72j646k681l014k106q48m93r65j179
52431B50191o78j09n4l45n67n49j51O96J592J887J480R20N93M32M86J047K026
52414B58897K877L451M199N167N586N102M731N722P872R719J0182R270P293M314
52400C44382O21k922n476o871p400p227o369n170m322m214m369l908k576j057
52386B83122j51P8N7K0QK19P65J221J088O52O91J313J882K194K839L998M877M882
52368C09755M542M479M256L191J766J054J105R97L79j25j39j30m49p28o09l37
52352C29007j55K23J014J732J773J318J099J451K026K395K508K592K830L166L378
$$ plain form
52462 272088 275043 278670 282146 284968 287174 288776 289436 288913 287420 285189 282054 277971 273749 270605 268897
52447 268897 267835 266649 265486 264857 264690 264486 263995 263123 261477 258796 255782 253676 252828 252335 251370 250191
52431 250191 249513 249404 249350 249005 248438 247889 247738 248434 250026 251913 253393 254313 254906 255338 255824 256871 258897
52414 258897 261774 265225 269424 274591 280177 285279 290010 295732 303604 313323 323505 332775 340068 344382
52400 344382 345003 342081 336605 329734 322334 315107 308738 303568 299246 295032 290663 286755 284179 283122
52386 283122 282971 283049 283106 283126 283134 283353 284118 285339 286427 287079 287770 289083 290965 293159 295998 299996 304873 309755
52368 309755 314297 318776 323032 326223 327989 329043 330148 331145 331524 331399 331260 331130 330681 329953 329344 329007
52352 329007 328852 329075 330089 331821 333594 334912 336011 337462 339488 341883 344391 346983 349813 352979 356357
52337C56357L414L637M461N731O783P275P596Q237R108R863J0553J1549J2912
52324D57476J4315J5584J6869J8237J9355J9733J9120J7721J6190J5359J5672
52313F45631J6728J7602J7710J7263J6859J6799J6928J6984J6883J6595J5949
52302H31931J4707J2953J1320J0563J0774J1194J0943R748P760N011J552j977
52290I36479m594n975o793p710q540q752q387p942p587p072o318n462m370k708
52276H44269o19J222K488L626N099O657P799Q516R125R603R660R416R454J0069
52262I36384J0921J1551J1927J2313J2825J3290J3495J3409J3171J2874J2346
52251A074506J1320R838Q341P072N516K864q62m467o680p489q085r446j1283j2567
$$ plain form
52337 356357 359771 363408 367869 373600 380383 387658 395254 403491 412599 422462 433015 444564 457476
52324 457476 471791 487375 504244 522481 541836 561569 580689 598410 614600 629959 645631
52313 645631 662359 679961 697671 714934 731793 748592 765520 782504 799387 815982 831931
52302 831931 846638 859591 870911 881474 892248 903442 914385 924133 931893 936904 938456 936479
52290 936479 931885 925910 919117 911407 902867 894115 885728 877786 870199 863127 856809 851347 846977 844269
52276 844269 843650 844872 847360 850986 856085 862742 870541 879057 888182 897785 907445 916861 926315 936384
52262 936384 947305 958856 970783 983096 995921 1009211 1022706 1036115 1049286 1062160 1074506
52251 1074506 1085826 1095664 1104005 1111077 1116593 1119457 1118595 1114128 1107448 1099959 1091874 1082428 1071145 1058578
52237A058578j2955j3201j4021j4957j4892j3550j1916j1138j1410j2147j2678
52226I15713j2557j1587j0047q571p486o462n141l745k656j782q31J5M40P27J506
52211H47536K742L705L949L757L499L177K800K586K574K539K462K649L147L561
52197H90683L696L864M247M535M572M787N524O310O420N803M910L870K446O73
52183I52340j125k871m728o527p751q261q527q858q879q159p023o224n901n376
52169H62130m131k560j416p61LJ133K119K462K425K635L185L648L759L652L460
52154H81743L129K672K190J608P62j80p52p56m18M8P38J691K586K980K716K019
52138I02776J360J143J326J450J312J437K439M163O029Q030J0611J3541J5835
$$ plain form
52237 1058578 1045623 1032422 1018401 1003444 988552 975002 963086 951948 940538 928391 915713
52226 915713 903156 891569 881522 872951 865465 859003 853862 850117 847461 845679 844848 844863 845303 846030 847536
52211 847536 850278 853983 857932 861689 865188 868365 871165 873751 876325 878864 881326 883975 887122 890683
52197 890683 894379 898243 902490 907025 911597 916384 921908 928218 934638 940441 945351 949221 951667 952340
52183 952340 951215 948344 943616 937089 929338 921077 912550 903692 894813 886654 879631 873407 867506 862130
52169 862130 857999 855439 854023 853262 853265 854398 856517 858979 861404 864039 867224 870872 874631 878283 881743
52154 881743 884872 887544 889734 891342 892104 891924 891172 890416 889998 890046 890784 892475 895061 898041 900757 902776
52138 902776 904136 905279 906605 908055 909367 910804 913243 917406 923435 931465 942076 955617 971452
52125I71452J7113J8212K0023K2355K4422K5875K6843K7413K7631K7587K7139
52114A236065K5943K4178K2688K1892K1009J9074J6276J3602J1481R544P601O041
52102A435394N171M727M214L364K131M87j667m507q008j1638j4588j6573j8015
52089A380492j9237j9885j9514j8374j7173j6254j5501j4731j3774j2401j0570
$$ plain form
52125 971452 988565 1006777 1026800 1049155 1073577 1099452 1126295 1153708 1181339 1208926 1236065
52114 1236065 1262008 1286186 1308874 1330766 1351775 1370849 1387125 1400727 1412208 1421752 1429353 1435394
52102 1435394 1440565 1445292 1449506 1452870 1455001 1455488 1453821 1449314 1441306 1429668 1415080 1398507 1380492
52089 1380492 1361255 1341370 1321856 1303482 1286309 1270055 1254554 1239823 1226049 1213648 1203078
$$ [...]
##END NTUPLES=NMR SPECTRUM
##END=
