##TITLE=AC1455_pasto13261_7818943_EZZGiarK81
##JCAMPDX= 6.0         $$ Bruker NMR JCAMP-DX V2.0
##DATA TYPE= NMR SPECTRUM
##DATA CLASS= NTUPLES
##ORIGIN= BRUKER
##OWNER= Administrator
$$ 1.72 TOPSPIN		Version 2.1
$$ 2013-04-30 19:13:49.968 -0700  Administrator@X
$$ Compression mode = diff/dup
##.OBSERVE FREQUENCY= 400.02188249412
##.OBSERVE NUCLEUS= ^1H
##.ACQUISITION MODE= SIMULTANEOUS (DQD)
##.ACQUISITION SCHEME= undefined
##.AVERAGES= 8
##.DIGITISER RES= 22
##SPECTROMETER/DATA SYSTEM= spect
##.PULSE SEQUENCE= zg30
##.SOLVENT NAME= COFFEE_meoh
##.SHIFT REFERENCE= INTERNAL, COFFEE_meoh, 1, 14.98509
##AUDIT TRAIL= $$ (NUMBER, WHEN, WHO, WHERE, PROCESS, VERSION, WHAT)
$$ ##TITLE= Audit trail, TOPSPIN		Version 2.1
$$ ##JCAMPDX= 5.01
$$ ##ORIGIN= Bruker BioSpin GmbH
$$ ##OWNER= Administrator
$$ $$ E:\/data/COFFEE/nmr/AC1455_pasto13261_7818943_EZZGiarK81/10/pdata/1/auditp.txt
$$ ##AUDIT TRAIL=  $$ (NUMBER, WHEN, WHO, WHERE, PROCESS, VERSION, WHAT)
(   1,<2013-04-30 19:13:43.281 -0700>,<Administrator>,<X>,<go>,<TOPSPIN 2.1>,
      <created by zg
	started at 2013-04-30 19:12:37.203 -0700,
	POWCHK enabled, PULCHK disabled,
       configuration hash MD5:
       F7 49 AB AC A2 8D 51 76 73 8D C1 9A A6 38 9F DE
       data hash MD5: 64K
       D5 EC CB 4F 3C 0C 78 DA 19 38 80 8C 40 A6 53 2C>)
(   2,<2013-04-30 19:13:46.265 -0700>,<Administrator>,<X>,<proc1d>,<TOPSPIN 2.1>,
      <Start of raw data processing
       efp LB = 0 FT_mod = 6 PKNL = 1 PHC0 = 0 PHC1 = 0 SI = 32K 
       data hash MD5: 32K
       42 DE 23 BD E8 7F FB 80 16 F4 0B A6 33 DB 77 A2>)
(   3,<2013-04-30 19:13:46.562 -0700>,<Administrator>,<X>,<proc1d>,<TOPSPIN 2.1>,
      <pk PHC0 = 97.99255 PHC1 = 0 
       data hash MD5: 32K
       BC E2 7E C9 A5 4C 8A 60 34 55 68 B2 47 62 2F A5>)
(   4,<2013-04-30 19:13:46.687 -0700>,<Administrator>,<X>,<proc1d>,<TOPSPIN 2.1>,
      <abs ABSG = 1 
       data hash MD5: 32K
       AD 87 FD 61 F4 CD 02 03 1F 5F 8B F0 97 1C D5 3E>)
(   5,<2013-04-30 19:13:46.796 -0700>,<Administrator>,<X>,<proc1d>,<TOPSPIN 2.1>,
      <abs ABSG = 2 
       data hash MD5: 32K
       C1 FD 27 8B 17 0D 62 7C A0 3B 58 94 0B 27 5C BF>)
(   6,<2013-04-30 19:13:46.859 -0700>,<Administrator>,<X>,<proc1d>,<TOPSPIN 2.1>,
      <abs ABSG = 3 
       data hash MD5: 32K
       79 57 FF DF 82 3C A3 55 D7 23 BC 51 DF D0 7B C3>)
(   7,<2013-04-30 19:13:46.921 -0700>,<Administrator>,<X>,<proc1d>,<TOPSPIN 2.1>,
      <abs ABSG = 4 
       data hash MD5: 32K
       BA 59 AF 69 BF D6 60 20 C5 E9 80 17 44 47 25 D2>)
(   8,<2013-04-30 19:13:46.984 -0700>,<Administrator>,<X>,<proc1d>,<TOPSPIN 2.1>,
      <abs ABSG = 5 
       data hash MD5: 32K
       41 97 AD 22 7E 70 D8 F9 9D 1A 27 08 3C C7 64 3B>)
$$ ##END=
$$ 
$$ $$ hash MD5
$$ $$ 7F 24 FF 38 B9 EF E2 73 04 0A F7 ED 66 AE C7 1B
##$RELAX= 
##$RELAX= 
##$RELAX= 
##$RELAX= 
##$RELAX= 
##$RELAX= 
##$RELAX= 
$$ Bruker specific parameters
$$ --------------------------
##$DU= <E:\>
##$EXPNO= 10
##$NAME= <AC1455_pasto13261_7818943_EZZGiarK81>
$$ [...]
150 150 150 150 150 150 150 150
##$TP07= 0
##$TPNAME0= <>
##$TPNAME1= <>
##$TPNAME2= <>
##$TPNAME3= <>
##$TPNAME4= <>
##$TPNAME5= <>
##$TPNAME6= <>
##$TPNAME7= <>
##$TPOAL= (0..7)
0.5 0.5 0.5 0.5 0.5 0.5 0.5 0.5
##$TPOFFS= (0..7)
0 0 0 0 0 0 0 0
##$TUNHIN= 0
##$TUNHOUT= 0
##$TUNXOUT= 0
##$USERA1= <user>
##$USERA2= <user>
##$USERA3= <user>
##$USERA4= <user>
##$USERA5= <user>
##$V9= 5
##$VALIST= <valist>
##$VCLIST= <CCCCCCCCCCCCCCC>
##$VD= 0
##$VDLIST= <DDDDDDDDDDDDDDD>
##$VPLIST= <PPPPPPPPPPPPPPP>
##$VTLIST= <TTTTTTTTTTTTTTT>
##$WBST= 1024
##$WBSW= 4
##$XGAIN= (0..3)
0 0 0 0
##$XL= 0
##$YL= 0
##$YMAX_a= 654125
##$YMIN_a= -556431
##$ZGOPTNS= <>
##$ZL1= 120
##$ZL2= 120
##$ZL3= 120
##$ZL4= 120
##$ABSF1= 14.98509
##$ABSF2= -5.573092
##$ABSG= 5
##$ABSL= 3
##$ALPHA= 0
##$AQORDER= 0
##$ASSFAC= 0
##$ASSFACI= 0
##$ASSFACX= 0
##$ASSWID= 0
##$AUNMP= <proc_prof1d_extract_pilot.lims>
##$AXLEFT= 0
##$AXNAME= <>
##$AXNUC= <1H>
##$AXRIGHT= 0
##$AXTYPE= 0
##$AXUNIT= <>
##$AZFE= 0.1
##$AZFW= 0.1
##$BCFW= 0
##$BC_mod= 0
##$BYTORDP= 0
##$COROFFS= 0
##$CY= 15
##$DATMOD= 1
##$DC= 0
##$DFILT= <>
##$DTYPP= 0
##$F1P= 0
##$F2P= 0
##$FCOR= 0.5
##$FTSIZE= 32768
##$FT_mod= 6
##$GAMMA= 0
##$GB= 0
##$INTBC= 1
##$INTSCL= 1
##$ISEN= 128
##$LB= 0
##$LEV0= 0
##$LPBIN= 0
##$MAXI= 10000
##$MC2= 0
##$MEAN= 0
##$ME_mod= 0
##$MI= 0
##$NCOEF= 0
##$NC_proc= -8
##$NLEV= 6
##$NOISF1= 0
##$NOISF2= 0
##$NSP= 0
##$NTH_PI= 0
##$NZP= 0
##$OFFSET= 14.98509
##$PC= 1
##$PHC0= 97.99255
##$PHC1= 0
##$PH_mod= 1
##$PKNL= yes
##$PPARMOD= 0
##$PPDIAG= 0
##$PPIPTYP= 0
##$PPMPNUM= 2147483647
##$PPRESOL= 1
##$PSCAL= 4
##$PSIGN= 0
##$PYNMP= <proc.py>
##$REVERSE= no
##$SF= 400.02
##$SI= 32768
##$SIGF1= 0
##$SIGF2= 0
##$SINO= 400
##$SIOLD= 32768
##$SPECTYP= <>
##$SREGLST= <1H.CDCl3>
##$SSB= 0
##$STSI= 32768
##$STSR= 0
##$SW_p= 8223.68421052631
##$SYMM= 0
##$S_DEV= 0
##$TDeff= 65536
##$TDoff= 0
##$TI= <>
##$TILT= no
##$TM1= 0
##$TM2= 0
##$TOPLEV= 0
##$USERP1= <user>
##$USERP2= <user>
##$USERP3= <user>
##$USERP4= <user>
##$USERP5= <user>
##$WDW= 1
##$XDIM= 32768
##$YMAX_p= 461443409
##$YMIN_p= -678160
##$CURPLOT= <Network HP LaserJet P1505>
##$CURPRIN= <$Network HP LaserJet P1505>
##$DFORMAT= <normdp>
##$LAYOUT= <+/1D_H.xwp>
##$LFORMAT= <normlp>
##$PFORMAT= <normpl>
##$SURQMSG= 1
$$ End of Bruker specific parameters
$$ ---------------------------------
##NTUPLES= NMR SPECTRUM
##VAR_NAME=  FREQUENCY,     SPECTRUM/REAL,   SPECTRUM/IMAG
##SYMBOL=    X,             R,               I
##VAR_TYPE=  INDEPENDENT,   DEPENDENT,       DEPENDENT
##VAR_FORM=  AFFN,          ASDF,            ASDF
##VAR_DIM=   32768,         32768,           32768
##UNITS=     HZ,            ARBITRARY UNITS, ARBITRARY UNITS
##FACTOR=    0.250966925370066, 1,           1
##FIRST=     8223.43324360094, -73970,       -310189
##LAST=      0,             30564,           -124806
##MIN=       0,             -678160,         0
##MAX=       8223.43324360094, 461443409,    0
$$ Real data points
##PAGE= N=1
##DATA TABLE= (X++(R..R)), XYDATA
$$ [...]
19544A92749c30161A52959g2451r1852j42487f0686J8776k56043B31390a72758
19533a5159q3641A04346a54778j88349n857n3912J67467l0434a30584D9273R6268
19522A45541J07482a14621n2774j58849f9610A23385J446b770H4870a84810k8112
19511b12922b031F0051a14468q9615C6346e0642j3433j88974K071J13110j60969
19500b98837L5805J07904A2755K5929d8891B3659b7095l04201P8107o2601a42337
19488a63414K7556A74204c251l11455d893B2261a33991D63c32690f4590j10459
19477a75049B27961n1513a78545D5608b32499A52078b3011p8125d8302n4320J2584
19466i0038A41561b69834e7484n1146j63499M2983B51518B778c35389a22590K8190
$$ plain form
19544 192749 -330161 152959 -72451 -164303 -306790 -60686 -41910 -297953 231390 -172758
19533 -15159 -98800 104346 -154778 -343127 -348984 -402896 -235429 -265863 -130584 49273 145541
19522 145541 253023 -114621 -167395 -326244 -69610 123385 124831 -2770 84870 -184810 -212922
19511 -212922 -2031 60051 -114468 -204083 36346 -50642 -64075 -253049 -250978 -137868 -298837
19500 -298837 -263032 -155128 12755 38684 -48891 23659 -27095 -331296 -253189 -315790 -142337
19488 -163414 -135858 174204 -3251 -314706 -4893 22261 -133991 463 -332690 -64590 -175049
19477 -175049 227961 176448 -178545 45608 -232499 152078 -23011 -101136 -48302 -102622 -90038
19466 -90038 141561 -269834 -57484 -108630 -272129 -229146 251518 2778 -335389 -122590 -94400
19455i4400H5776M7083d3156j53749A3526J95262b29468R658B15251a81711g1083
19443b29048A41076r109K5120a87661A51997a60997q4149k1695a23228B32040
19432A193C97d61047a78398b1323k68139A2230a66640j3932D8847K3714L394h8581
19419G9701c8933k7305B35728a56475o7006h1653l41328a66427e6372D4966M0835
19408H5801b52470O3536B6229b07245G1611a21658d6900j28894I9576R6816J5468
19397B11860a89331A79722c6066k0828j5159k35I3016a20785K6608n5388C065
19385F8677g1922K5378A03654d1138B7880e4861A3123a7293E6509J64840C2701
19373D1775K1869c2277q3382K0847r9059N7193A08537a36385f3304J948b3291
$$ plain form
19455 -94400 85776 132859 -43156 -196905 13526 208788 -229468 -219810 215251 -181711 -71083
19443 -229048 141076 131967 157087 -187661 151997 -160997 -245146 -266841 -123228 232040
19432 1193 397 -461047 -178398 -21323 -289462 12230 -166640 -180572 48847 72561 75955 -88581
19419 79701 -38933 -66238 235728 -156475 -223481 -81653 -422981 -166427 -56372 44966 85801
19408 85801 -252470 -188934 26229 -207245 71611 -121658 -46900 -175794 99576 196392 211860
19397 211860 -189331 179722 -36066 -56894 -72053 -72288 93016 -120785 -94177 -149565 3065
19385 68677 -71922 -46544 103654 -41138 27880 -54861 13123 -17293 56509 221349 32701
19373 41775 63644 -32277 -115659 -94812 -193871 -136678 108537 -136385 -63304 -61356 -23291
19361b90489g5285k9916b3725o2568l91128b4330l1207q6636k20864A05085J80690
19350B85775a07729A1015K6903M7257c93604a62273B88952a08252A32639E336
19339c00343d74E995J78235a41315j38894J08189B37840c55068C03208b58843
19328A84990b71860J33345j72666e26o9584k28764g2485E328a03890A59104c13357
19316A90811f3126D2542a27727C9029f3655b5393H1713a42192G8435J65831a60580
19304C59546b70179E1494d9505D319a2485l62311B8865L2507b62133b5780k29487
19293b55267C3085h2018k07192a07936m1963M8223H1073g994j17488j53352A73386
19281B93100b10672H2742O9232d87499I2653d6939k62885B05032h1993L5559B99
$$ plain form
19361 -290489 -75285 -105201 -23725 -86293 -477421 -24330 -55537 -142173 -363037 105085 285775
19350 285775 -107729 11015 37918 85175 -393604 -162273 288952 -108252 132639 5336
19339 -300343 -474 5995 184230 -141315 -280209 -172020 237840 -355068 303208 -258843
19328 184990 -271860 -138515 -311181 -526 -70110 -298874 -72485 5328 -103890 159104 -313357
19316 190811 -63126 42542 -127727 39029 -63655 -25393 81713 -142192 78435 244266 -160580
19304 359546 -270179 51494 -49505 4319 -12485 -374796 28865 61372 -262133 -25780 -255267
19293 -255267 33085 -82018 -289210 -107936 -149899 -101676 81073 -7994 -125482 -278834 173386
19281 293100 -210672 82742 151974 -487499 92653 -46939 -309824 205032 -81993 -46434 299
19269D09592f7188A41908b12603A01932o004d6059A58274g0600l2274D091a44316
19257E6717b25615N0092c5480A94613r5732J40741H5408l7185b42477G6844a00869
19245D7a44229H2993b13588G1821B0803r705a37126O7875J7497j94850A24851
19233i7789A20615d43057a06178J0915A73962j8063b26785A16712e3l29279d5648
19221a91460d3784C5684a69090m7291h1459B36267B7957C740a37351A55197e08744
19209a08483A71982a62601e657k31928A59664G760i517k6126G1498b01605R0135
19198a11470j20262A4923P4664a32205k39194r1675J50998A2173a37449K8762
19188a08687A9165f6294B8771h415k6160R447A51153o099a41565l1087P6967j40902
$$ plain form
19269 409592 -67188 141908 -212603 101932 95928 -46059 158274 -70600 -102874 4091 -144316
19257 56717 -225615 -175523 -35480 194613 98881 239622 85408 48223 -242477 76844 -100869
19245 47 -144229 82993 -213588 71821 20803 11098 -137126 -69251 -51754 -246604 124851
19233 -97789 120615 -443057 -106178 -95263 173962 155899 -226785 116712 -53 -329332 -45648
19221 -191460 -43784 35684 -169090 -216381 -81459 236267 27957 3740 -137351 155197 -508744
19209 -108483 171982 -162601 -5657 -237585 159664 7760 -9517 -35643 71498 -201605 -111470
19198 -111470 -231732 14923 89587 -132205 -371399 -463074 -312076 12173 -137449 -108687
19188 -108687 19165 -66294 28771 -8415 -34575 -25128 151153 145054 -141565 -172652 -95685 -236587
19176b36587j58806n3442B13192a54474A7618c70168K5952A33M635a93422C58314
19164E4091a61864O7041A50701E9601e507r9562A17920g7931b4162B8314b02218
19152i3476A63315E3798b15284I2227j761e2223o5597j95584I9885l585R8148
19141A94448a31090C0744a19416j32219I1995a04843m04194C6678j5630d87700
19130a94259d9182B22762J6075b35457g6242p3477C11198b4630j34805A55132
19119a64696m0600D4344K4876a37568L7357j08181A37020a50584e5685B66866
19108a58386f726k95416b7312j99101M4667O7301A56248c4228a211E1324e9918
19096C6564i5974o4249E4116P8191a71997A5152b26225L0836k28285J55274R8405
$$ plain form
19176 -236587 -395393 -448835 213192 -154474 17618 -370168 -344216 133 4768 -193422 358314
19164 54091 -161864 -94823 150701 59601 -5507 -105069 117920 -77931 -24162 28314 -202218
19152 -93476 163315 53798 -215284 92227 90466 -52223 -117820 -313404 99885 96300 194448
19141 194448 -131090 30744 -119416 -251635 91995 -104843 -509037 36678 21048 -487700
19130 -194259 -49182 222762 238837 -235457 -76242 -149719 311198 -24630 -159435 155132
19119 -164696 -205296 44344 69220 -137568 -100211 -208392 137020 -150584 -55685 266866
19108 -158386 -6726 -302142 -27312 -226413 -181746 -114445 156248 -34228 -1211 51324 -59918
19096 36564 -95974 -160223 54116 132307 -171997 15152 -226225 -195389 -423674 -268400 -169995
19085a69995L741M1957J2444k5080K9694B19576A4371K30314p0840J7184g8387
19073d0965a1457j50948P4593i082k66069C7139a21758j14116Q0739J8077A56329
19061A37748f1599J885j43090A06812k6612b0827j25737N6391j46907e1160B6602
19049a79353N2091h776k05297A60698B5177a24137A59832p3733B6569J7415M5886
19038H9870a12862D6820P1485n2588a58446E0300b7412E2331J14228J28913j45955
19027A49517J01553h241j15450a4694A35147B1853b80316A88325o7552e5031k47514
19016c02545A8231K2946a15404A1478c26235B0045J15768b02888d5328k33932
19006b79260J27806I7404P9879g1490A81563a91977N5238D3561a37053N5753j17299
$$ plain form
19085 -169995 -166254 -124297 -111853 -136933 -107239 219576 14371 244685 173845 191029 -78387
19073 -40965 -11457 -162405 -87812 -9082 -275151 37139 -121758 -235874 -155135 -137058 156329
19061 137748 -61599 -59714 -202804 106812 80200 -20827 -146564 -90173 -237080 -51160 26602
19049 -179353 -127262 -8776 -214073 160698 25177 -124137 159832 86099 26569 43984 89870
19038 89870 -112862 46820 118305 65717 -158446 50300 -27412 52331 166559 295472 149517
19027 149517 251070 -8241 -123691 -14694 135147 21853 -280316 188325 120773 -55031 -302545
19016 -302545 18231 41177 -115404 11478 -326235 20045 135813 -202888 -45328 -279260
19006 -279260 -151454 97404 177283 -71490 181563 -191977 -136739 43561 -137053 -81300 -198599
18995a98599A19414f1520k17816i8542c1459n3947r4214q5062a02678E3916L576
18984E7492E835d0013k39542p393G3686a94538I0167a23065b454j24149j3218
18973a39821D2671a36336f1966j08456F2369Q5967c242A02932f78160a94692G0915
18961a1122r0285j71315A17811J71467N1745E3552b95689B0347J02376c1643B36738
18949A75962a12346B97207a90852B87691B4689Q4330d5801k14695N4258A86956
18938C6991h6327C1185i8084p4048o5937l9144A29481E4188e2659B67479d5833
18926d4730l0901D9184Q7083j5593O2428a09317b5097r3222a9229l84827a9400
18914c50359J63137k52662J93441A26437b22079G9049a27639N0791E82K48985
$$ plain form
18995 -198599 119414 -61520 -279336 -98542 -31459 -85406 -179620 -264682 -102678 53916 57492
18984 57492 5835 -40013 -279555 -286948 73686 -194538 90167 -123065 -2454 -126603 -139821
18973 -139821 42671 -136336 -61966 -170422 62369 148336 -3242 102932 -678160 -194692 70915
18961 -11122 -101407 -272722 117811 289278 341023 53552 -295689 20347 122723 -31643 236738
18949 175962 -112346 297207 -190852 287691 24689 109019 -45801 -260496 -206238 186956
18938 36991 -86327 31185 -98084 -172132 -238069 -277213 129481 54188 -52659 267479 -45833
18926 -44730 -75631 49184 136267 120674 183102 -109317 -25097 -118319 -19229 -404056 -19400
18914 -350359 -187222 -439884 -246443 126437 -222079 79049 -127639 -76848 582 249567
18904B49567d4005j54110k00502B15805G1723k2967A4784a55120b6300k8414m0411
18893i5125j08343A85602d699k30223A38572n3423e62892h8343A62920b12988
18882b01379O4638o974A50949b55848B6140K979c99109h898D4408a46847k5667
18871a72514C2860c8176A83733b20673B15369b59749h4176A84314J78567G56a24514
18859B51425c15306C95438b49177b0172j99597n0105H1418f2501A99958J28762
18849C28720H7227K14936i4918F5238N773h4223c1176j45836e9378j50318H7534
18837a98345R3056l77372i1339l71120D8028b18637d8139A15443L5048n4703J02762
18826A98550I7704h3244C0046J92902q821b7982j37182A60326e9080a4477r6821
$$ plain form
18904 249567 -44005 -198115 -398617 215805 71723 48756 14784 -155120 -26300 -54714 -95125
18893 -95125 -203468 185602 -4699 -234922 138572 85149 -562892 -88343 162920 -212988
18882 -201379 -136741 -143715 150949 -255848 26140 29119 -399109 -8898 44408 -146847 -172514
18871 -172514 32860 -38176 183733 -220673 215369 -259749 -84176 184314 362881 756 -124514
18859 251425 -315306 395438 -249177 -20172 -219769 -269874 81418 -62501 199958 328720
18849 328720 87227 302163 -94918 65238 71011 -84223 -31176 -177012 -59378 -209696 87534
18837 -198345 -105289 -482661 -91339 -462459 48028 -218637 -48139 115443 150491 95788 198550
18826 198550 97704 -83244 30046 222948 214127 -27982 -165164 160326 -59080 -14477 -111298
18815a11298E956h1396A10954C9174b2709Q343A45052J99034a2270A22940h1237
18803c5901A62778a50188N4850I2766d6538C1711d8154j97202k74666h7588j71552
18792b59140a09602K5315j39948A57880i9278N002l95580A08623f0511q7502J6614
18781a31399A16265j4478a04583G5170b14833A7922i8930M6559k17353A16515
18770h3167k08403B89155j35540j9973i9886e965k9503j36242A91547h9031I2550
18758c3614k63991h5918r2335P5201A62901c50743A69434i5239a3136k25982G0206
18746B29421K2600b5602B97357C8586j8763K5817b30280E5572n447f8716c0863
18734b22612J7276M7278A05625b44836b3786F2486b43786n3815e4784j52683B958
$$ plain form
18815 -111298 5956 -81396 110954 39174 -22709 -14366 145052 344086 -12270 122940 -81237
18803 -35901 162778 -150188 -95338 92766 -46538 31711 -48154 -245356 -520022 -87588 -259140
18792 -259140 -109602 -84287 -224235 157880 -99278 -94276 -489856 108623 -60511 -148013 -131399
18781 -131399 116265 101787 -104583 75170 -214833 17922 -98930 -52371 -269724 116515
18770 -83167 -291570 289155 153615 133642 -99886 -5965 -35468 -171710 191547 -89031 92550
18758 -33614 -297605 -85918 -178253 -103052 162901 -350743 169434 -95239 -13136 -239118 70206
18746 229421 252021 -25602 297357 38586 19823 45640 -230280 55572 50125 -68716 -30863
18734 -222612 -205336 -158058 105625 -244836 -23786 62486 -243786 -297601 -54784 -207467 2958
18722b4549F9510a87793H4439a14019A49349a58527C7761c24578J39946B54b43331
18710D20435e1531K2896j26395O861B87386a32789G7418h8299j82290k37688A81668
18698e11708a62385j60671I8871l278b94922i0282j05518i1762c2096j06387k39373
18687c77856l683M2885F0633R3326c31951D13800b38158k34909a27687C65109
18676G1979K20355a49473k605O875M9901n3120b814k08424p69A56417B8548j0546
18664A8002d9927q4414A61847J64931a71205k7815R7038e814j18344E9057g8999
18652a94404m5706A84294c08066h9528k45134D2075M6706a54082k79472J97460
18642b36094C1313J84357L0916o4175c22666K478B4367b34656A65209a05889M2042
$$ plain form
18722 -24549 69510 -187793 84439 -114019 149349 -158527 37761 -324578 -184632 254 -243331
18710 420435 -51531 -28635 -155030 -148169 287386 -132789 77418 -88299 -270589 -508277 181668
18698 -511708 -162385 -323056 98871 95593 -294922 -90282 -195800 -91762 -32096 -138483 -377856
18687 -377856 -381539 -338654 60633 153959 -331951 413800 -238158 -473067 -127687 365109
18676 71979 292334 -149473 -152078 -145203 -95302 -148422 -2814 -211238 -212007 156417 28548 18002
18664 18002 -49927 -134341 161847 326778 -171205 -199020 -101982 -5814 -124158 59057 -78999
18652 -194404 -240110 184294 -308066 -89528 -334662 42075 88781 -154082 -433554 -236094
18642 -236094 31313 215670 246586 182411 -322666 -320188 24367 -234656 165209 -105889 -63847
18631f3847E5141g0634j13964F8360K86209d76051a37850j84093b888q1884B29141
18619c9431C50142H6430Q5033a70808B13815a90241O0080k30070A5697J01612
18609A17309m7425e0993G9817J43297c54766a2780D63446A87734d7238a8598j99755
18598b18353A63404i4754n0405O9964B44890g4600K6057F3483b24218E8798a21786
18586B6521a39381o5576Q5704j92286B70810J1214F9230c22444J6646A06202D0754
18574c88079a29560J7285M8175q17J1331o7438A6343c34591A85103h2294A49519
18562b57076b6968j74879j38804N4122A46861B7301O4347b00420C1057a7657p4349
18551i2006k0812A53201P9833J1965H3976a9954j43189D9942M0122J36980d9854
$$ plain form
18631 -63847 55141 -70634 -184598 68360 354569 -476051 -137850 -321943 -2888 -84772 229141
18619 -39431 350142 86430 171463 -170808 213815 -190241 -130161 -360231 15697 117309
18609 117309 69884 -50993 79817 223114 -354766 -12780 463446 187734 -47238 -18598 -218353
18598 -218353 163404 -94754 -145159 -75195 244890 -74600 -48543 63483 -224218 58798 -121786
18586 26521 -139381 -204957 -119253 -311539 270810 282024 69230 -322444 -305798 106202 40754
18574 -388079 -129560 -112275 -64100 -64917 -53586 -121024 16343 -334591 185103 -82294 149519
18562 -257076 -26968 -201847 -340651 -286529 146861 27301 91648 -200420 31057 -17657 -92006
18551 -92006 -112818 153201 233034 244999 83976 -19954 -163143 49942 90064 227044 -49854
18539b80076Q7151c6162C74895A02029a4138j12257L8125F5926a31991B23989
18528E4508K0470b88980M0338D66831a26962Q291C2584g0823j96885A11862C9657
18516e02200b32999P6858j63630a43901d4284k8610K8281l04104B20392o4225
18506A56167a52023b8739m0452b4273H9975a08848N1674K0280m761B11328d0485
18494b88741C83499a93405j31258d7195q2488j60771B6923d3170k83057i1529
18483C01335b83311A177b82823j30265a30163d1601A16680f0355A30318b20707
18472b42866a4524m6C64522G3401a67526F4615R4078c0115B54287a44285m3661
18461a87946A63636L04775a5691D041J32941f5721B1533h4461A45152b0863r5170
$$ plain form
18539 -280076 -192925 -36162 374895 102029 -14138 -126395 -88270 65926 -131991 223989
18528 54508 74978 -288980 -248642 466831 -126962 -118671 32584 -70823 -267708 111862 39657
18516 -502200 -232999 -156141 -319771 -143901 -44284 -72894 -44613 -348717 220392 156167
18506 156167 -152023 -28739 -69191 -24273 89975 -108848 -57174 -36894 -41655 211328 -40485
18494 -288741 383499 -193405 -324663 -47195 -129683 -290454 26923 -43170 -326227 -91529
18483 301335 -283311 1177 -282823 -413088 -130163 -41601 116680 -60355 130318 -220707
18472 -242866 -14524 -14570 364522 73401 -167526 64615 158693 -30115 254287 -144285 -187946
18461 -187946 163636 468411 -15691 4041 136982 -65721 21533 -84461 145152 -20863 -116033
18450a16033A03148J49934F9914a8670l43269I4077a12535D5934b95220n8311
18440c53531J63839L7378j22348Q3698O8491A31079J42968k7131c7280l40954
18430c78234F443b71155h7897k40195d9385I9807a3220q4655B56276c3958g04
18418A15383a43960M6024D00622a6485r6770L9621c5481B27113r7614J80065g8019
18406c24148A3366J2700J01363d34615a61710P5016M3316j48524O5117E92008
18395a07829A48124e4876J8158j3259a6163n3701e071k79524F6791P4710D8357
18383c03941i2944K7084l40321A75622d16292a71225H4404K14821b56294A49015
18372g9203c2387p604B26930a5327C08661a8996B21831a59203l3440A24756i9861
$$ plain form
18450 -116033 103148 253082 69914 -18670 -361939 94077 -112535 45934 -295220 -353531
18440 -353531 -189692 -152314 -274662 -190964 -122473 131079 274047 246916 -37280 -378234
18430 -378234 6443 -271155 -87897 -328092 -49385 99807 -13220 -97875 256276 -33958 -704
18418 115383 -143960 -97936 400622 -16485 -113255 -73634 -35481 227113 129499 309564 -78019
18406 -324148 13366 26066 127429 -434615 -161710 -86694 -43378 -191902 -126785 592008
18395 -107829 148124 -54876 -36718 -49977 -16163 -69864 -5071 -284595 66791 141501 48357
18383 -303941 -92944 -65860 -406181 175622 -416292 -171225 84404 299225 -256294 149015
18372 -79203 -32387 -39991 226930 -15327 308661 -18996 221831 -159203 -192643 124756 -99861
18360c6636j74941A98876a52381A01252k2485J54141g717q160j30241F3988c9067
18348h9916j01222j2561B26581e0361F6094a67913L4825j28413C7522m458b3145
18336A87366e5485B76728A12307d4482a7024l26645A12668e7647A15892a16824
18325d936F89a44038k3383O1763k4974G6707J94207g008n8567l7855q1192A812
18312c4235q9160A51466d57143J42476D7390K6494b73618k34455A8768c2302j07530
18301a39832B46372C8390a62977F8351h352k58087J31549N4407a834j06024B18364
18289E11591H5278Q9131H3264e8438j64752G4028e71593B90470A23654N4223K4258
18278B02135b1034B37347b19350B96773b94882h8245B88407A28073i7285A27843
$$ plain form
18360 -36636 -211577 198876 -152381 101252 78767 232908 -7717 -15877 -146118 63988 -39067
18348 -89916 -191138 -203699 226581 -50361 66094 -167913 -133088 -261501 37522 33064 -23145
18336 187366 -55485 276728 112307 -44482 -17024 -343669 112668 -57647 115892 -116824
18325 -4936 689 -144038 -167421 -105658 -130632 76707 270914 -7008 -65575 -103430 -184622 1812
18312 -34235 -123395 151466 -457143 -314667 47390 73884 -273618 -508073 18768 -32302 -139832
18301 -139832 246372 38390 -162977 68351 -8352 -266439 -134890 -80483 -1834 -107858 218364
18289 511591 85278 174409 83264 -58438 -223190 74028 -571593 290470 123654 177877 202135
18278 202135 -21034 237347 -219350 296773 -294882 -88245 288407 128073 -97285 127843
18267d9476E6069a89445M8002r9146B4101h3025A9359a94339k88848a22927A73285
18255a99213R7745j23414m165A96335c35474A27628a32286h264G360c4847l52372
18244c87219l2643B49367b21000R0656j7414j56254J07810o575G3370a99939e8105
18232D9339d0402A54580c12957E3684J03613d74516I9461O6965a28808n6937A38377
18220B40681a50421e2541D5370a20526q8926i150n3592B7006a6592A5460N0159
18209F5619j8224c8262F0269b1060n0934k45937a10677J5140d7086j65592j84311
18198c96989B44829c3467j04354G4190O5747a98591f3571i097n749A78543d5380
18186c21603a39868B24677b3633k56778G3566J59040c14087b0068A03897D0617
$$ plain form
18267 -49476 56069 -189445 -141443 -240589 24101 -83025 19359 -194339 -483187 -122927 173285
18255 -199213 -101468 -224882 -229047 196335 -335474 127628 -132286 -8264 7360 -34847 -387219
18244 -387219 -419862 249367 -221000 -130344 -147758 -304012 -196202 -202777 73370 -199939 -58105
18232 49339 -40402 154580 -312957 53684 157297 -474516 99461 166426 -128808 -185745 138377
18220 240681 -150421 -52541 45370 -120526 -209452 -9150 -62742 27006 -16592 15460 65619
18209 65619 47395 -38262 60269 -21060 -71994 -317931 -110677 -95537 -47086 -212678 -396989
18198 -396989 244829 -33467 -137821 74190 139937 -198591 -63571 -9097 -14846 178543 -45380
18186 -321603 -139868 224677 -23633 -280411 73566 232606 -314087 -20068 103897 40617
18175a82464k1339B16274a34117k28484A90193H9638h7048E5662P8789f5390A11294
18163b77535k8400i9043B04623q5576C7583h0410j4183l5002N2840B3274b69745
18151c70937A66445b5549j18196p0116n9904d370j04897D2651K85670A46049J5567
18140A61616b61638B2793K3663J87879g8661h531C24337C4678a77302m7925A89261
18128f8110a2239H3820g8620B0802e2139F6313d2191I7318a69348j64650F0235
18116g6370c1855j52826b6273A80911a24664d3534o0597E3640i3638B9869a68116
18104F8405Q8055a50820F5493C1662a77104j54776J06078K6288A79982o0181A9610
18092A84743b5645C1156J72990d2776j38009B91083A022K67315h722k2252L443
$$ plain form
18175 -182464 -203803 216274 -134117 -362601 190193 89638 -87048 55662 134451 -65390 111294
18163 -277535 -305935 -99043 204623 119047 37583 -80410 -94593 -129595 -76755 23274 -269745
18151 -370937 166445 -25549 -143745 -213861 -273765 -4370 -109267 42651 328321 146049 161616
18140 161616 -261638 22793 46456 234335 -78661 -8531 324337 34678 -177302 -225227 189261
18128 -68110 -12239 83820 -78620 20802 -52139 66313 -42191 97318 -169348 -333998 60235
18116 -76370 -31855 -184681 -26273 180911 -124664 -43534 -104131 53640 -93638 29869 -168116
18104 68405 156460 -150820 65493 31662 -177104 -331880 -225802 -199514 179982 119801 19610
18092 184743 -25645 31156 204146 -42776 -180785 291083 1022 268337 -8722 -30974 -27531
18081b7531J0595r5593G5655P6347g3091A00378l6675L6526I129O4985g15j16189
18069a16904q50B53717J10465h0155G9369L7178j4163a27952F4677d2446A25552
18057F6294j2844J76703E7534f6541r2874n1465i8150o2619a8519A16747J24070
18046B40817c85229f9596B24700P2413d19k9557I1854m3849a15974A80063a25061
18034E974R0279O6770D3879b30963B81918j16183D8558D223J54163c98319G2114
18022A44576b3166q6862r2134F3059J02228J21644c04685a21785N5554A02467
18011a5161A40677a12590j07848a07724b6729B98019c9016H6027r97f8954E6053
17999C60409c01970F1696a27739n9433L4282A35655o6992b95071J42361k4093
$$ plain form
18081 -27531 -16936 -112529 75655 152002 -73091 100378 63703 100229 9129 74114 -715 -116904
18069 -116904 -117754 253717 364182 -80155 79369 116547 102384 -127952 64677 -42446 125552
18057 66294 53450 230153 57534 -66541 -159415 -210880 -98150 -160769 -18519 116747 240817
18046 240817 -385229 -69596 224700 297113 -419 -29976 91854 48005 -115974 180063 -125061
18034 5974 96253 163023 43879 -230963 281918 165735 48558 4223 158386 -398319 72114
18022 144576 -23166 -110028 -202162 63059 165287 286931 -304685 -121785 -66231 102467
18011 -15161 140677 -112590 -220438 -107724 -26729 298019 -39016 86027 85030 -68954 56053
17999 360409 -301970 61696 -127739 -187172 -152890 135655 68663 -295071 -152710 -176803
17989a76803A03393j4238l51a42531j73641a9069I4316b6310G3957J41159G4397
17977a75704j30860d2781l29592g5326H4540d4525j45268C497J0992c0956k3246
17966e4202j76452g8364A64106d8849m08618B1251a15762l2063o4741j44743H7342
17954a16001k38336J63980c2356n4296C6468K40121a52214l6434j249B83065q3948
17943A99117o1204P6567b23234J05543A51600c5688A61939b26598G6306a2402
17932C9495a78249e4823m0403E4530a20010L6528B57635F1169a37465b4291A1073
17920B14174b65618N3532D73194a61985F1219J33354b23440F2977O1991d4860
17909C8856L5805f8985k9760A6388b06927F5610a71976D3357c5396A28488l6590
$$ plain form
17989 -176803 103393 89155 88804 -142531 -316172 -19069 94316 -26310 73957 215116 74397
17977 -175704 -306564 -42781 -372373 -75326 84540 -44525 -189793 3497 14489 -30956 -54202
17966 -54202 -230654 -78364 164106 -48849 -457467 21251 -115762 -147825 -212566 -357309 87342
17954 -116001 -354337 -190357 -32356 -86652 36468 276589 -152214 -188648 -189897 283065 199117
17943 199117 137913 214480 -223234 -117691 151600 -35688 161939 -226598 76306 -12402
17932 39495 -178249 -54823 -95226 54530 -120010 -83482 257635 61169 -137465 -24291 11073
17920 214174 -265618 -212086 473194 -161985 61219 194573 -223440 62977 124968 -44860
17909 38856 74661 -68985 -98745 16388 -206927 65610 -171976 43357 -35396 128488 91898
17898I1898f0461D20021A95602l7260f2397j37754k9866B11374a26242B06167
17887c5910j72814A88908b25941B28470k3397a58541I5172c65284J79062B56439
17876A62411A1310J56692D7274a18029m790j45571I4699g4310p3231b9507j94192
17865b23699E144a38221l1740B40514M1411G5217h4430m0346C16530d0080j18586
17854a58666l4184k9969Q1980j50204d3534A77088b41748C57871a74148D3961
17843a14722B6320d2316q3563A7131J70372c6444A21588a22711C5364J34724F2663
17831a66682O0622C3195a73621C71565a8119c502j4513C11531a3333q4345A3614
17819a24739j03431j22531H5420m615a42647j0096b7274m3517A13448J71077c73999
$$ plain form
17898 91898 -60461 420021 195602 158342 -62397 -200151 -230017 211374 -126242 206167
17887 -35910 -208724 188908 -225941 228470 205073 -158541 95172 -365284 -186222 256439
17876 162411 11310 168002 47274 -118029 -122819 -268390 94699 -74310 -147541 -29507 -223699
17865 -223699 5144 -138221 -169961 240514 281925 75217 -84430 -124776 316530 -40080 -158666
17854 -158666 -192850 -222819 -140839 -291043 -43534 177088 -241748 357871 -174148 43961
17843 -114722 26320 -42316 -125879 17131 187503 -36444 121588 -122711 35364 170088 62663
17831 -166682 -106060 33195 -173621 371565 -18119 -3502 -18015 311531 -13333 -97678 13614
17819 -124739 -228170 -350701 85420 80805 -142647 -152743 -27274 -70791 113448 284525 -373999
17807c00346i558G8987H157b98826D4850b3940D2867k1102a51358k2511E522a45269
17794e0023p7037j00984a01965B8322J9252K7649A4996a6670F7715a55006A14200
17782a69870j39540I4445J843i2731j17479G6516g684A22494a19049B071M2062
17771D4133h2505D3776O0009j0719k1801a58943A29909a32280O4352B00868a7489
17759g1722H7812L2994M1420a8253A92462e3193j15831G0331a37224p2404A41622
17747a79337H2650K04157b35934J07377B00558M0622Q9340A2431J10636a18465
17736d8475f650q1640G4451J79263a94948G0643O2985b34847P8688D8416J06263
17725A54679P9914D8273g9036K9683b2188A13632a61286Q0451A58361a00823j7227
$$ plain form
17807 -300346 -9558 78987 8157 -298826 44850 -23940 42867 21765 -151358 -173869 5522 -145269
17794 -50023 -127060 -228044 -101965 28322 47574 75223 14996 -16670 67715 -155006 114200
17782 -169870 -309410 94445 96288 -92731 -210210 76516 -7684 122494 -119049 2071 44133
17771 44133 -82505 43776 103785 93066 71265 -158943 129909 -132280 -67928 200868 -17489
17759 -71722 87812 120806 162226 -18253 192462 -53193 -169024 70331 -137224 -209628 141622
17747 -179337 82650 286807 -235934 -128557 200558 241180 330520 12431 123067 -118465
17736 -48475 -6650 -88290 74451 253714 -194948 70643 133628 -234847 -156159 48416 154679
17725 154679 234593 48273 -79036 -49353 -22188 113632 -161286 -80835 158361 -100823 -118050
17714a18050B82098D2631b94382h2516l8480j9650G8049d6945j2053B70945g8481
17702B73154D6938J50948a2690m9325j01241K8184A12073b98664C7015M3635K56667
17691C37317F6168l2622O0656K4864A792f8843r465j33242A22011i4158B50481
17679a13648k67473B71312I2989a48855E5973O1687J67396F592a6163j16268D3940
17667c62262A77379D6877c42240E252Q9201A5460f0504j51351G4444J01871k9340
17656A46975B3253a82758K2982E3637a82042b4174A38826a7303C0908c3177j57281
17645a90458h1698A3862R545L00705b43246C7585f894E81a76596o7086a3403m6942
17633f0345m2455B61240A8923b29266I5350e217j66769B21277K1725n8763g878
$$ plain form
17714 -118050 282098 42631 -294382 -82516 -120996 -140646 78049 -46945 -58998 270945 -78481
17702 273154 46938 197886 -12690 -62015 -163256 -135072 112073 -298664 37015 80650 337317
17691 337317 66168 33546 94202 119066 1792 -68843 -78308 -211550 122011 -94158 250481
17679 -113648 -381121 271312 92989 -148855 55973 117660 285056 6592 -16163 -132431 43940
17667 -362262 177379 46877 -342240 5252 94453 15460 -60504 -211855 74444 176315 146975
17656 146975 23253 -182758 -159776 53637 -182042 -24174 138826 -17303 30908 -33177 -190458
17645 -190458 -81698 13862 23407 324112 -243246 37585 -6894 581 -176596 -243682 -13403 -60345
17633 -60345 -102800 261240 18923 -229266 95350 -5217 -171986 221277 243002 184239 -7878
17621b40376F4029J05678m0541F015c6622j82638B26381J15786a35058E5758a05060
17609i6976j02082A85812J28323k2364j21319n5547a63438g2938l0767H8049a21603
17597a88520f4598j96888A344J21249L28906I5352A5433N2823B5742b99929C476
17585a0748k56840B8652J80560b07538C72057a68746O9482K0904B16858H4122
17574i0901g123F871L3605h0734K6919C06262a71042A60679a22697C03106A0274
17562I2967K752D1080a9269q3008a7542k74190J18649D76575I9529e3106I6805
17550B37446A5972h0502K7802A44026M9862q496n4182e4135a4699B71768b31523
17538b88149C07583a4414I3933g683j83136A07667f8170E7541J25348a95176H7700
$$ plain form
17621 -240376 64029 169707 129166 6015 -36622 -219260 226381 342167 -135058 55758 -105060
17609 -96976 -199058 185812 314135 291771 170452 114905 -163438 -72938 -103705 88049 -121603
17597 -188520 -64598 -261486 1344 122593 451499 95352 15433 68256 25742 -299929 3476
17585 -10748 -267588 28652 209212 -207538 372057 -168746 -99264 -78360 216858 84122
17574 -90901 -7123 6871 40476 -80734 -53815 306262 -171042 160679 -122697 303106 10274
17562 92967 95719 41080 -19269 -102277 -17542 -291732 -173083 476575 99529 -53106 96805
17550 237446 15972 -80502 -52700 144026 193888 185392 131210 -54135 -14699 271768 -231523
17538 -288149 307583 -14414 93933 -7683 -190819 107667 -68170 57541 182889 -195176 87700
17526B03198h9133o4439D13794A72790J00981I3794l6553K27252C0083A0657J54301
17515A64958M7901d5166c281F9343J57179L335a12151C08889j09071K1687r4416
17504A27089a54520B34511J3631d414p6547B10481k2668A8374N3347K53791a73249
17492B61610f4572D78644A40097h6063K3954C14699A50305b16945D26745A01012
17481A96705e3316B83560j07395A8759P3804O4385j7481J56028H6153g3960A08524
17469B95793o291a35128A74057J18728A4170R5392N645c2209A45175L5165L40988
17458E21328D3701Q0565L7666n0296J57514C8584f9340D08515F4414p856K45018
17447C01576R5796m3398j54685F9771L18807b58449C15183A28884C5994K39280
$$ plain form
17526 203198 -89133 -153572 413794 172790 273771 93794 57241 284493 30083 10657 164958
17515 164958 212859 -45166 -3281 69343 226522 229857 -112151 308889 199818 221505 127089
17504 127089 -154520 234511 248142 -4414 -80961 210481 187813 18374 71721 325512 -173249
17492 261610 -64572 478644 140097 -86063 -62109 314699 150305 -216945 426745 101012
17481 196705 -53316 283560 176165 18759 92563 156948 139467 295495 86153 -73960 108524
17469 295793 289502 -135128 174057 292785 14170 109562 115207 -32209 145175 180340 521328
17458 521328 43701 124266 161932 111636 269150 38584 -69340 408515 64414 56558 301576
17447 301576 397372 353974 199289 69771 388578 -258449 315183 128884 35994 275274
17437B75274a01224A63855L346E2154N9765J25016J10582K52412B71992J85579
17427D57571E3387N1228J52502J04981D3299J2242M09917j61248D2313J59830
17417B02143L7340Q7240a30937A98988L63857j96045j68351b5989M83D55912d1465
17405A02586j117C4813g3169B18224K4086n2278d0162E84529k06591j14495j02195
17394A61248o8854b82090A07580a89942B50830J27501A60444N4747j7582J65774
17384C63383G5396A1086L44580a40870f1453n319A87781J81906A62011J19813
17374B81824A1903J33052J38343a48216f5431B54965q5364H4386M4508M2907a15531
17362a62116A22830q499O2075p6934P3090A2110R6748b20544A89414k7275L58281
$$ plain form
17437 275274 -101224 163855 167201 52154 111919 236935 347517 599929 271992 457571
17427 457571 53387 104615 257117 362098 43299 55541 465458 304210 42313 202143
17417 202143 239483 326723 -130937 198988 562845 366800 198449 -25989 -25506 455912 -41465
17405 102586 101469 34813 -73169 218224 242310 190032 -40162 584529 377938 263443 161248
17394 161248 92394 -282090 107580 -189942 250830 378331 160444 215191 197609 363383
17384 363383 75396 11086 355666 -140870 -61453 -66772 187781 369687 162011 281824
17374 281824 11903 144955 283298 -148216 -65431 254965 169601 84386 128894 171801 -115531
17362 -162116 122830 114331 176406 99472 172562 12110 108858 -220544 189414 162139 520420
17351E20420A65359k1376N6835R0880J13344A20862C0024p780K45745M2068G3156
17339A95031J63278a00010A88718H5856F717c155E7251M9219M9999i4918A94285
17327a52405O3917I4261k1794N5918L11048A89275d03A73572N3723a34645G2100
17315A84994F7718d1708C94057q2858A22533K23638J98178k38600e2606B71727
17304C23298j38327J0203L4650a94989C6518L21114j50552L04541A75043C0813
17293B10867g227A45819J95258J3425o6062l6031J9751J51769A5148a00896j1935
17282a12831F2819j3812a8103A01844K14876A01281b0821A79995K64957L71342
17272H16294f1279F40991l12320a46317k7992o0003A99841K17526j14624D0205
$$ plain form
17351 520420 165359 143983 200818 291698 405042 120862 30024 22244 267989 310057 73156
17339 195031 358309 -100010 188718 85856 6717 -3155 57251 106470 156469 -94918 194285
17327 -152405 -88488 94261 72467 128385 439433 189275 -403 173572 227295 -134645 72100
17315 184994 67718 -41708 394057 311199 122533 346171 544349 305749 -52606 271727
17304 323298 184971 195174 229824 -194989 36518 357632 207080 511621 175043 30813
17293 210867 -7227 145819 341077 354502 288440 252409 272160 423929 15148 -100896 -112831
17282 -112831 62819 49007 -18103 101844 316720 101281 -20821 179995 444952 816294
17272 816294 -61279 640991 328671 -146317 -174309 -234312 199841 417367 302743 40205
17261A64218i2113D9604M5049M12052j54310m7763N942b58776B51804j00106n7458
17250I4240J8600h8179c5251A63233b07797C34108E6016Q9022L681m1162Q9729
17239A97286M2811o525K24228l7966f0056P663D6661J78678J09434j53411a00424
17227A61080f6747K2651A11237J13283k4912K09915j78725j09602J90134a04821
17216F94470A32859P6887r4761J53906J4605I4999m5440K13356J64035j46100
17206B80850A6810O13528A76610G8926N0972J69465M1362e2590j07874I2024B6474
17194C04280Q4169K6044j75193I1846L11080A61896K88674j54578M3469N7157
17184C96618K216I6890M57409D4366J8877K6167K25848I6961R6397G17M73348
$$ plain form
17261 164218 -92113 49604 94653 506705 352395 304632 310574 -258776 251804 151698 94240
17250 94240 112840 -88179 -35251 163233 -207797 334108 56016 145038 148719 107557 197286
17239 197286 240097 233572 457800 419834 -60056 -52393 46661 225339 334773 181362 -100424
17227 161080 -66747 -44096 111237 224520 199608 409523 230798 121196 311330 -104821
17216 694470 132859 209746 114985 268891 283496 94999 49559 262915 426950 280850
17206 280850 16810 630338 176610 78926 129898 299363 340725 -52590 -160464 92024 26474
17194 304280 388449 414493 239300 91846 402926 161896 450570 295992 339461 396618
17184 396618 398834 96890 554299 44366 63243 89410 315258 96961 193358 717 474065
17173D74065r4636J85829k31753K21346B51106o0763M75287l12851j14056Q3704
17163C22427J52645p4301j8A75874O7272Q9136K33475k30031p2868O1418l4461
17152B89815O2465J3612L1102j20569O6854K17850r4560j01637n958E5148M84661
17141E39809j39167H7184M7564L32395j39572j45614K82697J88521k02712g0481
17130C3774K66062f7873D95515j78480p6186P5243J97235k28179N0352L3748r628
17119C59620j00108K73365k53596J92030B00316O1196M73548C42341j37544K08085
17109D12882j47389J5642K08233A65091J83162j3333D8826L88645k12917L01682
17099E26236B03274F4171M24147j59060K02397m7906A89530L98812o338m9514
$$ plain form
17173 474065 379429 565258 333505 554851 251106 190343 665630 352779 238723 322427
17163 322427 475072 400771 400753 175874 243146 332282 565757 335726 262858 324276 289815
17152 289815 352280 365892 396994 276425 343279 561129 466569 364932 358974 55148 539809
17141 539809 400642 87184 134748 467143 327571 181957 464654 653175 450463 -70481
17130 33774 299836 -67873 495515 317035 240849 316092 513327 285148 335500 369248 359620
17119 359620 259512 532877 279281 471311 200316 261512 735060 342341 204797 412882
17109 412882 265493 281135 489368 165091 348253 334920 48826 437471 224554 526236
17099 526236 203274 64171 488318 329258 531655 483749 189530 588342 582004 532490
17089E32490j38002K6028C4921J84999K5479K10781r1279J88079j01900j5998
17079D35082n4426L57658C27433Q65L19830A69361N35132B07180L27604k57103
17069B77681L14398m5729q330n4382a2676E30666j6338q3110j31948J18800a8672
17057H64002k90330j07177J42837j91125n716K49790Q0175r5008k33876O0365
17047D73937L59922D15597L37232k68882J64396o66J25552j42696r3065J47730
17037F85198j38775q5737N2253K8338p7443K59616k55774o0123P3389N00378m19401
17026E61919j27245J86205k4031l5586P5619N247j09958J28789k00624L28369
17016G88704l39603J99359j89974J10442k03069M00315Q2807C87712M80403C66609
$$ plain form
17089 532490 394488 420516 34921 219920 245399 456180 364901 552980 451080 435082
17079 435082 380656 738314 327433 328298 648128 169361 704493 207180 534784 277681
17069 277681 592079 546350 538020 483638 -12676 530666 514328 431218 299270 418070 -18672
17057 864002 573672 466495 609332 418207 412491 662281 742456 647448 413572 473937
17047 473937 833859 415597 752829 483947 648343 647677 773229 630533 537468 685198
17037 685198 546423 460686 512939 541277 463834 723450 467676 407553 480942 981320 561919
17026 561919 434674 620879 596848 561262 636881 642128 532170 660959 460335 788704
17016 788704 449101 648460 458486 568928 365859 766174 848981 387712 868115 366609
17005H66571Q9506j61830K12259k06719J41583l50976L85420j13877j39095J34659
16995H57501j58823J09754j04757J97539n7751P355k44306K1320K13009K33446
16985A074287j12213j76996J91606k07388J55829M451j35526N0447L3454R0670
16975I68621N3115k32383p7783L48820E19754L79627C79552M70542L24100k49168
16965I25026N8038J82310l47961O4353J29276j16759O4593J45626L03137l38176
16955A069463k73423K14339j4847O0634J89295M4276n07554M00940j68635k2058
16945I92430K67113j91750J37032K29798l72930j24725K18370J14431P7432j16240
16935A230961O8155L54041l99024r026q2636j73095N22330J28086o22729L98523
$$ plain form
17005 866571 956077 794247 1006506 799787 941370 590394 975814 861937 722842 857501
16995 857501 698678 808432 703675 901214 843463 850818 606512 627832 840841 1074287
16985 1074287 962074 785078 976684 769296 925125 929576 794050 844497 877951 968621
16975 968621 1021736 789353 711570 1060390 519754 899381 379552 850094 1174194 925026
16965 925026 983064 1165374 817413 881766 1011042 894283 958876 1104502 1407639 1069463
16955 1069463 796040 1010379 995532 1056166 1245461 1289737 782183 1183123 1014488 992430
16945 992430 1259543 1067793 1204825 1434623 1061693 936968 1155338 1269769 1347201 1230961
16935 1230961 1299116 1653157 1254133 1245107 1162471 989376 1511706 1639792 1017063 1415586
16925A415586J82492k22520K65632m31090L56015J57545l25645K92387J217p6793
16915A614826L829j60607L28922n49818P9436K08445l8176m3469q8203L74742
16905A729927k51465M23266L7589O3322k25514N75n8932L33351n152p2773j93715
16894A780479K37962J86822k57011j50788K28199K53189l35293K43414K22450
16885B409423l91382K09979k54139j13729N44607m16097M68949j9600J32682l26262
16875B244431L76644n00357N21680Q8401l08382j89429O01102k59717n3703P9162
16865B599832j24716M50399k25802j92860J49402R0953R0332J49479J16665k56090
16855B847594M41018r9903j0757k16605M52821k53368K89762k67023L93694r9438
$$ plain form
16925 1415586 1598078 1375558 1641190 1210100 1566115 1723660 1398015 1690402 1691619 1614826
16915 1614826 1618655 1458048 1786970 1237152 1316588 1525033 1486857 1443388 1355185 1729927
16905 1729927 1478462 1901728 1939317 2002639 1777125 1777700 1718768 2052119 2046967 1974194 1780479
16894 1780479 2018441 2205263 1948252 1797464 2025663 2278852 1943559 2186973 2409423
16885 2409423 2018041 2228020 1973881 1860152 2404759 1988662 2457611 2438011 2570693 2244431
16875 2244431 2621075 2120718 2642398 2730799 2422417 2232988 2834090 2574373 2520670 2599832
16865 2599832 2475116 2925515 2699713 2506853 2656255 2747208 2837540 2987019 3103684 2847594
16855 2847594 3288612 3188709 3177952 2961347 3414168 3160800 3450562 3183539 3577233 3477795
16845C477795N3374O18Q9486p5045L00562R1750L04744k62093j12171J36520L8455
16834D043995J96253P2264J40506L0892j79601J79759J0595q114J91733K66910
16824D945192j09511R8583m0853L54617j26203J44340J66812M11266J54793k14400
16814E784636L7926L67064j71193J86842j83547N87059R1703M09435j34300l0250
16804F945375K11229N37954J75206J51044K62199j71107K14746J87708k0633M32317
16794H926038K77130L39959J56520N02021K09365J32566K27693L1399L81741O23942
16784A1808374M47448K17677O20498j17046N58814L77683P07139l2949P29766
16775A5317404P7797N42495N12360R49425M48142M74155K86123J293891N41300
$$ plain form
16845 3477795 3531169 3531787 3621273 3546228 3846790 3938540 4243284 3981191 3869020 4005540 4043995
16834 4043995 4240248 4312512 4453018 4483910 4304309 4484068 4494663 4486549 4678282 4945192
16824 4945192 4835681 4934264 4893411 5248028 5121825 5266165 5432977 5844243 5999036 5784636
16814 5784636 5822562 6189626 6018433 6205275 6021728 6608787 6700490 7109925 6975625 6945375
16804 6945375 7156604 7694558 7869764 8020808 8283007 8111900 8326646 8514354 8493721 8926038
16794 8926038 9203168 9543127 9699647 10201668 10411033 10543599 10771292 10802691 11184432 11808374
16784 11808374 12255822 12473499 13093997 12976951 13535765 13913448 14620587 14587638 15317404
16775 15317404 15395201 15937696 16450056 17399481 17847623 18321778 18607901 19901792 20443092
16766B0443092O59744J193273M15164P84030R58693Q07657J480191O71316R71961
16757B8385121J554121J182868J279171J494231J435963J639020J900129J803159
16749D0673783K041926K327646K178996K347179K565409K665557L170911L287583
16741F1258990L091360L617952M326705M111071M183582N025209M901321N600480
16733I6116670N643072O077422O544727O457644O885141O630960P474346P964357
16725A49794339O784380P037684O841860O342968N439899M743842L412656K470318
16717A92867946J371272r0539j375948k518482m021962m613507n683140o247215
16709A69688425o802208p316702p271144p233378p715548p277880p126411o728935
$$ plain form
16766 20443092 21102836 22296109 22711273 23495303 24453996 25261653 26741844 27413160 28385121
16757 28385121 29939242 31122110 32401281 33895512 35331475 36970495 38870624 40673783
16749 40673783 42715709 45043355 47222351 49569530 52134939 54800496 57971407 61258990
16741 61258990 64350350 67968302 72295007 76406078 80589660 85614869 90516190 96116670
16733 96116670 101759742 107837164 114381891 120839535 127724676 134355636 141829982 149794339
16725 149794339 156578719 163616403 170458263 176801231 182241130 186984972 190397628 192867946
16717 192867946 194239218 194148679 192772731 190254249 186232287 181618780 175935640 169688425
16709 169688425 162886217 155569515 148298371 141064993 133349445 126071565 118945154 112216219
16701A12216219o545256o314588n626605n348534n060246m929833m554300m194894
16693F9641963l568651l807608l318463l323041l043022k478215k745822k226525
16685D5130616k224837j916044k002869k237981r63975k261086j469121j282142
16677C0772561j115299j503145j110369r17129j252336j104661p47515o90893
16669B2331214j081642p07665q31156n55189q54622p77272j37818r06557p02918
16660A5776375l09236q16309j66554p59222n55005k76894l26670m72738n12302
16651A1581445l53475o1685l40205l38048l54545k89430o48783j08329L05222
16642I392167l86002l76841p9418k96028k56491l2455m88817l5899q0317m38462
$$ plain form
16701 112216219 105670963 99356375 93729770 88381236 83320990 78391157 73836857 69641963
16693 69641963 66073312 62265704 58947241 55624200 52581178 50102963 47357141 45130616
16685 45130616 42905779 40989735 38986866 36748885 35784910 33523824 32054703 30772561
16677 30772561 29657262 28154117 27043748 26126619 24874283 23769622 23022107 22331214
16669 22331214 21249572 20541907 19710751 19155562 18300940 17523668 17385850 16479293 15776375
16660 15776375 15467139 14650830 14484276 13725054 13170049 12893155 12566485 12093747 11581445
16651 11581445 11227970 11166285 10826080 10488032 10133487 9844057 9195274 9086945 9392167
16642 9392167 9006165 8629324 8549906 8253878 7997387 7964932 7476115 7440216 7359899 6921437
16632F921437m5502P1196l56014j87262K99169l61675j30680k60361p878l66906
16622E575524k09198J08482m07592j66770L75014k78297l02684K07975k7057n27961
16612D347436Q2463K75776l83366p3341m52334L13316k86249K61665k64882K865
16602C823349j89534j36786J41695l24170J41724j16415K135r8688j50139m2727
16592C050444j34648j10026L66609l58364N9327K40492l89549o7458J30932n21256
16582B266503J63143J54630O4349K4067j81883n4106m179l39194N37444k42719
16572B388055j57277l93317L03844J45054k36397J0604N5662n1516o5459J45303
16562B144556k80845J6474l5805j2911l46771L92576R8604l3781l65531j21539
$$ plain form
16632 6921437 6875935 6947131 6591117 6403855 6703024 6341349 6210669 5950308 5942430 5575524
16622 5575524 5366326 5474808 5067216 4900446 5275460 4997163 4694479 4902454 4875397 4347436
16612 4347436 4429899 4705675 4322309 4248968 3796634 4109950 3823701 4085366 3820484 3823349
16602 3823349 3633815 3497029 3638724 3314554 3456278 3339863 3341998 3243310 3093171 3050444
16592 3050444 2915796 2805770 3172379 2814015 2873342 3113834 2724285 2656827 2787759 2266503
16582 2266503 2429646 2584276 2648625 2672692 2490809 2436703 2432524 2093330 2630774 2388055
16572 2388055 2230778 1837461 2141305 2286359 2049962 2060566 2116228 2064712 1999253 2144556
16562 2144556 1863711 1880185 1844380 1831469 1484698 1877274 1975878 1942097 1576566 1455027
16552A455027L87177k37622J27943j44300j0263L26879m21204J44580j88718J05579
16542A545078k30472J34347P3429j78842J2708K03184l68887J05787O639J0414
16532A313385k55555K75628J50823k52153K7866P7111o35330L93840N0338J75358
16522A321311J29783j78494j41833k3641L88213m39332Q3615l20756N1513J67101
16512A037480k19997L83266j45284k8607L71880m28363L0744j42565J9798k13749
16502F64603k2092L20548K43399k03515J78118O1046k43551m36878L99429n6734
16492I04373j48262K28958K38738n89703N4780l525r0643K50993p9424L02418
16482A068703C70883L48035L25156j27263j1076j53852j39666K65080C35042K27821
$$ plain form
16552 1455027 1842204 1604582 1732525 1588225 1577962 1904841 1483637 1628217 1439499 1545078
16542 1545078 1314606 1448953 1522382 1343540 1356248 1559432 1190545 1296332 1302971 1313385
16532 1313385 1057830 1333458 1484281 1232128 1259994 1337105 701775 1095615 1145953 1321311
16522 1321311 1451094 1272600 1130767 1107126 1495339 1056007 1139622 818866 870379 1037480
16512 1037480 817483 1200749 1055465 1026858 1398738 970375 1001119 858554 878352 664603
16502 664603 642511 963059 1206458 1002943 1181061 1242107 998556 561678 961107 904373
16492 904373 756111 985069 1223807 634104 688884 685359 594716 845709 766285 1068703
16482 1068703 370883 718918 1044074 916811 905735 751883 612217 877297 335042 562863
16472E62863L49875j81004O3452k54867p3080L22080j66042r0130J47126l38422
16462C41851J04137L91951r7507k84338j75995M82524j12908K1796C35740M62529
16452G98269q5406j89518L5411A09670K20852K31341k07354N2283N6900j11863
16442C51829j11064L38416j7329A25037L94692B52111L94832C02183K05136J52268
16432F59587o1431j21466j58852J41968k12024L89995A26365J88611F9734N93706
16422F63440C26689K14757j11144p041a1966D18320m3444j64382L43787k07368
16412C46913k644j4322J42305r4214j56768F5721L03820O5293M0044O933j66834
16401C14977L1889Q8563o3394j32147p9075c634A85772m4123M64880B76605J1176
$$ plain form
16472 562863 912738 731734 795186 540319 467239 789319 623277 533147 680273 341851
16462 341851 445988 837939 740432 456094 280099 762623 649715 671511 335740 798269
16452 798269 712863 523345 558756 109670 330522 561863 354509 406792 463692 351829
16442 351829 240765 579181 561852 125037 519729 252111 646943 302183 507319 659587
16432 659587 598156 476690 317838 459806 247782 637777 126365 314976 69734 663440
16422 663440 326689 541446 430302 423261 -11966 418320 374876 210494 554281 346913
16412 346913 344269 329947 472252 378038 221270 65721 369541 434834 474878 481811 314977
16401 314977 346866 435429 372035 239888 160813 -3634 185772 141649 606529 276605 287781
16390B87781K09032A4045K59669J40113q8638m7689Q3752c11347D17104j48155
16380B68949L0852P7930j57274J70418A68908L29225k15967m3237M77907k49220
16370D67616p308j62926J1475J34987b02605A29115m50K44264L6825j33259a5351
16358C37591P8985p1645r3258N6308A19761L9690N2361J81780J94879k00769R1665
16347D79367F497J75585M2997J47314j74977J384q9843J7697K6550P8274m318
16336B27160p9284B6953O8698J30102J42284G0865J88685L1216p4876M8650J48991
16325D13531A63412a3441C89939A06089b659k2681A93589c6137A89350n799K05428
16314C88979I1035B4757K59119A28879M7296C3864g9648C36016d2565C21889J26442
$$ plain form
16390 287781 496813 14045 273714 413827 325189 277500 361252 -311347 417104 268949
16380 268949 299801 377731 220457 390875 168908 498133 282166 238929 716836 467616
16370 467616 460308 297382 308857 443844 -202605 129115 128665 372929 409754 276495 -15351
16358 337591 416576 344931 251673 307981 119761 159451 211812 393592 588471 387702 479367
16347 479367 6497 182082 225079 372393 197416 198800 108957 126654 153204 231478 227160
16336 227160 147876 26953 95651 225753 368037 70865 259550 290766 215890 264540 413531
16325 413531 163412 -13441 389939 106089 -2659 -25340 193589 -36137 189350 183551 388979
16314 388979 91035 24757 283876 128879 176175 33864 -79648 336016 -42565 321889 448331
16303D48331j52904N51j19704J27209j24904a73507A87362R7129j36633O7517
16293B15375I5088Q6237p7363J85725I3480L89692m825b80209a11612b5617C36194
16281A09704O5342l5335F5198M73055q5036a49136A40902Q5477c1363A30269c7053
16269a82955A49189b81772F0128O8967g4358I8784J73554c7700A64554o8534K9722
16258A25742M4407P410i6673F2202c76541C8923K94446n0844K53992k64046A0936
16246a68657A10777l1127h3062a030B90954a02549C8856L37936A51257J99945
16236C51202j63565G111J36319n9235M28906i7630B9648a45472a2517j8225k11235
16225b41977c239D7447K71135A26634J94210a17135I6547J07537c55373c3591
$$ plain form
16303 448331 295427 295978 176274 303483 178579 -173507 187362 284491 147858 215375
16293 215375 95088 181325 103962 289687 93480 483172 478347 -280209 -111612 -25617 336194
16281 109704 175046 139711 65198 538253 453217 -149136 140902 226379 -31363 130269 -37053
16269 -182955 149189 -281772 60128 129095 -74358 98784 272338 -37700 164554 96020 125742
16258 125742 170149 177559 -96673 62202 -376541 38923 333369 282525 536517 272471 10936
16246 -168657 110777 79650 -83062 -1030 290954 -102549 38856 376792 151257 351202
16236 351202 187637 7111 143430 84195 513101 -97630 29648 -145472 -12517 -30742 -241977
16225 -241977 -3239 47447 318582 126634 320844 -117135 96547 204084 -355373 -33591
16214d9625j035b1482O443G3958K33007F8788Q6599b33966B21959d9265J4185
16203c5080q2692l3234l7765I0907a68568C66858b89229J24353E2938J52365a09304
16191A50191F7909R9688a71399A03687c67757D4702g4196A73350a2662H5277P024
16180I2301a5220C09623A12344a22179A2379a05926p5146i602B5243J58523B9076
16168c05873d0802G1714l0047L34285j45882I0005N5924B0098a57079e1950D42258
16156A31702b84947m8998R2370I7004a09088k61946c6475j22152F2552f2860k47875
16145c10735A31152h5126k53666R8983j0645j19230h7922k4372I0375J02184C7352
16133I9256J05016m467E4160P240c6936j40480D7400A3400b49861E2150K6021
$$ plain form
16214 -49625 -50660 -21482 -15039 73958 306965 68788 155387 -233966 221959 -49265 -35080
16203 -35080 -117772 -151006 -188771 90907 -168568 366858 -289229 -164876 52938 205303 -109304
16191 150191 67909 167597 -171399 103687 -367757 44702 -74196 173350 -12662 85277 92301
16180 92301 -15220 309623 112344 -122179 12379 -105926 -181072 -9602 25243 183766 29076
16168 -305873 -40802 71714 41667 375952 230070 90005 145929 20098 -157079 -51950 442258
16156 131702 -284947 -333945 -241575 97004 -109088 -371034 -36475 -158627 62552 -62860 -310735
16145 -310735 131152 -85126 -338792 -239809 -250454 -369684 -87922 -112294 90375 192559 37352
16133 99256 204272 199805 54160 61400 -36936 -177416 47400 13400 -249861 52150 78171
16122G8171h8448Q743L4173j37026H5016j6319c8420l25420A21775b14641D67979
16110A03747g3613E3692a06069j9076M5343A11591f2482j9290j25850A34327D0777
16098C61826A11756J39326b2770j93275a04286r3381l00251K36444a7848C55588
16087C91595n6068A23220n4266J12476a08340J2464k6739A74306i6182A3665Q4999
16076I8664D2257c5519n5647L0672a1397A3130c8705M22r9442B57753b75473m2528
16064c18001J28615a2367l89070B13030l494d3239l0819E2993f0092r9360c2692
16052b26288L7043A45701a81840N7063p3459A702K11762E17f8615C57482F7024
16040i4450k15044K3591f670C8483k337j3886b9532F073g6846K562A80899J15324
$$ plain form
16122 78171 -88448 -79705 -45532 -182558 85016 68697 -38420 -363840 121775 -214641 467979
16110 103747 -73613 53692 -106069 -125145 -79802 111591 -62482 -81772 -207622 134327 40777
16098 361826 111756 251082 -22770 -216045 -104286 -197667 -497918 -261474 -17848 355588
16087 391595 335527 123220 68954 181430 -108340 -95876 -122615 174306 -96182 13665 98664
16076 98664 42257 -35519 -91166 -60494 -11397 13130 -38705 -38283 -137725 257753 -275473 -318001
16064 -318001 -189386 -12367 -401437 213030 209536 -43239 -74058 52993 -60092 -159452 -32692
16052 -226288 -189245 145701 -181840 -124777 -198236 1702 213464 517 -68615 357482 67024
16040 -94450 -309494 -285903 -6670 38483 36146 22260 -29532 6073 -76846 -74284 180899 296223
16028B96223A19608J53714D6457L1479i7392m3798I0534c190l34281a62973A45658
16016B41248c7594k3598C170L23334a52816j42971b888j96207A22056b39323D04454
16004E1658b79476A68983B7283L0408I887N2281e7945l08513A84504a12868e4114
15992d5559I1988d0418D6008j9558J31631b2504G0305J26290g6554B93706O9527
15981C63233n7919n1411A20980O8340a30637N7361D8604b3761E3277K14521D7599
15969C489M5617b07528A8820L823g2626A76508B8908M9568b43806A01718e4059
15957b12535F899b57169k3268G5609c7397A29117c662B57465l1519c74733e7859
15945h3624b0551k02307L0643A55989c45151J19131J03621E6159b43181B8072
$$ plain form
16028 296223 119608 273322 46457 77936 -97392 -141190 90534 -3190 -337471 -162973 145658
16016 241248 -37594 -61192 3170 326504 -152816 -295787 -2888 -199095 122056 -239323 404454
16004 51658 -279476 168983 27283 57691 9887 62168 -57945 -366458 184504 -112868 -54114
15992 -45559 91988 -40418 46008 26450 158081 -22504 70305 196595 -76554 293706 363233
15981 363233 305314 253903 120980 189320 -130637 -73276 48604 -23761 53277 267798 47599
15969 3489 49106 -207528 18820 22643 -72626 176508 28908 78476 -243806 101718 -54059
15957 -212535 6899 -257169 -280437 75609 -37397 129117 -3662 257465 225946 -374733 -57859
15945 -83624 -20551 -222858 -192215 155989 -345151 -226020 -122399 56159 -243181 28072
15934H4803a21797j6869o1924E5470d7531n7604I5151h8220k67048H0108K09560
15923B89668a1269k84003k15083C02694C8210a4679H5330J67383j11463N3300
15913A94550a2053D3835P8370a01939C2907b3671k6517r231D7123a18176m1245
15902a59421A29085a59549a5409n5147k54019O6554E7503a46763A22154d1337
15891i8757A53835b92589J14119F4313C0777a98101C2724d7859A49062K0838a21414
15879i599E43c8566F7588a19821D2431Q8352a25294A53715b02004L7950D567a14783
15866I5782K057b74391A16384c24713h5667A10635A4391a72821b1801K775q5162
15855a04188C8708b6490E2488J29131d3347j93066G6858b34557k6609f1740A20010
$$ plain form
15934 84803 -121797 -138666 -200590 55470 -47531 -105135 95151 -88220 -355268 80108 289668
15923 289668 -11269 -295272 -510355 302694 38210 -14679 85330 252713 141250 194550
15913 194550 -12053 43835 122205 -101939 32907 -23671 -50188 -59419 47123 -118176 -159421
15902 -159421 129085 -159549 -15409 -70556 -324575 -258021 57503 -146763 122154 -41337
15891 -98757 153835 -292589 -178470 64313 30777 -198101 32724 -47859 149062 169900 -121414
15879 -9599 543 -38566 67588 -119821 42431 130783 -125294 153715 -202004 -164054 4567 -114783
15866 95782 97839 -274391 116384 -324713 -85667 110635 14391 -172821 -21801 -19026 -104188
15855 -104188 38708 -26490 52488 181619 -43347 -236413 76858 -234557 -261166 -61740 120010
15843g6561A87798g4305L36K7671j87957D533c0270P875l21667D1283d4751r7567
15831a42318b709C722L1898a56720g3843B52771E2581b57780Q6982M8823A18242
15819a66462j4690M9028A00038h2713j38431D23231d42814B48069b40065q6895
15809c26960n1955k5664C3921a10453G6102a06633A26006a06609L7884l4938G5836
15797E2983J6152f5724B48524e5735G2605f0622A81915o6477i92j68689r2972
15786b62653B5270b17014D7165b20758d1074p2857o323l2017N6754H3327k0585
15775F2742h5901H110J00469h1288K6390K0721j22813m934j26296a23871j55674
15764b79545A19643j375K06953B6640f3263l2186I7075k5052M9379J6119e9614
$$ plain form
15843 -76561 187798 -74305 -73969 -46298 -234255 4533 -30270 -22395 -344062 41283 -44751 -142318
15831 -142318 -2709 3722 35620 -156720 -73843 252771 52581 -257780 -170798 -121975 118242
15819 -166462 -181152 -132124 100038 -82713 -221144 423231 -442814 248069 -240065 -326960
15809 -326960 -378915 -404579 33921 -110453 76102 -106633 126006 -106609 -68725 -103663 75836
15797 52983 69135 -65724 248524 -55735 72605 -60622 181915 115438 -992 -169681 -262653
15786 -262653 25270 -217014 47165 -220758 -41074 -113931 -120254 -152271 -95517 83327 62742
15775 62742 -85901 8110 108579 -81288 -54898 -34177 -156990 -161924 -288220 -123871 -279545
15764 -279545 119643 118268 325221 26640 -63263 -95449 97075 72023 121402 137521 -59614
15752A76091A323M2245e7258G9508N548a58363D0253e5934C4312K18208a9820
15740A61108f3443E7217a48316B3789M9325b06136k43314C16895b75588M1249
15730b34339c9385j03595I8250c60687C84501e6150A38459c08992b0105k20609
15720b40714b2075j41544L8013D72776b81439K598E6376a36419j34953J28097
15710a43275c2189m066A53882a68452J1261b8503B17914A763L2501A5078a62323
15698B64515b5378H5456b14891i2677p8878B34432D1351O2296J08183e68466B044
15686A10208b12051j33342A9923c76F7970g5993B8284P0263h3232j14158A50260
15674b11396A05682A6980d62965B64454a58072F9624m331d39908c4846l62102
$$ plain form
15752 176091 1323 43568 -57258 79508 85056 -158363 40253 -55934 34312 252520 -19820
15740 161108 -63443 57217 -148316 23789 73114 -206136 -449450 316895 -275588 -234339
15730 -234339 -39385 -142980 98250 -360687 384501 -56150 138459 -308992 -20105 -240714
15720 -240714 -22075 -163619 -125606 472776 -281439 -278841 56376 -136419 -271372 -143275
15710 -143275 -32189 -36255 153882 -168452 -157191 -28503 217914 1763 34264 15078 -162323
15698 264515 -25378 85456 -214891 -92677 -171555 234432 41351 103647 211830 -568466 2044
15686 110208 -212051 -345393 19923 -376 67970 -75993 28284 98547 -83232 -197390 150260
15674 -211396 105682 16980 -462965 264454 -158072 69624 65293 -439908 -34846 -396948
15664c96948O7110a8068A45739a02002j16202j11365J06284J9737E7546a62235
15653a35739c0358A50531M2874p0799b85958j44924i8497M3408A49275a3410k06075
15642b19485f4979B8778i7520j48937A80594c1953a043A5652c6622B81044a14951
15630I8138a31920l9929B6859L907J0918K7702N9899h2011B10021H7924c08763
15618c0419A8256J15049c7369q5811A02424a61580B8261b59652E3855b8679j51986
15607a80665G1046B2355h5205K2328p9422A93115C5418c6335j54845n966A8771
15595a61639J2040l6849A4633b72762A69607A0773K30518l0259B0717G346L02623
15584C09969O3850A44343C660K22535C0119J20295m0070i6204l9197N6660p8541
$$ plain form
15664 -396948 -329838 -18068 145739 -102002 -218204 -329569 -223285 -203548 57546 -162235
15653 -135739 -30358 150531 193405 122606 -285958 -430882 -98497 -55089 149275 -13410 -219485
15642 -219485 -64979 28778 -97520 -246457 180594 -31953 -1043 15652 -36622 281044 -114951
15630 98138 -131920 -171849 26859 30766 41684 69386 129285 -82011 210021 87924 -308763
15618 -30419 18256 133305 -37369 -123180 102424 -161580 28261 -259652 53855 -28679 -180665
15607 -180665 71046 22355 -85205 -62877 -142299 193115 35418 -36335 -191180 -197146 18771
15595 -161639 -149599 -186448 14633 -272762 169607 10773 241291 211032 20717 7346 309969
15584 309969 373819 144343 3660 226195 30119 150414 110344 -96204 -135401 -78741 -157282
15573a57282B89788a61245F378a19245B09573q8088L0396e5222A87619b8934A16649
15561i2551j2902K8141I5604Q5809i058j84313A93191h115j05006A28926b21630
15549a50065i542H3513M7489n9508K5006A2587a02696K8725A57560J3744k2562
15538A48742a74760C03531a10382c6233D6730e318k92904j2901H7498a91406D5457
15526a77309B2516b62003a19365c5806B56352j20857E9204L49727b21494l55L5217
15515a86632A36265b44452J18594A0530b8243A20966K0833K81265A21273J41161
15505B62434a61215C22925F7762a90813P7869k24390B46449A23168n4585c74440
15494b77384k38389a94141L5488F2455d945k55337B39384b77705G6427b24434
$$ plain form
15573 -157282 289788 -161245 6378 -119245 209573 121485 151881 -55222 187619 -28934 116649
15561 -92551 -105453 -77312 95604 181413 -9058 -193371 193191 -8115 -113121 128926 -221630
15549 -150065 -9542 83513 131002 71494 96500 12587 -102696 -73971 157560 171304 148742
15538 148742 -174760 303531 -110382 -36233 46730 -5318 -298222 -311123 87498 -191406 45457
15526 -177309 22516 -262003 -119365 -35806 256352 135495 59204 408931 -221494 -221849 -186632
15515 -186632 136265 -244452 -125858 10530 -28243 120966 141799 423064 121273 262434
15505 262434 -161215 322925 67762 -190813 -112944 -337334 246449 123168 68583 -374440
15494 -277384 -515773 -194141 -158653 62455 -4945 -260282 239384 -277705 76427 -224434
15483A0908a74088E4112f1361A67114b62553a29728j29273Q2612l3976I7994e4092
15471b8339j16643B2120d38486J70450A6850c06724C1578d1210A25494a29442
15460I8152Q7379H3882i6557D3946J1850d4711A13831e070F2478f8838A00671
15448C4248N3258g7674j75738M025M3916D7387J69641b31602J01144d7624J1816
15437c5808k34189a8222q2618k96048B26177b06966b4220q9638j2552N2761l5522
15426a09171A21635a24645A6737P5160C9457c0949b403j49091H5540N6663c80186
15414G0319k7247K15757H874J18948B6605L0011J36174a15925A15927a55349j2871
15403a68220O6805B02065p8851J19124n5343c64412g3825H913c07481G2418A952
$$ plain form
15483 10908 -174088 54112 -61361 167114 -262553 -129728 -259001 -176389 -210365 97994 -54092
15471 -28339 -144982 22120 -438486 -268036 16850 -306724 31578 -41210 125494 -129442
15460 98152 185531 83882 -96557 43946 55796 -44711 113831 -5070 62478 -68838 100671
15448 34248 87506 -77674 -253412 -249387 -205471 47387 217028 -231602 -130458 -47624 -35808
15437 -35808 -269997 -18222 -100840 -396888 226177 -206966 -24220 -113858 -126410 -73649 -109171
15426 -109171 121635 -124645 16737 91897 39457 -30949 -2403 -151494 85540 142203 -380186
15414 70319 43072 258829 8874 127822 26605 56616 192790 -115925 115927 -155349 -168220
15403 -168220 -101415 202065 123214 242338 186995 -364412 -73825 8913 -307481 72418 1952
15391a34730C4028f2533q6915i706n5155C11153c88283d5222E0634J2146L7244
15380A00024e5216j79799a7270r1582j25961Q2833j27639h0352B8561c0252A16694
15368C30881A23823a56056k46678A21130R1073e3994A306K25466A8528h0581B38439
15356B11879G4803a81528A22670K60806a24531a1638q0095q0317B32742a06110
15345a29139M0942L4887n4712a9956C1292K24548H9058a44333B57213c95248A2285
15333a46698I6987B7107a19846o0027C5285a12251B65798c8500B0517d1584n0970
15322i2554B98416a11793E5059J84720e3659C4057c47365J53288G7526N9470o423
15311A30573i6395K1647A17320K7267f4535p7051d5288B27096h4620F7823J29966
$$ plain form
15391 -134730 34028 -62533 -149448 -9706 -64861 311153 -388283 -45222 50634 62780 100024
15380 100024 -55216 -235015 -17270 -108852 -234813 -151980 -279619 -80352 28561 -30252 116694
15368 330881 123823 -156056 -402734 121130 212203 -53994 1306 226772 18528 -80581 238439
15356 211879 74803 -181528 122670 383476 -124531 -11638 -91733 -172050 232742 -106110
15345 -129139 -88197 -53310 -108022 -19956 31292 255840 89058 -144333 257213 -395248 12285
15333 -146698 96987 27107 -119846 -179873 35285 -112251 265798 -38500 20517 -41584 -92554
15322 -92554 298416 -111793 55059 239779 -53659 34057 -347365 -194077 77526 136996 130573
15311 130573 -96395 -74748 117320 144587 -64535 -141586 -45288 227096 -84620 67823 197789
15300A97789G7382L5332b05605k0687H2966O3768B2257O8196O5589h9768N964
15289h3804b4410G7528M0719g3463B1329E319P5954b59684D05614l2080A83895
15277A06733L70137b7589A10088H965b97537B62421b84605A88564C1224C310d7041
15265H4321e5687A10372P5986a31781A57575j8657F5483d4044a2341B90010A28868
15253A67771L14297A1476N7530M41780E4196M41155J404655o44468K22576P140
15243A485254G01124k75768A58171e5804a3518o1731F347a32228d0612J1595A01116
15231b10727a2887E2488L70849d5169G8606J04233K5015j5136R9784A06460b4338
15219H3967R5800q1071i3247G1230m574c7128A22049k5153m5160i372A66502p1442
$$ plain form
15300 197789 77382 112714 -205605 -226292 82966 146734 22257 90453 156042 -89768 -83804
15289 -83804 -24410 77528 118247 -73463 21329 5319 81273 -259684 405614 373534 183895
15277 106733 476870 -27589 110088 8965 -297537 262421 -284605 188564 31224 3310 -47041
15265 84321 -55687 110372 186358 -131781 157575 138918 65483 -44044 -12341 290010 128868
15253 167771 482068 11476 69006 510786 54196 495351 1900006 1255538 1478114 1485254
15243 1485254 701124 425356 158171 -55804 -13518 -75249 6347 -132228 -40612 -29017 101116
15231 -210727 -12887 52488 423337 -45169 78606 182839 207854 192718 292502 106460 -24338
15219 83967 179767 98696 -93247 71230 66656 -37128 122049 96896 51736 -9372 166502 95060
15207I5060J29382d1420k64192M5187D71750A37516M11991a47959B9100a43012
15196i7992a0571H920a43570H5344P4031b02939C50718e4688A2298a3032E798
15184a43098B45884a92359F4301b20012D3529a8909A8950Q0359i8733p006j66985
15173b72724A48031g7461j6830b6527j61204A48267J1104O4043K33080D3435N5733
15162I9168J91975K28659I8552g3309A80251n2360k390j7868K77971J2363a88384
15150E7906E068K49425a07203B37801l1819F3383L01831a56731f5947E4567J08184
15139A62751b27616I4710K36979I4306J32985B0256e6717C04843B8934J45041
15129A73975o7161n0703J94195q6715a1439D89945B34770J08360p8205a51744
$$ plain form
15207 95060 224442 -41420 -305612 -260425 471750 137516 549507 -147959 29100 -143012
15196 -97992 -10571 8920 -143570 85344 159375 -202939 350718 -54688 12298 -13032 5798
15184 -143098 245884 -192359 64301 -220012 43529 -18909 18950 99309 -98733 -105739 -272724
15173 -272724 148031 -77461 -94291 -26527 -187731 148267 159371 223414 456494 43435 99168
15162 99168 291143 519802 98552 -73309 180251 127891 125501 107633 385604 397967 -188384
15150 57906 5068 254493 -107203 237801 205982 63383 365214 -156731 -65947 54567 162751
15139 162751 -227616 94710 331689 94306 227291 20256 -56717 304843 28934 173975
15129 173975 106814 56111 250306 163591 -11439 489945 234770 343130 264925 -151744
15118B10121K2410K213J225F671Q1639g8783q7470a9070A57362J11356a34582
15106h1386n2988n3773A82026g7819k090A6356b02349q0544B48503K1587p4326
15095A95764J67853a89945E62474D4312L7900L1217K09907A36448f5960F9538
15084c03099A16347f510B18963a22628c358A3854a87594D6312K20351A16177g2592
15072A57757d8305A53173a99493B34290J17167H0128J61162m7484J47891J26450
15062D68147i8103C1827j3178d1790D9721J11337F0472P6612o0916a04774D35081
15050b58688a7272E74503G7411P7609K80857j53553j03203M8352c0093A1095K04314
15039B15409J43001G0199J51780E3339j0116J31316G3316J55741i374D13952Q8255
$$ plain form
15118 210121 232531 234744 235969 6671 88310 -78783 -166253 -19070 157362 268718 -134582
15106 -81386 -134374 -188147 182026 -77819 -79909 16356 -202349 -282893 248503 270090 195764
15095 195764 363617 -189945 562474 44312 82212 113429 323336 136448 -65960 69538
15084 -303099 116347 -6510 218963 -122628 -3358 13854 -187594 46312 266663 116177 -72592
15072 157757 -48305 153173 -199493 234290 351457 80128 241290 193806 341697 468147
15062 468147 -98103 31827 18649 -41790 49721 161058 60472 137084 76168 -104774 435081
15050 -258688 -17272 574503 77411 155020 435877 282324 179121 227473 -30093 11095 215409
15039 215409 358410 70199 221979 53339 43223 174539 73316 229057 -9374 413952 502207
15028E02207A12434K39471r6181P2973N9032j02102L2030I9747d3482B1648K10423
15017B32071p2255a574I4063C744K24609Q7027j1597J66008A37924a68267C13998
15005C29571b8717E9518b38620C02603c333A36271D160L00362j3570j08997M51937
14994F33892C06182o8713I5408J99935q9638M69355B11031L21159j60838j45496
14984B25856M6856r1042J10404n1863A8052L26621j19196h5670C31960r2507I9806
14972C38969k9280g2025C95780A41456K91005A66284b6554B57326j291G7996M05606
14961D83602A33651m4272e152B71517A12136H098J84006P3727A11849K41655j65574
14950A87930Q86L22620B50254N4192J18203l1432j17772K15771k39830Q2634A51030
$$ plain form
15028 502207 112434 351905 255724 328697 387729 285627 317657 99747 -43482 21648 232071
15017 232071 159816 -1574 94063 3744 228353 315380 303783 469791 137924 -168267 313998
15005 329571 -28717 59518 -238620 302603 -3333 136271 4160 304522 290952 181955 633892
14994 633892 306182 237469 95408 295343 205705 675060 211031 532190 371352 225856
14984 225856 272712 181670 292074 240211 18052 344673 225477 -85670 331960 239453 99806
14972 338969 309689 -72025 395780 141456 432461 166284 -26554 257326 256035 77996 483602
14961 483602 133651 89379 -5152 271517 112136 8098 192104 265831 111849 353504 187930
14950 187930 188816 511436 250254 304446 422649 391217 273445 489216 249386 332020 151030
14938A81431K91053P5349a50309D62191a5577C2088q709J88324J77025A16213
14927C88910j34634n6810d4501B71699A02950K02876P6761j8691b2941B94121
14916D46259j23129q6159R3460k4234P2719Q4938A29506M19193A81641m3537J96364
14905C34468K0374L5764M1484A42232J29162j1379j031p1356a42349C51486K47578
14894E99064A58239J11078J8181J71063B24426O7758J22772o1851J8568k0637
14884C51036J96004A96861K20267O7644n4853N4625k15061R6929J67736j75054
14874C59094j22635a63200B96832K70862A57042J71536P7408j61034o3103J21351
14864C03200L46505k84371k8091l8642J6171J43343R1864j07398O0861m5681L0200
$$ plain form
14938 181431 472484 547833 -150309 462191 -15577 32088 23379 211703 388728 116213
14927 388910 254276 197466 -44501 271699 102950 305826 382587 363896 -22941 294121
14916 446259 323130 236971 330431 306197 378916 463854 129506 548699 181641 138104 334468
14905 334468 354842 390606 432090 142232 271394 260015 258984 187628 -142349 351486 599064
14894 599064 158239 269317 287498 458561 224426 292184 414956 353105 371673 351036
14884 351036 547040 196861 417128 484772 429919 484544 269483 366412 534148 359094
14874 359094 236459 -163200 296832 567694 157042 328578 405986 244952 181849 303200
14864 303200 649705 365334 337243 298601 314772 458115 549979 442581 503442 457761 487961
14853D87961K9684K8471m4132B01687I0747M03076M2491E3228M03943j21414R4342
14842D30099R4233B45161p1752J83741r9470N4629M3297L17087j10156j90440
14832C72097L91582j04267k53314J55050Q954B04959K95306k30294J56614q8288
14822C38297K12944n2250O5668L4029J55034B07945q0073M97139k2504k51941
14812C50566K00627j8036l8306J19581L28201m21322j75274J40227A8436M52263
14802D70699k842J83535j66891K55426k09663J13736C14574J53791n7008J27235
14792E38592O2866B06606O28040C48115J56325M5250J91464l09677M86113B97137
14781E71013k78467J54296A331O36081j77786J62174q5340k39573K84242J01775
$$ plain form
14853 487961 517645 546116 501984 201687 90747 493823 536314 53228 457171 335757 430099
14842 430099 524332 245161 173409 357150 257680 312309 355606 672693 562537 372097
14832 372097 763679 659412 406098 561148 570102 204959 500265 269971 426585 338297
14822 338297 551241 498991 564659 598688 753722 207945 127872 625011 602507 350566
14812 350566 551193 533157 494851 614432 942633 521311 346037 486264 18436 470699
14802 470699 467857 651392 484501 739927 530264 644000 314574 468365 411357 538592
14792 538592 601458 206606 834646 348115 504440 549690 741154 431477 917590 297137
14781 571013 292546 446842 1331 637412 459626 621800 536460 296887 581129 682904
14771F82904P1135o6223k91388N40852D60072J29977J65188C63458L47043k1108
14761F89393J16660l59632M31551j70539q8816j74520P407J65239M10745j71355
14751H56133l21198J3390J250k4605J49498K73799l46277p5065j9842J67560K03388
14740H78031J7331l46856L07833K1820J02312l37532J57419j05761j87156J67673
14730F75114Q841P4858K95083m85864J65736M04497l45101j76824K47687k57452
14720F06575J40823J48782k05959R2109j95057K38051K9267m9657J74597L0616
14710A010147o3244n4422k06321k320N9150J34864m8259k6482j11772J73945N3626
14699I18912Q8523j04413k1978P8400J922j26179j13380L55327D87971M14654
$$ plain form
14771 682904 754039 687816 396428 937280 460072 590049 755237 363458 710501 689393
14761 689393 806053 446421 877972 707433 618617 444097 451504 616743 1027488 856133
14751 856133 534935 548325 549575 524970 674468 948267 601990 526925 507083 674643 878031
14740 878031 895362 548506 856339 878159 980471 642939 800358 694597 507441 675114
14730 675114 683955 758813 1053896 568032 733768 1138265 793164 616340 864027 606575
14720 606575 747398 896180 690221 782330 587273 825324 854591 804934 979531 1010147
14710 1010147 946903 892481 686160 683840 742990 877854 829595 803113 691341 865286 918912
14699 918912 1007435 903022 881044 959444 961366 835187 721807 1077134 487971 902625
14689I02625j35064M16519n28665L07305J08793p0674O2962o4571m9923L7049
14679I86356k32569L78227m86767K18075R5252K59826k59889K83949m11536K7998
14669H58922J2461l17095J45591N44271p3763P323m3125k39521o3736M68820k60042
14658A040106J86066j84489J86889k36654J31778l1861p1199L91731l68763K24843
14648A268447l37236K94140l4816j45251J4735j88733L46569K60248k09515Q3674
14638A352262j93018K88723k47071J873j27759L56533j41517l4464J61430M6105
14628A463097r0884k08509L03164j52845r5295R2393N0891o9321J76349N4627
14618A523667l96419J17222q1063K82864k4132K06754j82872N81326m36608K5131
$$ plain form
14689 902625 767561 1184080 655415 962720 1071513 1000839 1063801 999230 949307 986356
14679 986356 753787 1132014 645247 863322 958574 1218400 958511 1242460 830924 858922
14669 858922 871383 554288 699879 1244150 1170387 1177710 1134585 895064 831328 1300148 1040106
14658 1040106 1226172 1041683 1228572 991918 1123696 1091835 1020636 1412367 1043604 1268447
14648 1268447 931211 1225351 1190535 1045284 1060019 871286 1217855 1478103 1268588 1352262
14638 1352262 1159244 1447967 1200896 1202769 1075010 1431543 1290026 1255562 1416992 1463097
14628 1463097 1372213 1163704 1466868 1314023 1218728 1311121 1362012 1292691 1469040 1523667
14618 1523667 1127248 1244470 1163407 1446271 1422139 1628893 1446021 2027347 1590739 1615870
14608A615870o9900Q4483k54310L20865R5377j80172m4221O6442K43198j87175
14598A690457J55173j37139K7965J43122O1068k82124N0739J72603K5146K47533
14588B154543l91560l5863J23889L29415j62163J18774n19823K23821K92140k083
14578B131090j39976j11837J11329q0748K61869N7547j29647J33395Q0749j80115
14568B133656K46835k20388P6977j48724K59267L3323M7588J20571q1485K85294
14558B752914q8932M86295J50102k5402J66884K15370L64839N61499J009449J578278
14548G171296L298053Q350890K2864366L582942B1384383q980900E756210k425616
14540C330594n43508j76869l89410m38720N51749l43584n7709K90333k86341K04193
$$ plain form
14608 1615870 1545970 1630453 1376143 1697008 1792385 1612213 1567992 1634434 1877632 1690457
14598 1690457 1845630 1708491 1736456 1879578 1940646 1658522 1709261 1881864 1907010 2154543
14588 2154543 1762983 1727120 1851009 2180424 2018261 2137035 1617212 1841033 2133173 2131090
14578 2131090 1991114 1879277 1990606 1909858 2171727 2229274 2099627 2233022 2313771 2133656
14568 2133656 2380491 2160103 2237080 2088356 2347623 2380946 2428534 2549105 2467620 2752914
14558 2752914 2663982 3150277 3300379 3274977 3441861 3657231 4022070 4583569 5593018 7171296
14548 7171296 10469349 18820239 41684605 45267547 21384383 12403483 5756210 3330594
14540 3330594 2787086 2610217 2220807 1782087 2333836 1990252 1932543 2222876 1936535 2140728
14530B140728r44K04896j60161J27284J86147k73934j56612J78025K81813J37834
14520B665076l49352K30772J44737j34752m0622K32944o810J63431k04272J65921
14510B867073p6106J60436o9436M4596K53042k87194o7951L80528l24940L19862
14500C199910N4582L4927K19071j41917k95539Q3038K2546K26233M6638j70490
14490C278999K04175k46303L91235J89650j85770j04260L9330J9664K17181l05193
14480C498708K84213L36444l0481j32176N4741j64844L50277P5457j07395K61288
14470D426232P3400k72878K35629k22269M89850j34376J10911j39833L72848k43114
14460D696400J32428M54289j92085j3275n6678J67588k8481K78260j24963P3206
$$ plain form
14530 2140728 2139784 2344680 2184519 2311803 2497950 2224016 2067404 2245429 2527242 2665076
14520 2665076 2315724 2546496 2691233 2556481 2515859 2748803 2741993 2905424 2701152 2867073
14510 2867073 2790967 2951403 2881967 2926563 3179605 2892411 2824460 3204988 2880048 3199910
14500 3199910 3254492 3289419 3508490 3366573 3071034 3154072 3176618 3402851 3449489 3278999
14490 3278999 3483174 3236871 3628106 3817756 3631986 3527726 3567056 3586720 3803901 3498708
14480 3498708 3782921 4119365 4088884 3956708 4011449 3846605 4196882 4272339 4164944 4426232
14470 4426232 4499632 4226754 4462383 4240114 4729964 4595588 4706499 4566666 4939514 4696400
14460 4696400 4828828 5283117 5091032 5077757 5021079 5188667 5160186 5438446 5313483 5386689
14450E386689N4061q195J23440L44800p3034m52111M63338L08041j10950N5859
14440F091938Q0264Q2682K23410j79210K21166k16634M06314K28625j12108O216
14430F832663J16165L09702j75961L56086K2684p7281J23931L17732K9689m5437
14420G809973K11178L00531k49507K59895K1733K35540n3929K16757J80937J83267
14410I116375J87380r5834J41327K19520J75012J05396R6343J75131K90651k20319
14400A0190982M77281K49089j54394M84187j69793M45526r2150K16856M21573
14391A2069157J7017N06210L4933L83614j57610L28843L82534k53161M70299J22825
14381A3904661N61744M32147n0976L70109J3090M51846P41708o5541J58861N79447
$$ plain form
14450 5386689 5440750 5432555 5555995 5900795 5827761 5375650 5838988 6147029 6036079 6091938
14440 6091938 6172202 6254884 6478294 6299084 6520250 6303616 6709930 6938555 6826447 6832663
14430 6832663 6948828 7258530 7082569 7438655 7461339 7384058 7507989 7825721 7855410 7809973
14420 7809973 8021151 8321682 8072175 8332070 8353803 8589343 8535414 8752171 8933108 9116375
14410 9116375 9303755 9207921 9349248 9568768 9743780 9849176 9945519 10120650 10411301 10190982
14400 10190982 10668263 10917352 10762958 11247145 11077352 11522878 11430728 11647584 12069157
14391 12069157 12086174 12592384 12627317 13010931 12853321 13182164 13564698 13311537 13781836 13904661
14381 13904661 14466405 14898552 14847576 15217685 15230775 15682621 16424329 16358788 16517649 17097096
14371A7097096L07963K76051N37253M34113N5008N69722M14568N06889J23677
14362B0322340L32658J010524L78409O80927J67543O16635L83165M73210L38366
14353B4703777J142323J1833Q41055N22917R19591P22797N60133J021093Q29466
14344C1274985O65313R48937Q63170O62703R71393J374460N31070R46419J178817
14335C9417267J133501J077163J268904J269542J631943J032631J755410J345500
14327D9931861J338160J885459J841930J751967K006973J663230K204645K316377
14319F4940602K446851K151482K775431K502935L288428K532879L415930L396223
14311H7450761L307842L823319L978755M015057M359952M625116M967275N140545
$$ plain form
14371 17097096 17405059 17681110 18218363 18652476 18707484 19277206 19691774 20198663 20322340
14362 20322340 20654998 21665522 22043931 22724858 22892401 23509036 23892201 24365411 24703777
14353 24703777 25846100 25857933 26698988 27221905 28141496 28864293 29424426 30445519 31274985
14344 31274985 31940298 32889235 33752405 34415108 35386501 36760961 37292031 38238450 39417267
14335 39417267 40550768 41627931 42896835 44166377 45798320 46830951 48586361 49931861
14327 49931861 51270021 53155480 54997410 56749377 58756350 60419580 62624225 64940602
14319 64940602 67387453 69538935 72314366 74817301 78105729 80638608 84054538 87450761
14311 87450761 90758603 94581922 98560677 102575734 106935686 111560802 116528077 121668622
14303A21668622N495290O068887N956087O473134O964053P306775P873126P919442
14295A75725416Q740904R178480R778681J0286349J0682737J1582916J1685392
14288B47660875J2551159J3026836J3258134J3819458J4477890J4384870J4798403
14281C43977625J4855777J4634895J4350683J4057518J3467419J1954279J0779323
14274D38077519R542461O923653M512577J856358N30841l106429k925750m322694
14266D51088536l954558p206227r089185j1221395j2872330j3779268j4529575
14259C78435998j5057550j5168197j4910772j5139025j5095771j2985674j3695572
14252B76383437j3200458j3082109j1883624j1722673j1240270j0264552r724067
$$ plain form
14303 121668622 127163912 133232799 139188886 145662020 152626073 159932848 167805974 175725416
14295 175725416 184466320 193644800 203423481 213709830 224392567 235975483 247660875
14288 247660875 260212034 273238870 286497004 300316462 314794352 329179222 343977625
14281 343977625 358833402 373468297 387818980 401876498 415343917 427298196 438077519
14274 438077519 447619980 454543633 459056210 460912568 461443409 458336980 455411230 451088536
14266 451088536 447133978 439927751 430838566 419617171 406744841 392965573 378435998
14259 378435998 363378448 348210251 333299479 318160454 303064683 290079009 276383437
14252 276383437 263182979 250100870 238217246 226494573 215254303 204989751 195265684
14245A95265684r336567q553403p991159q120976p574488p138042o314256n660905
14237A34575888o208745n235974m821112n340442n030242m102053l754085l903000
14229I6180235m175595l293556l776127k701587l118495l303250k587574k500034
14221G0724017k769601j439345k637733k237406k005464k058866j648006j876124
14213E4051472j296448j850804j476189j531473j647685j368034k44282j414624
14205D3221933j168940j635366j369192o93642p92605r36447j128463o84887r25446
14196C3886945j243734q18124m93113o86266j000741n83951r71236n21358q54422
14187B6714000o05258n86437l61866m28387p47898m70023m56006o52344m49741
$$ plain form
14245 195265684 185929117 177375714 169384555 161263579 153689091 146551049 140236793 134575888
14237 134575888 128367143 123131169 118310057 112969615 107939373 103837320 100083235 96180235
14229 96180235 92004640 88711084 84934957 82233370 79114875 75811625 73224051 70724017
14221 70724017 67954416 66515071 63877338 61639932 59634468 57575602 55927596 54051472
14213 54051472 52755024 50904220 49428031 47896558 46248873 44880839 44636557 43221933
14205 43221933 42052993 40417627 39048435 38354793 37562188 36625741 35497278 34812391 33886945
14196 33886945 32643211 31825087 31331974 30645708 29644967 29061016 28089780 27568422 26714000
14187 26714000 26108742 25522305 25160439 24732052 23984154 23514131 23058125 22405781 21956040
14178B1956040n43084j649m97811l43125n13689m18888m12247p58954k05681j34268
14168A8126644l25348n96415k93198P4690m90274n41430j06935j16244m42115
14159A5289375j78924l39273j34265m39132k7809n08211j89047j53196k65787
14150A3053731j93717o3984m52932R0163k12981l30822k28241l5262n13958K0605
14140A1132602o8418l60061L7818k35344m30331K18905k69711j63928j19319j83814
14130I558399l10787J09477j59539j24403j81322j5178n8222m34108J07253l71562
14120H120008r2619L60086m06738j66497o3372k02614J3271K6868j65657k67305
14110G155431L71776k63631J47437n46277M153l90927O5631l5682p102J16073
$$ plain form
14178 21956040 21412956 21411307 20913496 20570371 20056682 19637794 19225547 18466593 18260912 18126644
14168 18126644 17801296 17204881 16911683 16986373 16496099 15954669 15847734 15731490 15289375
14159 15289375 15110451 14771178 14636913 14197781 14169972 13661761 13472714 13319518 13053731
14150 13053731 12860014 12796030 12343098 12433261 12220280 11889458 11661217 11625955 11111997 11132602
14140 11132602 11064184 10704123 10741941 10506597 10076266 10295171 10025460 9861532 9742213 9558399
14130 9558399 9247612 9357089 9197550 9073147 8891825 8876647 8818425 8384317 8491570 8120008
14120 8120008 8027389 8387475 7980737 7814240 7750868 7548254 7561525 7588393 7422736 7155431
14110 7155431 7527207 7263576 7411013 6864736 6868889 6477962 6543593 6507911 6500809 6616882
14100F616882M6832p01384L26621k30802J39605j02755q1742l11193P3989q4337
14090E691716o1802m7137L0573k81687J13677j51200j28620O5751j5993j72605
14080E042673j10134O5572j51668K27836r3521o00566L93043j46961J76266R358
14070D811898k8238K512l77247L19188l74451l57509J63138K00068k35318J65725
14060D289766k22202K09268n2075K02075k34912n5404j34227j87705K67875j47393
14050C935066J29721l50949j36974K68065Q5414l70880j14794M13870l41405q9308
14040C427826k4697K32160l42459J19282q1933N7674j18911J13798j79091l74942
14030B828707L36997j1240N419P6514j31667m1968j8943k67468j4331j65105J44279
$$ plain form
14100 6616882 6663714 5962330 6288951 6058149 6197754 6094999 6013257 5702064 5776053 5691716
14090 5691716 5629914 5582777 5613350 5331663 5445340 5294140 5165520 5231271 5215278 5042673
14080 5042673 4932539 4998111 4846443 5074279 4980758 4380192 4773235 4626274 4802540 4811898
14070 4811898 4783660 4786172 4408925 4728113 4353662 3996153 4159291 4359359 4124041 4289766
14060 4289766 4067564 4276832 4224757 4426832 4191920 4136516 4002289 3814584 4082459 3935066
14050 3935066 4064787 3713838 3576864 3844929 3930343 3559463 3444669 3858539 3517134 3427826
14040 3427826 3403129 3635289 3292830 3412112 3330179 3387853 3268942 3382740 3203649 2828707
14030 2828707 3165704 3154464 3159883 3236397 3104730 3062762 3043819 2776351 2762020 2596915 2741194
14019B741194M50641n50453J85603j04900Q9402L2448o53301M38554R9714m09599
14009B319303J7577K89990N8427m05244K07483J38577l73983l17870L29858J25771
13999B389889j53523j57037K95112o6251m01160O7784K63461J4399j57272O82830
13989B778232N45816J979714O435482K1112264J6272203k2221946j2213054n734464
13981H954247k587218j385892p65666l39960M3798o33941n28156J67260N1869
13972B976341l32119J91865j90453R3576j56837j60639K25421m65052J19680J463
13962B303246N4416R4916j65421r2591O9649j90296J30950M8906m4842n9058l39373
13951A810502K61482M61145m10999N5245J22741R7110l50105Q0645l86845K70191
$$ plain form
14019 2741194 3191835 2641382 2826985 2722085 2811487 2843935 2190634 2629188 2728902 2319303
14009 2319303 2336880 2626870 2685297 2280053 2487536 2626113 2252130 1934260 2264118 2389889
13999 2389889 2236366 2079329 2374441 2308190 1907030 1974814 2238275 2252674 2095402 2778232
13989 2778232 3324048 5303762 11739244 32851508 49123711 26901765 14688711 8954247
13981 8954247 6367029 4981137 4215471 3875511 3919309 3285368 2757212 2924472 2976341
13972 2976341 2644222 2836087 2645634 2739210 2582373 2421734 2647155 2182103 2301783 2303246
13962 2303246 2357662 2452578 2287157 2194566 2264215 2073919 2204869 2253775 2208933 2149875 1810502
13951 1810502 2071984 2533129 2122130 2177375 2300116 2397226 2047121 2127766 1740921 2011112
13941B011112p3627k35589J80172q5197j00971J28368j29710J44713n8263j58417
13931A622591J28599m5094Q3682j88992J42803j37739J10045j3007J12115L36531
13921B151534m14496j43176m4509K31138k86865M47046l21998p4249j33099K89055
13911A700381l44823K95117Q5635K2361L2258J96937l76681j88020m00308N21586
13901A544443k43831p2135O81805l20472j51242K56574r7817k47663K13084j83534
13891A379212L75827n38988J24394N7254j28239K59607k52521K66914j74523N9724
13881A428661l14795k2488M7987K74222j72232k86521K91852r2511R8914J73008
13871A426097k62012J44782r5595R3856O2645k22152Q2162j43170K12929p729
$$ plain form
13941 2011112 1937485 1701896 1882068 1796871 1695900 1824268 1694558 1839271 1781008 1622591
13931 1622591 1751190 1706096 1789778 1600786 1743589 1605850 1715895 1702888 1815003 2151534
13921 2151534 1737038 1593862 1549353 1780491 1493626 1940672 1618674 1544425 1411326 1700381
13911 1700381 1355558 1650675 1736310 1758671 1790929 1987866 1611185 1423165 1022857 1544443
13901 1544443 1300612 1228477 1910282 1589810 1438568 1695142 1597325 1349662 1562746 1379212
13891 1379212 1755039 1216051 1340445 1397699 1269460 1529067 1276546 1543460 1368937 1428661
13881 1428661 1113866 1091378 1139365 1413587 1241355 954834 1246686 1154175 1253089 1426097
13871 1426097 1164085 1308867 1213272 1307128 1369773 1147621 1229783 1086613 1299542 1291813
13861A291813K16768k89152k787q8170J32440M5612j12174l64672L20553J32820
13851A283051k59086k6892J67994J52708J3880m6949E78708M83257p7968L29528
13841A313525k89366p9054q2412J67914J82821l8430j08286m68114K90075J43562
13831A032235j72277L01451m856j63852N3521j12022o7387m279P8432k1373j58463
13820G61130j13102L32524m9569j36248J41868o7677L43901j16509n20435K08410
13810G84293k00423L29901j97891Q0208k53749L83959k95735L27746k14908L856
13800G47257J94003j27869j46978P0171j35334M57051j86933K62358j70557j81875
13790G81294j24549J05347m6539K79465l7886N1628j10307C12136Q29628m45928
$$ plain form
13861 1291813 1508581 1219429 1216642 1128472 1260912 1306524 1194350 829678 1150231 1283051
13851 1283051 1023965 997073 1165067 1317775 1331655 1284706 578708 1061965 983997 1313525
13841 1313525 1024159 945105 862693 1030607 1213428 1174998 1066712 598598 888673 1032235
13831 1032235 859958 1161409 1156553 992701 1046222 934200 866813 862534 940966 919593 761130
13820 761130 648028 980552 930983 794735 936603 868926 1212827 1096318 575883 784293
13810 784293 583870 913771 715880 796088 542339 926298 630563 958309 743401 747257
13800 747257 941260 813391 666413 736584 601250 1058301 871368 1133726 963169 781294
13790 781294 656745 762092 715553 995018 957132 1008760 898453 312136 1141764 695836
13780F95836R7793O4141o8168J96600l80949P4550k67923K89473P7681Q9940l2235
13769H36739m964k20452J3668J34464J3005L57791m54218M08396k33451j20601
13759G30377O5012k05472R2131J80257k765l74529J27450k4137R500M12689q1613
13748I28900l57157J83551j85304J67493N7357K39845m76280j27716J89793o8732
13738E51750j7409K13184Q9724N2988k74598n0249j81354J4199J98717o7858k42307
13727B86787O13015R9707k34808L4510k45373j20241J07682J71924j44361l6608
13717E32234L77591m32644J60820L7980M12j77762J65292j37391O0254J70120
13707G56906j72554M0820k5491J72331l82596M18414p0710j1374C32499L77867
$$ plain form
13780 695836 793629 857770 789602 986202 605253 679803 411880 701353 779034 868974 836739
13769 836739 831775 611323 624991 759455 772460 1130251 676033 1084429 850978 730377
13759 730377 795389 589917 682048 862305 859540 485011 612461 588324 597824 1010513 928900
13748 928900 571743 755294 569990 737483 794840 1034685 558405 430689 620482 551750
13738 551750 534341 747525 837249 890237 615639 565390 384036 398235 596952 529094 286787
13727 286787 899802 999509 764701 799211 553838 433597 541279 713203 568842 532234
13717 532234 909825 477181 638001 675981 676393 498631 663923 526532 586786 756906
13707 756906 584352 625172 599681 772012 389416 807830 737120 725746 332499 710366
13697G10366k81921L80019C51332M20376j30121P5022J00857r7059B47457M13370
13687F60827k84864J48906k44132L98622j54053r1761K1803J27133K4120B82340
13676E42185o0958K10274A72181P0908N88151k94961k0030P9034B25143K14439
13666D39582q3196j8997L64161k39467J39097j5579l0878j55601j37217P2292
13656C34197L32614p329k95274L94761l62630K05555j03597J02284n7276A65823
13645E78332f5957E98127r9368A71837K29826j64832J05417P1477O1261m5199
13635D29787Q4005J99269C39144o147J61285P9501j92752j73410K75636M0839
13625E24096Q2901k06845m0543A52059K61290J9247k5674J91013A04940L87782
$$ plain form
13697 710366 428445 808464 351332 771708 641587 716609 817466 720407 247457 660827
13687 660827 375963 524869 280737 679359 525306 433545 455348 582481 606601 282340
13676 542185 481227 691501 172181 243089 831240 536279 516249 595283 225143 439582
13666 439582 356386 337389 701550 462083 601180 585601 554723 399122 261905 334197
13656 334197 666811 659482 364208 758969 396339 601894 498297 600581 543305 165823
13645 578332 -65957 598127 498759 171837 401663 236831 342248 413725 474986 429787
13635 429787 513792 713061 339144 332997 494282 573783 381031 207621 483257 524096
13625 524096 606997 400152 359609 152059 413349 432596 406922 597935 104940 492722
13615D92722J3364R9535M4314C922M61554J63445C09785K72866k75859j07011
13605A99781K71398j35828P8044l0263i2176B69450J44329L71648l51592q653
13595D25182A46554M15872k16925K54778j75702A65706L87983J1633j2899k65534
13585B86889R0020q5404K50411j52807p2006j0401j29500K98853j70506K02892
13575E08441M2233A94599K33039N3955q4551P3047A26318J21004J47584J31727
13565E26633G5624L3559K24842n6082N8604G1063N48885E1906K7230N8078K91912
13554D29126o3362J3461A16397K7768K14252n7914K216J80754o7228q1931r41
13543C33373f7373A26311L3764J35131q9207m9067J68253K65673J61061j77234
$$ plain form
13615 492722 506086 605621 649935 3922 465476 628921 309785 582651 306792 199781
13605 199781 471179 335351 413395 383132 -92176 269450 413779 785427 433835 425182
13595 425182 146554 562426 345501 600279 424577 165706 553689 565322 552423 286889
13585 286889 376909 291505 541916 389109 317103 306702 177202 476055 305549 508441
13575 508441 550674 194599 427638 481593 397042 470089 126318 247322 394906 526633
13565 526633 75624 109183 334025 277943 336547 71063 619948 51906 79136 137214 429126
13554 429126 365764 379225 116397 144165 358417 300503 302719 483473 416245 334314 333373
13543 333373 -67373 126311 160075 295206 205999 156932 325185 590858 751919 574685
13533E74685k67558A28498J89761K72770k58582c3880B42329J09745j52264R7925
13523B97735m09p0655K91414k45354N1815m0923H0465C4926L46096J13812b715
13511D55758j72531R2107j9496L3605r4760o5243L68484A50931J7578K38916j64999
13500B42426C7291j289k439O7060J69581L42307B20488K05785m5714j82076D4688
13488d9185D36350j27302o3553N9357o6887l1487K3654d8829F69627j81581m1180
13477D46866B10589D8425M21197k33609l5523L85482A72950M3178n4818Q6782
13467B48092r2729j2608K97432j53693L87521l32821J37891j44939j12251K88397
13457E10292d9917B75465L61438k43573q6054K8179n6569a6579B34098A7240J77140
$$ plain form
13533 574685 307127 128498 318259 591029 332447 -33880 242329 352074 199810 297735
13523 297735 297326 226671 518085 272731 324546 283623 80465 34926 381022 494834 -2715
13511 455758 283227 375334 355838 389443 294683 229440 597924 150931 168509 407425 242426
13500 242426 37291 36002 33563 100623 270204 612511 220488 426273 380559 198483 44688
13488 -49185 436350 309048 245495 304852 237965 206478 230132 -48829 669627 488046 446866
13477 446866 210589 48425 469622 236013 200490 585972 172950 216128 161310 248092
13467 248092 155363 142755 440187 286494 674015 341194 479085 334146 221895 510292
13457 510292 -49917 275465 636903 393330 307276 335455 278886 -16579 234098 17240 194380
13446A94380J60495A74837J68393e9668E30742B6582J23947a00498D27541M6845
13436D74386p0501g4200D48031A47959k7770J58801m3714J6848Q0877A5031K05204
13425B20235G37b62574A28030L5903J38945E23K4069K07094J41685Q4568A03027
13413F20765k45252j69108a9449E359J9143M06742j10337K16053B45161C5259
13402C19088j49490P962J95577A08894J71747k2627m7584J55335A51687R872J85677
13391C47236L4842j70475a3126A90408a0098E08257j90889j29426p1427C2898
13380a74010E07848j32697j47564j09889O8833K80922k30280J07994A18863J67517
13370B86380e397E7707J22748M55103C04572A35025C9693L72780a20720B59219
$$ plain form
13446 194380 354875 174837 343230 -59668 530742 26582 150529 -100498 427541 474386
13436 474386 403885 -74200 448031 147959 120189 278990 235276 252124 333001 15031 220235
13425 220235 737 -262574 128030 163933 302878 523 24592 231686 373371 457939 103027
13413 620765 375513 206405 -19449 5359 24502 431244 320907 536960 245161 35259
13402 319088 169598 177560 373137 108894 280641 258014 210430 365765 151687 161559 347236
13391 347236 382078 211603 -13126 190408 -10098 508257 317368 187942 116515 32898
13380 -174010 507848 375151 227587 117698 186531 467453 237173 345167 118863 286380
13370 286380 -5397 57707 180455 635558 304572 135025 39693 412473 -120720 259219
13359A50752K76389h6177B70502i5981G5235L48948A14536J33607K83525A1494
13348A91157J01164k6104J81143j95646L84914j86635m0969J5883M3706H7626
13337A73864L78082F5922B4472M2105M18566j89851j4738I56J90521O0158d0032
13325B51705k2250j073F5790A2515N05771k56719a42071B53295J04178A57696
13314B14917L0417j04545K71392b5717A97405b597C06433j22662F4711a44138
13303C90151n0870j57684J51835b4974B62458K62942A47207a8379C48255A2243
13292A4583L29508j13932J32598I1877c389j7398C161K14427h0533c8157A07767
13280B13862J77431A56051J4921D6543K07320J76737j48758A30272K15999b5508
$$ plain form
13359 150752 427141 -86177 270502 -95981 75235 424183 114536 248143 531668 11494
13348 191157 292321 266217 447360 251714 636628 449993 409024 424907 468613 87626
13337 173864 551946 65922 24472 66577 485143 295292 280554 956 191477 251635 -40032
13325 251705 229455 228382 65790 12515 518286 261567 -142071 253295 357473 157696
13314 214917 245334 140789 412181 -25717 197405 -2597 306433 183771 64711 -144138
13303 390151 339281 181597 333432 -24974 262458 525400 147207 -18379 348255 12243
13292 14583 344091 230159 362757 91877 -3389 -20787 3161 217588 -80533 -38157 107767
13280 213862 391293 156051 170972 46543 253863 430600 281842 130272 346271 -25508
13269a5169A78060a6910I2679M2937f6091B54179E6589d1327A54831K3231f7070
13257D76901K217I3362M5817K0020a16544q3803B21979k1527q4250J06530n3573
13246A69159o7008E0427i1970C3510e0371B01345K28513A03383P0017J9429J14770
13235C07599H2488Q2702G5424m208O6162c3893k09596B918K13715L6173L6606
13224B89412N8525H5315B8580K95681j8632k834d6984j7038b7890A01306k4912
13213G6394p410L65991A23143R0258B3789a02578E4906E85K67452H0520J90632
13202B71152M2489n4355h5908B08184I9770K21355A05784P4766B4560e651A16707
13190A15421J06368J32425A54862i4459B43380I8951i9006B7596K31603A22941
$$ plain form
13269 -15169 178060 -16910 92679 135616 -66091 254179 56589 -41327 154831 178062 -67070
13257 476901 479118 93362 139179 159199 -116544 -200347 221979 200452 116202 222732 169159
13246 169159 102151 50427 -91970 33510 -50371 201345 429858 103383 173400 192829 307599
13235 307599 82488 165190 75424 71216 137378 -33893 -243489 2918 216633 252806 289412
13224 289412 347937 85315 28580 324261 305629 302795 -46984 -64022 -27890 101306 76394
13213 76394 68984 434975 123143 213401 23789 -102578 54906 585 268037 80520 271152
13202 271152 313641 259286 -85908 208184 99770 321125 105784 180550 24560 -5651 116707
13190 115421 221789 354214 154862 -94459 243380 98951 -99006 27596 259199 122941
13179B30832b18035B11457b0145j22827q6247E2412f477G5738a20660r1887H9149
13167D26457A34136a50108B16070P088A07514K59799j11039c1137m3059A34297
13156a09158C53239A8202K71694d11531A38006K77542O0409k30696c0108k30275
13146b60383J15357c1396A17198R2493B4966L04470A60390k1303A0138K46750
13136B56888b3821C1319K84373A8773J99101h1020j09728b5209l5313m0315J7222
13125h3615F809L52529i5428G6610Q7945Q2013G2481J09213J32349b3162B92800
13113C26670B6278J04333M10418g626C79234h4493D29086k12641r5159K23538
13103C44824f620B46413O5703B898L76701i595A53383C5528M2194o691f2073n1835
$$ plain form
13179 230832 -218035 211457 -20145 -142972 -229219 52412 -6477 75738 -120660 -212547 89149
13167 426457 134136 -150108 216070 223158 107514 367313 256274 -31137 -74196 134297
13156 -109158 353239 18202 289896 -411531 138006 415548 475957 245261 -30108 -260383
13146 -260383 -145026 -31396 117198 209691 24966 329436 160390 139087 10138 256888
13136 256888 -23821 31319 315692 18773 217874 -81020 -190748 -25209 -60522 -100837 -83615
13125 -83615 6809 359338 -95428 76610 164555 246568 72481 181694 314043 -23162 292800
13113 326670 26278 130611 541029 -7626 379234 -84493 429086 216445 121286 344824
13103 344824 -6620 246413 312116 2898 379599 -9595 153383 35528 77722 71031 -62073 -113908
13091a13908A15016b5991B00769k2958K2856C7413a5629G1206a13058B99471l8257
13080B61214N4914c59B69495o5272H6583i924j52880A77270b31821B08433F5147
13068A82976m3876D5324L03599A08717f9465A40585B2894K98061o0648h8404B09553
13056B01672a08702E670K66491q3110Q4187D8918K11827J09121A26605C525J04180
13045A07705j5462k7574K11449j35123a04141A77841L05915j88413I3077Q0077
13035A73154J69521i6410b4543B5014a57932c6027A60371c5433A0220K04140J04181
13024C18541j36919K49731G9130J85074A0315J74386J28151o1220g160A48960
13013A52274i6394I1277J20864k6083k9271b18571C69831E6040L72955k06252
$$ plain form
13091 -113908 115016 -25991 200769 177811 200667 37413 -15629 71206 -113058 299471 261214
13080 261214 316128 -359 269495 204223 86583 -9924 -162804 177270 -231821 208433 65147
13068 182976 139100 45324 348923 108717 -69465 140585 22894 320955 260307 -88404 209553
13056 201672 -108702 5670 272161 189051 273238 48918 260745 369866 126605 3525 107705
13045 107705 92243 64669 276118 140995 -104141 177841 483756 295343 93077 173154
13035 173154 342675 -96410 -24543 25014 -157932 -36027 160371 -35433 10220 214360 318541
13024 318541 181622 431353 79130 264204 10315 184701 312852 251632 -7160 148960
13013 152274 -96394 91277 212141 186058 156787 -218571 369831 56040 428995 222743
13003B22743G2259P2052F1872j1004M6824M07181i3148j08353D753Q0153a70466
12991D02997b01960D27696j88767H112K68194H8194a06809A41530c9792j73009
12981b12801A55460c5683l88876c9248j54319m9341g158B72282a47232M2887o2911
12970a67256I0121j3162O7935M0085b79892e7474j53712A24365J49401H0600k7770
12959E2830e1985A3059A801L11853B3462a05198C11510d9207J7915l0349A31613
12947A88482a7085B28396C2448J50574a55195C49035j66229I0713K3949J97774
12937C12436N9598r4595a58155c3831F2461N8668a15496C76917g5160D4687J32999
12926A77686C7268a47261F7435J01936Q9086A16980b1120A69417Q7664j09594
$$ plain form
13003 222743 72259 144311 61872 50868 97692 504873 -93148 -201501 4753 84906 -170466
12991 402997 -201960 427696 238929 8112 276306 88194 -106809 141530 -39792 -212801
12981 -212801 155460 -35683 -424559 -39248 -193567 -242908 -7158 272282 -147232 -104345 -167256
12970 -167256 90121 76959 144894 184979 -279892 -57474 -211186 124365 273766 80600 52830
12959 52830 -51985 13059 1801 313654 23462 -105198 311510 -49207 -31292 -61641 131613
12947 188482 -17085 228396 32448 183022 -155195 349035 182806 90713 114662 312436
12937 312436 372034 277439 -158155 -33831 62461 121129 -115496 376917 -75160 44687 177686
12926 177686 37268 -147261 67435 169371 258457 116980 -21120 169417 257081 147487
12916A47487O0386K9971d8191B54145b19231B18371e5493A94516E2378b44243
12905A78300m0533K9110b42601C88558A70091c0019j46560B13396a49092B20665
12894B3340c0068B61680e7216j89231A59032n4492J7576b7758E00521E4686b06826
12882a57295O6088n7812B35918A5780K59267a26274A07517g872B71624j25849
12872A45775o2998c0727j40372c5407A49552L6360c7437A88458E4483k2475a50694
12860a11947C33758f8311j7220l987H9261K7397a47032d5662B1158a61987B4811
12848d0802a3255C25375M666h5052B87285a40630C38212g4267I3343L86511A89119
12836d4117A83303J12625j39728o4322K28917j20127C5116L1176A4733L79553
$$ plain form
12916 147487 207873 237844 -48191 254145 -219231 218371 -55493 194516 52378 -244243
12905 178300 137767 166877 -242601 388558 170091 -30019 -176579 213396 -149092 220665
12894 23340 -30068 261680 -57216 -246447 159032 104540 122116 -27758 500521 54686 -206826
12882 -157295 -91207 -149019 235918 15780 275047 -126274 107517 -7872 271624 145775
12872 145775 82777 -30727 -171099 -35407 149552 185912 -37437 188458 54483 32008 -150694
12860 -111947 333758 -68311 -85531 -89518 89261 116658 -147032 -45662 21158 -161987 24811
12848 -40802 -13255 325375 330041 -85052 287285 -140630 338212 -74267 93343 479854 189119
12836 -44117 183303 295928 156200 91878 320795 200668 35116 66292 14733 394286
12826C94286j48329a94802A9720L16592i1734p0593B56969c54655C31213b14546
12815G0635a41253A56060A2015d8712A31457E8931b08752N8663A64375l4952D5837
12803A13567N8216a18324M1513K5247I4669c8462A7171h9938G9053K20193A49428
12791h8679E811J52064a75527D989h4011A61689G4910j180C3798a04611F0186
12779B07708A4770K54990l3727F066L89484C4957d0059J1255k18938A38747c7912
12767d1342A81241F4542b7852j42618A43855J30154a2295D3430J73036a54823
12756A79929j1854A650J05832a63594C65166d1361B7406K07473a71059q166d4714
12744B73614n3714F5963b63181I5003L3397C5315L43224j56705j03583J891M3477
$$ plain form
12826 394286 245957 -194802 19720 336312 -91734 -162327 256969 -354655 331213 -214546
12815 70635 -141253 156060 12015 -48712 131457 58931 -208752 -150089 164375 129423 45837
12803 113567 171783 -118324 -76811 -51564 94669 -38462 17171 -89938 79053 299246 149428
12791 -88679 5811 157875 -175527 4989 -84011 161689 74910 73730 33798 -104611 60186
12779 207708 14770 269760 236033 6066 395550 34957 -40059 -28804 -247742 138747 -37912
12767 -41342 181241 64542 -27852 -170470 143855 274009 -12295 43430 216466 -154823
12756 179929 168075 1650 107482 -163594 365166 -41361 27406 234879 -171059 -179225 -44714
12744 273614 219900 65963 -263181 95003 128400 35315 378539 221834 118251 120142 163619
12733A63619C3304K83472H6504O5718c30633B32297j02425e6710f812I6294b4345
12721a14042b9637B06653P5949j8097j9389a89337A35072D14J9454K26837M6352
12710B93057g2590D2036K26062A07070Q775J00584N5976J4448D5802J17779D6408
12698a32620b2750A36438P8194p8561J8854h7080B39091A04103R1117O0229A67
12686C47550A44359b24766f4584G2709e9730A05665c7251m2178B19846J99353
12676D19199j06804H9085L21662k03768I3684J4078K5224g3262A20876f1939A64243
12664C0860d54419C36833g783D749b71490A71998F7883k0724K90666b56525A48651
12652f190j8399B00884I1467J47126J58227A0337J1567L11396b00385A29652J8699
$$ plain form
12733 163619 33304 316776 86504 152222 -330633 232297 129872 -56710 -6812 96294 -24345
12721 -114042 -29637 206653 282602 264505 245116 -189337 135072 414 19868 246705 293057
12710 293057 -72590 42036 268098 107070 115845 216429 272405 286853 45802 163581 46408
12698 -132620 -22750 136438 214632 136071 154925 -87080 239091 104103 195220 255449 167
12686 347550 144359 -224766 -64584 72709 -59730 105665 -37251 -79429 219846 419199
12676 419199 312395 89085 410747 206979 93684 107762 132986 -73262 120876 -61939 164243
12664 30860 -454419 336833 -7783 4749 -271490 171998 67883 47159 337825 -256525 148651
12652 -6190 -24589 200884 91467 238593 396820 10337 21904 333300 -200385 129652 148351
12641A48351K4315J30344A14312C3227f2873m8432b5771A81502p4898e3727C39589
12629c0244A34774L13118k04373m0325n1954R4778J34757A65145Q3954N7885A37326
12617g1910B91452a28212I7842J8103K56954a44925L7337A56072f3954A91370
12606D3990a14130n8724A3952J46929E3383O3412J53902F0854J00295g5223l62570
12595d37793C80613a88313A74739D386J35922d7445F1454L02548F1623K7360m76
12584H8507h0462l1374p8012Q8822H3258J097k2926K43472h2238K714G6695C7061
12571A67615K17291k9659A59487b01253A02309K28540g531j6249A25116a03280
12560D04693a50838j15377F391J72006h6303B45728d9328j51443E8511f3668B91858
$$ plain form
12641 148351 172666 303010 114312 33227 -62873 -111305 -25771 181502 106604 -53727 339589
12629 -30244 134774 447892 243519 203194 151240 246018 380775 165145 249099 306984 137326
12617 -71910 291452 -128212 97842 115945 372899 -144925 -107588 156072 -63954 191370
12606 43990 -114130 -172854 13952 160881 53383 116795 270697 60854 161149 -75223 -437793
12595 -437793 380613 -188313 174739 4386 140308 -47445 61454 364002 61623 88983 88507
12584 88507 -80462 -111836 -189848 -101026 83258 84355 61429 304901 -82238 -79524 76695 37061
12571 167615 384906 355247 159487 -201253 102309 330849 -7531 -23780 125116 -103280
12560 404693 -150838 -266215 6391 178397 -86303 245728 -49328 -200771 58511 -63668 291858
12548B19478c705D4672Q6175m2060j3641h658C68482H8518k805c3388A6473N1972
12536F8445l2468L1234a7758A35061b7241D2662J01570a85578E5067b47725p5437
12525c23162A15354J59590f7895A43239J70543d6812E0588L17415a55079A96041
12514H3670K15660d9023H6796C9123i3816C25348A4611f6317l80470C46683A9264
12502C7046J99039l0818p2030e0722A78833c17224I2618a17522M5631H9090R7721
12491A86811E4369J67939a30650j0898D7406J21606b88846C41831a27776E9817
12480a16573A28634J1929K589o3183K4411a91801j55488a38166A05464K10139
12470C15603f8491j41002B35047J26081H2214f0861B2443N7242j4443K88894b28316
$$ plain form
12548 219478 -3705 44672 130847 88787 75146 -8658 368482 88518 85713 -33388 16473 68445
12536 68445 35977 67211 -17758 135061 -27241 42662 144232 -185578 55067 -247725 -323162
12525 -323162 115354 274944 -67895 143239 313782 -46812 50588 368003 -155079 196041
12514 83670 299330 -49023 86796 39123 -93816 325348 14611 -66317 -446787 346683 19264
12502 37046 236085 205267 133237 -50722 178833 -317224 92618 -117522 -71891 89090 186811
12491 186811 54369 222308 -130650 -141548 47406 169012 -288846 341831 -127776 59817
12480 -116573 128634 140563 143152 79969 104380 -191801 -347289 -138166 105464 315603
12470 315603 -68491 -209493 235047 361128 82214 -60861 22443 79685 65242 354136 -228316
12458a16565n5903A37643f973C54808F0540b27538H4471K78492a98972A13052
12447A70405M528a67251q2837a05562p2075Q3194j71439B25709d0073I3486a28914
12435c08648J53366A65913i8042F5248R0882J1599b02366G3420J69231i9931j01231
12424b01162n912R6313F4678J80737r2285k8571J26519p8340n3207j3367d28562
12412A26945c4683A6396i7258A01538B1657r239Q8762J55166e9350H126a48523
12400a19929M9090n5675A88299e33034A21528e25724B7206a90464A78435B5561
12389a15878H4330K31918c47830M5231e9030j35185Q0159k09480A35687e3282
12378a42462j74838D7730P4026a12210A42310J13236g0478k2868c4367D5863b99385
$$ plain form
12458 -116565 -172468 137643 -6973 354808 60540 -227538 84471 362963 -198972 113052
12447 170405 174933 -167251 -250088 -105562 -177637 -94443 -265882 225709 -40073 93486 -128914
12435 -308648 -155282 165913 -98042 65248 156130 167729 -202366 73420 242651 -99931 -201162
12424 -201162 -207074 -110761 64678 245415 153130 124559 251078 172738 119531 106164 -428562
12412 126945 -34683 16396 -97258 101538 21657 12418 101180 256346 -59350 8126 -148523
12400 -119929 -70839 -126514 188299 -533034 121528 -525724 27206 -190464 178435 25561
12389 -115878 84330 316248 -347830 -302599 -59030 -194215 -114056 -323536 135687 -53282
12378 -142462 -317300 47730 121756 -112210 142310 255546 -70478 -93346 -34367 45863 -299385
12366G294a49106j67909B3076a46124F7553a52510a7349l545A586a7393C72296
12354B0359L49254J45819b27361r8897B97126l256i6240E0254c09060C46999F8112
12342F4993k1879c40091d4248k88238B64348A21166C7313q156J14679A6998M61029
12331D78027a4617G0442R4703B4361L17591n8424D3817b9561B71662n1141J03377
12320C23898h512k06013e4575A41374K9539c8234A24808K03103A17868K34109
12310C51977a22595I9274d14290A05543P3895B9994a11370O969B32142C5883f4014
12298c1425J2921A61950f5375B54366K47702a4551p9187o7409k31586F6734a74603
12286F9642J14957C9782K43471a91390C28665E1775b916C29960b61336B81743
$$ plain form
12366 7294 -149106 -317015 23076 -146124 67553 -152510 -17349 -20894 1586 -17393 372296
12354 20359 369613 515432 -227361 -326258 297126 293870 -96240 50254 -309060 346999 68112
12342 64993 43114 -340091 -44248 -332486 264348 121166 37313 29157 143836 16998 478027
12331 478027 -14617 70442 165145 24361 341952 283528 43817 -29561 271662 220521 323898
12320 323898 -8512 -214525 -54575 141374 170913 -38234 124808 327911 117868 351977
12310 351977 -122595 99274 -414290 105543 179438 29994 -111370 -104401 232142 35883 -64014
12298 -31425 -18504 161950 -65375 254366 502068 -14551 -93738 -161147 -392733 66734 -174603
12286 69642 184599 39782 283253 -191390 328665 51775 -2916 329960 -261336 281743
12275D98025b6185C78545m2174k1876j41968H2118J12219L3156J40055I5341J86423
12264B81764H9606B9378e5724C4104J14019c80485B07524a25171j01021j03201
12254c29393g4077B4455J65852a58018E46739H6678d5733D822c6789B14593J1203
12243B25796D9414g0662A57483a14030F0498n199k1191a5096A33092L0700e9372
12231A83222B5197P11709A64792P5414O7963H7532M22193d4187A94280J38197
12221C32477j17835D0539K23548m3681E4347J74279j10495b66391A10222R6215
12211B06437G0693A7508c6683B48717K42845G622J107J23278d3724G9168J09194
12200A88362L87893b64566C63262j70778r5926M62458A87152K97276A15962b58910
$$ plain form
12275 498025 -26185 378545 336371 314495 172527 82118 194337 227493 367548 95341 281764
12264 281764 89606 29378 -55724 34104 148123 -380485 207524 -125171 -226192 -329393
12254 -329393 -74077 24455 190307 -158018 546739 86678 -45733 4822 -36789 214593 225796
12243 225796 49414 -70662 157483 -114030 60498 55299 34108 -15096 133092 163792 -59372
12231 183222 25197 736906 164792 240206 308169 87532 509725 -44187 194280 332477
12221 332477 214642 40539 264087 220406 54347 228626 118131 -266391 110222 206437
12211 206437 70693 17508 -36683 248717 491562 7622 8729 132007 -43724 79168 188362
12200 188362 576255 -264566 363262 192484 96558 559016 187152 484428 115962 -258910
12189b09652G3052k4651g5103A50297E5803J83738N4108j37284J61297f5176J819
12178f3357B27432O7446B9973a41807d683F1104K56669n3340j1483J47015A40107
12166C59716k4641e3358I150g661j3540I9066J73000b4415B34746g6129A59438
12154D26892a49772A5470J75193a25490A0302K9911M8301a36776D5662K9764A4155
12142a64154C45114j40052F482i8406M7231A38980J83327A31348j6627f9214A51471
12130C15715a85883A88792b2034j15139A89271b32220O5058j38696F7917J48304
12120B16221a06632B36904e9895A48575D2450a0983A29263h0750H1322g1166j09361
12109a80527P9644q583q7192M6746J3101c763j01707C71375A25619e4773A55757
$$ plain form
12189 -209652 73052 48401 -75103 150297 55803 239541 293649 156365 317662 -65176 -63357
12178 -63357 227432 294878 29973 -141807 -4683 61104 317773 264433 252950 399965 140107
12166 359716 335075 -53358 9150 -7661 -21201 99066 272066 -24415 234746 -76129 159438
12154 426892 -149772 15470 190663 -125490 10302 40213 88514 -136776 45662 75426 14155
12142 -164154 345114 205062 6482 -98406 -51175 138980 322307 131348 114721 -69214 151471
12130 315715 -185883 188792 -22034 -137173 189271 -232220 -167162 -305858 67917 216221
12120 216221 -106632 236904 -59895 148575 42450 -10983 129263 -80750 81322 -71166 -180527
12109 -180527 -100883 -109466 -196658 -149912 -136811 -3763 -105470 371375 125619 -54773 155757
12097a84996n1817B7061b10387D6113p777i6705B63314b90046A42593a36706E8933
12085f3936k07840D0124e6945K2955j410H9631J18862M30157J390035J44683E82857
12073F84396l03186A59241L2538n2733F4235P0441l0964c0960l29929C16149A29424
12061b07820B01131A7719J6623O8244a28884e1063C3841J31626J84171a44963
12050b68711J6628D1659c1375B79441c21020j9798a29056B49783c40135H2645
12039a66510l5013c8993k32878f3600A51207e7962J3538C04318a20866E7804N638
12028F3442P7398l9538j9686O739i4512A03017G285h0097c4391F4318d72442B84115
12015d9614D0784g7925k26213Q0917A40539a6999G9476b46109F9467a455E6069
$$ plain form
12097 -184996 -236813 27061 -210387 46113 38336 -96705 263314 -290046 142593 -136706 58933
12085 -63936 -271776 40124 -56945 -33990 -35400 89631 208493 638650 2028685 2173368 582857
12073 684396 381210 159241 191779 139046 64235 134676 103712 -30960 -360889 316149 129424
12061 -207820 201131 17719 34342 102586 -128884 -51063 33841 165467 349638 -144963
12050 -268711 -252083 41659 -31375 279441 -321020 -340818 -129056 249783 -340135 82645
12039 -166510 -201523 -38993 -271871 -63600 151207 -57962 -44424 304318 -120866 57804 63442
12028 63442 140840 101302 81616 88355 -94512 103017 7285 -80097 -34391 64318 -472442 284115
12015 -49614 40784 -77925 -304138 -223221 140539 -16999 79476 -246109 69467 -1455 56069
12003A54946c48189B59383c5856C19952c50338J59370I6248d9783j37399q3862
11993b71044A2870L14186l0688H1337b10791B0577L2749e2856I9305i3910n1544
11982a45454G7555K6172e4198k31282b0839F3257R6971O7811d809H1978O2932
11971A44910J35522O2997g0835n3915c4141r237k30033a14220B5438c72761h0723
11959B05748c36781B2875a20804A21068J95252b55B1499j946n479a55887O4970
11948i0917A23491K6724b52300J1976D1093a02727A54173J24738a10298I7570
11937d820B32483c6131k38507F470b43289B6997Q023d74846B04776J42199A08380
11925C79652A81160a27046B3367a87187A53360L9400E9106Q0405l8488K45683
$$ plain form
12003 154946 -348189 259383 -35856 319952 -350338 -190968 96248 -49783 -187182 -271044
11993 -271044 12870 327056 296368 81337 -210791 20577 53326 -52856 99305 -93910 -145454
11982 -145454 77555 103727 -54198 -285480 -20839 63257 160228 228039 -4809 81978 144910
11971 144910 280432 343429 -70835 -124750 -34141 -43378 -273411 -114220 25438 -372761 -80723
11959 205748 -336781 22875 -120804 121068 316320 -255 21499 19553 14074 -155887 -90917
11948 -90917 123491 150215 -252300 -240324 41093 -102727 154173 278911 -110298 97570
11937 -4820 232483 -36131 -274638 6470 -243289 26997 35020 -474846 204776 346975 108380
11925 379652 181160 -127046 23367 -187187 153360 192760 59106 139511 101023 346706
11915C46706e8510o2880n5953g5151b7898p3816l2104d2977J8041B42246H6003
11903D8001Q6027i3604A92040j2709K4937q7688J40077j21374c4267o0337A04269
11891B75019a3275k92306a50210J206j65499b7039A9648c24858R7831i3183r3048
11880a86231B21135K35037C612c8687j28683j19120A456g76A65147p1560J78620
11869B72207a68232j47340A87284C4618J11661a44246B8008b81385A18284A3373
11858D5989O8560g8415a6323C10795a39558G2458Q2660a01671A5602a51768f4389
11846C82435b64153a12130k8664q0502A44214B9222J24271a32394B80601A7495
11835c88079C99780g0791j02826D1592a11275j2206A3570b35978P1049M6911c2311
$$ plain form
11915 346706 -58510 -121390 -177343 -75151 -27898 -101714 -133818 -42977 -24936 242246 86003
11903 48001 134028 -93604 192040 179331 204268 116580 256657 135283 -34267 -94604 104269
11891 275019 -13275 -305581 -150210 -149004 -314503 -27039 19648 -324858 -227027 -93183 -186231
11880 -186231 221135 456172 3612 -38687 -167370 -286490 1456 -776 165147 93587 272207
11869 272207 -168232 -315572 187284 34618 146279 -144246 28008 -281385 118284 13373
11858 45989 114549 -78415 -16323 310795 -139558 72458 155118 -101671 15602 -151768 -64389
11846 382435 -264153 -112130 -140794 -221296 144214 29222 153493 -132394 280601 17495
11835 -388079 399780 -70791 -173617 41592 -111275 -123481 13570 -235978 -164929 -118018 -32311
11823e2160F2785M6343m4401a65346E4543J48317d4122A9100o462d04655E773
11811C8331b1419j88858N9897h083j54914p9553E2457j3991i7759A70920Q9438
11800B60358b1792G6471K43222e5164m2992c6675l77948a7716C98694A76654p7799
11789I8855O1269h5704J009C2865a27913C05731a55437d4755n0184d3420J7850
11778b5570B0567J75700n2758j5658A2960K01058b3547f76o6953j69775I4518
11766C31900C6961j5898a19652L3881p1526A03187c0195k7546B867L7477d6222
11754a34117j01184g1442j7497l2957c7518m4430o4252A9249i476l79308l1794
11743d20578A63670b50342a17212d8698A62420a59766f7436j21852B08299p8442
$$ plain form
11823 -52160 62785 109128 64727 -165346 54543 202860 -44122 19100 12638 -404655 5773
11811 38331 -21419 -210277 -150380 -8083 -162997 -242550 52457 38466 -97759 170920 260358
11800 260358 -21792 76471 319693 -55164 -98156 -36675 -414623 -17716 398694 176654 98855
11789 98855 160124 -85704 -84695 32865 -127913 305731 -155437 -44755 -94939 -43420 -25570
11778 -25570 20567 196267 143509 127851 12960 214018 -23547 -676 -67629 -237404 94518
11766 331900 36961 21063 -119652 -85771 -157297 103187 -30195 -57741 2867 40344 -46222
11754 -134117 -235301 -71442 -88939 -121896 -37518 -81948 -146200 19249 -9476 -388784 -420578
11743 -420578 163670 -250342 -117212 -48698 162420 -159766 -67436 -189288 208299 129857
11733A29857R036h3730D150J50299J4176N8630E7966o976a21799B19351a31641
11721A87177d0289J7607C44554B2519K25948c03763a677A25275i6071A1741g5766
11709A66770n8855b19330I3647J6928a9211j19559A9127J416K6549K72826A11868
11697E6797a72347h2681p9717B11764J31561g8442p1253B15419n8235J9145D7649
11685A39751O7138I5086e4298B18067c3460j43643E3956J13952p1049a40675j77071
11674c17746H4008O9976d5372D51801A35776g6069A31641c5890D29a21455b8032
11662f131A5373J7399a3737A72723q1837L03505H2106J61856c06900c7199C7008
11650F1968a02749k04692H1075J43151q1493l1026D9349b8069A21140J8963c1039
$$ plain form
11733 129857 138893 -83730 4150 154449 168625 227255 57966 50990 -121799 219351 -131641
11721 187177 -40289 -22682 344554 22519 248467 -303763 -1677 125275 -96071 11741 -75766
11709 166770 107915 -219330 93647 110575 -19211 -138770 19127 20543 47092 319918 111868
11697 56797 -172347 -82681 -162398 211764 343325 -78442 -149695 215419 157184 176329 47649
11685 139751 206889 95086 -54298 218067 -33460 -177103 53956 167908 96859 -140675 -317746
11674 -317746 84008 153984 -45372 451801 135776 -76069 131641 -35890 429 -121455 -28032
11662 -6131 15373 32772 -13737 172723 90886 394391 82106 243962 -306900 -37199 37008
11650 61968 -102749 -307441 81075 224226 142733 111707 49349 -28069 121140 140103 -31039
11638b466k83315A13394C7503h8302k18920B68577A25641m2783K80512j31800
11628B31570q2862J15913H2037c5124a668j40437C06419e3747E865i0883A1140
11616i3083k58647B4783i7477A44116b45379c7095k8630b5010B20061b12801c7215
11604C06484I1257a33059r4142E4030J6009B8594a85436A39285D6981P3342a33910
11592B55561d0070j33564c5885A75971H1326N9705b3799I3850m5541j1923K13077
11581B49463f43A59270M8255o6196O0563l4043A276L54892O7257A55805o8858
11570H6947a65089n4994B11908e6045b7769l6274a795A92139c7705B68270A28655
11558i3866E3576K15719h7198C7075K01513p7033K2746e4439D71807b08916m2451
$$ plain form
11638 -2466 -285781 113394 37503 -88302 -307222 268577 125641 82858 363370 231570
11628 231570 148708 264621 82037 -35124 -1668 -142105 306419 -53747 5865 -90883 11140
11616 -93083 -351730 24783 -97477 144116 -245379 -37095 -65725 -25010 220061 -212801 -37215
11604 306484 91257 -133059 -227201 54030 70039 28594 -185436 139285 46981 120323 -133910
11592 255561 -40070 -173634 -35885 175971 81326 141031 -23799 93850 48309 36386 249463
11581 249463 -643 159270 207525 141329 201892 167849 1276 356168 423425 155805 86947
11570 86947 -165089 -220083 211908 -56045 -27769 -64043 -1795 192139 -37705 268270 128655
11558 -93866 53576 269295 -87198 37075 238588 161555 184301 -54439 471807 -208916 -251367
11547b51367A46395J44151p1433l7422E5305K6763b2940E24728j17059a79835
11536b37456C27381h2213B4916a46777a0198B34596K06226A81759O8771J10621
11526C61151A80412k6448d8063B48285K54517b39343D54369i5419B4181c7128
11515B36663l0821k7687o2538J5822c5015B03519A0944a63121g2695F8409a2863
11503a16203E9305N7143J0954B188N4287J39459b7273C12843A22414O7382a03419
11491H7323b12298f3057B68630a33055A97703a02255I7389h4314A36090J7328
11481A53418J1251F2192M5130A2934L6181K36398k9063R5274K12605d4042A19334
11469A73112F7737L20497d1016D31037j91351j09450R3532H0491a86399B02188
$$ plain form
11547 -251367 146395 290546 219113 181691 55305 82068 -22940 524728 407669 -179835
11536 -237456 327381 -82213 24916 -146777 -10198 234596 440822 181759 250530 361151
11526 361151 180412 153964 -48063 248285 502802 -239343 454369 -95419 24181 -37128
11515 236663 205842 178155 115617 131439 -35015 203519 10944 -163121 -72695 68409 -12863
11503 -116203 59305 116448 127402 2188 56475 195934 -27273 312843 122414 189796 -103419
11491 87323 -212298 -63057 268630 -133055 197703 -102255 97389 -84314 136090 153418
11481 153418 164669 62192 107322 12934 49115 285513 256450 351724 564329 -44042 119334
11469 173112 67737 388234 -41016 431037 239686 130236 223768 80491 -186399 202188
11458A94275b85621G9108d6925J4537B02422E2308O7549M6835J19900g3910j73754
11447b47664H8970L2182h727A26733D9483J28045H6618D3108Q6383n3014k7518
11436D8959J42500o47F784O9882e2535H9926H970a3477k29032A98156H7570b6289
11423A4043a592l1834B94735b7303o531l7311j53229A49542b59010b5065C1058
11411C55162j00211a49633F431k778i7180o1582L4795N6963A77982G6773k4922
11400E1851J86872D7086K68783b67130C01622c51538a11591B94586A880e7652
11389c8785A68551k222D6411k0587a78065Q7096A01421b9068H6668e4850A6704
11377g2373B34534I0743K9044g5511A08811B2392a73591C3110O6732J63655b6307
$$ plain form
11458 194275 -285621 79108 -46925 -32388 202422 52308 119857 166692 286592 -73910 -247664
11447 -247664 88970 121152 -8727 126733 49483 177528 86618 43108 129491 76477 48959
11436 48959 191459 190812 6784 76666 -52535 89926 8970 -13477 -242509 198156 87570 -26289
11423 14043 -1592 -33426 294735 -27303 -33834 -71145 -224374 149542 -259010 -25065 31058
11411 355162 254951 -149633 6431 3653 -97180 -158762 -123967 -67004 177982 76773 51851
11400 51851 238723 47086 315869 -267130 301622 -351538 -111591 294586 1880 -57652
11389 -38785 168551 166329 46411 25824 -178065 -90969 101421 -29068 86668 -54850 16704
11377 -72373 234534 90743 119787 -75511 108811 22392 -173591 33110 99842 263497 -26307
11365b11566A53057a88032A06292a22869C49594a9457l76747C6882P8240g1195
11354c31705h9425A1755J8184J09J6396K4209a42193j680B44962E637P4246K53191
11342C33074b85593g0745k1631A24033j8976a38726N5345A75521d3310a811p3587
11331g5398A03249N7850C210Q095O8923c10465a37833A24087l2429R2514F69J07316
11319A07985h3838D06518A33301D1501h1090a6466H1647e0065F5703b19822E0911
11307c7793A15113D9969j5553J31801m9242a31408A12773a96865l4316B40204
11296A38988F8026J34573a60032g0392H950J43273J30150A38931a61867k576L3527
11285a30916A77705b11069A15376K2792h8460D85324e0947k1124a8434k96948
$$ plain form
11365 -211566 153057 -188032 106292 -122869 349594 -19457 -396204 36882 115122 -71195
11354 -331705 -89425 11755 29939 30048 46444 70653 -142193 -143873 244962 5637 79883 333074
11342 333074 -285593 -70745 -92376 124033 105057 -138726 -83381 175521 -43310 -1811 -75398
11331 -75398 103249 161099 3210 11305 80228 -310465 -137833 124087 91658 184172 669 107985
11319 107985 -83838 406518 133301 41501 -81090 -16466 81647 -50065 65703 -219822 50911
11307 -37793 115113 49969 34416 166217 116975 -131408 112773 -196865 -231181 240204
11296 138988 68026 202599 -160032 -70392 8950 152223 282373 138931 -161867 -164443 -130916
11285 -130916 177705 -211069 115376 138168 -88460 485324 -50947 -72071 -18434 -315382
11275c15382J23838B6901e744j08385M5792q5021F2693J1666a6431j47733m0372
11264b04536N4726B24557a27958d4931m0107B28937b5935k1073J8587m1119A39393
11252a28271B70575D4609c78906a50056A71618g6173b8108l97449b7176B62034
11241d27842I8317n462i1589j88429E0758J10584a0604m08964R2292B64030b16463
11229A69427a85C40966a47310p3319D5983a3985l4665F5908P8175b37853A68082
11217a64179j02011d1229k6668C54366e36584A07558c7237B75634i6300D5718
11206a66191k13868M317a40030d4621G8700B354J19287J7308D1716K75742b06196
11194a00055A87008c09672B33284p9263g4454J5378k05842B3991b09002d7661
$$ plain form
11275 -315382 -191544 26901 -5744 -114129 -68337 -153358 62693 74359 -16431 -164164 -204536
11264 -204536 -149810 224557 -127958 -44931 -85038 228937 -25935 -47008 -28421 -69540 139393
11252 -128271 270575 44609 -378906 -150056 171618 -76173 -28108 -425557 -27176 262034
11241 -427842 98317 92855 -91589 -280018 50758 161342 -10604 -419568 -327276 264030 -216463
11229 169427 -185 340966 -147310 -220629 45983 -13985 -48650 65908 144083 -237853 168082
11217 -164179 -266190 -41229 -67897 354366 -536584 107558 -37237 275634 -96300 45718
11206 -166191 -380059 -375742 -140030 -44621 78700 2354 121641 138949 41716 317458 -206196
11194 -100055 187008 -309672 233284 154021 -74454 -59076 -264918 23991 -209002 -47661
11183A14755a38061D8488Q1903a14133C6062b37780b6971k44155h0808D2318A8034
11171e61282a55016E0770A8500a02056r4178A56293N4515b9627C8186g993n8924
11160f6917k05399G9778J92117b16668P3210D51202c8580a0577j57244b2324r7454
11149a19778H0849h5069l82481K15354o817j36294a83390c6360n0405A29310a83124
11137b88220a03144j25651O2924d3798B99454L1715E607J14527c19939a3894B0411
11125a24696l2076l3188B66710A28487b01417E407J93928M3510L0466b00011C4688
11113D1594K48419G3396K22802b34352B01182Q5175j28739E3073L0145l2127J67856
11102B18947e6289B60215A13331P9467l6049J72331G8769c51009A69832J41182
$$ plain form
11183 114755 -138061 48488 130391 -114133 36062 -237780 -26971 -271126 -80808 42318 18034
11171 -561282 -155016 50770 18500 -102056 -196234 156293 210808 -29627 38186 -7993 -66917
11160 -66917 -272316 79778 271895 -216668 -143458 451202 -38580 -10577 -167821 -22324 -119778
11149 -119778 80849 -85069 -467550 -252196 -259013 -395307 -183390 -36360 -86765 129310 -183124
11137 -288220 -103144 -228795 -165871 -43798 299454 331169 5607 120134 -319939 -13894 20411
11125 -124696 -156772 -189960 266710 128487 -201417 5407 199335 242845 273311 -200011 34688
11113 41594 290013 73396 296198 -234352 201182 286357 157618 53073 83218 51091 218947
11102 218947 -56289 260215 113331 192798 156749 329080 78769 -351009 169832 311014
11092C11014h0211A44515J09981p1905H8665J86090m8816n5827N2176J13239A21350
11080B34929j8774B0682K36383j9532N2544L50518B89999A21118K53262L7997
11070D12377A32514K71755J96693B94734J36936A36395K61425R4234j06078J57895
11060E43871m1507K26247j03249J03311j02857j60438R4687j49024M75647l39467
11050E47221N4052J14398K91485k26169k57519L50862l37251K22214j04747M4350
11040F98896Q0344q997M31456E53091J92563J35997D29085J84591k6874R9205
11030F86007P823P0061J44474q1049L33002m90768J56916q8027J82101j77192
11020G43348C31363K64493q4099L864K8566L93091j90100j67060J7270k80066
$$ plain form
11092 311014 -80211 144515 254496 182591 88665 274755 225939 170112 222288 335527 121350
11080 234929 216155 20682 257065 237533 290077 640595 289999 121118 374380 412377
11070 412377 132514 404269 600962 294734 431670 136395 397820 492054 385976 543871
11060 543871 502364 728611 625362 728673 625816 465378 560065 411041 886688 547221
11050 547221 601273 715671 1007156 780987 523468 874330 537079 759293 654546 698896
11040 698896 779240 770243 1201699 553091 745654 881651 429085 613676 586802 686007
11030 686007 693830 763891 908365 827316 1160318 669550 826466 738439 920540 743348
11020 743348 331363 595856 511757 515621 544187 937278 747178 580118 597388 317322
11010C17322L71853q1935o196p3355K59759j13486k35093k9342J64759J96158
11000G70444j66833J9184J69554j69957j65193O13545m98484r7243N32577K8914
10990A036508j18875j91415O5097M36903k24336k45229M39905j90346k11910L96978
10980A193280J6892O6221P4270L44837n3221N21614j47542M43115M49160k61033
10970B647593K23616L14193m38661o1437m05543j77715k16199l25460k3749M85767
10960B022405l22092K08535k21041P0628Q5187j7173k04917k93041L84318o24438
10950A088371j12267r7249k44487M4647j96984J7464K0546l9261p5632A63156
10939A4316K63397G5704a37314D8597P3476f4423B98417j01692a77133A65404
$$ plain form
11010 317322 689175 607240 601044 527689 787448 673962 438869 409527 574286 770444
11000 770444 603611 622795 792349 622392 457199 1070744 572260 475017 1007594 1036508
10990 1036508 917633 726218 791315 1228218 1003882 758653 1198558 1008212 796302 1193280
10980 1193280 1210172 1276393 1350663 1695500 1642279 2163893 2016351 2459466 2908626 2647593
10970 2647593 2871209 3185402 2746741 2685304 2279761 2102046 1885847 1560387 1536638 2022405
10960 2022405 1700313 1908848 1687807 1758435 1843622 1826449 1621532 1328491 1712809 1088371
10950 1088371 976104 878855 634368 679015 482031 499495 520041 480780 405148 163156
10939 14316 277713 75704 -137314 48597 122073 -64423 298417 196725 -177133 165404
10928b6751j54518F9943c4575A04619B0032a45774C02621D6474P2184a58180k25327
10917c83507B14312H6468b4184G423c05674A64234D1226a25482C8564K11564b45127
10905C05898D7632e1164m182H74e3883A4829c38995a8563G4512J09172Q8734h6050
10892F327P0160A8583a18446g199B1163d1082j7890j81199R0093M5856B88671
10880D378b26724q5350J49895A69560d6909p0764M3950l8518j92749b7013k24931
10869b51944G727a07816j1002j76478E1545b5512j69190N8821A16001b94409H975
10857F580g7153l73946D37989j89646A23906E1945h189j04162o0469C33430a23814
10845f7393q117c879B28167a28260A29916J6624J18478c10688B2846c06140a04082
$$ plain form
10928 -26751 -181269 69943 -34575 104619 20032 -145774 302621 46474 118658 -158180 -383507
10917 -383507 214312 86468 -24184 7423 -305674 164234 41226 -125482 38564 250128 -245127
10905 305898 47632 -51164 -55346 874 -53883 14829 -338995 -18563 74512 183684 272418 -86050
10892 6327 76487 18583 -118446 -7199 21163 -41082 -58972 -240171 -150078 -104222 288671
10880 4378 -226724 -312074 -162179 169560 -46909 -117673 -73723 -112241 -304990 -27013 -251944
10869 -251944 7727 -107816 -118818 -295296 51545 -25512 -194702 -135881 116001 -294409 8975
10857 6580 -77153 -451099 437989 248343 123906 51945 -8189 -112351 -172820 333430 -123814
10845 -67393 -75510 -3879 228167 -128260 129916 146540 265018 -310688 22846 -306140 -104082
10833C6646O9785i7659A16461c02705J1241P4658C7244a30491I2147L4575m9301
10822G7421J4141b96344c4682H2117b78849B4988e2975i181A80804a70414l5A65825
10809e8100a620B06852Q7442a36754P994m8356p3854A13368B1164b40251J11003
10798a29248a2116A39161o6545a1825B88578r572A01666a50072e9701j15970h2073
10786h0087b1646J0509D9135N6824k9727a81264J5870j77939a55203B07899i882
10774A98441H4082g410B61236d07783B32946C0995a61165B52465j24164N1310
10764A79611a71207Q070M6111C33092B352L9822O7478b49724D6967c04306a6169
10752G9678M6421C9281e0717B06593c22536a36427G0370a54075A34946b57914
$$ plain form
10833 36646 106431 -97659 116461 -302705 -291464 -216806 37244 -130491 92147 126722 77421
10822 77421 91562 -296344 -34682 82117 -278849 24988 -52975 -9181 180804 -170414 -170449 165825
10809 -58100 -1620 206852 294294 -136754 -128760 -177116 -250970 113368 21164 -240251 -129248
10798 -129248 -12116 139161 72616 -11825 288578 279006 101666 -150072 -59701 -175671 -82073
10786 -80087 -21646 -11137 49135 105959 76232 -181264 -165394 -343333 -155203 207899 -9882
10774 198441 84082 -7410 261236 -407783 232946 30995 -161165 252465 128301 179611
10764 179611 -171207 -163137 -117026 333092 2352 42174 109652 -249724 46967 -304306 -16169
10752 79678 126099 39281 -50717 206593 -322536 -136427 70370 -154075 134946 -257914
10741b92152i9006K1612J4698j49398p5741Q1400d7292F6248R1197p0052A6913
10729g7989A45015a79091F8656B6575O7998Q652Q8140A9071j231f3348B17695
10717b84102a07862j63086j68646J40524r5461F4057b18530B9541j2829O2868
10707G9580d5915l27083B04773b434m0747q2508A61795G4231e15371c9160E9099
10695I5287b5426j27240E972J12604J80614b60853H1585g7850k02B83727h8309
10683e1336j41021M2342n225p247P5233A26216a88343b4418j87367h8603a0389
10671E6068P6270J29656g1700A40644c7202A0482c19544B26129b17745l41511
10661e59256A69132l733L6837a13624M0764B3724b41924b1209l159l25426k86474
$$ plain form
10741 -292152 -99006 -77394 -62696 -212094 -287835 -206435 -47292 66248 157445 87393 16913
10729 -77989 145015 -179091 68656 26575 94573 103225 191365 19071 17840 -63348 217695
10717 -284102 -107862 -270948 -439594 -299070 -394531 64057 -218530 29541 16712 79580
10707 79580 -45915 -372998 204773 -2434 -43181 -125689 161795 74231 -515371 -39160 59099
10695 95287 -25426 -152666 5972 118576 299190 -260853 81585 -77850 -78052 283727 -88309
10683 -51336 -192357 -150015 -155240 -162487 -87254 126216 -188343 -24418 -211785 -88603 -10389
10671 56068 132338 261994 -71700 140644 -37202 10482 -319544 226129 -217745 -559256
10661 -559256 169132 165399 202236 -113624 -72860 23724 -241924 -21209 -24368 -349794 -636268
10650f36268b69784A47089j7868b9833m9381o9240o1760h6975a6692k02590b6690
10638A31327E3978a90841N1853j20151B34107a34047p7022i265C41303g9609B36029
10626b82877J38226K9345b1399A56760n676a74698A5940a4756j78644c6686H7198
10614c3195H866b20433E5392c32364j10657f2106j0541l18168A28030a32714J8110
10603a14604j04352k2211e7053B14825b81697b2690r1604L6383j58946j21798
10593c58655a13764J0799p5702p1810B7749L02892a25456b5968k00030f5251l5206
10582a00457K6021A44368G1697A4981a83244C066J13189a28923A32860A1714b85635
10570a80060c9250m6476F9208d41393I7669J82975a63928B19267a93093N1068
$$ plain form
10650 -636268 -269784 147089 129221 -29833 -79214 -148454 -210214 -86975 -16692 -219282 -26690
10638 131327 53978 -190841 -138988 -259139 234107 -134047 -211069 -9265 341303 -79609 236029
10626 -282877 -144651 -115306 -21399 156760 151084 -174698 15940 -14756 -193400 -36686 87198
10614 -33195 8866 -220433 55392 -332364 -443021 -62106 -72647 -390815 128030 -132714 -114604
10603 -114604 -218956 -241167 -57053 214825 -281697 -22690 -114294 -77911 -236857 -358655
10593 -358655 -113764 -102965 -178667 -250477 27749 330641 -125456 -25968 -225998 -65251 -100457
10582 -100457 -74436 144368 71697 14981 -183244 3066 116255 -128923 132860 11714 -285635
10570 -180060 -39250 -85726 69208 -441393 97669 280644 -163928 219267 -193093 -142025
10560a42025I6164B6199K31352c3167q6235B09317h2889E4834a48360A79111a33463
10548B55239b81104a22281k02011c0762A17635a0947j24661K34m4292D0600j1128
10537B9472a86024d2133j49642A48805a93858j31728F43c1117d435k05075A3460
10525B35095b84523H9723J06302o1073b8583j45566A03783a7559o8826k3449b3117
10513H1223c0993f237C8564D220a58068k92146a75907M2596b9554k19072A37463
10501B65130A13438M7874k707A6069M0347a96077m8136a14621B7413b06569C6197
10489e3419J2323B17420J1646A3939K65965H9377J53645K8356q9671K60676J42735
10478E85118A24723M20685J29493a7186A0099h4409o0008C7576b60509f918I4247
$$ plain form
10560 -142025 96164 26199 257551 -33167 -119402 209317 -82889 54834 -148360 179111 -133463
10548 255239 -281104 -122281 -324292 -30762 117635 -10947 -135608 -135374 -179666 40600 29472
10537 29472 -186024 -42133 -191775 148805 -193858 -325586 643 -31117 -4435 -209510 13460
10525 235095 -284523 89723 196025 134952 -28583 -174149 103783 -17559 -86385 -109834 -23117
10513 81223 -30993 -6237 38564 4220 -158068 -450214 -175907 -133311 -29554 -248626 137463
10501 265130 113438 161312 158605 16069 56416 -196077 -244213 -114621 27413 -206569 36197
10489 -53419 -41096 217420 229066 13939 279904 89377 243022 271378 181707 442383 585118
10478 585118 124723 545408 674901 -17186 10099 -84409 -144417 37576 -260509 -6918 94247
10466c61827D25990a42142D5825d18116c2750I4307K019c40407J54499O3568I9937
10454b8086j36623h2063A96820b13354I9400b8834C8838A5224a6404I5212b30419
10442B9808O0549L55612A33544C2144L5506P8156a7252k33029F2990g3664D3816
10430F1800o039b15867K6038N8464B82810a35738A00801A0461b89019d8758o3503
10419a12261E6904d3194B82034g7382A5999L5731a4603A89960I1785J38423b71709
10407C42584e18871H1981a01793G2160d9309m4034K910r4240g4877F2396d3963
10395A64097a61567A52995K12004B9290a35194H8388c1234B65601M055d3464C50515
10383I2693b4465A51189C8543K86751j43123J37949J06391j80065q8454L4306
$$ plain form
10466 -361827 425990 -142142 45825 -418116 -32750 94307 96326 -340407 -185908 -122340 99937
10454 -28086 -164709 -82063 196820 -213354 99400 -28834 38838 15224 -16404 95212 -230419
10442 29808 90357 445969 133544 32144 67650 145806 -17252 -250281 62990 -73664 43816
10430 61800 55761 -215867 -189829 -131365 282810 -135738 100801 10461 -289019 -48758 -112261
10419 -112261 56904 -43194 282034 -77382 15999 51730 -14603 189960 91785 230208 -271709
10407 342584 -518871 81981 -101793 72160 -49309 -93343 -90433 -184673 -74877 62396 -43963
10395 164097 -161567 152995 364999 29290 -135194 88388 -31234 265601 269656 -43464 350515
10383 92693 -24465 151189 38543 325294 182171 320120 426511 246446 157992 192298
10373A92298k4836L25940B6399K47226k4004P5015A51541P28249l36773L0736
10363E73753J7292B93784m4259J02914o2218k5668P4022I9825l0973J81873L3237
10352B83962j10638M41861r9020J35976N4908j56000B50099O7489m5703J67721
10342D39606A80477l1423J37733j42890J58354A10725J67068G5474B8135b9282
10331B24287j08402B9520I816L24432b584j20656A81469i5288j4601B62576J675
10320B64251c3123a215A818J03176a36713B92032P7444D3818O1203i4039B14952
10308A41515g6707E8459K83644j45273a837G8819L82354D361e8581B3173j398
10297B1775b59074C9284N9569K10011a95912B55361A00939a75073p567j60382
$$ plain form
10373 192298 167462 493402 26399 273625 249621 324636 151541 879790 543017 573753
10363 573753 591045 293784 249525 352439 290221 264553 338575 99825 68852 250725 283962
10352 283962 173324 615185 516165 652141 707049 551049 250099 317588 271885 439606
10342 439606 180477 149054 286787 143897 302251 110725 277793 75474 28135 -29282
10331 224287 115885 29520 9816 334248 -2584 -123240 181469 -95288 -109889 262576 264251
10320 264251 -33123 -1215 1818 104994 -136713 292032 369476 43818 105021 -94039 214952
10308 141515 -76707 58459 342103 196830 -1837 78819 461173 4361 -58581 23173 21775
10297 21775 -259074 39284 98853 308864 -195912 255361 100939 -175073 -182640 -343022
10287c43022Q3329a4149n5852k05254L2896E1570c31657A8584a20036k3220c4191
10275h2502r4812M4548I8096J62465b1874C9381A2644P8252c656A02029d38409
10263b64698f1743A25921M1383E5882K52265L7470J91852A32153o052n6877K33060
10252C02284b15808L4940l0160K4836k2665q0815C31118a31136j17774j36534
10242c85444c532B9706a42362E8023J16244G8878J1414a43607D6606b63449e5016
10230h5689j12692A41994b25131g5613A4481d8668A151K29209H0064C4397i0656
10218B30789G1821q043k4073K33361b17287a1581j28096B4530a45410D0911c80575
10206b63198c765r1569C8154d0795B1294K52414a44955o5865i9327l4551e5119
$$ plain form
10287 -343022 -259693 -14149 -70001 -275255 -242359 51570 -331657 18584 -120036 -143256 -34191
10275 -82502 -177314 -132766 98096 260561 -21874 39381 12644 90896 -3656 102029 -438409
10263 -264698 -61743 125921 167304 55882 308147 345617 537469 132153 126101 69224 302284
10252 302284 -215808 -180868 -211028 -186192 -208857 -289672 331118 -131136 -248910 -385444
10242 -385444 -3532 29706 -142362 58023 174267 78878 90292 -143607 46606 -263449 -55016
10230 -85689 -198381 141994 -225131 -75613 14481 -48668 1151 230360 80064 34397 -90656
10218 230789 71821 63778 39705 273066 -217287 -11581 -139677 24530 -145410 40911 -380575
10206 -263198 -3765 -95334 38154 -40795 21294 273708 -144955 -210820 -99327 -133878 -55119
10194A14729a33719j9434f7835j01318A34547d1983D4155d57109B81163a02991
10183c3937F7060K33555h0463j03510b2945j14316j60681j3943a01064n29406
10173f30470A20618a68271A65961c69312A36558b19096c250A05432b23609I0200
10162f4720j26678r180F486R8924j6779J46027c11022d0905l9634b1599l5758
10151e7357k23173n6586Q1427g09l51768B54357a9578j50904a7455A90095a24734
10139e6114A55113A3972M365R3384h6480F7882M2106a32361D3478L6065a21197
10127A8249g2236p429m7487A53246o3917k2498b61435h0845H9000a85717k28654
10116d14371L6457B16243a99131A33673c5571j17904I3990b20015D187K07676
$$ plain form
10194 114729 -133719 -153153 -67835 -169153 134547 -41983 44155 -457109 281163 -102991
10183 -33937 67060 300615 -80463 -183973 -22945 -137261 -297942 -311885 -101064 -630470
10173 -630470 120618 -168271 165961 -369312 136558 -219096 -3250 105432 -223609 90200
10162 -64720 -191398 -200578 6486 105410 88631 234658 -311022 -40905 -80539 -21599 -57357
10151 -57357 -280530 -337116 -255689 -709 -352477 254357 -19578 -170482 -17455 190095 -124734
10139 -56114 155113 13972 18337 111721 -86480 67882 109988 -132361 43478 79543 -121197
10127 18249 -72236 -79665 -127152 153246 89329 66831 -261435 -80845 89000 -185717 -414371
10116 -414371 -377914 216243 -199131 133673 -35571 -153475 93990 -220015 4187 211863
10106B11863b28789L2146c8428r9913j07277f1390j80636L872H2715A7676M8569
10095F6245O731c9185m4041A76094g0857Q494J2970k92900A63460a92443E1285
10083b71536B69771B2682a5036l4537A46546c52288A77746h3719F5673a86760
10072e7544a8937D0155c67434a24195j30919A21741a21194B02757a39955R639
10062a30316A25175J19086b67117F3039b92263A71724o442b90764H515c47074
10051b960k56768p3996H3167a9088k81962a37732A50761d8991j98551A22708C5533
10039G6213m538f0250A75500c14837J12491Q3077N1151j56061j9147A65006b63637
10027a21607l22465a2815G6944a47209a2908A71776a20803d9560j13060B09306
$$ plain form
10106 211863 -228789 -196643 -38428 -138341 -245618 -61390 -242026 -238154 82715 17676 66245
10095 66245 72976 -39185 -83226 176094 -70857 -62363 -49393 -342293 163460 -192443 51285
10083 -271536 269771 22682 -15036 -49573 146546 -352288 177746 -83719 65673 -186760
10072 -57544 -18937 40155 -367434 -124195 -255114 121741 -121194 202757 -139955 -130316
10062 -130316 125175 244261 -267117 63039 -292263 171724 165282 -290764 8515 -347074
10051 -2960 -259728 -333724 83167 -19088 -301050 -137732 150761 -48991 -247542 122708 35533
10039 76213 71675 -60250 175500 -314837 -202346 -119269 -68118 -224179 -243326 165006 -263637
10027 -121607 -444072 -12815 76944 -147209 -12908 171776 -120803 -49560 -162620 209306
10016B74800H9490J6925b35573h5930E0575a9400j91245j9248E23423b07424g5505
10004a29491c7401E7042J82461a96163j69338E3815a1994k52426A11192a65855
9993a81209r8215A75088a14783B60606d8147A82125e443k44408B68414a2598j83835
9982a96433D2058a86964E469R2225I017a23716B3641b51478R7650B16472c90289
9970B117a24369A41568a5243n4940n5781B65634a7578A29656e23361G8335a79256
9958d0561j0255G552d53486i5451j84627E7178j3761O5142P40b16637A60716b35860
9945a08872A41644a73853A08560a77002A79609E3070a64061C18781b22969B36724
9934A12155f9483d085m4371A82415b71785H9301a06594l9316A43119B993J71462
$$ plain form
10016 274800 89490 106415 -235573 -85930 50575 -19400 -210645 -229893 523423 -207424 -75505
10004 -129491 -37401 57042 239503 -196163 -365501 53815 -11994 -264420 111192 -165855
9993 -181209 -279424 175088 -114783 260606 -48147 182125 -5443 -249851 268414 -12598 -196433
9982 -196433 42058 -186964 5469 97694 9017 -123716 23641 -251478 -153828 216472 -390289
9970 2117 -124369 141568 -15243 -70183 -125964 265634 -17578 129656 -523361 78335 -179256
9958 -40561 -50816 7552 -453486 -95451 -280078 57178 43417 108559 109299 -216637 160716 -235860
9945 -108872 141644 -173853 108560 -177002 179609 53070 -164061 318781 -222969 236724
9934 112155 -69483 -4085 -48456 182415 -271785 89301 -106594 -145910 143119 2993 174455
9923A74455c2931H0069a69950b0351I6245a69737e6162r7927N5353j09403J8833
9912a89306A9898a41653O732f4876k97501J56500Q0080j10255B14202a00672E7903
9900b87169c5423E1477a778m6093j09606D0908J04414b65597A84467C2590M9130
9889H1720M0264J83291A7319g6738A64317E1419j9269h8330a5907l0640p6043
9878a22590n850N0432I4003a91735j87598A30733a26882A05222O7935a28072K2579
9867a05493m0868r209n8023B55550d11253G7490L2355b62589h0262m7266k45351
9856c72879J53864a7291A41076N2762A7782L01i1994B33705b36347A16606P2484
9845A89090b57380B15667e9453q9471k55568b6751G4322l1111J9830a45410H3367
$$ plain form
9923 174455 -32931 80069 -169950 -20351 96245 -169737 -56162 -154089 -98736 -208139 -189306
9912 -189306 19898 -141653 -134921 -64876 -362377 -205877 -125797 -236052 214202 -100672 57903
9900 -287169 -35423 51477 -1778 -47871 -157477 40908 145322 -265597 184467 32590 81720
9889 81720 121984 305275 17319 -76738 164317 51419 32150 -88330 -15907 -46547 -122590
9878 -122590 -128440 -78008 94003 -191735 -379333 130733 -126882 105222 173157 -128072 -105493
9867 -105493 -146361 -155570 -213593 255550 -411253 77490 109845 -262589 -80262 -127528 -372879
9856 -372879 -219015 -17291 141076 193838 17782 18083 -91994 233705 -236347 116606 189090
9845 189090 -257380 215667 -59453 -148924 -404492 -26751 74322 43211 63041 -145410 83367
9833c71808a54759C2009K12103b41939j09364F0697f2334j89983A8717J52106
9823A70823a11927l9048k681f1047E8799a05533B5954c01021O7688d3649j83819
9812b27468F7437J66277c05912J41721o8652H685a71591O0233E2877D31b87158
9800A97550k4079b78584a02119m4421k7550O0696l03182F2476O5204d4205k90195
9789c34400c7634A06724C4141J93418i0966o4553L3686a7294m3760H027d7688
9777B43522c9192q2240c5021k08691m2877c9355A07563a56844H2251a87687M8885
9766a38802a9542j55532f8234r0279A71703a46474j80435D6992a3358j16411K287
9755a27482k99935a40097H8759f2900k10397o0859a04475m8320O5447q0254n4039
$$ plain form
9833 -371808 -154759 32009 244112 -241939 -351303 60697 -62334 -252317 18717 170823
9823 170823 -111927 -150975 -153656 -61047 58799 -105533 25954 -301021 -233333 -43649 -227468
9812 -227468 67437 233714 -305912 -164191 -232843 8685 -171591 -111358 52877 431 -287158
9800 197550 173471 -278584 -102119 -146540 -174090 -113394 -416576 62476 127680 -44205 -334400
9789 -334400 -37634 106724 34141 227559 -90966 -155519 -121833 -17294 -61054 8027 -47688
9777 243522 -39192 -121432 -35021 -243712 -286589 -39355 107563 -156844 82251 -187687 -138802
9766 -138802 -19542 -175074 -68234 -158513 171703 -146474 -326909 46992 -13358 -129769 -127482
9755 -127482 -427417 -140097 88759 -62900 -273297 -334156 -104475 -152795 -87348 -167602 -221641
9744b21641A86917f4345C8732b00786j02656C6764J779i1039H0493a48896k03749
9733c52645a69802h4728H8583B0562J61836a48417N9329f106j13199A54883P7538
9722B32421c937A50945L0198b93990f1517j63609O6051b1713l07931A88241a32872
9710g3136L3746q1568q0905j17389N5139a16139A24223g1444k9938k06149e9645
9698B6270a74071P658L5123H479b0903D2462d2116B5398b59548j12533a30476
9686a92515A6616a67568h886B94662g464j42459M9584l03378B7626K9015b04350
9674a05218A82211D6537K7133b20295A6657a16772A4641P7822c30302J04396J02608
9663a23298C5370H853d9555o4180C04676a35301A80J3941a12181e5162B51801
$$ plain form
9744 -221641 186917 -64345 38732 -200786 -303442 36764 38543 -91039 80493 -148896 -352645
9733 -352645 -169802 -84728 88583 20562 182398 -148417 -89088 -6106 -119305 154883 232421
9722 232421 -3937 150945 181143 -293990 -61517 -225126 -159075 -21713 -329644 188241 -132872
9710 -73136 -39390 -120958 -201863 -319252 -264113 -116139 124223 -71444 -101382 -307531 -59645
9698 26270 -174071 -166413 -131290 8479 -20903 42462 -42116 25398 -259548 -372081 -130476
9686 -192515 16616 -167568 -8886 294662 -7464 -149923 -100339 -403717 27626 56641 -204350
9674 -105218 182211 46537 73670 -220295 16657 -116772 14641 92463 -330302 -225906 -123298
9663 -123298 35370 8853 -49555 -113735 304676 -135301 180 14121 -112181 -55162 251801
9651F3043c79251A02256f8027l7114L6116A23282A9752b03473A66847J7665d3914
9639a17986j53245F6084a68166C1645a42611I9256a10629O169I2858c39991J40883
9628a99108E1374A7628K42424a45601A53954d70717B37372r3577C1809a19297
9617c02415P6265A9948O696b96530J28323f1795l9164j61714A18666a67967p3790
9606b41757k17661J43023i901j08214a1688F3547f1644J212I5084e3618l3593
9595h7211d1616B4607j869A804K51272a80114j0942a8307o9457E6261j6669b56453
9582B67452a26754n4944k6443J03244I9743a60734I6319m5271a98389g5945m2162
9571a18107p1687e4814n3910c0431C92892c05464C1516b97361i3732A661c6711
$$ plain form
9651 63043 -379251 102256 -68027 -105141 -69025 123282 19752 -203473 166847 184512 -43914
9639 -117986 -271231 66084 -168166 31645 -142611 99256 -110629 -104460 92858 -339991 -199108
9628 -199108 51374 17628 260052 -145601 153954 -470717 237372 143795 31809 -119297
9617 -302415 -226150 19948 26644 -296530 -168207 -61795 -100959 -262673 118666 -167967 -241757
9606 -241757 -459418 -316395 -9901 -118115 -11688 63547 -61644 -60432 95084 -53618 -87211
9595 -87211 -41616 24607 22738 1804 253076 -180114 -191056 -18307 -87764 56261 39592 -256453
9582 267452 -126754 -181698 -208141 -104897 99743 -160734 96319 51048 -198389 -75945 -118107
9571 -118107 -189794 -54814 -108724 -30431 392892 -305464 31516 -297361 -93732 1661 -36711
9559d37457g1904B94700j45205p3153b97916J48538G3464e5283A07226Q5279a95467
9547A15078P087b5428G4049h277A9012N7569f6311l43230a29291f4339A17635
9535C71736i8492H8547b45884Q3921d509l66120E0506i2980k16308a07481M3356
9524f4125c1510A27736J08374i4258A61504b13677L3404N5556j39514g2173j72829
9513b45002A99365b73983i9093k78787E0570M0647L6324C6174G396b05500j6153
9502b21653E7225K8800J34899b61218j9928D2099i7694j01327b1058m3229C7784
9490D2279b31959A64419d1289k9488J4960j2546b4155k6532B04839h802m7385
9479e6187o180j41675J00985A51055b82598a2065a204l04579Q210A620d29977
$$ plain form
9559 -437457 -71904 294700 149495 76342 -297916 -149378 73464 -55283 107226 192505 -195467
9547 115078 122165 -25428 74049 -8277 19012 76581 -66311 -409541 -129291 -64339 117635
9535 371736 -98492 88547 -245884 -161963 -4509 -370629 50506 -92980 -309288 -107481 -64125
9524 -64125 -31510 127736 236110 -94258 161504 -213677 -180273 -124717 -264231 -72173 -245002
9513 -245002 199365 -273983 -99093 -377880 50570 91217 127541 36174 7396 -205500 -221653
9502 -221653 57225 86025 220924 -261218 -281146 42099 -97694 -199021 -21058 -64287 37784
9490 42279 -231959 164419 -41289 -70777 -55817 -68363 -24155 -50687 204839 -8802 -56187
9479 -56187 -62367 -204042 -103057 151055 -282598 -12065 -1204 -305783 -297573 1620 -429977
9467a51509O7328A15796B5308i1457K1534A57314p6842a38A67240J00735E5837
9455a39645l79285b35910B59577b34307A4070O4574b16698h1030B35366b17307
9444D9403O4458h8621B42320E4063b22600K4028j33169i0836q0050K7762G4323
9432B62153b52097D7774a5553H2192b28025i5508E2656a90616N6590D96271g9503
9420a66992P1008k89867A0154c6485k0308A34823I043M40714j71580a66009A23549
9408g0397k98500J11916j51361a81007A04112b08835k7286Q1104B7654b72527
9397A31010D0885h6670l5469A99707A5229J68639a3335k25328D1556b13101p3138
9386b86239D0276a52659p8468a13597H6531j0411C1459a1511A80567N866i4908
$$ plain form
9467 -151509 -84181 115796 25308 -91457 -69923 157314 80472 -138 167240 267975 55837
9455 -139645 -518930 -235910 259577 -234307 14070 78644 -216698 -81030 235366 -217307
9444 49403 113861 -88621 242320 54063 -222600 -198572 -331741 -90836 -170886 -143124 74323
9432 262153 -252097 47774 -15553 82192 -228025 -95508 52656 -190616 -134026 496271 -79503
9420 -166992 -95984 -385851 10154 -36485 -56793 134823 9043 449757 278177 -166009 123549
9408 -70397 -368897 -256981 -408342 -181007 104112 -208835 -236121 -155017 27654 -272527
9397 131010 40885 -86670 -122139 199707 15229 183868 -13335 -238663 41556 -213101 -286239
9386 -286239 40276 -152659 -231127 -113597 86531 76120 31459 -11511 180567 186433 -94908
9374b0653j30479j361I2953b74486h3218j82367O2331C0147P6348a77120h4977
9362G7535b11088c007j10706N3264j346j86138A79881d2363l90271H5758C2043
9350b27897F1808O1726e1586j89432b4712j13582k13684b3092k26166P6718d3696
9338G2481f859k73735E9669J76747f8149c501H135J1373b51410p383B42490c00075
9325b21053m8389a24409p4268a6527k1225j19656A48997n1852F308a47085p0059
9314b17144A28167J00179b97985B48367a61632I5969m13m2340B0693R3520b97564
9302c02512B09456I388a78275F263N6712a278j43670P2120j49302f2551k65384
9291c27935B36315a18403G2168M4317K4787b03231A04887g373j10066j60841B7348
$$ plain form
9374 -20653 -151132 -152493 92953 -274486 -83218 -265585 -203254 30147 106495 -177120 -84977
9362 77535 -211088 -3007 -113713 -60449 -61795 -247933 179881 -42363 -432634 85758 32043
9350 -227897 61808 123534 -51586 -241018 -24712 -138294 -351978 -23092 -249258 -172540 -43696
9338 72481 -6859 -280594 59669 236416 -68149 -3501 8135 19508 -251410 -258793 242490 -300075
9325 -221053 -269442 -124409 -198677 -16527 -37752 -157408 148997 97145 6308 -147085 -217144
9314 -217144 128167 228346 -297985 248367 -161632 95969 95556 53216 20693 114213 -297564
9302 -302512 209456 9388 -178275 6263 62975 -1278 -144948 -72828 -222130 -62551 -327935
9291 -327935 236315 -118403 72168 116485 141272 -203231 104887 -7373 -117439 -278280 27348
9279a97147B028a27567n6228M4149o2387J9254I6962R9640b85325I3391M5030
9268A38421o5663c5933n48320A48988B5465e847F1380b7654l0945j067q7483j3868
9256a61017A6018a13450d7089G1167h2095h221A82586B0264a63483k52855D20630
9244b47131a17970k6398f3475J0477r5215A77807Q7334a43921l5342F2429J35034
9233A97463a42578n4982j43709g0999m0937E4458a91903f0581a0815o9504k71860
9222c52179D2321N5204g9693j8547c5649j55453C7546d8882R93k71071m8203J47718
9210b19445J08300d5458n2469M1736Q207C7635d0493O797m618j7200k7875N034
9198g8355C73025G1369g3284C4792N0236a6920j07879c7571k81884d8419a8677
$$ plain form
9279 -197147 2028 -127567 -183795 -139646 -202033 -182779 96962 196602 -285325 93391 138421
9268 138421 72758 -35933 -584253 148988 25465 -5847 61380 -27654 -58599 -59666 -147149 -161017
9256 -161017 16018 -113450 -47089 71167 -82095 -8221 182586 20264 -163483 -416338 420630
9244 -247131 -117970 -144368 -63475 -52998 -148213 177807 265141 -143921 -179263 62429 197463
9233 197463 -142578 -197560 -341269 -70999 -111936 54458 -191903 -60581 -10815 -80319 -352179
9222 -352179 42321 97525 -79693 -98240 -35649 -191102 37546 -48882 -47889 -318960 -367163 -219445
9210 -219445 -111145 -45458 -97927 -56191 -47984 37635 -40493 -33696 -38314 -55514 -83389 -78355
9198 -78355 373025 71369 -73284 34792 85028 -16920 -124799 -37571 -319455 -48419 -18677
9186b52707P5136A10057a68427Q2083j0494k46046a7687C6892L68566g6910k0032
9175i6942B3716i4672j02523K5693k16359C90581c90019a36823e8101I1277f5097
9163A08853a25468D11830H4289h4311a3193b71A87846a71729I2540J59785a60968
9151D6951L5460J96297g7374j1838l85067a98125A52601J44140D8050b03695O7940
9140a35755A1416a24472j15144N4594C0229e5272L897D5778c06453a613o4522
9129f6135A78374k0222b70952J24550A83679b66566d4441n3396M6085j16392m7624
9118b15768a4076A4179J07538n7989a33279D25152a781k8599j28589P1769P17
9107h6483G336K13081a26156A45299a56698o6778d5639D35457b27074N4925e3213
$$ plain form
9186 -252707 -177571 110057 -168427 -86344 -96838 -342884 -17687 36892 405458 -76910 -96942
9175 -96942 23716 -94672 -197195 -171502 -387861 390581 -390019 -136823 -58101 91277 -65097
9163 108853 -125468 411830 84289 -84311 -13193 -271 187846 -171729 92540 252325 -160968
9151 46951 82411 278708 -77374 -89212 -474279 -198125 152601 296741 48050 -203695 -135755
9140 -135755 11416 -124472 -239616 -185022 30229 -55272 -51375 45778 -306453 -1613 -66135
9129 -66135 178374 158152 -270952 -146402 183679 -266566 -44441 -97837 -51752 -168144 -215768
9118 -215768 -14076 14179 121717 63728 -133279 425152 -1781 -30380 -158969 -87200 -86483
9107 -86483 7336 220417 -126156 145299 -156698 -223476 -45639 435457 -227074 -172149 -53213
9095B0993c94525F8377c46147a02834B4766c730j37825L3322l10048h7635q6430
9084a74065A00647b53771a19271c3847F4868b6792a0316q2057j95345a28524j02874
9073b31398k4060E197L70937E8280e9247b2731A59767K22194A17832d0428A86318
9061a35799N4775j82906q3593J58961k01903a29757l3894A26705b36140b0392
9050a23429A1639k927a89863j10180a16018r3678E6446a08874o4420A95753N8985
9039B54738i0029o7027c9160A67804H3248J12384J73906I1971a03476n9767o4343
9028b27586D5857H96b08029j13747C6181L7535b87738G50b39798B00452f9276
9016d9161A29664e3680C4274N1466C0614m645b09760k29128J81890A19308a00240
$$ plain form
9095 20993 -394525 68377 -346147 -102834 24766 -3730 -141555 -108233 -418281 -87635 -174065
9084 -174065 100647 -253771 -119271 -33847 64868 -26792 -10316 -92373 -287718 -128524 -231398
9073 -231398 -255458 5197 376134 58280 -59247 -22731 159767 381961 117832 -40428 186318
9061 -135799 -81024 -263930 -347523 -188562 -390465 -129757 -163651 126705 -236140 -20392
9050 -123429 11639 8712 -189863 -300043 -116018 -209696 56446 -108874 -173294 195753 254738
9039 254738 -90029 -157056 -39160 167804 83248 195632 369538 91971 -103476 -163243 -227586
9028 -227586 45857 896 -208029 -321776 36181 73716 -287738 750 -239798 200452 -69276
9016 -49161 129664 -53680 34274 85740 30614 25969 -209760 -438888 -256998 119308 -100240
9004d58683A8295a38877l5469A10052a07039B0203N8248a77906Q2630k02161C5330
8992b1956E8550K06116a47431n2032B53352E0176J06138o7113a09371E3458J5600
8981F9058L4137b28097p3960f1136A82101a82896B79524B4289K7477N9757a94771
8969A40688c06446o673J25655A20967a72905A65470L048b92223G0914C0819c19147
8957B46606C7365c36858i2345b2570q6972D4840N9719a81389d2977C62870a78439
8945c27574a32341j09552j14669g2096B86901a28803A23695e27202b20972I0909
8934D14462b8987A65241a21447B9428f0213C36425b48652O3028k11166e3136I7462
8922A15762L75590J096376E16760j14163c08962A60917c44031C1492J7819b21110
$$ plain form
9004 -458683 18295 -138877 -174346 110052 -107039 20203 78451 -177906 -95276 -297437 35330
8992 -21956 58550 264666 -147431 -199463 253352 50176 156314 89201 -109371 53458 69058
8981 69058 103195 -228097 -302057 -61136 182101 -182896 279524 24289 51766 111523 -194771
8969 140688 -306446 -313119 -187464 120967 -172905 165470 168518 -292223 70914 30819 -319147
8957 246606 37365 -336858 -92345 -22570 -109542 44840 104559 -181389 -42977 362870 -178439
8945 -327574 -132341 -241893 -356562 -72096 286901 -128803 123695 -527202 -220972 90909
8934 414462 -28987 165241 -121447 29428 -60213 336425 -248652 -185624 -396790 -53136 97462
8922 115762 491352 1587728 516760 402597 -308962 160917 -344031 31492 49311 -221110
8911G3731L42608i0956A4196d07274c2178j01333a8449j14702E6526J71977a13504
8899A13140a48535A19153J61436D1454K4368B552J65779i398j74751l4782A29009
8887A35962e8141j6520k75936a68043o0949G8459b06103c7634E6096a79032G7249
8875c37164B60423E5301a07862b631k62724B01834h5240m7571G1780c24389A76091
$$ plain form
8911 73731 416339 -90956 14196 -407274 -32178 -133511 -18449 -133151 56526 228503 -113504
8899 113140 -148535 119153 280589 41454 65822 2552 168331 -9398 -184149 -218931 129009
8887 135962 -58141 -74661 -350597 -168043 -228992 78459 -206103 -37634 56096 -179032 77249
8875 -337164 260423 55301 -107862 -2631 -265355 201834 -85240 -132811 71780 -324389 176091
$$ [...]
##END NTUPLES=NMR SPECTRUM
##END=
