##TITLE=AC1456_PAST113262_7818896_D1qtiZiE4I
##JCAMPDX= 6.0         $$ Bruker NMR JCAMP-DX V2.0
##DATA TYPE= NMR SPECTRUM
##DATA CLASS= NTUPLES
##ORIGIN= BRUKER
##OWNER= Administrator
$$ 1.72 TOPSPIN		Version 2.1
$$ 2013-04-30 19:46:07.234 -0700  Administrator@X
$$ Compression mode = diff/dup
##.OBSERVE FREQUENCY= 400.02188249412
##.OBSERVE NUCLEUS= ^1H
##.ACQUISITION MODE= SIMULTANEOUS (DQD)
##.ACQUISITION SCHEME= undefined
##.AVERAGES= 8
##.DIGITISER RES= 22
##SPECTROMETER/DATA SYSTEM= spect
##.PULSE SEQUENCE= zg30
##.SOLVENT NAME= COFFEE_meoh
##.SHIFT REFERENCE= INTERNAL, COFFEE_meoh, 1, 14.98509
##AUDIT TRAIL= $$ (NUMBER, WHEN, WHO, WHERE, PROCESS, VERSION, WHAT)
$$ ##TITLE= Audit trail, TOPSPIN		Version 2.1
$$ ##JCAMPDX= 5.01
$$ ##ORIGIN= Bruker BioSpin GmbH
$$ ##OWNER= Administrator
$$ $$ E:\/data/COFFEE/nmr/AC1456_PAST113262_7818896_D1qtiZiE4I/10/pdata/1/auditp.txt
$$ ##AUDIT TRAIL=  $$ (NUMBER, WHEN, WHO, WHERE, PROCESS, VERSION, WHAT)
(   1,<2013-04-30 19:46:00.421 -0700>,<Administrator>,<X>,<go>,<TOPSPIN 2.1>,
      <created by zg
	started at 2013-04-30 19:44:54.187 -0700,
	POWCHK enabled, PULCHK disabled,
       configuration hash MD5:
       F7 49 AB AC A2 8D 51 76 73 8D C1 9A A6 38 9F DE
       data hash MD5: 64K
       6C 97 45 31 6F 36 A0 57 B3 36 9F 9B 0C 23 B4 1D>)
(   2,<2013-04-30 19:46:03.421 -0700>,<Administrator>,<X>,<proc1d>,<TOPSPIN 2.1>,
      <Start of raw data processing
       efp LB = 0 FT_mod = 6 PKNL = 1 PHC0 = 0 PHC1 = 0 SI = 32K 
       data hash MD5: 32K
       F3 90 00 63 3F BD 4B A6 6F EF 77 F5 30 8C A6 B6>)
(   3,<2013-04-30 19:46:03.718 -0700>,<Administrator>,<X>,<proc1d>,<TOPSPIN 2.1>,
      <pk PHC0 = 95.09216 PHC1 = 0 
       data hash MD5: 32K
       7C 8A 49 99 04 8B 7D 64 66 2A 5F DF 65 E1 2B BF>)
(   4,<2013-04-30 19:46:03.843 -0700>,<Administrator>,<X>,<proc1d>,<TOPSPIN 2.1>,
      <abs ABSG = 1 
       data hash MD5: 32K
       F9 84 F0 53 DF 4A 44 FF 60 AC 67 69 95 0C 15 1D>)
(   5,<2013-04-30 19:46:03.937 -0700>,<Administrator>,<X>,<proc1d>,<TOPSPIN 2.1>,
      <abs ABSG = 2 
       data hash MD5: 32K
       DC A8 2F B5 BB DB 1F 8F 2E 81 3E A9 26 91 99 97>)
(   6,<2013-04-30 19:46:04.031 -0700>,<Administrator>,<X>,<proc1d>,<TOPSPIN 2.1>,
      <abs ABSG = 3 
       data hash MD5: 32K
       77 20 B5 3C A0 C2 5B C4 99 63 50 BB 99 6F 89 F9>)
(   7,<2013-04-30 19:46:04.093 -0700>,<Administrator>,<X>,<proc1d>,<TOPSPIN 2.1>,
      <abs ABSG = 4 
       data hash MD5: 32K
       2A 81 B3 5A 59 47 6A 39 D8 4D B4 93 67 47 50 43>)
(   8,<2013-04-30 19:46:04.156 -0700>,<Administrator>,<X>,<proc1d>,<TOPSPIN 2.1>,
      <abs ABSG = 5 
       data hash MD5: 32K
       B7 5E 54 93 F1 DE 54 73 17 57 3D 48 69 56 5B 2C>)
$$ ##END=
$$ 
$$ $$ hash MD5
$$ $$ F2 52 EC EB BC 2C EE 56 96 30 C6 91 6A 54 98 55
##$RELAX= 
##$RELAX= 
##$RELAX= 
##$RELAX= 
##$RELAX= 
##$RELAX= 
##$RELAX= 
$$ Bruker specific parameters
$$ --------------------------
##$DU= <E:\>
##$EXPNO= 10
##$NAME= <AC1456_PAST113262_7818896_D1qtiZiE4I>
$$ [...]
150 150 150 150 150 150 150 150
##$TP07= 0
##$TPNAME0= <>
##$TPNAME1= <>
##$TPNAME2= <>
##$TPNAME3= <>
##$TPNAME4= <>
##$TPNAME5= <>
##$TPNAME6= <>
##$TPNAME7= <>
##$TPOAL= (0..7)
0.5 0.5 0.5 0.5 0.5 0.5 0.5 0.5
##$TPOFFS= (0..7)
0 0 0 0 0 0 0 0
##$TUNHIN= 0
##$TUNHOUT= 0
##$TUNXOUT= 0
##$USERA1= <user>
##$USERA2= <user>
##$USERA3= <user>
##$USERA4= <user>
##$USERA5= <user>
##$V9= 5
##$VALIST= <valist>
##$VCLIST= <CCCCCCCCCCCCCCC>
##$VD= 0
##$VDLIST= <DDDDDDDDDDDDDDD>
##$VPLIST= <PPPPPPPPPPPPPPP>
##$VTLIST= <TTTTTTTTTTTTTTT>
##$WBST= 1024
##$WBSW= 4
##$XGAIN= (0..3)
0 0 0 0
##$XL= 0
##$YL= 0
##$YMAX_a= 621727
##$YMIN_a= -529156
##$ZGOPTNS= <>
##$ZL1= 120
##$ZL2= 120
##$ZL3= 120
##$ZL4= 120
##$ABSF1= 14.98509
##$ABSF2= -5.573092
##$ABSG= 5
##$ABSL= 3
##$ALPHA= 0
##$AQORDER= 0
##$ASSFAC= 0
##$ASSFACI= 0
##$ASSFACX= 0
##$ASSWID= 0
##$AUNMP= <proc_prof1d_extract_pilot.lims>
##$AXLEFT= 0
##$AXNAME= <>
##$AXNUC= <1H>
##$AXRIGHT= 0
##$AXTYPE= 0
##$AXUNIT= <>
##$AZFE= 0.1
##$AZFW= 0.1
##$BCFW= 0
##$BC_mod= 0
##$BYTORDP= 0
##$COROFFS= 0
##$CY= 15
##$DATMOD= 1
##$DC= 0
##$DFILT= <>
##$DTYPP= 0
##$F1P= 0
##$F2P= 0
##$FCOR= 0.5
##$FTSIZE= 32768
##$FT_mod= 6
##$GAMMA= 0
##$GB= 0
##$INTBC= 1
##$INTSCL= 1
##$ISEN= 128
##$LB= 0
##$LEV0= 0
##$LPBIN= 0
##$MAXI= 10000
##$MC2= 0
##$MEAN= 0
##$ME_mod= 0
##$MI= 0
##$NCOEF= 0
##$NC_proc= -8
##$NLEV= 6
##$NOISF1= 0
##$NOISF2= 0
##$NSP= 0
##$NTH_PI= 0
##$NZP= 0
##$OFFSET= 14.98509
##$PC= 1
##$PHC0= 95.09216
##$PHC1= 0
##$PH_mod= 1
##$PKNL= yes
##$PPARMOD= 0
##$PPDIAG= 0
##$PPIPTYP= 0
##$PPMPNUM= 2147483647
##$PPRESOL= 1
##$PSCAL= 4
##$PSIGN= 0
##$PYNMP= <proc.py>
##$REVERSE= no
##$SF= 400.02
##$SI= 32768
##$SIGF1= 0
##$SIGF2= 0
##$SINO= 400
##$SIOLD= 32768
##$SPECTYP= <>
##$SREGLST= <1H.CDCl3>
##$SSB= 0
##$STSI= 32768
##$STSR= 0
##$SW_p= 8223.68421052631
##$SYMM= 0
##$S_DEV= 0
##$TDeff= 65536
##$TDoff= 0
##$TI= <>
##$TILT= no
##$TM1= 0
##$TM2= 0
##$TOPLEV= 0
##$USERP1= <user>
##$USERP2= <user>
##$USERP3= <user>
##$USERP4= <user>
##$USERP5= <user>
##$WDW= 1
##$XDIM= 32768
##$YMAX_p= 465412042
##$YMIN_p= -621236
##$CURPLOT= <Network HP LaserJet P1505>
##$CURPRIN= <$Network HP LaserJet P1505>
##$DFORMAT= <normdp>
##$LAYOUT= <+/1D_H.xwp>
##$LFORMAT= <normlp>
##$PFORMAT= <normpl>
##$SURQMSG= 1
$$ End of Bruker specific parameters
$$ ---------------------------------
##NTUPLES= NMR SPECTRUM
##VAR_NAME=  FREQUENCY,     SPECTRUM/REAL,   SPECTRUM/IMAG
##SYMBOL=    X,             R,               I
##VAR_TYPE=  INDEPENDENT,   DEPENDENT,       DEPENDENT
##VAR_FORM=  AFFN,          ASDF,            ASDF
##VAR_DIM=   32768,         32768,           32768
##UNITS=     HZ,            ARBITRARY UNITS, ARBITRARY UNITS
##FACTOR=    0.250966925370066, 1,           1
##FIRST=     8223.43324360094, 31618,        -83726
##LAST=      0,             -65644,          -173417
##MIN=       0,             -621236,         0
##MAX=       8223.43324360094, 465412042,    0
$$ Real data points
##PAGE= N=1
##DATA TABLE= (X++(R..R)), XYDATA
$$ [...]
19558F4830m403d4204k59041F7185d5419m187j890r9948b5868F5052f6593j46350
19546b12943G1796J49749a5335B29396n7240a68350B249c52012a38402J2370b8749
19534G4224J14461F2709a15918l6717D7546b27546N9346K8726d7008B9014K74777
19523C03791b60569d1332k80696D0492K7500k9418J41085a98827A65437b41659
19512A89381a26279L8301F9382J6307O521a83064E1984k1141a8043j02431N0361
19501g0113k37068g8258I0952a23806G3593N8619c87243A68938K3348B3871a55880
19489b55835i7623q6238h0628A60236K4634G857a73210P5978j28735P0862I7572
19477b12095A15964a56934o9294a0315k66312g1680K247l428l4267b7868j07921
$$ y = [64830, 60427, -44204, -303245, 67185, -45419, -49606, -51496, -151444, -25868, 65052, -66593, -212943, 71796, 221545, -15335, 229396, 172156, -168350, 2249, -352012, -138402, -126032, -28749, 74224, 188685, 62709, -115918, -152635, 47546, -227546, -168200, -139474, -47008, 29014, 303791, -260569, -41332, -322028, 40492, 67992, 38574, 179659, -198827, 165437, -241659, 189381, -126279, -87978, 69382, 85689, 92210, -183064, 51984, 30843, -18043, -120474, -70113, -307181, -78258, 90952, -123806, 73593, 132212, -387243, 168938, 192286, 23871, -155880, -255835, -97623, -183861, -80628, 160236, 184870, 7857, -173210, -97232, -225967, -155105, 97572, -212095, 115964, -156934, -226228, -10315, -276627, -71680, -69433, -72861, -107128, -27868, -135789]
19466a35789E2267e4757F5881b12543p2396E1943K16694F4462h5571n5888j3265
19455a54724o5574M195A6026a65654D719a66956p2003A38026m7589a49016B52323
19443A51370k670J55038B3557i4447j10047p208l01645e6999D8314a05565d668
19431a15598k67530d7528k10497I8579a35222A03401d37945a84545A80257c8772
19420a18100e2333j17876e640A62813C1473J3515J3367A6439a05607j12963M6429
19409a72141d0316k23119A93285H1775b08088m4316h2757j1205j60614a04386
19398b58413A39695R0678i3715j02891e1166A18249i7001r7691A10162E3933Q5518
19387A39451b2046l59380d8228B5681a74035l5974l4730J04560j4061A6034e8670
$$ y = [-135789, 52267, -54757, 65881, -212543, -284939, 51943, 268637, 64462, -85571, -141459, -154724, -220298, -216103, 16026, -165654, 4719, -166956, -238959, 138026, 90437, -149016, 252323, 151370, 148700, 303738, 23557, -94447, -204494, -211702, -513347, -56999, 48314, -105565, -4668, -115598, -383128, -47528, -258025, 98579, -135222, 103401, -437945, -184545, 180257, -38772, -118100, -52333, -170209, -5640, 162813, 31473, 44988, 58355, 16439, -105607, -218570, -172141, -40316, -263435, 193285, 81775, -208088, -252404, -82757, -93962, -254576, -104386, -258413, 139695, 230373, -93715, -196606, -51166, 118249, -97001, -194692, 110162, 53933, 139451, -22046, -381426, -48228, 25681, -174035, -210009, -244739, -140179, -154240, 16034, -58670]
19375B1491f3107m5294A48903H163L99430b27881H3422a80076D5676h4327A29959
19363a63295A5057d31498a19577d6536A02480c58335a11089k39539B52626B9066
19352B6414b8683A41282A1296a41942B0198R3783f0928A13127J30020B3433c48184
19340a78450A79587C7111a78351F2012B4716q225d26484A32200d6447k84760F79
19328a78566n3265a7040A9391c72739J67186O1210b2233m2151B47886C832O5227
19317F9059p393a48350J4848B18323h948A87328c95766a91419b8994J1854m02337
19306d19477A86930d49281a30965B9911a90568H8498a81108B18433D7615c18688
19295c1618D3589L0666L9036D3775a29628k9900J1750O2549m11482E1880c570
$$ y = [21491, -63107, -108401, 148903, 8163, 407593, -227881, 83422, -180076, 45676, -84327, 129959, -163295, 15057, -431498, -119577, -46536, 102480, -358335, -111089, -350628, 252626, 29066, 26414, -28683, 141282, 11296, -141942, 20198, 113981, -60928, 113127, 243147, 23433, -348184, -178450, 179587, 37111, -178351, 62012, 24716, 16491, -426484, 132200, -46447, -331207, 679, -178566, -231831, -17040, 19391, -372739, -205553, -144343, -22233, -64384, 247886, 3832, 69059, 61666, -148350, -133502, 218323, -8948, 187328, -395766, -191419, -28994, -17140, -419477, 186930, -449281, -130965, 29911, -190568, 88498, -181108, 218433, 47615, -318688, -31618, 43589, 74255, 113291, 43775, -129628, -159528, -147778, -85229, -496711, 51880, -3570]
19283D7794b8140l79136J20414C40253b06672f0359A7394J48786p2336c7924j38324
19272a76248j5045A14698f0937r8357P0754j93784L4031f6814j13240A40719l5574
19261A05145h1850j24388M1084k15372F8616k4314J12500d78818D6626a59004
19250c12829n0735A01944a7858D9320d79312b7159F7757C3469M502h6744c7684
19238b04151A97324J9672a53984L6438c922n6920m7773K3974B3656K54985j08343
19227A70298D746h9640A28269a29362D02995g0789m2356b479B65504a34110e8613
19215a33577G8743c24271A01335a46394K3875D7722a41512j32128h6906j05868
19205a92774b8999o3076C9429Q0286b7398k30753k5544i7418c554F0899a99309
$$ y = [47794, -28140, -407276, -286862, 340253, -206672, -60359, 17394, 166180, 93844, -37924, -176248, -191293, 114698, -60937, -159294, -88540, -282324, -248293, -66814, -180054, 140719, 105145, -81850, -206238, -165154, -380526, 68616, 44302, 156802, -478818, 46626, -159004, -312829, -363564, 101944, -17858, 49320, -479312, -27159, 67757, 33469, 37971, -86744, -37684, -204151, 197324, 216996, -153984, -117546, -3922, -60842, -108615, -84641, 23656, 278641, 170298, 4746, -89640, 128269, -129362, 402995, -70789, -113145, -2479, 265504, -134110, -58613, -133577, 78743, -324271, 101335, -146394, -122519, 47722, -141512, -273640, -86906, -192774, -28999, -92075, 39429, 119715, -27398, -258151, -283695, -97418, -3554, 60899, -199309]
19193a40447M8846A14250P535a92373b5796D4255a92547A10560a0429B18763c78786
19181b81006A25208e94184b47543A05538b64840j3440A00144J59721b6583F1146
19170b2550A5624B898J11814a62621I3416N6359c07031J08874F9678h330j09238
19159a17568G6416a09269j30032a7367q1764l34611b5229o0346A29088B9040a39104
19147C6972A4394N2848J15304E523f0039a5494D8843c76900J08378j68762B38843
19135A22711e9142k23890b3384r673r2978N2641k693n1052B47361f2996I0565
19123c89329I8608a50666j71308J58734C1894b09507E2245A8081a17773j40558
19113b58331a1736l94747P4185A24395O2987c11124b4260k17251j653b765k1450
$$ y = [-140447, -91601, 114250, 121785, -192373, -25796, 44255, -192547, 110560, -10429, 218763, -378786, -281006, 125208, -594184, -247543, 105538, -264840, -278280, 100144, 259865, -26583, 61146, -22550, 15624, 2898, 114712, -162621, 93416, 149775, -307031, -198157, 69678, -8330, -117568, 76416, -109269, -239301, -17367, -99131, -433742, -25229, -85575, 129088, 29040, -139104, 36972, 14394, 67242, 182546, 5523, -60039, -15494, 48843, -376900, -268522, -437284, 238843, 122711, -59142, -283032, -23384, -33057, -126035, -73394, -76087, -127139, 247361, -62996, 90565, -389329, 98608, -150666, -321974, -163240, 31894, -209507, 52245, 18081, -117773, -258331, -11736, -406483, -332298, 124395, 187382, -311124, -24260, -241511, -243164, -2765, -24215]
19102b4215l76954a17168H1471J27784d85972D134f9910j02602A42579l6362e03270
19090F0332e3843j63555b0834C7930a60685L605N6428j53608B08041G9899j2855
19079F7044B8325L6143L7841a09842L7347B33962d2138a4863I8863c24340a05851
19067A4384a3736A47929C6444M2186c69241C23826a67807D7321J32067a75859
19056c78224h3721l8697L7223j93684f9860o0166j40266A09556d2298j58166e527
19044A29764a64983M1051j45034j0177A08944a68827d9409o6844k34639j38687
19034d89579e6731B53655c4568H9353C9625M209J87847n246b74201C63231j68111
19023A95120h5047H1071K2183g1792j37110i9799L582k93286H5028N7655m7416
$$ y = [-24215, -401169, -117168, 81471, 209255, -485972, 4134, -69910, -172512, 142579, 106217, -503270, 60332, -53843, -217398, -20834, 37930, -160685, -157080, -100652, -254260, 208041, 79899, 67044, 28325, 64468, 102309, -109842, -72495, 233962, -42138, -14863, 98863, -324340, -105851, 14384, -13736, 147929, 36444, 78630, -369241, 323826, -167807, 47321, 179388, -175859, -378224, -83721, -122418, -85195, -278879, -69860, -130026, -270292, 109556, -42298, -200464, -5527, 129764, -164983, -123932, -268966, -279143, 108944, -168827, -49409, -116253, -350892, -489579, -56731, 253655, -34568, 89353, 39625, 43834, 231681, 226435, -274201, 363231, 195120, -85047, 81071, 103254, -71792, -208902, -99799, -96217, -389503, 85028, 142683, 95267]
19012I5267g6266a8557l24947A32303a43286j3989O6736p7487H9229a89719C4909
19000c64004a3417A38462F312b62474E3250a48607I8141m2361a15162k00465B7799
18988a43470j50757a09842j80926F2751c55224I0245K7931K6368b23518A88491
18977b65307K330J23585j10211M3522k5988B16357b12202D6480i8110A25117a23131
18965F2075J92424c57085e6983j93919O3849P8465I1361a28128D711J05611b1808
18953A321O5360J68360p6391b72894A2178J3728J2728J2823d6903l6147a095j07326
18941a08421E0980J23738D6605N2963h5773A72601d9925D5871J87809p1378a90187
18929A63692J57598a2513l9286j64375H5131f4543k03618J27290E4682b4303p4573
$$ y = [95267, -76266, -18557, -343504, 132303, -143286, -157275, -90539, -168026, 89229, -189719, 34909, -364004, -13417, 138462, 6312, -262474, 53250, -148607, 98141, 55780, -115162, -315627, 27799, -143470, -294227, -109842, -290768, 62751, -355224, 90245, 118176, 144544, -223518, 188491, -265307, -262977, -139392, -249603, -206081, -232069, 216357, -212202, 46480, -98110, 125117, -123131, 62075, 254499, -357085, -56983, -250902, -187053, -108588, 91361, -128128, 4711, 110322, -21808, 1321, 66681, 235041, 158650, -272894, 12178, 25906, 38634, 51457, -46903, -83050, -1095, -108421, 50980, 174718, 46605, 99568, -85773, 172601, -49925, 45871, 233680, 162302, -190187, 163692, 321290, -12513, -51799, -216174, 85131, -64543, -268161, -140871, 54682, -24303, -98876]
18918i8876d3187l4796D9194b79877C68184a98154j40748g6631E31501b15183
18907b21247M5489d9078H5298B9427L6859d22526G5245a34261O2306j24865o9526
18896b66346A13619k9534J6060R3400a23344A49979a40730M8499j17321A29993
18885b71462H721N725J6370K06160m7173Q6461a67536I8084b17097i8562D0156
18873b40430b2091r5447K6137B60132p7219b4365q8585c734A06674i0455K1464
18862f8991l58490d4264A96903J31173J80261c0396D6787J41727d5049C9927j7511
18851B2416e4084H8103g4311B6183e11E6379d30706H1881c60502g1129A14255
18839d7021C0945M8486a35526E8398J795b05233b7384A02301c90532e9443K7734
$$ y = [-98876, -43187, -77983, 49194, -279877, 368184, -198154, -338902, -76631, 531501, -215183, -221247, -175758, -49078, 85298, 29427, 66286, -422526, 75245, -134261, -71955, -196820, -266346, 113619, 84085, 100145, 193545, -123344, 149979, -140730, -92231, -209552, 129993, -271462, 8721, 14446, 30816, 236976, 189803, 276264, -167536, 98084, -217097, -98562, 40156, -240430, -22091, -117538, -91401, 260132, 182913, -24365, -112950, -3734, 106674, -90455, -68991, -427481, -44264, 196903, 328076, 508337, -30396, 46787, 188514, -45049, 39927, 22416, -54084, 88103, -74311, 26183, -511, 56379, -430706, 81881, -360502, -71129, 114255, -47021, 30945, 79431, -135526, 58398, 60193, -205233, -27384, 102301, -390532, -59443, -31709]
18828c1709j08757a655E2208J87541b63146A3157J78389b50188q9105A56333e0518
18816A5714b03109B14128C7752l443L52459a44866r1905C30525a98051k1404I8279
18804g841j32464n3969F5439Q9587b68351f2537A11922E022K263c81767a65613
18792c06035A500a55146k1890Q4703n1372H4162l7178Q5855c61643G1771a87769
18780A6571M5527i761r6117K3891J5254C5161c78871J42132J07616K7306C1478
18768F0993B5464b01562B65751H7972b71666H383f6601o5617l07842b2483A39155
18756d2885j69l0786j6507E7831a51030A73431a04897j38673g3829L5499m36804
18745d75134A80127a68276b5284j0279j79347P7241e6108B05928b69611H4834
$$ y = [-31709, -140466, -1655, 52208, 239749, -263146, 13157, 191546, -250188, -339293, 156333, -50518, 15714, -203109, 214128, 37752, 34309, 386768, -144866, -236771, 330525, -198051, -219455, 98279, -7841, -140305, -194274, 65439, 155026, -268351, -62537, 111922, 5022, 7285, -381767, -165613, -306035, 1500, -155146, -177036, -92333, -143705, 84162, 46984, 132839, -361643, 71771, -187769, 16571, 62098, -9761, -105878, -81987, -66733, 35161, -378871, -236739, -129123, -101817, 31478, 60993, 25464, -201562, 265751, 87972, -271666, 8383, -66601, -132218, -440060, -22483, 139155, -42885, -43054, -73840, -90347, 57831, -151030, 173431, -104897, -243570, -73829, -38330, -475134, 180127, -168276, -25284, -35563, -214910, -137669, -56108, 205928, -269611, 84834]
18734B48407c5176M094k34966k17100a81043J1106B47046a69248A315a18838M4864
18723g3974k4989H7771a8635h355j4181A20034b28218R5654j51628j12649d1077
18711a42866j63234A33061A4837R6659R9268E1392b10984F8428c39705A38297
18700a31022l871j29038J18622A47904n4751d33j53997O0832j48729a14618A82791
18688c7087k67488a30354o2323A18952i7950D9687j7290p083P5751c33863c9384
18676e7692k59586i4366c259r9650D0429b04251g9541r7533A01003H804a89350
18664b35812i7656A05992k8802a64608I5908j73c7008j34757c7336j00944b6690
18652a92363j18850B7270J75254a2354A82704a37221I2487H659P101K4990a65549
$$ y = [248407, -35176, -31082, -266048, -483148, -181043, -169937, 247046, -169248, 1315, -118838, -73974, -98963, 87771, -18635, -8355, -22536, 120034, -228218, -132564, -284192, -396841, -41077, -142866, -306100, 133061, 14837, 111496, 210764, 51392, -210984, 68428, -339705, 138297, -131022, -134893, -263931, -145309, 147904, 93153, -433, -154430, -93598, -242327, -114618, 182791, -37087, -304575, -130354, -192677, 118952, -97950, 49687, 32397, 25314, 101065, -333863, -39384, -57692, -317278, -94366, -3259, -102909, 40429, -204251, -79541, -177074, 101003, 8804, -189350, -235812, -97656, 105992, 77190, -164608, 95908, 95735, -37008, -171765, -37336, -138280, -26690, -192363, -311213, 27270, 202524, -12354, 182704, -137221, 92487, 8659, 15760, 40750, -165549]
18640D6239g6703c8012E5217K37149f8365q4691N8522A65088b80747A71949b24368
18628B53355b6124D2612i7863l9302O5895b3261A44457b80438I5412J0047J1548
18617A17007a37496J1959C0196F01h1394E1349A8982c5891I9197a70463E8163
18605A56220a50474G6375O6714a81119G8695b84120b4130j54053m0331j94863
18595d13377h2787j18357o8796N2911G2938a92886A80719d8211j43812d8181B10389
18583a01848B8633Q9080a59299D38951a77463l28504a41391H5618a17991B04906
18572B60781C3429g3113I8599b0855B59573b5684A17717h3180A23513N9590K80326
18561D63429a24565n2047m486I0603a75576M6118E6992a56727l01246a40974L8007
$$ y = [46239, -76703, -38012, 55217, 292366, -68365, -153056, -94534, 165088, -280747, 171949, -224368, 253355, -26124, 42612, -97863, -137165, -71270, -23261, 144457, -280438, 95412, 105459, 117007, -137496, -125537, 30196, 601, -81394, 51349, 18982, -35891, 99197, -170463, 58163, 156220, -150474, 76375, 143089, -181119, 78695, -284120, -24130, -178183, -218514, -413377, -82787, -201144, -269940, -217029, 72938, -192886, 180719, -48211, -192023, -48181, 210389, -101848, 28633, 117713, -159299, 438951, -177463, -505967, -141391, 85618, -117991, 204906, 260781, 33429, -73113, 98599, -20855, 259573, -25684, 117717, -83180, 123513, 183103, 463429, -124565, -176612, -181098, 90603, -175576, -129458, 56992, -156727, -457973, -140974, -102967]
18550a02967A04568i2082j7388k03058J11383R0387N757J7880k49064J2965B12974
18538A48055d9816A5377a64824O4070H7036k4728J6298a81083F8826a51086A06336
18526d11942a7352j14477o2607a1515j8158o3304F7225b50836A739d4748k85398
18515c30146c9075j64602d3302j28967h2791c615l42712C3413a1083p9750k405
18504i3238b6299B14388B7720L5098b7171B5606e27725d2432B55592c13161J17481
18493a95680C23691d96436a20268o9418o6841c5746A34202g8286m36803L7362
18483d77727K37828a02792B1579b7490H0417M5093i354A49255n9442a05143M3218
18472f1925J716D2384G496b6924J2887C32152E0184K14620a21443j0040d8872
$$ y = [-102967, 104568, -92082, -109470, -312528, -201145, -110758, -105001, -87121, -336185, -323220, 212974, 148055, -49816, 15377, -164824, -100754, 87036, 62308, 78606, -181083, 68826, -151086, 106336, -411942, -17352, -131829, -194436, -11515, -29673, -92977, 67225, -250836, 1739, -44748, -330146, -39075, -203677, -43302, -172269, -82791, -3615, -346327, 33413, -11083, -90833, -93238, -26299, 214388, 27720, 62818, -27171, 25606, -527725, -42432, 255592, -313161, -195680, 323691, -496436, -120268, -189686, -256527, -35746, 134202, -78286, -515089, -477727, -239899, -102792, 21579, -27490, 80417, 125510, -9354, 149255, 89813, -105143, -61925, -60209, 42384, 7496, -26924, -14037, 332152, 50184, 264804, -121443, -131483, -48872]
18460a99605J1101j22713G8813b80257J21684A56634g0008A90327q9280a06636
18449h2065C58123a80190h5960D7572a71889A41927a65532H5021a65569H3161
18438A7420a45459C2272d45595F0506O1916m0784a27824j64561b9768D3158i939
18426a96336g6642B4761d7011j92248C6480b00703B16407C9225c78841A45789
18415c1913E3208b66019B03186O4079g5668A55244A182a67955A04899L20108A44948
18403f4974A50251J40399g1888A60112p3425h6338A1606d9384k12627J18021A35695
18391B3661a46017j24358a17250B16259J648e8864I1513b42011d4373A87125a3151
18379g2495c0606j03229B50463A01728a82352L3128B10897A8081a43211b0516
$$ y = [-199605, -188504, -311217, 78813, -280257, -158573, 156634, -70008, 190327, 101047, -106636, -82065, 358123, -180190, -85960, 47572, -171889, 141927, -165532, 85021, -165569, 83161, 17420, -145459, 32272, -445595, 60506, 122422, 81638, -127824, -292385, -29768, 43158, -9939, -196336, -76642, 24761, -47011, -239259, 36480, -200703, 216407, 39225, -378841, 145789, -31913, 53208, -266019, 203186, 267265, -75668, 155244, 1182, -167955, 104899, 425007, 144948, -64974, 150251, 290650, -71888, 160112, 86687, -86338, 11606, -49384, -262011, -143990, 135695, 23661, -146017, -270375, -117250, 216259, 217907, -58864, 91513, -242011, -44373, 187125, -13151, -72495, -30606, -133835, 250463, 101728, -182352, -149224, 210897, 18081, -143211, -20516]
18368A32896c7594A7798a08697K5081C27608E5913b29710B03657L820a00228J036
18357i9192B1190K60786H1165a4015B1764K81886D2789N6059c01154N5092f9621
18345a32875F4994j0421J56878J445p2788c3739A45865b1476I7142K57715j47002
18334B07855d29946L047A36828a1235B14019d1613C51936c76657c5128A63873
18323b75200J00370A20763J19067c55077j72701a08443r2176A05650d4463k9768
18313g4231m026D6847b3470j49927p1491j9348a6398A9118J5815J4080j2862h0740
18300E2066H989d35968d4683o3888j23113h8647o4390H2515J9753a31399A82173
18288a18790A73150a98428Q8635F0946a92295f5355C9950d2008J3680k88551J34975
$$ y = [132896, -37594, 17798, -108697, -83616, 327608, 55913, -229710, 203657, 207477, -100228, -99192, 21190, 281976, 81165, -14015, 21764, 303650, 42789, 98848, -301154, -246062, -69621, -132875, 64994, 54573, 211451, 212896, 140108, -33739, 145865, -21476, 97142, 354857, 207855, -429946, -426899, 136828, -11235, 214019, -41613, 351936, -376657, -35128, 163873, -275200, -174830, 120763, 239830, -355077, -527778, -108443, -200619, 105650, -44463, -74231, -78257, 46847, -23470, -173397, -244888, -264236, -16398, 19118, 34933, 49013, 36151, -80740, 52066, 8989, -435968, -44683, -108571, -231684, -88647, -153037, 82515, 102268, -131399, 182173, -118790, 173150, -198428, -109793, 60946, -192295, -65355, 39950, -42008, -28328, -316879, -181904]
18277a81904D5600J1249a73590b0915B481J92971a98959F6022B8853a78623b5598
18265d5562O288F0514k0474b70463q5187A06735J5281i9538B5485J32458a03538
18253b04766E2506f5500B08073C9000a76199E8495a51604j59638a12603M6977
18243f5626J5164k24637c5821j2282n1093M2832k32170c6597E9163b51343J03768
18232a47575j27539J30960A25680a1647A99855r3350J05171a58095l753F8892
18221b62872c7072A80016E0759e8874l3005o2418A31323e8103j2465E73a85420
18209d4688l81223d9928m9677A1292d17418d362E0748b54568A08208a16499D978
18197b22751J8216B69036e7100l7406B37508F2907h3460j35489Q1869k04640f8701
$$ y = [-181904, 45600, 56849, -173590, -20915, 2481, 195452, -198959, 66022, 28853, -178623, -25598, -45562, -39274, 60514, 40040, -270463, -355650, 106735, 122016, -99538, 25485, 157943, -103538, -204766, 52506, -65500, 208073, 39000, -176199, 58495, -151604, -311242, -112603, -65626, -50462, -275099, -35821, -48103, -99196, -56364, -288534, -36597, 59163, -251343, -147575, -275114, -144154, 125680, -11647, 199855, 106505, 211676, -158095, -161848, 68892, -262872, -37072, 180016, 50759, -58874, -91879, -154297, 131323, -58103, -70568, 573, -185420, -44688, -425911, -49928, -99605, 11292, -417418, -4362, 50748, -254568, 108208, -116499, 4978, -222751, -204535, 269036, -57100, -94506, 237508, 62907, -83460, -218949, -137080, -341720, -68701]
18185a61721g5587m2473b0281E1128d3105j9707B3402J10062O3886a758l96823
18174c98581I1035A0896e5771F7876b39196D6574a58783d380C29768c49061G2473
18162b2424H2366K0109b95149J10761b3080n7963A96912D7135a55587E2623K0660
18151G3283k2478J87972c30344A46607b43422g3190A84375D8931b58300Q5125
18141a73175n8948A09055i680m21447A40284J57386C8886a0873j35252c763F0681
18129A57210a24672N8692r8797I6323A944L48467c65342B86171e4092A26681J93957
18118C20638j14939E6494h6977j45726A08091C6095J03113i814m1147h39l1482
18107c2321F3798L9876A1946m104J00869e85120A35535a16235b0774A6975K88556
$$ y = [-161721, -75587, -118060, -20281, 51128, -43105, -62812, 23402, 133464, 197350, -1758, -398581, 91035, 10896, -55771, 67876, -239196, 46574, -158783, -4380, 329768, -349061, 72473, -22424, 82366, 102475, -295149, -184388, -23080, -81043, 196912, 47135, -155587, 52623, 73283, 50805, 238777, -330344, 146607, -243422, -73190, 184375, 48931, -258300, -173175, -232123, 109055, -9680, -431127, 140284, 297670, 38886, -10873, -146125, -3763, 60681, 157210, -124672, -65980, -164777, 96323, 1944, 350411, -365342, 286171, -54092, 126681, 320638, 205699, 56494, -86977, -232703, 108091, 36095, 139208, -9814, -50961, -839, -32321, 63798, 103674, 11946, 7842, 108711, -585120, 135535, -116235, -20774, 16975, 305531]
18096C05531a96793A72030e83015J91746A13152L5145a53999H9885b6855A04585
18085i6111B77407d3093B69509F9558c09927i0891F2605a90623b4321j53031e4995
18073B2597J04734b62919a22304o5063K5026A18891D6143d30627b8925A10186
18062i5856i308k71190K4416B63670a96282j49240A03929f0976A74145g9695H4939
18050a65629n6720D0036J43328H5431J00628M7945a10193B37449a12249j30905
18040b43154J17373A45880N0074a76503m4841l8817D0567g0909j21483n8857F648
18028d9898p8819M8294j22054Q3541b0657c338G8688c1847m1261l5617D0308A7498
18015A8225f7264B8236J66463C7868a59225D6514L94665a05536r6123D9373b5651
$$ y = [305531, -196793, 172030, -583015, -391269, 113152, 148297, -153999, 89885, -26855, 104585, -96111, 277407, -43093, 269509, 69558, -309927, -90891, 62605, -190623, -24321, -177352, -54995, 22597, 127331, -262919, -122304, -187367, -162341, 118891, 46143, -430627, -28925, 110186, -95856, -9308, -280498, -256082, 263670, -196282, -345522, 103929, -60976, 174145, -79695, 84939, -165629, -222349, 40036, 183364, 85431, 186059, 234004, -110193, 237449, -112249, -243154, -125781, 145880, 195954, -176503, -221344, -260161, 40567, -70909, -192392, -251249, 6648, -49898, -128717, -80423, -202477, -118936, -20657, -3338, 78688, -31847, -73108, -108725, 40308, 17498, 18225, -67264, 28236, 194699, 37868, -159225, 46514, 441179, -105536, -201659, 49373, -25651]
18003a30748q9253j39046C76493b64896N92l03512A01143L2911c47738C99566
17992C2903i8822H8259N6905k4126D9946K09049D5643c02870A46757O5645a04819
17980H6815J27668n9169o9253J0389l6786K23724H5713A7486b2267r1332B20576
17968b53261D6496R4761b8573H918a89519b590k30491G5055a35948C7530O910
17957D4440J0525K59434f2569j30120E7023b99545C83764e8156A32477o2616e40338
17945b13474A64064O6323i5746A72839A7930f0096b84D19140e6010n2778A58875
17933A21187B4064a61888a9714k42284O4354b0284l65974O3130b012F3404J29503
17922A92907b40307c6410l15596a33713A14217C0347N3124f6141A21222J19590
$$ y = [-130748, -220001, -359047, 376493, -264896, -264304, -567816, 101143, 134054, -347738, 399566, 32903, -98822, 88259, 145164, 121038, 49946, 258995, 45643, -302870, 146757, 212402, -104819, 86815, 214483, 155314, 86061, 96450, 59664, 283388, 85713, 17486, -22267, -113599, 220576, -253261, 46496, 141257, -28573, 8918, -189519, -2590, -233081, 75055, -135948, 37530, 44440, 54965, 314399, -62569, -192689, 57023, -299545, 383764, -58156, 132477, 69861, -540338, -213474, 164064, 230387, -95746, 172839, 17930, -60096, -284, 419140, -56010, -108788, 158875, 121187, 24064, -161888, -19714, -261998, -197644, -20284, -386258, -323128, -2012, 63404, 192907, -240307, -36410, -352006, -133713, 114217, 30347, 83471, -66141, 121222, 240812]
17912B40812A6661P7435a57304m0962f0055A5344h3181I7886e783k16898B49738
17900b4547A7610J37076a25495k32746a59766N2668p7256M7651B54249b46771
17889b68604a08214G3391C5675L1234c01109c2283C8265K63108a45696j33689
17879b79385c589A67935j1421c20330e4027A00687c23654D9732O7053D7827b50023
17867a57360D12838a57825B84030b38448C5305f1717A3582g7783A21545j1377
17857A10168a54065A37042n327J3296e3058r2777H838N41601b59254A46321E0291
17845A73181a88426G8307R4378P3941B8447J91400K25575b05824C3525b00402
17834A97121A7719b39967b0984l1304q4199A12500Q15a78750B3721J09338d16669
$$ y = [240812, 16661, 94096, -157304, -198266, -60055, 15344, -83181, 97886, -5783, -222681, 249738, -24547, 17610, 154686, -125495, -358241, -159766, -107098, -184354, -136703, 254249, -246771, -268604, -108214, 73391, 35675, 66909, -301109, -32283, 38265, 301373, -145696, -279385, -3589, 167935, 156514, -320330, -54027, 100687, -323654, 49732, 116785, 47827, -250023, -157360, 412838, -157825, 284030, -238448, 35305, -61717, 13582, -77783, 121545, 110168, -154065, 137042, 131715, 145011, -53058, -145835, 8838, 550439, -259254, 146321, 50291, 173181, -188426, 78307, 172685, 246626, 28447, 219847, 445422, -205824, 33525, -200402, 197121, 17719, -239967, -20984, -52288, -136487, 112500, 113315, -178750, 23721, 133059, -416669]
17822G6090K41158F6393q145a09134B85749a1234j17036C5999O9949c07487B69383
17810a65511B08237l43a04278a2886k22165J03983N9909n097f111j42415m0577
17799a89103A15886j979n2884a36046J1465f554m04837K03802d1205B5202a85757
17787a22960e6541r9143B33575a08296j441K1015k14985h6084I7293b0700j25068
17776a45768G6590b95250j2592A52833a6876B29156a14668p0960C15496C2257
17765A13573e8863j12165M6087A5781R0822b17082n1415g7752a4114A89806a1743
17753A80070A8787J40703a158j12903B9149a14197n6866H7818a23575C48930h0509
17741f5058E348K31167a18043J2682B53297j4653a39718H6696f6401B9510J78577
$$ y = [76090, 317248, 66393, 58248, -109134, 285749, -11234, -128270, 35999, 105948, -307487, 269383, -165511, 208237, 207894, -104278, -12886, -235051, -131068, -71159, -76256, -6111, -148526, -189103, 115886, 113907, 61023, -136046, -124581, -6554, -411391, -207589, -41205, 25202, -185757, -122960, -56541, -155684, 233575, -108296, -109737, -88722, -303707, -86084, 97293, -20700, -145768, 76590, -295250, -307842, 152833, -16876, 229156, -114668, -185628, 315496, 32257, 113573, -58863, -171028, -124941, 15781, 106603, -217082, -268497, -77752, -14114, 189806, -11743, 180070, 18787, 159490, -1158, -114061, 29149, -114197, -171063, 87818, -123575, 348930, -80509, -65058, 5348, 236515, -118043, -105361, 253297, 238644, -139718, 86696, -66401, 29510, 208087]
17730B08087g2221i0F7608d57403H6867J97955j3933i233B6444A0098a77724B26927
17717I54J03370R5159a76437k3918B3352J35475F8158J22217g818A48390a90343
17705c94755R9869D6501b46938C75717j87554b1950o3265j01505c8269m9223A17292
17693c173H9990R5179J14120P0157a52302B03120b43575f8930C20673H703b5279
17681a58317m48p8784B64987G0645O7886O6564q0269D8675L86744h0026A54619
17669a42951e1449j67845H2326J19545E633f5361m8467M8583G1491d3701D4022
17657a17756r0557g8760i62A26157a9884A50550B6745K47515b3075D3437c44771
17645A7472A524P226b20032F7636J5551Q2687n2535b5311k37398H3647J32794
$$ y = [208087, -72221, -90, 67608, -457403, 86867, 284822, 270889, -9233, 26444, 10098, -177724, 226927, 954, 104324, 199483, -176437, -200355, 23352, 158827, 68158, 190375, -7818, 148390, -190343, -394755, -294886, 46501, -246938, 375717, 188163, -21950, -85215, -186720, -38269, -87492, 117292, -3173, 89990, 185169, 299289, 369446, -152302, 203120, -243575, -68930, 320673, 8703, -25279, -158317, -158765, -237549, 264987, 70645, 138531, 205095, 124826, 48675, 435419, -80026, 154619, -142951, -51449, -219294, 82326, 201871, 5633, -65361, -113828, -65245, 71491, -43701, 44022, -117756, -208313, -78760, -962, 126157, -19884, 150550, 26745, 274260, -23075, 43437, -344771, 17472, 1524, 8750, -220032, 67636, 83187, 165874, 113339, -25311, -262709, 83647, 216441]
17634B16441p1906F0211h1566B29147H2528J48408i6957k0285d2119C2172K45072
17623B77244M2916A16421c26679g6499m9615j16429i0359j03751A42653B5938
17612f8615A5101b8633F1108R3529E8094J92278j9489a84377N5355D87f6019q6378
17600a52397A48205a12413L6746A75870a9038d284j09408A68605e8056q5506d690
17588h7445A88897n4129E821a41135A343M9817C244J49959b6926j10459e7679
17576b67446A59668o8596A1944N2730O9202Q5832N8691r6789a59190C82063C2628
17564I2666L7708i8742A03256P3492p5399N426J22849n7977G9389b6890A78834
17552F4473L7383a29689e2839A63743e8124C11800j22740a10744e1143A631a9486
$$ y = [216441, 144535, 60211, -81566, 229147, 82528, 230936, -96957, -117242, -42119, 32172, 277244, 320160, 116421, -326679, -76499, -126114, -242543, -90359, -194110, 142653, 25938, -68615, 15101, -28633, 61108, 154637, 58094, 250372, 230883, -184377, -129022, 487, -66019, -152397, 148205, -112413, -75667, 175870, -19038, -4284, -113692, 168605, -58056, -143562, -4690, -87445, 188897, 134768, 5821, -141135, 1343, 51160, 3244, 153203, -26926, -137385, -57679, -267446, 159668, 91072, 11944, 64674, 133876, 219708, 278399, 181610, -159190, 382063, 32628, 92666, 130374, -98742, 103256, 176748, 101349, 106775, 229624, 171647, 79389, -26890, 178834, 64473, 101856, -129689, -52839, 163743, -58124, 311800, 189060, -110744, -51143, 1631, -19486]
17540A30872j6245P274g6200B35157c28635G747j677J62020l8974c19217A10377
17528b10062b3797I2652a33037B04764o194K4190M408g3321m2763C45752E4476
17516A18554K44773c7704A30887D9455J89374K43431a08340A24309K09013H7085
17505a21694A88249c41789B68965q6787L6734p011J35573F5019J78154e6290G2316
17493D6516i7817A59065R822m4161a82002e1620D3232N208c2370k44534D63779
17481B60714m2951A08176r724j3402b42420B90411j21648c09387E1562a25958
17470B33694J71943C5894K13540F4236L82112i381E9081J49815d3460A81785R108
17459A90893D0851c93362E5187J58828a0138j5595I0985M4466J91907k1678K08820
$$ y = [130872, 114627, 121901, -76200, 235157, -328635, 7747, 6070, 168090, 129116, -319217, 110377, -210062, -23797, 92652, -133037, 204764, 198570, 222760, 227168, -73321, -116084, 345752, 54476, 118554, 363327, -37704, 130887, 49455, 238829, 482260, -108340, 124309, 333322, 87085, -121694, 188249, -341789, 268965, 182178, 218912, 211901, 347474, 65019, 243173, -56290, 72316, 46516, -97817, 159065, 168887, 124726, -182002, -51620, 43232, 48440, -32370, -276904, 463779, 260714, 217763, 108176, 98452, 85050, -242420, 290411, 168763, -309387, 51562, -125958, 233694, 405637, 35894, 249434, 64236, 446348, -9381, 59081, 208896, -43460, 181785, 190893, 40851, -393362, 55187, 214015, -10138, -25733, 90985, 135451, 327358, 305680, 514500]
17448E14500C6255M69514R9623f206A2678K55500O4198b9704A78141k0765J97256
17437C54632o7624k8768R0211l4784J14221k08600Q2216i7958D42394A85314H4797
17425D8891J53929H2532N01673H9077Q6135f483C15022A00192Q9890G0629L18776
17414C89405r9828n8281l5049C8151e8272I7771K44272b1948B57397J32443j76424
17403B13416h1610r0357D5317J29021q1129N245J39684k4770K8756n6973b49195
17391A31510J90834L9779H4101R7763p4011b339B88353Q848E718K17755F2056
17379D99623A91642A4229g2566A55398J58637E1541K1705J18787P4739c0D2468
17367I419K07275j6832J05117C926M55956j67415j34578C7056J29523J1486O2915
$$ y = [514500, 36255, 505769, 605392, -6206, 12678, 268178, 332376, -29704, 178141, 157376, 354632, 287008, 258240, 348451, 313667, 427888, 219288, 301504, -97958, 442394, 185314, 84797, 48891, 202820, 82532, 584205, 89077, 175212, -6483, 315022, 100192, 190082, 70629, 389405, 289577, 231296, 196247, 38151, -58272, 97771, 342043, -21948, 257397, 389840, 213416, -81610, -171967, 45317, 174338, 93209, 98454, 238138, 213368, 242124, 185151, -249195, 131510, 322344, 362123, 84101, 181864, 107853, -2339, 288353, 297201, 5718, 223473, 62056, 499623, 191642, 14229, -72566, 155398, 314035, 51541, 73246, 192033, 266772, -30, 42468, 9419, 216694, 199862, 304979, 3926, 459882, 292467, 157889, 37056, 166579, 178065, 240980]
17356B40980a74535C40395A34341C7724J89681F9026M62405B64924L8590A34386
17345A86606K24543j29020b3464D3307c93938C05427d9341D84323j70810A02344
17334a13112B41139J5475I8862B1084K10009F3423K2919i8105G7235M57580A20029
17322D30288a53364j56747C27829J22198b10920A59071B0026K82852b4619e696
17311A88744j2010J22501a46940A19147a12550F7106J83652A03375b85109b8941
17300A92238a44737K6355B06203M259K52423A10293J40758C5972N8849k2520R8631
17289A70932G2290J72038Q7482R353A67263G3648O7070J92442j21101k8402k782
17278A80875J8446K11112j95213d1884D67269P2380h6655A36493j8708L08231
$$ y = [240980, -174535, 340395, 134341, 37724, 227405, 69026, 531431, 264924, 303514, 134386, 186606, 411149, 282129, -23464, 43307, -393938, 305427, -49341, 484323, 313513, 102344, -113112, 241139, 256614, 98862, 21084, 231093, 63423, 86342, -98105, 77235, 534815, 120029, 430288, -153364, -310111, 327829, 450027, -210920, 159071, 20026, 302878, -24619, -5696, 188744, 176734, 299235, -146940, 119147, -112550, 67106, 250758, 103375, -285109, -28941, 192238, -144737, -118382, 206203, 210462, 462885, 110293, 251051, 35972, 94821, 72301, 170932, 72290, 244328, 331810, 341163, 167263, 73648, 140718, 333160, 212059, 183657, 180875, 199321, 410433, 215220, -41884, 467269, 539649, -86655, 136493, 117785, 426016]
17268D26016O9905k43449A8778J37354O5814J9204m9485k9724E7626J38789c1689
17256D1061O26502g4466E8877B1697O4062g8424B39670J53927a07310C640J31554
17245A35194K3474J27759m0314f8716C27072A20349J51460j877j20419P0110P4298
17234B93921p5096J56639o3745F0765O8497J04108G9399P5955f2232E23878A38206
17222D7370K33549F9843R6310n5496O7470K0736r2766j1112K19278R373A11243
17210B59468j10781i0764D33629j21379A45931E1253J44553b4949C70543G4383
17199D189N9027b8510A2583K11569K12013j01529j27049C4643L83601j41813o0551
17188B15880n7154K1747K87294I9952L10075j25886J06664q9489a04415C64917
$$ y = [426016, 495921, 252472, 18778, 156132, 221946, 241150, 191665, 161941, 57626, 196415, -31689, 41061, 667563, -74466, 58877, 21697, 85759, -78424, 239670, 393597, -107310, 3640, 135194, 158668, 286427, 246113, -68716, 327072, 120349, 271809, 269932, 149513, 219623, 293921, 218825, 375464, 311719, 60765, 129262, 233370, 79399, 155354, -62232, 523878, 138206, 47370, 280919, 69843, 166153, 110657, 178127, 198863, 106097, 94985, 314263, 323636, 111243, 259468, 148687, -90764, 433629, 312250, 145931, 51253, 195806, -24949, 370543, 74383, 4189, 63216, -28510, 12583, 224152, 436165, 334636, 207587, 34643, 418244, 276431, 215880, 158726, 180473, 467767, 99952, 410027, 284141, 390805, 301316, -104415, 364917]
17177B70983A14253J24463a1134B75210j3719J68194j27950p1183J80346n8706
17167C52192R6779J08176o6631F8919J28641J42359C0568M607K49768j27005k1604
17156A36334E7405M66411k46786J79017k19990O5258a87110A88313n434b8583
17145A15335M84731B79542F8498R2356P4038L7332J17419F6226J24314E083P4831
17134G9914R3281m0845K98143p7350P2749j61880a6842A90031K94486q7744F7792
17122D39781j32801J28902p2151J1360J80445r3831j17526B9513O33841I3289
17111C93231a78182A07600J11422j1166N04747C14323K51798j65045o9444j34152
17101A97480J33053K27953O2527l2813k27041p8030l57m9201J39289A62713J80647
$$ y = [270983, 114253, 238716, -11134, 275210, 261491, 429685, 301735, 230552, 410898, 352192, 448971, 557147, 490516, 68919, 197560, 339919, 30568, 35175, 284943, 157938, 136334, 57405, 523816, 277030, 456047, 236057, 301315, -187110, 188313, 182879, -28583, 115335, 600066, 279542, 68498, 160854, 234892, 272224, 389643, 66226, 190540, 5083, 79914, 173195, 132350, 430493, 353143, 425892, 264012, -16842, 190031, 484517, 396773, 67792, 439781, 306980, 435882, 363731, 375091, 555536, 461705, 344179, 29513, 663354, 93289, 393231, -178182, 107600, 219022, 207856, 712603, 314323, 566121, 401076, 331632, 197480, 330533, 558486, 621013, 588200, 361159, 283129, 282772, 233571, 372860, 162713, 343360]
17090C43360J42033L8303o055B17684K16419A53098J42599J00388J15294B43634
17079A29230K48663p873o7322j17806O842K68397j3659J7811Q9042B68163j1663
17068B56500N6281K22873j79855l6491j37544K35863j35885O4206M07508k45124
17058E08332p7489J35654o8702k13334Q8483J96333j98558j44074J61173j39049
17048B48769M18007k45487J20217l7035M4529j91118K49051K78534k19893C06429
17037D45455L41220B89499R5272J65211P0146q1724j90570L81254l44589J00009
17027D84508k9845p1523J43608j85790L03744L5441M8847j19463o3986J29031
17017F74572j76074k4683L22044C67652J73762L60435k82871M871L6446n6266
$$ y = [343360, 485393, 523696, 517641, 217684, 434103, 153098, 295697, 396085, 511379, 243634, 129230, 377893, 370020, 302698, 184892, 191734, 460131, 446472, 464283, 553325, 268163, 256500, 312781, 535654, 355799, 319308, 181764, 417627, 281742, 345948, 753456, 508332, 430843, 566497, 497795, 284461, 372944, 569277, 370719, 226645, 387818, 248769, 666776, 421289, 541506, 504471, 549000, 357882, 606933, 885467, 665574, 306429, 445455, 786675, 289499, 384771, 549982, 620128, 538404, 347834, 729088, 384499, 484508, 454663, 383140, 526748, 340958, 644702, 680143, 728990, 609527, 545541, 674572, 498498, 473815, 795859, 367652, 541414, 901849, 618978, 623849, 660295, 604029]
17007F04029k21294K16571J09053j1647k54954m3793P4363K88266N3100k13658
16997F00036r5744P19743m61469r8269O6397r8377K75471l12010P2844J92890
16987H61512k6260j64916J62607P8773j04147j76729O8182q2106M55391K73922
16977A346229m67023l46500J52600J40208J34352k8406L1952r4788k01830J15877
16967G82671J37664l06699o6019K19317J23883J41971j7601m01468J88486K51289
16957A053494k99171J61625L05740l31055J73900l30406N14534l85148L9786J78688
16947A081987n7406l6183j4051L21761l41397K02363N5339m2609O3551k53515
16937I79840K26236m02409M11977k76696J72068J68627n88031P93117n98792J77687
$$ y = [604029, 382735, 599306, 708359, 696712, 441758, 397965, 472328, 760594, 813694, 600036, 504292, 1224035, 762566, 664297, 730694, 632317, 907788, 595778, 668622, 861512, 835252, 670336, 832943, 911716, 807569, 630840, 699022, 616916, 1072307, 1346229, 879206, 532706, 685306, 825514, 959866, 931460, 963412, 868624, 666794, 782671, 920335, 613636, 547617, 766934, 890817, 1032788, 1015187, 613719, 802205, 1053494, 754323, 915948, 1221688, 890633, 1064533, 734127, 1248661, 863513, 903299, 1081987, 1024581, 988398, 974347, 1296108, 954711, 1157074, 1212413, 1169804, 1233355, 979840, 1206076, 803667, 1215644, 938948, 1111016, 1279643, 691612, 1484729, 885937, 1063624]
16927A063624J53806K80958j87175j76789J11173j41529K24007k35311J35444
16918A228208J88858J79461n4374l94053K06028Q3495J46362L7268k82391M20500
16908A759362m24704L36320l2371K34189l23624K0190l5682k46025K19194j19912
16898A386937J83284K25390j45308J41568j14078m6600J58584R8881N3216k21236
16888A720638J91758j23225J77701m17440M69663K65273k35459j00503q913M0084
16878A979577O0729L83173m07724J72399J1215k39099m4148N83785n6802j17012
16868B326093L6506J71406J33078J01183m25388J45758J74088j22238j1917J15876
16858B644445P8946n2988j39079L65032L56623k61150J0209J29213j28045Q1447
$$ y = [1063624, 1217430, 1498388, 1311213, 1134424, 1245597, 1104068, 1328075, 1092764, 1228208, 1417066, 1596527, 1542153, 1148100, 1354128, 1437623, 1583985, 1621253, 1338862, 1759362, 1334658, 1670978, 1638607, 1872796, 1549172, 1569362, 1533680, 1287655, 1506849, 1386937, 1570221, 1795611, 1650303, 1791871, 1677793, 1631193, 1789777, 1888658, 1941874, 1720638, 1912396, 1789171, 1966872, 1549432, 2019095, 2284368, 2048909, 1948406, 1939493, 1979577, 2040306, 2423479, 2015755, 2188154, 2199369, 1960270, 1916122, 2499907, 2443105, 2326093, 2362599, 2534005, 2667083, 2768266, 2342878, 2488636, 2662724, 2540486, 2528569, 2644445, 2723391, 2670403, 2531324, 2896356, 3252979, 2991829, 3002038, 3131251, 3003206, 3084653]
16848C084653k40598M24389R2712m68647J80038M87530n04269K91753k117l3426
16838C312018J98539k13608L70068q578K25335O1908J31470n6929L51367J0016
16828D381606l43521L61246L16222k33327K74869J21019k15809L18524L05106
16819E285935j90153K60458j68448M81661k97023M2944M68916j25366p5942k54582
16809E428400P96837K12754l58944M96056q2503L60085j73728Q55590r0044p0029
16799G374474L01988o3022J54543J85014M36786R6122J37998o4369N24890L90385
16789I474809K67321J56041K00478N32956p9610J54473N95929N86276l8959M82396
16779A2332110K92386O87969J03972Q47209J64600M44067M41151M10068Q13425
$$ y = [3084653, 2844055, 3268444, 3361156, 2892509, 3072547, 3560077, 3055808, 3347561, 3345444, 3312018, 3510557, 3296949, 3667017, 3658439, 3883774, 3945682, 4077152, 4020223, 4371590, 4381606, 4038085, 4399331, 4715553, 4482226, 4757095, 4878114, 4662305, 4980829, 5285935, 5095782, 5356240, 5187792, 5669453, 5372430, 5415374, 5884290, 5758924, 5682982, 5428400, 6225237, 6437991, 6079047, 6575103, 6492600, 6852685, 6678957, 7534547, 7444503, 7374474, 7676462, 7613440, 7767983, 7952997, 8389783, 8485905, 8623903, 8559534, 9084424, 9474809, 9742130, 9898171, 10098649, 10631605, 10551995, 10706468, 11302397, 11888673, 11849714, 12332110, 12624496, 13312465, 13416437, 14263646, 14428246, 14872313, 15313464, 15723532, 16536957]
16770A6536957N67015N29390M18478J036804M92375N44493Q55414R93928M99861
16761B2474715J133691N39231J652136P69614Q87785J389186J615657J289071
16753C1751086J138665J762086J564442J636786K120092J523590K604881K645613
16745D6747241K078022K576987L173902K851311L370975L731830L733776M025868
16737G2289912M555700M552863N292857N497549N782313N961524O378226P236878
16729A17547822P023094P513227P412363P733059P844813P507733P002240O697713
16721A76282064N982416N031512M091727K462295J104905j01924j509263l481946
16713A89861786l877456n356249o720861o460826p687578p602127p828952p731728
$$ y = [16536957, 17103972, 17633362, 18051840, 19088644, 19581019, 20125512, 20980926, 21974854, 22474715, 23608406, 24147637, 25799773, 26569387, 27457172, 28846358, 30462015, 31751086, 32889751, 34651837, 36216279, 37853065, 39973157, 41496747, 44101628, 46747241, 48825263, 51402250, 54576152, 57427463, 60798438, 64530268, 68264044, 72289912, 76845612, 81398475, 86691332, 92188881, 97971194, 103932718, 110310944, 117547822, 124570916, 132084143, 139496506, 147229565, 155074378, 162582111, 169584351, 176282064, 182264480, 187295992, 191387719, 193850014, 194954919, 194852995, 193343732, 189861786, 185984330, 180628081, 173907220, 167446394, 159758816, 152156689, 144327737, 136596009]
16705A36596009p942897p613903o849436p141798o439064o613127n316996n537163
16697H3141625m905886m663717m512952m190565l543501l259251l433211l228499
16689E1404043k822378k072966k510073k410976k231802k167219j314610j612161
16681C4261858j869592j209751j619546j622238r53030j079299j273187o91033
16673B3944182j280616r04024p61253q96297o53783m95078j124797m31257p63275
16664A6633802j056046m64659m65607k03527m06389n02940m49069m58950k09798
16655A2416817r43824m1045n96349R9606n18533j85186l68516j31644j10358n81925
16645I039043l42119l15399k17530J57023n13034k9450n14350k9595k73880j05929
$$ y = [136596009, 128653112, 121039209, 114189773, 107047975, 100608911, 93995784, 88678788, 83141625, 78235739, 73572022, 69059070, 64868505, 61325004, 58065753, 54632542, 51404043, 48581665, 46508699, 43998626, 41587650, 39355848, 37188629, 35874019, 34261858, 32392266, 31182515, 29562969, 27940731, 26987701, 25908402, 24635215, 23944182, 22663566, 21759542, 20998289, 20101992, 19448209, 18953131, 17828334, 17397077, 16633802, 15577756, 15113097, 14647490, 14443963, 14037574, 13534634, 13085565, 12626615, 12416817, 11472993, 11431948, 10835599, 10935205, 10416672, 10231486, 9862970, 9731326, 9620968, 9039043, 8696924, 8381525, 8163995, 8321018, 7807984, 7778534, 7264184, 7234589, 6960709, 6854780]
16635F854780J3841m32857K54517m68870m2625q2842j74735k14413j47544m43309
16625E115943m2520K3528k37314J81544j75047k32989N3265l69206K81941P5480
16615D674625m26595L628m17533L53411j68256J2168j19662m1813k73686M1267
16605C637554P887l98565K28965n9776J02900p77011M22709r3020l5845j75215
16595B860583k5955q1288N7545o1419m08362M63653j65272k50566P4203J67126
16585B630248k64922J90535o0008L13754k82005L42733p67147r8991L86695m45850
16575A945042M20599m00967K15420j17196l0384k28234O5333j43326P2960P615
16565A806862j73403R4978R4569P9537k32158m1750J71320l60286K44802K59227
$$ y = [6854780, 6868621, 6435764, 6690281, 6221411, 6178786, 6095944, 5921209, 5706796, 5559252, 5115943, 5073423, 5096951, 4859637, 5041181, 4866134, 4633145, 4686410, 4317204, 4599145, 4674625, 4248030, 4251658, 3834125, 4187536, 4019280, 4031448, 3911786, 3869973, 3596287, 3637554, 3645441, 3246876, 3475841, 3416065, 3518965, 2741954, 3164663, 3071643, 3035798, 2860583, 2834628, 2753340, 2810885, 2749466, 2341104, 2804757, 2639485, 2388919, 2463122, 2630248, 2365326, 2555861, 2495853, 2809607, 2527602, 2870335, 2103188, 2004197, 2390892, 1945042, 2365641, 1964674, 2180094, 2062898, 2032514, 1804280, 1869613, 1726287, 1799247, 1806862, 1633459, 1728437, 1823006, 1902543, 1670385, 1628635, 1799955, 1439669, 1684471, 1943698]
16555A943698n13236J80084k92367J04551m3256K17914j43168l52848N08629j48691
16545A461310J16564m19599L01430k78500N02077m19663J6816K99731k86262K79322
16535A573226j33719j09622r9770K97917k83554L8446N7677k15770L2419r6419
16525A060831l554j8758N2095j62911N40950m76029J7413q071k11214J34319J69755
16514A094826o7071j05501J42380j2256N6850k60760J09318j46762L23392l10657
16504H23759j72756K83135J1791m6132m11335K29893R1398n7912J06785B81731
16493F87144K32902k29928J22865l94840Q6989n791l650k985N0692n1411J07925
16482E99912K82056k18025o0721j22398M8414j98186K32699L3471J89148l26563
$$ y = [1943698, 1430462, 1610546, 1318179, 1422730, 1379474, 1597388, 1454220, 1101372, 1610001, 1461310, 1577874, 1158275, 1459705, 1181205, 1683282, 1263619, 1280435, 1580166, 1293904, 1573226, 1439507, 1329885, 1230115, 1528032, 1244478, 1282924, 1340601, 1124831, 1157250, 1060831, 1057277, 1038519, 1090614, 927703, 1468653, 992624, 1010037, 1001966, 790752, 925071, 1094826, 1027755, 922254, 1064634, 1052378, 1109228, 848468, 957786, 811024, 1134416, 823759, 651003, 934138, 945929, 899797, 488462, 718355, 809753, 751841, 858626, 281731, 687144, 920046, 690118, 812983, 418143, 505132, 499341, 495691, 492706, 543398, 491987, 599912, 881968, 663943, 603222, 480824, 529238, 331052, 563751, 597222, 786370, 459807]
16472D59807q0521L16394J36986l46017m728K0359K33369C43174M37011j40467
16462F39718J47863l05446K89284k02812L6994J72726A28704N53576k84818o7528
16452C29934L15111k02470k8492q405M5069J16042m5703j34887K18133k16116
16442C88216J05095j06238Q0839r5764L34173l43045j61866L1392J4743K79113
16432E26658j63394K78027j07974j43671K95552L7358A72695J70628L59433B66320
16421D56405k08145J52467J88919j30839R3434j08904r7427A55561L14457A57970
16410D42686N0083I1715O26936k73809A70455Q2832A16981L48793K4091i278E37032
16398E11359k09268J06624a3051B7171N85016A02060Q2758Q7918J4574h493B56977
$$ y = [459807, 379286, 695680, 832666, 486649, 481921, 502280, 735649, 343174, 780185, 639718, 787581, 482135, 771419, 568607, 605601, 778327, 128704, 682280, 397462, 329934, 645045, 442575, 414083, 405678, 450747, 566789, 521086, 386199, 604332, 388216, 493311, 387073, 467912, 372148, 706321, 363276, 201410, 232802, 247545, 526658, 363264, 641291, 533317, 389646, 685198, 722556, 172695, 343323, 702756, 266320, 456405, 248260, 400727, 589646, 458807, 552241, 443337, 345910, 155561, 470018, 157970, 442686, 492769, 91715, 718651, 444842, 170455, 253287, 116981, 465774, 489865, -9278, 537032, 511359, 302091, 408715, -13051, 27171, 612187, 102060, 184818, 272736, 287310, -8493, 256977]
16386A87372P9670J01824J05826j92784J25131p3109A53070P9196b16886B88565
16375B89881j30198K08837r2624L04181o1552A95217G3062K31207N0566j42729
16365B12106a57131A00524J0448J8776L40996o6593M9349j68499A04142d0760
16354D92606D7532K16492p6027e2642D20470j98216R052O9432A16361D5790K86998
16343C32788L9205A9267L90530D3748J14060K0552M45955A57479R2348J23099
16333C72926J805A03357l8995l1507K03385K24570B30297k6339J93882n2746f4044
16321H0779L1845J23908D0433a6918A22920J54213a37316E12727j97127B3480
16310H0064R083N0778l8907K7021a00883B81058j4644K7579m9126J3653J7381
$$ y = [187372, 267042, 368866, 474692, 281908, 407039, 333930, 153070, 232266, -216886, 288565, 289881, 159683, 368520, 275896, 580077, 518525, 195217, 73062, 304269, 354835, 212106, -157131, 100524, 110972, 129748, 470744, 404151, 453500, 285001, 104142, -40760, 492606, 47532, 264024, 187997, -52642, 420470, 222254, 231306, 300738, 116361, 45790, 332788, 371993, 19267, 409797, 43748, 157808, 178360, 624315, 157479, 249827, 372926, 374731, 103357, 64362, 32855, 236240, 460810, 230297, 203958, 397840, 345094, -64044, 80779, 112624, 236532, 40433, -16918, 122920, 277133, -137316, 512727, 315600, 23480, 80064, 89147, 139925, 101018, 128039, -100883, 281058, 266414, 293993, 244867, 258520, 275901]
16299B75901j35521K5998B5880a96790a3989A03342a43618B12469J31540o6649
16289B77360B9112J6976L5093K04129L2112J17743q5693k2443G4405Q8854L6305
16278A99564q8400b923B6574J80235P8782C533b4528A58459n1763a3987B08239
16266A18275K63085b26834A39390a9409A26636J64322a50729C9890a01712B6410
16255c0152A77902J9637F0873J02792J17082a80485f7748b6595k23283D32335
16244C47438q6673H7286L4610B6983J44639b37616A47255c41353C78958j43667
16234B35291J37248a41012j38454B33134E1816J44141m549o8670N831C4231K44737
16223B78968I7586g7379D2363j3540L9614N7685g5897i855B55249a35105A16940
$$ y = [275901, 140380, 166378, 25880, -196790, -13989, 103342, -143618, 212469, 344009, 277360, 29112, 46088, 81181, 285310, 317422, 435165, 349472, 327029, 74405, 163259, 199564, 111164, -2923, 26574, 206809, 285591, 3533, -24528, 158459, 106696, -13987, 208239, 118275, 381360, -226834, 139390, -19409, 126636, 290958, -150729, 39890, -101712, 26410, -30152, 177902, 197539, 60873, 163665, 280747, -180485, -67748, -26595, -249878, 432335, 347438, 260765, 87286, 121896, 26983, 171622, -237616, 147255, -341353, 378958, 235291, 372539, -141012, -279466, 233134, 51816, 195957, 191408, 122738, 128569, 34231, 278968, 97586, -77379, 42363, 28823, 68437, 126122, -75897, -9855, 255249, -135105, 116940]
16211d23161C2306d6531B24679i1813j68275D3693R2594Q8422f7260j04758A14285
16199G4865L109O0642b8531I0449c6457A08369b11403G3868a04898G850e6243
16187A26414b99412H2908J04835g6049k80463c8818k4980j25266a7596E0713N1785
16176A02498J36046h011k62137J10098M8769c7724m229j6389q802j17086M6632
16165a37598H1634F878a98301c0296A29621L40004A28366M5040b16061a5042m44099
16154d59141j51655a50593c5343A25389h0794j50565B19397C2246f7306q0775
16144a48081m4338J5081A89799b163A77808a7294B24715i73B20973F3010M273
16133F7283O3537Q8444b71126A96145G2419Q1872b21774A6907J07047a91393a896
$$ y = [-423161, 32306, -46531, 224679, -91813, -260088, 43693, 136287, 224709, -67260, -172018, 114285, 74865, 77974, 138616, -28531, 90449, -36457, 108369, -211403, 73868, -104898, 7850, -56243, 126414, -299412, 82908, 187743, -76049, -356512, -38818, -63798, -189064, -17596, 50713, 102498, 238544, -8011, -270148, -160050, -111281, -37724, -41953, -58342, -67144, -184230, -137598, 81634, 6878, -198301, -30296, 129621, 469625, 128366, 173406, -216061, -15042, -459141, -610796, -150593, -35343, 125389, -80794, -231359, 219397, 32246, -67306, -148081, -192419, -177338, 189799, -2163, 177808, -17294, 224715, -973, 220973, 63010, 67283, 130820, 219264, -271126, 196145, 72419, 154291, -221774, 16907, 123954, -191393, -1896]
16121A4390L4697J78589g2560l29861R7790A31913f7813A3868a3297p5504r4942
16110a83743I2763b08259J6625d8905j94980c5588k03457B01582D735a66337e2306
16098C16841h2318b1671A74851b23146A6250J75058N9804C8003j3883e655A3841
16086G482e9569k92024A48643c50075P9226E3579b6475A30506M6581b11709R2403
16075a19306d7307l28978C81373d778o6978D05973d2626j0416E3669J58671m6508
16064A65832n39F527R2787j9103d7005I1091h9776A81971r994F1712d8790k71201
16052c19991b0648I5077e5328j01324A70804b64624M7103O2626H9361A4265J7897
16041C2162a29091Q362b2573E642J17959b21658h3337A31326C623b04767l39825
$$ y = [14390, 49087, 227676, -72560, -402421, -304631, 131913, -67813, 13868, -13297, -88801, -183743, 92763, -208259, -191634, -48905, -243885, -35588, -239045, 201582, 4735, -166337, -52306, 316841, -82318, -21671, 174851, -223146, 16250, 191308, 251112, 38003, 24120, -5655, 13841, 7482, -59569, -351593, 148643, -350075, -270849, 53579, -26475, 130506, 177087, -211709, -119306, -47307, -376285, 381373, -4778, -71756, 405973, -42626, -53042, 53669, 212340, 165832, 165293, 6527, 99314, 80211, -47005, 91091, -89776, 181971, 171977, 61712, -48790, -319991, -20648, 95077, -55328, -156652, 170804, -264624, -217521, -154895, 89361, 14265, 32162, -129091, -120729, -22573, 5642, 123601, -221658, -83337, 131326, 3623, -204767, -544592]
16030e44592b43353A91529c604C70474G2005a23377k05271b3509B17326c42525
16019A01810l0735N3686g2983E7540c28524a44074L7669j42810R641C1867c11617
16007G3791j3745b14080B34175j06957h5132a7689j04268A08114J9260C5983a162
15995A01756K91938d23187D765P0817J38445H7240l2469h3480q4192A04492b8948
15983B55579j25807N3144J12701E9868a68550D6472c5005n9961m63K8961q1383
15972a47851C9251R1517P1594D7010A7484e044j28745B49657H5329P4043m8299
15961A11073B5150a83774A1750J42681h3850D209i9001B34390H8565g2715f481
15949A44237F5854a92752e6805j7192E8712b79036J9396J4309J15662b19j13884
$$ y = [-544592, -243353, 191529, -3604, 370474, 72005, -123377, -328648, -23509, 217326, -342525, 101810, 71075, 124761, -72983, 57540, -328524, -144074, -106405, -249215, -239574, 31867, -311617, 73791, 60046, -214080, 234175, 127218, -85132, -17689, -121957, 108114, 127374, 35983, -1162, 101756, 393694, -423187, 4765, 75582, 214027, 87240, 54771, -83480, -167672, 104492, -28948, 255579, 129772, 182916, 295617, 59868, -168550, 46472, -35005, -94966, -95429, -66468, -147851, 39251, 130768, 202362, 47010, 17484, -5044, -133789, 249657, 85329, 159372, 111073, 25150, -183774, 11750, 154431, -83850, 4209, -99001, 234390, 88565, -72715, -6481, 144237, 65854, -192752, -56805, -73997, 58712, -279036, -259640, -245331, -129669, -219, -114103]
15938a14103e1264g96k71315K5246P0122C16028f5410k3064A7776d6331m57462
15927e03793J80745F9495a95114r139e6424l9860F6383a94110A319c99973c0569
15915c64530g4829A38927Q4506B0360a70485a8839G3409d0444B11965a2586j23995
15904a36581B17550b96726P7050A03958J34685a51461C1548g7488m1367N6630
15894f2225j74485L5615N9823A06340L6188F5267a08012b6320q7475B12591d415
15882B7801L1424b48376b2486B49187A3110i5433c9340p7282j37927B26911a30379
15870b86585A63133h9694K7838A66239a12150A7930a49700M5560h818H7685K2254
15859A09939M1693j9767K9548p3675d6193K0960j20753o8723B86813a33781F734
$$ y = [-114103, -51264, -796, -272111, -246865, -176743, 316028, -65410, -88474, 17776, -46331, -503793, -323048, 69495, -195114, -204253, -56424, -96284, 66383, -194110, 1319, -399973, -30569, -364530, -74829, 138927, 223433, 20360, -170485, -18839, 73409, -40444, 211965, -12586, -136581, 217550, -296726, -219676, 103958, 238643, -151461, 31548, -77488, -118855, -62225, -236710, -201095, -141272, 106340, 142528, 65267, -108012, -26320, -113795, 212591, -4415, 27801, 59225, -248376, -22486, 249187, 13110, -95433, -39340, -116622, -254549, 226911, -130379, -286585, 163133, -89694, -61856, 166239, -112150, 17930, -149700, -104140, -8818, 87685, 109939, 151632, 131865, 161413, 87738, -46193, -25233, -145986, -214709, 286813, -133781, 6734]
15847b82065A35739J7919a00961B7430b72997A51849i4330k72132e2542R718F0974
15835b10137b9710j01418c631k85594A32108J651a82673j21501c1949r920R435
15824c2434n7140I8936a88802R2307k24732a6529l19200a6252r3372q2151j59697
15813c51472a8645m15350a49876q2598F0989J45245K1169G3008d8778D2675J91528
15802B34203d4702D38549a36041n0911L5969R510a8317G0745a42354A29184K02541
15791C31725a28341M3507E1847A5323b26446N2177a5906H9279f2295l9646E2562
15779f4454F9523a84343B9111J8067j1385a67564e0623k29946a20386j96664a2912
15767A92123a32106c6280l7101A24271h0648E3543K86868C1511K10067O6875a29835
$$ y = [-282065, 135739, 153658, -100961, 27430, -272997, 151849, -94330, -366462, -52542, -42824, 60974, -210137, -29710, -131128, -3631, -289225, 132108, 133759, -182673, -304174, -31949, -41869, -32434, -89574, 98936, -188802, -96495, -321227, -16529, -335729, -16252, -109624, -191775, -351472, -18645, -433995, -149876, -232474, 60989, 206234, 227403, 73008, -48778, 42675, 234203, -44702, 438549, -136041, -186952, -150983, -141473, -18317, 70745, -142354, 129184, 331725, -128341, -84834, 51847, 15323, -226446, -174269, -15906, 89279, -62295, -101941, 52562, -64454, 69523, -184343, 29111, 47178, 35793, -167564, -50623, -280569, -120386, -317050, -12912, 192123, -132106, -36280, -73381, 124271, -80648, 53543, 340411, 31511, 241578, 308453, -129835]
15755I6280h4910r5136J9525I0194A3422f2159C497b71618b5150j77751P0653
15744a32248I6786J22949a34606C10433H9228k7641J25002e1838k6136k7147C1280
15732a78695A71056J90737a44683E522J12774c90881D4270c3352j03419K0891
15722a15880Q033C1700a74362k35636A13351J34922a37746A09006h3623B29831
15711c38948J36090g4302I112b13161B34251a9469A83676a57401b2561j00739
15701a23300A70229G2499N7586L7763a33463f1679K3716A08086J60084b1875B69245
15689C09236a08272B19931a70286N3847a7438B01178H8761J41954p1444O4518
15679B23789a80619r2240i7722L7121k58143a23242A73617a19274B24894J33699
$$ y = [96280, -84910, -180046, -160521, 90194, 13422, -62159, 3497, -271618, -25150, -202901, -132248, 96786, 219735, -134606, 310433, 89228, 61587, 186589, -51838, -77974, -105121, 31280, -178695, 171056, 361793, -144683, 5522, 118296, -390881, 44270, -33352, -136771, -115880, -107847, 31700, -174362, -409998, 113351, 248273, -137746, 109006, -83623, 229831, -338948, -202858, -74302, 9112, -213161, 234251, -19469, 183676, -157401, -22561, -123300, 170229, 72499, 130085, 167848, -133463, -61679, -37963, 108086, 268170, -21875, 269245, 309236, -108272, 219931, -170286, -116439, -17438, 201178, 88761, 230715, 159271, 223789, -180619, -272859, -97722, -60601, -318744, -123242, 173617, -119274, 224894, 358593]
15669C58593A49855l4385f7627j55780b5331m5777o3930j62528a14408n3262j52275
15658c19945A42164h3238o5682B83828a66364B26219c1608j91544o4260J42785
15648a44627o2730A05579K71520g2089p7271F5026b50974K6239A45734J53521
15638B99255a42695A88488Q375i6657a3194o4234j779A0309K78068a68903c0010
15626a98501n0976f8113D8563N8370K5906a03795B3395e57j6231k75035G3970
15614A11798c8900L799J0883j61505A35965o2106A0541a48591A44030d5187A57893
15602b38193j32637A71242B6630a24223j29624B56124a41280P0371j43601I6272
15591C0393a68125A41944M6122l9945K52854C2661K30836a08115D6534n387b50194
$$ y = [358593, 149855, 115470, -67627, -223407, -25331, -71108, -135038, -297566, -114408, -167670, -319945, 142164, -83238, -148920, 283828, -166364, 226219, -31608, -223152, -287412, -144627, -207357, 105579, 377099, -72089, -149360, 65026, -250974, -224735, 145734, 299255, -142695, 188488, 196863, -96657, -13194, -77428, -79207, 10309, 288377, -168903, -30010, -198501, -249477, -68113, 48563, 106933, 132839, -103795, 23395, -557, -16788, -291823, 73970, 111798, -38900, -35101, -24218, -185723, 135965, 73859, 10541, -148591, 144030, -45187, 157893, -238193, -370830, 171242, 26630, -124223, -253847, 256124, -141280, -70909, -214510, 96272, 30393, -168125, 141944, 188066, 148121, 400975, 32661, 263497, -108115, 46534, 41147, -250194]
15579b52759B20365j07701J2710b67011A18259b55541g8499C6605I775J50024
15569A59799b389A63357b10411Q5937B1405Q4424C2606a23562k37653A45940o2083
15558H3857J33467a86486i0623J1235K4413B1189K58081a60964f7473B34757c809
15546B34245j03094B5384c0407p3857D5388a38680B838L48077N5008G6647a13989
15534a31193b8893E1427K2009l4284Q5449C7718b5187A6807R396i8834A6588a94890
15521c10686A51951b40306D3644K57936d1403A53825K8468c6584k14827F2507
15510C9350J19012k4332g2615J1544C8917J43412c06911I0256a9270G6250b99637
15498A24084m2858a41368A10925P7271d5j34E40680B8119N776f0568J3261D3522
$$ y = [-252759, 220365, 112664, 125374, -267011, 118259, -255541, -78499, 36605, 9775, 159799, -2389, 163357, -210411, -124474, 21405, 105829, 32606, -123562, -361215, 145940, 83857, 217324, -186486, -90623, -79388, -54975, 21189, 279270, -160964, -67473, 234757, -3809, 234245, 131151, 25384, -30407, -104264, 45388, -138680, 2838, 350915, 405923, 76647, -113989, -131193, -28893, 51427, 73436, 39152, 124601, 37718, -25187, 16807, 26203, -98834, 16588, -194890, -310686, 151951, -240306, 43644, 301580, -41403, 153825, 182293, -36584, -251411, 62507, 39350, 158362, 134030, -72615, -61071, 38917, 182329, -306911, 90256, -19270, 76250, -299637, 124084, 81226, -141368, 110925, 188196, -45, -179, 540680, 28119, 33895, -60568, -47307, 43522]
15485a17692j60554A84763b27072b558r183D981b2062I9223f0134b0440l54912
15474c75352d6551A05362D5607a04118m136j67559G5922K4321a07181p7520I4550
15462a89159c0832r1429A46414P2647f6965A33470R692L4202b17210A25486g7790
15450F1884a1718D05331g8568C21160H146a04185k3784R35j19346e6528G1171
15438A80796c23140i5699j8634I3567C7553h4114k8651N0012j10227f0100l9013
15427i9113E7187b8547A04653L0510L0910a53082o0201H0455a14464H2524J22695
15416B05219D1705A2879J25367b34813A69209J81233F4006d9955B11457b44503
15405a39278H430a49619d3913j17829A58666a53713A40724p297g3639a6340j70869
$$ y = [-117692, -278246, 184763, -227072, -2558, -11741, 4981, -22062, 99223, -60134, -20440, -375352, -46551, 105362, 45607, -104118, -108254, -275813, 75922, 100243, -107181, -184701, 94550, -189159, -30832, -122261, 146414, 219061, -66965, 133470, 143162, 177364, -217210, 125486, -77790, 61884, -11718, 405331, -78568, 321160, 8146, -104185, -127969, -127034, -246380, -56528, 71171, 180796, -323140, -95699, -114333, 93567, 37553, -84114, -112765, -62753, -172980, -60100, -99113, 57187, -28547, 104653, 135163, 166073, -153082, -213283, 80455, -114464, 82524, 205219, 41705, 12879, 138246, -234813, 169209, 350442, 64006, -49955, 211457, -244503, -139278, 8430, -149619, -43913, -161742, 158666, -153713, 140724, 133427, -73639, -16340, -187209]
15394a87209q1310e8258D2392b43493b3670k96836J18473l54827E8969h0509F7256
15382E3796O0474a9865i874B35035H0004b86814E2656a27960A9589O8593e8574
15370B71562o4029J04512a02675C6832P0652a80050h8372n2621A5964b7880C06736
15358A8265g8153L0816C2568a49732G2069d22392P9584D9785J67590F7956K06435
15347B74391D6227M8398a76795A86213J2489P0564I9151j6963b20327c2574B42305
15335C57595k0214j62456P4764b56626L7214O5540B51318N765p9186h4119G2698
15323b04410d6788l967a5635I1871d3611C67169F7766a19048L8221o6175B33968
15311a33908D50060j01850g5064B08004a33393A94152I2067i2026A47438a32558
$$ y = [-187209, -268519, -58258, 42392, -243493, -23670, -320506, -202033, -556860, 58969, -80509, 67256, 53796, 114270, -19865, -9874, 235035, 80004, -286814, 52656, -127960, 19589, 88182, -58574, 271562, 207533, 312045, -102675, 36832, 107484, -180050, -88372, -140993, 15964, -27880, 306736, 18265, -78153, -47337, 32568, -149732, 72069, -422392, -342808, 49785, 217375, 67956, 274391, 46227, 94625, -176795, 186213, 198702, 269266, 99151, 82188, -220327, -32574, 242305, 357595, 337381, 174925, 249689, -256626, -219412, -153872, 251318, 257083, 177897, -84119, 72698, -204410, -46788, -50755, -15635, 91871, -43611, 367169, 67766, -119048, -80827, -147002, 233968, -133908, 450060, 348210, -75064, 208004, -133393, 194152, 92067, -92026, 147438, -132558]
15300A64501D7492K38401C1902J84867H3408a80189j80836E7209a8626B95172
15289C1462K819f9489B22510n7939b70471A52879C1422R0128J04008E4770Q7678
15278A42448b76607g8698A4094j311K36134a84046A34459b9326m18981B3265R8534
15267A21799b6819k85088H7434g7483A62893o0988M2922D8050K3151Q1932G2091
15255a0001A88649J76120A59216F7322R5279a53581B10268Q67596P28117l91275
15245A414706J56643p74690A42921o9856P8741b88765A31917P3839g0025k1691
15235i1716F1411e1621A13775D7895O2802B5563L43606G0945C3021O5489l6990
15224F1520O4556a9035j14579B9453Q1774b5877k6801k65416H7809l3890M4551
$$ y = [164501, 47492, 285893, 31902, 216769, 83408, -180189, -361025, 57209, -18626, 295172, 31462, 34281, -69489, 222510, 164571, -270471, 152879, 31422, 121550, 225558, 54770, 142448, -276607, -78698, 14094, 12783, 248917, -184046, 134459, -29326, -448307, 23265, 121799, -26819, -311907, 87434, -77483, 162893, 101905, 144827, 48050, 71201, 153133, 72091, -10001, 188649, 364769, 159216, 67322, 162601, -153581, 210268, 1077864, 1805981, 1414706, 1571349, 796659, 142921, 73065, 151806, -288765, 131917, 205756, -70025, -91716, 61411, -51621, 113775, 47895, 110697, 25563, 369169, 70945, 33021, 98510, 61520, 126076, -19035, -133614, 29453, 111227, -25877, -52678, -318094, 87809, 53919, 98470]
15213I8470O3313J16451R3567A2490K60921c16076C107i106B43970B8633j1264
15202A7369N875J49208a39364A18960J73299a0633j1021C43129j03164b67970
15191b36893A40562a31140C58045f4499A21377n2901K11274a38704A34848b6797
15180g5203j31390H9959O8279f0626C14176a6504k00188A54566a85553c1987q984
15169d0971d699E6380j2139a08922G6080f8163A43530q097R1203i3132a5080j9334
15157c4414B09371o7027c29730C41944r9707e3901j88617B33315e3249B89116
15146B33999E0264J20975D3555n206J70239p1869a22923B71509l5629E0277R2821
15135A43098R889c2627A13652J51443A6205a27820k09976B36756G940Q1509L4113
$$ y = [98470, 161783, 278234, 371801, 12490, 273411, -316076, 3107, -9106, 243970, 28633, 17369, 23244, 172452, -139364, 118960, 292259, -10633, -21654, 343129, 239965, -267970, -236893, 140562, -131140, 358045, -64499, 121377, 68476, 279750, -138704, 134848, -26797, -75203, -206593, 89959, 158238, -60626, 314176, -16504, -216692, 154566, -185553, -31987, -40971, -4699, 56380, 44241, -108922, 76080, -68163, 143530, 135433, 226636, -93132, -15080, -34414, 209371, 142344, -329730, 341944, 242237, -53901, -242518, 233315, -53249, 289116, 233999, 50264, 171239, 43555, 38349, 208588, 136719, -122923, 271509, 235880, 50277, 143098, 152987, -32627, 113652, 265095, 16205, -127820, -337796, 236756, 7940, 89449, 123562]
15124A23562L59165B24537n6350m3638E567L64276G6854M4976P663a76654L2576
15113a44078B19022D9090d8976A41019j5192b0182A706J92767j9442G3706a0329
15101F8402K12136A24020M0977m6825J610A7943J30633k7066J21497d2606B45993
15089i5881B00353O2860l3174N8583D6873K72820L40364A60294m8044j5264L46973
15078D43959A52037e8128B90056j01897J55348E392K12812K86491A23408J90786
15068C14194A648a3014F8224a24890A0205L08558J45747q1848m6492G9442L6481
15057A15923J24140o2325m0943J17541b95767A00476a33201A6266J55819b38317
15046A62970Q0134j20714J91875A04988Q9559M29256a32228D70413A37726m525
$$ y = [123562, 482727, 224537, 168187, 124549, 5567, 369843, 76854, 121830, 129493, -176654, -144078, 219022, 49090, -48976, 141019, 125827, -20182, 1706, 194473, 175031, 73706, -10329, 68402, 280538, 124020, 164997, 118172, 119782, 17943, 148576, 121510, 243007, -42606, 245993, -95881, 200353, 263213, 230039, 288622, 46873, 319693, 660057, 160294, 112250, 96986, 443959, 152037, -58128, 290056, 188159, 343507, 5392, 218204, 504695, 123408, 314194, 1648, -13014, 68224, -124890, 10205, 318763, 464510, 382662, 336170, 79442, 115923, 240063, 177738, 136795, 254336, -295767, 100476, -133201, 16266, 172085, -238317, 162970, 243104, 122390, 314265, 104988, 194547, 623803, -132228, 470413, 137726, 133201]
15036A33201J53895j19611F8531M03131k20047K1810h3327B46300d1685B34215
15025B52498f6498B23647C4648J36292A2232f5728A78115p4639l9993M91656I0964
15013i7954a3068B96042H0909b00434K5281B94811L93739c3208E04411k04867
15003B99544k867J21086A4666J53521j5978N952J45550q4141q1871J04599J76169
14992D18467a32983B22434R1719j56342k807d5960I2712j2608l6414K37379J39095
14981D20164L6258H1838J19969c225B64276C2984O5398J45258e6342B10954J51931
14970C62885A18509K35337H0018L67957j88547O9599J8216b4111A36374c9699
14959E24422j72172N8143j94901o0429J97419c6142A50746E9417K89245P0274
$$ y = [133201, 287096, 167485, 68531, 471662, 251615, 273425, -83327, 246300, -41685, 234215, 252498, -66498, 223647, 34648, 170940, 12232, -65728, 178115, 103476, 63483, 555139, 90964, -97954, -13068, 296042, 80909, -200434, -175153, 294811, 688550, -33208, 504411, 299544, 296677, 417763, 14666, 168187, 152209, 158161, 303711, 219570, 137699, 242298, 418467, -132983, 222434, 314153, 157811, 155004, -45960, 92712, 80104, 43690, 281069, 420164, 456422, 81838, 201807, -3225, 264276, 32984, 98382, 243640, -56342, 210954, 362885, 118509, 353846, 80018, 447975, 259428, 329027, 347243, -24111, 136374, -39699, 524422, 352250, 410393, 215492, 155063, 352482, -36142, 150746, 59417, 348662, 418936]
14949D18936B04889J22465O6147j41981r5451K14601N4741A71019Q642a2754A41572
14937C02147A01930J99282l9417G3445N7193K37520J9255j13975L9761m1917q4788
14926A86494K51428j95975j07873R2283P0140p8915J5593K17027B10524M34650
14916F45174j77230B00166K15913b1593C27654k163a74368C92109K3676j22116
14906B93669o3611J25053a50700B81417C8474J63094J40631C7221L28598A79213
14895C46254J4280k2493K43397j09244n1260B04827H5871K41367q5765N07645
14885G49118B97636p8118K0197P8081J5614K13225j68303Q5675j12213R3718q2431
14874C63081J40131j20304K30834B24454R5033k5464K4066H0256K81213K07222
$$ y = [418936, 204889, 327354, 393501, 251520, 156069, 370670, 425411, 171019, 179661, -12754, 141572, 302147, 101930, 301212, 261795, 73445, 130638, 368158, 387413, 273438, 313199, 271282, 186494, 437922, 241947, 134074, 226357, 296497, 217582, 233175, 450202, 210524, 645174, 467944, 200166, 416079, -21593, 327654, 325491, -174368, 392109, 415785, 293669, 230058, 355111, -150700, 281417, 38474, 201568, 342199, 37221, 365819, 179213, 346254, 360534, 338041, 581438, 472194, 420934, 204827, 85871, 327238, 241473, 749118, 297636, 219518, 239715, 317796, 333410, 546635, 378332, 464007, 351794, 445512, 363081, 503212, 382908, 613742, 224454, 319487, 294023, 318089, 80256, 361469, 568691]
14864E68691j31351j27672J33807j33499l6737J36177M4625p3998j70513o1289
14854A48241m5421N02952J26417B77164K19881A71705n6725L60001j4149B03483
14843E66241J6723j94249j74079K05342j04626L31616j99226J34316k53917J73808
14833E01949J20352k33508L73738C38587A68904M02204J84347C31007J31918K340
14823D65265A98602N1673K6943M7356p7672J61832l9740J27395B34256J59008
14813C93264o1268l7256M74197B89817K74421A75360M26245j99750J48837J66968
14803G17660j61308K18876l53533K65965j4310k46968L4545j61091K00680p5119
14793D25397j28377J97933j9016L10071k07214L8222r527o1630o2842N2363j93400
$$ y = [568691, 437340, 309668, 443475, 309976, 273239, 409416, 454041, 380043, 209530, 148241, 102820, 605772, 732189, 277164, 497045, 171705, 114980, 474981, 460832, 203483, 566241, 582964, 388715, 214636, 419978, 315352, 646968, 447742, 582058, 328141, 501949, 622301, 388793, 762531, 338587, 168904, 571108, 755455, 331007, 462925, 465265, 198602, 250275, 277218, 324574, 246902, 408734, 368994, 496389, 234256, 393264, 331996, 294740, 768937, 289817, 564238, 175360, 601605, 401855, 550692, 717660, 556352, 775228, 421695, 687660, 673350, 426382, 460927, 299836, 500516, 425397, 297020, 494953, 475937, 786008, 578794, 617016, 607489, 545859, 483017, 535380, 341980]
14782C41980M26783C16069M22485l62409L57217k23501Q0111k487K41589C24008
14771B97601K41342k40706M48720l53846K02294j27405J11241J38245k1722k14185
14761D81579J66631M8663q5248P0413j21188j23799L8752M60743k14757o1207
14751F60582l7521k77811K56387L10069o4439k19783n9185O4725L4666k14354
14741D53336K77155m8698j56765J73421k20894K17632J58910l94977M87280n4470
14731H91930j43355L73813k82355k09337j0503o1976M55479n9812j92800j37422
14721F23662K09869p7623l19413L50289k14686L52328k81028o2475J52036J01115
14711H34074j78999K90656k21075J11326K1423K6416r4056J214k63265K66211
$$ y = [341980, 768763, 316069, 738554, 376145, 733362, 509861, 589972, 587485, 829074, 324008, 297601, 538943, 298237, 746957, 393111, 595405, 468000, 579241, 717486, 695764, 481579, 648210, 696873, 611625, 682038, 560850, 437051, 475803, 936546, 721789, 660582, 623061, 345250, 601637, 911706, 847267, 627484, 568299, 633024, 667690, 453336, 730491, 681793, 525028, 698449, 477555, 695187, 854097, 459120, 946400, 891930, 748575, 1122388, 840033, 630696, 620193, 558217, 1013696, 953884, 761084, 623662, 833531, 755908, 436495, 786784, 572098, 924426, 643398, 580923, 732959, 834074, 655075, 945731, 724656, 835982, 857405, 883821, 789765, 790979, 527714, 793925]
14701G93925r7763N3302M8766J6256k76443J38145J4680J62791J17983k64140
14691G07502K96739L7424J17215k30128o679l27244K23292R3742M4035k2660k24489
14680G08749J73422j98168K89090K10394j26681j67894K34710k75941O6285j51286
14670G62680K61300q3209L34798k58415k7984K35411J7081j69356k56650L32725
14660A148381p2735l08139M14446l18335R444J98975p4645n3606p9057M09990
14650A274719k0629k20228k02408N43698l2849k48758j86561L29134j39898K18155
14640A314375j52217r9986J47173J34931m9391l15661L23746l08802K98365k15425
14630A077108L96805j15382j02054k40007O42916o20548L59599q1018J18978k07560
$$ y = [793925, 696162, 749464, 798230, 814486, 538043, 676188, 690868, 853659, 971642, 707502, 1004241, 1041665, 1158880, 928752, 922073, 594829, 818121, 911863, 955898, 933238, 708749, 882171, 684003, 973093, 1183487, 1056806, 888912, 1123622, 847681, 913966, 762680, 1023980, 940771, 1275569, 1017154, 989170, 1224581, 1241662, 1072306, 815656, 1148381, 1075646, 767507, 1181953, 863618, 873062, 1072037, 997392, 943786, 864729, 1274719, 1254090, 1033862, 831454, 1375152, 1342303, 1093545, 906984, 1236118, 1096220, 1314375, 1162158, 1062172, 1209345, 1344276, 1294885, 979224, 1302970, 994168, 1292533, 1077108, 1473913, 1358531, 1256477, 1016470, 1659386, 1038838, 1398437, 1317419, 1436397, 1228837]
14620A228837J17940J04842k57161K34443l72914L09864K79499M641k09165K62558
14610A703384r6054l31082L01360j5561j05893L5165O6901k50384J30312N3532
14600A491680j43016M78140k98812O9100k74532K15539j09647J63715R580j74312
14590A427435L1477J49501p6203l3098j32104K31651j73288K12056K49873J52798
14580B040098l07840J44379j88818m00L39692J2980Q2139j45262M3643r7325L42640
14569B265926l09609j03285J0187K73767J4719J67811P7901J90339J38543n21553
14559B204746K19664K29181Q0468J69076J68602M15935J76704L03578O63478L11632
14549D943064J560724L305072P134837K0254309J4822122B2377471I199303D281039
$$ y = [1228837, 1346777, 1451619, 1194458, 1428901, 1055987, 1365851, 1645350, 1649991, 1440826, 1703384, 1607330, 1276248, 1577608, 1562047, 1456154, 1491319, 1558220, 1307836, 1438148, 1491680, 1348664, 1826804, 1527992, 1597092, 1322560, 1538099, 1428452, 1592167, 1601747, 1427435, 1458912, 1608413, 1532210, 1499112, 1367008, 1598659, 1425371, 1637427, 1887300, 2040098, 1732258, 1876637, 1687819, 1687419, 2027111, 2040091, 2122230, 1976968, 2020611, 1923286, 2265926, 1956317, 1853032, 1863219, 2136986, 2151705, 2319516, 2397417, 2587756, 2726299, 2204746, 2424410, 2653591, 2734059, 2903135, 3071737, 3487672, 3664376, 3967954, 4631432, 4943064, 6503788, 9808860, 16943697, 37198006, 52020128, 22377471, 9199303, 4281039]
14540B504717m16249m08787P3901k54503K99846j99960L91610J16542L0130l16287
14530A820960K55680j3835L4400M40626n64856J07577J37232L48563l23365k23318
14520B019664K41340J31461r902o4433L2696L50659m15104K55542j42703N54704
14510B953924J11228l99372L3677J09395j87925M14297n19811N85743k6742j27269
14500B947145J97387L6553k78246Q2447K50471j48770m4283K73959L6684q0341
14490C273006j98445L8080J61024k54498L68444j96397M48410j15678O699K92148
14480C822793o79452L87615j7318M66608l19976J06537J12822J73807k54001K66122
14470D065557j87711L39595j03655J25588K42134o69211K08661L12358M68714
$$ y = [2504717, 2088468, 1679681, 1753582, 1499079, 1798925, 1598965, 1990575, 2107117, 2137247, 1820960, 2076640, 2062805, 2097205, 2537831, 1972975, 2080552, 2217784, 2566347, 2242982, 2019664, 2261004, 2392465, 2382563, 2318130, 2350826, 2701485, 2286381, 2541923, 2399220, 2953924, 3065152, 2665780, 2699457, 2808852, 2620927, 3035224, 2515413, 3101156, 3074414, 2947145, 3144532, 3181085, 2902839, 2985286, 3235757, 3086987, 3042704, 3316663, 3353347, 3273006, 3074561, 3112641, 3273665, 3019167, 3387611, 3191214, 3639624, 3523946, 3530645, 3822793, 3143341, 3530956, 3513638, 3980246, 3660270, 3766807, 3879629, 4053436, 3799435, 4065557, 3877846, 4217441, 4113786, 4239374, 4481508, 3812297, 4020958, 4333316, 4802030]
14461D802030n98210K62539k61560J20242M35678R4677P9698j98216j2846M023
14451D728055M99756n20144Q15968n83723J02876M36885J5042o60681O91445m6311
14441E479168J76370m8545J41626Q2815j91990N20238k58855M0568L80857j52354
14431F169898L12917j61386K53807J11134j65001J25435n659L28297K63345n1920
14421G180867K59122m04227N76096K4123J20649K25131n707L0912J14545J1189
14411H132700J16412L29305P8161K76975N5479o7922K16908J43618J58680J06025
14401I546341N15729k05478J72341L220K06284K10534N29903j14121L11732M46244
14391A1622729l3245p0894J51255K98331J32303J91552P14879l95310N30277J95781
$$ y = [4802030, 4203820, 4466359, 4204799, 4325041, 4760719, 4855396, 4935094, 4736878, 4724032, 4728055, 5227811, 4707667, 5523635, 4939912, 5042788, 5479673, 5494715, 4834034, 5525479, 5479168, 5655538, 5606993, 5748619, 5831434, 5639444, 6159682, 5900827, 5941395, 6322252, 6169898, 6482815, 6321429, 6575236, 6686370, 6521369, 6646804, 6641145, 6969442, 7232787, 7180867, 7439989, 7035762, 7611858, 7635981, 7756630, 7981761, 7976054, 8006966, 8121511, 8132700, 8249112, 8578417, 8656578, 8933553, 8989032, 8921110, 9138018, 9281636, 9440316, 9546341, 10062070, 9856592, 10028933, 10032153, 10238437, 10448971, 10978874, 10864753, 11176485, 11622729, 11589484, 11518590, 11669845, 11968176, 12100479, 12292031, 13006910, 12611600, 13141877, 13337658]
14381A3337658K44348M56707J19772J06060L38161K65751N02354N498K29576O24785
14371A6230670M92255J89402K90966O4428N06779K12967K05975P62515L83008
14362A9338965L01853O60029M01482N5737P50534M53548N08691M98070O36166
14353B3605075M47361M11461Q28239M73616O32364N76665P70985O32282P83433
14344B9161481N62076P96559Q07118J068275O69317J362959O86147Q16640J039802
14335C6970374J225503R35556J310795J103664J082559J210528J553705J758063
14327D7150747J609254J471037J474328J456083K172376J811670K213023J724177
14319F1082695K536913K644121K144375L069300K565431K521704L052889L125083
$$ y = [13337658, 13582006, 14038713, 14158485, 14264545, 14602706, 14868457, 15370811, 15376309, 15605885, 16230670, 16722925, 16912327, 17203293, 17267721, 17774500, 17987467, 18193442, 18955957, 19338965, 19640818, 20300847, 20702329, 20758066, 21508600, 21962148, 22470839, 22968909, 23605075, 24052436, 24463897, 25292136, 25765752, 26398116, 26974781, 27745766, 28378048, 29161481, 29723557, 30520116, 31327234, 32395509, 33064826, 34427785, 35113932, 35930572, 36970374, 38195877, 39131433, 40442228, 41545892, 42628451, 43838979, 45392684, 47150747, 48760001, 50231038, 51705366, 53161449, 55333825, 57145495, 59358518, 61082695, 63619608, 66263729, 68408104, 71477404, 74042835, 76564539, 79617428, 82742511]
14311H2742511L600077L693133L862452L736837M434928M639604M736333N062569
14303A16508444N406544N755681O306809O521104P012190P347379Q099470Q315829
14295A71273450Q872575Q995471J0210083J0921250J0903221J1631069J2902958
14288B45710077J2677853J3410615J4496249J4977808J5092341J5503679J5920551
14281C47789173J5835362J5670669J5534908J4705287J3721822J2430629J1031510
14274D46719360R166177N887929K820528Q18048j64456j946541l838761m237389
14266D55224895p536839j0584538j2559100j3588901j4645612j5605091j5895898
14259C64808916j6290196j6117684j5924520j5596787j5294428j3259275j3718797
$$ y = [82742511, 86342588, 90035721, 93898173, 97635010, 102069938, 106709542, 111445875, 116508444, 121914988, 127670669, 133977478, 140498582, 147510772, 154858151, 162957621, 171273450, 180146025, 189141496, 199351579, 210272829, 221176050, 232807119, 245710077, 258387930, 271798545, 286294794, 301272602, 316364943, 331868622, 347789173, 363624535, 379295204, 394830112, 409535399, 423257221, 435687850, 446719360, 455885537, 461773466, 464593994, 465412042, 465247586, 463301045, 459462284, 455224895, 447688056, 437103518, 424544418, 410955517, 396309905, 380704814, 364808916, 348518720, 332401036, 316476516, 300879729, 285585301, 272326026, 258607229]
14252B58607229j3419843j2199237j2099663j1400326j0735232r997426r462562
14245A79292940q803354p631760q249188p545999o809218o848887n990367n527163
14237A21887004m970317n421382m959883m765758m311747l659755l284884l956362
14229H6556916l497803l287746k964730k949159k804349k776516k367777k461002
14221F3447834k212252j718393k143227j957405j747971k195839j799584j161894
14213D8511269j344433j508135j443430j450156j364272r06412q54843q01395
14205C8838193j589292j010114j141035j211217q21509N4102j406273j025009
14197C0687846n29894j213863n83055n32310n15246p89294p35854o90596m59998
$$ y = [258607229, 245187386, 232988149, 220888486, 209488160, 198752928, 188755502, 179292940, 170489586, 162857826, 154608638, 147062639, 140253421, 133404534, 127414167, 121887004, 116916687, 111495305, 106535422, 101769664, 97457917, 93798162, 90513278, 86556916, 83059113, 79771367, 76806637, 73857478, 71053129, 68276613, 65908836, 63447834, 61235582, 59517189, 57373962, 55416557, 53668586, 51472747, 49673163, 48511269, 47166836, 45658701, 44215271, 42765115, 41400843, 40494431, 39639588, 38838193, 37248901, 36238787, 35097752, 33886535, 33065026, 33119128, 31712855, 30687846, 30157952, 28944089, 28361034, 27828724, 27313478, 26524184, 25788330, 25097734, 24637736]
14188B4637736n33210j053472k13812m72977n54519n95925m69667k30559n80568
14179A9933027n30584k48582o50446l18035l56527O279p36749K16813r10124l19004
14169A6086068l18124k89834j25406o24943j3977m03505j80211n41192j5787k32799
14159A3340290p8497n39509J673n4799m50307j78163o6248m43264J59136m22030
14149A1268282l42606j0921l3630k87425j47797j33625l7130l58111J87139m70603
14139I633573n8368m6490o0701l81169q5703L4666k51319k81102L64969m93433
14129H374923l03647L9607k33383j94387M6509q8584j20004j05500L00646l88529
14119G327651K9591k63442J81996l64813q9413Q8033O0304l95565j70959J89159
$$ y = [24637736, 24104526, 23051054, 22837242, 22364265, 21809746, 21213821, 20744154, 20513595, 19933027, 19402443, 19153861, 18503415, 18185380, 17828853, 17835132, 17098383, 17315196, 16405072, 16086068, 15767944, 15478110, 15352704, 14727761, 14713784, 14310279, 14130068, 13588876, 13573089, 13340290, 13261793, 12722284, 12723957, 12669158, 12218851, 12040688, 11974440, 11531176, 11690312, 11268282, 10925676, 10914755, 10881125, 10593700, 10445903, 10312278, 10275148, 9917037, 10104176, 9633573, 9575205, 9528715, 9468014, 9086845, 9001142, 9035808, 8784489, 8503387, 8868356, 8374923, 8071276, 8110883, 7877500, 7683113, 7729622, 7641038, 7521034, 7415534, 7716180, 7327651, 7357242, 7093800, 7275796, 6910983, 6821570, 6909603, 6969907, 6574342, 6403383, 6592542]
14109F592542k6604l68231o6282N1550l70907J80226k8251m0178j29005j83376
14099E611484M5892J67851o16240O13157l2301l94855l59046J24025k16342j84525
14089D759100k2741K03227j68030N070q7139o5925K26794r3303k81596J14280
14079D589737n1388M8218J15505l20206L01359n20194J97476O6311k41634p4522
14069D110662j98244K04333j82402j43279K61869l34744j22089j4679J6544K63160
14059C861131j39543j21342L74006n49737K25702k87134J99704k21845L06686
14050C647628l67243K25478l48403J86619j67331M37808l44526m56545J63786
14041B977271r2358J51239k35292J60447N9161M6169k43509k09671M01463J30959
$$ y = [6592542, 6565938, 6197707, 6131425, 6182975, 5812068, 5992294, 5964043, 5923865, 5794860, 5611484, 5657376, 5825227, 5208987, 5822144, 5789843, 5394988, 5035942, 5159967, 4943625, 4759100, 4736359, 4939586, 4771556, 4776626, 4689487, 4623562, 4850356, 4757053, 4475457, 4589737, 4538349, 4586567, 4702072, 4381866, 4683225, 4163031, 4360507, 4426818, 4185184, 4110662, 3912418, 4116751, 3934349, 3791070, 4052939, 3718195, 3596106, 3581427, 3597971, 3861131, 3721588, 3600246, 3974252, 3424515, 3650217, 3363083, 3562787, 3340942, 3647628, 3280385, 3505863, 3157460, 3344079, 3176748, 3614556, 3270030, 2813485, 2977271, 2884913, 3036152, 2800860, 2961307, 3020468, 3066637, 2823128, 2613457, 3014920, 3145879]
14031C145879j93577J42682k11149n2842l01447K76243k58933K31970l85879J79254
14021B572201j68704J3606J93055J12278j15819j66053k05659M4309m8420K26810
14011B457604j26844n2924N2088j79036m1072J86581m78900R3383K43743j75071
14001A979552R72l7315n1228K27465k75757n2633j8002R1740j04862K96197K17954
13990B274083P5961Q15637J949319N154678J8088737K5778974k6518391A2355766
13981G277646k059251j079168l77344k58253o95182k3567j9358l58253P0296K7727
13971B505293O4824m0985q2584j785M5175j35402j72547j99293L63144j71761
13961B174079j56942R5317j84410r7214N16361l55656o6336j66663Q6339P7441
$$ y = [3145879, 2952302, 3094984, 2883835, 2830993, 2529546, 2805789, 2546856, 2778826, 2392947, 2572201, 2403497, 2417103, 2610158, 2722436, 2606617, 2440564, 2234905, 2279214, 2230794, 2457604, 2330760, 2277836, 2329924, 2150888, 2109816, 2296397, 1817497, 1910880, 2154623, 1979552, 1980524, 1943209, 1891981, 2119446, 1843689, 1791056, 1773054, 1864794, 1759932, 2056129, 2274083, 2350044, 3165681, 5115000, 10269678, 28358415, 54137389, 27618998, 12355766, 7277646, 5218395, 4139227, 3761883, 3503630, 2808448, 2784881, 2765523, 2407270, 2477566, 2505293, 2570117, 2529132, 2446548, 2444763, 2489938, 2354536, 2181989, 1982696, 2345840, 2174079, 2017137, 2112454, 1928044, 1830830, 2347191, 1991535, 1925199, 1758536, 1844875, 1922316]
13951A922316l1974o2051j48534L5011L38940l84825j48433K32997K95466j42824
13941A906089j80712o1476J45272j33363M2530j03901j48301N8651k39299J07222
13931A392712J98760j29918j09823K74543q6497R10M5417l99588L62727K10017
13921A759260l94199R5456j31550J37884j26064j23393P0706K42791j23675K03949
13911A611165k38038l3492R666q6468R9599q6948j73404k22412L14811K38859
13901A433338m0030k91153J53412j30903M6763J78211j2698j40950j04078Q4383
13891A176295j96693J11421J20825r0225j11032Q3616J99573q6470k3462l74866
13881H08982L43418j06448K24793J2016l28416J27121l64008k7228K78470j20703
$$ y = [1922316, 1890342, 1828291, 1679757, 1714768, 2053708, 1668883, 1520450, 1753447, 2048913, 1906089, 1725377, 1663901, 1809173, 1675810, 1718340, 1614439, 1466138, 1524789, 1285490, 1392712, 1591472, 1461554, 1351731, 1626274, 1539777, 1540687, 1586104, 1186516, 1549243, 1759260, 1365061, 1460517, 1328967, 1466851, 1340787, 1217394, 1288100, 1530891, 1407216, 1611165, 1373127, 1339635, 1349301, 1262833, 1362432, 1275484, 1102080, 879668, 1194479, 1433338, 1393308, 1102155, 1255567, 1124664, 1171427, 1349638, 1336940, 1195990, 1091912, 1176295, 979602, 1091023, 1211848, 1121623, 1010591, 1094207, 1293780, 1207310, 1183848, 808982, 1152400, 1045952, 1270745, 1282761, 954345, 1081466, 717458, 690230, 968700, 847997]
13871H47997K49429o7091k07613P9359K41386m2907n5644j061r375L714p0548
13860I67646j97378L03733J12511n70131O39352k67897J64963j97990p5447N5234
13850I34596L3283j59474O5213J50276K0701k54596K15043k21446J23885j66250
13840G41231L83948m13020K15303J03422K4890k65212L6790O2729L5542J14632
13830A040255l73124L29806L17732m55242j98351O5883k3126j47900p5265J08897
13820E89565J79594j12478J81608m5277L6420K28044j45038r4843m03972K17406
13810F31029K73281q2261k10884J75408o2778J64100j87883j00210M11062l39146
13800F71718J82214p9904K450O9733l27922K42666C70680N66807k46179P4251
$$ y = [847997, 1097426, 1030335, 822722, 902081, 1143467, 1100560, 1044916, 1043855, 1034480, 1038194, 967646, 770268, 1074001, 1186512, 616381, 1255733, 987836, 1152799, 954809, 879362, 934596, 967879, 808405, 873618, 1023894, 1044595, 789999, 1005042, 783596, 907481, 741231, 1125179, 712159, 927462, 1030884, 1055774, 790562, 827352, 890081, 925623, 1040255, 667131, 996937, 1314669, 859427, 661076, 726959, 703833, 555933, 480668, 589565, 769159, 656681, 838289, 793012, 829432, 1057476, 912438, 817595, 413623, 631029, 904310, 822049, 611165, 786573, 723795, 887895, 700012, 599802, 1010864, 671718, 853932, 774028, 776478, 846211, 518289, 760955, 370680, 937487, 691308, 765559]
13790G65559k4881C16593N34300k49374n526j26940L89407k02010L9050j94776
13780E00724K62726J8834J25913l99209J7857K00919O7351j23813j49874L01734
13770H23162j08744B63718N56191k55186M6400J00261j32945k56990K64271Q7847
13760F73567j116k13757q0667R8478L31058j27915o6115J62325o2430j44477j52295
13749D16656M04049k26639J9291R4707o6547k31256N2521L17369C44871M95686
13739H40557j87816J58341l55820K82063K53297m26339k60142L68246k56361j02389
13729C13637L28776L0854n2154j55124K52742k02927J85094p4022j5148L1501
13719F43229J01588k58582R9233K94384C94396K01218A35344J3259K01151L87547
$$ y = [765559, 740678, 316593, 850893, 601519, 595993, 469053, 858460, 656450, 695500, 500724, 763450, 782284, 908197, 508988, 526845, 727764, 795115, 671302, 521428, 823162, 714418, 263718, 819909, 564723, 611123, 711384, 578439, 321449, 585720, 673567, 672451, 458694, 378027, 476505, 807563, 679648, 613533, 775858, 713428, 568951, 416656, 820705, 594066, 613357, 708064, 641517, 410261, 462782, 780151, 344871, 840557, 652741, 811082, 455262, 737325, 990622, 564283, 304141, 672387, 416026, 313637, 642413, 673267, 621113, 465989, 718731, 515804, 700898, 626876, 611728, 643229, 744817, 486235, 585468, 879852, 394396, 595614, 135344, 148603, 349754, 737301]
13709G37301J6757j54706n9799j36401P1334M7551j65154J23209B25635L13014
13699E38649j25346K66551k56034K76468k79449j05001L86428l09157r7536J98433
13689D94006j3417A47049J485K09984J23503J55009B87195K01944A92281K84329
13679D76610p811K24272l19975K94817j47829q5908j70729L92786A50992L84704
13669E35696K99171B11278K81687A88936J60794O0176K76101A26963J29309J96161
13659D52433K06576B37415L61627L00437A24995K09028q8954J53914P3322j12659
13649C59646L83956k76558k06879K07842A48279k503O2139R2448F3626M40703
13639E04329J9723l6304j29584o0691J39682J1757J46348l6576o6902j79368N5485
$$ y = [737301, 754058, 599352, 539553, 403152, 474486, 522037, 356883, 480092, 225635, 538649, 413303, 679854, 423820, 700288, 420839, 315838, 702266, 393109, 295573, 494006, 480589, 147049, 148534, 358518, 482021, 637030, 287195, 489139, 192281, 476610, 468799, 693071, 373096, 667913, 520084, 434176, 263447, 656233, 150992, 535696, 834867, 211278, 492965, 188936, 349730, 409906, 686007, 126963, 256272, 452433, 659009, 237415, 599042, 899479, 124995, 334023, 245069, 398983, 472305, 359646, 743602, 467044, 260165, 468007, 148279, 145776, 207915, 300363, 63626, 504329, 524052, 487748, 358164, 297473, 437155, 448912, 595260, 558684, 491782, 312414, 367899]
13628C67899j06462J15238R9409j92919O0561L55969C49324Q5520J18556P5417
13618F28817k76458n9975M4993h3734C80793J76437k38564j17255m4095J54317
13608C11633j50874J77725J08618n2670j13550K5902J03246j62162P2721Q0934
13598D01523A70120M55610k55552I9564L6426J34992I6136J8841O8915R0797L75317
13587F50006C15035J71564a03003G3244J86022K80126m027B18832L30477j55896
13577C93413O1614J224A58836l5221k8050J95700A37568a08415o1794B92113K64307
13566E56420j52688D1776L97568L081j18344a9406B74870Q210M629J95619n6970
13555D26358J92194A85585K34713B5030K84251p2404J12633a22658A76312K30774
$$ y = [367899, 261437, 376675, 476084, 283165, 343726, 699695, 349324, 434844, 553400, 628817, 352359, 292384, 337377, -83734, 380793, 557230, 318666, 201411, 157316, 311633, 160759, 338484, 447102, 394432, 280882, 306784, 410030, 247868, 320589, 401523, 170120, 625730, 370178, 99564, 135990, 270982, 96136, 114977, 183892, 274689, 650006, 315035, 486599, -103003, 73244, 259266, 539392, 535365, 218832, 549309, 393413, 455027, 456251, 158836, 123615, 95565, 291265, 137568, -108415, -170209, 292113, 556420, 403732, 41776, 439344, 442425, 324081, -19406, 274870, 283080, 287709, 483328, 426358, 618552, 185585, 420298, 25030, 309281, 236877, 349510, -122658, 176312, 407086]
13545D07086j88439N6376j17107K99207J73860A28036N6924P6235I6816M60589
13535E57405A56156K3362J59444L7298e8506A61273J69608A19919J79973K89688
13525E89580B29118j1361J34899P1426n637j81875d6631E13718I8170d9259A63635
13513B19407L1460J94228M0099j21636H1018M74923j70379G3664K52441b8120
13502A56029L38766C9083L03246p1028P900B3770K86798j30393o7324M5318l4420
13491A23749J94917d824B01051J42360m7006H1342N5773O2968J62875A65742R8623
13480B64365K00364j59836I8305J0016R8045I2209J3512N8984B5573N8507O5930
13469A50010L36427m8500H2035K624J00916F3687J02441K31114l7746A56201k0118
$$ y = [407086, 218647, 275023, 157916, 457123, 630983, 128036, 184960, 261195, 96816, 557405, 156156, 179518, 338962, 376260, -58506, 161273, 330881, 119919, 299892, 589580, 229118, 217757, 352656, 424082, 418445, 236570, -46631, 513718, 98170, -49259, 163635, 219407, 250867, 445095, 485194, 363558, 81018, 555941, 385562, 73664, 326105, -28120, 156029, 494795, 39083, 342329, 271301, 279201, 23770, 310568, 180175, 112851, 158169, 123749, 318666, -4824, 201051, 343411, 296405, 81342, 137115, 200083, 362958, 165742, 264365, 464729, 304893, 98305, 108321, 206366, 92209, 105721, 164705, 25573, 84080, 150010, 486437, 437937, 82035, 84659, 185575, 63687, 166128, 397242, 359496, 156201, 136083]
13458A36083K61444C3976L27162A14175K51311n1309j26473D0018J60589N1500
13448B52107M9181f6762C21205g4474A5403e4613A03405J48116K08743g0721D0933
13436F21017A57733o3429j3557J54708a1307A32256a9898A59451G6085C5426P0188
13425A05614L21229A35115J05555J15703G7080L5696E4441M19822r9392r7201
13415B77670r3230B3952J55199L02986F1055K19145J11015j15367c9376k72343
13405c11719A33970K33022j8976J0730A42271J25815G850K28010b11950B87033
13394A87224J24519A02483j4707N2717K58189j77146D4568M82196k02421o7588
13384B56755f3985k81322C30184A20523K6784K41707A65512K0410G5821Q567M0981
$$ y = [136083, 397527, 33976, 361138, 114175, 365486, 314177, 187704, 40018, 200607, 252107, 301288, -66762, 321205, -74474, 15403, -54613, 103405, 251521, 460264, -70721, 40933, 621017, 157733, 94304, 80747, 235455, -11307, 132256, -19898, 159451, 76085, 35426, 105614, 426843, 135115, 240670, 356373, 77080, 112776, 54441, 474263, 374871, 277670, 184440, 23952, 179151, 482137, 61055, 280200, 391215, 275848, -39376, -311719, 133970, 366992, 348016, 358746, 142271, 268086, 7850, 235860, -211950, 287033, 187224, 311743, 102483, 87776, 140493, 398682, 221536, 44568, 526764, 324343, 256755, -63985, -345307, 330184, 120523, 147307, 389014, 165512, 185922, 75821, 84388, 125369]
13373A25369a0005A85284r160N7513K9579R0045l919D8997M0164A1983K62178
13362B74161J33539j61093J0275A8083J17038a38934C79501m0384J3198j43155
13352B09160K4636a56802c141B01325B8079K65758j6340j32782J85799K382j44027
13341A88869J44496m0845I2723d5076A30227K29444B3350J76435J8410b2905A42858
13329B52015D0759M49597q9199B9142M11718B9002J44597E2384a14325b7473k4404
13318e1877B60641I6144J97933r5467r274J04478A130c488A11476p522a22844
13306i2579A83558a5019G2653a9788n155j12885F2117L4972J48429j0718K7937
13295B62737E446J41150K08301o0262A26882L75328e7384H2852L2583k1712b8092
$$ y = [125369, -10005, 185284, 176124, 233637, 263216, 353261, 349342, 48997, 89161, 11983, 274161, 407700, 246607, 256882, 18083, 135121, -138934, 379501, 339117, 352315, 209160, 233796, -156802, -3141, 201325, 28079, 293837, 277497, 144715, 330514, 332896, 188869, 333365, 292520, 92723, -45076, 130227, 359671, 23350, 199785, 218195, -22905, 142858, 252015, 40759, 490356, 401157, 29142, 440860, 29002, 173599, 52384, -114325, -27473, -51877, 260641, 96144, 294077, 198610, 189336, 293814, 1130, -3488, 111476, 103954, -122844, -92579, 183558, -15019, 72653, -19788, -24943, -137828, 62117, 97089, 245518, 234800, 262737, 5446, 146596, 354897, 294635, 126882, 502210, -57384, 82852, 115435, 93723, -28092]
13283B92782j13871K71962A44920l8170a86326R0610G3526L54212k02811g822
13272F196K04135L824K7372i200n6055A98807b034A67393N4705A7408Q2440g7037
13259c9143D02731A9580J69864K81913A89768C5994a06602e0150b1963C5010J32641
13248A67651P2862E9435J64053n7995J77630a78123b4778A32715C7190J9066P2100
13237A28356K5892G3198J57244p2738d5425A7614J05427k2937b5457A99831C3933
13225C15832e1044j07837C38705C3179j1123a39700j00295A94319a39175a7412
13214f3455A31529l2379J67989F6270J65486I9527I001L80948J8662c6804D37530
13202D0023M9525a4423I1838J95352A14017K8769F9532C3255J78296a98352G4119
$$ y = [292782, 178911, 450873, 144920, 106750, -186326, -95716, 73526, 427738, 224927, -7822, 6196, 210331, 214155, 241527, -9200, -65255, 198807, -2034, 167393, 222098, 17408, 99848, -77037, -39143, 402731, 19580, 189444, 471357, 189768, 35994, -106602, -50150, -21963, 35010, 167651, 240513, 59435, 223488, 165493, 343123, -178123, -24778, 132715, 37190, 56256, 128356, 154248, 73198, 230442, 157704, -45425, 17614, 123041, 100104, -25457, 199831, 33933, 315832, -51044, -158881, 338705, 33179, 22056, -139700, -239995, 194319, -139175, -17412, -63455, 131529, 99150, 267139, 66270, 231756, 99527, 9001, 389949, 408611, -36804, 437530, 40023, 89548, -14423, 91838, 287190, 114017, 142786, 69532, 33255, 211551, -198352, 74119]
13190c50467J49798i2663M0094j30603f9410B01455b69647J31028l685C4401J10456
13179A44857K58805a83748p2588A60471J99726B0801N01995a04998p2547O3767
13169a13778A71911J2302c0547j96659B75443n4394K02559a31028o308A66075
13158B72728A6533J20480J28609F0385k3051J51457n5895c13225B4517i072F4301
13146c430k27979Q5190A80628D8170O4333B8784Q715J72575D217c7792k6175A04001
13133I9502M25674a07658I2451a8223E1245M2654L7447h4167C57001A55106i7887
13121A99032a02596A62200D1290c41863b3849G2830K66014i4782A09684b62164
13110d247A67859a45746a367A8672K1423Q596Q4050d2574a2997E7429a51931J8033
$$ y = [-350467, -200669, -92663, -52569, -183172, -69410, 201455, -269647, -138619, -142304, 34401, 144857, 403662, -183748, -256336, 160471, 360197, 20801, 522796, -104998, -177545, -113778, 171911, 184213, -30547, -227206, 275443, 221049, 423608, -131028, -137336, 166075, 272728, 16533, 137013, 265622, 60385, 37334, 188791, 132896, -313225, 24517, -9072, 64301, -3430, -231409, -146219, 180628, 48170, 112503, 28784, 37499, 210074, 4217, -37792, -63967, 104001, 99502, 525176, -107658, 92451, -18223, 51245, 93899, 131346, -84167, 357001, 155106, -97887, 199032, -102596, 162200, 41290, -341863, -23849, 72830, 338844, -94782, 109684, -262164, -4247, 167859, -145746, -1367, 18672, 40095, 48691, 132741, -42574, -12997, 57429, -151931, -133898]
13098a33898B24918a54628P2692A08471h6921E5000N7970H894L33623j61969Q5521
13087B66069c9138n5856j03431f1199A13541a04796B6645c05137H9234a11965
13076a10326B77548A02580C2934N14559B51145g6133H5897N5993F3734K49732
13066C13466A21600J27089A08198m5364J58064A1675O6818C8506b7661A92910
13055a0493k8868B31660IK93478a13934l27050B28700K41834A57991P4625B4136
13043d6631A59077a96808B86737A40224D932a25489I0952M7189h3757A62166R4288
13032B56454q5711B340K44057d0070B24465l6317a16880K2289L4481D60155E6276
13020A48053E5677L9293J95652a56093A19453P3037A1325L17054B8459a20937
$$ y = [-133898, 224918, -154628, -81936, 108471, -86921, 55000, 112970, 8894, 342517, 180548, 266069, -39138, -94994, -198425, -61199, 113541, -104796, 26645, -305137, 89234, -111965, -110326, 277548, 102580, 32934, 547493, 251145, -76133, 85897, 141890, 63734, 313466, 121600, 248689, 108198, 62834, 220898, 11675, 78493, 38506, -27661, 192910, -10493, -39361, 231660, 9, 293487, -113934, -440984, 228700, 470534, 157991, 232616, 24136, -46631, 159077, -196808, 286737, 140224, 4932, -125489, 90952, 138141, -83757, 162166, 256454, 170743, 2340, 246397, -40070, 224465, 188148, -116880, -94591, -60110, 460155, 56276, 148053, 55677, 94970, 290622, -156093, 119453, 192490, 11325, 328379, 28459, -120937]
13009g0662j0761A86364R3684C2152L24266A54206a97995C76540j55254k476h5080
12997C22580A832d0571A88970H5647g0038B47294J500a670C35543a05129l1904
12986a37033B55425r5965k9390K6498B5885R8332a59060d60A44692N9456K0877
12975B25025e4515p0598I2448d85383i2901B7670L3354R5024f7457k09832D97057
12963b95598c4908j93709A15620E929a15337e4166E3954a96311D25643b96417
12952B89225j15680a84591e617A04062e3907A104c3927j87004K0687M0103c0375
12940a92415B94563c4817A6187M02233F5292L048N2260k7144b62534A14572a76178
12928A46238F3735K67379A62220F0630O7887a7189A93064l0490a72145A28207
$$ y = [-70662, -81423, 186364, 280048, 32152, 356418, 154206, -197995, 376540, 221286, 218810, -85080, 322580, 1832, -40571, 188970, 85647, -70038, 247294, 248794, -1670, 335543, -105129, -137033, 255425, 159460, 130070, 156568, 25885, 124217, -159060, -460, 144692, 204148, 225025, -54515, -125113, 92448, -485383, -92901, 27670, 61024, 156048, -67457, -277289, 497057, -295598, -34908, -228617, 115620, 5929, -115337, -54166, 53954, -196311, 425643, -296417, 289225, 173545, -184591, -5617, 104062, -53907, 1104, -33927, -220931, -200244, -160141, -30375, -192415, 294563, -34817, 16187, 418420, 65292, 68340, 120600, 93456, -262534, 114572, -176178, 146238, 63735, 331114, 162220, 60630, 128517, -17189, 193064, 162574, -172145, 128207]
12917A68301E1028A726K89573k4337d7674I635b20021M1699B08374a48918B0036
12905b05186i4085C01891j42474K52006C850b85572I4624K8656j666j2907J2315
12894A21022B8184a48809e9470A26427a53300D21327A8748H330L6757J16967c4881
12882b4368j26040L4679a6941n4264J7149A21305b08882A8874a73997A26467c68883
12870A04732a10339j78701J27116j91035B90003j43549h1406c4015B5554N7237
12860H2791M7450k6105b5623q4564A85608B0835J6298J03296E0910J11333b07782
12848a9135B9734l968a96171A00260b53595a06921A87911h379D1901a36731j622
12837a38353a3413B47015k4806d5426j97920H8033K78872j60012b41201a19679
$$ y = [168301, 51028, 1726, 291299, 266962, -47674, 9635, -220021, -178322, 208374, -148918, 20036, -205186, -94085, 301891, 159417, 411423, 3850, -285572, 94624, 123280, 121614, 108707, 121022, 28184, -148809, -59470, 126427, -153300, 421327, 18748, 8330, 45087, 162054, -34881, -24368, -150408, -115729, -16941, -71205, -54056, 121305, -208882, 18874, -173997, 126467, -368883, 104732, -110339, -289040, -161924, -352959, 290003, 146454, -81406, -34015, 25554, 82791, 130241, 104136, -25623, -110187, 185608, 20835, 37133, 140429, 50910, 162243, -207782, -19135, 29734, 25766, -196171, 100260, -253595, -106921, 187911, -8379, 41901, -136731, -138353, -13413, 247015, 222209, -45426, -243346, 88033, 366905, 206893, -241201, -119679]
12826a91800m2175a0425B0352P4513J95530I5405O639a0817B30858c9465B12827
12814a28808A43480D4498g9124J2185j01555a620A54823n3397b2873I127a93602
12802c5857j78765a05684j58643H4622M21978B32313b72257A06840n1073a31760
12791A91781j4609C7376b10704B01115P2937j02971a97079A14915c02903B8660
12780a62867e0164o9367I3030P7629J74348A03619a02601I2484a23703k5994D3231
12768h4757m4531B85M4089L36629b44672B8784a09236C10135a75536F3031R4919
12757A57950f1525D38063a75272f3991r8967J7687f965k78736A50071D1995a17781
12745a33098J6440l3724c9048B846h986l9414r417F7018J53152P2745j16667Q867
$$ y = [-191800, -233975, -10425, 20352, 94865, 290395, 95405, 102044, -10817, 230858, -39465, 212827, -128808, 143480, 44498, -79124, -66939, -168494, -1620, 154823, 101426, -22873, 9127, -193602, -35857, -214622, -105684, -264327, 84622, 506600, 232313, -272257, 106840, 55767, -131760, 191781, 177172, 37376, -210704, 201115, 274052, 171081, -197079, 114915, -302903, 28660, -162867, -50164, -119531, 93030, 170659, 345007, 103619, -102601, 92484, -123703, -149697, 43231, -84757, -129288, 285, 44374, 381003, -244672, 28784, -109236, 310135, -175536, 63031, 157950, -61525, 438063, -175272, -63991, -162958, -145271, -6965, -285701, 150071, 41995, -117781, -133098, -116658, -150382, -39048, 2846, -8986, -48400, -57817, 67018, 220170, 292915, 176248, 185115]
12733A85115k9703B4696J90707L358r6083m4449M6116J65324a62555K0171d269
12721f7421A38901C3383R0802J34386B6422J07615a27242M9996j6402B47647C1519
12709I3201f70k1871E0052r960K34215r6302J27185A02745a2986H2131a8653A63593
12696B16786G9248K43294a23738l6124g1692B47095A1638R0719b11276q036I3067
12684D2449I723L09211c80266a21440D8752Q3978J64923j39652m241J06338l3551
12673B26547H7398J10571a53485O4580j13728A2750b4260A93076d9182D6005c8355
12661A43772l8638J36903A02999a33818I0151b5937A14666K39684k7191A56948
12650B0559g2080c07B46372M9563L60398a65843q86A00283c6144H790h8756l9788
$$ y = [185115, 155412, 24696, 215403, 218761, 122678, 78229, 124345, 289669, -162555, -142384, -4269, -67421, 138901, 33383, 124185, 258571, 26422, 134037, -127242, -77246, -93648, 247647, 31519, 93201, -670, -22541, 50052, 40092, 274307, 178005, 305190, 102745, -12986, 82131, -18653, 163593, 216786, 79248, 322542, -123738, -159862, -71692, 247095, 11638, 102357, -211276, -219312, 93067, 42449, 9723, 318934, -380266, -121440, 48752, 132730, 297653, 158001, 153760, 260098, 226547, 87398, 197969, -153485, -88905, -202633, 12750, -24260, 193076, -49182, 46005, -38355, 143772, 105134, 242037, 102999, -133818, 90151, -25937, 114666, 354350, 327159, 156948, 20559, -72080, -307, 246372, 295935, 656333, -165843, -166729, 100283, -36144, 8790, -88756, -128544]
12638a28544o4296A73105a28147B88654j26085a28791B79618a21475B30924K5786
12628B56710c2457D31263j55714K08136k03149J38777N4611B23889c8152C52016
12617C20983j08947j02501a71650b6003h882c12A79835a23223A38487c3889B98405
12605b94204h6585A7970O0435c6666B16358d719A33587C5544J70080M285E4679
12593E3099a85216H3117N5741a40247b0141G9910P1017a64161p7604A75271c9339
12581d7180j7455H244J04001d7758j11639C2432c6843k021I5624f3547A80744
12569d0065p6358q5882C008J53603L3430o8500m1596J95431a84197f6752k47679
12558c14431A35255a40852B44826I8073c243E0059c58094a10861B68094b4707
$$ y = [-128544, -192840, 173105, -128147, 288654, 162569, -128791, 279618, -121475, 230924, 256710, -32457, 431263, 275549, 483685, 280536, 419313, 473924, 223889, -38152, 352016, 320983, 212036, 109535, -171650, -26003, -8882, -312, 179835, -123223, 138487, -33889, 298405, -294204, -86585, 17970, 78405, -36666, 216358, -4719, 133587, 35544, 205624, 209909, 54679, 53099, -185216, 83117, 138858, -140247, -20141, 79910, 150927, -164161, -241765, 175271, -39339, -47180, -64635, 8244, 112245, -47758, -159397, 32432, -36843, -38864, 95624, -63547, 180744, -40065, -116423, -202305, 3008, 156611, 190041, 121541, 79945, 275376, -184197, -66752, -314431, 135255, -140852, 244826, 98073, -3243, 50059, -358094, -110861, 268094, -24707]
12547D0624h9005H9883k4966h1059j18485a4888j31781L1954k74465P774E9161
12535I669J49054a02485A45576B8272a3047j65386c6128A45335k4547A096K44090
12524B45186b39460a0813j35182j5992c9949k44090I9562K8817a6550E4807C975
12512A49244g0929D6463A5798N4849L62163H0366J23376J34052a93243A08757
12501A6038f6033b5087k61579g8970p5906B28761a21363c5957B19802D6221J72174
12490B18395g9140l51734d0988E4161a6175l552D19714A5413b23332E9297M76933
12479E36230g4367A73196J00575e8938C6481g9364l5059j3414b0340r742B45969
12467A08988K9441o0828d6727n2060A17878E1863b5015B64657b69552A92684d87959
$$ y = [40624, -89005, 89883, 64917, -81059, -199544, -14888, -146669, -114715, -389180, -381406, 59161, 9669, 158723, -102485, 145576, 28272, -13047, -178433, -36128, 145335, 120788, 1096, 245186, -239460, -10813, -145995, -161987, -39949, -284039, 99562, 128379, -16550, 54807, 3975, 149244, -70929, 46463, 15798, 70647, 432810, 80366, 203742, 337794, -193243, 108757, 16038, -66033, -25087, -286666, -78970, -154876, 228761, -121363, -35957, 219802, 46221, 218395, -79140, -430874, -40988, 54161, -16175, -19727, 419714, 15413, -223332, 59297, 536230, -74367, 173196, 273771, -58938, 36481, -79364, -114423, -127837, -20340, -30082, 245969, 108988, 138429, 77601, -46727, -98787, 117878, 51863, -25015, 264657, -269552, 192684, -487959]
12455b5061B35903b28096Q2204C044K25737J75049e851B46356e2982B11268r1156
12444A20112a53337L7979B4247a73740A62863c0926j4490B36480n7495E2075K0208
12433G2283B565e5643Q414k2138l36729A11493k6729b58517L4687A21721i5293
12421b98096h3431j67586J12474A20154D9551K5280a2767F9603a30187a1789D4337
12409i6131n590b0604m04981A48697a9511k45001a05089j41284J20343j37412
12399b63442a0487C03748b2836A54911N8464l021a35126H3821K6114O9994a6796
12387E2616a10853F0763e9119A38306f7374j9558B28602c1743J0767E2966d2648
12375d8606C14818j41449J53050B1004a46707C46922c1286j25263m0186h9825
$$ y = [-25061, 235903, -228096, -145892, 3044, 228781, 403830, -5851, 246356, -52982, 211268, 120112, -153337, -115358, 24247, -173740, 162863, -30926, -45416, 236480, 178985, 52075, 72283, 2565, -55643, -47229, -69367, -406096, 111493, 84764, -258517, -223830, 121721, -95293, -298096, -83431, -251017, -138543, 120154, 49551, 74831, -12767, 69603, -130187, -11789, 44337, -96131, -101721, -20604, -425585, 148697, -19511, -264512, -105089, -246373, -126030, -263442, -10487, 303748, -22836, 154911, 213375, 210354, -135126, 83821, 109935, 179929, -16796, 52616, -110853, 60763, -59119, 138306, -67374, -86932, 228602, -31743, -20976, 52966, -42648, -48606, 314818, 173369, 326419, 21004, -146707, 346922, -31286, -156549, -196735, -89825]
12364d99659D8849K00056F166J10938L5130a89983d6338K2604p1147B46339a7756
12352A58780b31337E5050b03984Q1441q1972q3757f1075J2059J8747q3843q279
12341a22391h106B84432j32431k962b1504j75663B64156F7132O0784Q8503b75548
12329a1813j28717o7130C32728B8761pb14345G5047L2523a14424j04030h9864
12317c41707H5960a56845C69065c1998A72220c1080o7633G4451a01872A89430
12306H3584a02502A97J47006d1860A91906a73400A33329J99134A29003a53097
12295B83189j14305K58536a93486C08416F8851J83419A9411a73585c3664a3046
12284A50491G1449G511K84108G4253h5819p04h498E8895J24420R1364A6300K15220
$$ y = [-499659, 48849, 248905, 6166, 117104, 152234, -189983, -46338, -23734, -94881, 246339, -17756, 158780, -231337, 55050, -203984, -122543, -204515, -288272, -61075, -49016, -30269, -114112, -122391, -8106, 284432, 152001, 149039, -21504, -197167, 264156, 67132, 127916, 216419, -275548, -11813, -140530, -207660, 332728, 28761, 28754, -214345, 75047, 107570, -114424, -218454, -89864, -341707, 85960, -156845, 369065, -31998, 172220, -31080, -98713, 74451, -101872, 189430, 83584, -102502, 197, 147203, -41860, 191906, -173400, 133329, 332463, 129003, -153097, 283189, 168884, 427420, -193486, 308416, 68851, 252270, 19411, -173585, -33664, -13046, 150491, 71449, 7511, 291619, 74253, -85819, -86523, -8498, 58895, 183315, 274679, 16300, 231520]
12272B31520C7823Q8075d1841A30706c00394B57799j22803b11825A59704m4585
12262A15119a4313j9518j80839C10894D7545j8547Q9056a90569C47456L830A69874
12250C97151A32841E0427R2280a32814M6853j9205j46666i5574C25692a20061
12239B59509q7896p6672l5626J71073O5875j05536a30224G4624J68572m4300J30324
12228C29220K8407j55023J61326b8307A80600d8967A93404a94964C22072D771
12217h5981D27208j77093J45224A17209L9935G8106a68650m7C5300M66928b43940
12205A85260c5167B51377A10950L33290A53887J13758L65651A35728K03306j25020
12195B14014M7005A16297J82240K25436A60625a5391C88065l8726r810A51179
$$ y = [231520, 37823, 125898, -41841, 130706, -300394, 257799, 134996, -211825, 159704, 115119, -14313, -33831, -214670, 310894, 47545, 28998, 118054, -190569, 347456, 351286, 169874, 397151, 132841, 50427, 142707, -132814, -85961, -105166, -251832, -95574, 325692, -120061, 259509, 171613, 94941, 59315, 230388, 296263, 190727, -130224, 74624, 243196, 198896, 329220, 357627, 202604, 363930, -28307, 180600, -48967, 193404, -194964, 322072, 4771, -85981, 427208, 250115, 395339, 117209, 157144, 78106, -168650, -168697, 35300, 502228, -243940, 185260, -35167, 251377, 110950, 444240, 153887, 267645, 633296, 135728, 339034, 214014, 261019, 116297, 298537, 523973, 160625, -15391, 388065, 349339, 339529, 151179]
12184b88084b9700F4518a57530D96195k09703J68532G8892l6418J74174E0288
12173A5448a03178C59651a66963C30017E0152N9928J58769G3063K65954I3829
12162D78708A84888o5342E6353a90082H639L1341Q7356Q8865J66317e4946B84015
12150I4975b05293A14681a42506E076M31539r9828A01949O1057l6520d7183A82144
12138E0577Q9372q597b51696H2556f6921A93428h934p2221B83161l9430I4535
12126B02975J72777E0528a36996G0812i7722b9190o3570j01519K8361c8698B14447
12114a49233c152p8940k88222h9267d2882k65666a34263G918O4617c03812N6567
12103b47245H4911a82942M5941j11114g6824k21361A24320a36482A04389a63260
$$ y = [-288084, -29700, 64518, -157530, 496195, 286492, 455024, 78892, 42474, 216648, 50288, 15448, -103178, 359651, -166963, 330017, 50152, 110080, 268849, 73063, 339017, 93829, 478708, 184888, 119546, 56353, -190082, 8639, 39980, 127336, 216201, 382518, -54946, 284015, 94975, -205293, 114681, -142506, 5076, 436615, 336787, 101949, 163006, 126486, -47183, 182144, 50577, 139949, 131352, -251696, 82556, -66921, 193428, -8934, -81155, 283161, 243731, 94535, 202975, 375752, 50528, -136996, 70812, -97722, -29190, -92760, -194279, -165918, -38698, 214447, -149233, -3152, -82092, -370314, -89267, -42882, -308548, -134263, 7918, 72535, -303812, -247245, 84911, -182942, -137001, -248115, -76824, -298185, 124320, -136482, 104389, -163260]
12092b02796A51201C681b14418j11892A54049F7597j8044a78302d590A60701D6083
12080C15748B9136c11971B24985K19598j68276L00250J258317n35952E67375b3723
12069A26435a24201C26417b14997I1603f223A02815a8741N733j37947E8c74077
12057A93074a11731e4819o7515F5027f8667A36333P5574p1568i4833j45287g1161
12045D5064c81444a35113c5114J4304n9197B79266o7954J12840F7071a56407B2387
12033b05910A26149L4227b7339k54395c6379E0851a86000j1464a159I2738G087
12021c84579c910A30001d59729A85873e3899D61348b61998d6181A2866J1604b71068
12009C10748L839H124Q2012b18813I4928B9993K49723A34790R6601b49384d2492
$$ y = [-202796, 151201, 3681, -214418, -326310, 154049, 67597, 49553, -178302, -4590, 160701, 46083, 315748, 29136, -311971, 224985, 444583, 276307, 576557, 1834874, 1298922, 567375, -23723, 126435, -124201, 326417, -214997, 91603, -6223, 102815, -18741, -13008, -150955, 58, -374077, 193074, -111731, -54819, -122334, 65027, -68667, 136333, 211907, 140339, -94833, -240120, -71161, 45064, -381444, -135113, -35114, -20810, -80007, 279266, 211312, 324152, 67071, -156407, 22387, -205910, 126149, 160376, -27339, -281734, -36379, 50851, -186000, -197464, -1159, 92738, 7087, -384579, -3910, 130001, -459729, 185873, -53899, 461348, -261998, -46181, 12866, 24470, -271068, 310748, 314587, 8124, 90136, -218813, 94928, 29993, 279716, 134790, 231391, -249384, -42492]
11997A38772O3048a02022A86903m3470D0291J74630c1471A18992B2077A40J3022
11986A3162K10262K0641p8033e57036g7548p7000E9909J15842a49263p546P5242
11975h1567q6389B21214a68413M132H7158f6745A38230l5578b56531A56309G8123
11963a24599r0851B00803P7830f8142j50368j0853B08073d03A14078D4948J8737
11952F3685e0778A19178d5029b86B70549o8102a03591B21363D945J24457b11903
11940F1531a93467D7344a61373L9404a4446l0333l8178k05105j070Q4389A94789
11928A04671i893I3518f6273L530k4094A5728N13478a58822d6720r1681L7622
11917a00779o7210M2714r6987a08322r2681j41979A43394g7057n8303A21997B6822
$$ y = [138772, 201820, -102022, 186903, 143433, 40291, 214921, -31471, 118992, 22077, 140, 13162, 223424, 244065, 166032, -557036, -77548, -154548, 59909, 175751, -149263, -156809, -81567, -167956, 221214, -168413, -164281, 87158, -66745, 138230, 102652, -256531, 156309, 78123, -124599, -215450, 200803, 278633, -68142, -218510, -229363, 208073, -403, 114078, 44948, 63685, -50778, 119178, -45029, -286, 270549, 202447, -103591, 221363, 4945, 129402, -211903, 61531, -193467, 47344, -161373, -121969, -14446, -44779, -82957, -288062, -289132, -204743, 194789, 104671, -9893, 93518, -66273, -62743, -86837, 15728, 529206, -158822, -46720, -138401, -100779, -167989, -125275, -222262, -108322, -201003, -342982, 143394, -77057, -135360, 121997, 26822]
11905A00759K22868a60812O3102d6845C26771a45109J8538m197j20093B05140
11894a2952j29890d4190j15249N1943k49693a68997B52289c23556A39104a74864
11883A90167b00413d7255H3882k0692J19994b6877j54400L7630N2916c72A1619
11871b62866r7331b8260j51194A7935J2399i1759j90514c3871A9792h7602b0730
11859a19993M0443I4302a2804b056B0566K6978b19333q6049J07169j09668Q9530
11848b18351j05684m789k1491C5108b83058c8930C27748a73335a3813k53847Q4946
11837a82714B1273c9843C39404j37842a5982k10463c0812a4866l9894D8276a5566
11825i6448B87928C1348J92562j06809b85614R3373f3759H247a73427F9484a04209
$$ y = [100759, 323627, -160812, -97710, -46845, 326771, -145109, -126571, -130768, -250861, 205140, -12952, -142842, -44190, -159439, -107496, -357189, -168997, 252289, -323556, 139104, -174864, 190167, -200413, -47255, 83882, 63190, 183184, -26877, -181277, -143647, -90731, -372, 11619, -262866, -360197, -28260, -179454, 17935, 30334, -91759, -282273, -33871, 19792, -87602, -20730, -119993, -79550, 94302, -12804, -2056, 20566, 47544, -219333, -305382, -198213, -307881, -218351, -324035, -328824, -350315, 35108, -283058, -38930, 327748, -173335, -13813, -267660, -182714, 21273, -39843, 339404, 201562, -15982, -226445, -30812, -14866, -54760, 48276, -15566, -96448, 287928, 31348, 223910, 117101, -285614, -192241, -63759, 8247, -173427, 69484, -104209]
11813f8849A49561e1586n3736j14094P0150A70399E5805e0097k7543C54644a74716
11801B8071J17092b81223E7294a24368e599A39388M2515a10440A78078c06411
11790F7800K75416d479i39j33453k508A30856b32773A76860a64859C1151Q4843
11779A15994l9855K12118f6897n3681A9850f1530l0847p4446K9095B32156E3749
11767h1670b296E3144c7902H3476a60601c463j8365j31617b8301q7445p192r9492
11755b22430C8663a77274A51237b62086H0686c98384J42693A88280p9117E1374
11744A72189l2052e5640A08210a16193K9423j8700B8478L2148P2588K90352A0974
11732A02792a5072k27191A27896R8628b59990a6537o1839J4401E5220M8793P4824
$$ y = [-68849, 149561, -51586, -105322, -219416, -149266, 170399, 55805, -50097, -77640, 354644, -174716, 28071, 145163, -281223, 57294, -124368, -5599, 139388, 181903, -110440, 178078, -306411, 67800, 343216, -4479, -939, -134392, -136900, 130856, -232773, 176860, -164859, 31151, 115994, 76139, 288257, -66897, -120578, 19850, -61530, -92377, -166823, -137728, 232156, 53749, -81670, -2296, 53144, -37902, 83476, -160601, -3463, -21828, -153445, -28301, -115746, -122938, -222430, 38663, -177274, 151237, -262086, 80686, -398384, -255691, 188280, 109163, 51374, 172189, 140137, -55640, 108210, -116193, -86770, -105470, 28478, 60626, 133214, 423566, 10974, 102792, -15072, -242263, 127896, 226524, -259990, -16537, -78376, -63975, 55220, 104013, 178837]
11721A78837k7553P610p0397a77553A47922g1451H3556h4755A09826J66781C6849
11709b01197A5568J05848P9171q4495l0541a37384B14656D1316N28932f91k1466
11698b2157A72807J5416Q8176f5326I0082a83880C43781c2179C95036C5387R212
11687D4599L27333A02249d9277A76902i7003j18166A23466a16763A67347n6209
11677A11138K27850q6656a59644c2033Q436A59650n215m5992i152A1240J51849
11666A63089K7516c2508k16670J6136f3805K019A38793a23438b3118E353b33827
11654D6453J07379b63788D751a84719j13039a20701r0820a2929j7391o9926A76061
11642h9943a1173k49558b1660j3480k24277A2437g6103N154R664D8216J91203
$$ y = [178837, 151284, 158894, 88497, -177553, 147922, -71451, 83556, -84755, 109826, 276607, 36849, -201197, 15568, 121416, 200587, 116092, 85551, -137384, 214656, 41316, 570248, -691, -22157, 172807, 188223, 276399, -65326, 90082, -183880, 343781, -32179, 395036, 35387, 44599, 371932, 102249, -49277, 176902, -97003, -215169, 123466, -116763, 167347, 111138, 338988, 252332, -159644, -32033, -23597, 159650, 154435, 108443, -9152, 11240, 163089, 190605, -32508, -249178, -233042, -63805, -61786, 138793, -123438, -23118, 5353, -233827, 46453, 153832, -263788, 4751, -184719, -297758, -120701, -211521, -12929, -30320, -100246, 176061, -89943, -11173, -260731, -21660, -35140, -259417, 12437, -76103, -70949, -61285, 48216, 239419]
11631B39419a85572a9406B46952j13393d24694A75290K81709G7010g7961o4060
11621a42021A00299b1481k72395b792l03313A33414a16995L8614B3083b61159
11610h8036E02549a12773l8224B0547b3805j40736B51730a66238h307B10603B6987
11598A27408F2012j4429k1678c34526a36673B12810I9292g1138P889l0293l912
11587i7454c4566M941B26978b51957I9088J80008a51609D428M20215F3065g2530
11575G7244a08700D1497k0362K09458P6746j42320j5388l4214l9611o955a37379
11563b35883j0281A65965E5400j7173J9407b1458O210j08322A56842f0741J4846
11552d5895E5512a49588B81007c09423B40573b8548A16266m829D6690a56116F0907
$$ y = [239419, -185572, -19406, 246952, 133559, -424694, 175290, 456999, 77010, -77961, -142021, 100299, -21481, -293876, -2792, -306105, 133414, -116995, -78381, 23083, -261159, -88036, 502549, -112773, -150997, 20547, -23805, -164541, 251730, -166238, -8307, 210603, 26987, 127408, 62012, 47583, 25905, -334526, -136673, 212810, 99292, -71138, -63249, -93542, -97454, -34566, -29625, 226978, -251957, 99088, 279096, -151609, 4428, 424643, 63065, -72530, 77244, -108700, 41497, 21135, 230593, 307339, 165019, 149631, 115417, 75806, 68851, -137379, -235883, -246164, 165965, 55400, 38227, 57634, -21458, -15248, -123570, 156842, -60741, -45895, 55512, -149588, 281007, -309423, 240573, -28548, 116266, 111437, 46690, -156116, 60907]
11540E2266K43773C4851K81865e253A93222H7736f8383J0442C28065a61071A72147
11528A97408E7576k0052j5736K89364j31218B6620L28945b2039A96314M499i0189
11516a58178A6110J3417J99586G364R1764K62186J43032E5831h9456A32149R8413
11505B30562H725P5426B4908i6449B327M65119a3176A24513g0239B28423n4113
11494A74310e6846D15420j93053R0859K839A40039E1528f7629B18553r2645J21835
11483B47743j00538e2124A27530j3192J32337M1353d91372G1394d307F1825J92564
11472B54389A11398Q4801F1480J72420F1191J8863J88810j18675O2682J42998
11462C55869F2486e054l9537m3602C40330H1749J67370F8207h7578C50445A6299
$$ y = [52266, 296039, 34851, 316716, -5253, 193222, 87736, -68383, -57941, 328065, -161071, 172147, 197408, 57576, 37524, 21788, 311152, 179934, 26620, 355565, -22039, 196314, 200813, -90189, -158178, 16110, 29527, 229113, 7364, 99128, 361314, 504346, 55831, -89456, 132149, 230562, 8725, 84151, 24908, -96449, 2327, 467446, -13176, 124513, -70239, 228423, 174310, -56846, 415420, 222367, 313226, 316065, 140039, 51528, -67629, 218553, 125908, 247743, 147205, -52124, 127530, 114338, 246675, 288028, -491372, 71394, -4307, 61825, 254389, 111398, 196199, 61480, 233900, 61191, 80054, 268864, 150189, 212871, 355869, 62486, -5054, -44591, -88193, 340330, 81749, 249119, 68207, -87578, 350445, 16299]
11450g4683A04899j2576l5955a71967A33817O8137g5601p2845a4941p2105I0391
11438A27638h394j2622k59318e5797C17959j23384i5425B33896j02443B7004c67476
11426A32625g0581A14293J47515o2202E7596c9870A92274n0857E0424b17461R7400
11415a20061A83871a74588A97576b68013k49845e1606l697M5j1740A46478J92415
11404C38893c24961D5814r663N6104i8805j35997a04156B23543i2538B4756a80381
11392A01824l0669K04292I5500c45627h8739A13241a48843B3967a64187a6123
11381a77956h4185b4948j69972M5771p2166B9158e0682l39593g007j40535c3439
11369d47197a60987i702o3288C1124Q7339h6967k24653h549B57284b61244g4734
$$ y = [-74683, 104899, 92323, 56368, -171967, 133817, 201954, -75601, -148446, -14941, -87046, 90391, 127638, -8394, -21016, -280334, -55797, 317959, 194575, -95425, 233896, 131453, 27004, -367476, 132625, -70581, 114293, 261808, 199606, 57596, -39870, 192274, 141417, 50424, -217461, -120061, 183871, -174588, 197576, -268013, -517858, -51606, -55303, -55258, -66998, 146478, 338893, -324961, 45814, 36151, 92255, -98805, -234802, -104156, 223543, -92538, 24756, -180381, 101824, 71155, 275447, 95500, -345627, -88739, 113241, -148843, 23967, -164187, -16123, -177956, -84185, -24948, -194920, -149149, -221315, 29158, -50682, -390275, -7007, -147542, -33439, -447197, -160987, -9702, -72990, 31124, 118463, -86967, -311620, -8549, 257284, -261244, -74734]
11357a23745E9854J4905B4103J14160b440r9983Q21A72559Q286o3705R4856c8658
11344d9473A72438F423L938J18822B2265Q1063B1164e9990F4552i7001A73747
11332C7174c740p7321A81255a83175a3515A61436b42629a12836B59194L9336a90952
11320C17391a91559g0294A03111D5565M8339J04245b03926A44887k5415a03592
11309a62333C47711a29176j76536E8758M9691c3671k36485D247J86949d30157
11298B63079a26983B72848F2178a54426e1853n5762A39166a74083G6757J04998
11288A81755L1903a63596d7392E1512a49287P2508C37303A54438a42631A56643
11277a98938A33532c86619D37255c34177c3625m00823K01564A16671d6393B24207
$$ y = [-123745, 59854, 74759, 24103, 138263, -2440, -102423, -101602, 172559, 180845, 117140, 211996, -38658, -49473, 172438, 6423, 10361, 129183, 22265, 103328, 21164, -59990, 64552, -97001, 173747, 37174, -3740, -81061, 181255, -183175, -13515, 161436, -242629, -112836, 259194, 298530, -190952, 317391, -191559, -70294, 103111, 45565, 93904, 198149, -203926, 144887, 119472, -103592, -162333, 347711, -129176, -305712, 58758, 108449, -33671, -270156, 4247, 191196, -430157, 263079, -126983, 272848, 62178, -154426, -51853, -107615, 139166, -174083, 76757, 181755, 213658, -163596, -47392, 51512, -149287, -76779, 337303, 154438, -142631, 156643, -198938, 133532, -386619, 437255, -334177, -33625, -434448, -232884, 116671, -46393, 224207]
11266g5764A8102J1395f0018b5234A29493c00416J46906f9029C8288K53124i2201
11254b7770B8553e1654b171C07330G0459f6610F5595e7552k92588J36677N0186
11243a63277j2470d5860A9535a34630H4869J05960c66652J05763R7738k0108B63446
11231A17923J49804H0707P6227n5348e5906A9884K7674a88066j46026B11108a70172
11219D8199a27988m33934a35326M401K2104j33774b5408j27583m094B16178h9173
11207E1153M8546n628L9751a40373O5767E7015Q0121b04814F1882b75640a00917
11195C480J81000g6646D6085h319j00520B27814a89872A3263J2763R6164A4394
11183g4071A43655d9544A18579c06184a52782m9708m3226h9103k513K5471o1954
$$ y = [-75764, 18102, 29497, -60018, -25234, 129493, -300416, -153510, -69029, 38288, 291412, -92201, -27770, 28553, -51654, -2171, 307330, 70459, -66610, 65595, -57552, -350140, -213463, -163277, -175747, -45860, 19535, -134630, 84869, 190829, -366652, -260889, -163151, -183259, 263446, 117923, 267727, 80707, 156934, 101586, -55906, 19884, 47558, -188066, -334092, 211108, -170172, 48199, -127988, -561922, -135326, -130925, -108821, -242595, -25408, -152991, -157085, 216178, -89173, 51153, 99699, 94071, 133822, -140373, -74606, 57015, 137136, -204814, 61882, -275640, -100917, 3480, 184480, -76646, 46085, -8319, -108839, 227814, -189872, 13263, 26026, 122190, 14394, -74071, 143655, -49544, 118579, -306184, -152782, -202490, -245716, -89103, -91616, -66145, -128099]
11172a28099E6039J08844J31613j20358b12509A33721e8490B83630a31784k6251
11162a58035B73367c78399C18796E2144j5218K78874G0932k8976e0781B08927
11151B87956d30405I1653a84317H6489a14892j74438M0459h8336a946j27707A01624
11139B88514b30022a09388A03566A4650M5699g357A29102b48158C38005A7455
11128C38948A27341C8520P7983n2483Q5070J25303D3729J64833o9220o7094O1470
11117A33718j0502j2535E718h7692K7179G2574a12129r5591A76023J39820H3891
11105A65103A8809J57541K71422l0155j22520j3644j7177e112A61399o5476J01730
11094A97653q3131a75320B1435j01M95665g3874C36364h4271m537C29566J8921
$$ y = [-128099, 56039, 164883, 296496, 176138, -212509, 133721, -58490, 283630, -131784, -158035, 273367, -378399, 318796, 52144, 36926, 315800, 70932, 41956, -50781, 208927, 287956, -430405, 91653, -184317, 86489, -114892, -289330, -248871, -88336, -1946, -129653, 101624, 288514, -230022, -109388, 103566, 14650, 60349, -7357, 129102, -248158, 338005, 17455, 338948, 127341, 38520, 116503, 64020, 149090, 274393, 43729, 208562, 139342, 72248, 133718, 123216, 110681, 5718, -87692, -60513, 72574, -112129, -207720, 176023, 315843, 83891, 165103, 18809, 176350, 447772, 417617, 295097, 281453, 264276, -5112, 161399, 95923, 197653, 114522, -175320, 21435, 21334, 516999, -73874, 336364, -84271, -88808, 329566, 348487]
11083C48487A25284M3184J51624A7240L36264A39350J08759M37976A01350L0633
11073A31983K23935j29605M155J70706P5812j08836L0731o7363o7752j5255K11842
11062D60353M9390A19256L26913J9867J87112B95082L73153n2562k33893K38477
11052F20257J4223k624q0766K95480k18187O1124j03509k642J15984k25209O34180
11041A108311O7670l00059j20946M9316j92828m7198K15114r5004o2001B59505
11030F81481j338k87871M85627j19769j09892o9687J30915K89859k00543j80113
11020F18669J08975L4844k44190O5100k9929n1342J55214j16430M7869L04906
11010H93686l50449n1453j4710J74215K0178j06124L81556j19628l29213K29961
$$ y = [348487, 125284, 168468, 320092, 17240, 353504, 139350, 248109, 686085, 101350, 131983, 355918, 226313, 230468, 401174, 476986, 368150, 398881, 331518, 263766, 248511, 460353, 509743, 119256, 446169, 466036, 653148, 295082, 668235, 615673, 381780, 620257, 634480, 631856, 551090, 846570, 628383, 689507, 585998, 583356, 699340, 474131, 1108311, 1175981, 875922, 754976, 804292, 611464, 564266, 779380, 684376, 622375, 259505, 681481, 680143, 392272, 877899, 758130, 648238, 578551, 709466, 999325, 798782, 618669, 727644, 762488, 518298, 583398, 553469, 502127, 657341, 540911, 588780, 893686, 543237, 491784, 477074, 651289, 671467, 565343, 946899, 827271, 498058, 728019]
11000G28019B90724N35733k88410J14006B77605M40323j46967M56735B67298N45075
10990H12373j084m4787N51248n84020L82968m33082K16481K28637r2132K25303
10980A261905j93992L27693J83107n1290L51534L04496J4714J49127M57632K26385
10970C031311k32757J95566k82404m14579n5902l71080j12143k92359n4953Q4466
10960A495166m0449M0326L10881l34214J42671K60917l63504k1019j87081F02482
10949I23616j07177C47188J05509j36389O2017n0602k5614J46755A57877P6763
10939B34640c2747j705I2278m5899K58045A29208i2085C64889H5536J28936C9948
10927A86955h2078k2381B2310J1395f8590B32544o1017J777I494K6708a20434
$$ y = [728019, 290724, 826457, 538047, 652053, 277605, 717928, 570961, 1027696, 267298, 812373, 811289, 766502, 1317750, 733730, 1116698, 683616, 900097, 1128734, 1036602, 1261905, 1067913, 1395606, 1578713, 1527423, 1878957, 2183453, 2198167, 2347294, 2804926, 3031311, 2798554, 2994120, 2711716, 2297137, 2241235, 1870155, 1758012, 1465653, 1410700, 1495166, 1454717, 1495043, 1805924, 1471710, 1614381, 1875298, 1511794, 1490775, 1303694, 602482, 923616, 816439, 347188, 452697, 316308, 378325, 327723, 302109, 448864, 157877, 234640, -32747, -34452, 92278, 46379, 304424, 129208, -92085, 364889, 85536, 214472, 39948, 186955, -82078, -104459, 22310, 33705, -68590, 232544, 171527, 173304, 9494, 36202, -120434]
10915a0095n0470j3225A77861q4681l078C0938e5128B39672A0010a00840b3434
10903a52410C6073b46725e2552H7003K987B5524g1447q9231A25548N6036a84053
10891d381H2809c47990A37180a71430c5155k46697J28276A67984J3055q5310j3096
10880H2633a44427E015J67734A1461O7748Q212f1058F0180k8400Q391P2370m1490
10868G1051J54168a42421D944N89a54668A0606d5311j97636o2797J15901d884
10856A86552K6481a68305j24840A49485B3118e8507p0696r8294H8865b23025L7254
10845a85771g8942C62424G3667g18D0841a32025j45346B25812C5631b09586G6467
10833a76998g907B21938b9686A35810d4201j82922R4308A00079m7054a30047B0366
$$ y = [-10095, -60565, -73790, 177861, 93180, 90102, 30938, -55128, 239672, 10010, -100840, -23434, -152410, 36073, -246725, -52552, 87003, 89990, 25524, -71447, -160678, 125548, 181584, -184053, -4381, 82809, -347990, 137180, -171430, -35155, -281852, -153576, 167984, 181039, 95729, 82633, -144427, 5015, 172749, 11461, 79209, 87421, -61058, 60180, 31780, 40171, 112541, 71051, 225219, -142421, 4944, 5533, -154668, 10606, -45311, -242947, -305744, -189843, -4884, 186552, 213033, -168305, -293145, 149485, 23118, -58507, -129203, -227497, 88865, -223025, -185771, -78942, 362424, 73667, -718, 40841, -132025, -277371, 225812, 35631, -209586, 76467, -176998, -7907, 221938, -29686, 135810, -44201, -227123, -132815, 100079, 53025, -130047, 20366]
10821a16043A42771l2896a35088j5327c4822H2353a7061A52781a0922B19620i1879
10809b34704A15474a05638D7218b08386j79590F0048g1558c3850k23641j0146
10799b67637G5730c1888k19227d732k45420A00590H819J31591k3295a56642j30841
10788b87483J12888E2219f1299r3176B24742b5258A3124P1825a02344d5010K2413
10777b2597j29404p6808B9765N2712N3288F6704a63504a2583j2867H9712b42705
10765A96476q4727a68702k29272e2334n8433A57163f4232k45866f3851F6585d9431
10753c3822n3457A40654b22599L1020G2534c37878J07108A67456a6233I5289K87582
10742C82871a84980A29637l5272b94697Q7979R9412j51676A88914a87019R2534
$$ y = [-116043, 142771, 109875, -135088, -150415, -34822, 82353, -17061, 152781, -10922, 219620, -91879, -234704, 115474, -105638, 47218, -208386, -387976, 60048, -71558, -33850, -257491, -267637, 75730, -31888, -251115, -4732, -250152, 100590, 8819, 140410, 117115, -156642, -287483, -174595, 52219, -61299, -154475, 224742, -25258, 13124, 84949, -102344, -45010, -22597, -152001, -228809, 29765, 82477, 135765, 66704, -163504, -12583, -25450, 89712, -242705, 196476, 111749, -168702, -397974, -52334, -110767, 157163, -64232, -310098, -63851, 66585, -49431, -33822, -87279, 140654, -222599, -191579, 72534, -337878, -230770, 167456, -16233, 95289, 382871, -184980, 129637, 94365, -294697, -206718, -107306, -258982, 188914, -187019, -94485]
10732i4485B83610j05593b02538f6831G188J34632e468B83319i0700l2283j17200
10721b40183G5840c04190B0312L2697b29062C16965j39730L1887h4301G5332b39863
10709b01207B01850J5597A6479h9757L4726C9186J84285d5902A56643n8205b9090
10697a31691N2219j2643k935j56470A63837b53577B19320A3145J52264c37517
10686b65608R2472F606J64566b61967C6358h8818k00237h6677l25552E5068f8384
10674b8511A8994d03189g3604G0911O1489l3547h6155J0384j04469A30882A8411
10662g2191H058a55010g1513j41431A39781C025J53483m2860b37055F6809e588
10650I1161L8686C5597i8989j37724I2160a48714F2248b00899k33532A88595a25753
$$ y = [-94485, 283610, 178017, -202538, -66831, 7188, 141820, -5468, 283319, -90700, -122983, -240183, 75840, -304190, 20312, 53009, -229062, 316965, 177235, 209122, -84301, 75332, -239863, -201207, 201850, 217447, 16479, -89757, -55031, 39186, 223471, -45902, 156643, 98438, -29090, -131691, -79472, -92115, -95050, -251520, 163837, -253577, 219320, 13145, 165409, -337517, -265608, -173136, 6606, 171172, -261967, 36358, -88818, -289055, -86677, -412229, 55068, -68384, -28511, 18994, -403189, -73604, 70911, 132400, 98853, -86155, -75771, -180240, 130882, 18411, -72191, 8058, -155010, -71513, -212944, 139781, 3025, 156508, 113648, -237055, 66809, -5588, 91161, 129847, 35597, -98989, -236713, 92160, -148714, 62248, -200899, -434431, 188595, -125753]
10638a07977k49350r7867A00909J55417e1683B81680a11820n2553b4527j96877
10628b21404i5903B158J03539b65525Q9592A8750R9425j9442J54546H1780d1926
10616H2845b21515D1219a2714q8469k1068C24872r5627b82452C4364c9521j96874
10605b36395J8242A19992g7390j42892J00582A40308b45565a19868e1756j08208
10595a59964j72661d7542A37000C5319f8706l8759j28086F580O5957K239b27595
10583i6656K5346j64454A63208b35796K7476a4258m09515a91095n9505b2587r4478
10572a17065A859b21076A43676K33966a00026l92587b2030k17772L9286g4174
10561a78487A78338H8481c13444g6376c1578B6425J29842D761J65149E5935a53855
$$ y = [-107977, -357327, -455194, 100909, 256326, -51683, 281680, -111820, -164373, -24527, -221404, -95903, 2158, 105697, -265525, -175933, 18750, 118175, 98733, 253279, 81780, -41926, 82845, -221515, 41219, -12714, -101183, -122251, 324872, 229245, -282452, 34364, -39521, -236395, -218153, 119992, -77390, -220282, -119700, 140308, -245565, -119868, -51756, -159964, -332625, -47542, 137000, 35319, -68706, -107465, -235551, 6580, 72537, 74776, -227595, -96656, -71310, -235764, 163208, -235796, -208320, -14258, -423773, -191095, -250600, -22587, -117065, 1859, -221076, 143676, 377642, -100026, -492613, -22030, -239802, -200516, -74174, -178487, 178338, 88481, -313444, -76376, -31578, 26425, 156267, 4761, 169910, 55935, -153855]
10549F9074A1285J08403d3484K98J4056D4841b16170l1397N6807g6462B40593
10537a26313B63171G3096J32955C3648e9528j47351K6646e8642L466p4347B50824
10525C52534c7405A57951N9619k2014a11349p6486H0573d92434h9585B01736g9613
10513a32209I1255g3888l17578A07666b29588A2079a02421b6771A1814P8025a3978
10501a96996Q5704D32223b36652J04682q9419i8983j8669k79236J87933C00946
10490i6828A22478J26797a91687j63552E885K74292B8101a03727D23629o5501
10480C58128j43394J31512J01047j06125c6539B03813J27699c4453B58781e5049
10469d171A04206h2429d548B938O3677O3997b06299B96145h8259b2405B65090
$$ y = [69074, 11285, 119688, -43484, -43186, -29130, 44841, -216170, -247567, -190760, -76462, 240593, -126313, 263171, 73096, 206051, 33648, -59528, -206879, -180233, -58642, -55176, -129523, 250824, 352534, -37405, 157951, 217570, 195556, -111349, -187835, 80573, -492434, -89585, 201736, -79613, -132209, 91255, -73888, -391466, 107666, -229588, 12079, -102421, -26771, 11814, 89839, -13978, -196996, -111292, 432223, -236652, -131970, -221389, -98983, -117652, -396888, -208955, 300946, -96828, 122478, 249275, -191687, -355239, 5885, 280177, 28101, -103727, 423629, 358128, 214734, 346246, 447293, 341168, -36539, 203813, 331512, -34453, 258781, -55049, -4171, 104206, -82429, -4548, 2938, 66615, 130612, -206299, 296145, -88259, -22405, 265090]
10457B91625a83547r5196J24021k258k51083J93710N8045d1190j70939H9558a95251
10445A69007i1679C3177m889a30259m4466c4000l9563A70648c52395h2881l38713
10434d21594B38480b64559d2438B2997c28167H3465d5245E8138N1157J3512J13
10423A22920J36373a74769P5578m14178a55136c1532B90384a12884j58032B77091
10412b32183O712A94369e5245C13037J3049E046M7480k2124L7845J26595b35238
10400E2120a63922C13502b79874H0129C7843B761N09110j23220G879a40345C52494
10388I4915K2563J01329b0552A13544J09774A60J6967J80557r5915J59089K3261
10377B84119j31927o8336J77997L28094j25263A66345J46536A15267O2949J15924
$$ y = [291625, -183547, -278743, -154722, -156980, -408063, -214353, -156308, -41190, -212129, 89558, -195251, 169007, -91679, 33177, 28288, -130259, -174725, -34000, -73563, 170648, -352395, -82881, -421594, 238480, -264559, -42438, 22997, -328167, 83465, -45245, 58138, 109295, 122807, 122920, 259293, -174769, -99191, -513369, -155136, -31532, 290384, -112884, -270916, 277091, -232183, -225471, 194369, -55245, 313037, 326086, 5046, 52526, 30402, 68247, 194842, -235238, 52120, -163922, 313502, -279874, 80129, 37843, 2761, 511871, 388651, 7879, -140345, 352494, 94915, 117478, 218807, -20552, 113544, 223318, 160, 17127, 197684, 101769, 260858, 284119, 152192, 83856, 261853, 589947, 464684, 166345, 312881, 115267, 178216, 294140]
10367B94140J34043J32365k33090J63448B25345K44737k14144E8830K06917l0554
10357B35193J49884G6389J59491M7283c8682C23621J49529k5142J76008l10038
10347C13978K84855k39164j70203N92073B23391L16346j76073A40642L89488c5632
10336f3973B67308a4391D50343n7911j91353G0013A1337M2269c1195B68876A03544
10324A03797D2990J93224p2635O5284K26193A52114C5473L51416D1971K54204
10314B96175l8148a413A64325A8767J49532A7774i2996C4277J52407h1052m3944
10303a24996r412E9762a43754A79910f4598k27921p9761a23750n73j67790h0710
10291a77210B00521a68712c6345l14872B97740c10209P4966M7183n1191i9314
$$ y = [294140, 428183, 560548, 327458, 490906, 225345, 470082, 255938, 58830, 265747, 235193, 385077, 76389, 235880, 283163, -38682, 323621, 473150, 448008, 624016, 313978, 598833, 359669, 189466, 781539, 223391, 539737, 363664, 140642, 530130, -35632, -63973, 267308, -14391, 450343, 392432, 201079, 70013, 11337, 53606, -31195, 268876, 103544, 103797, 42990, 236214, 163579, 228863, 455056, 152114, 35473, 386889, 41971, 296175, 258027, -1413, 164325, 18767, 168299, 17774, -92996, 34277, 186684, -81052, -124996, -134408, 59762, -143754, 179910, -64598, -292519, -372280, -123750, -124323, -292113, -80710, -177210, 200521, -168712, -36345, -351217, 297740, -310209, -235243, -188060, -239251, -99314]
10280c97071J32073a31665A37372M4928b4958G9562O8812J1887F9504c4959B12921
10268f3381B16928E6962K2779K47518d09132I1156L8515B3243Q9685O2409K8842
10257B04179N4508J98083A03668j187I561N8997a71589A01293a42758A26957h6450
10245h2504r4511A06886D8654d2382C52929G5000J28248J6633a2726B5739c70404
10233A86410b23166l830a6564l1521A97000a5161m7675k02934L2021r014K4563
10222b18200k35807C2195K6686j7865c02253g3275A14204b0936C22708l9324A39478
10210c37030C0909i4382A28302a86313J5625j7393f6670l10193B64201M219b03816
10198B08570a32295D4115e0305A44360a1229k76207c4383j07881f7928J1886k3420
$$ y = [-397071, -264998, -131665, 137372, 182300, -24958, 79562, 148374, 160261, 69504, -34959, 212921, -63381, 216928, 56962, 79741, 327259, -409132, 91156, 129671, 23243, 112928, 175337, 204179, 258687, 456770, 103668, 102481, 9561, 68558, -171589, 101293, -142758, 126957, -86450, -82504, -177015, 106886, 48654, -42382, 352929, 75000, 203248, 219881, -12726, 25739, -370404, 186410, -223166, -226996, -16564, -48085, 197000, -15161, -62836, -265770, -233749, -242763, -218200, -454007, 32195, 58881, 41016, -302253, -73275, 114204, -20936, 322708, 283384, 139478, -337030, 30909, -94382, 128302, -186313, -170688, -188081, -66670, -376863, 264201, 268420, -203816, 208570, -132295, 44115, -50305, 144360, -11229, -287436, -34383, -142264, -67928, -56042, -79462]
10187g9462n5107l1592O1591j55264L7106j86434a89243B0354O8658d70305J58502
10176c11803A88922b40486d2572C6053c49012A52669a47019D6967a01355n19881
10166f21236A91429r2522c0114k80798D2585a69590F258i357j47996l0241c2143
10154h8387E1647b01282b5403A89636b04838A5324a304p1239C1230j4071c31909
10142c0423m2100j67064H5600a71971A23366b22412D3415J54357F1964f8771B03858
10130h3625o430l02930a01191k93117h8964o0751f1684l916b9456A6616a2472
10118e6747l5606j18663D5585a64847A31233a62135P2188j79780K3327d5574A28576
10106b07605h0024j92468B39402H7398L7190a34632D778a58918B23638b8666m3154
$$ y = [-79462, -134569, -166161, -104570, -259834, -222728, -409162, -189243, 20354, 89012, -470305, -311803, 188922, -240486, -42572, 36053, -349012, 152669, -147019, 46967, -101355, -621236, 191429, 98907, -30114, -310912, 42585, -169590, 6258, -9357, -157353, -187594, -32143, -88387, 51647, -201282, -25403, 189636, -204838, 15324, -1304, -72543, 31230, 17159, -331909, -30423, -72523, -239587, 85600, -171971, 123366, -222412, 43415, 197772, 61964, -68771, 203858, -83625, -90055, -392985, -101191, -394308, -88964, -149715, -61684, -65600, -29456, 16616, -12472, -56747, -92353, -211016, 45585, -164847, 131233, -162135, -89947, -269727, -246400, -45574, 128576, -207605, -80024, -272492, 239402, 87398, 124588, -134632, 4778, -158918, 223638, -28666, -71820]
10095g1820n9754A9724J05512J7880a44042A27220j9378a8629B4204c38774a38536
10083i553A80925e9446j25119e1463C89512i389A99662a20399p0757A34242n1014
10072H3228h6370m18372B9326K4745a79138j5495H7498l7020J01987a38457G2662
10060B68365f8463k80211a61556B02884H5399c57622a64314c0804H2534g1213
10049a83955H057c60752a57820A90a35428B73720d46013d6710k7627k34613C20074
10037b25252g2851b7858n6612Q32n0962A2732f7012G3508A2375a17139A13972
10025d1489q791B20983E0920b514j65982h0685F921b29918R0862j32871E7665
10013A69670o6861a9660B8417J05059d27301a1633B27653a54971E6445b35549
$$ y = [-71820, -131574, 19724, 125236, 143116, -144042, 127220, 107842, -18629, 24204, -338774, -138536, -9553, 180925, -59446, -184565, -51463, 389512, -9389, 199662, -120399, -191156, 134242, 83228, -86370, -504742, 29326, 54071, -179138, -194633, 87498, 50478, 152465, -138457, 72662, 268365, -68463, -348674, -161556, 202884, 85399, -357622, -164314, -30804, 82534, -71213, -183955, 8057, -360752, -157820, 190, -135428, 273720, -446013, -46710, -74337, -308950, 320074, -225252, -72851, -27858, -84470, -83638, -134600, 12732, -67012, 73508, 12375, -117139, 113972, -41489, -50280, 220983, 50920, -2514, -168496, -80685, 6921, -229918, -139056, -271927, 57665, 169670, 102809, -19660, 28417, 133476, -427301, -11633, 227653, -154971, 56445, -235549]
10002b98996J24178A01242d60240e7751k7887G0544l114Q751b81229A25312b42081
9990a73645N4686E5508C823J1153d8564k90137a42667G7928b78689A30773J41546
9979B72319f5813A06531b43334b4867B6351a71003I9637a42022K7950k932j21498
9968b38502b258B14721q844d43037F8595B3107a27345G5114K876a30039e0601
9956I2903C6999m646g1918a8921j13749O2443j6855j48076d5623p4510q4163k04891
9944d09187h7955A84599a74214d6917A60673a6877l89958B45312B9674b11064
9933A48310e6237l5879j69795B13624C5702b03069a0488A5854c4520j34538o4788
9922b33846j15234O9232L082A36710E9624A4418K27561c13804k1258E973b4721
$$ y = [-298996, -174818, 101242, -460240, -57751, -85638, 70544, 67430, 76181, -281229, 125312, -242081, -173645, -118959, 55508, 3823, 14976, -48564, -338701, -142667, 77928, -278689, 130773, 272319, -65813, 106531, -243334, -24867, 26351, -171003, 99637, -142022, -114072, -117004, -238502, -2258, 214721, 205877, -443037, 68595, 23107, -127345, 75114, 77990, -130039, -50601, 92903, 36999, 32353, -71918, -18921, -132670, -70227, -87082, -235158, -45623, -120133, -204296, -409187, -87955, 184599, -174214, -46917, 160673, -16877, -406835, 245312, 29674, -211064, 148310, -56237, -92116, -261911, 213624, 35702, -203069, -10488, 15854, -34520, -169058, -233846, -349080, -279848, -276766, 136710, 59624, 14418, 241979, -313804, -335062, 5973, -24721]
9910a54444e442r0186A87739b6460M019l11471a55688j56778E1070m354e61327
9898A908c0547D0770J48719b0804j18608b4077j99937Q7496A7280f5378m4481
9887a09859J4293B34710b5582l52829B07003I3824D0175h1348j91496P7572c8881
9875i2176H9841L2064a94867h0095L4376k28812O4536F1307a62465G8294b56373
9863h0053K8716K5230H3672i7707j58a7671k52371i4429k7964a8379k7563k04962
9851b50904R7154A34258c51629A07645a73689M4568A49510p1371J51393a2822
9840A36785a30397j559A84086g6373I3078d63140A65830A4858c61849L2728a37269
9828a2858j2277p5734B37564M5992c85749B54523h2952A89180A9790a87160C34183
$$ y = [-154444, -5442, -95628, 187739, -26460, -22441, -333912, -155688, -312466, 51070, 46716, -561327, 1908, -30547, 40770, 189489, -20804, -139412, -24077, -224014, -136518, 17280, -65378, -109859, -95566, 234710, -25582, -378411, 207003, 93824, 40175, -81348, -272844, -195272, -38881, -92176, 89841, 121905, -194867, -80095, -45719, -274531, -209995, 61307, -162465, 78294, -256373, -80053, -51337, -26107, 83672, -97707, -97865, -17671, -270042, -94429, -122393, -18379, -45942, -250904, -153750, 134258, -351629, 107645, -173689, -129121, 149510, 78139, 229532, -12822, 136785, -130397, -131956, 184086, -76373, 93078, -463140, 165830, 14858, -361849, -329121, -137269, -12858, -25135, -100869, 237564, 283556, -385749, 254523, -82952, 189180, 19790, -187160, 334183]
9816C5280c35477J50822E1675J23191a61354j18746i4977k2309E5104b1380A346
9804c9678A20407b46940F5132g5584C105g110l86646c0518k54704A524d8134j9361
9792f7495j21103N3090r9622A89265b55089A33705G128d9242A01279b98810R6007
9781b02803c0073D9235d7496B0464b49637K8632k8559l0030A1092a37781j31161
9770b68942B41100d16657J88517A74894E3230g7764I534a38966q9747A13615a31702
9758d98819C9302c94228d1157j15639N439O4758E6736c29755J15827B52958a11210
9746C51586f7096j50454A30387L7790a62951D5807J03583g2338A53517a34533
9735i5760L9858D8507J02638c8287n7473A39491J43212a94613E8278c3994B62474
$$ y = [35280, -335477, -184655, 51675, 174866, -161354, -280100, -94977, -117286, 55104, -21380, 1346, -39678, 120407, -246940, 65132, -75584, 3105, -7110, -393756, -30518, -285222, 1524, -48134, -67495, -188598, -135508, -235130, 189265, -255089, 133705, 7128, -49242, 101279, -298810, -202803, -30073, 49235, -47496, 20464, -249637, -221005, -249564, -279594, 11092, -137781, -268942, 241100, -416657, -228140, 174894, 53230, -77764, 9534, -138966, -228713, 113615, -131702, -498819, 39302, -394228, -41157, -156796, -151357, -86599, 56736, -329755, -213928, 252958, -111210, 351586, -67096, -217550, 130387, 168177, -162951, 45807, 149390, -72338, 153517, -134533, -95760, -55902, 48507, 151145, -38287, -95760, 139491, 282703, -194613, 58278, -33994, 262474]
9723i5368J0648q6983B10941g3478j83544a26692N8331J5067k6063j09844h0732
9711I3555d9988J5890q562C1448c5863j83404M8526g2489C3705K45946H7713K2949
9699A10662B6710a20275c874m29062B681K15507c1474A06936B999R1336O338c01693
9686B55098d2346A12247b01642N4837j98222c363k94214M7489h4245A12262E6057
9674c96631J84425k5024a00388k57420a41861m6007f5303B5043a37068r8105E4031
9662A43691a29946A86932b3050c921h56k79204e4231P23n2312B37666c94183i3333
9649A50892a27680c5014A71816a82616o0941E2124c14738g2306a6604D9815g7207
9637e5366G2665a99446A41454b61414a03850H356b99071K8520g5494l3436A848
$$ y = [-95368, -84720, -171703, 210941, -73478, -257022, -126692, -68361, -53294, -79357, -189201, -80732, 93555, -49988, -34098, -42660, 31448, -35863, -219267, -170741, -72489, 33705, 279651, 87713, 110662, 26710, -120275, -3874, -432936, 2681, 218188, -31474, 106936, 2999, 94335, 100673, -301693, 255098, -42346, 112247, -201642, -146805, -345027, -3363, -297577, -250088, -84245, 112262, 56057, -396631, -212206, -237230, -100388, -357808, -141861, -187868, -65303, 25043, -137068, -235173, 54031, 143691, -129946, 186932, -23050, -3921, -856, -280060, -54231, -53508, -105820, 237666, -394183, -93333, 150892, -127680, -35014, 171816, -182616, -243557, 52124, -314738, -72306, -16604, 49815, -77207, -55366, 72665, -199446, 141454, -261414, -103850, 8356, -299071, -270551, -75494, -108930, 1848]
9625D19948c55258D6894a02291N123D41916b46242B02185B4289J8124f7610a0057
9613G9642a77479A6037e2000k03958P7345A89262a38168j87978R5591I849e5643
9601g101q7141j62159R6086j00265a12082A62162j8310F5101d48133A33749c04300
9589a7993d144H7547g0688j13560A672J8704b20946G176P2911B682d2194a469
9576a61377M9950C5184j5418J56199d419j48902N8767A18752D6010J69579b6650
9564a27495k24494l2628c7793A33511i2047D5742a56042A38112f4483B08957b94463
9552D2243M19620a99316H3261J5572M681a71578A9102J3514R2420d3247I111R4881
9540A03992b68433E3238a45624L80A34494J69295c47325A30652c45795B922a09313
$$ y = [419948, -355258, 46894, -102291, -97168, 441916, -246242, 202185, 24289, 42413, -67610, -10057, 79642, -177479, 16037, -52000, -255958, -178613, 189262, -138168, -326146, -230555, 9849, -55643, -7101, -94242, -256401, -160315, -260580, -112082, 162162, 143852, 65101, -448133, 133749, -304300, -17993, -4144, 87547, -70688, -184248, 1672, 20376, -220946, 7176, 80087, 2682, -42194, -1469, -161377, -111427, 35184, 19766, 175965, -4419, -153321, -94554, 118752, 46010, 215589, -26650, -127495, -351989, -384617, -37793, 133511, -92047, 45742, -156042, 138112, -64483, 208957, -294463, 42243, 461863, -199316, 83261, 98833, 103514, -171578, 19102, 32616, 125036, -43247, 9111, 103992, -268433, 53238, -145624, -145244, 134494, 303789, -347325, 130652, -345795, 2922, -109313]
9528A83046B9502c6201j0153C36534A37669b58914R0946N8646q5650B6058g5412
9516a45741j32539j44557E3232k6106g9573A98840B0557d05569a6755p9495B07655
9504d80947a7686n0862k0439I81N9018J48708b81457A32975P8555c6329p8384
9493a14713j27659E7690a09614j19775c25A09330c78116e7565j78791b64k83176
9482b83440a39153r0658D4502O6632a01629j66460a8890A12807d1774j57573j0101
9471b09448k7690e0225j10778j91655c0040j67693i3229B3224a59862A61415i3887
9459F9121a7104k64080B23157C9190a99162A01603h7910j30303Q4277a3804A24673
9447c06210C057c17847a24689r0081d1197K282B47810a61674j55365a36783k55733
$$ y = [183046, 29502, -36201, -46354, 336534, 137669, -258914, -167968, -109322, -194972, 26058, -75412, -145741, -278280, -422837, 53232, 27126, -79573, 198840, 20557, -405569, -16755, -96250, 207655, -480947, -17686, -68548, -88987, 981, 59999, 208707, -281457, 132975, 211530, -36329, -114713, -242372, 57690, -109614, -229389, -325, 109330, -378116, -57565, -236356, -264, -283440, -139153, -229811, 44502, 111134, -101629, -268089, -18890, 112807, -41774, -199347, -209448, -237138, -50225, -161003, -352658, -30040, -197733, -93229, 23224, -159862, 161415, -93887, 69121, -17104, -281184, 223157, 39190, -199162, 101603, -87910, -218213, -133936, -13804, 124673, -306210, 3057, -317847, -124689, -214770, -41197, -38915, 247810, -161674, -317039, -136783, -392516]
9436c92516A37256a58611e776H5783B750J0418a68688B6298c10317A13390a71439
9424B43766c54369E9077b30342K9980d8169n3216A04902j1273a20819c7157A85334
9412D9035b6577n6853B99041g0185c0022G0062c12956b4771k1272j68935a05259
9400A48202a33237G0438b01601D9109e32597h7710A28332a18045k8512j24341
9390b70898H8437a78024l1716i654n474a617j6870k26689h9434n07590B08222
9378a70272H5365c1567q8874B90918p3632p2035k448f7879E6917M6848a97602
9366F5116a13851M7890A40499b06168a2071p1036g438m29723a45043q4554e7383
9354B49976c19356E8982B1680b81900N4772B1776K55267A18113g444A4533a18054
$$ y = [-392516, 137256, -158611, -5776, 85783, 2750, 13168, -168688, 26298, -310317, 113390, -171439, 243766, -354369, 59077, -230342, -200362, -48169, -101385, 104902, 93629, -120819, -37157, 185334, 49035, -26577, -83430, 299041, -70185, -30022, 70062, -312956, -24771, -46043, -214978, -105259, 148202, -133237, 70438, -201601, 49109, -532597, -87710, 128332, -118045, -146557, -270898, 88437, -178024, -209740, -9654, -15128, -1617, -18487, -245176, -89434, -597024, 208222, -170272, 85365, -31567, -120441, 290918, 217286, 145251, 142803, -67879, 56917, 103765, -197602, 65116, -113851, -65961, 140499, -206168, -12071, -83107, -7438, -437161, -145043, -229597, -57383, 249976, -319356, 58982, 21680, -281900, -227128, 21776, 277043, 118113, -7444, 14533, -118054]
9342E7036h2590A5453K21128H1465c4734k0366A73441a50777p7987P3648A21469
9330I8369b40190B19646e7064m0596k08593P6790o1433B8582D32i5492F4161a86804
9317a41998A89640J14334e6381R875C34366c5031l10819a47378k48195b2698j19244
9306a41942b2457A1712O2645c01728D4383K08479e7598q6033j27376F0811J26045
9295A86856a41123a8990j73004n1837K2178a06109A69628D0558J2188a0927B71863
9283B48261a74701k19625l7942H7340d24161D3172K01558a20255A26994a72801
9272e25572G9512b87463e6752j9729I8938a67836A3332J19855i4416b7331k1937
9261d9268Q852H5508J8328i4524k53692c5590j49699A00450D7050N7932a17234
$$ y = [57036, -82590, 15453, 236581, 81465, -34734, -55100, 173441, -150777, -228764, -155116, 121469, 98369, -240190, 219646, -57064, -97660, -306253, -229463, -290896, 28582, 432, -95492, 64161, -186804, -141998, 189640, 303974, -56381, -46506, 334366, -35031, -345850, -147378, -395573, -22698, -141942, -22457, 11712, 74357, -301728, 44383, 252862, -57598, -143631, -271007, 60811, 186856, -141123, -18990, -191994, -243831, -221653, -106109, 169628, 40558, 52746, -10927, 271863, 248261, -174701, -394326, -432268, 87340, -424161, 43172, 244730, -120255, 126994, -172801, -525572, 79512, -287463, -56752, -76481, 98938, -167836, 13332, 133187, -94416, -27331, -49268, -40416, 85508, 103836, -94524, -348216, -35590, -185289, 100450, 47050, 104982, -117234]
9249b40277J08743A61024F3186b71954O355K0759n1172H2412b89051A19227B4386
9237a46359B54754b08243H9018b95849a22641d8109o665C8579a82933j22542A52560
9225b28665A20058F652L64988A40340c14574f8157m7470j9668d8094A4298J18890
9214A33188j5281b09616I279J5768K31558a63004j54696P5901E0191a86146A21691
9202b60115L5570B21697a99982B60220J40608A69210g3734N390A23542C0676b11019
9190a27288N751M4446n2518L1885d3206F7333g1841K3899P913B05424a79546G9082
9177b14699A866J87024F7281N9374i2931q8691K0645A49278a87514H135d561j77672
9165a82233A65597a9952e103j85797A83411c32310B9330i2109j28249d7621a8259
$$ y = [-240277, -131534, 161024, 63186, -271954, -265599, -244840, -296012, 82412, -289051, 119227, 24386, -146359, 254754, -208243, 89018, -295849, -122641, -48109, -54774, 38579, -182933, -305475, 152560, -228665, 120058, 6652, 371640, 140340, -314574, -68157, -115627, -135295, -48094, 14298, 133188, 117907, -209616, 9279, 25047, 256605, -163004, -317700, -241799, 50191, -186146, 121691, -260115, -224545, 221697, -199982, 260220, 400828, 169210, -73734, -68344, 123542, 30676, -211019, -127288, -121537, -77091, -129609, -97724, -43206, 67333, -71841, -47942, -40029, 205424, -179546, 79082, -214699, 1866, 188890, 67281, 126655, -92931, -181622, -160977, 149278, -187514, 8135, -4561, -182233, 165597, -19952, -5103, -190900, 183411, -332310, 29330, -92109, -220358, -47621, -18259]
9153B05934d1194j78619e6872j38996E7502a26628c1719j12167n4775P6237G4100
9141d10321h3777B86868a23080A99689c45174a33079O0022M939p2752A40714a56003
9129b71441K9443g0862K4661C36229E9674a41776B81202b47426e4535A02996b57324
9117f2731j35487E7209i3779J4020L3698C29700K7263a3885l19995a22203j26829
9106b49032F2872b8216H0196h9095D2378a29933j90299H2770P1214o5612e0057
9094A8577c56982C6989a2724j78533j81769a19930A21190D312M28923b35593A9402
9082A72312d4530g989m9403H6457C9877a64743h1752F1949j4091b54405a26025
9070a89883A19230d55278I676B53h6779j4663j14318G6570K14042j36386a3226
$$ y = [205934, -41194, -219813, -56872, -195868, 57502, -126628, -31719, -143886, -198661, -122424, 74100, -410321, -83777, 286868, -123080, 199689, -345174, -133079, -73057, -68118, -140870, 140714, -156003, -271441, -241998, -70862, -46201, 336229, 59674, -141776, 281202, -247426, -54535, 102996, -257324, -62731, -198218, 57209, -93779, -79759, -46061, 329700, 356963, -13885, -333880, -122203, -249032, 62872, -28216, 80196, -89095, 42378, -129933, -320232, 82770, 153984, 88372, -50057, 18577, -356982, 36989, -12724, -191257, -373026, -119930, 121190, 4312, 433235, -235593, 19402, 172312, -44530, -7989, -57392, 86457, 39877, -164743, -81752, 61949, 47858, -254405, -126025, -189883, 119230, -455278, 9676, 253, -86779, -101442, -215760, 76570, 290612, 154226, -13226]
9058B230a56016n3377B59131a25561K4599k78026E687a33681c0699j20341l4845
9047a85885N4961B48944j06125c52881J09016A34790e7277A12430a05344K0495
9037h4849K3450l14791b3446k57915C9677h9972k23916f6030p4013o2320b638
9025B3085g1258q0900K4016j29468i0728M3792A84784e2745j42241A14746e1387
9013B5628E998h5249o0329R447L1241k9231G7069a28843O1834a9707m1583B60718
9000F0213a7101j63587B12044c03324h3600A20653a89431c4727j62772C2195c9185
8988b10341C66293I5098P0399I765e0342E4958L170a88712A61061m5639a28300
8976C5322a54131j94773R4767A48830M8309b56978A88303G924a3254j09415m13459
$$ y = [2230, -156016, -209393, 259131, -125561, -100962, -378988, 5687, -133681, -30699, -151040, -185885, -130924, 248944, 142819, -352881, -243865, 134790, -57277, 112430, -105344, -84849, -61399, -376190, -23446, -281361, 39677, -89972, -313888, -66030, -140043, -202363, -2638, 23085, -71258, -152158, -128142, -257610, -90728, -46936, 184784, -52745, -194986, 114746, -51387, 25628, 5998, -85249, -145578, -136131, -104890, -134121, 77069, -128843, -67009, -19707, -61290, 260718, 60213, -17101, -180688, 212044, -303324, -83600, 120653, -189431, -34727, -197499, 32195, -39185, -210341, 366293, 95098, 165497, 9765, -50342, 54958, 58128, -188712, 161061, 115422, -128300, 35322, -154131, -348904, -254137, 148830, 197139, -256978, 188303, 7924, -13254, -122669, -536128]
8965e36128J94751E6417f3010k88108g2082D7380g7572k3668B37082d11662B23678
8953e4640q9892d6158I0363K15390h4480n5377L3566A15494j8978k5820M1583
8942A12279b41312j30708J40002c5406l06142a59112H4347h0445m5155B55704
8931E5717Q0181a89038j14539G03h7367A98051a95388J634L6552H65949J762358
8920B628307D28773F1926i5907d0566C8854J65856d70968a41728k8056A47095
8909A58482p6499g5575j36243H0766c8281Q354j51740A08982f0522p8028B93292
8897b3559o2312H0932e7738j55700M93A08623L1410K5089G8132a7075k99704a19362
8884a77102B35736a38790f7817j2197G34a76264L1257I4193b40687I8320D804
$$ y = [-536128, -341377, 56417, -63010, -351118, -72082, 47380, -77572, -101240, 237082, -411662, 223678, -54640, -144532, -46158, 90363, 305753, -84480, -139857, -106291, 115494, 96516, 70696, 112279, -241312, -372020, -232018, -35406, -341548, -159112, 84347, -80445, -125600, 255704, 55717, 135898, -189038, -303577, 703, -87367, 198051, -195388, -193754, -157202, 865949, 2628307, 428773, 61926, -95907, -40566, 38854, 204710, -470968, -141728, -169784, 147095, 158482, 81983, -75575, -211818, 80766, -38281, -29927, -181667, 108982, -60522, -138550, 293292, -23559, -85871, 80932, -57738, -213438, -212945, 108623, 140033, 165122, 78132, -17075, -316779, -119362, -177102, 235736, -138790, -67817, -80014, 734, -176264, -145007, 94193, -240687, 98320, 4804]
8872E4333a29035L0384A93909k0582a6391P210o2287j59628q0533E0605d51382
8860D5901r227M0789g3477B48827B3669f6112J1417I6293h1275A64030a18763
8848i6163M6192A40139a75265I8925J19694n7858p090b86056J05970l0343B0384
8836a08006k24374A79961L28212A34501a65932g8513p3443H0162g5940J8304A4022
8824g4193A96909a60897q6208I4558L83213C4916a94623A33215i1042l43098h0432
$$ y = [54333, -129035, -98651, 193909, 173327, -16391, -9181, -71468, -231096, -311629, 50605, -451382, 45901, 36674, 77463, -73477, 248827, 23669, -66112, -54695, 96293, -81275, 164030, -118763, -96163, -49971, 140139, -175265, 98925, 218619, 160761, 153671, -286056, -180086, -210429, 20384, -108006, -332380, 179961, 508173, 134501, -165932, -78513, -151956, 80162, -75940, -57636, 14022, -74193, 196909, -160897, -247105, 94558, 477771, 34916, -194623, 133215, -91042, -434140, -80432]
$$ [...]
##END NTUPLES=NMR SPECTRUM
##END=
