##TITLE=AC1456_PAST113262_7818896_D1qtiZiE4I
##JCAMPDX= 6.0         $$ Bruker NMR JCAMP-DX V2.0
##DATA TYPE= NMR SPECTRUM
##DATA CLASS= NTUPLES
##ORIGIN= BRUKER
##OWNER= Administrator
$$ 1.72 TOPSPIN		Version 2.1
$$ 2013-04-30 19:59:07.017 -0700  Administrator@X
$$ Compression mode = diff/dup
##.OBSERVE FREQUENCY= 400.02188249412
##.OBSERVE NUCLEUS= ^1H
##.ACQUISITION MODE= SIMULTANEOUS (DQD)
##.ACQUISITION SCHEME= undefined
##.AVERAGES= 64
##.DIGITISER RES= 22
##SPECTROMETER/DATA SYSTEM= spect
##.PULSE SEQUENCE= noesygpps1d.comp
##.SOLVENT NAME= COFFEE_meoh
##.SHIFT REFERENCE= INTERNAL, COFFEE_meoh, 1, 14.9611
##AUDIT TRAIL= $$ (NUMBER, WHEN, WHO, WHERE, PROCESS, VERSION, WHAT)
$$ ##TITLE= Audit trail, TOPSPIN		Version 2.1
$$ ##JCAMPDX= 5.01
$$ ##ORIGIN= Bruker BioSpin GmbH
$$ ##OWNER= Administrator
$$ $$ E:\/data/COFFEE/nmr/AC1456_PAST113262_7818896_D1qtiZiE4I/12/pdata/1/auditp.txt
$$ ##AUDIT TRAIL=  $$ (NUMBER, WHEN, WHO, WHERE, PROCESS, VERSION, WHAT)
(   1,<2013-04-30 19:59:02.017 -0700>,<Administrator>,<X>,<go>,<TOPSPIN 2.1>,
      <created by zg
	started at 2013-04-30 19:47:32.343 -0700,
	POWCHK enabled, PULCHK disabled,
       configuration hash MD5:
       F7 49 AB AC A2 8D 51 76 73 8D C1 9A A6 38 9F DE
       data hash MD5: 64K
       9F 63 2B 21 2A C2 AD 99 25 DA 92 A8 D5 7F A5 1B>)
(   2,<2013-04-30 19:59:05.032 -0700>,<Administrator>,<X>,<proc1d>,<TOPSPIN 2.1>,
      <Start of raw data processing
       efp LB = 0.3 FT_mod = 6 PKNL = 1 PHC0 = 0 PHC1 = 0 SI = 128K 
       data hash MD5: 128K
       54 61 3D 06 CC C7 68 40 E0 4C E7 1A C0 54 71 2B>)
(   3,<2013-04-30 19:59:06.048 -0700>,<Administrator>,<X>,<proc1d>,<TOPSPIN 2.1>,
      <pk PHC0 = -82.27661 PHC1 = 0 
       data hash MD5: 128K
       05 E4 C8 A9 98 29 60 53 75 02 46 31 82 49 5D A7>)
(   4,<2013-04-30 19:59:06.486 -0700>,<Administrator>,<X>,<proc1d>,<TOPSPIN 2.1>,
      <abs ABSG = 1 
       data hash MD5: 128K
       1E F1 D4 65 83 DE D0 62 A8 DC DF 8B 3A D6 CD 41>)
(   5,<2013-04-30 19:59:06.579 -0700>,<Administrator>,<X>,<proc1d>,<TOPSPIN 2.1>,
      <abs ABSG = 2 
       data hash MD5: 128K
       BF 19 A4 97 57 2A EC 1C 52 EC 52 6B 4D 4D 98 1B>)
(   6,<2013-04-30 19:59:06.657 -0700>,<Administrator>,<X>,<proc1d>,<TOPSPIN 2.1>,
      <abs ABSG = 3 
       data hash MD5: 128K
       D8 29 70 1B BF 44 28 64 12 D2 B0 9A 13 56 B5 81>)
(   7,<2013-04-30 19:59:06.751 -0700>,<Administrator>,<X>,<proc1d>,<TOPSPIN 2.1>,
      <abs ABSG = 4 
       data hash MD5: 128K
       33 86 21 E7 F9 3F 2B 27 C9 00 B6 44 E5 5A D8 DC>)
(   8,<2013-04-30 19:59:06.845 -0700>,<Administrator>,<X>,<proc1d>,<TOPSPIN 2.1>,
      <abs ABSG = 5 
       data hash MD5: 128K
       59 FE 12 50 FF 93 A9 CB A8 30 F9 0C 35 D2 17 D1>)
$$ ##END=
$$ 
$$ $$ hash MD5
$$ $$ 73 01 E1 C1 80 B3 6B DA 25 5E CE 90 2A AF 71 B0
##$RELAX= 
##$RELAX= 
##$RELAX= 
##$RELAX= 
##$RELAX= 
##$RELAX= 
##$RELAX= 
##$RELAX= 
$$ Bruker specific parameters
$$ --------------------------
##$DU= <E:\>
##$EXPNO= 12
$$ [...]
150 150 150 150 150 150 150 150
##$TP07= 0
##$TPNAME0= <>
##$TPNAME1= <>
##$TPNAME2= <>
##$TPNAME3= <>
##$TPNAME4= <>
##$TPNAME5= <>
##$TPNAME6= <>
##$TPNAME7= <>
##$TPOAL= (0..7)
0.5 0.5 0.5 0.5 0.5 0.5 0.5 0.5
##$TPOFFS= (0..7)
0 0 0 0 0 0 0 0
##$TUNHIN= 0
##$TUNHOUT= 0
##$TUNXOUT= 0
##$USERA1= <user>
##$USERA2= <user>
##$USERA3= <user>
##$USERA4= <user>
##$USERA5= <user>
##$V9= 5
##$VALIST= <valist>
##$VCLIST= <CCCCCCCCCCCCCCC>
##$VD= 0
##$VDLIST= <DDDDDDDDDDDDDDD>
##$VPLIST= <PPPPPPPPPPPPPPP>
##$VTLIST= <TTTTTTTTTTTTTTT>
##$WBST= 1024
##$WBSW= 4
##$XGAIN= (0..3)
0 0 0 0
##$XL= 0
##$YL= 0
##$YMAX_a= 6153790
##$YMIN_a= -12122693
##$ZGOPTNS= <>
##$ZL1= 120
##$ZL2= 120
##$ZL3= 120
##$ZL4= 120
##$ABSF1= 14.9611
##$ABSF2= -5.597082
##$ABSG= 5
##$ABSL= 3
##$ALPHA= 0
##$AQORDER= 0
##$ASSFAC= 0
##$ASSFACI= 0
##$ASSFACX= 0
##$ASSWID= 0
##$AUNMP= <proc_prof1d_extract.lims>
##$AXLEFT= 0
##$AXNAME= <>
##$AXNUC= <1H>
##$AXRIGHT= 0
##$AXTYPE= 0
##$AXUNIT= <>
##$AZFE= 0.1
##$AZFW= 0.1
##$BCFW= 0
##$BC_mod= 0
##$BYTORDP= 0
##$COROFFS= 0
##$CY= 15
##$DATMOD= 1
##$DC= 0
##$DFILT= <>
##$DTYPP= 0
##$F1P= 0
##$F2P= 0
##$FCOR= 0.5
##$FTSIZE= 131072
##$FT_mod= 6
##$GAMMA= 0
##$GB= 0
##$INTBC= 1
##$INTSCL= 1
##$ISEN= 128
##$LB= 0.3
##$LEV0= 0
##$LPBIN= 0
##$MAXI= 10000
##$MC2= 0
##$MEAN= 0
##$ME_mod= 0
##$MI= 0
##$NCOEF= 0
##$NC_proc= -2
##$NLEV= 6
##$NOISF1= 0
##$NOISF2= 0
##$NSP= 0
##$NTH_PI= 0
##$NZP= 0
##$OFFSET= 14.9611
##$PC= 1
##$PHC0= -82.27661
##$PHC1= 0
##$PH_mod= 1
##$PKNL= yes
##$PPARMOD= 0
##$PPDIAG= 0
##$PPIPTYP= 0
##$PPMPNUM= 2147483647
##$PPRESOL= 1
##$PSCAL= 4
##$PSIGN= 0
##$PYNMP= <proc.py>
##$REVERSE= no
##$SF= 400.02000959507
##$SI= 131072
##$SIGF1= 0
##$SIGF2= 0
##$SINO= 400
##$SIOLD= 131072
##$SPECTYP= <>
##$SREGLST= <1H.CDCl3>
##$SSB= 0
##$STSI= 131072
##$STSR= 0
##$SW_p= 8223.68421052631
##$SYMM= 0
##$S_DEV= 0
##$TDeff= 65536
##$TDoff= 0
##$TI= <>
##$TILT= no
##$TM1= 0
##$TM2= 0
##$TOPLEV= 0
##$USERP1= <user>
##$USERP2= <user>
##$USERP3= <user>
##$USERP4= <user>
##$USERP5= <user>
##$WDW= 1
##$XDIM= 131072
##$YMAX_p= 403207096
##$YMIN_p= -10925
##$CURPLOT= <Network HP LaserJet P1505>
##$CURPRIN= <$Network HP LaserJet P1505>
##$DFORMAT= <normdp>
##$LAYOUT= <+/1D_H.xwp>
##$LFORMAT= <normlp>
##$PFORMAT= <normpl>
##$SURQMSG= 1
$$ End of Bruker specific parameters
$$ ---------------------------------
##NTUPLES= NMR SPECTRUM
##VAR_NAME=  FREQUENCY,     SPECTRUM/REAL,   SPECTRUM/IMAG
##SYMBOL=    X,             R,               I
##VAR_TYPE=  INDEPENDENT,   DEPENDENT,       DEPENDENT
##VAR_FORM=  AFFN,          ASDF,            ASDF
##VAR_DIM=   131072,        131072,          131072
##UNITS=     HZ,            ARBITRARY UNITS, ARBITRARY UNITS
##FACTOR=    0.0627417313425164, 1,          1
##FIRST=     8223.62146879497, 240,          -55571
##LAST=      0,             2149,            -55987
##MIN=       0,             -10925,          0
##MAX=       8223.62146879497, 403207096,    0
$$ Real data points
##PAGE= N=1
##DATA TABLE= (X++(R..R)), XYDATA
$$ [...]
67947 70133 69000 68189 67719 67837 68485 69162 69431 69319 69102 68910 68621 68097 67459 67098 67265 67668 67761 67544 67763
67928 67763 69055 71175 73350 75135 76551 77645 78437 79230 80411 81809 82756 83006 83248 84340 86171 87580
67912 87580 87447 85733 83443 81607 80332 78889 76679 74001 71766 70613 70439 70671 70788 70584 70141 69698
67896 69698 69528 69819 70590 71610 72403 72544 72055 71425 71132 71244 71491 71605 71476 71153 70812 70576 70308 69766 69038
67877 69038 68536 68343 67921 66826 65496 64911 65559 67074 68760 70119 70912 71169 71186 71235 71263 71154 71219 71975 73408
67858 73408 74844 75657 75732 75197 74197 73105 72449 72293 72054 71296 70327 69585 68764 67143 64716 62401 61099
67841 61099 60960 61581 62419 62873 62500 61529 60818 60963 61676 62396 63197 64527 66204 67361 67634 67851 69122 71541
67823 71541 74183 76194 77499 78543 79749 81234 82710 83641 83789 83615 83807 84407 84756 84384 83500 82432
67807 82432 81094 79372 77637 76347 75342 74060 72371 70737 69528 68640 67869 67207 66558 65539 63917
67792 63917 62074 60708 60113 59986 59891 59650 59203 58361 57020 55568 54737 54853 55492 56110 56800 57970 59371
67775 59371 60047 59493 58382 57786 58048 58796 59679 60537 61077 61104 61095 61921 63762 65758 66948 67207 67032 66749 66307
67756 66307 65689 65208 65337 66320 67944 69671 71030 71873 72219 72012 71269 70348 69737 69525 69370 69002 68562 68368
67738 68368 68547 68894 68917 68114 66551 65060 64402 64218 63356 61333 58951 57185 56083 55164 54374 53973 53788
67721 53788 53317 52582 52302 53026 54474 55858 56597 56597 56096 55389 54650 53973 53559 53657 54152 54464 54211 53819 54074
67702 54074 55080 56124 56604 56663 56701 56724 56519 56188 56064 56174 56196 55954 55620 55331 54877 54011 52884 51944 51423
67683 51423 51116 50712 50206 49911 50147 50958 52049 52928 53197 52816 52069 51282 50656 50339 50454 50898 51340 51616 51939
67664 51939 52493 53032 53297 53665 54815 56679 58290 58937 59017 59400 60296 61189 61639 61688 61556 61327 60981 60468 59759
67645 59759 58993 58512 58550 58977 59523 60088 60591 60744 60380 59932 60123 61123 62326 63073 63290 63299 63303 63303 63373 63854 65168
67624 65168 67397 69959 71845 72391 71744 70453 68844 67089 65616 64898 64802 64696 64319 64118 64445 64843 64539
67607 64539 63437 62254 61692 61725 61750 61321 60684 60479 60894 61261 60729 59181 57226 55454 54180 53779 54514 55838
67589 55838 56576 56257 55709 55846 56401 56506 56176 56300 57210 58069 57887 56618 54951 53494 52534 52286 52921 54291
67571 54291 55830 56840 56951 56371 55655 55154 54754 54227 53676 53371 53318 53285 53194 53247 53625 54332 55295 56336 57079
67552 57079 57181 56764 56335 56178 56012 55352 54072 52602 51718 52020 53320 54555 54666 53654 52541 52236 52731
67535 52731 53404 53717 53458 52714 51858 51325 51157 51008 50723 50627 51016 51623 51850 51381 50336 49055 47947 47350
67517 47350 47271 47398 47490 47536 47422 46867 45996 45600 46327 47834 49166 49768 49686 49040 47973 47050 46962 47655 48259 48107
67497 48107 47416 46784 46469 46409 46572 46928 47335 47759 48404 49392 50478 51304 51747 51843 51586 51005 50256 49452 48550
67478 48550 47633 47088 47200 47715 48078 48047 47819 47632 47466 47145 46499 45454 44136 42895 42117 42007 42615 43877
67460 43877 45451 46698 47191 47234 47596 48678 50156 51470 52437 53312 54382 55616 56554 56597 55560 53935 52443
67443 52443 51314 50243 49080 48190 47943 48122 48173 48000 48178 49315 51311 53320 54436 54458 54022 53903 54186
67426 54186 54245 53563 52376 51366 50941 51029 51425 51977 52501 52856 53182 53719 54295 54349 53649 52709 52143 51866 51283
67407 51283 50158 48887 47939 47470 47541 48294 49629 50991 51750 51691 51031 50144 49488 49529 50369 51485 52126 51999
67389 51999 51394 50748 50333 50301 50689 51307 51837 52195 52588 53160 53748 54071 53980 53448 52512 51394 50498 50097 50140 50490
67369 50490 51199 52336 53552 54118 53492 51807 49739 47967 46794 46220 46206 46732 47631 48514 48996 48922 48349 47485
67351 47485 46776 46842 47969 49694 51166 51916 52075 51883 51425 50947 50940 51545 52155 52027 51198 50532 50830 52067 53497
67332 53497 54384 54658 54901 55588 56425 56693 56271 55875 56057 56439 56290 55479 54355 53041 51536 50372 50346 51462
67314 51462 52756 53415 53547 53622 53707 53640 53525 53578 53740 53838 53934 54120 54160 53748 53034 52535 52568 53111 54124 55623 57400
67293 57400 59077 60541 61972 63313 64020 63618 62333 60950 60080 59703 59400 58913 58423 58276 58413 58276 57494
67276 57494 56566 56468 57488 58838 59639 59930 60252 60576 60290 59324 58639 59253 61133 63347 65033 65887 66030 65909
67258 65909 66181 67098 67973 67763 66342 64761 64018 63978 63859 63344 62736 62244 61727 61166 60863 60982 61225 61196 60889
67239 60889 60679 60939 61786 63048 64350 65359 66007 66422 66579 66263 65439 64453 63630 62803 61545 59859 58404
67222 58404 57883 58301 58980 59302 59313 59556 60409 61667 62769 63315 63340 63181 63144 63234 63198 62924 62798 63439 64948 66569
67202 66569 67359 67165 66782 67130 68404 69947 70880 70914 70632 70900 71900 72952 73447 73633 74125 74911 75388 75266
67184 75266 74829 74295 73549 72718 72408 72912 73675 73965 73802 73732 73961 74164 74069 73777 73592 73837 74768 76312 77928
67165 77928 79016 79408 79235 78579 77624 76945 77046 77614 77807 77398 77091 77479 78191 78478 78262 78159 78638 79605 80777
67146 80777 82045 83335 84342 84642 84065 82949 81957 81596 81847 82282 82542 82608 82641 82711 82794 82966 83427 84306 85427
67127 85427 86339 86691 86601 86549 86795 87139 87385 87821 88869 90410 91885 93041 94087 95071 95662 95775 95882 96350
67109 96350 96927 97326 97904 99158 100796 102040 102762 103643 105079 106573 107542 108188 109163 110656 112219 113341
67093 113341 113881 113997 113920 113744 113359 112651 111898 111765 112711 114485 116364 117770 118559 118863 118976 119297 120143 121499
67075 121499 123048 124456 125586 126491 127275 127903 128143 127863 127452 127714 129137 131439 133974 136360 138463 140061
67059 140061 140946 141313 141639 142165 142822 143587 144543 145588 146503 147353 148431 149729 150948 152160 153920 156443
67043 156443 159126 161317 163182 165306 167689 169688 170856 171366 171660 172154 173264 175235 177762 180133 181931
67028 181931 183388 184959 186773 188603 190137 191240 192147 193498 195903 199339 203133 206622 209594 212030
67014 212030 213792 214891 215883 217586 220300 223502 226404 228777 231209 234528 238949 243764 247971 251227
67000 251227 254062 257176 260664 264066 267031 269801 273082 277480 282977 288835 294052 298043 301017 303781
66986 303781 307201 311717 317133 322834 328243 333114 337377 340950 344000 347321 351956 358219 365301 372095
66972 372095 378233 384106 390126 396357 402779 409498 416506 423477 430047 436252 442568 449471 457039 465002
66958 465002 473151 481558 490315 499229 508039 516965 526670 537426 548556 559110 568983 578947 589547
66945 589547 600437 611090 621764 633245 645778 658739 671486 684102 697088 710689 724876
66934 724876 739794 755752 772790 790554 808680 826988 845320 863626 882366 902412 924165
66923 924165 946989 969863 992452 1015175 1038394 1061986 1085775 1109953 1134910 1160906 1188010
66912 1188010 1216113 1244883 1273939 1303229 1333124 1364032 1396100 1429342 1463837 1499549 1536052
66901 1536052 1572629 1608787 1644672 1680963 1718259 1756476 1794905 1832892 1870355 1907572 1944729
66890 1944729 1981861 2019012 2056131 2092941 2129274 2165345 2201328 2236790 2271067 2304095 2336234
66879 2336234 2367244 2396141 2422320 2446147 2468118 2487968 2505121 2519562 2531761 2542072 2550566
66868 2550566 2557118 2561227 2562087 2559351 2553517 2545088 2533723 2518851 2500872 2480977 2459798 2436918 2411790
66855 2411790 2384535 2355646 2325383 2293715 2260554 2225882 2189900 2153045 2115573 2077201 2037584
66844 2037584 1997164 1957081 1918174 1880399 1843298 1806492 1769638 1732398 1694789 1657245 1620095
66833 1620095 1583297 1546846 1511052 1476162 1442061 1408663 1376210 1344798 1313940 1283049 1252230
66822 1252230 1222125 1193099 1165047 1138002 1112382 1088428 1065679 1043261 1020515 997283 973870
66811 973870 950912 929042 908360 888311 868364 848765 830263 813123 796786 780647 764748
66800 764748 749346 734188 718789 703326 688605 675025 662099 649187 636223 623450 610898
66789 610898 598467 586163 573909 561536 549386 538484 529488 521738 513951 505636 497197 488898 480550
66776 480550 472174 464072 456019 447222 437544 428098 420121 413682 407902 402019 395764 389186 382730 377251
66762 377251 373227 369948 365999 360636 354378 348276 343004 338696 335173 331961 328347 323840 318655 313536
66748 313536 309013 304939 300830 296494 292120 287836 283535 279179 274978 271078 267373 263863 260893 258664
66734 258664 256793 254767 252657 250889 249463 247915 245938 243486 240343 236309 231863 227954 224926 222243
66720 222243 219511 217059 215203 213549 211499 208883 205697 201819 197565 193971 191784 190484 188999 187127
66706 187127 185549 184612 183829 182640 181044 179427 178176 177489 177128 176358 174610 172239 170256 169242 168847 168347
66690 168347 167267 165415 162776 159647 156625 154278 152826 152119 151792 151527 151286 151155 150841 149685 147530 145266
66674 145266 144026 143982 144398 144661 144648 144154 142730 140313 137480 134803 132367 130107 128155 126590 125174 123694
66658 123694 122308 121349 120967 121088 121444 121494 120669 118960 117071 115778 115296 115355 115639 115933 116083 115960 115362 113943
66640 113943 111580 108849 106724 105588 104959 104359 103961 104009 104099 103652 102830 102328 102362 102448 102221 101874 101679 101564 101368
66621 101368 101072 100476 99103 96874 94660 93660 94160 95246 95796 95522 94950 94567 94250 93517 92188 90698
66605 90698 89774 89808 90568 91467 92039 92165 91953 91598 91302 91176 91082 90741 90089 89385 88817 88157 87137 86052 85608
66586 85608 86018 86600 86503 85610 84502 83744 83468 83448 83271 82560 81342 80137 79401 79019 78629 78283 78294 78512 78331
66567 78331 77583 76926 77019 77755 78596 79330 80042 80559 80486 79813 79063 78693 78598 78344 77680 76681 75549 74471 73638
66548 73638 73229 73277 73596 73912 74115 74324 74692 75186 75575 75569 74909 73493 71604 69950 69233 69608 70689 72026
66530 72026 73375 74510 75136 75175 74920 74725 74662 74615 74501 74181 73387 72056 70650 69753 69294 68536 66986 65053
66512 65053 63592 62985 62956 63160 63558 64077 64247 63588 62309 61280 61185 61911 62900 63864 64855 65788 66315 66269 65935
66493 65935 65729 65762 65884 65952 65851 65369 64325 62916 61796 61664 62656 64081 64878 64561 63736 63499 64204 65050
66475 65050 65059 64235 63454 63334 63649 63886 63928 63881 63516 62437 60811 59511 59255 59838 60491 60855 61234 61892 62512
66456 62512 62583 62078 61481 61235 61365 61572 61499 60973 60201 59696 59779 60204 60454 60355 60137 59966 59800 59748 60116 60870 61435
66435 61435 61365 61032 61265 62384 63891 65039 65440 65110 64268 63224 62292 61667 61428 61621 62227 63030 63686 63968
66417 63968 63881 63567 63230 63101 63264 63460 63286 62670 61995 61641 61562 61453 61170 60785 60318 59679 58905 58269 58092 58522
66397 58522 59449 60497 61163 61198 60903 60799 60965 60941 60413 59652 59019 58356 57341 56299 56076 56930 58030 58384
66379 58384 57941 57459 57488 57932 58473 58995 59449 59661 59524 59258 59252 59667 60313 60903 61331 61644 61883 62071 62292 62616
66359 62616 62869 62703 62025 61209 60594 59927 58677 56919 55492 55106 55669 56679 57915 59317 60462 60735 60134
66342 60134 59504 59711 60713 61659 61921 61836 62212 63147 63731 63203 62057 61388 61308 60845 59576 58429 58311 58705
66324 58705 58469 57540 56869 56920 57217 57382 57679 58291 58849 59019 58934 58757 58337 57618 56868 56187 55290 54131 53254
66305 53254 53069 53191 52965 52365 51944 52059 52613 53413 54434 55692 57055 58155 58467 57748 56471 55489 55089
66288 55089 54708 53789 52571 51740 51655 52291 53615 55515 57518 59031 59884 60385 60939 61765 62806 63645 63750
66271 63750 63094 62360 62208 62512 62703 62631 62626 62774 62642 61919 60993 60636 61189 62198 62917 63123 63294 63826 64315 64046
66251 64046 63064 62141 61562 60698 59152 57638 57043 57173 57209 57061 57349 58220 59088 59643 60298 61370 62458 62967
66233 62967 62750 62009 60998 60073 59626 59674 59842 59914 60090 60503 60867 60853 60538 60240 60128 60223 60521 60923 61254 61513
66213 61513 61885 62328 62436 61910 60981 60121 59516 59016 58503 58041 57748 57715 58016 58673 59597 60630 61619 62509 63427
66194 63427 64590 65945 66992 67163 66377 65071 63793 63004 63080 64054 65386 66489 67502 69028 70983 72322
66178 72322 72195 70884 69275 67922 67021 66809 67307 68007 68454 68957 70016 71189 71300 69905 67871 66252
66162 66252 65214 64463 64085 64353 64966 65154 64529 63429 62396 61739 61597 61981 62562 62792 62537 62365 62917 64095
66144 64095 65150 65468 65055 64317 63651 63262 63125 63041 62892 62889 63381 64415 65636 66591 66949 66499 65340 64124
66126 64124 63673 64131 64825 65152 65332 65943 67026 68017 68399 68116 67478 66918 66707 66676 66406 65879 65630 65988 66567
66107 66567 66919 67272 67995 68739 68898 68743 69196 70415 71470 71628 71172 70658 70168 69795 70158 71726 74000 75972
66089 75972 77160 77716 77726 77023 75607 73859 72273 71201 70793 70996 71672 72770 74177 75395 75814 75506 75290
66072 75290 75659 76073 75792 74994 74498 74574 74736 74673 74754 75428 76550 77516 77811 77343 76508 76031 76487 77793 79224
66053 79224 79982 79762 78924 78178 77995 78167 78183 78122 78815 80755 83137 84541 84424 83453 82384 81288 80036 78982
66035 78982 78656 79001 79340 79096 78353 77692 77584 77996 78571 79180 80138 81757 83808 85665 86942 87747 88285 88509
66017 88509 88284 87762 87381 87508 88100 88717 88943 88824 88838 89382 90418 91757 93425 95514 97825 99996 101982
66000 101982 104108 106604 109296 111841 114115 116348 118928 121996 125114 127530 129005 130170 131783 133839
65986 133839 135833 137665 139605 141387 142088 141218 139407 137621 136125 134600 132859 130949 128845 126586 124539
65971 124539 122979 121447 119130 115945 112769 110398 108700 107076 105392 104067 103420 103310 103417 103558 103619 103390
65955 103390 102611 101165 99238 97375 96319 96502 97582 98674 99239 99607 100455 101987 103902 105999 108287
65940 108287 110491 112065 113021 114263 116558 119465 121846 123313 124484 125795 126733 126699 126125 126241 127834 130654
65924 130654 133967 137268 140337 142928 144779 145984 147201 149253 152413 156083 159264 161359 162570 163696
65910 163696 165624 168802 172951 177287 181214 184741 188068 190899 192563 192817 192167 191267 190337 189328 188340
65895 188340 187614 187253 187126 186920 186191 184639 182501 180387 178485 176161 172683 168200 163622 159630 156165
65880 156165 152867 149647 146638 143810 140832 137364 133426 129457 125905 122778 119777 116953 114917 114161
65866 114161 114385 114808 115014 115153 115397 115577 115446 114986 114398 113965 113894 114020 113747 112620 110989 109741 109326 109477
65848 109477 109958 111009 112710 114349 115035 114774 114459 114818 115763 116831 117865 119065 120552 122081 123105 123119
65832 123119 122075 120547 119442 119439 120647 122671 124948 127128 129336 132070 135754 140334 145348 150338 155141
65817 155141 159846 164516 168950 172720 175544 177600 179249 180432 180678 179849 178505 177162 175555 173133 170099
65802 170099 167286 165004 162630 159599 156172 152885 149717 146393 143246 141122 140367 140350 140103 139193 137884
65787 137884 136714 136063 136032 136543 137506 138932 140903 143569 147190 151993 157837 164073 169995 175507 181298
65772 181298 188202 196306 204577 211479 216093 218678 220027 220362 219134 215855 210712 204200 196573 188085
65758 188085 179496 171840 165710 161063 157658 155259 153481 151909 150670 150609 152626 156855 162628 169196 176431
65743 176431 184804 194713 205837 217219 227940 237542 245856 252788 258393 262826 265886 266875 265245 261133
65729 261133 254982 246984 237458 227419 218028 209462 201018 192321 183736 175471 167105 158400 149954 142618
65715 142618 136700 132101 128696 126118 123645 120855 118067 115698 113605 111570 109962 109128 108446 106930 104743
65700 104743 103278 103512 105003 106764 108390 109871 110899 111084 110657 110389 110750 111535 112368 113214 114219 115284
65684 115284 116087 116514 116847 117430 118278 119186 120149 121447 123330 125820 128820 132171 135662 139382 144126 150937
65668 150937 159903 169875 179789 189916 201194 213623 226040 237520 248281 259031 269977 280681
65656 280681 290393 298264 303754 307216 309692 311716 312683 311882 309840 308026 307368 307665 308520 310075 312487
65641 312487 315201 317290 318242 317876 315666 310880 303564 294784 285448 275266 263380 249819 235736 222229
65627 222229 209512 197400 186040 175760 166524 158017 150170 143250 137460 132683 128592 124870 121406
65614 121406 118424 116343 115336 115053 114872 114344 113425 112454 111962 112178 112612 112446 111504 110484 109972 109675 108974
65597 108974 107865 106793 105901 105074 104537 104661 105182 105339 104960 104872 105951 108161 110736 112935 114444 115420 116363
65580 116363 117727 119512 121461 123657 126556 130433 135234 141043 148194 156701 166104 176167 187287 199776
65566 199776 213063 226005 237734 247878 256269 262890 267966 271632 273491 272866 269525 263956 256961
65553 256961 249167 240816 231789 221870 211217 200516 190463 181172 172320 163819 156070 149494 144086
65540 144086 139566 135796 132860 130776 129358 128423 128015 128266 129085 130138 131154 132066 132869 133589 134451 135675
65524 135675 136843 136899 135272 132734 130636 129456 128659 127771 126814 125650 123809 121323 119018 117468 116228
65509 116228 114626 112892 111852 111752 111963 111793 111208 110780 111146 112376 113686 114032 113232 112259 112145 112877 113663
65492 113663 113963 113868 113762 114072 115212 117324 120135 123330 126866 130643 134164 136977 139241 141409 143511
65477 143511 145229 146482 147397 147799 147305 145947 144229 142517 140747 138747 136443 133785 130884 128174 126015
65462 126015 124194 122302 120534 119457 118995 118316 116918 115214 113743 112432 111070 109972 109620 109936 110388
65447 110388 110647 110691 110464 109868 109097 108609 108725 109399 110354 111249 111847 112257 112999 114588 117077 120068 123107 125902
65429 125902 128265 130114 131580 132943 134349 135614 136347 136275 135491 134392 133305 132171 130630 128467 125968
65414 125968 123841 122783 122952 123796 124436 124390 123883 123416 123214 123228 123455 123952 124695 125784 127629 130472 133738
65397 133738 136415 138185 139666 141356 142921 143942 144810 146267 148319 150232 151484 152125 152278 151931 151361
65382 151361 151081 151026 150315 148324 145717 143816 143102 142869 142389 141851 141826 142255 142453 142000 141173 140410 139772 139146
65364 139146 138839 139602 141994 145785 150130 154375 158639 163466 168919 174296 179028 183634 189337 196702 205106
65349 205106 213614 221802 229330 235272 238647 239579 239295 238826 238106 236524 233885 230573 226995 223215 219072
65334 219072 214471 209548 204573 199654 194553 188988 183125 177573 172822 168843 165310 162051 159175 156860
65320 156860 155110 153601 151822 149509 146998 144920 143450 142047 140104 137676 135425 133929 133165 132561 131478
65305 131478 129742 127907 126915 127350 128975 131003 132705 133732 134116 134261 134878 136584 139329 142360 144938
65290 144938 147064 149373 152307 155580 158470 160407 161134 160604 159089 157347 156200 155811 155703 155595 155771 156384
65274 156384 156846 156381 154954 153160 151387 149627 147961 146628 145501 144105 142372 140932 140335 140354 140326 139953
65258 139953 139459 139171 139234 139594 140065 140464 140842 141460 142431 143473 144097 143912 142706 140469 137550 134627 132297
65241 132297 130677 129422 128074 126416 124623 123119 122159 121602 121250 121299 122142 123734 125550 127200 128662 129810
65225 129810 130216 129748 128960 128506 128378 128091 127401 126499 125626 124855 124221 123804 123641 123694 123816 123729 123255 122716 122807 123865
65205 123865 125508 127203 128878 130601 131996 132460 131900 130799 129650 128673 127994 127636 127332 126780 126171 126014
65189 126014 126343 126481 125925 125182 125367 127049 129682 132201 134044 135481 137003 138576 139699 140127 140235 140549
65173 140549 141236 142228 143469 144711 145361 145057 144306 144073 144775 146039 147378 148611 149673 150615 151915 154139
65157 154139 157052 159605 161247 162789 165473 169460 173886 178210 182836 188266 194337 200697 207695 216265
65143 216265 226982 239607 253617 268770 284891 301425 317603 333060 347920 362287 376026
65132 376026 389194 402187 415042 426879 436547 443707 448782 451885 452395 449841 444797 438546 432007
65119 432007 425138 417191 407346 395310 381510 366682 351224 335108 318407 301630 285360 269922
65107 269922 255593 242844 231977 222731 214588 207336 200960 195129 189263 183166 177170 171535 166138
65094 166138 160988 156706 154112 153373 153805 154429 154537 153866 152557 151050 149861 149311 149535 150620 152490 154559
65078 154559 155783 155362 153449 151024 149054 147863 147203 146788 146651 147103 148372 150214 151831 152368 151628 150296
65062 150296 149300 149010 149089 149042 148727 148367 148255 148581 149427 150771 152453 154173 155543 156230 156105 155346 154304 153264
65044 153264 152315 151449 150706 150157 149778 149402 148780 147661 145890 143575 141193 139383 138434 137961 137257 136033 134738
65027 134738 134056 134173 134636 134842 134548 133968 133536 133551 133827 133640 132271 129773 127119 125372 124811 124955 125388 126317
65009 126317 128207 131009 133933 136096 137375 138463 140030 141957 143581 144636 145658 147415 150180 153626
64995 153626 157139 160030 161719 162115 161782 161501 161682 162296 163181 164121 164797 165131 165713 167428 170406 173670 176124
64978 176124 177711 179278 181415 183749 185368 185661 184609 182539 179850 176905 173911 170749 167095 162924
64964 162924 158894 156006 154766 154671 154601 153628 151533 148747 146002 143886 142468 141290 139828 138037 136397
64949 136397 135455 135404 135985 136651 136880 136567 136131 136013 136051 135650 134688 133957 134335 135675 136885 137113 136496 135673 135023
64930 135023 134682 134920 135918 137266 138210 138545 138756 139101 139077 138230 137088 136603 136830 136880 136349 136129 137421 140272
64912 140272 143465 145661 146390 146119 145665 145549 145787 146318 147516 149935 153453 157064 159825 161780 163702 166244
64896 166244 169649 174037 179438 185541 191757 197572 202741 207319 211793 216938 223059 229410 234776 238639
64882 238639 241428 243658 245256 245884 245518 244443 242829 240519 237179 232666 227313 221787 216568 211690 207147
64867 207147 203309 200624 199095 198376 198211 198323 198086 196963 195260 193830 192887 191710 189698 187092 184375
64852 184375 181544 178391 175003 171479 167547 163076 158658 155115 152615 150797 149555 149080 149169 149224 149116 149456
64836 149456 150632 151954 152194 150859 148636 146650 145560 145352 145726 146454 147450 148661 150027 151415 152577
64821 152577 153259 153548 154042 155439 157884 160865 163816 166631 169561 172823 176445 180353 184456 188774 193598
64806 193598 199397 206460 214678 223638 232665 240730 246724 250176 251546 251553 250373 247695 243386 237726 231168
64791 231168 224165 217205 210604 204297 198158 192535 188117 185131 183044 181215 179567 178430 177972 178087 178619
64776 178619 179380 180042 180347 180506 181068 182332 184204 186752 190540 195964 202429 208759 214546 220606 227843
64761 227843 236037 244177 251635 258501 264918 270728 275830 280339 284221 287251 289579 291838 294371 296694
64747 296694 298127 298627 298607 298182 297042 294922 291770 287520 282135 275878 269176 262218 254951 247470 240094
64732 240094 233105 226702 221230 217082 214272 212420 211193 210471 209989 209184 207706 205883 204452 203877 204086
64717 204086 204750 205669 206914 208745 211374 214729 218461 222214 225871 229472 232931 235860 237741 238319 237806
64702 237806 236641 234992 232589 229082 224439 218947 212988 207024 201708 197745 195470 194549 194123 193346 191967
64687 191967 190457 189487 189272 189542 190007 190527 190866 190848 191004 192504 195920 200381 204492 207861 211195 215135
64671 215135 219743 225082 231495 239016 247083 255102 262804 269804 275274 278491 279389 278246 275156 270214
64657 270214 263974 257321 250914 244990 239519 234328 229245 224376 220106 216675 213939 211781 210407 209954
64643 209954 210096 210478 211320 213127 215942 219387 223445 228672 235538 243994 253833 265060 277591 290807
64629 290807 303676 315275 325156 333373 340186 345553 348872 349513 347661 344285 340011 334360 326471 316477
64615 316477 305714 295545 286329 277753 269861 263336 258743 255855 253982 252844 252773 254011 256127 258389
64601 258389 260489 262510 264293 265292 265242 264643 264283 264422 264618 264264 263089 261214 258951 256553 254080 251525
64585 251525 249073 247056 245578 244408 243472 243208 244097 245980 248223 250559 253334 256867 260962 265154 269036
64570 269036 272146 273956 274350 273872 273143 272196 270582 267923 264054 258948 252960 246892 241268 235649 229311
64555 229311 222577 216770 212630 209432 206024 202194 198573 195657 193505 192050 191136 190369 189491 188824 188856 189445
64539 189445 189923 190037 190333 191494 193589 195991 197746 198073 197013 195598 194895 194744 193968 192006 189767 188530
64523 188530 188507 188951 189242 189258 188933 188216 187490 187422 188189 189272 190192 191117 192438 194039 195304 195863 196120 196965
64505 196965 198938 201712 204514 207123 210247 214748 220655 227317 234433 242476 251961 262574 273188 282505
64491 282505 289590 294170 296671 297749 297520 295470 291295 285598 279431 273415 267675 262396 257942 254490
64477 254490 252018 250610 250157 249743 248022 244594 240545 237196 234696 232276 229497 226616 223869 221105 218284
64462 218284 215860 214457 214405 215713 218208 221524 225149 228595 231482 233565 234889 235828 236660 237146 236919 236285
64446 236285 236131 236918 238209 239477 240907 243005 245766 248717 251634 254751 258370 262701 268073 274866 283070
64431 283070 292214 301934 312475 324562 338898 355844 375502 398039 423955 454029 489094 530006
64419 530006 577839 633831 698950 773475 856840 947457 1042570 1138849 1233617 1325345 1412688
64408 1412688 1493460 1564986 1625181 1672668 1706150 1724491 1727562 1716437 1692600 1657359 1611856
64397 1611856 1556819 1492114 1417385 1333649 1243795 1151154 1058112 966441 878242 795661 719967
64386 719967 651666 591340 539576 495996 459061 427153 399548 376207 357041 341596 329170
64375 329170 318957 310192 302351 295231 288830 283163 278134 273490 268979 264599 260522 256654 252545 247935
64361 247935 243179 238828 234993 231510 228441 225879 223359 220170 216397 213105 211204 210597 210769 211780 214217
64346 214217 218405 224040 230526 237289 243832 249787 254954 259186 262263 264026 264487 263618 261213 257230 252301
64331 252301 247635 244316 242682 242230 242026 241365 240344 239758 240250 241591 242923 243611 243621 243201 242517 241634 240553
64314 240553 239201 237622 236192 235325 234935 234482 233663 232708 231846 230831 229246 226905 223655 219159 213437 207476
64298 207476 202675 199588 197595 195870 194169 192528 190750 188695 186838 185979 186351 187269 187814 187727 187655 188609
64282 188609 191151 194979 199217 203159 206695 210073 213517 217253 221764 227607 234853 242827 250545 257400
64268 257400 263480 269336 275405 281441 286454 289382 290042 289379 288647 288331 287983 287090 285847 284992 285038 285960 287516
64251 287516 289404 290887 290667 287685 282088 275061 267651 260085 252242 244305 236660 229532 223155 218079
64237 218079 214807 213091 211972 210632 209012 207534 206536 206083 206121 206543 207122 207487 207304 206542 205569 204863 204572
64220 204572 204500 204603 205256 206770 208776 210423 211157 211008 210152 208542 206143 203246 200340 197793 195799 194499
64204 194499 194011 194363 195416 196841 198227 199376 200463 201741 203175 204521 205733 206980 208337 209820 211808
64189 211808 215044 219975 226342 233645 241834 251338 262547 275424 289433 303622 316914 328510 337909
64176 337909 344413 346947 344818 338668 330312 321439 312514 302966 292297 280891 269798 259843 251033
64163 251033 242860 235067 227934 221912 217161 213527 210717 208399 206302 204377 202799 201785 201518 202154 203593
64148 203593 205242 206435 207279 208744 211596 215583 219936 224282 228534 232186 234476 235357 235708 236318 237015
64133 237015 237054 236073 234359 232409 230507 228726 227081 225604 224349 223350 222634 222290 222489 223297 224535 225955
64117 225955 227588 229783 232823 236677 241216 246606 253262 261428 270858 281002 291384 301681 311420
64104 311420 319834 326204 330333 332603 333650 334118 334550 335211 336016 336953 338514 341328 345241 349266 352665
64089 352665 355583 358204 359712 358776 354977 349144 342316 334868 326812 318376 309988 301928 294288 287142
64075 287142 280647 275017 270388 266567 263026 259423 256064 253520 251824 250464 249222 248498 248537 248769 248351
64060 248351 247176 245988 245540 245913 246644 247281 247751 248334 249323 250710 252260 253884 255786 258210 261185 264595
64044 264595 268313 272216 276259 280730 286269 293457 302342 312369 322667 332447 341358 349617 357606 365275
64030 365275 372020 377198 380513 381904 381502 379937 378271 377163 376302 375071 373663 373055 373891 375798 377832
64015 377832 379193 379395 378141 375376 371321 366294 360606 354647 348792 343102 337369 331694 326766 323194
64001 323194 320648 318010 314499 310500 307207 305567 305559 306358 307137 307821 309161 311962 316176 320822 324864 328133
63985 328133 331265 334857 338901 343082 347425 352366 358195 364697 371422 378211 385246 392712 400604 408903
63971 408903 417730 427210 437313 447952 459158 471048 483714 497286 512049 528296 546062 565155
63959 565155 585510 607343 630935 656497 684417 715551 751051 791935 838960 892878 954654
63948 954654 1025412 1106370 1198919 1304558 1424511 1559319 1708927 1873147 2051943 2245091
63938 2245091 2451480 2668821 2894064 3123965 3355041 3582947 3802221 4006953 4191792
63929 4191792 4352426 4485470 4588334 4659240 4697037 4700841 4670018 4604712 4506401 4377922 4223061
63918 4223061 4046094 3851503 3643865 3427837 3208068 2988829 2773589 2565046 2365632
63909 2365632 2177830 2003787 1844566 1699907 1568807 1450382 1344175 1249696 1165921 1091532
63899 1091532 1025644 967905 917655 873375 833473 797409 765520 737741 713111 690629 669968
63888 669968 651000 633193 616041 599781 585109 572285 560949 550722 541547 533482 526623 521307
63876 521307 517988 516726 517070 518619 521567 526528 533915 543498 554470 565882 577131 588199 599502
63863 599502 611560 624677 638705 652958 666491 678600 689054 697920 705347 711475 716217 719028
63851 719028 719289 717098 713315 708432 701791 692384 680249 666568 652432 638004 622915 607025 590644
63838 590644 574236 558011 541690 524716 506903 488781 471074 454018 437492 421662 407002
63827 407002 393702 381438 369826 358770 348336 338566 329468 320968 312909 305371 298816 293520 288970
63814 288970 284267 279164 274233 270040 266605 263674 261061 258564 256041 253717 252020 250995 250225 249409 248594
63799 248594 247765 246670 245174 243374 241261 238807 236457 234966 234472 234236 233528 232256 230504 228137 225293
63784 225293 222716 221052 220201 219744 219557 219552 219294 218450 217272 216132 214947 213616 212604 212409 212719 212804 212575
63767 212575 212550 212861 212943 212301 211016 209502 208267 207875 208596 209980 211238 212085 212801 213478 213772 213502 213004 212697
63749 212697 212660 212785 213031 213420 214040 215120 216836 219068 221627 224626 228157 231637 234057 235081 235428 235977
63733 235977 236903 237949 239149 240808 243011 245474 247913 250355 253094 256442 260425 264689 268863 272989
63719 272989 277464 282546 288120 293889 299519 304559 308534 311271 312954 313772 313778 313135 312136 310802 308737 305655
63703 305655 301908 298193 294858 291755 288748 286055 283989 282534 281437 280698 280719 281766 283429 284925 285945
63688 285945 286818 287794 288654 289328 290424 292561 295431 298131 300266 302100 303702 304684 305006 305354 306361 307856
63672 307856 309210 310070 310565 311203 312812 316030 320452 324689 327783 330251 333251 337049 340890 344079 346396
63657 346396 347431 346391 343014 338184 333141 328306 323246 317648 311881 306587 302068 298184 294668 291409
63643 291409 288552 286454 285379 285098 284930 284461 284169 285021 287307 290169 292502 294115 295806 298471 302394
63628 302394 307247 312470 317699 323086 329133 335991 343133 350063 357149 365239 374531 384474 394860 406386
63614 406386 419775 434928 451378 469231 489166 511750 537120 565140 595503 627813 661837
63603 661837 697467 734147 770538 805079 836629 864199 886397 901851 910180 912129 908854 901618
63591 901618 892103 882120 872531 862819 851991 839519 825173 808469 788917 766666 742454 716961
63579 716961 690592 663843 637535 612556 589520 568657 549851 532808 517472 504301 493973
63568 493973 486791 482590 481053 481796 484146 487313 491077 495939 502292 509641 517044 524134 531309 539030
63554 539030 547488 557053 568535 582645 599468 618814 640896 666343 695702 729339 767773 811515
63542 811515 860145 911542 962190 1008222 1046290 1073992 1090232 1095591 1092161 1082627 1069235 1053616
63530 1053616 1037385 1022421 1010168 1000639 992308 982984 970793 954640 934272 910060 882445 851421
63518 851421 816805 779158 740179 701883 665445 631039 598612 568551 541554 518061 497920
63507 497920 480488 465006 450905 437866 425771 414727 405000 396739 389781 383893 379046 375158 371709
63494 371709 368097 364320 360777 357441 353920 350458 347961 346623 345389 343483 341768 341683 343322 345547 347641
63479 347641 349828 352352 355200 358811 363957 370574 377535 383841 389286 393771 396868 398514 399249 399279 397977
63464 397977 394896 390601 385975 381292 376589 372331 368941 366065 363091 360115 357703 355942 354439 353121
63450 353121 352380 352446 353192 354540 356566 359283 362807 367690 374570 383423 393606 404655 416601 429541
63436 429541 443436 458599 476029 497028 522561 552858 587169 623587 659353 691642 718379
63425 718379 738610 752492 761083 766027 769265 772770 778248 786912 799674 817501 841298 871330 907028
63412 907028 947382 991069 1035975 1079087 1117409 1148918 1172577 1187942 1195232 1195423 1189741 1179281
63400 1179281 1165452 1150224 1135123 1120052 1103754 1085307 1064590 1041468 1015358 985768 952710
63389 952710 916495 877725 837605 797682 759014 722004 687132 655286 627161 602793 581897
63378 581897 564225 549420 537031 526931 519380 514416 511600 510624 511773 515444 521506 529471 539023
63365 539023 550059 562400 575851 590484 606655 624814 645372 668631 694737 723873 756477
63354 756477 793009 833348 876636 921771 967707 1013076 1055842 1093632 1124414 1146847 1160362
63343 1160362 1165254 1162678 1154437 1142622 1129111 1114934 1100118 1084384 1067899 1050936 1032927 1012496
63331 1012496 988543 960818 929490 894962 858364 821445 785457 750720 717734 687983 662940
63320 662940 642854 627341 616628 611097 609623 609341 607331 601950 592559 578883 561204 540689 518979
63307 518979 497465 477013 458055 440730 425084 411283 399492 389578 381184 374140 368527 364283
63295 364283 361003 358231 355723 353317 350715 347540 343553 338824 333821 329237 325502 322430 319448 316181
63281 316181 312715 309451 306833 305062 303794 302318 300336 298398 297209 296673 296135 295435 295135 295638 296721
63266 296721 298091 299811 301894 303997 305858 307621 309343 310610 311111 311319 312131 314027 316971 320864 325575
63251 325575 330620 335365 339610 343646 347706 351730 355717 359997 365081 371400 379195 388397 398618 409498
63237 409498 421105 433820 447878 463255 479820 497317 515371 534030 554233 577018 602030
63226 602030 627374 651384 674080 696522 719182 741638 763598 785435 807562 829912 852332
63215 852332 875023 898225 921625 944356 965482 984287 1000273 1013042 1022034 1026237 1024401 1015876
63203 1015876 1001258 981943 959044 932970 904004 872942 840966 809193 778600 750177 724693
63192 724693 702263 682503 665304 651223 640927 634428 631145 630566 632497 636730 642885 650753 660521
63179 660521 672420 686334 701895 718708 736228 753621 770188 785860 800999 815768 830001
63168 830001 843605 856620 868821 879738 889250 897612 904543 908703 908637 904079 895786 884136 868500
63155 868500 848183 823584 796111 767249 738027 709176 681331 654935 630185 607224 586268
63144 586268 567424 550461 535013 521052 508941 498812 490083 481887 473990 466920 461111 456291 451955
63131 451955 448116 445152 443114 441692 440847 441043 442636 445395 448782 452485 456463 460643 464824 468794 472399
63116 472399 475594 478538 481518 484658 487783 490703 493542 496583 499863 503107 506035 508580 510725 512325
63102 512325 513246 513627 513848 514165 514486 514627 514727 515184 516118 517115 517701 517906 518098 518372 518474 518346 518374 518883 519649
63083 519649 520121 519975 519270 518255 517305 516897 517374 518724 520761 523455 526854 530757 534766 538721 542886 547704
63067 547704 553577 560904 569998 580770 592710 605378 618801 633295 649125 666639 686527 709504
63055 709504 735656 764448 795542 829374 866736 907945 952619 1000106 1049930 1101862 1155817
63044 1155817 1211656 1268900 1326633 1383821 1439799 1494419 1547875 1600565 1652963 1705331 1757535
63033 1757535 1809340 1860765 1911772 1961705 2009428 2053970 2094402 2128894 2154683 2169553 2172985
63022 2172985 2165369 2146550 2115830 2073135 2019521 1956689 1886773 1812427 1736241 1659897 1584562
63011 1584562 1512179 1445401 1385899 1333523 1287661 1248645 1217220 1193321 1176342 1166182 1163035
63000 1163035 1166309 1174639 1187042 1203235 1222722 1244374 1267288 1291403 1316893 1343447 1370591 1398285
62988 1398285 1426645 1455328 1483658 1511218 1537844 1563042 1585828 1605180 1620260 1630123 1633614 1629864
62976 1629864 1618748 1600570 1575358 1542745 1502646 1455920 1404268 1349562 1293367 1236920 1181281
62965 1181281 1127367 1075935 1027594 982716 941301 903098 867963 835929 806839 780093 755034
62954 755034 731508 709762 689821 671165 653088 635215 617650 600822 585241 571200 558514
62943 558514 546559 534651 522421 509969 497777 486431 476224 467039 458709 451393 445314 440193
62931 440193 435319 430325 425561 421463 417865 414275 410683 407685 405765 404721 403811 402325 400027 397304
62917 397304 394916 393406 392658 392142 391526 390854 390109 388978 387265 385376 384119 383966 384562 384904 384015 381655
62901 381655 378512 375621 373495 371916 370573 369624 369431 370007 371018 372199 373411 374356 374643 374215 373423 372616
62885 372616 371924 371453 371337 371459 371486 371357 371472 372165 373297 374536 375732 376716 377098 376706 376014 375628 375510 375233
62867 375233 374882 375030 375680 375867 374710 372465 370200 368676 367895 367520 367325 367295 367618 368615 370438 372751 374871
62850 374871 376293 377046 377556 378248 379273 380527 381865 383273 384843 386625 388546 390359 391633 391908 391092
62835 391092 389674 388391 387626 387217 386825 386356 386063 386372 387540 389270 390833 391847 392849 394694 397398 400060
62819 400060 402073 403853 406073 408629 410889 412755 414918 418035 422005 426192 430104 433743 437378 441086
62805 441086 444608 447783 451064 455329 461059 467915 475302 483130 491785 501616 512693 524891 537838
62792 537838 550867 563491 576081 589854 605999 624842 645979 669200 695248 725552 761167
62781 761167 802115 847968 898935 956005 1019941 1090491 1166692 1247650 1332836 1421870 1514146
62770 1514146 1608310 1701917 1791943 1875849 1951818 2017853 2071313 2109887 2132645 2139653 2130955 2106595
62758 2106595 2067385 2014967 1951277 1878461 1799026 1715308 1628810 1540711 1452858 1367383 1285364
62747 1285364 1206746 1131803 1061768 997667 939298 885902 837210 793276 753821 718383 686798
62736 686798 658919 634141 611666 591127 572563 556055 541767 530057 520976 513739 507183 500766
62724 500766 494826 489975 486578 484662 483914 483763 483850 484426 486024 488775 492357 496538 501422 507198 514051
62709 514051 522357 532559 544740 558641 574293 592339 613516 638096 666056 697612 733247 773191
62697 773191 817090 864273 914285 967110 1022970 1081947 1143808 1208061 1273950 1340201 1404791
62686 1404791 1465178 1518992 1564554 1600775 1626662 1641118 1643279 1632928 1610506 1576834 1533082
62675 1533082 1480966 1422564 1359669 1293486 1225245 1156860 1090478 1027314 967372 910469 857163
62664 857163 808375 764427 724827 688908 656338 627036 600822 577276 555924 536643 519828
62653 519828 505895 494486 484482 474980 465978 457819 450327 443027 436018 429963 425077 420708 416137
62640 416137 411383 406938 403107 400038 398092 397590 398227 399181 399965 400847 402287 404220 406060 407198 407256 406064
62624 406064 403761 400959 398477 396794 395861 395537 395979 397430 399774 402511 405169 407636 410102 412860 416130
62609 416130 419989 424434 429566 435583 442528 450162 458302 467223 477479 489310 502494 516841 532668
62596 532668 550739 571880 596600 624842 656065 689859 726493 766548 809852 855106 900720
62585 900720 945626 988952 1029298 1064915 1094493 1117214 1132165 1138359 1135618 1124942 1107574 1084038
62573 1084038 1054467 1019634 981087 940281 898084 855322 813251 773065 735117 699116 665056
62562 665056 633510 604925 579019 555180 533228 513508 496382 481922 469991 460254 452074 444653
62550 444653 437456 430427 423863 418155 413548 409937 406938 404338 402355 401215 400666 400277 400154 400802 402239
62535 402239 403824 405149 406529 408206 409614 410092 410044 410706 412794 415992 419823 424367 429855 436059 442660
62520 442660 450009 459083 470565 484240 499421 515828 534005 554999 579726 608481 640826 675912
62508 675912 713064 752029 792584 833950 874890 914430 952116 987309 1018565 1044127 1062961
62497 1062961 1075021 1080751 1080791 1076064 1067586 1056111 1042449 1028161 1015382 1005735 999897 998375 1002052
62484 1002052 1011577 1026784 1047238 1073003 1104340 1141001 1182267 1227297 1274740 1322144 1366389
62473 1366389 1404849 1435890 1458614 1472626 1477857 1473955 1459875 1434678 1398759 1353868 1301975 1244696
62461 1244696 1183629 1120384 1056023 991191 927159 866125 810018 759390 713823 672965 636756
62450 636756 605102 577940 555414 537409 522984 510751 499901 490486 482686 476158 470296 464899
62438 464899 460354 457185 455536 455121 455582 456721 458277 459641 460117 459527 458289 456856 455289 453472 451400
62423 451400 449039 446116 442384 437977 433235 428252 422886 417195 411605 406526 402005 397804 393743 389858
62409 389858 386382 383600 381634 380182 378551 376183 373275 370731 369329 368973 368923 368676 368373 368343 368691 369503
62393 369503 371119 373794 377202 380626 383610 386243 388895 391893 395326 398907 402191 405132 408245 411889
62379 411889 415711 419360 423460 429140 436590 444809 452884 460827 468965 477365 486266 496322 507801 520110
62365 520110 532805 546587 562577 580955 601144 623206 648216 677242 710612 748368 790842
62354 790842 838590 892128 951676 1016673 1085311 1155014 1223435 1288629 1348303 1399715 1440796
62343 1440796 1471041 1490944 1500912 1501102 1491999 1474602 1450014 1419087 1382421 1340499 1293957 1243954
62331 1243954 1192193 1140353 1089538 1040398 993626 950065 910367 874658 842498 813078 785677
62320 785677 760123 736689 715292 694993 674634 653933 633610 614440 596588 579913 564414
62309 564414 550081 536626 523840 512077 502007 493851 487148 481228 475662 470305 465291 461118 458307
62296 458307 456700 455393 453721 452061 451256 451447 451973 452419 453194 454922 457698 461190 465081 469098 472917
62281 472917 476438 479964 483832 488013 492382 497101 502337 507809 513067 518186 523732 530116 537453 545995
62267 545995 556125 567825 580720 594890 611130 630126 651915 676577 705025 738514 777528
62256 777528 821659 870437 923850 982106 1045283 1113154 1184908 1258891 1332705 1403473 1467928
62245 1467928 1522814 1565954 1597048 1616992 1626385 1625003 1612603 1589645 1557155 1516413 1468851 1415711
62233 1415711 1357563 1294699 1228281 1160662 1094276 1030592 970370 914338 863140 816956 775688
62222 775688 739183 706949 678115 652301 630169 612389 598287 586190 574979 564586 555131 546449
62210 546449 538591 531930 526387 521217 515937 510992 507087 504298 502205 500594 499685 499901 501564 504534 508029
62195 508029 511288 514601 519156 525539 532960 540324 547508 555023 562984 571226 580089 590234 601645 613533
62181 613533 625301 637037 648933 660718 671838 681868 690671 698449 705659 712615 719297 725912 733432
62168 733432 743097 755512 770845 789827 813819 843721 879407 920350 966091 1015758 1067712 1120110
62156 1120110 1171261 1219079 1260826 1294154 1318191 1333201 1339567 1337754 1328891 1314435 1295056 1270448
62144 1270448 1240406 1205639 1167389 1126714 1084450 1041568 999215 958482 920252 885152 853501
62133 853501 825421 801091 780806 764623 752034 742094 733897 726972 721390 717561 715880 716379 718709
62120 718709 722438 727376 733682 741617 751145 761675 772180 781644 789460 795475 799763 802439 803556 803034
62106 803034 800767 796956 792312 787615 782914 777363 770126 761377 752139 743146 734275 725323 716956 710404
62092 710404 706277 704172 703468 704030 705863 708618 711888 715704 720181 724882 729195 733456 739105 747405 758304
62077 758304 770764 783919 797696 812595 829169 847579 867340 887592 907758 927901 948393
62066 948393 969518 991558 1014996 1040252 1067371 1096248 1127080 1160233 1195586 1232207 1268633
62055 1268633 1303308 1334733 1361476 1382253 1396091 1402647 1402525 1396991 1386911 1371909 1350875 1323445
62043 1323445 1290666 1254036 1214231 1171098 1124734 1076176 1026973 978407 931251 886076 843531
62032 843531 804304 768912 737546 709996 685747 664159 644642 626758 610358 595655 582962
62021 582962 572158 562465 553000 543528 534464 526108 518184 510194 501974 493698 485525 477486 469612 461987
62007 461987 454767 448345 443372 440405 439519 440370 442574 445958 450561 456508 463688 471451 478904 485652 491937
61992 491937 497860 502951 506847 509871 512288 513450 512516 509769 506166 501641 495024 486006 476116 467090
61978 467090 459095 451274 443366 435841 428852 422035 415312 409155 403955 399613 395804 392243 388717 385222
61964 385222 382016 379262 376824 374757 373712 374249 375871 377389 378265 379026 380270 381926 383755 386026 389227
61949 389227 393359 397894 402375 406959 412462 419900 429661 440985 452563 463923 476004 490125 506581
61936 506581 524627 543657 563900 585713 608630 631507 653529 674647 694957 714080 731452
61925 731452 746948 760750 772705 782200 788666 791783 791265 787009 779684 770658 760986 750828 740157
61912 740157 729712 720807 714475 711183 711189 714726 721948 732954 747653 765284 784274 803010 820642
61899 820642 836813 850846 861691 868579 871274 869766 864168 854915 842677 828050 811563 793854
61887 793854 775472 756670 737826 719899 703885 689814 676738 663709 650388 636838 623333
61876 623333 610380 598304 586651 574498 561537 548444 536091 524833 514698 505785 498326 492745
61864 492745 489699 489530 491530 494328 497265 500895 505948 512461 520314 530014 542297 557291 574680 594515
61850 594515 617296 643227 671790 702182 734039 767628 803293 840597 878109 914200 947925
61839 947925 978781 1005763 1027288 1042161 1050174 1051646 1047048 1037358 1024155 1008878 992368 975533
61827 975533 960054 947954 940633 938567 941559 948892 959591 972903 988311 1004855 1020867 1034632
61815 1034632 1044804 1049880 1048056 1038447 1022029 1000612 975196 946050 913993 880535 846806 813181
61803 813181 780058 748179 718051 689784 663712 640428 619913 601284 583797 567644 553463
61792 553463 541534 531740 523808 517149 510838 504277 497713 491762 486608 481938 477442 473055 468854 465027
61778 465027 461839 459366 457315 455327 453345 451514 449869 448420 447412 447148 447436 447476 446503 444537 442457
61763 442457 441374 441863 443664 446033 448414 450829 453644 456974 460424 463502 466212 469034 472183 475124
61749 475124 477085 477921 478079 477716 476357 473684 470303 467249 464919 462841 460383 457291 453645 449744 446110
61734 446110 443260 441334 440146 439544 439457 439611 439660 439757 440595 442569 445128 447281 448648 449758 451363 453701
61718 453701 456504 459515 462731 466092 469170 471459 472998 474389 476040 477640 478596 478774 478483 477905 476886
61703 476886 475179 472563 468797 463894 458436 453222 448573 444318 440431 437183 434569 432101 429408 426653
61689 426653 424111 421715 419294 416891 414497 411739 408218 404001 399559 395407 392022 389737 388321 386911
61675 386911 384833 382394 380403 379030 377617 375641 373380 371433 369943 368582 367125 365810 365136 365339 366058
61660 366058 366597 366690 366870 367786 369213 370148 370038 369606 370214 372592 376356 380527 384180 386779 388358 389517
61644 389517 391015 393177 395854 398926 402568 406823 411172 414855 417559 419460 420621 420747 419680 417811
61630 417811 415699 413504 411085 408477 405867 403172 400066 396565 393251 390702 388840 387042 384743 381874
61616 381874 378847 376236 374365 373117 372171 371349 370548 369419 367504 364764 361572 358032 353761 348658 343472
61601 343472 339084 335465 331859 327903 324000 320610 317663 314785 311642 308005 303938 300120 297411 295796
61587 295796 294185 291684 288729 286460 285226 284306 283077 281791 280992 280613 280076 279071 277890 276987 276504 276262
61571 276262 276072 275856 275593 275312 275171 275399 275970 276479 276545 276309 276281 276700 277364 278153 279337 281077 282973 284525
61553 284525 285747 286888 287722 287824 287541 287954 289569 291637 293150 294036 294800 295444 295450 294737 293944 293635 293778 294203
61535 294203 295139 296981 299748 302994 306155 308867 311084 312946 314433 315195 314955 314051 313232 312789 312194 310793
61519 310793 308595 306216 304244 302856 301862 300884 299633 298190 296965 296292 296235 296797 298016 299654 301123 301975
61503 301975 302296 302398 302353 302042 301413 300415 299007 297532 296741 296974 297622 297965 298247 299181 300594 301502 301626 301904
61485 301904 303033 304345 304727 304135 303498 303507 304205 305511 307359 309301 310643 311221 311636 312530 313973 315666 317429
61468 317429 319207 320842 322112 323005 323766 324597 325330 325474 324741 323540 322720 322639 322682 321992 320591 319449 319426 320465
61450 320465 321845 322970 323764 324562 325771 327496 329353 330824 331895 333158 335098 337514 339813 341757 343620
61435 343620 345701 348027 350586 353513 356800 360006 362477 363916 364596 365044 365584 366144 366358 365887 364859 364017
61419 364017 364268 365911 368395 370885 372900 374332 375128 375327 375279 375384 375611 375632 375387 375030 374243 372270 369032
61402 369032 365662 363286 361658 359690 357113 354822 353550 353007 352528 351839 350838 349274 347157 345110 343803
61387 343803 343310 343407 344121 345504 347154 348545 349699 351022 352595 354110 355445 356779 358214 359773 361754
61372 361754 364469 367593 370346 372486 374565 376988 379341 381047 382199 383341 384718 386162 387435 388375
61358 388375 388915 389385 390635 393440 397848 403317 409409 416054 423321 431217 439644 448345 457006 465578 474236
61343 474236 482770 490360 496320 500865 504720 508264 511547 514916 518890 523392 527667 531017 533079 533438
61329 533438 531731 528372 524505 520804 516888 512263 507299 502689 498391 493800 488804 484094 480417 477951
61315 477951 476395 475327 474493 474084 474714 476846 480271 484387 488821 493543 498588 504195 510973 519309 528453
61300 528453 536817 543431 548601 552798 555429 555313 552170 547055 541282 535330 528949 521977 514782 508010
61286 508010 502114 497145 492935 489464 486974 485627 485125 484870 484614 484819 486244 489230 493412 498080 502721
61271 502721 507318 512282 518034 524483 530968 536864 542177 547308 552317 556905 561293 566615 573884 582794
61257 582794 592044 600843 609488 618357 626906 634176 639950 644910 649602 653700 656463 657709 658042 658131 657904
61242 657904 656617 653648 649065 643344 636795 629560 622047 614950 608599 602530 595962 588676 581340 575026
61228 575026 570406 567294 564889 562546 560343 558796 558065 557702 557302 557078 557543 558702 559887 560458 560531 560877
61212 560877 562129 564108 565958 566894 566752 565817 564372 562576 560693 559133 558276 558382 559614 561950 565183
61197 565183 569290 574769 582375 592552 605367 620756 638348 657057 675379 692352 707897 722165
61185 722165 734902 745582 753751 759232 762435 764572 766989 770062 773177 775866 778307 780469 781609 781195
61171 781195 779666 777611 774685 770151 764190 757872 751869 745779 738719 730170 720278 709709 699071 688287
61157 688287 676819 664720 652948 642244 632334 622911 614776 609040 605590 603416 602218 602517 604103
61144 604103 605478 605232 603134 599500 594240 587028 577937 567520 556605 546204 537219 530016 524499 520541
61130 520541 517937 516198 515036 514966 516734 520224 524735 530289 537618 546797 556984 567939 580665 595846
61116 595846 612530 629239 645752 663004 681713 701882 723283 745627 768497 791653 815195
61105 815195 838862 861554 882135 900519 917304 932538 945410 955063 961133 963519 962147 957101
61093 957101 948719 937552 924330 909788 894279 877772 860364 842511 824551 806376 787871 769298
61081 769298 750962 732950 715583 699668 685768 673589 662580 652749 644267 636652 629130 621650
61069 621650 614910 609467 605468 603081 602456 603207 604598 606404 609086 613023 618046 623802 630112 636833 643804
61054 643804 651132 659243 668564 679414 692110 706759 722878 739666 756772 774518 793324 813300
61042 813300 834544 857407 882202 908834 936900 966026 996012 1026822 1058514 1091096 1124473
61031 1124473 1158670 1194055 1231126 1270082 1310778 1353088 1397062 1442697 1489718 1537641 1586048
61020 1586048 1634947 1685089 1737958 1795285 1858452 1928303 2005417 2090549 2184857 2289664 2406071
61009 2406071 2535333 2680254 2846245 3040741 3272035 3549636 3885779 4295891 4798051
61000 4798051 5413600 6168420 7091521 8210578 9547322 11110377 12877643 14771474 16650857
60991 16650857 18343897 19709594 20686297 21296041 21616538 21753092 21819926 21913023 22067489
60982 22067489 22227090 22260797 22024092 21422560 20437809 19114240 17533619 15797230 14013154
60973 14013154 12280293 10672356 9231632 7974178 6898626 5992558 5237132 4611595
60965 4611595 4096142 3672070 3321540 3028973 2782604 2573877 2395534 2240811 2104184
60956 2104184 1982107 1872760 1775243 1688825 1612627 1545775 1487525 1436843 1391968 1350931 1312614
60945 1312614 1276786 1242927 1209706 1176016 1142018 1108664 1076521 1045475 1015240 985646 956528
60934 956528 927752 899328 871316 843817 817236 792265 769304 748075 728080 709209 691600
60923 691600 675146 659509 644545 630459 617656 606627 597780 591076 585944 581772 578395 575950 574449
60910 574449 573702 573547 573926 574846 576399 578698 581655 585010 588619 592418 596005 598684 600232 601283 602559
60895 602559 603956 604757 604491 603105 600494 596482 591341 585803 580303 574547 568056 560924 553723 546751 539684
60880 539684 532097 524053 515904 507584 498506 488445 478152 468693 460332 452556 445096 438323 432498 427292
60866 427292 422456 418499 416130 415226 414826 414166 413393 413226 414194 416235 418920 421900 425047 428156 430758 432559
60850 432559 433957 435736 438180 440881 443461 446040 448838 451806 454869 458079 461214 463646 464986 465528
60836 465528 465670 465227 463754 461260 458155 454678 450864 446951 443407 440566 438502 437146 436221 435247 433931
60821 433931 432512 431450 430877 430529 430051 429133 427601 425631 423580 421359 418292 413958 408794 403456 398005
60806 398005 392347 387094 383115 380292 377534 374187 370787 368103 365991 363563 360213 356205 352399 349538
60792 349538 347694 346323 344889 343339 341883 340657 339844 339761 340310 340656 340106 339141 338892 339617 340399 340464 340056
60775 340056 339766 339725 339876 340570 342363 345463 349605 354192 358439 361835 364720 368015 372096 376361 380175
60760 380175 383686 387228 390406 392425 393111 392994 392483 391493 389911 387941 385928 384131 382719 381655 380594
60745 380594 379121 377172 375031 373009 371301 369950 368559 366209 362212 357039 352057 348161 345014 341793
60731 341793 338195 334421 330555 326531 322598 319262 316658 314386 312167 310390 309697 310108 310863 311154 310805
60716 310805 310177 309604 309148 308849 308939 309615 310692 311659 312156 312337 312703 313577 314849 316220 317607 319191 321077
60699 321077 323119 325214 327613 330646 334102 337175 339287 340798 342606 345091 347774 350030 351763 353200
60685 353200 354391 355327 356376 358062 360383 362669 364232 364825 364430 363027 360845 358574 356987 356439 356845
60670 356845 357888 358985 359366 358577 356858 354724 352380 349756 346906 343883 340482 336625 332908 330149 328345
60655 328345 326722 324890 323341 322548 322255 322109 322428 323814 326307 329503 333166 337129 340706 342871 343172
60640 343172 342123 340575 338986 337277 335163 332539 329713 327219 325258 323438 321317 319057 317254 316247
60626 316247 315925 316142 316906 318100 319411 320658 321911 323079 323721 323508 322732 322047 321709 321333 320450 319183 318195
60609 318195 318034 318698 319844 321204 322638 324003 325238 326469 327706 328564 328689 328454 328671 329520 330306 330565
60593 330565 330828 331842 333514 335209 336728 338319 339962 341433 343030 345447 348688 351760 353711 354503 354572
60578 354572 354045 352860 351371 350347 350391 351629 353869 356838 360315 364278 368969 374677 381510 389419 398305
60563 398305 408006 418271 428894 439717 450319 459834 467414 472866 476514 478375 477890 474748 469677
60550 469677 463999 458543 453442 448908 445565 443804 443395 444090 446126 449700 454483 460326 467977 478199
60536 478199 490410 503285 516666 531770 549146 567472 584933 600817 614932 626248 633221 635258
60524 635258 633081 627866 620703 612644 604460 596292 588028 579863 572007 564185 556087 548178 541350 535929
60510 535929 531740 529034 528477 530134 533178 536790 540757 545139 550096 556265 564634 575774 589716 606798
60496 606798 628044 654345 685730 721677 761598 804614 849321 894261 938404 980873 1020482
60485 1020482 1055844 1085690 1108795 1123808 1129491 1125090 1110526 1086542 1054732 1017057 975088 929982
60473 929982 883152 836426 791214 747968 706818 668375 633497 602529 575229 551321 530644
60462 530644 512799 497030 482680 469630 458197 448652 440840 434241 428315 422694 417124 411504 406168
60449 406168 401803 398756 396533 394321 391828 389266 386807 384569 382919 382089 381466 380036 377689 375412 373938
60434 373938 372913 371748 370596 369960 369821 369816 369933 370391 370951 370946 370035 368571 367216 366448 366380 366791 367314 367766 368284
60415 368284 369066 370077 371113 372038 372861 373646 374374 374812 374655 373973 373395 373525 374310 375383 376844 379136 382103
60398 382103 384835 386667 387781 388622 389310 389975 391090 392990 395405 397860 400267 402807 405557 408556 411887
60383 411887 415384 418609 421395 424004 426465 428236 429031 429483 430414 431822 433220 434732 437083 440519 444298
60368 444298 447445 449673 451513 453756 456770 460203 463369 465932 468035 469781 471070 472085 473383 475167
60354 475167 477070 479144 482535 488458 496837 506611 517045 527955 538868 548923 557730 565542 572236
60341 572236 576755 577958 575750 571139 565367 559158 552503 545033 536705 528213 520596 514435 509497 505113
60327 505113 500770 496426 492464 489243 486563 483721 480266 476514 473178 470676 468983 467870 467045 466323 466037
60312 466037 467043 469970 474604 480294 486791 494430 503814 515653 530576 548513 568393 588854 609081
60299 609081 628546 646259 660960 671924 678976 681686 679219 671188 658259 641792 623280 604187
60287 604187 585899 569404 555071 542759 532160 523121 515720 509861 504902 500076 495412 491629 488834
60274 488834 485978 482179 477927 474215 470979 467365 463207 459165 455516 451879 448220 445131 442828 440798
60260 440798 438721 436943 435679 434516 433160 431965 431247 430658 429715 428481 427231 425929 424510 423327 422805
60245 422805 422932 423451 424239 425164 425899 426277 426553 426942 427189 426936 426271 425580 425078 424855 425131 426084 427570 429362
60227 429362 431549 434384 437827 441538 445201 448631 451679 454279 456560 458785 461234 464200 467865 472034
60213 472034 476260 480468 485255 491319 498711 506876 515256 523582 531697 539459 546865 554120 561440 568770
60199 568770 575679 581587 586197 589710 592536 594906 596941 598922 601095 603263 604990 606266 607481 608546
60185 608546 608544 606687 603300 599427 595654 591733 587269 582325 577286 572414 567724 563126 558582 554160 550035
60170 550035 546393 543310 540659 538152 535564 533002 530887 529509 528620 527580 525899 523603 521192 519328
60156 519328 518422 518358 518710 519332 520500 522257 523967 524966 525431 526109 527342 528916 530743 532999 535516 537710
60140 537710 539397 541134 543535 546765 550959 556575 563886 572528 581974 592082 602701 613074 622186
60127 622186 629559 635307 639542 642212 643527 644114 644564 644997 645117 644624 643619 642663 642375 642889 643848 644937
60111 644937 646239 647987 650154 652418 654363 655585 655798 654988 653360 651079 648216 644952 641531 637899 633677
60096 633677 628687 623403 618752 615557 614158 614384 615880 618601 622829 628426 634293 639092 642476 645129
60082 645129 647698 650353 653311 656899 660746 663742 665272 665824 665878 664933 662251 657918 652310 645072 635671
60067 635671 624680 613514 602905 592522 582115 572023 562365 552658 542814 533800 526652 521208 516367
60054 516367 511329 506065 500804 495765 491489 488832 488191 488971 490176 491445 493206 495865 499285 503184 507668
60039 507668 512982 518970 525192 531432 537683 543749 549291 554257 558782 562645 565362 566862 567511 567320 565772
60024 565772 562684 558608 553987 548514 541880 534628 527629 521040 514381 507356 499926 491852 482955 473833
60010 473833 465632 458944 453381 448333 443758 440077 437633 436366 435810 435393 434891 434515 434461 434582 434729 435064
59994 435064 435633 435981 435765 435585 436548 438989 442136 445113 447761 450418 453424 457017 461305 466018 470537
59979 470537 474304 477060 478702 479219 478812 477804 476380 474611 472715 470920 469157 467256 465477 464440 464416
59964 464416 465055 465943 467108 468845 471368 474764 478988 483692 488290 492366 495829 498587 500309 500667 499636
59949 499636 497448 494438 491039 487664 484471 481389 478476 476072 474432 473367 472360 470960 469013 466644
59935 466644 464039 461187 457938 454469 451513 449769 449140 449009 449307 450814 454173 459064 464641 470482 476673
59920 476673 483269 490115 497083 503945 509969 514151 516166 516860 517565 519036 521220 523875 527043 530866 535189
59905 535189 539564 543558 547022 550206 553689 557896 562401 565887 567240 566695 565563 564816 564371 563843 563414
59890 563414 563614 564649 566423 568949 572242 575983 579757 583642 588127 593413 599147 604851 610312 615497
59876 615497 620413 625132 629720 634056 637882 641007 643309 644541 644437 643007 640575 637524 634148 630676
59862 630676 627176 623493 619520 615507 611881 608804 606128 603687 601342 598906 596441 594649 594491 596306
59848 596306 599603 603771 608632 614220 620422 627053 633897 640409 645684 649064 650625 650886 650296 649302 648631
59833 648631 648952 650086 650862 650006 647101 642669 637523 632249 627178 622410 617628 612111 605378 597909 590909
59818 590909 585215 580605 576271 571662 566723 561656 556810 552594 549131 545985 542519 538498 534208 530080
59804 530080 526379 523109 520058 517082 514497 512904 512417 512383 512189 511993 512236 512763 513003 512742 512121 511124 509786
59787 509786 508793 509045 510493 512149 513341 514226 514927 514999 514161 512811 511327 509471 506985 504323 502205 500830
59771 500830 500022 499740 499917 500194 500406 501098 502924 505703 508654 511404 514209 517304 520677 524463 528902 533826
59755 533826 538798 543932 550026 557570 566112 574917 583856 593248 603133 613208 623286 633397 643400
59742 643400 652914 661729 670032 678070 685743 692590 698045 701684 703390 703417 702178 699926 696777 693083 689509
59727 689509 686477 683644 680174 675528 669865 663804 658030 653027 648815 644814 640292 635102 629801 624976
59713 624976 620688 616704 612984 609739 607199 605485 604525 603929 603135 601908 600618 599928 600387 602366 605931
59698 605931 610494 614879 618225 620759 623421 626858 630989 635316 639296 642481 644634 645728 645742 644677 642922
59683 642922 641249 640104 639142 637807 636045 634081 631821 629055 626005 623002 619733 615424 609859 603719
59669 603719 597868 592677 588029 583577 579036 574563 570728 567759 565094 562241 559781 558806 559505 561080 562972
59654 562972 565322 568178 571140 573996 576990 580270 583774 587758 592491 597203 600255 600872 599865 598157
59640 598157 595460 591120 585447 579343 573131 566658 560186 554336 549333 545004 541320 538310 535633 532908
59626 532908 530327 528307 526601 524389 521217 517319 513024 508407 503608 498969 494725 490871 487455 484670
59612 484670 482552 480889 479506 478417 477671 477270 477350 478243 480148 482725 485062 486245 486190 485825 486192 487346
59596 487346 488474 489031 489239 489454 489661 489942 490779 492428 494385 496015 497357 498769 500094 500790 500664 499923
59580 499923 498646 496823 494790 492989 491293 489152 486473 483793 481439 479003 475915 472210 468507 465427
59566 465427 463209 461728 460745 460179 460073 460216 459993 458926 457318 456036 455610 455790 456019 456114 456340 456978 457970
59549 457970 459004 459928 460996 462583 464732 467219 470058 473584 478018 483378 490008 498659 509699 522721
59535 522721 537455 554525 574361 595372 614081 627411 634516 636334 634110 628833 621684 614247 607996
59522 607996 603707 601452 600980 601941 603783 605658 606770 606859 606129 604612 601808 597076 590280 581979 573095
59507 573095 564377 555935 547244 537904 528445 519996 513093 507262 501922 497159 493282 490142 487377 484906
59493 484906 482744 480749 479127 478717 480006 482109 483558 484076 484796 486670 489389 492099 494499 496874 499482
59478 499482 502355 505517 509098 513264 518061 523264 528455 533359 537966 542124 545305 547245 548511 549908
59464 549908 551335 551884 551102 549592 548219 547328 547021 547678 549709 553068 557421 562707 569200 577014 585748
59449 585748 594684 603328 611766 620465 629643 638830 647028 653157 656321 656023 652524 646807 639851 632010
59435 632010 623349 614351 605820 598178 591379 585480 580708 576856 573227 569468 566099 563954 563462 564715
59421 564715 567804 572671 578857 585892 594010 604191 617373 633722 652635 673396 695762 719951
59409 719951 745947 772716 798029 819001 832979 838386 835271 825301 811128 795572 781205 770371
59397 770371 765090 766449 773727 784007 793004 796966 794261 785334 771375 753448 732871 711680 692109
59384 692109 675652 662804 653321 646397 640987 636578 633605 632731 633825 636007 638512 641069 643548 645758
59370 645758 647618 649187 650513 651737 653210 655087 656891 657942 658233 658398 658745 658754 657778 656014 654574 654665
59354 654665 656723 660293 664748 670080 676821 685245 695096 706230 718964 733442 749103 765230 781623
59341 781623 798236 814599 830178 844905 858675 870728 880264 887341 892327 894756 893794 889671 883559
59328 883559 875953 866222 854035 840275 826169 812368 799203 786991 775601 764391 753110 742296
59316 742296 732415 723215 714347 705996 698390 691209 684021 676894 670182 664137 659128 655692 653838 652762
59302 652762 651825 651522 652913 656393 661573 668177 676400 686264 696896 706461 712695 713818 709327 700002
59288 700002 687196 672296 656648 641349 626875 613350 601373 592020 585732 581785 579361 578643 580274
59275 580274 584152 589405 595392 602119 609741 618243 627660 638265 650331 663856 678421 693203 707232
59262 707232 719781 730385 738537 743688 745715 744972 741753 736109 728462 719864 711177 702324 692887 683244
59248 683244 674655 668272 664364 662339 661224 660302 659673 660112 662118 665267 668764 672350 676289 680696 685404
59233 685404 690462 696237 702870 709878 716449 721989 726310 729441 731310 731653 730262 727234 722805 716960
59219 716960 709531 700670 690978 681118 671600 662952 655552 649139 642953 636615 630420 624529 618466 611933
59205 611933 605607 600475 596598 593226 589929 586948 584394 581798 578730 575473 572835 571520 571832 573685
59191 573685 576642 580018 583217 586102 589054 592610 596957 601809 606795 611898 617353 623208 629235 635213
59177 635213 641033 646486 651302 655546 659752 664517 670067 676151 682175 687488 691911 695959 700219 704564
59163 704564 708372 711517 714515 717616 720242 721556 721066 718551 714016 708071 701769 695545 688643 679982
59149 679982 669260 656996 644001 631270 619890 610369 602176 594443 586953 580149 574341 569318 564569
59136 564569 559590 554159 548657 543935 540572 538371 536795 535661 535185 535563 536808 538831 541528 544889 549124
59121 549124 554387 560374 566604 573167 580698 589500 599216 609517 620469 631916 643167 653806 664293
59108 664293 675282 686771 698323 709622 720406 730297 739178 747278 754539 760457 764913 768453 771259
59095 771259 772596 771975 770171 768299 766509 764454 762442 761084 760168 758947 757282 755528 753494 750468 746214
59080 746214 741025 734918 727662 719533 711156 702541 693101 682685 671877 661281 651261 642400 635386
59067 635386 630212 626041 621975 617493 612294 606461 600759 596064 592375 588924 585222 581376 577479 573421
59053 573421 569353 565593 562009 558103 553778 549443 545385 541646 538492 536258 534744 533460 532524 532622 533983
59038 533983 536043 538163 540132 542009 544153 547270 551672 556562 560960 565225 570718 577950 586205 595135
59024 595135 605531 618138 632763 649063 667275 687509 709098 731140 752993 773732 791903
59013 791903 806407 816970 823297 824601 820684 812827 802866 791819 780041 768207 757398 748528 742139
59000 742139 738361 736602 735799 735556 736585 739492 743652 747857 751518 754382 755586 754084 750017 744816 739745
58985 739745 734870 729525 723190 715801 707653 699242 691045 683345 676323 670218 665267 661694 659894 660343
58971 660343 663046 667322 672398 678047 684435 691667 699789 708952 719131 729816 740318 750264 759510
58958 759510 767746 774538 779642 782956 784212 783006 779102 772573 763734 753099 741270 728719 715798
58945 715798 702980 690780 679273 668065 657103 647237 639554 634242 630476 627427 625076 623962 624322
58932 624322 625590 626801 627449 627835 628465 629296 629861 629946 629663 628873 627091 624100 620193 615642 610492 605096
58916 605096 600283 596497 593234 589843 586565 584221 583101 582764 582821 583304 584189 585185 586327 588478 592780 599596
58900 599596 608226 617781 628088 639467 651753 664090 675879 687394 698965 710072 720085 729679
58888 729679 740524 753461 767886 783206 799844 818109 836869 854306 869597 883043 894775
58877 894775 904218 910857 914753 916104 914829 910920 904884 897468 889060 879545 868861 857644 847203
58864 847203 838674 832223 827235 823106 819507 815909 811468 805692 798808 791132 782519 772820 762519 752344
58850 752344 742464 732642 723126 714753 708020 702512 697452 692498 687684 682796 677148 670099 661667 652540
58836 652540 643429 634471 625292 615613 605669 596038 587189 579243 572092 565636 559956 555270 551761 549429
58822 549429 548059 547248 546553 545856 545595 546346 548035 549905 551420 552797 554337 555758 556691 557497 558874 560859
58806 560859 562868 564626 566345 567996 569191 569919 570717 571867 572963 573497 573367 572630 571374 570031 569208 568812
58790 568812 567868 565673 562775 560449 559502 559949 561492 563873 566842 570197 573968 578493 584275 591626 600234
58775 600234 609253 617991 626321 634053 640294 644075 645441 645216 643725 640568 635732 630077 624445 618962
58761 618962 613501 608164 603006 597842 592725 588157 584578 582045 580521 579930 579859 579857 580158 581402 583415 585113
58745 585113 585916 586464 587541 589085 590783 592889 595848 599695 604379 610161 617170 625130 633957 644054
58731 644054 655515 667592 679510 691261 703065 714583 725226 734752 743056 749848 755120 759476
58719 759476 763545 767505 771600 776493 782611 789720 797670 806912 817689 829282 840705 851478 861105
58706 861105 868416 872284 872492 869191 862026 850630 835501 817583 797379 775269 752195 729106 706040
58693 706040 682742 659921 638970 620493 603999 588952 575344 563244 552547 543322 535816 529951
58681 529951 525143 520661 515965 510914 505886 501509 498052 495391 493562 492733 492443 491734 490562 490343 492544
58666 492544 497371 504350 513315 524076 535855 547928 560164 572150 582551 590296 595685 599338 600804
58653 600804 599379 595613 590732 585051 578315 571164 564769 559144 553173 546345 539310 532757 526878 521900
58639 521900 518066 515008 512128 509636 508270 508081 508412 508975 509939 511082 511963 512864 514435 516410 517755 518089
58623 518089 517828 516990 515152 512772 511260 511366 512561 514320 516940 520696 525205 530113 535581 541646 547884
58608 547884 554032 560188 566049 570717 573684 575364 576301 576490 575838 574725 573692 572921 572224 571252 569781 568101
58592 568101 566862 566106 564919 562843 561110 561455 564046 567809 572556 579267 588192 598216 608536 619607
58578 619607 631777 644128 655462 665586 674964 683846 692378 700960 709905 719301 729551 741558 756063
58565 756063 773396 794061 818782 847583 879473 913402 948920 985629 1022672 1059137 1094251
58554 1094251 1126771 1154817 1176832 1192338 1201504 1204565 1202036 1194998 1184715 1172109 1157703 1141770
58542 1141770 1124451 1106029 1086924 1067026 1045308 1020727 993423 964520 935035 905656 877202
58531 877202 850306 824876 800821 779118 761081 746699 734791 724699 716640 710403 705057 700143
58519 700143 695975 692588 689580 687128 685795 685050 683370 680248 676787 673861 671084 668199 666009 665025 664446
58504 664446 663461 662522 662283 662285 661786 661182 661370 662224 662750 662513 662072 662132 662947 664399 666179 667967 669780 672068
58486 672068 675331 679851 685775 693141 701944 712542 725730 741837 760073 779536 800456 823430
58474 823430 847719 871387 892913 911427 925631 934082 936691 934516 927965 916702 901521 884667
58462 884667 867897 851736 837008 825289 817127 811454 807651 806702 809419 815004 822442 831909 843569
58449 843569 856099 867598 877107 884220 888131 888096 884139 876654 866140 853892 841827 830824 820330
58436 820330 810243 801904 796358 792899 790433 789126 789716 792266 796748 803840 813988 826467 840378
58423 840378 855726 872647 890499 908576 926630 943677 957342 965551 968036 965337 957476 944777
58411 944777 928957 912048 894896 877681 861017 845527 831186 818073 806925 798035 790612 784090
58399 784090 778958 775356 772225 769035 767090 767689 770152 773089 776521 781121 786301 790675 793767 795809
58385 795809 796531 795586 793528 791139 788372 785100 782038 779754 777676 775392 773991 774791 777701 782215 788971
58370 788971 798633 810107 821621 833008 845364 859031 873393 888104 903024 917521 931240 945020
58358 945020 959784 975114 990140 1004936 1019597 1032814 1043016 1050287 1055679 1059326 1060804 1060745 1060486
58345 1060486 1060605 1061116 1062472 1065057 1068448 1072555 1078567 1087257 1097232 1106511 1115072 1124288 1134763 1146444
58331 1146444 1159993 1176012 1193457 1210630 1227251 1243940 1260265 1275040 1287941 1299181 1308174
58320 1308174 1314239 1318078 1321038 1323493 1325389 1327543 1330753 1334488 1338077 1342266 1347997 1354687 1361548 1369543
58306 1369543 1380092 1392804 1406434 1421002 1436932 1453235 1468798 1484479 1501619 1519450 1536300
58295 1536300 1552438 1569275 1586584 1603045 1618877 1635563 1653516 1672268 1692159 1713555 1735286
58284 1735286 1756259 1777727 1801573 1827318 1853331 1879932 1908509 1938529 1968339 1998203 2029815
58273 2029815 2063555 2098924 2136819 2178515 2223189 2269235 2317111 2368225 2422052 2477259 2534448
58262 2534448 2594828 2657522 2721334 2787606 2857791 2929687 2999875 3068503 3137717 3206871 3273621
58251 3273621 3338462 3403666 3468853 3532409 3596360 3664964 3739076 3816655 3898140 3986419 4082070
58240 4082070 4183626 4292100 4410261 4537901 4672777 4815676 4969563 5134514 5308751
58231 5308751 5493707 5692468 5904241 6126386 6360960 6613007 6883379 7169911 7474717
58222 7474717 7803260 8157145 8535311 8941557 9383128 9862735 10380245 10941518 11557072
58213 11557072 12233050 12972885 13787127 14691986 15699491 16820039 18073904 19489163 21090116
58204 21090116 22901246 24962519 27328718 30057698 33218188 36912333 41280160 46492624
58196 46492624 52769713 60413714 69815190 81442872 95856473 113702529 135621658
58189 135621658 162114379 193452852 229512118 269281202 310221953 348192138 378455372
58182 378455372 397311246 403207096 396688759 379606897 354388571 323678866 290114967
58175 290114967 256030951 223195629 192741159 165265223 140991190 119911682 101886179
58168 101886179 86681971 73987255 63445042 54708528 47473452 41474286 36478331
58161 36478331 32294489 28774565 25797797 23260861 21082513 19203311 17573151 16145277
58153 16145277 14883322 13763301 12763856 11861781 11039590 10289291 9605024 8978468 8403719
58144 8403719 7879480 7403092 6968092 6569970 6208547 5882307 5585699 5313909 5064895
58135 5064895 4834855 4617187 4408236 4209405 4021670 3842662 3670945 3508426 3356436
58126 3356436 3213530 3078933 2954020 2838589 2729579 2625214 2526814 2435075 2348295 2265710
58116 2265710 2188864 2118051 2050859 1985782 1923958 1865881 1809654 1753978 1699856 1648035 1597767
58105 1597767 1549268 1504312 1463118 1423618 1384964 1348768 1315726 1284103 1252931 1223662 1197142
58094 1197142 1171724 1145908 1120295 1095570 1071101 1047014 1025245 1007015 991368 977295 965104
58083 965104 954607 944246 933197 922235 911505 899683 886217 872101 857421 840555 820941
58072 820941 800294 779924 759181 737831 717565 699735 683570 668034 653460 640140 627312
58061 627312 614888 604270 596148 589356 582986 577608 573093 567431 559284 549860 540714 531510 521573 511877
58047 511877 503647 496418 489255 482678 477706 474008 470538 467122 464103 461273 458273 455276 452361 449122
58033 449122 445676 442934 441074 438860 435246 430468 424827 417797 409282 400447 392283 384464 376443 368457
58019 368457 360658 352576 344434 337697 333318 330513 328090 325778 323539 320946 318126 316010 314740 313233
58005 313233 311122 309585 309276 309127 308378 308166 309644 312009 313960 315822 318620 322198 325889 330020 335077
57990 335077 340217 344225 347312 350474 353646 355912 356998 357247 356573 354661 351756 348225 343855 338580 333265
57975 333265 328682 324352 319480 314417 310110 306718 303840 301563 300182 299374 298672 298205 298107 297796 296852 295927
57959 295927 295713 295635 294656 292795 290751 288572 285859 282811 279952 277209 274297 271631 269787 268413 266737
57944 266737 264843 263465 262871 262898 263820 266208 270135 275312 281705 289316 297743 306708 316530 327277 337939
57929 337939 347272 355055 361697 367212 371416 374470 376192 375437 371385 365015 358135 351251 343538 334634
57915 334634 325244 316099 307450 299591 292835 286934 281414 276542 273187 271751 271885 273063 274682 275867
57901 275867 276109 275962 276289 277005 277435 277681 278612 280552 283012 285795 289403 294045 299049 303633 307722 311735
57885 311735 315905 319934 323080 324646 324688 324050 323361 322255 319971 316391 312066 307553 303209 299228 295332
57870 295332 290808 285477 280284 276333 273713 271923 270928 270981 271724 272406 272903 273790 275508 278069 281461 285727
57854 285727 290783 296604 303299 310540 317433 323573 329691 336466 343209 348624 352452 355362 357559 358583
57840 358583 358337 357276 355611 353203 350249 347173 343876 339873 335152 330159 325028 319633 314283 309577
57826 309577 305632 302246 299678 298383 298050 297801 297343 297018 296731 295799 293996 291921 290113 288558 287216 286178
57810 286178 285054 282853 278771 272728 265128 256596 247888 239492 231369 223567 216803 211736 207928 204419
57796 204419 201187 199085 198428 198618 199179 200135 201290 202127 202732 203884 205936 208368 210697 213069 215762 218914
57780 218914 222967 228542 235581 243333 251455 260271 269679 278750 286917 294756 302985 311299 318799 325034
57766 325034 330012 333565 335261 334820 332330 328210 323120 317601 311720 305309 298525 291778 285192 278692
57752 278692 272559 267330 263160 259833 257311 255611 254270 252772 251465 251089 251379 251192 250247 249628 250153 251271
57736 251271 252131 252736 253343 253560 252920 251830 251164 251318 252191 253642 255344 256646 257149 257182 257276 257599 258294 259866
57718 259866 262680 266396 270322 273963 276886 278630 279304 279783 280678 281436 280966 278866 275536 271494 267130
57703 267130 262856 258877 255006 251204 248040 246098 245124 244296 243229 242201 241484 240887 239985 238456 236190
57688 236190 233314 230117 226826 223539 220394 217600 215213 213133 211380 210077 209206 208891 209981 213770 220909
57673 220909 231111 244161 260619 281321 306973 338698 378187 426477 482710 544236 607031
57662 607031 665398 712298 741636 750660 739892 711429 668417 615765 559642 505180 454852 409201
57650 409201 368532 333582 304972 282529 265131 251156 239272 228919 220089 212745 206641 201489
57638 201489 197073 193256 190091 187826 186666 186601 187510 189143 190901 192070 192591 193224 194550 196153 197143 197164
57622 197164 196408 194933 192557 189307 185521 181618 178093 175444 173579 171555 168459 164397 160063 155606
57608 155606 150658 145360 140521 136685 133763 131765 131122 131895 133291 134437 135218 136006 136947 137927 138867 139561
57592 139561 139450 138067 135689 133215 131410 130498 130320 130535 130701 130515 130163 130185 130805 131561 131717 130932 129406
57575 129406 127485 125387 123271 121295 119519 117941 116734 116155 116044 115701 114592 112965 111383 109831 107837
57560 107837 105416 103294 102013 101358 100952 100930 101596 102746 103800 104487 105105 106144 107827 109879 111674 112785
57544 112785 113464 114246 115068 115227 114399 113157 112224 111714 111519 111853 112809 113791 114075 113701 113147 112407 111159 109770
57526 109770 109268 110153 111831 113423 114572 115281 115540 115509 115636 116194 116964 117672 118594 120366 123231 126664 129772
57509 129772 131980 133360 134353 135295 136291 137423 138749 140001 140586 140121 138753 136707 133914 130463 127132
57494 127132 124825 123558 122486 120960 119105 117381 116105 115496 115645 116194 116414 115910 114992 114174 113574 113036
57478 113036 112538 112233 112188 112321 112476 112438 112010 111235 110446 109929 109535 108703 106900 104105 101020 98794 98349 99811
57460 99811 102515 105506 108037 109856 111249 112786 114787 116961 118641 119367 119174 118444 117560 116622 115410 113784
57444 113784 112147 111165 110860 110373 109077 107564 107005 107642 108543 108844 108651 108570 108882 109447 110038 110475 110629 110551
57426 110551 110427 110316 110156 110113 110647 111958 113471 114117 113239 111294 109675 109564 110760 111806 111553 110415 109701
57409 109701 109943 110496 110702 110754 111170 112038 113193 114628 116217 117350 117398 116459 115259 114329 113564 112595 111310
57392 111310 110031 109322 109597 110737 112114 113165 113974 115149 117166 119945 123075 126283 129540 132774 135589
57377 135589 137467 138334 138779 139532 140712 141759 142132 141876 141382 140741 139594 137697 135426 133455 131902 130131
57361 130131 127672 125090 123370 122498 121300 118988 116295 114612 114453 115378 117043 119524 122615 125577 127804
57346 127804 129310 130433 131499 132849 134693 136717 138154 138478 137814 136676 135555 134693 133909 132709 131003
57331 131003 129566 129280 129959 130582 130629 130475 130463 130485 130786 132144 134681 137195 138423 138428 138081 137673 136854 135571
57313 135571 134241 133127 132205 131594 131464 131584 131452 130898 130138 129359 128739 128646 129245 129991 130132 129681 129348 129468
57295 129468 129624 129400 128874 128197 127278 126192 125373 124998 124536 123270 121057 118277 115364 112705 110769 109801
57279 109801 109390 108709 107416 106125 105827 106879 108695 110447 111921 113632 116254 120175 125460 131854 138656
57264 138656 144984 150489 155527 160345 164437 167170 168806 170333 172337 174623 176953 179498 182290 184831
57250 184831 186723 188352 190517 193489 196812 199890 202472 204657 206747 209106 211898 214908 217746 220309
57236 220309 222878 225768 228938 232029 234691 236874 238833 240893 243263 246022 249169 252577 256042 259491
57222 259491 263088 266910 270648 273895 276744 279738 283099 286404 289299 292233 296043 300937 306262 311296
57208 311296 315874 320178 324251 328002 331463 334794 338154 341732 345814 350532 355643 360812 366176 372321
57194 372321 379503 387180 394582 401633 408968 417037 425534 433877 441957 450155 458757 467682 476729 485825
57180 485825 494979 504270 514034 524870 537183 550718 564702 578495 592025 605620 619585 634049
57168 634049 649079 664671 680576 696388 712021 727992 744920 762758 780845 798862 817402
57157 817402 837269 858367 879782 900974 922464 945086 968889 993163 1017423 1041956 1067324
57146 1067324 1093628 1120464 1147378 1174198 1201058 1228290 1256227 1284895 1313929 1343050 1372605
57135 1372605 1403393 1435875 1469840 1504954 1541359 1579484 1619577 1661855 1706969 1755765 1808491
57124 1808491 1864659 1923901 1986522 2053001 2123403 2197817 2277125 2362768 2455825 2556901 2666981
57113 2666981 2787858 2921487 3069303 3232507 3412720 3612192 3833778 4081208 4359302
57104 4359302 4673822 5031676 5441904 5916489 6470146 7120154 7887763 8800304 9891964
57095 9891964 11203272 12780974 14677937 16950665 19654065 22835857 26531517 30757990
57087 30757990 35506832 40741661 46402139 52409860 58671164 65078004 71507713 77814778
57079 77814778 83809688 89238987 93793793 97158118 99076299 99405863 98137768 95386481
57071 95386481 91358771 86310687 80506816 74196557 67609589 60958359 54435575 48206069
57063 48206069 42398744 37101727 32361271 28185637 24554086 21427378 18755799 16484486
57055 16484486 14557798 12922912 11532044 10343865 9324491 8446906 7688602 7029792
57047 7029792 6453890 5948341 5503462 5110398 4760715 4447310 4164537 3907601 3672749
57038 3672749 3457965 3262439 3085064 2924081 2778180 2647135 2531013 2429366 2341542 2267444
57028 2267444 2207715 2163545 2136555 2128460 2139929 2168766 2208445 2248407 2276700 2283620 2263805 2215971
57016 2215971 2141966 2046598 1937395 1822965 1710734 1605767 1510860 1426855 1353065 1288140
57006 1288140 1230822 1179908 1134089 1092500 1055121 1021951 991979 963741 936815 912009 889954
56995 889954 870194 851857 834608 818681 804406 792023 781679 773462 767544 764329 764236 767348 773370
56982 773370 781611 790585 797880 801012 798513 789978 775434 755327 731056 704812 678629 653855 631327
56969 631327 611444 594031 578719 565614 555251 547967 543819 543106 546382 553872 565359 580707 599859
56956 599859 621967 644784 665065 679469 685479 682154 670251 651329 626835 598299 567961 538309
56944 538309 510974 486638 465879 449251 436594 427257 421323 419871 423717 432658 446287 464849
56932 464849 488836 518115 551545 586671 619473 645255 660477 663634 654533 633791 603526 567616
56920 567616 530235 494101 460266 428950 400074 373616 350059 330147 313798 299788 287008
56909 287008 275518 265812 257587 249947 242477 235443 229184 223912 219832 216931 214838 213389 213041 214210
56895 214210 216524 219347 222907 228332 236618 247998 262223 279033 298424 320727 346208 374113
56883 374113 402115 426936 445532 455918 457637 451957 441184 427272 411264 394223 377953 364159
56871 364159 353407 345617 341199 340961 345289 354224 368237 388105 414138 446284 484957 530827 583315
56858 583315 639478 694330 742020 777121 795875 796953 781292 751522 711658 666660 621200 578465
56846 578465 540229 507758 482212 464472 455208 455073 464389 482961 510774 548706 597979 659105
56834 659105 731793 815121 906167 997989 1080029 1141656 1175905 1180604 1157274 1109747 1043445 965068
56822 965068 882114 801654 728645 665158 611440 567563 533844 510311 496756 493400 500753 518765
56810 518765 546774 584423 631899 688809 752833 819103 880242 927520 953682 955843 935737 897291
56798 897291 844628 782218 715397 649414 588043 533460 486915 448838 418630 395247 378214
56787 378214 367881 364792 369057 380247 397691 420830 449269 482105 516952 549788 576069 592147
56775 592147 595959 587042 566376 536156 499450 459735 420268 383303 349670 319277 292000 267966
56763 267966 247228 229669 215166 203416 193603 184794 176813 170279 165583 162227 159297 156247 153047
56750 153047 149949 147309 145348 143914 142653 141433 140364 139428 138484 137573 136843 136212 135510 134883 134529 134150
56734 134150 133348 132520 132516 133245 133490 132532 131185 130732 131494 132966 134737 136521 137808 138282 138440 139105 140395
56717 140395 141684 142480 142846 143011 143020 142847 142544 142253 142230 142735 143708 144664 145128 145092 144901 144878 145227 146094 147390 148642
56697 148642 149177 148565 146935 145043 143896 143931 144506 144578 143915 143220 142995 142905 142535 142196 142488 143442 144577 145576
56679 145576 146472 147366 148384 149800 151807 154172 156333 157773 158274 158011 157561 157589 158344 159628 161268 163256
56663 163256 165354 167054 168181 169123 170199 171188 171747 171884 171765 171508 171545 172659 175116 178075 180370 181618
56647 181618 182131 182113 181603 180952 180660 180656 180269 178976 176851 174297 171673 169266 167347 166180 165998 166811 168145
56630 168145 169251 169783 170041 170307 170309 169669 168536 167389 166369 165225 163764 162022 160211 158775 158262 158687
56614 158687 159256 159160 158537 158250 158810 159904 160831 161044 160362 159070 157822 157120 156947 157029 157241 157440 157219 156363
56596 156363 155415 155277 156249 157828 159403 160718 161627 161924 161645 161302 161585 162845 164865 167083 169097 170974
56580 170974 172956 174924 176507 177757 179223 181094 182727 183467 183614 184092 185398 187295 189383 191550 194014
56565 194014 197306 202068 208467 215938 223862 232404 242388 254582 269381 286763 305887 324822 341373
56552 341373 354408 364118 371069 375396 377032 376413 374762 373611 373777 374657 374836 373573 371354 368789 365583
56537 365583 361141 355651 349829 343825 337195 329876 322475 315541 309194 303544 298851 295128 292019 289208
56523 289208 286586 283926 280858 277251 273218 268658 263186 256690 249635 242582 235594 228280 220323 211930
56509 211930 203724 196214 189366 182852 176719 171520 167702 165173 163574 162529 161470 159770 157442 155298
56495 155298 154029 153535 153481 153951 155057 156422 157631 158774 159983 160983 161716 162852 164886 167214 169003
56480 169003 170482 172339 174251 175185 174994 174528 174231 173777 173179 173093 173790 174858 176212 178420 181695 185427
56464 185427 189049 192521 195692 198009 199217 199548 198972 197181 194676 192869 192502 192800 192776 192555 192715 193079
56448 193079 193109 192984 193435 194736 196565 198592 200573 202104 202932 203428 204169 205161 205939 206328 206585 206844 206952
56431 206952 206933 207143 207708 208079 207595 206496 206059 207372 210009 212272 212933 212436 212117 212599 213380 213735 213467 212857
56413 212857 212391 212547 213419 214571 215553 216374 217104 217360 216812 215997 215820 216338 216752 216588 216105 215556 214844 214052
56395 214052 213491 213032 212167 211035 210566 211239 212316 212756 212392 211861 211832 212607 214056 215684 217056 218256 219550
56378 219550 220736 221429 221923 222914 224336 225358 225676 225942 226619 227338 227744 228077 228469 228528 228210 228307 229383 230943
56360 230943 232243 233344 234695 236267 237774 239225 240631 241678 242349 243387 245396 247880 249844 251011
56346 251011 251732 252038 251678 250959 250726 251263 251825 251501 250250 248878 248133 247988 247875 247605 247847 249489 252682
56329 252682 256855 261473 266372 271493 276839 282605 288799 294802 299855 303880 307184 309571 310643 310826
56315 310826 311017 311123 310028 307271 303760 300558 298003 296242 295498 295318 294746 293815 293846 295672 298584 301673
56299 301673 305034 308838 312326 314806 316767 319053 321675 324344 327309 330641 333492 335202 336479 338352
56285 338352 340580 342243 343381 344843 346925 349390 352502 356753 361670 366022 369331 372368 376152 381159
56271 381159 387365 394301 401117 407249 412914 418564 424240 430028 436633 444764 454353 465079 477118 490517
56257 490517 504433 518097 532256 548571 567748 589244 612779 639154 669482 704335 743731
56246 743731 787352 834808 886100 941569 1000927 1062755 1125627 1189272 1253729 1317633 1378304
56235 1378304 1433418 1481779 1522529 1554515 1576691 1588645 1590626 1583373 1567770 1544376 1513495 1475985
56223 1475985 1433541 1387860 1340002 1290918 1241860 1193714 1146499 1100135 1055053 1011535 969332
56212 969332 928689 890864 856612 824948 794474 765218 738025 712872 689175 667221 647855
56201 647855 630953 615537 601257 588562 577572 567924 559617 552855 547147 541650 536381 532085 529003
56188 529003 526684 524858 523590 522721 522111 522195 523312 524718 525305 525111 525125 525873 527189 529106 531749 534522
56172 534522 536607 538221 540298 543004 545684 548213 551284 555324 560075 565286 570977 577157 584133 592780
56158 592780 603482 615108 626143 636631 647900 660689 674740 690026 707105 726343 747918
56147 747918 772481 800716 832562 868143 909292 958894 1018786 1089463 1171498 1265707 1371807
56136 1371807 1488141 1612597 1742522 1873793 2001407 2121330 2231082 2329137 2415297 2491407
56126 2491407 2560092 2622411 2677556 2724234 2760888 2785204 2795487 2792751 2779895 2758754 2729254
56115 2729254 2690904 2642960 2583030 2507820 2416112 2309796 2192000 2066022 1936331 1808473
56105 1808473 1686933 1574095 1471568 1380953 1302870 1236597 1181176 1135748 1098771 1068427 1044032
56094 1044032 1025584 1011826 1000418 990269 982064 976144 971637 968121 966469 967276 969739 972676 975558
56081 975558 978309 981310 985678 992216 1000066 1007727 1015226 1023692 1033082 1042248 1051155 1060957 1071807 1082714
56067 1082714 1093772 1106291 1120298 1134079 1146762 1159419 1173104 1187648 1202855 1218979 1235608
56056 1235608 1251950 1268485 1286397 1305146 1322720 1338514 1353760 1368962 1383353 1397230 1412245
56045 1412245 1428829 1445743 1462706 1481010 1500975 1521377 1542030 1564313 1588451 1612894 1637157
56034 1637157 1662750 1690574 1720039 1751437 1786359 1824865 1864963 1905762 1948446 1993349 2038958
56023 2038958 2084605 2131195 2178417 2224374 2268973 2314554 2362162 2410481 2459512 2511888 2569185
56012 2569185 2630158 2693873 2761334 2832784 2906738 2982941 3062975 3146911 3233037 3321865 3416452
56001 3416452 3517589 3622853 3731679 3847019 3970562 4100877 4237789 4383896 4540075
55992 4540075 4704400 4877209 5062107 5260113 5468361 5686711 5920021 6171505 6439650
55983 6439650 6724238 7029468 7358553 7711466 8090738 8502996 8952016 9437171 9961585
55974 9961585 10534546 11163255 11850660 12604858 13441839 14375501 15414838 16575437 17883743
55965 17883743 19365960 21044610 22952164 25137840 27658496 30579972 33997499 38045432
55957 38045432 42888426 48729528 55843647 64594877 75427635 88872689 105556534 126137512
55949 126137512 151173946 181017605 215672174 254374043 294932122 333456268 365131485
55942 365131485 385805731 393301656 387629192 370348734 343894853 311214694 275456834
55935 275456834 239491704 205465691 174667670 147680036 124596252 105192956 89073017
55928 89073017 75780954 64863875 55895301 48499932 42373305 37273137 32998730 29387126
55920 29387126 26316201 23692503 21435050 19475897 17766796 16272198 14957841 13792791
55912 13792791 12756376 11833734 11007763 10262193 9588055 8979746 8427936 7922405 7458228
55903 7458228 7033113 6641881 6278901 5942736 5633190 5346677 5079075 4830006 4599875
55894 4599875 4385854 4184999 3998130 3826414 3667154 3517032 3376470 3246791 3126109
55885 3126109 3012025 2905496 2808085 2718162 2633572 2555184 2483783 2416113 2348052 2279421 2211997
55874 2211997 2145206 2077647 2010599 1946019 1882892 1819216 1755862 1695035 1636664 1579739 1525483
55863 1525483 1475830 1430284 1387561 1348719 1315400 1286390 1259097 1233064 1208969 1185661 1161534
55852 1161534 1137544 1115547 1094593 1072081 1047780 1023599 999980 975541 949960 924577 900289
55841 900289 877022 854948 834285 814450 795116 777279 761559 746613 731158 716346 704012
55830 704012 693720 683741 673831 664756 656145 647185 638468 630746 622763 612764 601402 590745 581071
55817 581071 571130 560923 551619 543067 533921 524214 515514 508557 502828 498459 496416 496616 497737 499155
55803 499155 501563 505577 511163 518372 527256 537090 546936 556762 566810 576245 583780 589192 592837 594195
55789 594195 592456 588110 582359 575321 566378 556036 545744 535959 525893 515081 503767 491797 478589
55776 478589 464320 450025 436570 424605 415318 410027 409040 411848 418081 427219 437666 447199 454179
55763 454179 457549 456379 450604 441701 431362 419938 407337 394763 384093 375863 369200 363385 358118
55750 358118 352683 346332 339335 332358 325145 317106 308809 301334 294448 287059 279370 272992 268766 265929
55736 265929 263613 261812 260593 259556 258451 257399 256239 254474 251954 248913 245384 241333 237185 233344
55722 233344 229396 224592 218911 212966 207317 202683 200148 199979 200760 200916 200691 201460 203654 206821 211171
55707 211171 217328 224647 231414 236714 240659 242808 242161 238963 234870 230781 225885 219471 212433 206224
55693 206224 201316 197314 193859 190785 187941 185295 182820 180218 177311 174801 173925 175256 178309 182312
55679 182312 186768 191346 195854 200272 204331 207340 209012 210077 211355 212664 213407 213709 213951 213653 212028
55664 212028 209365 206688 204298 201895 199924 199481 200817 203100 205724 208719 211875 214628 216968 219441
55650 219441 222166 224827 227570 230866 234471 237596 240049 242067 243137 242261 239484 235905 232042 227367
55636 227367 221536 214861 207375 198834 189968 182361 176570 171474 165997 160451 155679 151879 148843 146517
55622 146517 144852 143703 143111 143005 142662 141414 139817 139020 138904 138184 136468 134759 133564 132008 129528 127042
55606 127042 125527 124576 123291 121637 119975 118127 115894 113875 112848 112748 112940 113000 112689 111686 110010 108322
55590 108322 107300 107056 107406 108143 108770 108633 107748 106929 106743 106925 107064 107098 106866 106052 105043 104999 106509 108930
55572 108930 111608 114985 119749 125601 131654 137570 143563 149527 154858 159017 161934 163988 165715 167205
55558 167205 167710 166320 163084 158908 154379 149472 144445 140090 136788 134197 132119 130753 129819 128523 126855
55543 126855 125820 125803 125788 124958 123962 123673 123737 123441 123193 123815 124939 125403 124982 124554 124717 125254 125834 126230 125868
55524 125868 124149 121392 118690 116621 114731 112485 110120 108277 107129 106155 104643 102322 99623 97320
55510 97320 95857 95061 94491 93809 92842 91645 90605 90132 90096 89940 89451 88981 88783 88644 88426 88418 88793 89161 89014
55491 89014 88299 87266 86100 85008 84263 83948 83971 84410 85381 86472 86900 86517 86074 86260 86991 87889 88756 89312
55473 89312 89177 88551 88242 88576 88946 88869 88704 88765 88483 87281 85665 84617 84281 84056 83687 83500 83694 84036 84198
55454 84198 83985 83422 82877 82765 82848 82349 81118 80087 80064 80683 81156 81446 81920 82413 82529 82524 82948 83618 83853 83613
55434 83613 83530 83821 83959 83537 82823 82283 82061 82050 82087 82015 81904 82151 83052 84357 85581 86585 87455 87995 87905 87446
55414 87446 87470 88645 90877 93498 95794 97394 98375 99050 99576 99833 99653 98961 97739 96166 94742 93889 93393
55397 93393 92743 91955 91434 91051 90275 89390 89508 90875 92165 92196 91498 91260 91524 91516 91222 91434 92409 93548 94362
55378 94362 94852 94898 94131 92567 90739 89067 87450 85494 82759 78963 74333 69602 65366 61751 58976
55363 58976 57584 57548 57787 57437 57097 57849 59493 60879 61751 62978 64902 66674 67586 68006 68484 68799 68518
55346 68518 67951 67905 68818 70521 72654 74834 76575 77423 77300 76680 76266 76350 76473 76017 75139 74717 75200 76094
55328 76094 76903 77937 79589 81382 82499 82893 83091 83225 83109 82972 83226 83597 83455 82956 82865 83175 82878 81400
55310 81400 79418 77892 77004 76507 76450 77039 78178 79590 81145 82797 84390 85730 86636 86888 86445 85726 85311
55293 85311 85315 85395 85405 85650 86470 87904 89729 91445 92296 91796 90323 88829 88011 87982 88451 88704 87792 85589 83487
55274 83487 83143 84468 85768 85972 85697 85839 86160 85930 85133 84273 83575 83121 83289 84213 85107 84995 84018 83313
55256 83313 83480 83815 83272 81751 80150 79445 80005 81555 83459 84978 85630 85588 85604 86270 87307 87871 87658 87338
55238 87338 87683 88568 89227 89225 88748 88070 87238 86298 85405 84588 83704 82679 81598 80596 79898 79885 80767 82164 83335
55219 83335 83908 84155 84522 85074 85489 85504 85311 85429 86000 86309 85518 83974 83170 83989 85572 86485 86445 86114 85670
55200 85670 84650 83181 82262 82490 83236 83527 83269 83179 83797 84838 85496 85305 84732 84701 85474 86368 86843 87346 88510
55181 88510 90007 90953 91157 91155 91202 91088 90799 90505 89915 88558 86766 85528 85253 85445 85743 86388 87509 88776
55163 88776 90052 91543 93063 93971 94175 94383 94962 95362 95173 94935 95292 95956 96215 95953 95542 95082 94343 93218
55145 93218 91791 90225 88878 88257 88468 88979 89118 88594 87474 86157 85417 85859 87072 87963 88159 88380 89154
55128 89154 89984 90303 90385 90607 90500 89492 88127 87541 87928 88410 88408 88301 88556 88860 88492 87238 85667 84582
55110 84582 84336 84678 85213 85880 86770 87725 88500 89253 90347 91689 92854 93907 95374 97142 98215 98026 97331
55093 97331 97243 97912 98756 99484 100226 100998 101685 102359 103071 103574 103679 103671 103876 104108 103995 103578 103078 102353 101162 99767
55073 99767 98706 98084 97592 97129 96914 97042 97352 97657 97751 97287 96067 94444 93122 92521 92473 92461 92004 91060 90170
55054 90170 90033 90746 91764 92630 93318 93779 93772 93440 93390 93772 93900 93354 92788 92948 93438 93326 92598 92045 91951 91857
55034 91857 91617 91774 92676 93921 94879 95265 95090 94533 93973 93750 93831 94042 94447 95021 95147 94110 92137 90325
55016 90325 89400 89077 88787 88449 88309 88503 89084 90134 91569 93036 94226 95141 95947 96762 97648 98646 99678
54999 99678 100518 100992 101208 101572 102481 103836 104926 105095 104587 104360 104962 106012 106938 107683 108400 108989 109386 109862
54981 109862 110584 111371 112304 113957 116345 118267 118594 117827 117403 117800 118345 118706 119329 120318 120945 120659 119675 118280
54963 118280 116375 114067 111962 110449 109333 108519 108412 109202 110380 111400 112293 113220 113965 114321 114488 114589
54947 114589 114242 113112 111591 110380 109703 109326 109103 109059 109149 109287 109479 109665 109725 109868 110601 111963 113213 113741
54929 113741 113909 114427 115236 115766 116100 117083 119165 121827 124385 126824 129539 132742 136542 141292 147332 154392
54913 154392 161581 167969 173035 176599 178606 179007 177715 174622 169883 164195 158538 153419 148547 143477
54899 143477 138449 134205 131050 128480 125918 123430 121448 120053 118884 117640 116348 115220 114518 114537 115356
54884 115356 116583 117579 118110 118659 120031 122689 126456 130766 135206 139821 144868 150293 155640 160571 165255
54869 165255 169970 174437 177758 179092 178298 176027 173185 170220 166830 162523 157432 152327 147811 143843
54855 143843 140146 136714 133744 131422 129978 129428 129007 127433 124262 120550 117651 115771 114290 112996 112143
54840 112143 111542 110594 109246 108125 107625 107500 107442 107338 106890 105713 104091 103007 103121 104229 105830 107615
54824 107615 109174 109852 109329 107984 106428 105052 104129 103829 103855 103599 102908 102305 102188 102338 102430 102510 102651 102678 102653
54805 102653 103107 104364 106028 107550 108848 109972 110690 110986 111517 112907 114841 116462 117418 117882 117801 116929
54789 116929 115607 114773 114890 115371 115359 114763 114316 114781 116230 118007 119303 119839 119990 120208 120511 120704 120873 121353
54771 121353 122273 123436 124679 126131 128090 130804 134316 138364 142462 146347 150401 155488 162159 169944
54757 169944 177436 183186 186631 188144 188212 186806 183810 179745 175505 171349 166743 161403 156002 151489 148037
54742 148037 145080 142078 138880 135560 132368 129814 128411 128226 128814 129563 130026 130095 130038 130216 130663 131124 131606
54725 131606 132586 134446 136963 139570 141875 143795 145608 148195 152734 159538 167391 174497 179920 183701
54711 183701 185902 186245 184624 181291 176460 170306 163455 156942 151455 147034 143560 140988 138915 136532
54697 136532 133439 130171 127544 125777 124646 124151 124485 125395 126092 125902 124795 123288 122075 121702 122239 123097
54681 123097 123377 122633 121242 119962 119232 118940 118735 118317 117499 116264 114881 113830 113400 113385 113341 113084 112823 112762
54663 112762 112825 112855 112939 113311 113990 114688 115120 115284 115399 115591 115700 115397 114548 113505 112964 113417 114680 115976 116519
54644 116519 116066 115023 114152 114117 115137 116839 118474 119383 119380 118702 117628 116355 115200 114639 114835 115255 115160 114443
54626 114443 113668 113303 113289 113427 113620 113569 112820 111573 110915 111619 113071 114056 114326 114622 115300 115838 115821 115594 115655
54607 115655 116057 116729 117755 118972 119853 120153 120194 120181 119774 118747 117548 116696 116087 115412 114831 114636 114599 114297
54589 114297 113832 113618 113668 113681 113670 113904 114357 114806 115369 116299 117311 117757 117571 117427 117845 118700 119727 120872 121905
54570 121905 122249 121613 120418 119280 118381 117664 117298 117577 118491 119714 120896 121814 122348 122563 122724 123084 123662
54553 123662 124305 124788 124829 124272 123402 122899 123184 123930 124440 124530 124818 126086 128458 131264 133652 135267 136320
54536 136320 137157 137928 138640 139240 139559 139403 138909 138579 138657 138682 138096 137196 136956 137777 138887 139244 138664 137709 136728
54517 136728 135474 133687 131678 130213 129900 130729 132111 133338 134079 134448 134604 134442 133782 132791 132002 131805 132032
54500 132032 132127 131733 130987 130288 129903 129864 130052 130152 129688 128483 127097 126417 126628 127005 126994 127094 128143 129986
54482 129986 131536 132160 132375 132972 134007 135060 136037 137222 138708 140225 141519 142545 143307 143790 144106 144489
54466 144489 145085 145868 146781 147775 148715 149398 149724 149768 149657 149498 149439 149673 150268 151033 151615 151695 151153 150150 149047
54447 149047 148129 147334 146388 145230 144191 143616 143352 142745 141211 138832 136462 135121 135129 135787 136115 135908 135793
54430 135793 136213 136800 137140 137712 139377 142020 144456 145906 146929 148535 150831 153001 154239 154278 153295 151857
54414 151857 150781 150476 150454 149868 148501 146907 145728 145291 145697 146732 147769 148255 148274 148111 147449 145727 143380
54397 143380 141830 141910 142981 144012 144894 146133 147814 149583 151351 153295 155257 156696 157304 157323 157227 157308 157496
54380 157496 157350 156408 154747 153086 152123 151934 152165 152512 152795 152835 152663 152592 152785 153011 153128 153512 154536 155820
54362 155820 156595 156709 156883 157934 160078 162977 166071 168843 171007 172547 173493 173824 173675 173304 172635 171195
54346 171195 168889 166477 164818 163879 163007 161928 160869 159862 158618 157123 155755 154730 153920 153212 152583
54331 152583 151798 150632 149484 149146 149744 150393 150205 149278 148443 148358 149019 149863 150162 149548 148370 147325 146761 146576
54313 146576 146697 147166 147662 147511 146448 144996 143793 142821 141612 139960 138152 136674 135932 136107 137008 138120
54297 138120 138997 139603 140237 141156 142316 143446 144369 145232 146256 147260 147771 147761 147872 148511 149121 148946 148231 147939
54279 147939 148392 148983 149252 149472 149979 150620 151176 151681 152009 151732 150790 149805 149327 149223 149132 149028 148944 148678 148243
54260 148243 148149 148713 149503 150049 150688 152038 153867 155183 155464 155226 155301 155973 156873 157414 157319 156940 156941 157476 157884
54241 157884 157468 156342 155148 154222 153533 153157 153220 153404 153098 152135 150925 149876 149138 148966 149734 151305 152870
54224 152870 153716 153861 153679 153266 152596 152087 152441 153794 155363 156124 155684 154349 152576 150752 149397 149067 149741
54207 149741 150579 150737 150277 149836 149523 148756 147346 146030 145539 145622 145546 145214 145139 145463 145724 145675 145777 146598 148133
54188 148133 149937 151683 153256 154517 155282 155562 155651 155868 156254 156547 156499 156205 155986 155930 155720 155114 154481 154553 155569
54169 155569 156856 157421 156884 155725 154642 153829 152954 151815 150785 150436 150810 151282 151179 150332 148970 147378
54153 147378 145842 144723 144217 144090 143871 143391 142966 143048 143781 144925 146101 147057 147759 148337 148922 149523 149980 150088
54135 150088 149865 149705 150096 151071 152120 152787 153127 153360 153314 152740 152025 151963 152650 153243 153130 152825 153174 154070 154646
54116 154646 154631 154821 156001 157890 159479 160174 160283 160490 161216 162532 164348 166407 168184 169166 169299 168942 168313
54099 168313 167321 166134 165473 165941 167299 168896 170605 172746 175197 177302 178788 180241 182439 185627 189472
54084 189472 193180 195590 195953 194864 193837 193608 193492 192659 191230 189610 187693 185558 184170 184282 185041 184875
54068 184875 183542 182209 181601 181261 180801 180692 181311 182139 182545 182688 183006 183320 183155 182595 182210 182382 183245 185131
54050 185131 188367 192635 197039 201010 204724 208464 212000 214909 217263 219470 221564 223165 224342 226019
54036 226019 229021 232966 236692 239710 242665 246283 250520 255031 259823 264883 269594 273219 275785 277961
54022 277961 280180 282397 284589 286853 288930 290179 290258 289500 288495 287565 286720 285755 284229 281636 277794 272957
54006 272957 267557 262013 256765 252160 248149 244286 240149 235690 231215 227129 223672 220740 218008 215323
53992 215323 212829 210605 208436 206252 204525 203797 203892 204022 203604 202645 201387 200065 199049 198707 198927 199111
53976 199111 198809 198107 197308 196520 195713 194954 194382 194061 193924 193790 193479 193083 193000 193521 194460 195438 196427 197721 199428
53957 199428 201353 203325 205370 207521 209791 212330 215422 219382 224587 231393 239730 248967 258448 267908
53943 267908 276996 284758 290244 293467 295189 295900 295639 294669 293561 292567 291541 290460 289440 288293 286861
53928 286861 285733 285790 286906 288077 288972 290413 292976 296166 299457 303183 307709 312574 317279 322238 328109
53913 328109 334776 341752 349000 356486 363433 369099 373992 379285 385135 390439 394209 396365 397216 397009 396098
53898 396098 394863 393317 391324 389135 387030 384447 380314 374425 367765 361242 354748 347787 340344 332704
53884 332704 324929 317061 309519 302809 296982 291732 286889 282567 278938 276032 273622 271180 268132 264344
53870 264344 260174 256012 251994 248277 245167 242643 240054 236730 232874 229415 226896 224779 222032 218318
53856 218318 214381 211313 209558 208716 208173 207712 207393 207087 206438 205367 204360 204047 204501 205079 205092 204574 204240
53839 204240 204608 205297 205459 204818 203943 203424 203152 202692 202047 201666 201816 202323 202861 203165 203039 202527 202118 202408 203430
53820 203430 204572 205256 205486 205659 206183 207348 209249 211533 213490 214702 215483 216444 217773 219211 220632 222269
53804 222269 224357 226921 230020 233906 238693 244046 249444 254699 259983 265429 270922 276303 281541 286632
53790 286632 291444 295670 298866 300637 301089 301063 301594 302984 304676 306041 306878 307043 306146 304063 301302 298322
53774 298322 294807 290201 284717 279165 273961 269027 264552 261016 258257 255338 251628 247449 243449 239928
53760 239928 237008 234735 232689 230148 227039 224148 221986 220169 218301 216658 215377 213873 211902 210417
53746 210417 210242 210534 209875 208517 208108 209233 210647 211206 211271 211711 212547 213208 213287 212528 210842 208875 207875
53729 207875 208354 209496 210337 210915 211657 212406 212913 213749 215782 218947 222361 225503 228498 231296 233439 234756
53713 234756 235714 236887 238541 240733 243289 245627 247170 248084 249147 250723 252418 253942 255752 258413 261754
53698 261754 265110 268144 271001 273864 276883 280405 284765 289714 294466 298441 301688 304433 306523 307600
53684 307600 307627 306929 305751 304073 301909 299562 297423 295631 294044 292540 291220 290302 289856 289705 289587 289424
53668 289424 289372 289567 289902 290101 289994 289589 288947 288154 287394 286901 286741 286799 286976 287220 287280 286702 285230 283117 280894
53649 280894 278988 277697 277286 277758 278672 279501 280190 281112 282455 283924 285097 285886 286656 287988 290307 293472
53633 293472 296770 299504 301592 303377 304965 306150 307016 308163 310150 312960 316265 319924 323957 328242
53619 328242 332566 336868 341206 345548 349815 354142 358847 364125 369824 375555 380945 385848 390345 394498
53605 394498 398111 400914 403037 405099 407602 410439 413233 415988 419027 422217 424669 425544 425049 424350 424346 424726
53589 424726 424426 423001 421226 420166 419873 419469 418439 417336 416856 416614 415389 412536 408673 404872 401574
53574 401574 398543 395612 393008 390935 389132 387087 384634 382218 380525 379834 379752 379553 378795 377638 376624
53559 376624 376165 376202 376280 376002 375488 375350 376088 377484 378702 379072 378715 378354 378606 379568 380939 382309 383376 384156
53541 384156 385170 387186 390540 394782 399135 403283 407559 412521 418500 425496 433151 440787 447827 454362
53527 454362 461189 469137 478553 489423 501683 515127 529289 543774 558599 573878 589286 604327
53515 604327 619174 634782 651902 670342 689516 709459 730809 753878 778260 803573 830090
53504 830090 858195 887350 916152 943522 969524 994853 1019885 1044462 1068283 1091067 1112526
53493 1112526 1132675 1152207 1172045 1192456 1212957 1233178 1253284 1273325 1292748 1311050 1328593
53482 1328593 1346249 1364401 1382744 1400869 1418566 1435633 1451917 1467593 1482901 1497460 1510244
53471 1510244 1520388 1527727 1532428 1534478 1533825 1530673 1525251 1517391 1506677 1493122 1477580 1461340 1445286
53458 1445286 1429402 1413066 1395733 1377189 1357293 1335878 1313142 1289789 1266437 1243035 1219276
53447 1219276 1195377 1171989 1149433 1127574 1106481 1086592 1068004 1050128 1032430 1015214 999412
53436 999412 985861 975052 967217 962194 959280 957609 956762 956904 958416 961445 965704 970652 976139 982924
53422 982924 992165 1004156 1017897 1032241 1047158 1063482 1081685 1101482 1122549 1144999 1168977 1194227
53410 1194227 1220437 1247775 1276838 1308103 1341577 1376931 1413844 1452189 1492035 1533533 1576858
53399 1576858 1622177 1669585 1719049 1770483 1823889 1879305 1936597 1995435 2055482 2116385 2177577
53388 2177577 2238417 2298756 2359084 2419784 2480319 2539426 2595957 2649304 2699159 2745385 2788115
53377 2788115 2827564 2863573 2895627 2923504 2947582 2968277 2985349 2998002 3005480 3007274 3002889 2991690
53365 2991690 2973099 2946802 2912825 2871624 2824122 2771432 2714466 2653940 2590768 2526234 2461608
53354 2461608 2397701 2334923 2273634 2214224 2156936 2101811 2048825 1997896 1948762 1901030 1854306
53343 1854306 1808136 1762005 1715828 1670479 1627330 1586976 1548780 1512024 1477121 1445201 1416735
53332 1416735 1391187 1368006 1347296 1329286 1313612 1299518 1286509 1274488 1263337 1252625 1241768
53321 1241768 1230442 1218851 1207581 1197046 1187138 1177583 1168547 1160541 1153790 1148045 1143150 1139428 1137300
53308 1137300 1136779 1137528 1139225 1141745 1145251 1150246 1157226 1166068 1176076 1186896 1199083 1213480 1230296
53295 1230296 1249150 1269777 1292209 1316406 1342205 1369626 1398741 1429171 1460121 1491025 1521701
53284 1521701 1551672 1579795 1605072 1627700 1648807 1669072 1687873 1703912 1716309 1724805 1729231 1729403
53272 1729403 1725669 1719016 1710216 1699072 1684927 1667710 1648033 1626366 1602663 1576874 1549298 1520244
53260 1520244 1489811 1458264 1426201 1394015 1361515 1328427 1294902 1261200 1227248 1193033 1159194
53249 1159194 1126632 1095635 1065863 1037071 1009300 982329 955564 928696 902079 876277 851503
53238 851503 827621 804416 781715 759564 738425 718949 701374 685377 670629 657244 645550
53227 645550 635642 627342 620313 613987 607577 600462 592508 583885 574669 564848 554544 543943 532974
53214 532974 521285 508654 495346 482070 469638 458595 449002 440415 432124 423618 415005 406977 400225
53201 400225 394712 389583 383892 377406 370574 363746 356727 349220 341448 334011 327179 320671 314258 308283
53187 308283 303270 299139 295195 291009 287016 283965 281893 279965 277326 273952 270598 268071 266573 265532
53173 265532 264034 261576 258527 255793 253934 252708 251479 249928 248315 247172 246810 247064 247456 247704 247979
53158 247979 248520 249063 248956 247907 246358 245049 244479 244789 245757 246736 247003 246499 245931 245817 245742 244924 243274 241459
53140 241459 240052 239095 238406 237912 237652 237802 238662 240271 242068 243372 244187 245091 246264 247107 247116 246735 246951 248106
53122 248106 249449 249931 249280 248234 247765 248225 249322 250760 252539 254548 256314 257488 258311 259186 260004 260355
53106 260355 260238 259995 259621 258757 257532 256725 256737 256847 255942 253692 250696 247705 245112 243037 241471 240296
53090 240296 239424 238925 238842 238964 239049 239182 239646 240380 240843 240493 239232 237341 235186 233198 231944 231856 232797 234019
53072 234019 234716 234619 234038 233483 233302 233527 233872 233913 233445 232615 231593 230220 228261 225990 224112 223041 222572
53055 222572 222344 222288 222455 222781 223325 224382 225997 227648 228775 229463 230195 231084 231731 231769 231210 230368 229747 229844
53037 229844 230710 231761 232342 232299 231753 230669 229171 228025 228060 229126 230257 230897 231337 231873 232209 231968 231266
53020 231266 230490 229945 229892 230443 231190 231474 231300 231510 232660 234196 235239 235788 236601 238066 239720 240847 241168
53003 241168 240858 240208 239381 238437 237521 236979 237074 237673 238393 239078 239819 240555 241105 241607 242434 243464 244012 243829 243675
52984 243675 244378 245628 246286 245768 244678 244097 244601 245943 247418 248517 249398 250723 252920 255749 258613 261067
52968 261067 262863 263810 263877 263305 262403 261398 260599 260408 260915 261696 262267 262526 262598 262544 262505 262816 263596 264403 264652
52949 264652 264184 263142 261508 259175 256356 253514 250959 248762 246992 245752 245056 244866 245097 245445 245429 244874
52933 244874 244061 243126 241685 239534 237402 236366 236576 237152 237329 237193 237190 237413 237565 237361 236788 236144 235845 236039
52915 236039 236436 236678 236757 236868 237025 237132 237241 237395 237391 237086 236831 237085 237642 237712 236845 235432 234216 233655 233765
52896 233765 234227 234653 235057 235996 237835 239907 240967 240634 239877 239826 240509 241067 240909 240242 239538 238800 237513 235323
52878 235323 232717 230843 230537 231695 233662 235944 238193 239905 240741 241105 241869 243492 245799 248540 251537
52863 251537 254285 256103 256937 257571 258763 260577 262661 264709 266388 267249 267081 266045 264300 261801 258623
52848 258623 255049 251214 247072 242915 239354 236472 233565 230163 226838 224479 223137 222170 221214 220388 219727
52833 219727 219069 218509 218431 219029 220106 221325 222346 222834 222763 222618 222901 223445 223641 223335 223004 222983 223012 222772 222472
52814 222472 222503 222764 222707 222070 221258 220902 221174 221735 222343 223288 224943 226951 228251 228115 226904 225525 224409
52797 224409 223346 222179 221180 220689 220666 220703 220270 219019 217135 215446 214851 215515 216795 217939 218587 218572 217705
52780 217705 216102 214435 213498 213530 214180 214994 215707 216164 216295 216245 216323 216709 217304 217851 218069 217736 216852 215784 215030
52761 215030 214696 214381 213711 212774 211903 211318 211279 212326 214830 218201 221015 222221 222062 221708 222204 223831 226145
52744 226145 228390 230064 231333 232727 234329 235607 236254 236765 237750 239038 240038 240704 241483 242398 242917 242876
52728 242876 242866 243461 244588 245915 247377 248963 250349 251083 250858 249468 246940 243910 241358 239564 237803
52713 237803 235543 233469 232657 233046 233516 233400 233177 233546 234437 235239 235561 235400 234852 234001 233067 232398 232252 232634
52695 232634 233322 234073 234767 235326 235629 235717 235971 236701 237470 237357 236165 234924 234718 235392 235984 236119 236237 236550
52677 236550 236649 236299 235940 236074 236636 237282 237839 238165 237990 237287 236519 236157 236191 236419 236867 237545 238076 238107 237975 238438
52657 238438 239704 241125 241991 242320 242773 244053 246486 249885 253554 256528 258079 258126 257135 255620 253780 251629
52641 251629 249389 247528 246275 245277 244030 242635 241760 241764 242247 242710 243271 244322 245759 247163 248644 250846
52625 250846 253939 257201 259880 262010 263924 265324 265404 263788 260892 257410 253912 250986 249214 248725 249068
52610 249068 249736 250604 251600 252289 252123 251042 249519 248155 247432 247644 248613 249575 249840 249661 249974 251091 252110
52593 252110 251942 250603 249095 248260 248203 248616 249098 249122 248305 247007 246308 247025 248894 250971 252685 254200 255805
52576 255805 257333 258343 258697 258747 258963 259475 260021 260354 260593 261018 261534 261487 260269 258065 255781 254140 253044
52559 253044 251980 250955 250692 251817 254000 256118 257233 257243 256624 255730 254526 252945 251312 250224 250012 250417
52543 250417 250901 251224 251533 251884 251946 251451 250789 250793 251788 253124 253814 253536 252849 252592 253241 254698 256377 257518
52525 257518 257701 257232 256895 257259 258284 259580 260841 261906 262637 263016 263312 263954 265144 266697 268340 270065
52509 270065 272114 274674 277661 280754 283611 286047 288046 289574 290380 290049 288390 285715 282660 279733 277084
52494 277084 274631 272190 269500 266397 263111 260145 257708 255481 253213 251338 250560 250927 251754 252556 253579
52479 253579 255210 257235 259044 260287 260940 260983 260510 260138 260752 262663 265280 267807 269993 271974 273707 274977
52463 274977 275909 277045 278762 280869 282992 285122 287477 289891 291698 292369 292020 291076 289665 287553 284611
52448 284611 281107 277581 274569 272380 270868 269461 267652 265488 263366 261453 259591 257780 256341 255463
52434 255463 254938 254524 254300 254407 254698 254880 254752 254119 252747 250752 248840 247804 247864 248694 249915 251329 252854
52417 252854 254529 256397 258149 259249 259807 260947 263645 267416 270945 273969 277655 282950 289461 296484
52403 296484 304356 313933 325026 336130 345581 352478 356521 357594 355732 351228 344637 336773 328542 320542
52389 320542 312902 305820 300018 296180 294003 292394 290813 289921 290537 292344 294049 294719 294536 294328 294752 296038
52373 296038 298180 301065 304452 308027 311629 315451 319885 324986 330092 334221 337014 339063 341103 343073
52359 343073 344329 344628 344344 343676 342258 339894 337231 335210 334103 333556 333374 333674 334343 334960 335418 336114 337330
52342 337330 338780 340019 340974 341920 343315 345831 350090 355963 362454 368655 374581 380758 387406 394551 402678
52327 402678 412557 424366 437422 450913 464578 478719 493919 510719 529170 548612 568115 587111
52315 587111 605352 622533 638545 654042 670073 686942 703951 720450 736624 752972 769557
52304 769557 786172 802804 819459 835783 851352 866190 880606 894606 907871 920165 931411
52293 931411 941290 949124 954264 956488 956041 953388 948962 942990 935569 926914 917442 907613 897797 888322
52279 888322 879472 871399 864214 858172 853626 850819 849988 851557 855782 862186 869827 878219 887455 897300
52265 897300 906920 915972 925316 935952 947709 959655 971447 983494 996028 1008884 1022150 1036238
52253 1036238 1051153 1066283 1081002 1094914 1107561 1118554 1128076 1136526 1143555 1148127 1149759 1148882 1145675
52240 1145675 1139407 1129589 1117161 1103796 1090391 1076789 1062637 1047819 1032327 1016450 1001041 987023
52228 987023 974541 963025 952005 941413 931221 921361 912102 903976 897214 891626 887120 883929 882077
52215 882077 880996 879924 878571 877275 876688 877357 879425 882605 886517 891036 896188 901765 907272 912208 916245
52200 916245 919287 921675 924152 927201 930477 933405 936330 940383 946023 952298 958001 963023 968087 973517
52186 973517 978904 983727 987694 990469 991630 991072 989106 986054 981966 976773 970446 962974 954464 945293
52172 945293 935990 926956 918458 910820 904351 899116 895074 892392 891277 891474 892280 893176 894209 895682 897792
52157 897792 900665 904408 908874 913576 918000 921827 924795 926650 927403 927433 927151 926773 926542 926876 928039 929839
52141 929839 931880 933956 936034 938089 940111 942073 943717 944657 944997 945587 947350 950471 954561 959427 965434
52126 965434 973286 983736 997323 1014049 1033464 1055267 1079487 1105846 1133389 1161322 1189790 1219111
52114 1219111 1248577 1276972 1304117 1330856 1357316 1382163 1403992 1422625 1438535 1451807 1462346
52103 1462346 1470566 1477153 1482508 1486950 1491012 1494857 1497799 1499172 1499427 1499520 1499258 1497061 1491525 1482588 1470995
52088 1470995 1457200 1441145 1422755 1402329 1380640 1358868 1338233 1319506 1302831 1287993 1274736
52077 1274736 1262972 1252938 1245094 1239643 1236286 1234687 1235060 1237876 1243081 1250068 1258480 1268611 1280803
52064 1280803 1294738 1309514 1324300 1338847 1353475 1368563 1383912 1398768 1412675 1426056 1439536
52053 1439536 1452875 1465115 1475669 1484625 1491958 1497201 1500137 1501056 1499855 1495504 1487024 1474699 1459785
52040 1459785 1443321 1425644 1406800 1386830 1365874 1344469 1323616 1304009 1285366 1267057 1249266
52029 1249266 1232849 1218048 1204127 1190546 1177799 1166597 1156657 1146858 1136371 1125164 1113546 1101807
52017 1101807 1090338 1079604 1069716 1060294 1051022 1042114 1033992 1026621 1019551 1012546 1005736 998936 991227
52004 991227 981616 969956 956818 942538 926940 910057 892635 875565 859140 843192 827743 813136
51992 813136 799665 787436 776512 766844 758016 749369 740469 731320 722056 712628 702782 692263 680987
51979 680987 669110 656866 644289 631253 617920 604851 592355 579926 566880 553602 541677
51968 541677 532546 526342 522254 519681 518702 519651 522634 527488 533922 541578 550033 558763 567062 574062 578964
51953 578964 581303 580999 578260 573484 567142 559688 551606 543573 536462 530984 527358 525433 525169 526915 531188
51938 531188 538168 547483 558507 570864 584555 599598 615633 631950 647765 662358 675064 685418
51926 685418 693374 699216 703228 705521 706159 705228 702642 697950 690394 679180 663876 644805 623074 600059
51912 600059 576796 553957 532267 512641 495857 482333 472237 465474 461515 459590 459273 460669 463914
51899 463914 468728 474597 481070 487659 493673 498424 501460 502393 500758 496299 489182 479745 468307 455511
51885 455511 442574 430769 420793 413008 407944 405984 406612 408593 411043 413974 417828 422946 429525 437477
51871 437477 446123 454441 461935 468863 475398 480931 484536 485787 484814 481903 477503 472484 467892 464329
51857 464329 461693 459534 457491 455549 454098 453697 454670 456931 460195 464061 467805 470414 471148 469951 467139
51842 467139 462948 457646 451764 445739 439438 432493 425097 418033 411916 406779 402503 399200 397026 395996
51828 395996 396208 397885 400832 404050 406240 406731 405753 403928 401718 399326 396877 394551 392560 391003 389727
51813 389727 388483 387313 386738 387394 389427 392349 395447 398251 400604 402496 403957 405039 405711 405773 405050 403730
51797 403730 402333 401214 400244 399195 398356 398415 399601 401176 401906 400947 398204 394166 389682 385763 383165 381989
51781 381989 381814 382247 383188 384532 385803 386352 385976 385260 385170 386239 388236 390650 393429 397061 402069 408691
51765 408691 416957 426633 436955 446922 456099 464733 472699 478819 481860 481938 480174 477040 471881 464268
51751 464268 455057 445620 436534 427551 418483 409540 400960 392848 385434 379173 374518 371715 370747 371307 373046
51736 373046 376062 380965 388118 396952 406392 415791 424975 433373 439824 443626 445381 446351 447251 448159 449410
51721 449410 451782 455395 458944 460606 459667 456852 453189 449058 444489 439864 435875 432928 430873 429175
51707 429175 427190 424479 421197 418096 415911 414896 415145 416993 420572 425130 429452 432926 435666 437609
51693 437609 438213 437352 435872 434868 434815 435671 437291 439191 440309 439641 437044 433019 427941 421965 415594 409776
51677 409776 405322 402412 400646 399413 398384 397886 398634 400868 403947 407011 409809 412667 416066 420725 427648
51662 427648 437334 448968 460890 471755 480721 486848 489232 487922 484026 478654 472296 465435 459121
51649 459121 454609 452758 453897 457677 462729 467004 468923 468042 464523 458553 450588 441563 432326 423176
51635 423176 414379 406700 400842 396583 393037 389668 386652 384484 383703 384813 387855 392028 396174 399638
51621 399638 402308 403967 404207 403017 400898 398202 394724 390190 384848 379392 374480 370479 367437 365128
51607 365128 363161 361108 358522 355092 351128 347813 346512 347608 350279 353473 356806 360513 365021 370929
51593 370929 378971 389412 401354 412976 422601 429527 433952 436317 436757 435060 431097 425326 418854 412923
51579 412923 408293 405157 403635 404279 407989 415310 425841 438463 452259 467127 483407 501143 519908
51566 519908 539197 558577 577432 595038 611117 626130 640928 656334 673255 692867 716341
51555 716341 744357 776891 813015 850569 886292 916933 940501 956331 964139 963478 954179 936889
51543 936889 912822 883163 848946 811429 772324 733507 696493 662080 630474 601779 576351
51532 576351 554622 536653 522125 510747 502389 496727 493015 490500 488928 488339 488424 488291 486929 483799
51518 483799 479040 473271 467208 461240 455275 449028 442505 436064 430024 424352 418784 413134 407396 401688
51504 401688 396236 391366 387321 384065 381323 378866 376681 374859 373432 372472 372220 372916 374366 375947 377198
51489 377198 378315 379765 381520 383027 383955 384551 385067 385254 384770 383746 382565 381286 379779 378229 376922
51474 376922 375582 373579 370909 368333 366286 364196 361303 357696 354057 350768 347805 345244 343312 341995
51460 341995 341125 340805 341225 342054 342467 341909 340504 338696 336849 335317 334431 334225 334518 335467 337736 341856 347634
51443 347634 354538 362564 372458 385060 400524 418029 435978 452475 465843 475076 480137 481992 482218
51430 482218 482156 482213 481896 480428 477280 472388 466243 459728 453477 447337 440817 434107 428121 423353 419240
51415 419240 415088 411160 408198 406151 404143 401769 399641 398334 397368 395824 393662 391828 391036 390992 390961 390733
51399 390733 390735 391428 392891 394861 396887 398494 399571 400649 402520 405418 408883 412609 417151 423448 431872
51384 431872 442180 454398 469335 487987 510681 537047 566816 600447 638929 682980 732465
51373 732465 786574 844161 903383 960959 1012505 1054308 1084709 1103563 1110815 1106283 1090579 1065278
51361 1065278 1032017 992077 947005 898834 849270 799241 749673 702095 657894 617385 580280
51350 580280 546746 517420 492565 471809 454585 440281 428116 417495 408495 401477 396123 391322
51338 391322 386104 380329 374501 369388 365812 364188 363948 363787 362725 360782 358548 356483 354795 353568 352746
51323 352746 352224 352181 353003 354618 356206 356973 357089 357475 358681 360270 361336 361373 360563 359471 358634 358322 358483
51306 358483 358827 359033 358931 358503 357704 356384 354462 352181 350042 348417 347283 346350 345358 344189 342845 341406
51290 341406 339933 338381 336740 335291 334463 334282 334259 334109 334408 336134 339617 344273 349370 354730 360597 367012
51274 367012 373425 378770 382038 383012 382474 381518 380693 380029 379737 380429 382596 386162 390612 395291 399527 402822
51258 402822 405117 406614 407254 406628 404514 401262 397516 393721 389994 386181 381984 377339 372750 368888 365689
51243 365689 362265 358041 353611 350044 347677 346084 345009 344587 344601 344196 342770 340766 339116 338131 337422 336870
51227 336870 337064 338459 340491 342047 342788 343523 345178 347757 350559 353071 355238 357103 358629 359874 361011
51212 361011 362117 363173 364240 365373 366408 367137 367619 367953 367898 367197 366355 366535 368457 371735 375443 378882
51196 378882 381613 383320 384103 384537 384983 385091 384382 383095 381935 381136 380212 378694 376740 374986 374014 373910
51180 373910 374144 373969 373153 372208 371662 371294 370462 369067 367769 367198 367337 367716 367951 367974 367982 368269 368971 369972 371210
51161 371210 373069 376182 380774 386326 391878 396538 399748 401402 401830 401525 400833 399940 399033 398216 397238 395601
51145 395601 393042 389804 386374 383084 379950 376791 373484 370239 367592 365967 365307 365306 365933 367453 369897
51130 369897 372815 375594 377872 379611 381001 382349 383880 385594 387542 390121 393690 397768 401080 402753
51116 402753 403253 403809 405104 406876 408600 410088 411333 412236 412821 413540 415017 417427 420262 422811 424791
51101 424791 426404 427821 428807 429016 428533 427873 427400 427003 426535 426310 426749 427529 427551 426091 423786 422092 421826
51084 421826 422571 423522 424425 425389 426173 426262 425615 424865 424687 425287 426533 428154 429675 430634 431216 432357 434856
51067 434856 438588 442820 447018 450990 454631 458221 462941 470467 481797 496732 514446 534065 554610
51054 554610 574925 594051 611462 626873 640207 652071 663806 676469 689774 702399 713345
51043 713345 722659 730659 736768 739436 737325 730405 719887 707290 693908 681022 669965 661344 654331
51030 654331 647196 638597 628076 615608 601422 586426 572070 559285 547915 537552 528482 521296
51018 521296 516008 512236 510105 510222 512693 516774 521663 527159 533364 540275 547969 556789 566876 577705
51004 577705 588455 598767 608885 619154 629578 639732 648841 656120 661409 665489 669384 673282 676398
50991 676398 677987 678102 677227 675531 672912 669642 666578 664706 664672 666732 670864 676914 684895 695166 708007
50976 708007 722896 738472 753462 767550 781324 795722 811689 830069 851363 875734 903477
50965 903477 935380 972213 1013988 1060073 1110007 1163849 1221715 1283340 1348133 1415197 1483225
50954 1483225 1550772 1616834 1680802 1741646 1797616 1847099 1889460 1924689 1952620 1973014 1986205
50943 1986205 1993147 1994894 1992574 1987788 1982275 1976802 1970691 1962694 1952112 1938981 1923641 1906605 1888601
50930 1888601 1870192 1851245 1831008 1808791 1784393 1757806 1728710 1696434 1660347 1620279 1576681
50919 1576681 1530457 1482521 1433427 1383482 1333281 1283926 1236527 1191615 1149309 1109967 1074212
50908 1074212 1042198 1013343 987095 963607 943130 924992 907837 890912 874516 859100 844665
50897 844665 831351 819902 810838 803528 796761 790084 784000 779051 775441 773510 773718 775742 778175 779648
50883 779648 779990 780034 780585 781935 784083 787009 790717 795231 800497 806286 812466 819415 827751 837416 847508
50868 847508 857479 868109 880651 895246 910841 926664 943156 961384 982188 1006104 1033481 1064259
50856 1064259 1098005 1134595 1174707 1219421 1269620 1325993 1389320 1460354 1539621 1627596 1724830
50845 1724830 1831565 1947433 2071841 2204423 2344704 2491500 2643035 2797452 2952647
50836 2952647 3105635 3252541 3389290 3512009 3617093 3701762 3764853 3806603 3827511 3827996 3809451
50825 3809451 3774983 3728613 3674120 3615043 3555230 3498488 3447629 3404258 3369281 3342978 3324441
50814 3324441 3311360 3300491 3288212 3270853 3245181 3208917 3160748 3100002 3026621 2941336 2845398
50803 2845398 2740051 2626675 2507509 2385709 2264467 2146354 2033523 1927861 1830523 1741743
50793 1741743 1661700 1591345 1531847 1483304 1444530 1414133 1391315 1375561 1365984 1361400 1360753 1363147
50781 1363147 1367571 1372950 1378503 1383760 1388153 1390862 1391338 1389852 1387192 1383754 1379149 1372719 1364135 1353344
50767 1353344 1340235 1324703 1306921 1287220 1265744 1242547 1218003 1192738 1167125 1141228 1115400
50756 1115400 1090555 1067573 1046689 1027761 1010943 996698 985198 976042 968716 963176 959977 959899 963429
50743 963429 970479 980544 993205 1008468 1026604 1047890 1072708 1101753 1135788 1174965 1218613 1265956
50731 1265956 1317061 1372836 1434043 1500529 1571525 1646347 1724348 1804361 1884930 1965329 2045714
50720 2045714 2125752 2203556 2276637 2343463 2403103 2453498 2491283 2513819 2520670 2512755 2491015 2456740
50708 2456740 2412593 2362303 2309482 2257324 2208947 2167001 2132783 2106439 2087998 2077433 2073558
50697 2073558 2073671 2074730 2074501 2071404 2063842 2050112 2028650 1998131 1957780 1908072 1850935 1788927 1724308
50684 1724308 1658929 1594560 1532859 1475182 1422730 1376739 1338211 1307602 1285060 1270841 1265193
50673 1265193 1267962 1278597 1296500 1321136 1351888 1388057 1428875 1473162 1519053 1564487 1608110
50662 1608110 1649404 1687892 1722609 1752663 1778085 1799860 1819194 1837001 1853907 1870265 1885982
50651 1885982 1900587 1913770 1925781 1937180 1948368 1959672 1971804 1985873 2002853 2023243 2047338
50640 2047338 2075443 2107635 2143624 2183164 2226350 2273098 2322485 2372972 2423217 2472300 2519292
50629 2519292 2563159 2603253 2639644 2672938 2704046 2733658 2760898 2782039 2791322 2783965 2758579 2716774
50617 2716774 2661279 2595279 2523240 2451187 2385322 2330076 2287255 2256726 2237843 2230271 2233384 2245053
50605 2245053 2261670 2279768 2297193 2312184 2321837 2322441 2311434 2288322 2253586 2207512 2150552 2084309
50593 2084309 2011574 1935462 1858598 1782800 1709073 1638025 1570410 1507124 1448556 1394311 1343803
50582 1343803 1296877 1253641 1214051 1178015 1145664 1117069 1091841 1069467 1049974 1033843 1021215
50571 1021215 1011554 1004242 999171 996558 996406 998360 1002056 1007456 1014854 1024575 1036619 1050622 1066299
50558 1066299 1083896 1104109 1127530 1154260 1184033 1216483 1251245 1287989 1326538 1366798 1408443
50547 1408443 1450702 1492660 1533782 1574041 1613563 1652368 1690590 1728775 1767739 1808165 1850565
50536 1850565 1895675 1944622 1998471 2057773 2122745 2193763 2271348 2355678 2446473 2543476 2646854
50525 2646854 2757083 2874604 2999615 3131817 3270180 3413112 3558933 3705825 3851140
50516 3851140 3991214 4122301 4241475 4346269 4433737 4500555 4544075 4562839 4556106 4523536 4465659
50505 4465659 4384316 4282404 4163393 4031191 3890140 3744903 3600518 3462546 3336673 3227772
50495 3227772 3139388 3073996 3033167 3017090 3024311 3052351 3098310 3158410 3227123 3297237 3360868
50484 3360868 3410420 3439217 3442267 3416927 3362886 3281715 3176743 3052970 2916141 2771449 2623236
50473 2623236 2475697 2332925 2197765 2071101 1952906 1843834 1745312 1658199 1581862 1514653
50463 1514653 1454923 1401428 1353106 1308935 1268171 1230612 1196423 1165654 1138049 1113414 1091986
50452 1091986 1074134 1059776 1048389 1039552 1033159 1028997 1026607 1025817 1027082 1030958 1037446 1046219 1057193
50439 1057193 1070356 1085084 1100078 1114095 1126479 1137027 1145825 1153400 1160648 1168366 1177009 1187045
50427 1187045 1199149 1213674 1230087 1247350 1264908 1283072 1302439 1323241 1345401 1369023 1394591
50416 1394591 1422744 1454028 1488898 1527795 1571164 1619421 1672971 1732191 1797260 1867921 1943363
50405 1943363 2022317 2103259 2184654 2265164 2343698 2419196 2490412 2556007 2614796 2665670 2707120
50394 2707120 2737085 2753510 2755000 2740825 2710599 2664446 2603655 2530800 2449011 2361207 2270122
50383 2270122 2178823 2090824 2009560 1937742 1877099 1828577 1792686 1769656 1759238 1760402 1771485
50372 1771485 1790678 1816159 1845519 1875266 1901244 1919701 1927915 1924091 1907269 1877648 1836676 1786379
50360 1786379 1728549 1664805 1597318 1529014 1462734 1400155 1341579 1286665 1235300 1187896 1145078
50349 1145078 1107177 1074077 1045583 1021949 1003873 991692 984479 979979 975529 969155 960033 948217
50337 948217 934094 918036 900363 881584 862648 844843 829305 816439 805891 797086 789819 784219
50325 784219 780220 777276 774832 773030 772712 774582 778440 783301 788162 792590 796693 800735 804837 808985
50311 808985 813310 818233 824195 831198 838837 846880 855555 865100 875267 885627 896186 907278 918848
50298 918848 930272 941030 951330 962084 974489 989580 1007764 1028708 1052053 1078374 1109149
50287 1109149 1145722 1188485 1236547 1287037 1334370 1371426 1392787 1397036 1385834 1361656 1327402
50276 1327402 1287370 1246740 1209252 1176026 1146953 1122409 1103111 1088965 1078883 1071671 1066739 1064059
50264 1064059 1063716 1065404 1068229 1071256 1074432 1078814 1085827 1096566 1111738 1131744 1156533 1185754 1219270
50251 1219270 1257086 1298435 1341460 1384300 1426130 1466632 1504920 1539849 1571320 1600508 1628595
50240 1628595 1655803 1681680 1705544 1726113 1741228 1748644 1747176 1736738 1717348 1688622 1650550 1604638
50228 1604638 1554061 1502539 1453020 1407198 1365836 1329106 1296564 1267062 1238895 1210186 1179462
50217 1179462 1146252 1111186 1075155 1038362 1000652 962838 927035 895207 867803 844289 824463
50206 824463 808483 795890 785599 776951 770019 764692 760184 755778 751411 747143 742623 737523 732088
50193 732088 726751 721586 716597 712197 708824 706260 703846 701219 698402 695346 691924 688256 684552 680741
50179 680741 676855 673686 672288 672649 673489 673656 673171 672555 671792 670646 669576 669551 670930 673111 675417 677870
50163 677870 680911 684755 689298 694432 700226 706820 714284 722574 731640 741635 752964 765943 780474
50150 780474 796293 813555 832826 854277 877105 900110 922871 946168 971271 998956 1029347
50139 1029347 1062705 1100255 1144164 1196526 1258232 1328670 1406187 1488583 1573313 1657815 1740130
50128 1740130 1819262 1894935 1967292 2036933 2104715 2170802 2233804 2291124 2340013 2377921 2402069
50117 2402069 2409585 2398623 2369154 2322477 2260409 2185232 2099937 2007832 1911893 1814861 1719742
50106 1719742 1629548 1546305 1470619 1402341 1341346 1287470 1239989 1197543 1158707 1122623 1089104
50095 1089104 1058171 1029559 1002836 978015 955745 936602 920404 906568 894935 885719 878713 873180
50083 873180 868777 866035 865578 867208 870070 873311 876222 878147 878851 878784 878465 877770 876316 874393 872862 872084
50067 872084 871605 870954 870163 869272 867921 865843 863306 860671 857864 854640 851050 847226 843025 838304 833292
50052 833292 828256 823087 817768 813000 809702 808009 807428 807934 810155 814347 819989 826702 834814 844540 855247
50037 855247 866218 877694 890423 904428 918963 933570 948479 963896 979573 995297 1011305
50026 1011305 1027927 1045167 1062877 1081058 1099758 1118976 1138942 1160388 1184353 1211833 1243611
50015 1243611 1280093 1320946 1364961 1410383 1455406 1498367 1537871 1573036 1603689 1630253 1653508
50004 1653508 1674399 1693730 1711714 1727788 1740818 1749222 1750859 1743314 1724882 1695379 1655888 1607951
49992 1607951 1553278 1493990 1432476 1370794 1310440 1252746 1199050 1150161 1105842 1065155 1027272
49981 1027272 991833 958695 927651 898542 871440 846539 823848 803038 783673 765658 749354
49970 749354 735111 722659 711191 700226 690244 682121 675925 670598 665008 659053 653462 648768 644914
49957 644914 641786 639513 638035 636915 636084 636443 639169 644436 651355 659165 667973 678154 689484 701171
49943 701171 712399 722543 731187 738318 744329 749455 753320 755355 755573 754492 752245 748080 740973 730562
49929 730562 717419 702562 686838 670780 654964 640268 627520 616794 607413 598844 591457 586126
49917 586126 583257 582519 583364 585378 588155 591316 594823 598909 603522 608105 612148 615769 619565 624135 629911
49902 629911 637169 645840 655413 665443 676142 688128 701488 715360 728608 740627 751223 759911
49890 759911 765853 768670 768984 767822 765574 761755 755702 747183 736416 723928 710600 697431 684870
49877 684870 672472 659544 646083 632930 621070 610981 602492 595064 588192 581814 576296 571953 568728
49864 568728 566539 565656 566381 568487 571446 575164 579981 585977 592832 600588 609942 621352 634179 647177
49850 647177 659681 671910 684204 696301 707375 716537 723328 727987 731276 733851 735750 736521 735697
49837 735697 732936 727829 720008 709678 697899 686052 674976 664650 654737 645309 636910 629944 624237
49824 624237 619351 615163 611920 609874 609184 610134 613052 617859 624039 631286 639869 650083 661520 673222
49810 673222 684428 694869 704406 712819 720129 726831 733439 739765 744820 747579 747858 746345 743803 740386
49796 740386 735844 730193 723878 717215 709911 701278 690880 678927 666130 653171 640346 627860 616525
49783 616525 607689 602045 598744 596243 593924 592246 591374 590579 589286 587892 587022 586671 586741 587864 590859 595735
49767 595735 601943 609346 618091 627740 637355 646456 655081 662905 669193 673793 677441 680835 684045 686995
49753 686995 689666 691393 690729 686629 679344 669830 658861 647280 636373 627158 619515 612733 606693 601907
49739 601907 598618 596567 595509 595245 595175 594583 593577 593101 593792 595355 597319 599863 603343 607364 610858 613154
49723 613154 614698 616659 619984 624895 631201 639001 648903 661423 676259 692315 708364 723460 736836
49710 736836 747728 755478 759631 759952 756582 750258 742141 733307 724509 716376 709579 704658 701834 700949
49696 700949 701307 701636 700624 697753 693340 687700 680652 672169 663144 655101 649238 646032 645497 647373 651107
49681 651107 656032 661729 668139 675423 683929 694177 706688 721904 740369 762459 787322 812212
49669 812212 833610 849224 858676 862423 860893 855021 846880 839025 833309 830627 831448 835946 843614 853080
49655 853080 862249 868468 869016 862248 848546 829851 808236 785182 762001 740193 720987 704844
49643 704844 691668 681212 673056 666545 661205 657152 654835 654458 655818 658495 661890 665158 667520 668727
49629 668727 668956 668191 665962 661863 656138 649584 642912 636325 629718 623174 617167 612272 608640 605793 603019
49614 603019 600001 597048 594733 593385 592968 593333 594436 596236 598450 600597 602360 603876 605576 607704 610100
49599 610100 612435 614536 616412 618106 619692 621380 623455 625987 628614 630724 631920 632362 632559 632776 632745
49584 632745 632194 631596 632025 634070 637109 639916 641767 642665 642717 641907 640597 639700 639940 641173 642802 644722
49568 644722 647508 651741 657544 664808 673446 683156 693177 702680 711446 719943 728583 736991 744057 748665
49554 748665 750363 749427 746424 741796 735788 728755 721426 714822 709762 706411 704309 702916 702099 702051 702812
49539 702812 704062 705454 706992 708884 711072 713163 714888 716496 718579 721633 725931 731694 739153 748408
49525 748408 759447 772354 787378 804693 824117 845026 866366 886732 904669 919149 929825
49514 929825 936845 940619 941853 941668 941518 942916 947116 954648 964916 976415 987558 997140 1003838 1005771
49500 1005771 1001267 990145 973799 953985 931979 908933 886287 865251 846200 829023 813864
49489 813864 801097 790787 782561 775992 770761 766561 763168 760597 758874 757777 757065 756853 757366 758393
49475 758393 759434 760383 761612 763314 765247 767281 769678 772560 775536 778240 780929 784099 787739 791457
49461 791457 795227 799433 804091 808487 811844 814137 815950 817660 818930 819034 817510 814497 810566 806345
49447 806345 802243 798326 794250 789435 783581 777097 770868 765539 761276 758273 757170 758577 762358 767707
49433 767707 773945 780991 789106 798518 809362 821679 835239 849584 864495 880429 898283 918759
49421 918759 942145 968813 999639 1035219 1074035 1111407 1140939 1157744 1160595 1151288 1132643 1107623
49409 1107623 1079701 1052696 1029557 1011592 999049 991973 990209 993160 1000098 1010437 1023270 1037026
49397 1037026 1050274 1062807 1075385 1088452 1101639 1114475 1126874 1138738 1149590 1158907 1166463 1172141
49385 1172141 1175708 1176963 1175754 1171762 1164780 1155360 1144616 1133072 1120319 1106331 1092509 1080650
49373 1080650 1071207 1063393 1056828 1052182 1050118 1050389 1052255 1055200 1058992 1063533 1068875 1074885 1080713 1085089
49359 1085089 1087394 1087923 1086905 1083967 1079038 1073042 1066922 1060326 1052142 1042231 1031932 1022841 1015732 1010746
49345 1010746 1007981 1007504 1009110 1012274 1016177 1019855 1022721 1025026 1027359 1029530 1030369 1028894 1025300 1020466
49331 1020466 1014910 1008807 1002806 998095 995340 993967 992849 991508 990433 990388 991850 995085 1000322 1007632
49317 1007632 1016904 1028230 1042061 1058652 1077501 1097613 1118044 1137611 1154221 1165298 1169373 1166892
49305 1166892 1159324 1147962 1133906 1118476 1102873 1087606 1072805 1058874 1046303 1035040 1024726
49294 1024726 1015500 1007978 1002412 998389 995360 992924 990686 988508 986955 986682 987104 986392 983207 977931 971833
49279 971833 965658 959531 953614 948119 943017 938469 935310 934426 935666 937937 940409 943160 946635 950931
49265 950931 955652 960022 963106 964395 964301 963728 963047 961857 959894 957883 957390 960128 967416 979728 996416
49250 996416 1016188 1038139 1061991 1086936 1110677 1130272 1143945 1151544 1153247 1148609 1137317 1120436
49238 1120436 1100269 1079022 1057967 1037809 1019257 1003027 989596 979168 971697 966839 964127 963434
49226 963434 965068 969155 975035 981470 987356 992239 996435 1000854 1006322 1012670 1018771 1023869 1028609 1034171
49212 1034171 1040673 1047166 1053028 1058544 1063992 1069154 1074120 1079673 1086302 1093571 1101191 1110072 1121350 1134799
49198 1134799 1149168 1163886 1179373 1195614 1211545 1226255 1239982 1253358 1266276 1278114 1288707
49187 1288707 1298462 1307631 1315975 1323176 1329253 1334599 1339882 1345895 1353210 1361850 1371507 1382274 1395097
49174 1395097 1411457 1432589 1459063 1491050 1528823 1572776 1622818 1677648 1734423 1788938 1836334
49163 1836334 1872334 1894575 1903159 1900120 1888503 1871831 1853756 1837341 1824263 1814713 1808042 1803409
49151 1803409 1800092 1797641 1795918 1794890 1794419 1794481 1795446 1797792 1801561 1806480 1812660 1820704 1830882 1842596
49137 1842596 1854994 1867856 1881515 1896087 1911228 1926599 1942148 1957850 1973512 1989108 2005075
49126 2005075 2021945 2039696 2057697 2075366 2092665 2109906 2127306 2145024 2163374 2182648 2202793
49115 2202793 2223801 2246496 2272429 2302689 2337371 2376791 2422929 2479188 2548983 2635268 2740886
49104 2740886 2867602 3013433 3171317 3331902 3488979 3642679 3796896 3952194 4099849
49095 4099849 4222811 4304078 4336088 4323176 4275554 4201393 4104149 3985565 3849178 3700521
49085 3700521 3545254 3388185 3233927 3087631 2954470 2838279 2740540 2660444 2595723 2543604
49075 2543604 2501519 2467497 2440123 2418092 2399804 2383577 2368273 2353509 2339294 2325742 2313161
49064 2313161 2301915 2291898 2282458 2273183 2264488 2257011 2250675 2244868 2239452 2234969 2231777 2229536 2227804
49051 2227804 2226707 2226656 2227700 2229490 2231669 2233995 2236283 2238668 2241940 2247248 2255234 2265536 2277076 2288607
49037 2288607 2298996 2307355 2313274 2316986 2319158 2320514 2321649 2323077 2325229 2328292 2332070 2336063 2339767 2343037
49023 2343037 2346201 2349693 2353409 2356512 2358102 2358155 2357684 2357917 2359464 2362293 2366267 2371471 2378077 2386055 2395037
49008 2395037 2404406 2413585 2422425 2431357 2441153 2452486 2465522 2479711 2494003 2507530 2520191 2532305
48996 2532305 2543662 2553370 2560875 2566684 2571569 2575354 2577088 2576321 2573614 2569747 2565012 2559413 2553062 2546152
48982 2546152 2538879 2531552 2524462 2517609 2510958 2504963 2500239 2496579 2492972 2488884 2484839 2481236 2477271 2471728
48968 2471728 2464388 2455941 2446960 2437817 2429342 2422510 2417402 2413237 2409597 2406917 2405636 2405634 2406799 2409394 2413467
48953 2413467 2418530 2424362 2431624 2441094 2452663 2465673 2480017 2496288 2514953 2535935 2558983 2583943
48941 2583943 2610490 2637984 2665798 2693694 2721878 2750879 2781355 2813769 2848222 2884736 2923655
48930 2923655 2965478 3010232 3057227 3105589 3154957 3205679 3258463 3313866 3371884 3431918 3493216
48919 3493216 3555489 3618983 3683856 3749568 3815100 3879794 3943735 4007142 4069486 4129630 4187011
48908 4187011 4242384 4296937 4350735 4402503 4451059 4496428 4539265 4579762 4617768 4653703 4688470
48897 4688470 4722333 4754556 4784427 4812042 4837670 4860803 4880482 4896300 4908481 4917106 4921882 4922808
48885 4922808 4920444 4915171 4906549 4893808 4876868 4856589 4834050 4809708 4783152 4753489 4720071 4683048
48873 4683048 4643227 4601264 4557041 4509921 4459533 4406111 4350100 4291604 4230473 4166995 4102472
48862 4102472 4038861 3977610 3918864 3862036 3807091 3754836 3705824 3659513 3615039 3572559 3533236
48851 3533236 3497879 3466145 3437187 3410675 3386914 3366264 3348717 3333863 3321125 3310210 3301561
48840 3301561 3296138 3294650 3297036 3302725 3311144 3321892 3334766 3349851 3367287 3386698 3407092 3427686
48828 3427686 3448662 3470779 3494372 3519056 3544225 3569426 3594307 3618696 3642887 3667470 3692657
48817 3692657 3717972 3742756 3766816 3790529 3814437 3838881 3863893 3889336 3915141 3941276 3967477
48806 3967477 3993221 4018277 4043109 4068356 4094023 4119629 4145136 4171185 4198216 4225897 4253734
48795 4253734 4281804 4310439 4339479 4368324 4396475 4423518 4448666 4470992 4490328 4507599 4524076
48784 4524076 4540492 4556852 4572631 4586803 4597969 4604880 4606826 4603374 4593893 4577725 4554851 4526087
48772 4526087 4492491 4454816 4413655 4369767 4323788 4275701 4225055 4171827 4116715 4060372 4002772
48761 4002772 3943797 3884158 3825074 3767032 3709431 3651724 3594463 3538848 3485609 3434756 3386259
48750 3386259 3340472 3297856 3258612 3222621 3189549 3158985 3130703 3104806 3081440 3060401 3041276
48739 3041276 3023945 3008680 2995721 2985011 2976454 2970060 2965609 2962336 2959242 2955759 2952029 2948559 2945703
48726 2945703 2943500 2942004 2941700 2943307 2946896 2951318 2954923 2957015 2958257 2959547 2960851 2961522 2961373 2960881 2960349
$$ [...]
##END NTUPLES=NMR SPECTRUM
##END=
