##TITLE=AC1457_PAST213263_8026755_9Goeyw9t4D
##JCAMPDX= 6.0         $$ Bruker NMR JCAMP-DX V2.0
##DATA TYPE= NMR SPECTRUM
##DATA CLASS= NTUPLES
##ORIGIN= BRUKER
##OWNER= Administrator
$$ 1.72 TOPSPIN		Version 2.1
$$ 2013-07-11 15:31:41.624 -0700  Administrator@X
$$ Compression mode = diff/dup
##.OBSERVE FREQUENCY= 400.02188249412
##.OBSERVE NUCLEUS= ^1H
##.ACQUISITION MODE= SIMULTANEOUS (DQD)
##.ACQUISITION SCHEME= undefined
##.AVERAGES= 8
##.DIGITISER RES= 22
##SPECTROMETER/DATA SYSTEM= spect
##.PULSE SEQUENCE= zg30
##.SOLVENT NAME= COFFEE_meoh
##.SHIFT REFERENCE= INTERNAL, COFFEE_meoh, 1, 14.98509
##AUDIT TRAIL= $$ (NUMBER, WHEN, WHO, WHERE, PROCESS, VERSION, WHAT)
$$ ##TITLE= Audit trail, TOPSPIN		Version 2.1
$$ ##JCAMPDX= 5.01
$$ ##ORIGIN= Bruker BioSpin GmbH
$$ ##OWNER= Administrator
$$ $$ E:\/data/COFFEE/nmr/AC1457_PAST213263_8026755_9Goeyw9t4D/10/pdata/1/auditp.txt
$$ ##AUDIT TRAIL=  $$ (NUMBER, WHEN, WHO, WHERE, PROCESS, VERSION, WHAT)
(   1,<2013-07-11 15:31:34.921 -0700>,<Administrator>,<X>,<go>,<TOPSPIN 2.1>,
      <created by zg
	started at 2013-07-11 15:30:28.592 -0700,
	POWCHK enabled, PULCHK disabled,
       configuration hash MD5:
       C8 4E 4E 5D D3 5C D8 9E 9F 52 82 E0 59 8A DE 15
       data hash MD5: 64K
       50 06 77 61 53 4B AC 9E AB 57 24 0D 6E AE 8F 0E>)
(   2,<2013-07-11 15:31:37.796 -0700>,<Administrator>,<X>,<proc1d>,<TOPSPIN 2.1>,
      <Start of raw data processing
       efp LB = 0 FT_mod = 6 PKNL = 1 PHC0 = 0 PHC1 = 0 SI = 32K 
       data hash MD5: 32K
       50 37 71 EB E9 FE 65 81 FE 22 7B 4C D7 49 CF 73>)
(   3,<2013-07-11 15:31:38.092 -0700>,<Administrator>,<X>,<proc1d>,<TOPSPIN 2.1>,
      <pk PHC0 = 97.34985 PHC1 = 0 
       data hash MD5: 32K
       75 A2 D5 EE 48 55 29 46 A9 F5 2C C8 1C 0E 4C BD>)
(   4,<2013-07-11 15:31:38.186 -0700>,<Administrator>,<X>,<proc1d>,<TOPSPIN 2.1>,
      <abs ABSG = 1 
       data hash MD5: 32K
       6D 5C 1A F4 93 85 53 3F 9A E9 0A 7D 25 15 81 8D>)
(   5,<2013-07-11 15:31:38.249 -0700>,<Administrator>,<X>,<proc1d>,<TOPSPIN 2.1>,
      <abs ABSG = 2 
       data hash MD5: 32K
       1F 00 BF 9B F2 D5 49 B8 D9 7D D7 41 6E 59 52 28>)
(   6,<2013-07-11 15:31:38.327 -0700>,<Administrator>,<X>,<proc1d>,<TOPSPIN 2.1>,
      <abs ABSG = 3 
       data hash MD5: 32K
       34 DC 3A D6 F9 D0 09 47 FB 44 B2 04 9D 71 7E 2E>)
(   7,<2013-07-11 15:31:38.405 -0700>,<Administrator>,<X>,<proc1d>,<TOPSPIN 2.1>,
      <abs ABSG = 4 
       data hash MD5: 32K
       A3 C1 3B F9 16 F2 86 6D 0E 65 D4 21 B8 9A 87 5C>)
(   8,<2013-07-11 15:31:38.467 -0700>,<Administrator>,<X>,<proc1d>,<TOPSPIN 2.1>,
      <abs ABSG = 5 
       data hash MD5: 32K
       1C 57 60 D7 1B 0A 2E 5F 19 17 54 6B B7 86 6E 49>)
$$ ##END=
$$ 
$$ $$ hash MD5
$$ $$ 1B D8 C2 42 3E 97 43 67 75 0A 24 6F 8E 41 EA 89
##$RELAX= 
##$RELAX= 
##$RELAX= 
##$RELAX= 
##$RELAX= 
##$RELAX= 
##$RELAX= 
$$ Bruker specific parameters
$$ --------------------------
##$DU= <E:\>
##$EXPNO= 10
##$NAME= <AC1457_PAST213263_8026755_9Goeyw9t4D>
$$ [...]
##$TP= (0..7)
150 150 150 150 150 150 150 150
##$TP07= 0
##$TPNAME0= <>
##$TPNAME1= <>
##$TPNAME2= <>
##$TPNAME3= <>
##$TPNAME4= <>
##$TPNAME5= <>
##$TPNAME6= <>
##$TPNAME7= <>
##$TPOAL= (0..7)
0.5 0.5 0.5 0.5 0.5 0.5 0.5 0.5
##$TPOFFS= (0..7)
0 0 0 0 0 0 0 0
##$TUNHIN= 0
##$TUNHOUT= 0
##$TUNXOUT= 0
##$USERA1= <user>
##$USERA2= <user>
##$USERA3= <user>
##$USERA4= <user>
##$USERA5= <user>
##$V9= 5
##$VALIST= <valist>
##$VCLIST= <CCCCCCCCCCCCCCC>
##$VD= 0
##$VDLIST= <DDDDDDDDDDDDDDD>
##$VPLIST= <PPPPPPPPPPPPPPP>
##$VTLIST= <TTTTTTTTTTTTTTT>
##$WBST= 1024
##$WBSW= 4
##$XGAIN= (0..3)
0 0 0 0
##$XL= 0
##$YL= 0
##$YMAX_a= 646427
##$YMIN_a= -549517
##$ZGOPTNS= <>
##$ZL1= 120
##$ZL2= 120
##$ZL3= 120
##$ZL4= 120
##$ABSF1= 14.98509
##$ABSF2= -5.573092
##$ABSG= 5
##$ABSL= 3
##$ALPHA= 0
##$AQORDER= 0
##$ASSFAC= 0
##$ASSFACI= 0
##$ASSFACX= 0
##$ASSWID= 0
##$AUNMP= <proc_prof1d_extract_pilot.lims>
##$AXLEFT= 0
##$AXNAME= <>
##$AXNUC= <1H>
##$AXRIGHT= 0
##$AXTYPE= 0
##$AXUNIT= <>
##$AZFE= 0.1
##$AZFW= 0.1
##$BCFW= 0
##$BC_mod= 0
##$BYTORDP= 0
##$COROFFS= 0
##$CY= 15
##$DATMOD= 1
##$DC= 0
##$DFILT= <>
##$DTYPP= 0
##$F1P= 0
##$F2P= 0
##$FCOR= 0.5
##$FTSIZE= 32768
##$FT_mod= 6
##$GAMMA= 0
##$GB= 0
##$INTBC= 1
##$INTSCL= 1
##$ISEN= 128
##$LB= 0
##$LEV0= 0
##$LPBIN= 0
##$MAXI= 10000
##$MC2= 0
##$MEAN= 0
##$ME_mod= 0
##$MI= 0
##$NCOEF= 0
##$NC_proc= -8
##$NLEV= 6
##$NOISF1= 0
##$NOISF2= 0
##$NSP= 0
##$NTH_PI= 0
##$NZP= 0
##$OFFSET= 14.98509
##$PC= 1
##$PHC0= 97.34985
##$PHC1= 0
##$PH_mod= 1
##$PKNL= yes
##$PPARMOD= 0
##$PPDIAG= 0
##$PPIPTYP= 0
##$PPMPNUM= 2147483647
##$PPRESOL= 1
##$PSCAL= 4
##$PSIGN= 0
##$PYNMP= <proc.py>
##$REVERSE= no
##$SF= 400.02
##$SI= 32768
##$SIGF1= 0
##$SIGF2= 0
##$SINO= 400
##$SIOLD= 32768
##$SPECTYP= <>
##$SREGLST= <1H.CDCl3>
##$SSB= 0
##$STSI= 32768
##$STSR= 0
##$SW_p= 8223.68421052631
##$SYMM= 0
##$S_DEV= 0
##$TDeff= 65536
##$TDoff= 0
##$TI= <>
##$TILT= no
##$TM1= 0
##$TM2= 0
##$TOPLEV= 0
##$USERP1= <user>
##$USERP2= <user>
##$USERP3= <user>
##$USERP4= <user>
##$USERP5= <user>
##$WDW= 1
##$XDIM= 32768
##$YMAX_p= 439811947
##$YMIN_p= -663608
##$CURPLOT= <Network HP LaserJet P1505>
##$CURPRIN= <$Network HP LaserJet P1505>
##$DFORMAT= <normdp>
##$LAYOUT= <+/1D_H.xwp>
##$LFORMAT= <normlp>
##$PFORMAT= <normpl>
##$SURQMSG= 1
$$ End of Bruker specific parameters
$$ ---------------------------------
##NTUPLES= NMR SPECTRUM
##VAR_NAME=  FREQUENCY,     SPECTRUM/REAL,   SPECTRUM/IMAG
##SYMBOL=    X,             R,               I
##VAR_TYPE=  INDEPENDENT,   DEPENDENT,       DEPENDENT
##VAR_FORM=  AFFN,          ASDF,            ASDF
##VAR_DIM=   32768,         32768,           32768
##UNITS=     HZ,            ARBITRARY UNITS, ARBITRARY UNITS
##FACTOR=    0.250966925370066, 1,           1
##FIRST=     8223.43324360094, -93049,       -56358
##LAST=      0,             36759,           -31607
##MIN=       0,             -663608,         0
##MAX=       8223.43324360094, 439811947,    0
$$ Real data points
##PAGE= N=1
##DATA TABLE= (X++(R..R)), XYDATA
$$ [...]
$$ plain form
19562 -66193 -32475 -131157 13012 -210328 53515 87679 -186413 -61544 228250 -51791 77867
19550 -216111 14597 -272107 -254260 -285299 18186 -56500 -286499 -190944 55688 -77298 -187183
19539 -187183 -32896 -55339 12290 -81124 217091 -118507 49635 233370 14496 51124 -181486
19527 35933 -519 -167438 288241 -214350 -51926 -95306 -194838 22444 -50487 119380 -388030
19515 56313 -4758 -269809 235350 69322 -77302 -180338 -168126 -226421 -415754 -128846 67386
19503 -285819 -23401 -85455 -85546 299024 79331 -84393 -201363 56044 -9043 42327 -109005 34780
19490 -41336 946 -9848 -77508 -20912 -17246 243669 -155492 63347 271284 -40837 76091 26334
19477 16119 191173 37518 223735 140448 -40972 -389029 48223 -37803 114109 -26453 -208584
$$ packed form
19562f6193c2475r8682A3012b10328E3515L4164a86413f1544B28250e1791G7867
19550b16111A4597b72107J7847l1039A8186e6500k29999R5555E5688g7298j09885
19539a87183c2896k2443A2290h1124B17091a18507D9635J83735A4496L6628a81486
19527C5933e19j66919B88241b14350e1926m3380r9532B2444e0487A19380c88030
19515E6313d758k65051B35350F9322g7302j03036J2212n8295j89333a28846F7386
19503b85819b3401o2054r1B99024G9331h4393j16970E6044i043D2327a09005C4780
19490d1336I46i848o7660b0912L666B43669a55492F3347K07937d0837G6091B6334
19477A6119J75054C7518J86217q3287d0972l48057D8223c7803A14109b6453j82131
$$ plain form
19466 -208584 -68417 9100 -134209 -189987 7906 -92772 257230 -69162 -478171 -237751 -121191
19455 -121191 -166507 -194493 -37712 -127613 275844 158378 113907 181025 38691 246009 -413197
19443 257206 -138451 139935 100427 -124730 -45733 -116198 295286 73308 127129 104986 181478
19432 181478 -55561 -508361 -273273 -226766 40822 -227318 260629 93572 111809 -160625
19421 -145523 55551 -171931 73048 -191414 91251 -130183 51020 107554 110288 20387 235515
19410 235515 -311362 -319825 -130575 -54403 -186401 -197036 -395899 -232476 -348327 -169037
19399 196611 -49175 -249312 180349 270159 -209023 39958 -258539 53189 -213557 387123
19388 164351 39127 73370 -31906 -12908 -474963 -182020 -388816 -146461 -239495 -129668
$$ packed form
19466b08584f8417I100a34209n5778G906i2772B57230f9162m09009b37751J16560
19455a21191m5316k7986c7712q9901B75844j17466m4471O7118C8691K07318d13197
19443B57206a38451A39935l9508a24730d5733p0465B95286G3308N3821k2143P6492
19432A81478e5561m52800K35088M6507D0822b27318B60629I3572J8237a60625
19421a45523E5551a71931G3048a91414I1251a30183E1020N6534K734B0387K15128
19410B35515c11362q463a30575e4403j31998j0635j98863J63423j15851a69037
19399A96611d9175k00137A80349Q9810b09023C9958b58539E3189b13557C87123
19388A64351C9127L4243c1906a2908m62055a82020k06796a46461r3034J09827
$$ plain form
19378 -129668 -146818 -184854 47803 4149 -52953 81016 -19938 28038 -6143 -251215 -150162
19367 -150162 38452 -386976 -90358 -329423 -456188 -417941 10277 -82427 19426 -104535 234962
19355 27087 -305030 -81608 64632 205680 -50486 41640 661 -325166 95721 -137575 -152348
19344 -152348 -156441 -87066 92884 45897 -233799 239997 -4636 84255 46791 -124063 432237
19332 24688 -363511 104885 26083 -87193 -31992 -140036 -25594 -1721 13783 9822 -85286
19320 -201937 2256 94913 90398 -116980 64409 25176 -303752 -112405 -66139 -23811 -101232
19309 -101232 -73766 -207296 -48399 -19875 43078 -142990 77851 -71133 135830 126867 -6618
19297 -37662 -393467 -323799 12304 24488 -94995 -205285 -189129 -63899 -188600 -115018 -163916
$$ packed form
19378a29668j7150l8036D7803D149e2953H1016a9938B8038f143k45072J01053
19367a50162C8452c86976i0358k39065j26765L8247A0277h2427A9426a04535B34962
19355B7087c05030h1608F4632J41048e0486D1640F61c25166I5721a37575j4773
19344a52348m093O9375I2884D5897b33799B39997d636H4255l7464a24063D32237
19332B4688c63511A04885B6083h7193c1992j08044b5594a721A3783l961h5286
19320b01937B256R2657m515a16980F4409B5176c03752a12405M6266b3811p7421
19309a01232K7466j33530d8399a9875D3078a42990G7851g1133A35830q963f618
19297c7662l55805O9668A2304J2184i4995j10290J6156f3899j24701P3582m8898
$$ plain form
19286 -163916 -227174 -137547 -37173 209375 117541 -312871 -132047 121934 101398 -88310 -227143
19275 -227143 -221571 -231320 -43071 18794 -95623 -13866 -63944 75060 -179583 41100 -102668
19263 -149696 231489 197011 122111 88762 -141415 -265792 -233727 -141283 -390260 -39803 32011
19251 -129917 -35633 84095 -109316 198112 -32493 96579 -141866 -60675 35289 8184 -65275
19239 -105292 -146205 107198 143500 109549 -73516 181802 -2452 -123319 232812 -16913 -166516
19228 -166516 -241382 -236203 65453 -46326 -292306 -208745 -213773 -9749 -188864 -39236 24293 7070
19215 -231169 18247 -132020 -287584 -135179 1617 -342562 -204448 -154614 -106265 -30543 -37023
19204 -37023 62613 24072 -167633 50106 -235834 -171487 -50405 -8965 378932 51556 217845
$$ packed form
19286a63916o3258Q9627c7173B09375r1834c12871a32047A21934k0536h8310j38833
19275b27143N572r749d3071A8794i5623a3866n0078G5060a79583D1100a02668
19263a49696B31489l4478p4900l3349a41415j24377L2065R2444k48977c9803C2011
19251a29917c5633H4095a09316A98112c2493I6579a41866f0675C5289H184f5275
19239a05292m0913A07198L6302l3951g3516A81802b452j20867B32812a6913j49603
19228a66516p4866N179F5453d6326k45980Q3561n028i749j79115c9236B4293G070
19215b31169A8247a32020j55564a35179A617c42562J38114M9834M8349c0543o480
19204c7023F2613B4072a67633E0106b35834O4347e0405h965C78932E1556J66289
$$ plain form
19193 217845 -86506 -33380 -54540 -107808 202858 -46738 -33172 -66299 146182 -168933 -90122
19182 -90122 158039 1043 -91214 33226 -88126 -107197 151635 -87503 -340020 9730 129282
19171 129282 -218475 -86233 -262288 72835 -314096 -277568 -191043 90283 45306 40870 15143
19159 -275401 164799 358133 154372 -171262 -29973 128319 40749 -305717 -201770 -217646
19149 -217646 -107945 209434 -48088 -180037 -193811 113535 -19405 -190803 -132744 112182
19138 -54268 -174141 159236 -135707 11106 -120727 -145672 238917 -170483 -291125 -25426
19127 -281167 162712 -33622 96359 4093 -83579 -105516 101432 -60307 -121339 89732 202045
19116 202045 -183835 126342 -116622 -289768 99129 -385035 -291414 -278103 59180 122987
$$ packed form
19193B17845h6506c3380k1160n3268B02858d6738J3566l3127A46182a68933P8811
19182i0122A58039A043i1214C3226h8126j9071A51635h7503k52517I730J19552
19171A29282b18475h6233j76055G2835c14096L6528Q6525I0283m4977m436A5143
19159b75401A64799J93334A54372a71262b9973A28319D0749c05717J03947j5876
19149b17646a07945B09434d8088j31949j3774A13535a9405j71398N8059A12182
19138e4268j19873A59236a35707A1106a20727k4945B38917a70483j20642b5426
19127b81167A62712c3622I6359D093h3579k1937A01432f0307o1032H9732J12313
19116B02045a83835A26342a16622j73146I9129c85035R3621J3311E9180O3807
$$ plain form
19106 122987 528 37921 278287 -156926 -48592 23734 8115 -224256 -110884 -29986 -58852
19095 -58852 89530 -29028 -53461 -248726 -39382 -139189 -31938 117784 5924 303126 269391
19084 269391 -118550 -69235 -150236 -130376 57769 -257382 -84834 -173068 -210164 146586 -251437
19072 59240 -78628 -105285 -117282 -4009 18557 -31836 119897 134832 -261267 -163049 -44906
19060 -303432 253754 -56435 -396256 42112 134521 129068 51773 -226704 -235482 -205774 293279
19048 -5833 -100244 -254712 -41796 -16154 -312570 -209906 -100827 -277666 168648 105296 -161331
19036 -308685 -199296 -38855 106095 -380525 169963 -118627 -203725 242474 -77269 -37265
19025 60687 5963 -2893 7909 -90733 159278 -88003 -3520 -360026 183977 -203645 -19269 -189541
$$ packed form
19106A22987E28L7393K40366a56926d8592B3734H115b24256a10884b9986k8866
19095e8852H9530b9028k4433j95265c9382r9807c1938A17784E924K97202l3735
19084B69391a18550M9315q1001J9860E7769b57382h4834q8234l7096A46586b51437
19072E9240g8628k6657j1997d009A8557c1836A19897J4935b61267R8218d4906
19060c03432B53754e6435l39821D2112R2409n453E1773b26704q778K9708B93279
19048e833r4411j54468d1796a6154k96416J02664a00827j76839A68648o3352a61331
19036c08685J09389c8855A06095c80525A69963a18627q5098B42474g7269c7265
19025F0687E963b893G909i0733A59278h8003c520l56506A83977b03645a9269j70272
$$ plain form
19013 -189541 95013 60441 108007 -258038 117893 -25187 -42353 -61329 -222920 112945 -83287
19001 -206040 -205270 -132236 103753 -153499 -179030 -34306 -124840 161833 -35309 179766 -40255
18989 -10656 194767 59780 -91297 -100579 -90050 86554 -128738 15243 -148556 -51451 -170004
18978 -170004 -116830 483541 -31351 141645 -132356 -1267 42419 139351 8301 -85868 175395
18966 -376386 -98694 17041 178417 -239721 -198334 -41205 16467 247377 -191099 44770 34605
18955 34605 6501 50511 -270802 -468580 132578 -248779 -5136 -185839 201432 -135744 339579
18943 -174813 71024 122832 -229431 332435 14350 -205342 -254035 -431448 -96080 210361
18932 -56159 -451650 99586 -126929 -86820 133638 -43659 58763 -93321 27734 181575 -115204
$$ packed form
19013a89541I5013l4572M7566b58038A17893b5187j7166j8976j61591A12945h3287
19001b06040P70P3034A03753a53499k5531c4306r0534A61833c5309A79766d0255
18989a0656A94767E9780i1297r282J0529H6554a28738A5243a48556e1451j18553
18978a70004N3174D83541c1351A41645a32356a267D2419R6932H301h5868A75395
18966c76386i8694A7041J61376b39721M1387d1205A6467K30910a91099D4770j0165
18955C4605F501M4010b70802j97778A32578b48779e136j80703B01432a35744C39579
18943a74813G1024N1808b29431C32435A4350b05342m8693j77413i6080B10361
18932e6159l95491I9586a26929M0109A33638d3659E8763i3321B7734J53841a15204
$$ plain form
18920 -106984 55624 14500 30691 -84021 -62111 156964 -248609 -56015 49060 70798 -169431
18908 -125028 -205064 65565 349893 -30541 -166777 35630 271339 -173564 -55247 -229337
18898 -229337 -137493 -87674 -12040 109357 113022 87445 146244 -164348 82684 -85421 -232019
18887 -232019 183085 175604 197974 -81451 -128480 79281 103289 169223 4236 66850 -156898
18875 -57423 -157584 120059 -211739 -112115 -41782 -282645 -141279 -52500 -262126 66403
18864 64538 82248 -333084 90399 143939 -48150 206483 -40261 -186970 -201245 -117524 -355171
18853 -355171 -84237 18151 145706 13117 25683 31176 -332481 37757 -224110 -29051 -308411
18842 -308411 308359 -130296 -294417 230415 -190682 -71333 -170306 36666 79747 -130624
$$ packed form
18920a06984E5624A4500J6191h4021K1910A56964b48609e6015D9060K1738a69431
18908a25028q0036F5565K84328c0541j36236C5630K35709a73564e5247j74090
18898b29337R1844M9819a2040A09357L665k5577N8799a64348H2684h5421j46598
18887b32019A83085p481K2370h1451m7029G9281K4008O5934D236O2614a56898
18875e7423j00161A20059b11739R9624d1782k40863a41279e2500k09626F6403
18864F4538J7710c33084I0399N3540d8150B06483d0261j46709j4275Q3721k37647
18853c55171h4237A8151J27555A3117J2566N493c32481C7757b24110b9051k79360
18842c08411C08359a30296j64121B30415a90682g1333r8973C6666M3081a30624
$$ plain form
18831 188036 34529 320082 -166173 165432 50060 -210218 291587 32213 219373 -14566
18820 59788 -18418 5890 178370 -45251 -299400 68830 50704 -414998 -812 104522 -51456
18808 181818 -125923 -155005 -356652 193433 -131825 101242 -259306 46298 161546 21809
18797 -297676 -30394 119407 65352 -78449 -56372 87420 105507 32426 51154 135011 88022
18786 88022 -96831 167023 -59113 6733 -110115 -18375 -78824 228416 55429 127075 -250792
18774 -304208 -162885 -23612 128605 -108776 -92995 -243851 -287586 -287682 330175 -51240 -83573
18763 -83573 -41119 -224955 -65346 -33456 22418 35224 88191 -139520 155694 -183526 -194944
18752 -194944 -263632 142149 -313642 146694 17280 240982 -54688 -42023 104699 -419416
$$ packed form
18831A88036C4529K85553a66173A65432E0060b10218B91587C2213J87160a4566
18820E9788a8418E890J72480d5251k54149F8830j8126d14998h12A04522e1456
18808A81818a25923k9082k01647A93433a31825A01242b59306D6298J15248B1809
18797b97676c0394A19407n4055g8449K2077H7420J8087C2426J8728Q3857m6989
18786H8022i6831A67023e9113F733a10115a8375o0449B28416E5429P1646b50792
18774c04208J41323b3612A28605a08776J5781j50856m3735r6C30175e1240l2333
18763h3573d1119j83836f5346L1890B2418J2806N2967a39520A55694a83526j1418
18752a94944o8688A42149c13642A46694A7280K23702e4688J2665A04699d19416
$$ plain form
18741 18780 -79718 -134478 -105993 61686 -59655 188750 366078 121543 27042 -23509 -213490
18730 -213490 15690 -15532 -257198 -3726 38180 240472 138097 -68996 -49318 -1554 177559
18718 70053 22836 -3959 34290 78437 -121654 -426829 115320 -94017 -159833 -308747 97665
18706 182639 204043 -143825 -233793 -164766 -70441 -222953 -176002 -178939 -217226 -112764 -8984
18694 119399 -300807 70333 -261327 81682 -72386 -21909 -243330 -157235 166436 139002 -196828
18682 -162345 -321802 -235659 -34532 116886 132382 -119032 350377 -186990 53606 -101695
18671 -214417 -102081 -93417 -57661 34360 121472 -54736 101709 -17066 -180002 -124951 -107494
18660 -107494 -349541 -314720 -139911 -253559 -223146 160798 186128 -88566 217437 -53805
$$ packed form
18741A8780g9718n4760K8485F1686e9655A88750J77328A21543B7042b3509j89981
18730b13490A5690a5532k41666c726C8180K02292j02375f8996J9678a554A77559
18718G0053B2836c959C4290M4147a21654l05175A15320i4017o5816j48914I7665
18706A82639K1404a43825q9968O9027g0441j52512M6951k937l8287J04462h984
18694A19399c00807G0333b61327H1682g2386b1909k21421Q6095A66436k7434a96828
18682a62345j59457Q6143c4532A16886J5496a19032C50377a86990E3606a01695
18671b14417a02081Q664L5756C4360Q7112e4736A01709a7066j62936N5051J7457
18660a07494k42047L4821a39911j13648L0413A60798K5330h8566B17437e3805
$$ plain form
18649 36107 3924 -124726 124619 17847 76968 -120584 136780 88606 -22579 -134572 -104490
18638 -104490 50779 -367855 -230584 154330 174873 -359137 -230330 -272277 104276 189769
18628 189769 -34243 -87647 -143356 -105489 -207331 -37822 183809 -209886 -118374 -213174 127564
18616 189956 -29978 -21861 -402153 135012 -105726 210852 -139803 -93010 38493 -377580
18605 -60510 149848 32171 162575 -189810 -165490 -82789 -4784 409664 70938 -41664 195875
18593 650 34226 220838 75746 201062 234033 100006 61023 -200822 14985 -205272 50465
18581 -267507 199208 -152517 276997 -185889 5301 26646 66228 133756 399751 122366
18570 -410044 483137 -115713 -101497 88777 50362 -89928 -74915 -27582 -102635 88122 153873
$$ packed form
18649C6107C924a24726A24619A7847N9121a20584A36780m8174b2579j11993L0082
18638a04490E0779c67855J37271A54330K0543c59137J28807m1947A04276Q5493
18628A89769c4243n3404n5709L7867j01842c7822A83809b09886R1512r4800A27564
18616A89956b9978Q117l80292A35012a05726B10852a39803M6793C8493c77580
18605f0510A49848C2171J30404a89810K4320Q2701d784D09664G0938d1664A95875
18593F50L3576J86612G5746J25316L2971A00006l8983b00822A4985b05272E0465
18581b67507A99208a52517B76997a85889E301K1345L9582O7528K65995A22366
18570d10044D83137a15713J4216H8777l8415h9928J5013b7582p5053H8122O5751
$$ plain form
18559 153873 -75669 -74700 -168925 -310007 -230431 -306309 96833 -39860 -134119 151398 -2798 -386223
18547 -386223 74379 152690 -95585 -161075 -165941 -116139 -340810 -254956 70329 11200 -141659
18535 -51361 269286 -139618 169610 169517 -153906 110765 -237145 -83198 -109355 -17967 54610
18523 -184129 -29819 -130788 112078 44987 -126082 53196 198343 -102883 238331 -147376
18512 44033 -419548 -108957 -41834 -231120 61979 -209460 36930 -315967 88878 -126850
18501 -181998 -222451 38890 25311 -144347 50928 -194443 -240843 260259 -138618 199891
18490 -102672 -218065 -239921 -253736 -311599 -183914 -282899 108022 -4108 193093 -47896 187883
18478 177877 370434 299773 -36958 188442 137211 -149058 -360771 99156 -73030 -77064 -123398
$$ packed form
18559A53873g5669R69r4225j41082P9576p5878I6833c9860r4259A51398b798l83425
18547c86223G4379P8311i5585o5490m866M9802k24671Q5854G0329A1200a41659
18535e1361B69286a39618A69610r3a53906A10765b37145h3198k6157a7967E4610
18523a84129b9819j00969A12078D4987a26082E3196J45147a02883B38331a47376
18512D4033d19548a08957d1834j89286F1979b09460C6930c15967H8878a26850
18501a81998m0453C8890j3579a44347E0928a94443m6400B60259a38618A99891
18490a02672j15393k1856j3815n7863J27685r8985A08022d108A93093d7896A87883
18478A77877J92557p0661c6958A88442n1231a49058k11713I9156g3030m034m6334
$$ plain form
18467 -123398 -323475 -2791 49497 -56459 -64480 -103176 -10776 -27520 -212968 -323632 -142508
18455 -21191 -91801 -379749 -170629 167170 -64071 20032 124388 -213665 -164851 -22661 335450
18443 -78378 115952 -64337 -193651 107325 -115785 8574 -80981 28465 -295180 -240838 -35359
18431 1807 -110676 -320066 -31884 79108 -70639 294971 -328361 -27165 -136277 426735 -121520
18419 186929 -80875 -59316 -145261 -300808 17022 259941 -279762 13545 -36010 -327964 338488
18407 250738 110974 -521697 -76990 -31247 -75390 103697 11834 27912 -139791 195894
18396 107343 -26259 -188396 -1542 -83622 -103496 -289061 69563 -106416 -174501 294425 310090
18385 310090 -46459 156817 49151 -51427 111369 -219472 -227357 -390809 275279 -112935
$$ packed form
18467a23398k00077b791D9497e6459q021l8696a0776j6744j85448j10664a42508
18455b1191p0610k87948a70629A67170f4071B0032J04356b13665M8814b2661C35450
18443g8378A15952f4337j29314A07325a15785H574h0981B8465b95180N4342c5359
18431A807a10676k09390c1884G9108g0639B94971c28361b7165j09112D26735a21520
18419A86929h0875K1559q5945j55547A7022K42919b79762A3545c6010k91954C38488
18407B50738A10974e21697g6990c1247m4143A03697A1834J6078a39791A95894
18396A07343b6259j62137a542q2080j9874j85565F9563a06416o8085B94425J5665
18385C10090d6459A56817D9151e1427A11369b19472p885j63452B75279a12935
$$ plain form
18374 314658 179856 -179465 119627 -35606 27290 -175682 18261 103730 176959 74618 -461291
18362 -84220 115693 -135093 -238056 405527 -76404 117603 -28175 3987 -134356 -266235
18352 -266235 6646 -42449 -61525 -134983 132439 235077 -2298 -125367 -30664 199096 -297685
18340 115848 -142912 21619 -173072 -203537 -297397 69989 75725 -25822 -29908 -34618 -184408
18329 -184408 -4116 -278390 -166196 -107871 -9354 39411 -139682 225663 -188074 276718 -270258
18317 -34148 -2921 -204385 81180 19763 85201 76055 -231009 -43710 15551 -126913 -118289 187697
18304 -345533 29048 12800 -286897 9604 -114927 -138782 -192466 89899 -14807 27995 -24130
18292 -167489 -84437 123652 -120428 -82859 -19135 -77923 -100038 182629 6783 -32455 70859
$$ packed form
18374C14658j34802a79465A19627c5606B7290a75682A8261Q5469P3229G4618d61291
18362h4220A15693a35093j02963D05527g6404A17603b8175C987a34356j31879
18352b66235F646d2449j9076p3458A32439J02638b298j23069c0664A99096b97685
18340A15848a42912B1619a73072l0465r3860F9989N736b5822m086m710j49790
18329a84408d116k74274J12194N8325i354C9411a39682B25663a88074B76718b70258
18317c4148b921k01464H1180A9763O5438r146b31009d3710A5551a26913Q624A87697
18304c45533B9048A2800b86897I604a14927k3855n3684H9899a4807B7995b4130
18292a67489Q3052A23652a20428L7569a9135n8788k2115A82629F783c2455G0859
$$ plain form
18280 10826 -2733 -6214 -186040 137336 -183314 -91672 123520 -241713 -192852 245912 -39826
18268 -201574 33075 37159 218836 81004 -10404 164869 -60160 -2622 184175 181954 -43703
18256 226993 -174286 69123 -190597 20543 19549 -43912 65328 128330 21614 -164022 -295534
18245 -295534 153074 -60268 -20470 167228 16416 -179052 -128039 -1667 -286626 308751 38370
18233 50808 -139116 -42816 -91528 -3111 -12331 146976 -93937 -157947 -88427 168612 205042
18222 205042 -89606 -381682 390267 -304027 -130239 -117380 -56396 -97595 -155402 8993 -301838
18210 -143411 -117148 -207913 -46990 381912 425267 -134884 64537 -160418 -231934 -94419 -62852
18199 -62852 -495 -219813 401074 74930 -400650 -33650 -47066 -141065 -17381 26615 -192783
$$ packed form
18280A0826b733l481j79826A37336a83314R1642A23520b41713M8861B45912c9826
18268b01574C3075M084J81677H1004a0404A64869f0160b622A84175k221d3703
18256B26993a74286F9123a90597B0543r94d3912F5328O3002B1614a64022j31512
18245b95534A53074f0268b0470A67228A6416a79052N1013a667k84959C08751C8370
18233E0808a39116d2816m8712c111r220A46976i3937o4010O9520A68612L6430
18222B05042h9606k92076C90267c04027a30239J2859e6396m1199n7807H993c01838
18210a43411K6263r0765d6990C81912M3355a34884F4537a60418p1516i4419L1567
18199f2852d95k19318D01074G4930d00650c3650j3416r3999a7381B6615a92783
$$ plain form
18187 -33863 -34614 -19426 62094 -205500 -375366 130818 -14042 124825 -234029 -137238 -248246
18176 -248246 -113757 -115358 -27784 -354586 -250446 -211201 27992 -168410 -5066 168355 -355582
18164 -98030 -238637 -120278 73782 -301639 160176 74785 340385 53667 -178255 26122
18153 -59705 -220360 -122601 81404 -152570 -113544 107941 -5972 -78843 -39067 220676 167238
18142 167238 -186079 -312667 162379 143456 115091 68497 205002 -160338 133951 -1315
18131 274645 -123596 -198645 -64959 -104462 -182214 -101543 -166338 49591 50091 104454 -201273
18119 279709 -39699 100618 32910 -18479 144710 128842 75077 159397 -141091 26714 145827
18108 145827 -59439 83201 432961 134753 -272017 -434664 43461 -6881 -277877 -272042 -32893
$$ packed form
18187c3863p51J5188F2094b05500j69866A30818a4042A24825b34029R6791j11008
18176b48246a13757j601b7784l26802J04140L9245B7992a68410e066A68355c55582
18164i8030j40607J18359G3782c01639A60176G4785K65600E3667a78255B6122
18153e9705j60655R7759H1404a52570L9026A07941e972p2871c9067B20676n3438
18142A67238a86079j26588A62379j8923k8365m6594J36505a60338A33951a315
18131B74645a23596p5049f4959l9503p7752Q0671o4795D9591N00N4363b01273
18119B79709c9699A00618C2910a8479A44710j5868n3765Q4320a41091B6714J19113
18108A45827e9439H3201L49760A34753b72017j62647D3461f881k70996N835c2893
$$ plain form
18096 -269876 -6567 -142936 -180005 182553 -11594 165010 38132 72287 12664 142691 7476
18084 -203597 -102547 4993 -112595 317861 -75441 -164226 -207472 -108194 -11962 217162 42013
18072 -478852 -92008 82013 -61064 184296 53387 -265022 46843 -206313 -219973 35932 -26803
18060 -228783 -142229 138226 86816 -214924 -65859 55072 -262647 162799 -95545 163111
18049 -120413 -164615 -217718 -157529 162314 -372539 351039 143986 97392 -248522 79763
18038 401623 -71472 -267216 -144435 -124622 73554 255585 90485 -257689 -70252 59275 -26374
18026 -248437 -14692 -90677 9133 -33999 -112113 -244700 238863 38137 -362792 -79501 216947
18014 41405 -83890 150628 -269933 2540 41571 -27146 301346 269503 -239496 132247 -82769
$$ packed form
18096b69876f567j36369l7069A82553a1594A65010C8132L4155A2664J30027G476
18084b03597J01050D993a12595C17861g5441q8785m3246R9278a1962B17162D2013
18072d78852i2008H2013f1064A84296E3387b65022D6843b06313j3660C5932b6803
18060b28783Q6554A38226n1410b14924f5859E5072b62647A62799i5545A63111
18049a20413m4202n3103O0189A62314c72539C51039A43986m6594b48522G9763
18038D01623g1472j95744J22781J9813G3554J82031I0485b57689g0252E9275b6374
18026b48437a4692p5985I133c3999p8114j32587B38863C8137c62792g9501B16947
18014D1405h3890A50628b69933B540L9031b7146C01346l1843b39496A32247h2769
$$ plain form
18002 -12386 -185636 -52875 113224 136422 226014 2793 -277891 204817 -413915 -91063 68560
17990 -112885 51840 122442 -81379 250815 93165 -73615 154401 263516 -74656 -247336 234083
17978 120800 -46508 -58108 8033 -424119 24599 15753 159891 -204705 -313000 89218 -142334
17966 -28938 37426 176748 452572 -95001 -68936 145391 -413529 -117723 169846 431813
17956 431813 -163491 -121356 -108567 198231 103592 -16123 96774 -62283 -203970 2435 -51436
17944 69236 149763 197623 -234130 -46789 327219 -50433 -263018 58630 -22902 -221636 106727
17932 311025 -55408 368139 105956 -93517 -423643 -181512 -25891 -24709 -11353 -111040 230756
17920 31752 176712 -44969 -120274 -135949 -190584 44843 80031 -125341 -77998 99802 -114422
$$ packed form
18002a2386j73250e2875A13224K3198Q9592B793b77891B04817d13915i1063F8560
17990a12885E1840P0602h1379B50815I3165g3615A54401J09115g4656j72680B34083
17978A20800d6508j1600H033d24119B4599q846J44138b04705j08295H9218a42334
17966b8938C7426J39322K75824i5001K6065A45391d13529a17723A69846K61967
17956D31813a63491M2135J2789A98231r4639a6123I6774f2283j41687B435e1436
17944F9236Q0527M7860b34130d6789C27219e0433k12585E8630b2902j98734A06727
17932C11025e5408C68139A05956i3517l30126a81512b5891J182a1353r9687B30756
17920C1752J44960d4969p5305j5675n4635D4843L5188a25341M7343I9802a14422
$$ plain form
17908 142757 -190281 16380 -166933 10901 -115698 -223746 -138380 -5663 -58470 -94371 -259113
17897 -259113 91790 -127343 70020 -301019 -43835 -47854 -67914 164974 39423 -173770 -57027
17885 96447 115392 97675 -176060 -69299 -21562 209087 -34992 -89949 153278 -19568 -83611
17874 -83611 -244005 271117 -13200 165007 -103627 111838 -161789 37201 7836 -116329
17863 -129076 -70313 81581 -41779 63456 -222067 324 31292 72221 -147863 -57455 -153308
17852 -153308 105095 344691 426 -32633 155129 38379 -34752 -247912 224852 51570 31300
17841 31300 -470138 157671 -26359 144538 15546 176056 67712 -2366 -22499 42932 -76635
17829 -242036 29423 -188192 -1350 222595 -157040 -188543 82745 25300 348531 -287591 72552
$$ packed form
17908A42757a90281A6380a66933A0901a15698j08048Q5366e663n2807l5901j64742
17897b59113I1790a27343G0020c01019d3835m019k0060A64974C9423a73770e7027
17885I6447J8945j7717a76060f9299b1562B09087c4992n4957A53278a9568o4043
17874h3611j60394B71117a3200A65007a03627A11838a61789C7201G836a16329
17863a29076N8763H1581d1779F3456b22067C24L0968M0929a47863e7455r5853
17852a53308A05095K39596D26c2633A55129C8379c4752k13160B24852E1570k0270
17841C1300d70138A57671b6359A44538A5546J60510F7712b366k0133D2932g6635
17829b42036B9423a88192a350B22595a57040l1503H2745B5300L23231b87591G2552
$$ plain form
17817 -153445 -35847 -327801 -1326 -189551 29672 -340583 75439 118229 -98282 -46671 -19131
17805 -57103 209912 -212660 -82598 48073 213299 -190398 -88767 -106864 30460 59171 -14775
17793 128793 88177 188777 57096 436811 -112908 -125185 191773 747 -521167 61987 452053
17782 452053 -43315 212130 -43281 100538 104647 58256 180320 -114582 -60002 -44067 106215
17770 261032 202827 -282193 -271027 -86199 -121168 -54707 -155625 -359092 90077 348492 -60945
17758 -303556 -52137 -181090 113606 -39728 -34399 327949 -106762 245366 -445533 9270 399649
17747 399649 174026 -53603 88295 32856 44241 30389 20071 -111286 89464 75182 32978
17735 -29380 96250 -34465 201500 -243784 13360 -61961 21390 22879 -6081 -392534 -80284
$$ packed form
17817a53445c5847k91954a326j88225B9672c40583G5439M2790i8282d6671a9131
17805e7103B09912b12660h2598D8073J65226a90398h8767j8097C0460K8711a4775
17793A28793m0616J00600E7096L79715a12908j2277A91773G47e21167F1987L90066
17782D52053d3315B12130d3281A00538M109m6391J22064a14582N4580J5935A06215
17770B61032n8205b82193J1166h6199l4969e4707j00918k03467I0077K58415f0945
17758c03556e2137j28953A13606c9728N329C27949a06762B45366d45533I270L90379
17747C99649A74026e3603H8295C2856J1385j3852j0318a11286H9464j4282C2978
17735b9380I6250c4465B01500b43784A3360f1961B1390J489f081l86453h0284
$$ plain form
17723 35590 173579 -10718 -1732 -140281 -36654 -83002 48647 -84167 -196232 58547 121876
17712 121876 147865 255531 6831 197807 -194745 391383 109310 226742 148233 -26287
17701 177934 -144265 -140002 -160341 -141333 -2523 38692 224082 93601 -153029 -19164 -247343
17690 -247343 -161284 -103264 67170 156579 2926 -16111 146913 38185 131112 32005 -73507
17678 133420 -177936 -19099 428549 215054 -199105 215236 -130876 79049 -62103 33360
17667 -215871 111265 52767 -15565 88584 -78467 306525 -250376 -33502 -30942 114530 -17501
17655 20568 -70395 226932 -106075 -151641 -131869 -79161 -4077 115944 309947 -254764 -105375
17643 267862 42505 486141 100248 -72651 173649 -28935 270543 364835 453539 -71322 -70021
$$ packed form
17723C5590J37989a0718a732j38549c6654m6348D8647h4167j12065E8547O3329
17712A21876K5989J07666F831J90976a94745C91383A09310J17432p8509b6287
17701A77934a44265M263k0339J9008b523C8692J85390I3601a53029a9164k28179
17690b47343Q6059N8020F7170Q9409B926a6111A46913C8185R2927C2005g3507
17678A33420a77936a9099D28549k13495a99105B15236a30876G9049f2103C3360
17667b15871A11265E2767a5565H8584g8467C06525b50376c3502K560A14530a7501
17655B0568g0395B26932a06075m5566J9772N2708d077A15944J94003b54764a05375
17643B67862D2505M43636A00248g2651A73649b8935B70543R4292Q8704g1322J301
$$ plain form
17632 -70021 -209593 -85499 -56149 -50802 19360 20860 -6508 -83068 67851 -425700 244601 -82961
17619 107514 194495 -30252 239635 -83688 18647 243638 -194973 278460 36821 -295908
17608 -151916 -61631 181819 -258233 -109148 65028 242081 225872 60258 -289541 -42214
17597 37410 -1117 41242 -128247 228197 85520 156546 -27627 40621 -29100 251286 -40999
17585 34678 88219 73408 -29482 -126069 15844 -95448 246402 -48086 1528 -71110 162815
17573 -60414 -66113 -151136 -63277 224967 -116590 -49252 645 -136091 -361697 -106234 102154
17561 -100733 280236 205886 225671 -101929 108627 310981 115340 220686 -117553 -100613
17551 -100613 -93525 19285 -7054 411969 181778 144557 86210 114443 92921 99922 164143 31690
$$ packed form
17632g0021j39572h5499K9350N347A9360J500f508p6560F7851d25700B44601h2961
17619A07514Q6981c0252B39635h3688A8647K24991a94973B78460C6821b95908
17608a51916f1631A81819b58233a09148F5028J77053j6209F0258b89541d2214
17597C7410a117D1242a28247B28197H5520P1026b7627D0621b9100B51286d0999
17585C4678N3541j4811b9482r6587A5844i5448B46402d8086A528g1110A62815
17573f0414n699q5023f3277B24967a16590d9252F45a36091k25606a06234A02154
17561a00733B80236p4350J9785a01929A08627K02354A15340J05346a17553J6940
17551a00613P088A9285g054D11969A81778l7221n8347K8233k1522P001O4221C1690
$$ plain form
17538 30967 159497 85810 -218631 -8317 47633 214906 -173706 42099 459496 -62960 -184541
17527 -184541 -111770 350705 -553 185056 134918 19987 367129 285351 370173 230766 163060
17516 163060 145882 -150469 -215896 -133267 224927 63605 -133773 222267 40172 -23445 196226
17504 -130428 -69306 76669 375737 -223609 -382600 24812 38098 136759 9106 53506 -24737
17492 412103 220880 41036 -8500 80662 -99325 147505 -237194 289126 43146 33518 73240
17481 73240 349485 428874 232844 53506 -27341 169212 452127 105437 -85128 227689
17470 165482 -10347 450782 126579 204886 319514 239348 101143 43615 257845 123189
17459 256246 76488 222783 311771 -44616 131662 252873 407916 63233 259027 467869
$$ packed form
17538C0967J28530p3687b18631h317D7633J67273a73706D2099M17397f2960j21581
17527a84541P2771C50705e53A85056n0138A9987L47142q1778Q4822j39407o7706
17516A63060j7178a50469o5427Q2629B24927F3605a33773B22267D0172b3445A96226
17504a30428O1122G6669K99068b23609j58991B4812J3286R8661I106M4400b4737
17492D12103j91223D1036h500H0662i9325A47505b37194B89126D3146r628L9722
17481G3240K76245P9389j96030E3506b7341A69212K82915A05437h5128B27689
17470A65482a0347D50782A26579P8307J14628q0166A01143D3615K14230A23189
17459B56246G6488J46295Q8988d4616A31662J21211J55043F3233J95794K08842
$$ plain form
17449 467869 277188 236845 275726 182270 299338 164772 456326 346849 344355 -134205
17438 396345 417765 528615 242516 -138597 241865 82173 94616 170810 392754 230209
17428 230209 363212 193980 49424 224912 287218 534332 291855 309808 143717 291734
17418 291734 540997 408523 191783 405612 332595 187041 10938 69938 354357 129296
17407 206130 290282 -410203 -133146 -115535 179248 206167 171959 207697 19082 -170962 45583
17395 -120677 105817 107734 201707 291908 318992 64682 -24369 154324 215332 175115 110340
17384 110340 269543 -97601 244805 310759 201548 351496 176156 190189 97281 416658
17374 416658 14570 37767 342099 303844 -178894 193817 4760 79515 248181 113307 -70379
$$ packed form
17449D67869j90681m0343L8881r3456J17068j34566K91554j09477k494a34205
17438C96345K1420J10850B42516a38597B41865H2173J2443P6194K21944j62545
17428B30209J33003j69232D9424J75488O2306K47114k42477J7953A43717J48017
17418B91734K49263j32474A91783K13829p3017j45554A0938N9000K84419A29296
17407B06130Q4152d10203a33146J7611A79248K6919l4208L5738A9082a70962D5583
17395a20677A05817J917R3973R0201K7084F4682b4369A54324O1008m0217o4775
17384A10340J59203i7601B44805O5954j09211J49948j75340J4033r2908L19377
17374D16658A4570K3197L04332l8255a78894A93817D760P4755J68666A13307g0379
$$ plain form
17362 17222 70342 265355 67595 228916 48564 179511 26500 241900 254883 -65837 255863
17350 179745 114076 44538 -33528 5836 199704 342118 156439 268449 348445 33670 176222
17339 176222 269616 166273 178378 228400 112924 47123 152766 6225 200493 128473 450470
17328 450470 -28304 217994 282393 111542 -50610 184888 33763 234897 -42642 193303
17317 162673 625996 291358 279796 124784 -112387 225762 -92631 160302 202809 162627
17307 162627 354442 -23234 373539 175127 86669 -120975 428897 -149370 265410 -87786
17296 -3792 422038 35880 322329 231959 393494 79911 281046 744019 53583 -34131 -159165
17285 -159165 -152630 179345 125795 384456 78481 101534 320750 231336 552349 5373 148149
$$ packed form
17362A7222N3120J95013F7595J61321D8564J30947B6500K15400J2983f5837B55863
17350A79745o5669D4538c3528E836J93868J42414A56439J12010P9996C3670J42552
17339A76222R3394j03343J2105N0022A12924D7123J05643F225J94268p2020L21997
17328D50470b8304B17994O4399A11542e0610A84888C3763K01134d2642A93303
17317A62673M63323B91358j1562A24784a12387B25762i2631A60302M2507m0182
17307A62627J91815b3234C73539A75127H6669a20975D28897a49370B65410h7786
17296c792D22038C5880K86449r0370J61535G9911K01135M62973E3583c4131j25034
17285a59165O535A79345n3550K58661G8481K3053K19216q9414L21013E373J42776
$$ plain form
17274 148149 278435 331810 288241 272838 75179 286022 -108013 112619 286409 339519
17264 339519 -44563 207586 104927 67599 41712 339833 -368 142953 165855 154383 374024
17253 374024 307352 217390 186256 199698 331755 12528 84751 470536 -118864 67192 5846
17241 334663 233725 30145 -6501 143718 464668 56511 -89317 275480 181632 129652 225361
17230 225361 28695 150767 117143 201661 255661 114913 362289 295132 117352 320315
17220 320315 399956 210808 261186 450659 267036 212170 168046 375908 160112 404244
17210 404244 413552 210660 69471 194505 283084 300100 352370 226113 385834 436876 276623
17199 276623 174278 236549 192945 281989 162096 409281 481587 223514 404747 259700
$$ packed form
17274A48149J30286N3375m3569j5403G5179K10843a08013A12619J73790N3110
17264C39519d4563B07586j02659l7328k5887K98121c68A42953K2902j1472K19641
17253C74024o6672q9962l1134J3442J32057A2528P2223L85785a18864F7192E846
17241C34663j00938C0145f501A43718L20950E6511h9317B75480r3848n1980R5709
17230B25361B8695J22072l3624Q4518N4000A14913K47376o7157A17352K02963
17220C20315P9641j89148N0378J89473j83623n4866m4124K07862A60112K44132
17210D04244R308k02892F9471J25034Q8579J7016N2270j26257J59721N1042j60253
17199B76623j02345O2271m3604Q9044j19893K47185P2306B23514J81233j45047
$$ plain form
17189 259700 249544 361914 245562 196292 143948 185865 120206 67508 642511 314980 283812
17178 283812 602374 96221 381940 181324 300278 152504 248866 361957 51475 66752
17168 66752 152665 284550 81695 135606 206596 388278 -142029 388703 293714 192892 360838
17157 360838 6454 541864 307047 326130 224301 695513 510816 283288 39392 543606
17147 543606 714112 143812 157200 140957 590598 357409 464276 421350 87623 12389
17136 465508 291262 540517 324985 199152 523446 354735 250558 392694 89283 187639
17126 187639 692563 402901 178018 334891 198923 360909 416311 -12025 58112 338066
17116 338066 242437 318368 578228 267191 525876 801558 170853 603279 311814 356404
$$ packed form
17189B59700j0156J12370j16352m9270n2344M1917o5659n2698N75003C14980l1168
17178B83812L18562I6221K85719A81324J18954j47774R6362J13091E1475J5277
17168F6752Q5913J31885H1695N3911P0990J81682a42029C88703r4989j00822J67946
17157C60838F454N35410k34817J9083j01829M71212j84697k27528C9392N04214
17147E43606J70506A43812J3388j6243M49641k33189J06867m2926H7623A2389
17136D65508j74246K49255k15532j25833L24294j68711j04177J42136H9283R8356
17126A87639N04924k89662A78018J56873j35968J61986N5402a2025E8112K79954
17116C38066r5629P5931K59860B67191K58685K75682A70853M32426k91465M4590
$$ plain form
17106 356404 250600 609988 309276 526719 574718 260586 748330 627789 218151 382532
17096 382532 423985 54525 455755 544731 245661 267107 72244 660866 610977 267927 262236
17085 262236 169967 457843 340612 891778 396791 404108 376317 259259 550804 242704
17074 587834 161700 659679 372645 545507 518505 506309 379614 76800 514256 145976
17063 399198 283969 468809 619607 473336 825375 590086 662454 754620 730818 728100
17053 728100 584707 708001 411522 500299 515772 225722 331697 595683 832461 798616
17043 798616 546291 466095 550043 756781 730363 472411 597601 655866 525920 446160
17033 446160 568420 551162 779733 737884 591779 724101 757843 311740 534741 480699
$$ packed form
17106C56404j05804L59388l00712K17443M7999B60586M87744j20541B18151J64381
17096C82532M1453E4525M01230Q8976B45661K1446G2244N88622m9889B67927n691
17085B62236r2269K87876j17231N51166C96791P317k7791j17058K91545B42704
17074E87834A61700M97979k87034J72862k7002j2196j26695G6800M37456A45976
17063C99198j15229J84840J50798j46271L52039k35289P2368R2166k3802k718
17053G28100j43393J23294k96479Q8777J5473B25722J05975K63986K36778l3845
17043G98616k52325q0196Q3948K06738k6418k57952J25190N8265j29946p9760
17033D46160J22260j7258K28571m1849j46105J32322L3742C11740K23001n4042
$$ plain form
17023 480699 524455 593302 518517 538522 413388 536436 647044 395371 541173 942336
17013 942336 929328 747185 843075 563853 951672 781562 704983 722381 900607 506783
17003 506783 971962 642927 710685 785062 739167 998889 929908 619634 846076 758649
16993 758649 699843 695818 981063 348571 796889 1038524 649458 785942 820739 542287
16983 542287 919712 827927 596877 875738 796961 946751 1009336 954059 991487 735833
16973 735833 854418 1200165 1210527 807863 1214529 1183366 1136409 1350340 1082937 991036
16963 991036 1257542 1469363 741260 848986 1053729 1017076 983959 1034330 1139199 1046032
16953 1046032 1083619 1192758 1365763 1127239 1130865 1003803 908469 1558815 1100450 1074024
$$ packed form
17023D80699M3756O8847p4785K0005j25134J23048J10608k51673J45802M01163
17013I42336j3008j82143R5890k79222L87819j70110p6579J7398J78226l93824
17003E06783M65179l29035O7758P4377m5895K59722o8981l10274K26442q7427
16993G58649n8806m025K85245C48571M48318K41635l89066J36484L4797k78452
16983E42287L77425r1785k31050K78861p8777J49790O2585n5277L7428k55654
16973G35833J18585L45747J0362m02664M06666l1163m6957K13931k67403r1901
16963I91036K66506K11821p28103J07726K04743l6653l3117N0371J04869r3167
16953A046032L7587J09139J73005k38524L626j27062r5334O50346m58365k6426
$$ plain form
16943 1074024 1127061 1044367 1279814 1211662 1324963 1017003 1476753 1067472 1098818 1416131
16933 1416131 1541515 1241903 1527408 1330238 1846447 1298435 1219245 1423194 1612287 1307074
16923 1307074 1321372 1711288 1490228 1201980 1263815 1387907 1469249 1620350 1809967 1487792
16913 1487792 1782500 1489109 1926882 1762043 1799283 1707618 1614763 1563489 2057349 1706812
16903 1706812 1542276 1698974 1401909 2061252 2102440 2024216 1997576 2100531 2205243 2021330
16893 2021330 2129615 1884730 1968588 1784054 2032736 2046900 2019532 2056973 2123121 2075492
16883 2075492 2104102 2484764 2438668 2296692 2277596 2248376 2945099 2475070 2589893 2717784
16873 2717784 2673084 2777466 2691210 2707163 2646943 2850293 2716825 2564680 2821334 2759984
$$ packed form
16943A074024N3037q2694K35447o8152J13301l07960M59750m09281L1346L17313
16933A416131J25384k99612K85505j97170N16209n48012p9190K03949J89093l05213
16923A307074J4298L89916k21060k88248O1835J24092Q1342J51101J89617l22175
16913A487792K94708k93391M37773j64839L7240r1665r2855n1274M93860l50537
16903A706812j64536J56698k97065O59343M1188p8224k6640J02955J04712j83913
16893B021330J08285k44885Q3858j84534K48682J4164k7368L7441O6148m7629
16883B075492K8610L80662m6096j41976j9096k9220O96723m70029J14823J27891
16873B717784m4700J04382q6256J5953o0220K03350j33468j52145K56654o1350
$$ plain form
16863 2759984 2932466 2855442 2873121 2727249 3508076 3036118 3405819 3265201 3294472 3201672
16853 3201672 3334924 3320779 3666544 3888025 3752869 3571783 3579164 3730199 3648145 3829257
16843 3829257 3828991 3891616 3873937 4040341 4482582 4211797 4505091 4473277 4610303 4798796
16833 4798796 4635819 4645829 4826829 5028812 4867371 5470045 5219424 5282789 5303202 5453045
16823 5453045 5687261 5521313 5876076 5833188 6064433 6266717 6158025 6248993 6548611 6836481
16813 6836481 6597952 6990475 7018507 7276037 7149582 7495775 7642572 7795251 8097877 8440519
16803 8440519 8393782 8319595 9206890 8908223 9484114 9646569 9560437 10024981 9840498 10149771
16793 10149771 10683957 10730590 11134126 11451157 11988160 12414903 12666386 12900582 13248466
$$ packed form
16863B759984J72482p7024J7679j45872P80827m71958L69701j40618K9271r2800
16853C201672J33252j4145L45765K21481j35156j81086P381J51035q2054J81112
16843C829257k66O2625j7679J66404M42241k70785K93294l1814J37026J88493
16833D798796j62977J0010J81000K01983j61441O02674k50621O3365K0413J49843
16823E453045K34216j65948L54763m2888K31245K02284j08692R0968K99618K87870
16813F836481k38529L92523K8032K57530j26455L46193J46797J52679L02626L42642
16803H440519m6737p4187Q87295k98667N75891J62455q6132M64544j84483L09273
16793A0149771N34186M6633M03536L17031N37003M26743K51483K34196L47884
$$ plain form
16784 13248466 13655134 13814244 14579936 14798562 15398061 15751274 16386878 16772741 17371667
16775 17371667 18037024 18327955 19260166 19865965 20484061 21358529 21906615 22943507 23571707
16766 23571707 24763769 25497390 26495285 27277292 28417361 29805331 30931306 32022628
16758 32022628 33572700 35060959 36577807 38462652 40310876 41737298 43537673 45961909
16750 45961909 48562697 50648924 52941474 56027782 58679956 61797036 65368877 68939996
16742 68939996 72275033 76458469 80700034 85308451 90231381 95390885 100756790 106340241
16734 106340241 111971722 117893637 124258352 130685953 137207535 143001626 149691466 155441857
16726 155441857 161320100 166599891 171306169 174782172 177747600 179287411 180924009 180234170
$$ packed form
16784A3248466M06668J59110P65692K18626N99499L53213O35604L85863N98926
16775A7371667O65357K90931R32211O05799O18096Q74468N48086J036892O28200
16766B3571707J192062P33621R97895P82007J140069J387970J125975J091322
16758C2022628J550072J488259J516848J884845J848224J426422J800375K424236
16750D5961909K600788K086227K292550L086308K652174L117080L571841L571119
16742F8939996L335037M183436M241565M608417M922930N159504N365905N583451
16734A06340241N631481N921915O364715O427601O521582N794091O689840N750391
16726A55441857N878243N279791M706278L476003K965428J539811J636598o89839
$$ plain form
16718 180234170 179310559 177104948 174266962 170173787 165478013 160169305 154526205 148224875
16710 148224875 142133505 135630832 128967083 122342444 116207008 110087649 104015087 98733433
16702 98733433 93471428 87909555 83415065 78551187 74195963 70359327 66704890 63333096
16694 63333096 59879752 56850408 53830618 51080468 48553081 46484118 44339058 41956546
16686 41956546 39982887 38268295 36638427 35081501 33349898 31839206 30705287 29195475
16678 29195475 27858756 26822586 25937943 24843284 24127470 23086281 22051795 21376561
16670 21376561 20554482 19752239 18980336 18143864 17632612 16955273 16444845 16239297 15208770
16661 15208770 14998158 14533781 13925530 13646992 13321605 12606030 12491033 12149426 11662797
$$ packed form
16718A80234170r23611k205611k837986m093175m695774n308708n643100o301330
16710A48224875o091370o502673o663749o624639o135436o119359o072562n281654
16702I8733433n262005n561873m494490m863878m355224l836636l654437l371794
16694F3333096l453344l029344l019790k750150k527387k068963k145060k382512
16686D1956546j973659j714592j629868j556926j731603j510692j133919j509812
16678B9195475j336719j036170q84643j094659p15814j041189j034486o75234
16670B1376561q22079q02243p71903q36472n11252o77339n10428k05548j030527
16661A5208770k10612m64377o08251k78538l25387p15575j14997l41607m86629
$$ plain form
16652 11662797 11469495 11038984 10792738 10347382 10011222 9845063 9650280 9513235 9295293
16643 9295293 9181043 8823065 8441264 8263018 8380822 7885026 7584348 7343882 7153701
16634 7153701 7237625 7008597 6815804 6978291 6506609 6439890 6193683 6181605 5879307 5804821
16624 5804821 5723595 5691817 5659712 5336625 5421826 5096198 4878385 4829182 4526991 4827122
16614 4827122 4573313 4493565 4618033 4376032 4217356 3971075 4329771 4316999 3972938 3929364
16604 3929364 3858910 3544973 3382009 3817317 3802377 3512069 3119133 3197379 3298501 3224028
16594 3224028 3450605 3302705 3508380 3238957 3253884 3277119 2867736 3133121 2733414 2659484
16584 2659484 2826149 2799417 2433668 2736724 2776273 2796753 2716914 2503526 2421880 2562815
$$ packed form
16652A1662797j93302m30511k46246m45356l36160j66159j94783j37045k17942
16643I295293j14250l57978l81801j78246J17804m95796l00678k40466j90181
16634G153701Q3924k29028j92793J62487m71682o6719k46207j2078l02298p4486
16624E804821q1226l1778l2105l23087Q5201l25628k17813m9203l02191L00131
16614D827122k53809p9748J24468k42001j58676k46281L58696j2772l44061m3574
16604C929364p0454l13937j62964M35308j4940k90308l92936P8246J01122p4473
16594C224028K26577j47900K05675k69423J4927K3235m09383K65385l99707p3930
16584B659484J66665k6732l65749L03056L9549K0480p9839k13388q1646J40935
$$ plain form
16574 2562815 2424416 2421269 2202346 2075004 2132696 2515256 2204775 2344468 2141478 2272395
16564 2272395 2286692 2070221 2205166 2133769 2046473 1739507 1815710 2066233 1841473 2064464
16554 2064464 1639374 1967523 1797338 1528675 1867395 1744699 1874253 1622465 1636288 1949130
16544 1949130 1276548 1784885 1555173 1580661 1663512 1236860 1314833 1244283 1305247 1472842
16534 1472842 1715739 1405332 1612462 1342647 1280246 1227129 1834667 1567163 1165769 976088
16524 976088 1098754 1251835 1283002 1109245 1490031 1044168 1028363 1249819 1031695 1220683
16514 1220683 1081639 1228541 1171858 855254 962838 911894 1101035 686562 1132237 1003483
16504 1003483 927807 811625 696847 953251 1224653 1041614 944934 834430 983833 675823
$$ packed form
16574B562815j38399l147k18923j27342N7692L82560l10481J39693k02990J30917
16564B272395J4297k16471J34945p1397q7296l06966P6203K50523k24760K22991
16554B064464m25090L28149j70185k68663L38720j22696J29554k51788J3823L12842
16544A949130o72582N08337k29712K5488Q2851m26652P7973p0550O0964J67595
16534A472842K42897l10407K07130k69815o2401n3117O07538k67504m01394j89681
16524I76088J22666J53081L1167j73757L80786m45863j5805K21456k18124J88988
16514A220683j39044J46902n6683l16604J07584n0944J89141m14473M45675j28754
16504A003483p5676j16182j14778K56404K71402j83039r6680j10504J49403l08010
$$ plain form
16494 675823 865578 1033267 991654 804678 1322670 822066 1013061 954732 933741 1017296
16484 1017296 1264735 711398 890981 798166 1276377 600007 884572 891900 1063049 951005
16474 951005 1194528 387255 767939 875558 1122145 337079 589440 559386 841967 724548
16464 724548 747682 655928 495690 526507 638156 1079666 593002 830208 286700 566094
16454 566094 527373 647393 625664 699121 622252 540047 790175 594438 404148 319285 719753
16443 719753 697866 473467 616096 712613 597168 605979 860042 623355 434373 562098
16433 562098 352062 501701 696884 367197 423812 644046 504019 596942 663004 612150
16423 612150 478264 656138 258251 366009 498762 632090 453846 460463 861659 351534
$$ packed form
16494F75823J89755J67689m1613j86976N17992n00604J90995n8329k0991Q3555
16484A017296K47439n53337J79583r2815M78211F00007K84565P328J71149j12044
16474I51005K43523C87255L80684J07619K46587C37079K52361l0054K82581j17419
16464G24548K3134r1754j60238L0817J11649M41510m86664K37206B86700K79394
16454E66094l8721J20020k1729P3457p6869q2205K50128j95737j90290q4863M00468
16443G19753k1887k24399J42629R6517j15445Q811K54063k36687j88982J27725
16433E62098k10036J49639J95183l29687N6615K20234j40027R2923O6062n0854
16423F12150j33886J77874B58251J07758J32753J33328j78244O617M01196C51534
$$ plain form
16412 817061 535603 625287 158976 271789 538226 688647 512128 517513 568235 382029
16402 382029 427452 475909 639458 320131 565720 347964 661253 321572 484984 171437
16391 211140 419049 486291 624287 632652 486175 61388 396627 245764 390989 341861
16381 341861 494364 385721 475767 330131 489655 376212 410700 394799 183121 216920
16371 216920 312257 559957 184947 200010 638099 167978 578346 201131 479342 557411
16361 557411 224354 501777 467617 499440 215488 435119 61417 471555 297955 311679
16351 311679 337485 418027 723522 465546 198196 196471 231945 441197 391818 423742 181317
16339 283934 166742 147294 152155 138093 167885 282286 318834 191430 463388 292769 536697
$$ packed form
16412H17061k81458Q9684A58976J12813K66437J50421j76519N385N0722j86206
16402C82029M5423M8457J63549l19327K45589k17756L13289C21572J63412A71437
16391B11140K07909O7242J37996Q365j46477F1388L35239j50863J45225m9128
16381C41861J52503j08643R0046j45636J59524j13443L4488j5901A83121L3799
16371B16920R5337K47700A84947J5063M38089A67978M10368B01131K78211P8069
16361E57411B24354K77423l4160L1823B15488K19631F1417M10138j73600J3724
16351C11679K5806Q0542L05495k57976A98196j725L5474K09252m9379L1924A81317
16339B83934j17192j9448M861j4062K9792J14401L6548j27404K71958j70619K43928
$$ plain form
16328 536697 -6259 246456 -28231 130335 488304 297905 372580 487145 63155 279143
16318 279143 502058 420166 268938 387101 252689 -52577 -129236 88931 348979 356303 217198
16307 217198 120779 -125859 128959 156000 304123 121550 235749 622109 288994 209141
16297 209141 19076 -97970 163860 118092 297248 119661 130874 187320 253346 289499 -64501
16285 280042 162556 235001 248890 186119 333832 11523 68829 -115434 335271 76936 71799
16274 71799 319372 70950 -229546 356498 327594 137118 -279807 5433 124962 -166051
16263 327423 -103068 85483 298962 47717 189672 251797 35205 146245 126030 180625 284414
16252 284414 226305 406933 226757 137872 262594 142412 441909 127237 -4095 34872
$$ packed form
16328E36697f259B46456b8231A30335L57969j90399P4675J14565F3155K15988
16318B79143K22915q1892j51228J18163j34412e2577p6659H8931K60048P324j39105
16307B17198r6419a25859A28959K7041J48123A21550J14199L86360B88994p9853
16297B09141A9076i7970A63860m5768J79156A19661J1213N6446O6026L6153f4501
16285B80042j17486P2445J3889o2771J47713A1523N7306a15434C35271G6936n137
16274G1799K47573G0950b29546C56498k8904A37118b79807E433J19529a66051
16263C27423a03068H5483K13479D7717J41955O2125C5205J11040k0215N4595J03789
16252B84414n8109J80628j80176q8885J24722j20182K99497A27237d095C4872
$$ plain form
16241 -44178 91191 -296218 -149546 -87645 32815 59230 338408 259651 356608 145579 -245415
16229 458957 330401 -34880 -251834 99919 -99916 380401 184977 -42171 -37303 357184 110668
16217 -67638 -19124 90547 9831 -62509 -67824 -182354 -75765 -221361 105155 225573 276950
16206 276950 -11820 -69555 208081 229126 -99450 -110225 -50945 -50250 -235439 227137 -236879
16194 -72320 -45759 -49076 254612 -75094 -267980 -80111 370734 -38746 -40268 -6186 210957
16182 160502 -114474 112746 135443 30567 9101 42564 170512 -244152 137466 354805
16172 354805 -49626 74972 -29668 -121685 -157723 119305 103858 57466 -168265 61331 -23036
16160 252831 452909 73255 322951 129895 -229781 -32537 -248679 -176848 -226032 -13272
$$ packed form
16241d4178I1191b96218J46672O1901C2815K6415K79178p8757R6957A45579b45415
16229D58957j28556c4880k16954I9919i9916C80401A84977d2171M868C57184A10668
16217f7638a9124I0547I831f2509n315j14530g5765j45596A05155J20418N1377
16206B76950a1820n7735B08081K1045i9450j0775e0945O95j85189B27137b36879
16194g2320K6561l317B54612g5094j92886h0111C70734c8746j522f186B10957
16182A60502a14474A12746K2697C0567I101L3463J27948b44152A37466K17339
16172C54805d9626G4972b9668r2017l6038A19305j5447m6392a68265F1331b3036
16160B52831K00078G3255K49696A29895b29781c2537k16142P1831m9184a3272
$$ plain form
16149 78970 15067 62146 153499 -147599 -3475 236183 157683 218999 -34503 215509 -42839
16137 125854 -98338 1823 -243093 213458 -120934 206259 -126635 237605 -180031 93280
16126 -38664 273347 341904 -482132 -9263 -77573 65632 69491 -58200 -43001 -39092 -46992 239758
16113 -292321 261904 -228775 41922 98563 87015 15944 19246 -147171 303036 -85576 108556
16101 482120 108320 336099 192352 6920 -36772 86916 306026 -60241 -295660 -68732 432077
16089 -9746 -23936 -190036 -133254 -87934 48537 24369 -74781 209404 100018 142135 -96246
16077 112096 -48664 -93814 -92611 46221 257177 422599 -181030 258245 92792 -41316 273536
16065 -201871 74942 55688 64895 -186968 -24788 12581 -11174 17356 19672 61201 -7960 287223
$$ packed form
16149G8970A5067M7079R1353a47599c475B36183p8500O1316c4503B15509d2839
16137A25854i8338A823b43093B13458a20934B06259a26635B37605a80031I3280
16126c8664B73347O8557d82132i263o8310F5632L859e8200J5199L909p900B39758
16113b92321B61904b28775D1922N6641j1548A5944L302a47171C03036h5576A08556
16101D82120A08320K27779j43747F920c6772H6916K19110f0241k35419f8732D32077
16089i746j4190j66100N6782M5320D8537k4168g4781B09404A00018M2117i6246
16077A12096d8664m5150J203D6221K10956J65422a81030B58245I2792d1316B73536
16065b01871G4942j9254R207a86968b4788A2581a1174A7356K316M1529g960B87223
$$ plain form
16052 104730 221662 19035 -35218 185492 88424 51333 54066 -68364 160340 174485 134854
16041 134854 55856 -153771 32104 37504 -135504 45804 145649 -146563 23209 -29846 -45764
16030 -45764 -122784 110292 136494 25385 -147709 -99617 196690 -115872 31163 -66007 -26955
16018 188159 48484 -253777 -81391 42156 124443 91238 167629 79796 -60196 -108632 63953
16006 -10510 254038 32423 -292888 224978 55096 -131927 -129265 -38850 -88767 298 227415
15995 227415 -19213 134111 -311267 55238 79055 -104520 297588 -8841 -14878 116808 44988
15983 296813 116873 336692 228770 560013 96764 111301 182660 -157765 90683 -411643
15972 -38582 167726 268692 203324 198637 174111 9102 -85176 -42957 65324 -329994 34766
$$ packed form
16052A04730J16932A9035c5218A85492H8424l7091K733f8364A60340J4145l9631
16041A34854E5856a53771C2104N400a35504D5804R9845a46563B3209b9846j5918
16030d5764p7020A10292K6202B5385a47709M8092A96690a15872C1163f6007b6955
16018A88159D8484b53777h1391D2156Q2287l3205P6391G9796f0196m8436F3953
16006a0510B54038C2423b92888B24978E5096a31927K662c8850m9917B98K27117
15995B27415a9213A34111c11267E5238K3817a04520B97588h841o037A16808D4988
15983B96813A16873K19819j07922L31243I6764J4537P1359a57765I0683d11643
15972c8582A67726J00966o5368m687k4526I102h5176M2219F5324c29994C4766
$$ plain form
15960 -19100 97144 -166459 104733 -48083 190252 41883 -276233 55452 -130359 -33808 -56502
15949 -56502 101532 6426 -319161 -124928 96090 1789 -55146 208157 65087 40102 -92099
15937 -69803 -225909 -241957 117894 104969 -107319 -20098 79891 32172 -404032 -176809 83668
15925 -279836 54805 -496045 -28286 14307 120334 -205315 -42427 -159655 -93605 86480 308673
15914 308673 -175310 67936 202722 32349 -122955 82887 73668 99464 -98366 -42767 34123
15902 -214630 -265119 59182 -69519 -230201 29433 -209837 130121 -11795 -80003 115148 -401366
15890 -114806 52203 -76526 -110794 -214037 147451 112508 77501 -145047 -198854 -41263 -100758
15879 -100758 19524 -231882 -9891 -205042 -72567 210389 97058 -269922 -54854 -58931 -199709
$$ packed form
15960a9100I7144a66459A04733d8083A90252D1883b76233E5452a30359c3808k2694
15949e6502A01532F426c19161a24928I6090A789e5146B08157F5087k4985i2099
15937f9803j56106j6048A17894j2925a07319b0098G9891C2172d04032a76809H3668
15925b79836E4805d96045b8286A4307J06027b05315d2427j17228O6050H6480K22193
15914C08673a75310F7936J34786C2349a22955H2887r219K5796i8366d2767C4123
15902b14630n0489E9182f9519j60682B9433b09837A30121a1795o8208A15148d01366
15890a14806E2203g6526l4268j03243A47451l4943l5007a45047n3807d1263n9495
15879a00758A9524b31882i891j95151g2567B10389I7058b69922e4854m077j40778
$$ plain form
15868 -199709 -310564 -220331 -137863 -14730 10388 388434 -226074 -5226 -307566 -66790 87556
15856 7424 186001 43447 -7788 -474446 129644 1084 -29883 -416322 -163100 267419 142129
15845 142129 -96697 -193628 -71624 -100292 12429 49941 -56444 115555 -184140 314694 -148651
15833 -271964 -139098 93119 170630 -177024 -340204 279174 26933 -249266 117721 122303
15823 122303 -42891 243135 189717 133672 81039 104276 -118745 -36202 4412 -103595 -125443
15812 -125443 -143430 -206966 29302 177638 -250705 199606 77795 -29492 -238601 -253820 -140139
15801 -140139 -158253 -83846 68371 -230716 92972 -622304 241523 -114650 -100333 -63485 167396
15789 174918 -35399 12419 -86356 130865 -42675 -16269 443523 309590 181908 -145305
$$ packed form
15868a99709j10855R0233Q2468a4730A0388L78046b26074e226l02340f6790H7556
15856G424J78577D3447g788m66658A29644A084b9883l86439a63100B67419j25290
15845A42129i6697r6931g1624k8668A2429L7512e6444A15555a84140C14694a48651
15833b71964J32866I3119P7511a77024j63180B79174B6933b49266A17721M582
15823A22303d2891B43135n3418n6045n2633K3237a18745c6202D412a03595k1848
15812a25443j7987o3536B9302J48336b50705A99606G7795b9492k09109j5219J13681
15801a40139j8114P4407F8371b30716I2972f22304B41523a14650J4317L6848A67396
15789A74918c5399A2419h6356A30865d2675a6269D43523j33933j27682a45305
$$ plain form
15778 -118894 -149690 -18432 143653 -192368 -77532 79030 -130886 221604 364645 -310735
15767 208581 -17239 126112 50963 -50685 -50423 -350687 -29162 337431 -74962 236845 -212261
15755 -37769 51590 156797 72001 48869 -93333 -93575 80761 53369 354618 41966 -39473 124353
15742 215715 317113 -43769 -171349 -146321 -128925 -115750 269329 -143292 81209 -1770 -31457
15731 -31457 -256574 -83835 122618 -267662 -7824 -12886 -21980 35839 -176704 -77492 -95744
15720 -95744 47432 -20851 81588 -373593 30288 -341906 101775 -128450 -241047 83822 -73610
15708 -151510 -308489 63015 -5702 114832 -61066 -157766 37653 66536 -4234 249283 -96514
15696 -11692 118631 14078 254783 91907 64540 102933 284151 -159809 286299 128630
$$ packed form
15778a18894l0796a8432A43653a92368g7532G9030a30886B21604J43041c10735
15767B08581a7239A26112E0963e0685K62l00264b9162C37431g4962B36845b12261
15755c7769E1590J05207G2001k3132i3333k42H0761k7392L01249D1966c9473A24353
15742B15715J01398d3769j27580K5028J7396J3175B69329a43292H1209a770k9687
15731c1457k25117h3835A22618b67662g824n062r094C5839a76704g7492j8252
15720i5744D7432b0851H1588c73593C0288c41906A01775a28450j12597H3822g3610
15708a51510j56979F3015e702A14832f1066r6700C7653K8883d234B49283i6514
15696a1692A18631A4078K40705I1907k7367L8393J81218a59809B86299A28630
$$ plain form
15685 -31001 -258261 19840 -61223 -295374 46568 119107 181741 26493 66339 -294853 111550
15673 -247919 125225 -59158 139641 190841 -273096 63694 207069 -371446 -31685 -209972
15663 -209972 -158554 162998 -63230 -76755 -234472 -76037 -408427 26942 -114393 -170497 -5753
15651 83382 162364 150089 -96684 -84899 -86056 176739 93809 53737 283181 -277644 -192578
15640 -192578 127139 139721 -75617 359343 8398 70814 -230941 -310905 -74211 23040 23512
15629 23512 36023 -5491 -153655 -70797 310317 -36535 15613 -138502 223202 94798 58215
15618 58215 286471 -35505 286537 173398 -90359 188209 -85093 -328643 55390 -113644
15607 -216361 39597 -2451 -114988 -73481 -24406 224680 209721 12932 7519 -87214 -16477
$$ packed form
15685c1001k27260A9840f1223k34151D6568P2539O2634B6493L9846b94853A11550
15673b47919A25225e9158A39641N1200b73096F3694J43375c71446c1685j78287
15663b09972N1418A62998f3230j3525j57717g6037l32390B6942a14393n6104e753
15651H3382P8982j2275i6684J1785j157A76739q2930m0072K29444b77644Q5066
15640a92578A27139J2582g5617C59343H398O2416b30941p9964g4211B3040M72
15629B3512J2511e491j48164g0797C10317c6535A5613a38502B23202I4798l6583
15618E8215K28256c5505B86537j13139i0359A88209h5093k43550E5390a13644
15607b16361C9597b451j12537M1507b4406B24680j4959A2932n413h7214a6477
$$ plain form
15595 10267 -116209 37052 -30571 272234 61033 -65824 -65019 224598 -61192 132021 -79599
15583 219605 85777 -47276 -253823 -27374 -232537 -153564 872 -101840 129947 -48951 -143587
15572 -143587 -136056 -42135 -111916 -90647 218715 145698 -111508 245213 35501 254180 -64134
15560 -26697 -98301 -250091 -244377 -145535 179445 155025 -214516 -172655 -71924 56713 -46524
15548 136272 -238152 -99548 -80472 -328648 -52811 -58823 148539 -254855 57885 117906 -439348
15536 29420 -1886 -227939 63613 -35919 -103141 -384002 -98067 328184 -460334 -113775 -205832
15525 -205832 36597 146422 -28827 -147063 -163885 322973 25641 130246 -82591 -68881 67966
15513 27597 -275693 68076 -236668 45362 249232 -111789 -58475 -76648 -228149 40036 33276
$$ packed form
15595A0267a16209C7052c0571B72234F1033f5824Q05B24598f1192A32021g9599
15583B19605H5777d7276k06547b7374k05163P8973H72a01840A29947d8951r4636
15572a43587P531d2135o9781K1269B18715p3017a11508B45213C5501K18679f4134
15560b6697p1604j51790N714R8842A79445k4420b14516M1861g1924E6713d6524
15548A36272b38152i9548J9076k48176e2811o012A48539b54855E7885O0021d39348
15536B9420a886k26053F3613c5919o7222k80861i8067C28184d60334a13775r2057
15525b05832C6597J09825b8827j18236j6822C22973B5641J04605h2591J3710F7966
15513B7597b75693F8076b36668D5362K03870a11789N3314j8173j51501D0036o760
$$ plain form
15502 33276 155047 -439712 -100252 2630 -113286 26562 -67191 -177986 85534 132684 106307
15491 106307 263110 -424746 252470 82533 217666 -157966 180303 82439 -207125 -147458
15481 -147458 -56039 -164711 4718 38522 -254329 -77553 -65581 70927 -229845 105802 7144
15469 1844 118934 143490 18264 -73729 61892 196706 -25082 232623 -325153 -43989 -130428
15458 -130428 -22495 69011 191310 107172 3380 -82486 -15976 172602 38222 2506 7455 55354
15446 55354 282181 -31862 -249142 185618 -135275 193371 36352 168775 -119662 170061
15435 57363 40543 91413 -25387 57281 275445 -38995 281236 -7341 -33153 -126615 228225
15423 -263598 64985 150090 -23710 -147290 104358 210001 217388 -117079 -5661 -108975 180981
$$ packed form
15502C3276J21771d39712a00252B630a13286B6562f7191j10795H5534M7150k6377
15491A06307J56803d24746B52470H2533J35133a57966A80303H2439b07125N9667
15481a47458e6039j08672D718L3804b54329g7553J1972G0927b29845A05802G144
15469A844J17090K4556A8264g3729F1892J34814b5082B32623c25153d3989q6439
15458a30428b2495F9011J22299q4138C380h2486a5976A72602C8222B506M949M7899
15446E5354K26827c1862k17280A85618a35275A93371C6352J32423a19662A70061
15435E7363j6820N0870b5387E7281K18164c8995B81236g341k5812r3462B28225
15423b63598F4985Q5105b3710j23580A04358J05643P387a17079e661j03314A80981
$$ plain form
15411 22770 116765 -102792 134780 116339 142039 -108348 -52835 -151664 29737 61407 -255048
15399 -117771 -145705 42266 -415008 67371 38948 -222109 324839 -108798 125519 242120
15389 242120 306275 77185 -229779 -89269 94775 -100240 -4144 209845 118572 -2482 155429
15377 -57874 -197178 130921 104187 32855 118565 422894 255814 224487 23636 -234623 -11549
15365 153923 66866 -188931 127722 -164285 -26767 -181554 -98525 -50504 242647 -25328
15354 -216276 174518 -8557 -208174 -27664 64760 -153221 -124910 219083 -148579 105074
15343 184800 -172593 -31362 109224 134728 123625 -12962 -7037 290400 243002 -48477 89923
15331 79643 -327843 -22932 17032 258065 -52871 -185608 -74258 -9678 -246702 63213 -224935
$$ packed form
15411B2770R3995a02792A34780j8441K5700a08348e2835r8829B9737L1670b55048
15399a17771k7934D2266d15008F7371k8423b22109C24839a08798A25519J16601
15389B42120O4155G7185b29779h9269I4775a00240d144B09845r1273b482A55429
15377e7874j39304A30921k6734C2855Q5710L04329j67080l1327B3636b34623a1549
15365A53923F6866a88931A27722a64285b6767j54787Q3029M8021B42647b5328
15354b16276A74518h557j99617b7664F4760a53221K8311B19083a48579A05074
15343A84800a72593c1362A09224K5504j1103a2962N925B90400m7398d8477H9923
15331G9643c27843b2932A7032K41033e2871j32737g4258i678k37024F3213b24935
$$ plain form
15319 9883 7244 255753 192689 -412491 -43212 265308 90357 111725 49553 51352 -58047 158056
15306 144765 86257 -30718 -57677 -57788 92748 149829 -130518 -113157 -82549 -259953 103084
15294 -167352 -57674 -96435 154358 171147 -109491 -173650 -171829 -80697 251900 188723 138368
15283 138368 -151183 -63759 -135686 358952 -114391 12275 112875 -70299 137226 -78772
15272 224044 188434 -266603 221840 210689 34622 -7674 182532 438388 140062 68913 239315
15261 239315 -33488 144842 -103749 -29550 62643 325054 -2656 -159054 171366 265148 671966
15250 671966 649787 1042413 1222711 1194123 1051227 1019218 377548 101224 273799 -21517
15239 -55716 227332 -214227 313953 282446 179446 34704 -149419 229462 48037 -9742 84942
$$ packed form
15319I883k639K48509o3064d12491d3212B65308I0357K1368D9553J799e8047A58056
15306A44765n8508c0718k6959j11I2748N7081a30518J7361L0608j77404A03084
15294a67352e7674l8761A54358J6789a09491o4159J821h0697B51900o3177n0355
15283A38368a51183f3759p1927C58952a14391A2275J00600g0299A37226g8772
15272B24044l5610b66603B21840j1151C4622g674A82532K55856A40062F8913J70402
15261B39315c3488A44842a03749b9550F2643K62411b656j56398A71366R3782M06818
15250F71966k2179L92626J80298k8588j42896l2009C77548A01224J72575b1517
15239e5716B27332b14227C13953l1507j03000C4704a49419B29462D8037i742H4942
$$ plain form
15227 123921 173035 -31343 310119 261747 104918 -228846 -357099 -131675 -170681 322136
15216 -177990 120176 -64680 -47247 -81691 67036 -98708 -29442 -89731 54279 162502 54265
15204 -83256 8397 236633 185554 221982 206034 310388 82288 219681 145269 164185 -141242
15192 -88384 -61388 143004 101664 -120006 30955 17496 184281 271562 -266443 414354 12748
15180 334711 -519 70302 215430 -195534 453467 408614 206090 49093 88305 2708 71919
15169 71919 204693 42944 -26110 -58810 2259 -221668 4960 321513 -25468 243713 -27470
15157 -321542 -20025 150321 -8077 -136213 201084 200748 382581 23011 -77271 340162 -56827
15145 134466 30910 -73190 335285 327121 -5714 -39847 129198 111986 19724 152325 -14580
$$ packed form
15227A23921M9114c1343C10119m8372A04918b28846j28253a31675l9006C22136
15216a77990A20176f4680J7433l4444F7036i8708b9442o0289E4279J08223E4265
15204h3256H397K28236n1079L6428j5948J04354H2288J37393p4412J8916a41242
15192h8384K6996A43004m1340a20006C0955j3459J66785Q7281b66443D14354A2748
15180C34711e19G0302J45128a95534D53467m4853k02524D9093L9212B708O9211
15169G1919J32774D2944b6110l2700B259b21668D960L16553b5468B43713b7470
15157c21542b0025A50321h077j28136B01084l36J81833B3011g7271C40162e6827
15145A34466C0910g3190C35285q164e714l4133A29198j7212A9724J32601a4580
$$ plain form
15133 147731 -53255 97655 130864 -82679 200688 -17584 241852 98465 47659 200909 -20330
15121 552666 262863 266272 225644 241635 -25487 -318043 -12278 -113897 356387 320986 -86095
15109 157493 195622 -212592 -35702 191467 250329 -300599 157293 344518 110855 -193116
15098 -131148 -136569 322297 46391 -15466 177182 149800 466253 112507 293212 -182357
15087 229772 -104462 -145331 11731 197062 53934 560035 -61806 207588 -31645 520655
15076 120211 -32588 35049 645354 347119 115219 2793 218593 6971 -143608 -125544 333804
15064 109910 461551 11928 -262335 101085 4106 144289 28981 455800 161320 115816
15054 115816 -64243 184884 75237 417731 109818 -152571 317375 112052 131561 -127533
$$ packed form
15133A47731e3255I7655L3209h2679B00688a7584B41852I8465D7659J53250b0330
15121E52666B62863L409m0628J5991b5487k92556a2278j01619C56387l5401h6095
15109A57493L8129b12592c5702A91467N8862c00599A57293J87225A10855a93116
15098a31148n421C22297D6391a5466A77182k7382L16453A12507J80705a82357
15087B29772a04462m0869A1731J85331E3934N06101f1806B07588c1645E20655
15076A20211c2588C5049O10305k98235A15219B793K15800F971a43608J8064C33804
15064A09910L51641A1928b62335A01085D106J40183B8981M26819A61320m5504
15054A15816f4243A84884G5237L42494A09818a52571C17375A12052J9509a27533
$$ plain form
15043 226430 -54208 321524 -15827 -101200 302078 256136 131280 226172 165108 -306079 -216328
15032 -216328 302061 84035 79296 -14872 -46923 96931 280562 387416 199674 197559 256472
15021 256472 363557 169948 55273 244488 -90038 -223789 230706 221015 88147 46696 84668
15010 84668 377767 128876 119346 253662 21747 230827 8454 95554 434420 325363 -154861
14998 367528 368806 238009 -69825 261095 158309 524037 269613 60884 295258 114926
14987 160645 251427 55790 452242 111374 248117 10057 191599 270425 256890 221428 60359
14975 162321 312377 83094 59589 286355 -8123 142862 290433 -58056 -19148 297974 33569
14963 200138 237459 10042 325557 -9874 328265 12094 351887 113800 164461 539868 83242
$$ packed form
15043B26430e4208C21524a5827q5373C02078m5942j24856R4892o1064c06079Q9751
15032b16328C02061H4035m739a4872l2051I6931J83631J06854j87742k115N8913
15021B56472J07085A69948E5273J89215i0038j33751B30706r691H8147m1451L7972
15010H4668K93099A28876r530J34316B1747K09080H454Q7100L38866j09057a54861
14998C67528J278j30797f9825B61095j02786L65728k54424F0884K34374A14926
14987A60645R0782E5790L96452A11374J36743A0057J81542P8826j3535l5462F0359
14975A62321J50056H3094k3505K26766h123A42862J47571e8056a9148B97974C3569
14963B00138L7321A0042L15515i874C28265A2094L39793A13800N0661L75407H3242
$$ plain form
14951 130061 171686 307716 516981 385893 596974 164169 -29442 322629 96758 523833
14941 523833 180816 303212 243382 229153 84706 281177 146702 159235 141685 363005
14931 363005 167996 409488 188099 172079 465238 229467 478923 242686 168124 282806
14921 282806 466892 538935 411354 250201 307631 573822 418928 197726 490840 190677
14910 464872 411725 433640 240944 71530 104986 168327 468673 215529 388196 319078 287573
14899 287573 199428 543181 577980 530958 619091 366916 493641 319072 189226 194308 346669
14888 346669 464030 437939 224411 518867 518408 680035 367782 448343 393264 425500 144024
14876 239220 257926 234496 480475 400081 312444 -5337 186211 356375 627421 360399 139174
$$ packed form
14951A30061M1625J36030K09265j31088K11081A64169b9442C22629I6758M27075
14941E23833A80816J22396n9830j4229H4706J96471j34475J2533j7550K21320
14931C63005A67996K41492A88099j6020K93159B29467K49456k36237p4562J14682
14921B82806J84086P2043j27581j61153N7430K66191j54894A97726K93114A90677
14910D64872n3147K1915j92696G1530L3456O3341L00346B15529J72667o9118l1505
14899B87573q8145L43753L4799m7022Q8133k52175J26725j74569j29846N082J52361
14888C46669J17361k6091k13528K94456m59J61627l12253Q0561n5079L2236A44024
14876B39220J8706k3430K45979q0394q7637e337A86211J70164K71046k67022A39174
$$ plain form
14864 654296 448787 401919 506321 542744 550336 582134 473842 605926 512876 291889 908852
14853 908852 363199 630634 472282 457127 495165 417590 310725 477938 473743 448877 486732
14842 486732 510954 254594 431862 406841 550105 412209 627048 228584 547551 276738
14832 276738 812177 459875 748462 16109 582950 520437 231573 4443 365006 361299 217044
14821 217044 320678 178232 538556 392748 318916 434241 674515 786758 505247 440160
14811 440160 763578 653350 481773 263115 381287 616406 376248 442616 479164 294540
14801 294540 472178 508720 710466 694742 572619 517140 550935 835722 539024 476793
14791 476793 622451 701427 443654 541234 734795 635223 428451 801351 615903 563983
$$ packed form
14864F54296k05509m6868J04402L6423P592L1798j08292J32084r3050k20987O16963
14853I08852C63199K67435j58352j5155L8038p7575j06865J67213m195k4866L7855
14842D86732K4222B54594J77268k5021J43264j37896K14839B28584L18967k70813
14832B76738N35439l52302K88587A6109N66841o2513B31573D443L60563l707j44255
14821B17044J03634j42446L60324j45808p3832J15325K40274J12243k81511o5087
14811D40160L23418j10228j71577k18658J18172K35119k40158O6368L6548j84624
14801B94540J77638L6542K01746j5724j22123n5479L3795K84787k96698o2231
14791D76793J45658P8976k57773R7580J93561r9572k06772L72900j85448n1920
$$ plain form
14781 563983 584283 500789 874449 671970 665964 749920 595820 660231 558299 432008 698812
14770 698812 631845 523379 733966 944295 731185 328253 671243 452614 294787 355784
14760 355784 716101 936682 529672 701575 679604 751770 891665 336944 823124 739121
14750 739121 931764 855347 951108 462477 773966 583398 678121 696918 826947 745324
14740 745324 813952 661948 346758 666526 862505 375914 627466 750880 704451 1015488
14730 1015488 727199 796042 692207 625361 820111 710442 688721 731277 893175 583802
14720 583802 621872 807971 963411 731165 903518 1131102 861025 804888 1108491 892425
14710 892425 849214 810496 915889 561595 981991 753715 890560 899739 791903 654235
$$ packed form
14781E63983K0300q3494L73660k02479o006Q3956j54100O4411j01932j26291K66804
14770F98812o6967j08466K10587K10329k13110C28253L42990k18629j57827O0997
14760C55784L60317K20581m07010J71903k1971P2166J39895C36944M86180q4003
14750G39121J92643p6417R5761D62477L11489j90568R4723J8797J30029q1623
14740G45324O8628j52004l15190L19768J95979C75914K51552J23414m6429L11037
14730A015488k88289O8843j03835o6846J94750j09669k1721M2556J61898l09373
14720E83802L8070J86099J55440k32246J72353K27584k70077n6137L03603k16066
14710H92425m3211l8718J05393l54294M20396k28276J36845R179j07836j37668
$$ plain form
14700 654235 1164833 642202 1025777 1032535 396818 896615 951068 919472 860447 947783 973179
14689 973179 894304 1267939 864433 966215 779029 949713 1059973 949849 770832 1117090
14679 1117090 1313765 639328 759491 950122 1168775 923752 1178164 1025168 1154425
14670 1154425 991234 925719 1120054 1152017 1306772 1257631 1212660 1403003 1000551 1251990
14660 1251990 957606 1147071 1374681 1077800 1228461 1283602 1375999 1039409 1168020 1094814
14650 1094814 1423269 1010271 941654 1125365 1316062 1035589 1328570 1277962 1170939 1176844
14640 1176844 1214319 1098390 1228171 1072070 1202416 1173430 1295263 1306130 1512514 1628003
14630 1628003 1192763 1129734 1517735 1669312 1206879 1329665 1574631 1497994 1281652 1430584
$$ packed form
14700F54235N10598n22631L83575O758C96818M99797N4453l1596n9025Q7336K5396
14689I73179p8875L73635m03506J01782j87186J70684J10260j10124j79017L46258
14679A117090J96675F39328J20163J90631K18653k45023K54412j52996J29257
14670A154425j63191o5515J94335L1963J54755m9141m4971J90343m02452K51439
14660A251990k94384J89465K27610k96881J50661N5141R2397l36590J28611p3206
14650A094814L28455m12998o8617J83711J90697k80473K92981n0608j07023N905
14640A176844L7475j15929J29781j56101J30346k8986J21833J0867K06384J15489
14630A628003m35240o3029L88001J51577m62433J22786K44966p6637k16342J48932
$$ plain form
14620 1430584 1505646 1266186 1376612 1450137 1660604 1506802 1607806 1637973 1598652 1563978
14610 1563978 1723264 1691946 1580354 1708526 1647656 1360829 1955790 1878263 1612141 1540451
14600 1540451 1758030 1692066 1624343 1678733 1884013 2071679 1944387 2051400 1958168 1402676
14590 1402676 1756531 1578945 1962013 1636307 1844073 1970925 1707738 2040454 2240967
14581 2240967 2012547 2158842 1910889 2159543 1996813 2036403 2082936 2197736 2017947 2445397
14571 2445397 2283040 2705067 2320230 2398500 2371845 2542952 2478685 2502316 2392594 2636542
14561 2636542 2850350 3000860 3204386 2882801 2893636 3184034 3151296 3385325 3725291 4434632
14551 4434632 4656603 6081442 8008583 12290149 21050678 36335600 42557101 23375718
$$ packed form
14620A430584P5062k39460J10426P3525K10467j53802J01004L0167l9321l4674
14610A563978J59286l1318j11592J28172o0870k86827N94961p7527k66122p1690
14600A540451K17579o5964o7723N4390K05280J87666j27292J07013r3232n55492
14590A402676L53855j77586L83068l25706K07766J26852k63187L32716K00513
14581B240967k28420J46295k47953K48654j62730L9590M6533J14800j79789M27450
14571B445397j62357M22027l84837P8270k6655J71107o4267K3631j09722K43948
14561B636542K13808J50510K03526l21585J0835K90398l2738K34029L39966P09341
14551D434632K21971J424839J927141M281566Q760529J5284922O221501j9181383
$$ plain form
14543 23375718 10956500 5605813 3718178 2805688 2166634 2174507 2276617 2086462 2077523
14534 2077523 2327654 2160471 2119987 1988896 2212117 2131934 2107765 2305304 2377687 2249456
14524 2249456 2543243 2439781 2747666 2484448 2659773 2530327 2775012 2723268 2609129 2538950
14514 2538950 2445166 2722187 2345919 2760446 3072167 2772638 3113760 2719618 3131430 3110656
14504 3110656 3119533 3072378 3294353 3237778 3187396 3349812 3350551 3220708 3369902 3361406 3261915
14493 3261915 3604441 3717640 3910307 3572027 3258081 3499938 3451322 3891833 3847762 3967343
14483 3967343 3871435 3943634 3866481 3659049 3702218 4017160 4230711 4164465 3978297 4461128
14473 4461128 4334522 4356831 4466509 4460116 4550132 4550621 4540816 4903438 4394934 4974605 4891253
$$ packed form
14543B3375718A0956500n350687j887635r12490o39054P873J02110j90155q939
14534B077523K50131j67183m0484j31091K23221q0183k4169J97539P2383j28231
14524B249456K93787j03462L07885k63218J75325j29446K44685n1744j14139p0179
14514B538950r3784K77021l76268M14527L11721k99529L41122l94142M11812k0774
14504C110656Q877m7155K21975n6575n0382J62416P39j29843J49194q496r9491
14493C261915L42526J13199J92667l38280l13946K41857m8616M40511m4071J19581
14483C967343r5908P2199p7153k07432M3169L14942K13551o6246j86168M82831
14473D461128j26606K2309J09678o393R0016M89r805L62622n08504N79671q3352
$$ plain form
14462 4891253 4891623 4822011 4670409 4786919 4784401 4926644 5107240 5062128 5166435 5168374 5370528
14451 5370528 5475814 5339995 5553807 5776565 5562930 6048879 5856133 5853672 5957188 5962881
14441 5962881 6075931 5941834 6447064 6597091 6531877 6915120 6811671 6742986 7113170 7074245
14431 7074245 6847304 7179383 7292488 7169055 7154051 7339506 7498360 7439387 7980696 7933594
14421 7933594 7938384 8081107 8178367 8372498 8631083 8615324 8589394 8938405 9089428 9012983
14411 9012983 9225570 9518944 9549056 9757339 9522564 9897852 10113652 10256965 10289044 10383675
14401 10383675 10922844 10905611 11126962 11486922 11558260 11784373 11829771 11789124 12096186 12197411
14391 12197411 12635023 12851912 12983038 13503200 13721994 13724356 13851261 13863977 14456080 14528932
$$ packed form
14462D891253L70o9612j51602J16510k518J42243J80596m5112J04307J939K02154
14451E370528J05286j35819K13812K22758k13635M85949j92746k461J03516N693
14441E962881J13050j34097N05230J50027o5214L83243j03449o8685L70184l8925
14431G074245k26941L32079J13105j23433j5004J85455J58854n8973N41309m7102
14421G933594M790J42723R7260J94131K58585j5759k5930L49011J51023p6445
14411I012983K12587K93374L0112K08283k34775L75288K15800J43313L2079R4631
14401A0383675N39169j7233K21351L59960P1338K26113M5398m0647L07062J01225
14391A2197411M37612K16889J31126N20162K18794K362J26905J2716N92103P2852
$$ plain form
14381 14528932 15023391 15175573 15294642 15770544 15589474 16632031 16283770 16917718 17225675
14372 17225675 17502032 17988509 18264130 18730063 18659222 19677099 19682116 20272450 20554028 21010386
14362 21010386 21573468 21895352 22448033 22967458 23402991 23679323 24584695 24977039 25535440
14353 25535440 26153288 26643520 27343732 28056711 28761597 29390166 30580199 30895432 31497989
14344 31497989 32556980 33322695 34332325 35126937 36202550 37069827 38218448 39057996 40289248
14335 40289248 41463248 42845588 43876860 45223776 46639787 47715035 49383069 50827381
14327 50827381 52702665 54220104 56051744 57728327 60053368 61701234 63751861 66275309
14319 66275309 68256456 70782493 73429174 76277118 78939800 81935468 84769198 88191667
$$ packed form
14381A4528932M94459J52182J19069M75902j81070J042557l48261O33948L07957
14372A7225675K76357M86477K75621M65933p0841J017877N017N90334K81578M56358
14362B1010386N63082L21884N52681N19425M35533K76332R05372L92344N58401
14353B5535440O17848M90232P00212P12979P04886O28569J190033L15233O02557
14344C1497989J058991P65715J009630P94612J075613Q67277J148621Q39548J231252
14335D0289248J174000J382340J031272J346916J416011J075248J668034J444312
14327E0827381J875284J517439J831640J676583K325041J647866K050627K523448
14319F6275309J981147K526037K646681K847944K662682K995668K833730L422469
$$ plain form
14311 88191667 91556401 95349800 99225207 103239507 107672416 112327745 116998544 122095981
14303 122095981 127353291 132957763 139081179 145760647 152518267 159713288 167141498 175286495
14295 175286495 183801038 192600710 202207823 212193111 222431597 233381620 244737557
14288 244737557 256679611 269435798 282231556 295426772 309067258 322809320 336942204
14281 336942204 350595682 364799526 378202544 390954220 403309278 414754422 424715448
14274 424715448 432770947 436922411 438877769 439811947 438878108 439425425 438687826 435300443
14266 435300443 432860179 426812694 418592068 408596009 397708060 385154403 371822842
14259 371822842 357730322 343268360 328841757 314255747 300537960 286988136 273598899
$$ packed form
14311H8191667L364734L793399L875407M014300M432909M655329M670799N097437
14303A22095981N257310N604472O123416O679468O757620P195021P428210Q144997
14295A75286495Q514543Q799672R607113R985288J0238486J0950023J1355937
14288B44737557J1942054J2756187J2795758J3195216J3640486J3742062J4132884
14281C36942204J3653478J4203844J3403018J2751676J2355058J1445144R961026
14274D24715448Q055499M151464J955358R34178r33839N47317p37599l387383
14266D35300443k440264o047485q220626r996059j0887949j2553657j3331561
14259C71822842j4092520j4461962j4426603j4586010j3717787j3549824j3389237
$$ plain form
14252 273598899 260744463 248369732 236635149 225103720 214395468 204071454 194107650
14245 194107650 185377576 177120969 168954840 161165458 153367914 146394906 140188754 134067877
14237 134067877 128518042 122911927 117766192 112786523 108113469 103902038 100150175 96171860
14229 96171860 92199754 88698171 84762702 81766600 78823999 75902096 73002384 70595237
14221 70595237 68205796 66119825 63729934 61344886 59641027 57434947 55728180 54048106
14213 54048106 52909243 50829351 49272268 47905083 46347625 45048785 44438845 43284863
14205 43284863 41861583 40592455 39379603 38255264 36966512 36591072 35616840 34576884
14197 34576884 33508338 32452073 31732236 31237359 30347952 29581163 28609523 27970164 27436809
$$ packed form
14252B73598899j2854436j2374731j1734583j1531429j0708252j0324014r963804
14245A94107650q730074q256607q166129p789382p797544o973008o206152o120877
14237A34067877n549835n606115n145735m979669m673054m211431l751863l978315
14229I6171860l972106l501583l935469k996102k942601k921903k899712k407147
14221G0595237k389441k085971k389891k385048j703859k206080j706767j680074
14213E4048106j138863k079892j557083j367185j557458j298840o09940j153982
14205D3284863j423280j269128j212852j124339j288752l75440r74232j039956
14197C4576884j068546j056265p19837m94877q89407p66789r71640o39359n33355
$$ plain form
14188 27436809 26500228 26354210 25401850 25133393 24380590 23763764 23233221 23392983 22413893
14179 22413893 21856291 21310396 20894450 20490248 20072356 19516331 19128557 18937834 18654040
14170 18654040 18133575 17883357 17932648 17272431 16758293 16652785 16135633 16130313 15740576 15693552
14160 15693552 15422746 14869884 14586331 14202118 13913585 13939966 13632179 13370862 13022509
14151 13022509 13084260 12766599 12584505 12266325 12295913 11963052 11947386 11856060 11143342 11452203
14141 11452203 11132315 11064390 10740641 10811104 10631584 10272384 10213367 10082018 10150728 9573161
14131 9573161 9473686 9549761 9193562 9399538 8917994 8903582 9039526 8613796 8509584 8282400
14121 8282400 8379995 8348164 8397157 8123256 8035021 8171687 7689001 7802275 7566838 7626882
$$ packed form
14188B7436809r36581j46018r52360k68457p52803o16826n30543J59762r79090
14179B2413893n57602n45895m15946m04202m17892n56025l87774j90723k83794
14170A8654040n20465k50218M9291o60217n14138j05508n17152n320l89737m7024
14160A5693552k70806n52862k83553l84213k88533K6381l07787k61317l48353
14151A3022509O1751l17661j82094l18180K9588l32861j5666r1326p12718L08861
14141A1452203l19888o7925l23749P0463j79520l59200n9017j31349O8710n77567
14131I573161r9475P6075l56199K05976m81544j4412J35944m25730j04212k27184
14121H282400R7595l1831M8993k73901q8235J36666m82686J13274k35437O0044
$$ plain form
14111 7626882 7414789 7109760 7200484 6892394 6859610 7190651 6923505 7009176 6719733 6562632
14101 6562632 6543257 6243128 6437072 6268091 6011814 5984325 6177501 5811239 5947872 5931093
14091 5931093 5837321 5761053 5788951 5531883 5466984 5246205 5424123 5551224 5454484 5299518
14081 5299518 5351728 5145843 5134179 4931892 4893234 4841727 4943067 4868249 4581342 4960802
14071 4960802 4625504 4893359 4254506 4480745 4164888 4337011 4464738 4425868 4043866 4022829
14061 4022829 4332541 4186298 3709205 4225910 3956542 4025591 4179400 4129950 3715651 3718719
14051 3718719 3691433 3682527 3795087 3533759 3504294 3440054 3818764 3495358 3585304 3657701 3629458
14040 3629458 3176593 3209358 3201585 3443288 3332621 3473858 3318734 3289158 3327952 3228661
$$ packed form
14111G626882k12093l05029R0724l08090l2784L31041k67146Q5671k89443j57101
14101F562632j9375l00129J93944j68981k56277k7489J93176l66262J36633j6779
14091E931093r3772p6268K7898k57068o4899k20779J77918J27101r6740j54966
14081E299518N2210k05885j1664k02287l8658n1507J01340p4818k86907L79460
14071D960802l35298K67855o38853K26239l15857J72123J27727l8870l82002k1037
14061D022829L09712j46243m77093N16705k69368O9049J53809m9450m14299L068
14051C718719k7286q906J12560k61328k9465o4240L78710l23406Q9946P2397k8243
14040C629458m52865L2765p773K41703j10667J41237j55124k9576L8794r9291
$$ plain form
14030 3228661 3108047 3296315 3125603 3027227 3247765 2903944 2593068 2603074 2912591 2783111
14020 2783111 2760047 2872387 2932219 2655606 2807233 2779625 3003888 2610322 2602480 2674170
14010 2674170 2588504 2436578 2615466 2545213 2667434 2222072 2565460 2509834 2395734 2392618
14000 2392618 2368016 1983289 2311950 2199103 2048837 1879118 1970043 2206258 2238954 2312401
13990 2312401 2731151 4197242 6971859 13917703 29482723 41602812 28113105 16157345
13982 16157345 9953935 6653774 5452792 4294557 3746604 3364871 3090264 3053584 3007413
13973 3007413 3052267 3083329 2763321 2811230 2541219 2601842 2624491 2261543 2403782 2555844
13963 2555844 2280045 2354059 2066770 2283717 2676710 2276235 1918971 2432330 1873235 2340320
$$ packed form
14030C228661j20614J88268j70712r8376K20538l43821l10876J0006L09517j29480
14020B783111k3064J12340N9832k76613J51627k7608K24263l93566p842P1690
14010B674170q5666j51926J78888p0253J22221m45362L43388n5626j14100l116
14000B392618k4602l84727L28661j12847j50266j69719R0925K36215L2696P3447
13990B312401M18750J466091K774617O945844J5565020J2120089j3489707j1955760
13982A6157345o203410l300161j200982j158235n47953l81733k74607l6680m6171
13973C007413M4854L1062l20008M7909k70011O0623K2649l62948J42239J52062
13963B555844k75799P4014k87289K16947L92993m00475l57264N13359n59095M67085
$$ plain form
13953 2340320 2260101 2248229 2221871 2043544 2070230 1718288 2047626 1626992 1865900 1793427
13943 1793427 1994345 1861635 1946337 1764976 1957173 1663355 1938169 1965466 2116920 1655607
13933 1655607 1773087 1604456 1673912 1818014 1571913 1806379 1566564 1473370 1877338 1544764
13923 1544764 1706226 1925979 1550310 1563023 1662227 1634385 1631913 1621780 1845226 1820640 1572672
13912 1572672 1575442 1528467 1189571 1550510 1467468 1673424 1818982 1457125 1088091 1320082
13902 1320082 1304757 1539677 1558355 1415964 1560850 1207778 1397623 1179012 1284438 1119493
13892 1119493 1223100 1485245 1358720 1544482 1192926 1206639 1219806 1320320 1228788 1207519
13882 1207519 1083634 1193277 1177042 1270611 1555469 1345389 1293681 1351570 1180525 1149292
$$ packed form
13953B340320q0219j1872k6358j78327K6686l51942L29338m20634K38908p2473
13943A793427K00918j32710Q4702j81361J92197k93818K74814K7297J51454m61313
13933A655607J17480j68631O9456J44102k46101K34466k39815r3194M03968l32574
13923A544764J61462K19753l75669J2713R9204k7842k472j0133K23446k4586k47968
13912A572672K770m6975l38896L60939q3042K05956J45558l61857l69034K31991
13902A320082j5325K34920J8678j42391J44886l53072J89845k18611J05426j64945
13892A119493J03607K62145j26525J85762l51556J3713J3167J00514r1532k1269
13882A207519j23885J09643j6235R3569K84858k10080n1708N7889j71045l1233
$$ plain form
13872 1149292 1186022 1107826 943244 1175788 1284790 1272766 1247716 1034329 1117998 1045023
13862 1045023 1156674 1032929 1235928 1045257 1073806 1014507 1201901 1162884 1002204 1428016
13852 1428016 1100755 1120837 1008893 1006405 1211715 1070962 1042545 1227207 1139893 1236404
13842 1236404 894525 1022221 711801 950686 1079059 1107580 906480 807330 1153168 843846
13832 843846 1251191 646946 956402 877085 1227296 734276 433616 1085576 668947 1120616
13822 1120616 1067314 903068 990727 836334 774613 844539 1098609 738288 1178747 812387
13812 812387 722702 830739 1086706 948079 411701 819766 650296 911260 839379 834599
13802 834599 951515 948155 888520 954650 736816 877832 1044385 595399 1029211 828586
$$ packed form
13872A149292L6730p8196j64582K32544J09002j2024k5050k13387Q3669p2975
13862A045023J11651j23745K02999j90671K8549n9299J87394l9017j60680M25812
13852A428016l27261K0082j11944k488K05310j40753k8417J84662q7314R6511
13842A236404l41879J27696l10420K38885J28373K8521k01100r9150L45838l09322
13832H43846M07345o04245L09456p9317L50211m93020l00660O51960m16629M51669
13822A120616n3302j64246Q7659j54393o1721O9926K54070l60321M40459l66360
13812H12387q9685J08037K55967j38627D11701M08065j69470K60964p1881m780
13802H34599J16916l360n9635O6130k17834J41016J66553m48986M33812k00625
$$ plain form
13792 828586 858454 828136 866468 727585 901157 902472 754957 841780 593807 977809 996545
13781 996545 871315 1111006 668856 493981 857958 889357 918573 822297 778442 716674
13771 716674 982711 921818 758382 793049 827447 726406 747127 832867 952978 803680
13761 803680 633398 751590 704568 588832 545395 414008 817586 818681 695468 1121677
13751 1121677 769005 630448 867852 843259 571261 674888 1167144 638358 752674 391183
13741 391183 717767 523075 653408 841487 663596 787327 488363 508223 702406 312215
13730 776532 644838 670688 876016 617544 573298 762825 579742 799286 422973 548710
13720 548710 732257 763103 726101 776618 626326 482532 712549 521827 572300 748223
$$ packed form
13792H28586K9868l0318L8332j38883J73572J315j47515Q6823k47973L84002J8736
13781I96545j25230K39691m42150j74875L63977L1399K9216r6276m3855o1768
13771G16674K66037o0893j63436L4667L4398j01041K0721Q5740J20111j49298
13761H03680j70282J18192m7022j15736m3437j31387M03578J095j23213M26209
13751A121677l52672j38557K37404k4593k71998J03627M92256n28786J14316l61491
13741C91183L26584j94692J30333J88079j77891J23731k98964J9860J94183C12215
13730G76532j31694K5850K05328k58472m4246J89527j83083K19544l76313J25737
13720E48710J83547L0846l7002N0517j50292j43794K30017j90722N0473J75923
$$ plain form
13710 748223 808084 603788 490268 503869 495541 606657 533954 527402 297752 701364 577664
13699 577664 689344 653969 265521 372333 524201 698518 551363 440286 743011 653811
13689 653811 823282 751346 240603 496525 571871 502787 637034 553417 592868 342489
13679 342489 645311 470288 372370 526940 471783 549347 724342 431584 726159 317392
13668 529285 462010 355170 332602 95216 488513 466901 345783 407138 425996 699331 257769
13656 540409 151011 385913 624492 298860 339080 574216 691565 443936 742798 602241
13646 602241 366137 158784 374277 189186 527864 633928 285814 273210 451716 514402
13636 514402 382509 593270 332044 837814 39233 346282 449994 400644 419522 473685
$$ packed form
13710G48223N9861k04296j13520J3601q328J11116p2703o552k29650M03612j23700
13699E77664J11680l5375B65521J06812J51868J74317j47155j11077L02725q9200
13689F53811J69471p1936B40603K55922P5346o9084J34247q3617L9451k50379
13679C42489L02822j75023r7918J54570n5157P7564J74995k92758K94575C17392
13668E29285o7275j06840k2568I5216L93297k1612j21118O1355J8858K73335B57769
13656E40409A51011K34902K38579B98860M0220K35136J17349k47629K98862j40557
13646F02241k36104A58784K15493j85091L38678J06064B85814j2604J78506O2686
13636E14402j31893K10761k61226N05770C9233L07049J03712m9350J8878N4163
$$ plain form
13626 473685 376423 469954 349315 379006 339533 475209 702729 330692 221785 471132
13616 471132 469270 338181 559536 549856 636768 337279 438750 215432 353568 555447
13606 555447 204350 322712 360873 607771 534544 465357 295359 437145 308045 528713
13596 528713 579447 179981 377563 504556 128827 216866 180510 339137 384295 414605
13586 414605 322567 389282 526723 502373 307242 340382 327862 -4997 425076 -35382 283556
13574 174687 552832 320568 64466 539897 507729 515638 406772 425320 394619 45677 348866
13563 348866 267765 89543 374665 136175 331700 377854 460604 -79352 350360 355055 279118
13552 279118 510252 284954 485384 506827 376137 451287 504141 319123 350985 396746
$$ packed form
13626D73685r7262R3531j20639K9691l9473J35676K27520C30692j08907K49347
13616D71132j862j31089K21355r680Q6912k99489J01471B15432J38136K01879
13606E55447B04350J18362L8161K46898p3227o9187j69998J41786j29100K20668
13596E28713N0734A79981J97582J26993A28827Q8039l6356J58627M5158L0310
13586D14605r2038O6715J37441k4350j95131L3140j2520d997D25076c5382B83556
13574A74687L78145k32264F4466M75431l2168P909j08866J8548l0701D5677L03189
13563C48866q1101H9543K85122A36175J95525M6154Q2750g9352C50360M695p5937
13552B79118K31134k25298K00430K1443j30690P5150N2854j85018L1862M5761
$$ plain form
13542 396746 511533 255606 431206 514047 267459 194408 383966 189184 109440 523845
13532 523845 286763 260842 -17355 63391 373342 435526 352531 228297 380454 146550
13521 239636 130341 388288 108345 457845 320459 159433 285273 419980 197731 224841
13511 224841 566733 87650 303719 329201 365959 383763 338314 84573 266185 438911 570569
13500 570569 310911 222462 96568 624033 194025 96486 520530 309129 339416 192303
13490 192303 316786 538334 43642 86528 106526 35181 79781 445914 26491 441912 539291
13479 539291 136672 -125993 288110 421812 458004 474856 -62136 324117 455670 194108
13468 193888 249499 416938 165037 320172 428564 283398 330181 223505 -23182 166449
$$ packed form
13542C96746J14787B55606J75600Q2841k46588p3051J89558A89184p9744M14405
13532E23845k37082k5921a7355F3391L09951O2184q2995j24234J52157A46550
13521B39636j09295K57947A08345L49500j37386A59433J25840J34707A97731K7110
13511B24841L41892H7650K16069K5482L6758J7804m5449H4573J81612J72726J31658
13500E70569k59658q8449I6568N27465A94025I6486M24044k11401L0287j47113
13490A92303J24483K21548D3642M2886J9998C5181M4600L66133B6491M15421R7379
13479E39291A36672a25993B88110J33702L6192J6852f2136C24117J31553A94108
13468A93888N5611J67439A65037J55135J08392j45166M6783j06676b3182A66449
$$ plain form
13457 471090 152991 84784 556865 375196 124959 41652 -69081 236549 367992 458993
13447 458993 248879 64850 217831 325665 139243 344858 604882 192445 263745 64394
13436 130328 408154 256639 111186 396998 364149 243016 311618 260322 310513 164887
13426 164887 11848 181537 276388 126499 272570 113739 227376 436266 454795 200456
13415 142090 357789 175318 272701 151504 192821 337480 359075 -74276 51910 -234098
13404 -26703 148041 132888 171979 100288 385909 341788 115574 128847 191330 246120 138797
13393 138797 129677 99633 225717 278710 364776 155280 -150692 359566 276783 -105030 -23304
13381 194734 -187372 824396 276396 82287 294897 117138 102049 352305 239307 435895
$$ packed form
13457D71090A52991o8207M72081j81669A24959D1652f9081B36549J31443R1001
13447D58993k10114F4850J52981J07834A39243K05615K60024A92445P1300F4394
13436A30328K77826j51515A11186K85812l2849j21133O8602n1296N0191j45626
13426A64887A1848J69689R4851A26499J46071A13739J13637K08890J8529B00456
13415A42090K15699A75318R7383j21197M1317J44659K1595g4276E1910b34098
13404b6703A48041j5153L9091p1691K85621m4121A15574J3273O2483N4790j07323
13393A38797r120l0044J26084N2993Q6066A55280a50692C59566q2783a05030b3304
13381A94734a87372H24396B76396H2287K12610A17138j5089K50256j12998J96588
$$ plain form
13371 435895 191813 310340 257869 76173 21354 552553 71360 514858 675117 283732
13360 24289 76094 265130 445871 136631 64833 -94457 -197273 421402 203700 101771
13349 199819 492587 144087 66164 364120 337144 422284 125519 634155 521990 452330
13339 452330 505966 166158 233656 715357 111384 228638 147558 117971 313816 277208
13329 277208 256879 154384 370207 72808 343193 305702 116779 105199 334067 -21234
13318 -79792 142386 260019 184039 62715 238385 152988 319601 70100 33975 126625 44373
13306 -93815 151663 23245 261751 -178475 324386 297127 77227 8350 77018 94361 -115409
13294 67024 111110 106487 -13353 136574 316503 293684 -112585 265036 133120 -73191 -25898
$$ packed form
13371D35895A91813J18527n2471G6173B1354N31199G1360M43498J60259B83732
13360B4289N1805J89036J80741A36631F4833i4457j02816D21402B03700A01771
13349A99819K92768A44087F6164K97956k6976Q5140A25519N08636j12165o9660
13339D52330N3636A66158O7498M81701A11384J17254q1080k9587J95845l6608
13329B77208k0329j02495K15823G2808K70385l7491A16779j1580K28868b1234
13318g9792A42386J17633p5980F2715J75670q5397J66613G0100C3975R2650D4373
13306i3815A51663B3245K38506a78475C24386k7259G7227H350O8668J7343a15409
13294F7024M4086m623a3353A36574J79929k2819a12585B65036j31916g3191b5898
$$ plain form
13282 -111623 -119799 273905 449115 -29074 34129 39750 72574 472982 27683 239910 164204
13271 164204 110234 47367 277539 544424 110043 183688 239292 28958 129440 280040
13261 280040 394829 -39769 161836 429481 -41657 28632 134258 320737 -68033 76977
13250 273016 173601 140703 -107914 61666 62333 239012 -181090 113076 -123828 123573 176175
13239 176175 334939 53416 322193 233112 107586 285680 -107352 449310 62760 154766
13229 154766 363767 -117776 216506 59798 -5448 17590 41759 -394310 173022 70803 142413
13218 142413 86036 44184 296127 -18669 206235 261244 -158546 -15776 203454 195365 486375
13207 486375 37296 527593 342068 316459 136960 151750 98722 207116 215492 11592 259276
$$ packed form
13282a11623q176B73905J75210b9074C4129N621L2824M00408B7683K12227p5706
13271A64204n3970D7367K30172K66885A10043P3645N5604B8958J00482J50600
13261B80040J14789c9769A61836K67645d1657B8632J05626J86479f8033G6977
13250B73016r9415l2898a07914F1666O67J76679a81090A13076a23828A23573N2602
13239A76175J58764E3416K68777q9081A07586J78094a07352D49310F2760R2006
13229A54766K09001a17776B16506E9798e448A7590K4169c94310A73022G0803P1610
13218A42413n6377m1852K51943a8669B06235N5009a58546a5776B03454q089K91010
13207D86375C7296M90297j85525k5609A36960J4790n3028J08394Q376A1592K47684
$$ plain form
13196 259276 -75448 148677 367287 464157 102435 -336890 53039 -50531 455786 -183037
13185 196316 146900 -227783 147323 -50558 -8435 245774 134590 348124 52950 182443
13175 182443 176870 87306 98398 -22342 403496 167678 162787 132872 73682 208624 16739
13163 268212 391980 273469 99205 441969 265976 -75312 27115 164591 282505 -101558
13152 99853 27078 319204 -32087 23954 -5244 275059 497393 371309 -115090 240295 258226
13141 258226 27935 -232134 -24603 16798 -69056 342709 463195 327265 -366155 -291837
13131 -291837 -1153 92623 120530 158694 -149778 -8149 -33745 41424 332768 -92624 30536
13119 65859 -88900 206149 -5510 104928 306446 34089 155174 172774 9091 125070 175224
$$ packed form
13196B59276g5448A48677K18610R6870A02435c36890E3039e0531D55786a83037
13185A96316m9416b27783A47323e0558h435B45774j11184K13534E2950J29493
13175A82443n573H7306J1092b2342D03496A67678m891k9915n9190J34942A6739
13163B68212J23768j18511I9205L42764j75993g5312B7115J37476J17914a01558
13152I9853B7078K92126c2087B3954e244B75059K22334j26084a15090B40295J7931
13141B58226B7935b32134b4603A6798f9056C42709J20486j35930c66155P4318
13131b91837a153I2623K7907L8164a49778h149k5596D1424K91344i2624C0536
13119F5859h8900B06149e510A04928K01518C4089J21085J7600I091J15979N0154
$$ plain form
13108 175224 30268 48832 -198799 215834 13858 108143 -144163 251061 89280 196623
13098 196623 -174284 -104147 -33103 -79721 -3746 -139561 59323 -203905 -117001 -96155 272935
13086 246753 355327 -13540 56516 28767 -279503 222792 -205014 173474 -117230 298338
13075 -47615 -103067 576697 155270 199636 9093 194931 33125 127173 70700 -74665 327698
13063 151538 -80853 -189912 73903 72800 231201 304649 75165 -89952 132718 152766 233262
13052 233262 101340 -204026 111302 289187 -327659 356255 128847 -122746 30573 263380
13042 263380 274346 105023 30259 71544 298353 -79517 101823 340172 116399 -66827
13031 84997 284387 165844 155293 48213 -39167 71640 65792 -24673 -35250 154359 118535
$$ packed form
13108A75224C0268J8564a98799B15834A3858R4285a44163B51061H9280J07343
13098A96623a74284P0137c3103m6618c746j35815E9323b03905Q6904K0846B72935
13086B46753J08574a3540E6516k7749b79503B22792b05014A73474a17230B98338
13075d7615n5452E76697A55270M4366I093J85838C3125R4048n6473g4665C27698
13063A51538h0853j09059G3903j103J58401P3448G5165h9952A32718K0048Q0496
13052B33262A01340b04026A11302J77885c27659C56255A28847a22746C0573K32807
13042B63380J0966A05023C0259M1285K26809g9517A01823K38349A16399f6827
13031H4997J99390j18543j0551D8213c9167G1640n848b4673j0577A54359l5824
$$ plain form
13020 118535 312589 25151 -25507 264650 165617 236577 65866 265726 29055 239800 -383085
13008 126934 28670 57905 296941 316386 -256571 177826 171227 180623 407432 74556 165991
12997 165991 -130184 -153717 -32266 71924 112435 -152206 328154 253680 -113664 31023 -247773
12985 277121 -136907 147740 81311 47123 87913 502397 254754 255083 27616 -229372 -88166
12973 173884 6250 64703 4759 133211 -86109 -204626 -37780 315037 16778 -221710 351063
12961 18280 407855 160512 110023 79929 -58215 -158319 273940 169571 180084 253100 476727
12950 476727 -49517 -16277 364180 271465 205908 399873 185726 -113210 -7123 15910 5850
12938 -53746 -162623 87048 9310 83982 -162842 -80713 -180278 275687 -11042 -66728 205261
$$ packed form
13020A18535J94054B5151b5507B64650r9033P0960F5866J99860B9055K10745c83085
13008A26934B8670K9235K39036J9445b56571A77826o599R396K26809G4556R1435
12997A65991a30184k3533c2266G1924M0511a52206C28154p4474a13664C1023b47773
12985B77121a36907A47740o6429l4188M0790M14484k47643L29B7616b29372h8166
12973A73884F250N8453D759J28452h6109j18517c7780C15037A6778b21710C51063
12961A8280L89575A60512n0489l0094e8215j00104B73940j04369J0513P3016K23627
12950D76727d9517a6277C64180r2715o5557J93965A85726a13210g123A5910E850
12938e3746j08877H7048I310P4672a62842h0713r9565B75687a1042n5686B05261
$$ plain form
12926 51940 -238342 32620 342154 -218207 -315311 -26723 71622 57705 166656 -26862 -39305
12915 -39305 190786 160728 -281001 315033 239215 171673 381091 -97599 94703 317868 177308
12904 177308 103341 -283832 10506 -77432 22122 156492 209786 -33236 -418085 -51423 72719
12892 -13659 -151583 21329 36854 261869 64392 299339 74856 -104862 221191 -72469 436750
12880 -121738 1413 70865 74511 -67170 73108 209428 -30977 -168583 -243679 118972 -174999
12868 -95568 304082 -98030 443464 1970 70281 123713 -133808 -23286 -18284 -243954 126321
12856 124612 -200003 -47645 -275617 -116352 404899 142857 124760 82852 148886 -35303
12845 139048 -144851 150561 -97725 231784 -8507 175254 -8956 15956 225 -31011 -23913 -249894
$$ packed form
12926E1940b38342C2620L09534b18207r7104b6723G1622j3917J08951b6862j2443
12915c9305A90786l0058b81001C15033p5818o7542K09418i7599I4703K23165j40560
12904A77308p3967b83832A0506g7432B2122J34370N3294c3236l84849e1423G2719
12892a3659j37924B1329J5525K25015F4392K34947G4856a04862B21191g2469D36750
12880a21738A413O9452L646f7170G3108J36320c0977j37606p5096A18972a74999
12868i5568C04082i8030D43464A970O8311N3432a33808b3286N002k25670A26321
12856A24612b00003d7645k27972a16352D04899A42857j8097m1908O6034c5303
12845A39048a44851A50561i7725B31784h507A75254h956A5956B25c1011P098k25981
$$ plain form
12833 -249894 160835 18529 -31328 -46030 108493 -10769 162077 94563 -119387 -79498 -109395
12822 -109395 23816 152554 -11687 -11114 -161224 162621 -131313 -28724 -14925 104908 -15132
12810 449237 12825 -323960 208780 200289 59351 240819 158853 413082 149610 -340477
12799 -46883 96840 -349849 230297 -132243 182743 111174 -24572 -108738 -265979 -275700 117529
12787 99666 159090 134061 287648 221292 44229 -191382 118638 -8090 24056 41091 201575
12776 201575 -98085 53862 -22793 -133137 185295 -210175 -18053 -335115 65155 -366875
12765 -132931 -68411 -89277 107891 99211 194108 274884 28134 137498 -25826 -170060 124732
12753 42549 198480 121890 -396226 -77880 30699 -87072 -168108 81939 171079 375811 -159694
$$ packed form
12833b49894A60835A8529c1328j4702A08493a0769A62077o7514a19387L9889k9897
12822a09395B3816J28738a1687N73j50110A62621a31313b8724J3799A04908a5132
12810D49237A2825c23960B08780q491E9351J81468q1966K54229A49610c40477
12799d6883I6840c49849B30297a32243A82743p1569b4572q4166j57241r721A17529
12787I9666N9424k5029J53587o6356D4229a91382A18638h090B4056J7035J60484
12776B01575i8085E3862b2793j10344A85295b10175a8053l17062F5155c66875
12765a32931O4520k0866A07891q680R4897Q0776B8134J09364b5826j44234A24732
12753D2549J55931p6590c96226g7880C0699h7072q1036H1939Q9140K04732a59694
$$ plain form
12741 396565 49287 -120120 -60241 119447 141300 60703 55267 -25481 96117 -336408 25062
12729 -119619 18084 184808 49836 346611 115401 5076 82224 127863 -130066 54287 58212
12718 58212 254261 62680 152234 200032 162320 -182121 -101312 210416 -133254 267840 41201
12706 432608 314370 278729 216168 253805 121476 40081 460606 4021 164326 -145508 158944
12694 -161087 443562 -724 36623 -178724 -172023 205831 399004 142617 101268 5899 -130289
12682 9721 418706 -36784 30005 102444 181068 60828 300654 -126221 18938 -37543 134375
12670 105780 255789 -157500 2360 49862 412534 22524 -37538 155251 -12393 234574 -9697
12658 -92891 41584 129392 167810 146408 408835 106719 -15206 330197 -3467 227532 -8772
$$ packed form
12741C96565D9287a20120N9879A19447K1853F0703n436b5481I6117c36408B5062
12729a19619A8084J66724D9836K96775A15401E076P7148M5639a30066E4287L925
12718E8212J96049F2680Q9554M7798l7712a82121Q0809B10416a33254B67840D1201
12706D32608j18238l5641o2561L7637A21476D0081M20525D021J60305a45508A58944
12694a61087D43562g24C6623a78724O701B05831J93173A42617m1349E899a30289
12682I721M08985c6784C0005P2439P8624F0828K39826a26221A8938c7543A34375
12670A05780J50009a57500B360M7502L62672B2524c7538A55251a2393B34574i697
12658i2891D1584Q7808L8418k1402K62427A06719a5206C30197c467B27532h772
$$ plain form
12646 241496 276442 -37475 68086 327219 -165877 383549 -190247 282947 -69395 -88510
12636 -88510 75911 -32953 196736 160329 65674 218503 368398 376970 409325 1828 92895
12625 92895 367700 228830 123269 -70475 300790 -27485 -32040 -177071 18258 -58312 23768
12613 -32530 85448 -210333 -174413 200420 -122934 44500 275551 -34347 125737 44960 336176
12602 336176 -42788 123601 64946 50424 3228 -49752 332870 -32695 -99132 335986 -72114
12590 251477 133967 239663 -165121 6164 312144 130455 347514 -118096 -60843 -80704
12580 -80704 -141746 69039 79645 41236 -409316 230607 -78962 59107 -42235 -73537 145371
12568 30290 -50183 -279012 -60629 205223 -21159 410667 -21710 105014 -10075 234707 -212454
$$ packed form
12646B41496L4946c7475F8086K59133a65877C83549a90247B82947f9395j9115
12636h8510G5911c2953A96736l6407F5674J52829J49895Q572L2355A828R1067
12625I2895K74805j38870j05561g0475C00790b7485m555j45031A8258e8312B3768
12613c2530H5448b10333L5920B00420a22934D4500K31051c4347A25737D4960K91216
12602C36176d2788A23601n8655j4522C228d9752C32870c2695o6437C35986g2114
12590B51477j17510J05696a65121F164L05980A30455K17059a18096N7253j9861
12580h0704o1042F9039J0606l8409d09316B30607g8962E9107d2235l1302A45371
12568C0290e0183k28829f0629B05223b1159D10667b1710A05014a0075B34707b12454
$$ plain form
12556 32243 495577 -77527 170136 -83573 -9785 34119 -75395 245542 164127 289579 166934
12545 166934 -81431 44184 216939 175046 251834 -49822 357821 177525 48961 178388 -374158
12533 32415 -147235 -133151 241093 74353 -105372 245720 -185658 -170346 74883 232159
12523 232159 236218 131490 -340080 64919 62702 41979 -121957 -91209 17764 242733 66104
12511 -58965 190045 -61182 -241490 6314 -170190 -161993 44837 -146714 73689 41623 -350419
12499 -401984 51552 138783 117597 56469 126537 184782 110995 50043 38774 -355032 94470
12487 124465 166284 -102894 -53979 213228 19527 -250989 -112103 82100 -189063 42851
12476 141907 98325 -33625 142772 -269903 20384 -52541 -35132 -77846 199926 -5389 -201550
$$ packed form
12556C2243M63334g7527A70136h3573i785C4119g5395B45542q1415J25452j22645
12545A66934h1431D4184J72755m1893P6788d9822C57821A77525D8961J29427c74158
12533C2415a47235J4084B41093G4353a05372B45720a85658J5312G4883J57276
12523B32159M059j04728c40080F4919k217k0723a21957L0748A7764K24969F6104
12511e8965A90045f1182j80308F314a70190Q197D4837a46714G3689l2066c50419
12499d01984E1552Q7231k1186E6469P0068N8245p3787E0043j1269c55032I4470
12487A24465M1819a02894M8915B13228A9527b50989a12103H2100a89063D2851
12476A41907m3582c3625A42772b69903B0384e2541J7409m2714A99926e389j96161
$$ plain form
12465 -201550 42325 -121023 -39383 -98116 165430 169356 217446 -79543 68834 -240688 -102506
12453 -315778 268125 48424 233180 117209 366342 -62362 -34016 97322 192658 -100603
12442 -259133 -59922 -103412 116338 229243 50004 224092 35014 -155212 -360364 163815
12431 -63910 4600 -115745 -61863 36980 99408 36232 -431918 26637 68815 -38057 -33615 213309
12418 3974 102636 -123224 62853 25040 143795 156170 -126554 -75410 -5706 134272 291284
12407 291284 76748 54809 157502 -286322 -91808 -13022 -97700 -6967 -43039 -64078 -102581
12396 -102581 59600 -47790 -82906 -60984 -123774 -149394 130771 136179 -44216 -310271 -48433
12384 -324455 -295382 20042 170680 -54487 130306 97107 -103800 94025 -11952 -220344 -154525
$$ packed form
12465b01550D2325a21023c9383n8733A65430L926M8090g9543F8834b40688a02506
12453c15778B68125D8424J84756j15971K49133f2362K8346I7322R5336a00603
12442b59133e9922m3490A16338J12905E0004J74088C5014a55212k05152A63815
12431f3910D600a15745N3882C6980O2428C6232d31918B6637M2178c8057M442B13309
12418C974R8662a23224F2853B5040J18755J2375a26554N1144e706A34272J57012
12407B91284G6748k1939J02693b86322i1808a3022q4678f967l6072k1039l8503
12396a02581E9600d7790l5116K1922o2790k5620A30771N408d4216k66055d8433
12384c24455K9073B0042J50638e4487A30306l3199a03800I4025a1952k08392O5819
$$ plain form
12373 -154525 -8730 -10444 -58182 -132941 -191974 -216552 38069 135292 201467 43165 -32236 -146339
12361 -146339 -149436 186091 -34232 -78210 300319 59108 189378 -122814 -44285 -94676 -77461
12350 -77461 -127067 119915 284422 -59246 188605 -450860 14403 20687 -196205 -124318 220568
12338 67473 -52925 -51728 -122358 -36759 18136 -229560 -2269 133888 266057 -210543 501638
12326 -131398 -40063 -4484 40274 37137 96455 -221686 98246 25540 69980 29126 -154289
12314 75049 -72915 -148343 26245 218416 -246190 45858 338532 282165 -182903 200809 -233024
12302 301952 9891 -15923 -60594 -172154 176812 -68996 -317335 64660 16062 207539 210622
12291 210622 100054 -84319 -11555 23871 172438 88544 -5606 145721 -78065 -151303 96646
$$ packed form
12373a54525h730j714m7738p4759n9033k4578C8069R7223O6175D3165c2236j14103
12361a46339l097A86091c4232m3978C00319E9108J30270a22814d4285n0391J7215
12350g7461m9606A19915J64507e9246A88605d50860A4403O284a96205P1887B20568
12338F7473e2925J197p0630c6759A8136b29560b269A33888J32169b10543E01638
12326a31398d0063d484D0274l137N9318b21686I8246B5540M4440B9126a54289
12314G5049g2915p5428B6245J92171b46190D5858K92674n6367a82903B00809b33024
12302C01952I891a5923m4671j11560A76812f8996k48339F4660A6062J91477L083
12291B10622A00054h4319a1555B3871J48567q3894e606A45721g8065p3238I6646
$$ plain form
12279 -103148 -24233 24984 48610 71798 409076 145109 88891 250146 33209 239774 16885
12267 -98979 5188 98656 -115471 -33311 -17601 95937 -107865 135507 314809 -23442 68986
12255 27182 140635 227635 238460 52977 -27791 -15628 168669 99734 54916 -207214 140445
12243 97135 -183107 84580 -98250 -226211 -200294 -8645 210959 110757 29148 -169313 -133957
12232 -133957 88492 -21094 324518 387977 -12825 36392 298263 463277 274983 66441 621202
12221 621202 562372 -93311 216863 38752 23356 297888 479447 186148 152389 -77953 48380
12209 -94821 9959 201644 83142 -108306 -128925 -43452 97217 214600 -149631 430425 205494
12197 104761 -81883 252919 323033 155936 -50180 479354 343317 409587 57782 206093
$$ packed form
12279a03148b4233B4984K3626K3188L37278A45109n6218J61255C3209K06565A6885
12267i8979E188R3468a15471c3311J5710I5937a07865A35507J79302b3442F8986
12255B7182J13453Q7000J0825E2977b7791J2163A68669o8935m4818b07214A40445
12243I7135a83107H4580i8250j27961K5917h645B10959j00202B9148a69313L5356
12232a33957H8492b1094C24518O3459a2825C6392K61871J65014j88294F6441N54761
12221F21202n8830i3311B16863C8752j5396K74532J81559A86148l3759g7953D8380
12209i4821I959J91685H3142a08306k0619d3452I7217J17383a49631D30425B05494
12197A04761h1883B52919P0114A55936e0180D79354j36037O6270E7782J48311
$$ plain form
12187 206093 351776 220942 156601 52126 -75411 96939 92610 -145097 78872 94863 246891
12176 246891 137015 366224 -156807 283189 297910 89846 -253247 155050 -2424 225651
12165 105328 -20335 252307 30468 157601 49503 -270045 400586 -184208 -233894 67232
12154 -126261 -258982 46095 40851 155265 94355 -25391 215646 -249248 -45480 273394 131248
12142 144312 57776 -128220 250509 -68446 -224397 -92961 -48581 83215 -22381 -196730 13849
12130 143023 308417 223815 275089 107431 -110508 126166 66503 146718 -162361 170473
12119 70343 262257 158066 -98234 225404 -397802 57836 -229956 -151549 187530 -40009
12108 -147202 204164 345046 221377 -6317 -276928 26691 -31771 -155912 71367 291278
$$ packed form
12187B06093J45683j30834o4341E2126g5411I6939m329a45097G8872J5991J52028
12176B46891j09876K29209a56807B83189J4721H9846b53247A55050b424B25651
12165A05328b0335B52307C0468J27133D9503b70045D00586a84208m9686F7232
12154a26261j32721D6095n244J14414o0910b5391B15646b49248d5480B73394A31248
12142A44312E7776a28220B50509f8446j55951i2961M4380H3215b2381j74349A3849
12130A43023J65394q4602N1274A07431a10508A26166n9663Q0215a62361A70473
12119G0343J91914j04191i8234B25404c97802E7836b29956P8407A87530d0009
12108a47202B04164J40882j23669f317k70611B6691c1771j24141G1367K19911
$$ plain form
12098 291278 -119789 -47823 -807 -153628 156157 -1753 -1799 144895 32680 -370237 -94826 -324860
12086 -324860 -33092 -193554 110925 71469 38751 46601 4355 -103931 -448390 173122 -169804
12074 213507 506969 340333 1160871 1833398 633263 69693 -70099 -194271 222426 317522
12064 317522 -31676 325779 -59747 -99056 -227618 -183047 129865 18194 180478 -25617 175740
12052 -97293 -102454 194704 415244 -54882 -282172 -186328 79546 -133252 -138662 154901 -132608
12040 -59522 -156412 -4660 -132448 -293881 1874 -141942 -18388 -327951 -445498 -254219 61614
12028 70039 -111675 -18153 -255489 323260 -237262 -321140 41506 37081 205900 125055 -169019
12016 -141866 55261 -270611 -118931 323647 33078 -76635 -11633 -122917 -104076 -6443 176781
$$ packed form
12098B91278a19789d7823h07j52821A56157a753m6A44895C2680c70237i4826k30034
12086c24860c3092j60462A10925l9456l2718P850D355a03931l44459A73122a69804
12074B13507K93462j66636Q20538O72527F33263F9693g0099j24172B22426R5096
12064C17522c1676C25779e9747l9309j28562M4571A29865A8194J62284b5617A75740
12052i7293n161A94704K20540e4882k27290R5844G9546a33252n410A54901a32608
12040e9522r6890d660j27788j61433A874a41942a8388l09563j17547J91279F1614
12028G0039a11675a8153k37336C23260b37262q3878D1506m425J68819q0845a69019
12016a41866E5261b70611a18931C23647C3078g6635a1633j11284J8841f443A76781
$$ plain form
12004 -45266 -83516 151063 -8953 -79028 -48200 -168418 -74378 117561 285060 81746 90999
11993 90999 47343 216614 52410 -28758 227527 -21338 216477 -196289 6017 100335 -190363
11981 223744 -16782 83380 -3052 186878 236418 -235135 -132003 97363 171623 24528 -72005
11969 -17793 63515 -196572 256223 -199902 58351 45874 -101753 -180966 -104288 -95315 92703
11957 -29527 -239056 -78567 83289 26662 -187049 -5922 127189 -155458 -46491 -149773 -20480
11945 -122366 -320105 230860 -8465 -81946 160562 -192042 140573 -263766 -156567 -83756
11935 -83756 -181867 81449 59093 -11637 40883 266959 311590 -145402 -158661 49419 136868
11924 136868 -301908 -97443 187817 -2635 74306 -281928 3141 -120124 52034 127673 71451
$$ packed form
12004d5266l8250A51063h953p0075L0828j20218g4378A17561J67499H1746R253
11993I0999m3656J69271E2410b8758B27527b1338B16477a96289F017R4318a90363
11981B23744a6782H3380c052A86878M9540b35135J03132I7363P4260B4528g2005
11969a7793F3515a96572B56223a99902E8351j2477a01753p9213P6678Q973I2703
11957b9527k09529g8567H3289B6662a87049e922A27189a55458d6491j03282b0480
11945a22366j97739B30860h465p3481A60562a92042A40573b63766J07199P2811
11935h3756r8111H1449k2356a1637D0883K26076M4631a45402j3259D9419Q7449
11924A36868c01908i7443A87817b635G4306b81928C141a20124E2034P5639n6222
$$ plain form
11913 71451 1391 -118342 35537 -106637 179219 9165 -18642 428796 112571 -87717 186020
11901 -280137 -138514 17243 -30527 74216 -55037 185449 -257307 253124 141692 -142346
11890 -341320 -61458 66081 244358 -241935 208186 155778 -41932 -301036 -9398 132415 -385658
11878 -158533 -213961 -218153 3725 -14928 264526 142512 -35603 -131407 -386548 94177 23944
11866 -106105 119364 49134 -47907 -79824 -215400 -132037 173802 56158 -25019 -19278 54966
11854 97723 226021 -116732 14148 219287 -12919 -3357 84343 -324013 -69090 -154687 223221
11842 -31201 11671 -114586 -104744 -120402 -88096 107596 -365599 64438 -63010 354408 2796
11830 -20302 136103 -63848 -49034 21525 -244427 -72415 -59282 81159 -48500 -82010 -12343
$$ packed form
11913G1451A391a18342C5537a06637A79219I165a8642D28796A12571h7717A86020
11901b80137a38514A7243c0527G4216e5037A85449b57307B53124j11432a42346
11890c41320f1458F6081J78277b41935B08186n2408d1932k59104i398A32415c85658
11878a58533n5428m192C725a4928B64526j22014c5603r5804k55141I4177B3944
11866a06105A19364D9134d7907l1917j35576Q3363A73802E6158b5019N741E4966
11854I7723J28298a16732A4148K05139a2919c357H4343c24013f9090q5597B23221
11842c1201A1671a14586R842j5658L2306A07596c65599F4438f3010C54408B796
11830b0302A36103f3848J4814B1525b44427g2415J3133H1159d8500l3510a2343
$$ plain form
11818 51482 87928 -145604 67905 -162868 -334321 -209814 -112981 22324 -322185 35690 136825
11807 136825 177166 67976 7423 -193804 14993 63274 -98716 -221900 -108665 -76549 -19990
11795 37610 -61006 -136898 33567 -62654 -130400 -34678 92345 179580 -26014 161139 -193201
11783 -73755 86799 -24210 -99780 75173 199006 -239556 -210478 -146424 -244645 -107747 63851
11771 -171289 -268211 215327 437651 165589 43937 -48622 224695 -55009 -215641 195282
11760 -56676 -299451 24209 31912 -66741 4168 -130734 287388 30056 194624 -13334 77947
11748 23139 -108166 466919 126646 -35918 -227852 -204192 -103957 17371 -37940 -80751 -47096
11737 -47096 -380992 -304703 88844 0 -234462 54586 156883 -311411 132745 -102145 243434
$$ packed form
11818E1482L6446a45604F7905a62868j71453J24507R6833B2324c22185C5690J01135
11807A36825M0341F7976G423a93804A4993M8281i8716j23184a08665L2116a9990
11795C7610f1006p5892C3567f2654o7746c4678I2345Q7235b6014A61139a93201
11783g3755H6799b4210p5570G5173J23833b39556K9078O4054r8221a07747F3851
11771a71289r6922B15327K22324A65589D3937d8622B24695e5009j60632A95282
11760e6676k42775B4209P703f6741D168a30734B87388C0056J64568a3334G7947
11748B3139a08166D66919A26646c5918j91934K3660J00235A7371c7940m2811L3655
11737d7096l33896P6289H8844@b34462E4586J02297c11411A32745a02145B43434
$$ plain form
11725 250267 247546 -67026 110863 -182526 35943 -32719 126494 31582 -24984 86757 -1621
11713 -186012 169087 156497 167615 133210 121028 -66088 -167982 136863 -88619 -192965 -142468
11702 -142468 91586 -113543 -102216 -92619 -159524 39838 10880 -306814 76168 112395 224068
11691 224068 272071 -193548 180376 144495 107238 114145 -60977 -39947 4329 255729 36266
11679 -57255 -70115 -177306 -25673 -117092 133629 5202 -169819 80062 -155159 203008 7449
11667 -164281 135849 5438 -256967 -27549 -47575 115526 -80743 14567 155277 204052 168783
11656 168783 78009 -34539 13841 -108495 5210 195855 195097 58421 -229069 -163573 -186 -190653
11644 -190653 73924 126034 131046 341936 -249242 -250624 -19359 279130 30637 -271230 -30376
$$ packed form
11725B50267k721f7026A10863a82526C5943c2719A26494C1582b4984H6757a621
11713a86012A69087j2590J1118l4405j2182f6088j01894A36863h8619j04346N0497
11702a42468I1586a13543J1327R597o6905C9838A0880c06814G6168L6227J11673
11691B24068M8003a93548A80376l5881l7257O907f0977K1030D329K51400C6266
11679e7255j2860j07191b5673r1419A33629E202a69819H0062a55159B03008G449
11667a64281A35849E438b56967b7549k0026A15526h0743A4567J40710M8775l5269
11656A68783G8009c4539A3841a08495E210J90645p58E8421b29069O5496a86j90467
11644a90653G3924N2110N012K10890b49242j382a9359B79130C0637b71230c0376
$$ plain form
11632 48345 -13788 319092 -266388 117377 102141 185741 50880 -38935 90847 -95631 -233999
11621 -233999 60949 34653 74328 -87233 -177545 96806 122011 -301341 -145181 -141352 -208411
11610 -208411 35353 -5054 -71767 6700 -188787 -69460 147856 -174054 18842 -193114 -143830
11599 -143830 -128005 191580 -200991 18057 -95601 324033 241173 81253 63566 152772 90088
11588 90088 146932 346744 -192692 47598 122574 -106463 -93279 263769 -32009 71723 -140846
11576 315436 286673 14331 -22021 373853 132198 332975 -248750 107439 321860 -88920
11565 123396 -105305 145793 253944 -34613 100703 152225 88612 113190 211591 270980 -166251
11553 -261302 147663 194087 -231695 82842 26236 146653 -8058 -97088 -46287 222640 124715
$$ packed form
11632D8345a3788C19092b66388A17377j5236Q3600E0880c8935I0847i5631j38368
11621b33999F0949k6296L9675h7233r0312I6806K5205c01341a45181L829o7059
11610b08411C5353e054o6713F700a88787f9460A47856a74054A8842a93114M9284
11599a43830J5825A91580b00991A8057i5601C24033q2860H1253j7687Q9206o2684
11588I0088N6844J99812a92692D7598P4976a06463J3184B63769c2009G1723a40846
11576C15436k8763A4331b2021C73853A32198K00777b48750A07439K14421h8920
11565A23396a05305A45793J08151c4613A00703N1522o3613K4578R8401N9389a66251
11553b61302A47663M6424b31695H2842B6236J20417h058q9030d6287B22640r7925
$$ plain form
11542 124715 262767 4749 -206262 -23375 -141341 424461 251693 -164931 93579 206992
11532 206992 138246 -88949 -176780 -91610 134652 219558 -39405 -2478 148817 -41714 209998
11520 117084 211565 -23961 225140 -284739 317654 211251 286975 254137 509217 -88074
11509 324825 522719 239429 491654 209280 -96884 188448 274204 417773 247812 173161
11499 173161 305948 121700 154578 81392 294579 57589 186807 -122760 292191 352445
11489 352445 92828 50118 49966 152859 203754 -112032 39216 363424 53442 58092 164322
11478 164322 -85588 80570 31532 187011 119115 111060 57703 125138 -109049 23 444970 69768
11465 207740 -20220 -76962 101052 299390 285188 312344 297558 129098 149701 262084 169380
$$ packed form
11542A24715J38052D749b06262b3375j17966D24461j72768a64931I3579J13413
11532B06992o8746h8949q7831Q5170A34652Q4906c9405b478A48817d1714B09998
11520A17084R4481b3961B25140b84739C17654j06403P5724l2838K55080h8074
11509C24825J97894B39429K52225B09280i6884A88448Q5756J43569j69961p4651
11499A73161J32787A21700L2878p3186K13187E7589J29218a22760B92191O0254
11489C52445I2828m2710j52J02893N0895a12032C9216L24208E3442M650J06230
11478A64322h5588H0570C1532J55479o7896q055n3357O7435a09049B3M44947F9768
11465B07740b0220n6742A01052J98338j4202K7156j4786A29098K0603J12383r2704
$$ plain form
11454 169380 -5189 1075 106445 291997 -111427 -47883 221510 380341 29800 -49020 69247
11442 98579 238981 -119259 77430 -25213 64019 -106977 183858 -126016 -348390 151733
11431 175320 -150039 -34739 74109 -207597 247754 112458 77870 -113350 -3422 -142807
11421 -142807 -253786 8019 -83403 29784 -14193 172721 230953 38836 36876 -276428 -45993
11409 -65992 84332 16603 -268273 317647 -142860 68109 146639 -149666 31653 268671 162713
11398 162713 101644 -79629 -61005 208970 -74629 275128 10881 -47476 178793 312893 -265134
11386 284 -298753 -89959 280558 -249831 -99358 20059 11607 -118755 -11458 189325 187543
11375 187543 61548 186224 -172741 133007 209724 17818 35952 109303 -244513 -52798 -71340
$$ packed form
11454A69380e189A075J05370J85552a11427d7883B21510J58831B9800d9020F9247
11442I8579J40402a19259G7430b5213F4019a06977A83858a26016k22374A51733
11431A75320a50039c4739G4109b07597B47754A12458l4588a13350c422j39385
11421a42807j10979H019h3403B9784a4193A72721N8232C8836j960b76428d5993
11409f5992H4332A6603b68273C17647a42860F8109P8530a49666C1653K37018j05958
11398A62713o1069g9629J8624B08970g4629B75128A0881d7476A78793J34100b65134
11386B84b98753h9959B80558b49831i9358B0059q452a18755a1458A89325j782
11375A87543F1548J24676a72741A33007P6717A7818J8134P3351b44513e2798j8542
$$ plain form
11364 -71340 -85943 195138 -61797 -397679 -93643 233518 -64118 21412 -121323 -67740 -57921
11353 -57921 41179 -261708 117953 -44184 42925 -259645 -176998 -196707 -138041 297737 -106922
11341 -264616 93775 289543 -203385 64321 -144728 -57045 -129373 -96812 167751 -76916 336361
11329 -92185 111097 -54235 145590 180803 -245151 -56527 209239 -260288 -91501 81384 -187852
11317 46727 -102832 19192 82028 -79480 29926 -176612 -10154 93967 -688 10828 -29105 148318
11304 -3532 26144 -125981 -46086 -388455 11347 200743 34892 2720 -110723 73666 -49388
11292 -197150 -50616 278001 18044 55845 36756 -150166 16213 55166 -84603 117001 -72411
11280 -231084 103124 -84786 21515 39638 -223032 350036 88198 16624 -164386 -3302 -159679
$$ packed form
11364g1340j4603A95138f1797l35882i3643B33518f4118B1412a21323N3583R819
11353e7921D1179b61708A17953d4184D2925b59645Q2647j9709N8666B97737a06922
11341b64616I3775J95768b03385F4321a44728e7045p2328L2561A67751g6916C36361
11329i2185A11097e4235A45590L5213b45151e6527B09239b60288i1501H1384a87852
11317D6727a02832A9192O2836g9480B9926a76612a0154I3967f88A0828b9105A48318
11304c532B6144a25981d6086l42369A1347J89396C4892B720a10723G3666d9388
11292a97150e0616B78001A8044L7801j9089a50166A6213L8953h4603A17001g2411
11280b31084A03124h4786B1515J8123b23032C50036H8198A6624a64386c302j56377
$$ plain form
11269 -159679 255738 303716 -98312 40146 73458 62582 -270220 143936 141166 -91135 -96111
11258 -96111 -122873 69294 19755 -323156 85512 257394 47890 -118275 -179383 385795 148116
11246 111016 -259378 -220638 176776 -164456 548 -436828 299760 -122380 111766 -124173
11235 -30883 -178681 -931 -154071 144098 100926 216887 255162 13046 -329386 -284 95300
11223 -206668 -53495 -224442 159570 -128736 -42644 -199027 -119359 -26883 43219 62948 -135195
11211 -88800 -72847 134140 -196142 -106965 92777 19912 -2554 380664 -29968 -50970 20573
11199 -79707 -159604 -23895 -194466 -21733 -54950 -258117 -185616 -200901 -197566 -109872 17929
11187 -209817 -393779 211200 -67856 146602 -134500 -164907 -167823 4420 176502 127442 82961
$$ packed form
11269a59679B55738M7978i8312D0146L3312j0876b70220A43936k770i1135m976
11258i6111k6762F9294A9755c23156H5512J71882D7890a18275o1108C85795A48116
11246A11016b59378L8740A76776a64456E48d36828B99760a22380A11766a24173
11235c0883j47798i31j53140A44098m3172J15961L8275A3046c29386b84I5300
11223b06668e3495j70947A59570a28736d2644j56383P9668b6883D3219J9729a35195
11211h8800J5953A34140a96142Q9177I2777A9912b554C80664b9968k1002B0573
11199g9707p9897b3895j70571b1733l3217k03167P2501j5285L335Q7694A7929
11187b09817j83962B11200f7856A46602a34500l0407k916D420J72082m9060m4481
$$ plain form
11176 82961 479477 63336 29337 -235689 440242 60326 279231 -273086 -232267 218088
11165 60138 229246 -12623 67238 168989 -100242 -94779 -131180 77833 295783 84375 98046
11154 98046 -370283 -109541 140339 78124 -99757 -257391 -11498 -213555 -32414 -49195 139415
11142 -118767 67710 153727 89904 256666 -224780 -333449 245740 -181199 302046 -153584
11131 19021 21062 -236000 158794 313303 66636 -118191 121513 53213 324568 272508 -8095
11119 -212056 -155444 94492 68321 102097 159843 476563 178916 -73603 -256596 -237940 55070
11107 -11400 -31330 -15302 178324 -58319 -92765 481190 -23043 228650 205675 20086 88622
11096 88622 349063 433714 59957 188671 416520 213563 -95756 149580 -123787 168861
$$ packed form
11176H2961L96516F3336B9337b35689D40242F0326K18905b73086M0819B18088
11165F0138J69108a2623F7238J01751a00242N463l6401G7833K17950H4375J3671
11154I8046c70283a09541A40339o2215i9757j57634a1498k02057c2414j6781A39415
11142a18767F7710Q6017o3823J66762b24780j08669B45740a81199C02046a53584
11131A9021K041b36000A58794J54509F6636a18191A21513E3213K71355n2060h095
11119b12056N6612I4492k6171L3776N7746L16720A78916g3603j82993J8656E5070
11107a1400j9930a5302A78324e8319l4446D81190b3043B28650k2975B0086O8536
11096H8622K60441Q4651E9957J28714K27849k02957i5756A49580a23787A68861
$$ plain form
11085 -96350 -164122 348172 60814 371107 173942 328509 132176 116418 251224 61726
11074 24010 121377 507433 459944 462635 491213 137467 148295 189876 628133 458562 226658
11062 559903 447330 457775 492870 397880 363494 497280 525256 698647 488697 685504
11052 685504 1074811 513895 790123 761993 682268 887997 845876 966294 611470 757637
11042 757637 703610 1005248 679185 710338 707252 774055 653728 905105 833124 928362 862544
11031 862544 659287 408717 766842 784321 575880 1003621 1088229 585319 872549 627004
11021 627004 524494 661618 521668 526982 599482 601588 528005 369691 515627 645538 398708
11010 398708 540271 578662 693205 782849 458043 738641 811093 527830 440208 531009
$$ packed form
11085i6350o7772C48172F0814L10293A73942J54567A32176j5758J34806F1726
11074B4010R7367L86056m7489K691K8578A37467J0828M1581M38257j69571B26658
11062E59903j12573J0445L5095r4990l4386J33786K7976J73391k09950J96807
11052F85504L89307E13895K76228k8130p9725K05729m2121J20418l54824J46167
11042G57637n4027L01638l26063L1153l086O6803j20327K51377p1981R5238o5818
11031H62544k03257k50570L58125J7479k08441M27741Q4608n02910K87230k45545
11021F27004j02510J37124j39950N314P2500K106p3583j58314J45936J29911k46830
11010C98708J41563L8391J14543Q9644l24806K80598P2452k83263q7622R0801
$$ plain form
11000 531009 620864 564519 891455 843128 604728 754126 1032144 629764 536263 537868 477531
10989 477531 898175 950396 860862 1045253 986307 1007237 864054 1114600 934131 1390795
10979 1390795 1343432 1359896 1548821 2034776 2201619 2461007 2664087 2969519 2929454 2874909
10969 2874909 2888979 2690116 2479347 2349483 2096648 1621595 1318606 1546397 1699242 1640812
10959 1640812 1628364 1654297 1752696 1503127 1580084 1366684 1241179 803052 978645 857003
10949 857003 784338 413808 576354 580796 339592 671548 188728 46342 283599 92024
10938 81558 -233334 11999 162927 8746 127876 255134 274247 -149760 71789 20420 -39020
10926 -37818 129985 346318 147378 67560 172071 -148156 56977 -256023 -64639 -121021
$$ packed form
11000E31009Q9855n6345L26936m8327k38400J49398K78018m02380r3501J605o0337
10989D77531M20644N2221q9534J84391n8946K0930j43183K50546j80469M56664
10979A390795m7363J6464J88925M85955J66843K59388K03080L05432m0065n4545
10969B874909J4070j98863k10769j29864k52835m75053l02989K27791J52845n8430
10959A640812j2448K5933R8399k49569P6957k13400j25505m38127J75593j21642
10949H57003p2665l70530J62546M442k41204L31956A88728D6342K37257I2024
10938H1558b33334A1999J50928H746J19130J27258J9113a49760G1789B0420c9020
10926c7818A29985K16333A47378F7560J04511a48156E6977b56023f4639n6382
$$ plain form
10916 -121021 304372 -114676 296140 -89913 221140 135650 -46782 133392 -44215 -53591 -152543
10905 -152543 79339 45152 23668 -187089 -48844 45066 99572 -77588 -51216 -257268 151314
10893 -101353 -219896 99414 256085 23541 143664 -162652 158509 68123 -111650 -130222
10883 -130222 348768 -96172 -31053 65378 12011 1795 46275 -252660 -188793 111266 149687
10872 149687 -30011 188745 326699 -16594 170590 179961 -277522 -357756 27053 -198475 101731
10860 195472 35827 63761 -84065 -201419 -194273 144166 -345875 -44916 -199588 -23965 91509
10848 79784 -260778 42367 -159227 47835 230448 -132210 -86781 37665 -59776 124887 -59724
10836 26902 38348 -134484 69122 -294671 -49342 345905 -21072 -30750 180507 -171522 160939
$$ packed form
10916a21021C04372a14676B96140h9913B21140q5490d6782A33392d4215r376r8952
10905a52543G9339l4187k1484a87089d8844D5066N4506g7588K6372k06052A51314
10893a01353j18543I9414J56671B3541J20123a62652A58509F8123a11650j8572
10883a30222C48768i6172c1053F5378A2011A795M4480b52660O3867A11266L8421
10872A49687c0011A88745J37954a6594A70590R371b77522q0234B7053a98475A01731
10860A95472C5827K7934h4065j17354P146A44166c45875d4916j54672b3965I1509
10848G9784b60778D2367a59227D7835J82613a32210M5429C7665e9776A24887e9724
10836B6902J1446a34484F9122b94671d9342C45905b1072r678A80507a71522A60939
$$ plain form
10824 -220273 -109386 -333229 -85892 -114346 165426 -160363 -234444 74374 164160 -20658 100266
10812 -96768 -237112 -105996 264833 282507 85492 -192852 17529 -10957 -125206 61211 -103115
10800 -295130 -49860 155040 -263383 103863 29407 68557 -107852 56984 71132 14472 -33860
10788 -190142 -346866 112896 -21056 -131421 43108 281406 71393 -69349 -130328 -264682
10778 -264682 405788 -192837 148958 -3284 21579 -169048 214434 -69102 108361 147532
10768 147532 -358417 38032 122267 134167 -123749 -14288 -326278 19270 -156895 -64550 -13632
10756 -59435 8714 -264870 74654 -306386 -210177 99989 -257101 65441 -238349 -79942 100209
10744 73990 188901 -177601 273915 275288 -180220 35968 71023 -108053 130547 -72827 -297366
$$ packed form
10824b20273a09386k23843h5892k8454A65426a60363p4081G4374Q9786b0658A00266
10812i6768j40344a05996B64833J7674H5492a92852A7529a0957j14249F1211a03115
10800b95130d9860A55040b63383A03863B9407L9150a07852E6984J4148A4472c3860
10788a90142j56724A12896b1056j10365D3108K38298G1393f9349o0979j34354
10778b64682D05788a92837A48958c284B1579a69048B14434f9102A08361L9171
10768A47532c58417C8032Q4235J1900a23749a4288l11990A9270a56895f4550a3632
10756e9435H714b64870G4654c06386R6209I9989b57101F5441b38349g9942A00209
10744G3990J14911a77601B73915J373a80220C5968L5055a08053A30547g2827k24539
$$ plain form
10733 -297366 -193869 -11147 44221 32976 204476 5006 172813 -60624 22533 -104911 -98948
10722 -98948 45632 -23784 -222599 28762 20869 70290 -223867 -104766 248686 -12197 -88885
10711 -88885 366236 14226 83180 175185 -176122 -125831 -104673 261603 237503 -23640 261590
10699 -366960 50927 223052 -220410 257763 86206 6780 -244455 302116 213196 -192423
10688 -88520 -288010 -1097 -153061 -247416 -18513 -60636 -198422 209700 50373 -286218 266953
10676 -158833 -233365 -233353 -255185 -74914 -169599 -101050 -225619 -145126 45671 -11162 -104730 -43414
10663 -90893 -158799 362870 -116043 -221040 4759 -239338 -222340 -125384 161004 -302411 161396
10651 -135444 -63450 137114 -449394 -109541 -170895 14087 -139172 48494 353771 -126044
$$ packed form
10733b97366J03497a1147D4221j1245J71500E006J67807f0624B2533a04911N963
10722i8948D5632b3784j98815B8762p893M9421b23867a04766B48686a2197p6688
10711h8885C66236A4226O8954R2005a76122N0291K1158B61603k4100b3640B61590
10699c66960E0927J72125b20410B57763H6206F780b44455C02116q8920a92423
10688h8520j99490a097j51964r4355a8513m2123j37786B09700E0373b86218B66953
10676a58833p4532J2k1832g4914r4685O8549j24569Q0493D5671a1162r3568d3414
10663i0893o7906C62870a16043j04997D759b39338J6998R6956A61004c02411A61396
10651a35444f3450A37114d49394a09541o1354A4087a39172D8494L05277a26044
$$ plain form
10640 -130971 151476 -294241 28230 -188296 186257 -1274 -261177 254908 -24463 181995
10629 -193948 -19788 141271 17559 12888 -188436 -81722 42476 -202959 -39818 -242640 297098
10617 99535 -9659 -223383 -287157 -38971 25549 125456 -251049 -243755 29000 132101 196448
10606 196448 235392 -189229 89755 86045 -139478 -66402 -48137 201286 -156564 343550 -175956
10594 -88608 127097 -23449 195946 -128631 -37439 -156293 152802 -58362 268389 -77130
10583 -241812 -58609 -123277 -254439 -85106 99309 60724 -23426 -97341 -149633 -35366 -18800
10572 -18800 78942 169961 -60422 45193 -259426 -182647 -409861 -93678 38634 -146738 -42130
10560 -342881 49616 -239417 -227265 -273859 27922 -105864 -14501 53582 411646 195141 90632
$$ packed form
10640a30971A51476b94241B8230a88296A86257a274k59903B54908b4463A81995
10629a93948a9788A41271A7559m671a88436h1722D2476b02959c9818k02822B97098
10617I9535i659k13724o3774c8971B5549R9907b51049P294B9000J03101O4347
10606A96448L8944a89229H9755l710a39478f6402J8265B01286a56564C43550a75956
10594h8608A27097b3449A95946a28631c7439j18854A52802e8362B68389g7130
10583b41812e8609o4668j31162h5106I9309l8585b3426p3915n2292c5366J6566
10572a8800G8942R1019f0422D5193b59426P6779k27214i3678C8634a46738d2130
10560c42881D9616b39417J2152m6594B7922a05864a4501E3582L58064A95141I0632
$$ plain form
10548 -21821 -137938 70920 -5398 -286437 -191146 -59523 13901 -15292 -122264 -241577 -125632
10537 -125632 -65831 -178291 317117 -190647 -6929 -448995 203860 -31868 9731 -61647 -62048
10526 -62048 -55252 341923 -231651 198936 134763 -551 16989 18665 -146953 111965 -162272
10514 -95321 23741 -183527 41218 59107 80345 -125539 -218333 -444009 41928 -94319 -278829
10503 -278829 422714 -85340 177234 -237263 -10102 179967 193034 595 -217619 189105 27633
10491 -97331 -139696 -147417 165935 49007 177477 7162 103346 -56694 102589 -56262 230521
10479 314966 410775 220398 -72839 258992 -340602 185690 146165 -94461 168219 -84637
10468 34213 -208467 82791 -320087 -71888 37560 55132 389791 -305666 29302 -11131 88440
$$ packed form
10548b1821j16117G0920e398k81039R5291e9523A3901a5292j06972j19313J15945
10537a25632N9801j12460C17117a90647f929m42066B03860c1868I731f1647m01
10526f2048O796C41923b31651A98936o4173e51A6989J676a46953A11965a62272
10514i5321B3741a83527D1218J7889K1238a25539r2794k25676D1928i4319j84510
10503b78829D22714h5340A77234b37263a0102A79967J3067E95b17619A89105B7633
10491i7331m2365p721A65935D9007J28470G162R6184e6694A02589e6262B30521
10479C14966R5809j90377g2839B58992c40602A85690l9525i4461A68219h4637
10468C4213b08467H2791c20087g1888C7560J7572L34659c05666B9302a1131H8440
$$ plain form
10456 -33561 73535 177413 243054 -69201 46169 -145599 -75167 -85216 -57673 -260996 -57354
10444 -17760 -150170 -70273 105612 -25309 -269271 96996 325800 51805 10500 40763 -33324
10432 -120525 197553 77572 -110794 70128 -169190 99399 -271851 -91739 57878 5050 -120651
10420 -70473 16345 -112999 -216412 -182024 -94209 -104220 -74784 342549 53457 61909 83345
10409 83345 -213635 228289 -58339 -14098 -10653 103927 180073 89736 2687 -143116 -40166
10397 -131719 -132477 160686 202417 96318 107037 -83366 232854 17666 388967 45456 63424
10386 63424 295551 47923 260265 -76115 108052 -92657 -4984 83278 380565 692614 101560
10374 192948 71271 125194 171851 329544 529047 305147 296622 550260 427143 454526 267957
$$ packed form
10456c3561G3535J03878O5641f9201D6169a45599P0432j0049K7543k03323e7354
10444a7760j32410g0273A05612b5309k43962I6996K28804E1805A0500L0263c3324
10432a20525A97553G7572a10794G0128a69190I9399b71851i1739E7878E050a20651
10420g0473A6345a12999j03413L4388Q7815j0011K9436C42549E3457Q452K1436
10409H3345b13635B28289e8339a4098L445A03927P6146H9736B687a43116d0166
10397a31719p58A60686M1731I6318J0719h3366B32854A7666L71301D5456J7968
10386F3424K32127D7923K12342g6115A08052i2657d984H3278K97287L12049A01560
10374A92948G1271N3923M6657J57693J99503k23900q525K53638j23117K7383j86569
$$ plain form
10363 267957 162749 261935 177322 464862 451951 105065 74616 262751 127799 451010
10353 451010 408432 94724 606089 650193 451841 382552 374209 291946 338023 92412 600096
10342 600096 103103 434294 185572 313515 578832 -79157 -10952 205788 192407 221377
10332 221377 150351 16379 -33212 208875 -62578 32067 -233016 2422 -70691 194134 175719
10321 175719 360353 -122036 582125 129420 -51125 344776 59494 395844 -129259 70510
10310 14823 157209 -8212 104270 48355 -339269 501465 126634 -130634 -159761 -70338 37227
10298 -48290 -248518 65459 302735 -206764 -35716 142156 28677 -192725 -168905 122977
10287 45837 368054 -23707 -76232 180188 -44725 -82229 83708 29175 -413566 103370 -159634
$$ packed form
10363B67957j05208R9186q4613K87540j2911A05065l0449J88135A27799L23211
10353D51010m2578I4724N11365M4104j98352o9289q343q2263M6077I2412N07684
10342F00096A03103L31191A85572J27943K65317g9157a0952B05788j3381K8970
10332B21377p1026A6379c3212B08875f2578C2067b33016B422g0691A94134j8415
10321A75719J84634a22036E82125A29420e1125C44776E9494L36350a29259G0510
10310A4823J42386h212A04270D8355c39269E01465A26634a30634k9127g0338C7227
10298d8290k00228F5459K37276b06764c5716A42156B8677a92725K3820A22977
10287D5837L22217b3707n2525A80188d4725l7504H3708B9175d13566A03370a59634
$$ plain form
10275 -445263 52206 72279 105340 -132112 -356955 -171947 -128667 -183373 -22725 29630 -61238
10263 -73003 118815 245723 133490 -165191 113095 -4232 156363 15861 295577 138847
10252 72987 -96450 124794 68303 -147806 -146054 -207538 -48595 -209070 -131973 -1932 131922
10240 -29322 -16084 60440 -322755 -196497 -191117 160573 165278 33051 230847 -46422 -207112
10229 -207112 292302 -9190 77931 87436 -13855 -125421 -202121 60616 56238 39825 -321192
10217 -315042 165711 54127 79905 128635 -150195 -31692 -97164 -142323 -310703 124909 -290937
10205 204797 -65485 -141984 -96603 -238644 -99111 -130815 -402932 -197511 103710 171428 56219
10193 147103 -183762 -182286 84128 -135531 -155129 -279049 -286754 -130735 51123 -194767 -152952
$$ packed form
10275d45263E2206K0073L3061a32112k24843a71947M3280n4706b2725B9630f1238
10263g3003A18815J26908j12233a65191A13095d232A56363A5861K79716A38847
10252G2987i6450A24794n6491a47806J752o1484d8595j60475P7097a932A31922
10240b9322J3238F0440c22755J26258N380A60573M705C3051J97796d6422j60690
10229b07112B92302i190G7931R505a3855j11566p6700F0616m378j6413c21192
10217c15042A65711E4127K5778M8730a50195c1692o5472m5159j68380A24909b90937
10205B04797f5485p6499M5381j42041i9111l1704k72117a97511A03710O7718E6219
10193A47103a83762J476H4128a35531j9598j23920p705a30735E1123a94767M1815
$$ plain form
10182 -152952 -60945 -103106 68614 -240144 -101987 98701 127010 -147482 135669 61241 13992
10170 -100404 -36256 -44161 -328907 -82589 16246 -11696 9340 69740 -110538 37163 -138467
10158 -179004 -153810 -225411 -142378 -22542 -36658 101801 240312 26368 221253 -255558 -136731
10147 -136731 -244808 -33123 -268233 -144101 108169 -121762 -221031 351246 -223319 247860
10136 122782 56619 44324 -201708 -305781 28089 -84107 229070 1934 119942 -189181 -171830
10125 -171830 -111152 -203888 -222309 -122892 20861 -171046 -220164 -182924 -70334 -124620 97658
10113 -16016 179179 -306104 -97243 -40951 17161 -54637 -286612 -170925 -371003 -38978 -112620
10102 -112620 -342593 46542 -266228 -70423 171626 -127758 231749 -25291 -45968 210362
$$ packed form
10182a52952f0945m2161F8614b40144a01987I8701K8309a47482A35669F1241A3992
10170a00404c6256p905k84746h2589A6246a1696I340O0400a10538C7163a38467
10158a79004K5194p1601Q3033b2542j4116A01801J38511B6368J94885b55558J18827
10147a36731j08077c3123k35110J24132A08169a21762r9269C51246b23319B47860
10136A22782E6619j2295b01708j04073B8089h4107B29070A934J18008a89181J7351
10125a71830O0678r2736j8421R9417B0861a71046m9118L7240g0334n4286I7658
10113a6016A79179c06104i7243d0951A7161e4637k31975J15687k00078c8978p3642
10102a12620k29973D6542b66228g0423A71626a27758B31749b5291k0677B10362
$$ plain form
10091 -195044 -35554 208958 110190 328007 193821 -158853 -195240 -43677 -29843 -261169
10081 -261169 -35605 51991 3381 -132537 -233858 -115250 102337 -174568 -189712 37257 48025
10070 48025 200135 -129259 -200830 41686 -252033 -23497 -129916 -61749 -121452 106539 -90974
10058 -38438 -326647 145686 -31395 249642 -29406 -35911 -149053 -57603 155879 -382939 53655
10046 146019 -176694 12862 -130485 -254934 -53788 121206 115092 -129695 144817 134501
10036 134501 295399 161773 44080 -341315 -96654 -212382 80159 54156 -17904 308429
10025 -324925 -215068 -173998 -10025 291431 -253277 -120294 -107560 -248820 285426 364944
10015 364944 85516 12895 -68426 53101 -45555 -343446 87075 -159474 50303 -103908 -21020
$$ packed form
10091a95044c5554B08958r8768K17817j34186a58853l6387d3677J3834k31326
10081b61169c5605E1991C381a32537j01321a15250A02337a74568j5144C7257J0768
10070D8025J52110a29259p1571D1686b52033b3497j06419f1749n9703A06539i0974
10058c8438k88209A45686c1395B49642b9406o505j13142e7603A55879c82939E3655
10046A46019a76694A2862a30485j24449e3788A21206o114a29695A44817j0316
10036A34501J60898j33626D4080c41315i6654j15728H0159k6003a7904C08429
10025c24925J09857M1070a0025B91431b53277a20294J2734j41260B85426P9518
10015C64944H5516A2895f8426E3101d5555k97891H7075a59474E0303a03908b1020
$$ plain form
10003 -131947 7552 -4512 -45206 125238 239978 -10553 -69076 -163482 -350143 129073 -408612
9991 -136491 -105016 -85382 -50631 17812 210220 -68037 263782 221633 -35286 13050 32535
9980 32535 -360771 -231939 223301 -143247 -163474 -170548 -101006 -308613 52544 -77193 78526
9968 103017 60261 -199550 -414642 56144 132267 -328080 52785 -27674 186056 -25512 -28116
9957 -28116 -124561 -271681 -148923 -113461 -134669 37080 -187421 -26954 35817 -114739 -231728
9946 -231728 -344922 -198702 205710 129253 255098 252482 -156747 -331208 -177459 -126581
9936 -126581 101891 169287 -36014 -245119 -13739 214862 -220922 -9398 171764 -241860 -249458
9925 -249458 -381671 -73158 -173578 84620 -47532 145464 -148506 141757 -110430 -32043
$$ packed form
10003a31947G552d512m0694A25238J14740a0553n8523r4406j86661A29073d08612
9991a36491L1475J9634L4751A7812J92408f8037B63782m2149c5286A3050J9485
9980C2535c60771J28832B23301a43247k0227p074O9542k07607E2544g7193G8526
9968A03017m2756a99550k15092E6144P6123c28080E2785b7674A86056b5512k604
9957b8116r6445j47120J22758L5462k1208C7080a87421b6954C5817a14739j16989
9946b31728j13194J46220B05710p6457J25845k616a56747j74461J53749N0878
9936a26581A01891O7396c6014k09105a3739B14862b20922i398A71764b41860p598
9925b49458j32213g3158j00420H4620d7532A45464a48506A41757a10430c2043
$$ plain form
9914 210612 -187161 -57793 -125424 -379525 -202358 45248 -93277 -45586 43550 -97274 -8009
9902 -302583 -310288 -45738 23669 -76998 97752 -305801 -240315 -249817 -155576 -119145 -163617 -145612
9890 -145612 -217604 78976 -110832 -18223 -24984 -74939 -12026 -164806 -178999 -126110 -271984
9879 -271984 -312071 189618 281809 -194023 -52654 -184928 -13885 234281 -257599 -157477
9869 -157477 -525382 -99321 -199648 -218977 247523 37220 -287872 -94738 51169 142368 -249824
9857 -113912 -16977 -107710 2489 47775 -74047 -123194 229197 -98439 -284214 -403428 23470
9845 107789 -178950 -217407 -171910 -118908 -173410 -11634 -483711 -162858 -93982 141371 67769
9833 -14191 -95492 -407855 -222921 -32247 -292352 -176435 141606 -174394 20141 -43947 -415287
$$ packed form
9914B10612a87161e7793o7631k54101J77167D5248i3277d5586D3550i7274h009
9902c02583p705d5738B3669g6998I7752c05801O5486r502R4241L6431m4472J8005
9890a45612p1992G8976a10832a8223o761m9955a2026j52780j4193N2889j45874
9879b71984m0087A89618R2191a94023e2654j32274a3885B34281b57599J00122
9869a57477l67905i9321j00327j9329B47523C7220b87872i4738E1169R1199b49824
9857a13912a6977r0733B489M5286g4047m9147B29197i8439j85775j19214B3470
9845A07789a78950l8457M5497N3002n4502a1634m72077a62858O8876A41371F7769
9833a4191q1301l12363J84934c2247k60105J15917A41606a74394B0141d3947l71340
$$ plain form
9822 -415287 -245666 -168460 49818 -39046 -71924 -204173 28897 -164027 104367 -211133 226739
9810 -191368 -4846 -72472 154593 -215548 153338 145265 23809 -344704 -268027 42819 225297
9799 225297 183684 68930 -138161 -113058 -260591 39841 257487 263849 -203454 -200426 148138
9787 -28590 9462 -24832 -327569 -107528 15510 -331305 57601 82696 116262 -252207 -53942
9775 123501 9693 -71593 -87273 -160277 357841 39558 -312739 42037 -378184 -219634 46529
9763 -258031 -129868 -376665 -335136 84255 -21460 -292867 14428 -237757 16391 -170954 -217746
9752 -217746 119866 -82268 186729 -96021 -271941 -118635 253144 416718 25745 40311
9742 40311 298162 -299073 13374 37226 176555 57199 187614 40543 199719 -120773 94940
$$ packed form
9822d15287J69621P7206D9818c9046l2878j32249B8897a64027A04367b11133B26739
9810a91368d846o7626A54593b15548A53338q073B3809c44704P6677D2819J82478
9799B25297m1613F8930a38161K5103j47533C9841K17646O362b03454L028A48138
9787b8590I462b4832l02737a07528A5510c31305E7601K5095L3566b52207e3942
9775A23501I693g1593j5680p3004C57841C9558c12739D2037c78184J58550D6529
9763b58031J28163k46797M1529H4255b1460k71407A4428b37757A6391a70954m6792
9752b17746A19866h2268A86729i6021j75920a18635B53144J63574B5745J4566
9742D0311K57851b99073A3374K3852J39329E7199J30415D0543J59176a20773I4940
$$ plain form
9730 59805 79275 249111 -60702 -184332 -289655 10424 2394 27120 282080 -55112 -35186
9719 -35186 -177719 -463103 -80043 -37981 49628 -296167 -88500 197405 -16172 75361 242080
9708 242080 -129942 -190625 -183641 -238090 -56725 -315341 -154867 -18550 -273144 -65316 -64486
9697 -64486 -171448 67221 -304771 65437 -8539 -274014 215747 141143 70185 -44686 -11203
9685 -135980 -164502 -198043 7903 32447 -168832 184861 -14366 7839 -154747 122376 63901
9674 63901 -477512 310899 -34469 -367237 218748 -172162 263017 79150 -78377 -8737 -184160
9663 -184160 -81437 -25420 -193524 196821 -119634 -95993 9474 -223400 -153744 180640 -102870
9651 -68934 -277726 -186674 -160328 97821 190666 -155093 49379 -241148 51652 -72340 -399260
$$ packed form
9730E9805J9470J69836f0702j23630j05323A0424B394K4726K54960e5112J9926
9719c5186j42533k85384h0043c7981D9628b96167h8500A97405a6172G5361J66719
9708B42080a29942o0683O984n4449e6725k58616a54867a8550k54594f5316Q30
9697f4486j06962F7221c04771F5437h539k65475B15747p4604G0185d4686a1203
9685a35980k8522l3541G903K4544a68832A84861a4366G839a54747A22376n8475
9674F3901d77512C10899c4469l32768B18748a72162B63017G9150g8377h737j75423
9663a84160h1437b5420j68104A96821a19634K3641I474b23400O9656A80640a02870
9651f8934k08792R1052K6346I7821R2845a55093D9379b41148E1652g2340l26920
$$ plain form
9640 -399260 -165265 -70925 57897 -31312 -161247 5978 -310789 -416423 -21069 227165 -156123
9628 -657479 55992 -287869 87323 -257503 75022 -48280 -172934 -176855 -287039 99682 71689
9617 71689 -175682 -10810 206841 -204036 -416110 19097 -21150 -46593 -292080 -12586 146305
9605 46594 282001 -147328 -77636 -111899 9631 65414 104764 -81199 -48484 69368 -314812
9593 -244559 77391 -65977 -27680 29843 -6455 292 -194954 -94553 -12003 42363 99039 28350
9580 42166 -218091 76122 -90268 -122324 94888 -69535 -147999 -187726 -207453 -309188 -96499
9568 -90824 -286579 -12909 146091 -187173 -24827 271807 61766 -133941 43548 52905 148736
9557 148736 -283420 -168488 -1830 113195 6468 177346 -170654 187132 -36914 -153363 98285
$$ packed form
9640c99260a65265g0925E7897c1312j29935E978c10789j05634b1069B27165a56123
9628f57479E5992b87869H7323b57503G5022d8280j24654l921j10184I9682k7993
9617G1689a75682a0810B06841b04036k12074A9097b1150k5443k45487a2586A46305
9605D6594K35407a47328O9692l4263I631N5783L9350h1199L2715F9368c14812
9593b44559G7391f5977b7680B9843f455B92a94954i4553a2003D2363N6676B8350
9580D2166b18091G6122i0268l2056I4888f9535p8464l9727j9727j01735i6499
9568i0824j95755a2909A46091a87173b4827B71807F1766a33941D3548R357R5831
9557A48736b83420J14932a830A13195F468J70878a70654A87132c6914j16449I8285
$$ plain form
9545 -177891 -128064 126936 342361 -563187 101265 257563 -108656 -8853 185616 -258082
9534 -31302 -8637 -63178 33872 -59285 -115067 -1166 71094 -155688 2879 -233989 -306081 -126660
9521 48080 112377 -556961 192269 -254 -88321 -60215 -34731 184990 -58232 -409118 148410
9509 25629 -118362 -175665 -259378 17466 200186 -98698 -396100 -138975 -56270 127869 23677
9497 -34185 2214 -341433 141077 -35805 -235417 103168 -203196 -431603 -281728 120938
9486 -278450 -123494 -12497 -85900 -82670 -79726 -128374 127836 -117172 -213355 -229584 109414
9474 -98472 55115 -174255 -73408 185273 247627 -239507 -35908 137507 163014 -323973 -363968
9463 -363968 -60744 -49565 106961 -178953 169436 130011 205127 -101981 -265398 -130323
$$ packed form
9545a77891M9827A26936K15425e63187A01265J56298a08656h853A85616b58082
9534c1302h637n4541C3872e9285n5782a166G1094a55688B879b33989p2092a26660
9521D8080O4297e56961A92269b54q8067K8106K5484A84990e8232l50886A48410
9509B5629a18362n7303q3713A7466J82720i8698k97402a38975e6270A27869B3677
9497c4185B214c41433A41077c5805j99612A03168b03196k28407J49875A20938
9486b78450a23494a2497p3403L230K944m8648A27836a17172r6183j6229A09414
9474i8472E5115a74255g3408A85273O2354b39507c5908A37507K5507c23973l9995
9463c63968f0744J1179A06961a78953A69436l9425P5116a01981j63417a30323
$$ plain form
9452 -130062 -125538 185829 -36361 -30600 -40416 -106325 10942 -108321 15988 157967 -126869
9440 383285 -84224 -18422 -162495 125258 -188123 40598 83097 125703 -334263 -229564 -115288
9429 -115288 -34512 8169 -236654 -165553 70948 81955 -356014 36220 -243839 123315 111738
9418 111738 -372503 85818 202920 -97640 -137831 -63031 -85063 -107938 -278570 -13348 -45887
9407 -45887 137962 122868 -181022 -82006 -295006 -82615 -138339 224374 -319972 -123608 103475
9395 -273568 -96349 -238375 96358 -14688 -89844 -149511 -283422 198 73113 4159 85781 -196684
9382 -138026 -139703 -124755 109273 -210125 -2440 81177 -218702 -324522 -148005 -140156 32102
9370 -52848 -69036 -299048 -157107 -100891 -31822 -109857 -239750 -261849 -19836 -277107 -363867
$$ packed form
9452a30062M524A85829c6361N761r816o5909A0942a08321A5988J41979a26869
9440C83285h4224a8422j44073A25258a88123D0598M2499M2606c34263J04699J14276
9429a15288c4512H169b36654P1101G0948J1007c56014C6220b43839A23315j1577
9418A11738c72503H5818J17102i7640m0191f3031k2032k2875j70632a3348l2539
9407d5887A37962j5094a81022h2006k13000h2615n5724B24374c19972a23608A03475
9395b73568i6349j42026I6358a4688p5156n9667j33911A98P2915D159Q1622a96684
9382a38026j677J4948A09273b10125b440H1177b18702j05820a48005P849C2102
9370e2848j6188k30012J41941N6216c1822p8035j29893k2099a9836k57271q6760
$$ plain form
9359 -363867 95645 50806 -360856 -49448 -37233 -59432 -143253 -66941 -170007 191338 205178
9348 205178 -161938 95503 4081 -257996 -198552 -178544 -189546 336937 -92688 81197 -233795
9336 99358 -63163 -168030 -531594 -238705 -121650 -184231 -13111 -197436 182029 210603 -59395
9324 -29296 90837 -222265 -440955 -17404 -52487 -117690 -329386 -130266 -7789 -119798 -199454
9313 -199454 281659 114045 -211195 -68792 89720 -236862 -155973 137921 229186 -123677
9302 184368 -88466 231943 -10196 -74586 -298613 -267471 -96072 7897 -119423 149306 -75588
9290 299566 524 -132680 73880 -142635 11384 81574 13771 -56061 -119159 -55456 -26990 201278
9277 86853 106093 -8750 -515673 -210286 -27891 20043 -518908 -231856 42388 29578 -148781
$$ packed form
9359c63867I5645m4839c60856d9448J2215k2199q3821f6941j03066A91338J3840
9348B05178a61938I5503D081b57996N9444K0008j1002C36937i2688H1197b33795
9336I9358f3163j04867l63564b38705J17055o2581a3111j84325A82029K8574e9395
9324b9296I0837b22265k18690a7404l5083o5203k11696a30266g789j12009p9656
9313a99454B81659A14045b11195f8792H9720b36862Q0889A37921R1265a23677
9302A84368h8466B31943a0196o4390k24027L1142i6072G897a19423A49306g5588
9290B99566E24a32680G3880a42635A1384P0190A3771e6061o3098e5456b6990B01278
9277H6853J9240h750n06923b10286b7891B0043e18908b31856D2388j2810a48781
$$ plain form
9265 -125470 51953 206307 -165022 -30080 -64262 -104169 -406554 -305794 -289399 -13910 -211264
9254 -211264 257711 212933 167648 8099 125905 -19408 18061 -330021 -265121 244841 138109
9243 138109 -45418 204777 249380 38994 112599 -202237 -114306 -322469 89700 -19571 91736
9231 250728 -47272 -15089 -237080 310696 -171514 103595 -286016 280874 93016 143349
9221 143349 -258496 -255258 -236466 146536 -196914 -165585 103265 127199 -39198 -106425 -37066
9209 68728 5245 41047 87807 -256121 155358 126670 -98550 -2195 246739 80524 95015 -133441
9196 -487215 33887 36288 -107672 -203975 131674 198785 -47409 99453 -200020 -79247 -189476
9185 -189476 119982 203691 199391 -118530 -59201 46620 -24056 188524 75805 29419 -32223
$$ packed form
9265a25470E1953J54354a65022c0080l4182l9907l02385J00760J6395a3910j97354
9254b11264B57711m4778m5285H099J17806a9408A8061c30021O4900B44841j06732
9243A38109d5418B04777M4603C8994P3605b02237Q7931k08163H9700a9571I1736
9231B50728d7272a5089k21991C10696a71514A03595b86016B80874I3016N0333
9221A43349b58496L238J8792A46536a96914L1329A03265K3934c9198o7227c7066
9209F8728E245L5802M6760b56121A55358k8688i8550b195B46739H0524J4491a33441
9196d87215C3887K401a07672r6303A31674O7111d7409I9453b00020g9247j10229
9185a89476A19982Q3709m300a18530e9201D6620b4056A88524G5805B9419c2223
$$ plain form
9173 -227590 -374783 -128649 10452 227424 38309 -217285 -162230 12415 -111130 -103564 117515
9161 21841 -62864 -511259 169432 -251706 -68915 -63847 -10378 -142874 138273 -193794 -122804
9150 -122804 -25446 -185589 -1539 54364 -40822 -137906 -247993 197209 -36992 -276604 -49296
9138 -17671 62268 -395842 -17950 -306639 -147346 36186 258004 -42410 74366 -382761 229794
9126 -172092 -163441 -201486 -236115 -124108 -120094 133303 66037 40041 -65000 36255 -204860
9114 134880 -413313 282343 -162281 48068 7707 -145253 -166127 21068 -201729 -321241 39279
9102 -286187 166421 -8476 53094 -154904 -76341 320003 -79545 247878 -394381 -130888 -10960
9090 74220 -203004 -73762 235167 -233077 -58966 -475633 38753 -167431 -186948 2042 -414396
$$ packed form
9173b27590j47193a28649A0452K16972C8309b17285N5055A2415a11130P566A17515
9161B1841f2864m48395A69432b51706f8915N068a0378j32496A38273a93794P0990
9150a22804b5446j60143a539E4364d0822r7084j10087A97209c6992k39612d9296
9138a7671F2268c95842a7950k88689a47346C6186K21818d2410G4366c82761B29794
9126a72092Q651l8045l4629J12007M014A33303F6037k5996f5000C6255b04860
9114A34880d13313B82343a62281D8068G707a45253k0874B1068b01729j19512C9279
9102b86187A66421h476E3094a54904g6341C20003g9545B47878c94381a30888a0960
9090G4220b03004g3762B35167b33077e8966m16667C8753a67431j9517B042d14396
$$ plain form
9078 66311 166880 -315816 -437096 46406 -153360 -183077 -92356 -3352 -84263 171279 -119111
9066 -47458 -17443 -59507 170543 61580 108140 128798 -29598 1078 195568 -236107 -139619
9055 -139619 165113 -187912 2365 64245 -50056 46762 -174167 134031 203065 -72769 20098
9043 124670 26417 -40134 -71552 -187417 -79455 -104610 -317306 -171420 106397 160079 22608
9031 -110314 73249 8283 -214401 28669 37759 -251868 37677 -24387 -279119 116176 -380503
9019 7920 170959 157385 -310833 153856 165882 -295178 67234 232090 -112305 -178920 214192
9007 -71699 155174 -81141 -34144 175623 -449715 -385949 121817 -189201 -85198 78272 -147539
8995 -353760 -191614 42071 66938 -65895 125832 22997 -71999 -187695 20193 -112586 -271215
$$ packed form
9078F6311J00569c15816j21280D6406a53360k9717R0721c352q0911A71279a19111
9066d7458a7443m2064A70543F1580M6560K0658b9598A078J94490b36107R6488
9055a39619A65113a87912B365O1880e0056D6762a74167A34031O9034g2769B0098
9043A24670B6417d0134l1418j15865g9455k5155k12696J45886A06397N3682B2608
9031a10314G3249H283b14401B8669R090b51868C7677b4387k54732A16176c80503
9019G920J63039j3574c10833A53856J2026b95178F7234J64856a12305o6615B14192
9007g1699A55174h1141c4144A75623d49715O3766A21817a89201h5198G8272a47539
8995c53760J62146D2071K4867f5895A25832B2997g1999j15696B0193a12586j58629
$$ plain form
8984 -271215 -149910 -40649 -133013 115124 -110795 32804 -116215 -11426 -368374 -423454 18795
8972 142320 -21990 269239 -221045 10410 -254356 -117918 -90806 -31879 58359 65303 -88992
8960 -200781 -212924 -337246 338735 -10619 5988 238812 32770 -89655 -147588 -94493 -75688
8949 -75688 -225022 241576 102184 -304409 -217193 -110212 -15211 136816 -89421 40782 -122399
8937 -230415 -181713 -184653 -126495 212462 440 -82176 -80146 25717 -66408 261292 27593 -151849
8924 -211130 243867 129577 461901 630534 97351 52176 -265992 -286283 -182649 -88018
8913 121069 11602 -216871 -89267 -70166 -186339 237263 70377 -109540 -187099 -191279 159906
8901 165620 34549 51528 33604 302900 -87715 -26232 139870 -306735 -188582 96376 -57664
$$ packed form
8984b71215J21305d0649r2364A15124a10795C2804a16215a1426l56948n5080A8795
8972A42320b1990B69239b21045A0410b54356a17918K7112c1879E8359O944h8992
8960b00781j2143j24322C38735a0619E988K32824C2770h9655n7933N3095J8805
8949g5688j49334B41576A02184c04409Q7216J06981a5211A36816h9421D0782a22399
8937b30415M8702k940N8158B12462D40h2176K030B5717f6408B61292B7593a51849
8924b11130B43867j14290L32324J68633I7351m5175b65992k0291J03634h8018
8913A21069A1602b16871h9267J9101j16173B37263G0377a09540p7559m180A59906
8901A65620C4549J6979j7924K69296h7715b6232A39870c06735J18153I6376e7664
$$ plain form
8889 174667 -63381 -238151 35117 166347 -332519 -248469 43130 384315 -115117 -61335 -77301
8878 -77301 -97239 -22723 -262221 -153256 195795 328902 -242899 -257006 48124 217052 -194234
8866 -85951 -150551 -77193 -23119 -404904 20763 198966 159126 -704 126088 -68463 -77718 58506
8853 -240554 47526 10432 -71059 9276 -170441 -159867 150805 -135249 192873 -141709 -88748
8842 -88748 220206 164916 27143 61197 -164051 -213761 -72417 -125243 39064 81732 -27739
$$ packed form
8889A74667f3381j74770C5117J31230c32519Q4050D3130L41185a15117N3782j5966
8878g7301j9938b2723k39498J08965A95795J33107b42899j4107D8124J68928a94234
8866h5951o4600P3358b3119l81785B0763J78203l9840g04A26088f8463r255E8506
8853b40554D7526A0432g1059I276a70441J0574A50805a35249A92873a41709N2961
8842h8748B20206n5290B7143L4054a64051m9710g2417n2826C9064M2668b7739
$$ [...]
##END NTUPLES=NMR SPECTRUM
##END=
