##TITLE=AC1457_PAST213263_7818852_oyjx0UaAgp
##JCAMPDX= 6.0         $$ Bruker NMR JCAMP-DX V2.0
##DATA TYPE= NMR SPECTRUM
##DATA CLASS= NTUPLES
##ORIGIN= BRUKER
##OWNER= Administrator
$$ 1.72 TOPSPIN		Version 2.1
$$ 2013-04-30 20:18:14.097 -0700  Administrator@X
$$ Compression mode = diff/dup
##.OBSERVE FREQUENCY= 400.02188249412
##.OBSERVE NUCLEUS= ^1H
##.ACQUISITION MODE= SIMULTANEOUS (DQD)
##.ACQUISITION SCHEME= undefined
##.AVERAGES= 8
##.DIGITISER RES= 22
##SPECTROMETER/DATA SYSTEM= spect
##.PULSE SEQUENCE= zg30
##.SOLVENT NAME= COFFEE_meoh
##.SHIFT REFERENCE= INTERNAL, COFFEE_meoh, 1, 14.98509
##AUDIT TRAIL= $$ (NUMBER, WHEN, WHO, WHERE, PROCESS, VERSION, WHAT)
$$ ##TITLE= Audit trail, TOPSPIN		Version 2.1
$$ ##JCAMPDX= 5.01
$$ ##ORIGIN= Bruker BioSpin GmbH
$$ ##OWNER= Administrator
$$ $$ E:\/data/COFFEE/nmr/AC1457_PAST213263_7818852_oyjx0UaAgp/10/pdata/1/auditp.txt
$$ ##AUDIT TRAIL=  $$ (NUMBER, WHEN, WHO, WHERE, PROCESS, VERSION, WHAT)
(   1,<2013-04-30 20:18:07.394 -0700>,<Administrator>,<X>,<go>,<TOPSPIN 2.1>,
      <created by zg
	started at 2013-04-30 20:17:01.628 -0700,
	POWCHK enabled, PULCHK disabled,
       configuration hash MD5:
       F7 49 AB AC A2 8D 51 76 73 8D C1 9A A6 38 9F DE
       data hash MD5: 64K
       FC 15 6E 95 D3 9E 56 A0 DA 27 79 7D 68 3E 72 96>)
(   2,<2013-04-30 20:18:10.378 -0700>,<Administrator>,<X>,<proc1d>,<TOPSPIN 2.1>,
      <Start of raw data processing
       efp LB = 0 FT_mod = 6 PKNL = 1 PHC0 = 0 PHC1 = 0 SI = 32K 
       data hash MD5: 32K
       B4 79 95 3A 4B 63 77 85 73 88 5F B2 8E C2 AC 6C>)
(   3,<2013-04-30 20:18:10.675 -0700>,<Administrator>,<X>,<proc1d>,<TOPSPIN 2.1>,
      <pk PHC0 = 97.36633 PHC1 = 0 
       data hash MD5: 32K
       89 80 CE 11 50 E5 F2 FE 01 A7 6F 87 19 9F 7C 3A>)
(   4,<2013-04-30 20:18:10.831 -0700>,<Administrator>,<X>,<proc1d>,<TOPSPIN 2.1>,
      <abs ABSG = 1 
       data hash MD5: 32K
       38 9D 6C 4B 44 AD BA 71 A5 7D 96 99 38 90 56 60>)
(   5,<2013-04-30 20:18:10.878 -0700>,<Administrator>,<X>,<proc1d>,<TOPSPIN 2.1>,
      <abs ABSG = 2 
       data hash MD5: 32K
       1F 67 04 C2 11 3A 6A 6F AB F2 07 B8 01 D7 38 42>)
(   6,<2013-04-30 20:18:10.940 -0700>,<Administrator>,<X>,<proc1d>,<TOPSPIN 2.1>,
      <abs ABSG = 3 
       data hash MD5: 32K
       F9 E4 DA E2 06 F8 0B 52 E3 D1 A5 50 81 78 AD A6>)
(   7,<2013-04-30 20:18:10.987 -0700>,<Administrator>,<X>,<proc1d>,<TOPSPIN 2.1>,
      <abs ABSG = 4 
       data hash MD5: 32K
       BD 7E 01 FE 85 77 3F 63 E1 CA 5F 05 0E A2 0C 3C>)
(   8,<2013-04-30 20:18:11.050 -0700>,<Administrator>,<X>,<proc1d>,<TOPSPIN 2.1>,
      <abs ABSG = 5 
       data hash MD5: 32K
       34 FF 4E 0A AA B2 B3 58 B5 F5 5C EF A9 BA 40 15>)
$$ ##END=
$$ 
$$ $$ hash MD5
$$ $$ AA 6B 76 43 C2 D4 99 05 74 97 7F 04 C1 9D 1C E1
##$RELAX= 
##$RELAX= 
##$RELAX= 
##$RELAX= 
##$RELAX= 
##$RELAX= 
##$RELAX= 
$$ Bruker specific parameters
$$ --------------------------
##$DU= <E:\>
##$EXPNO= 10
##$NAME= <AC1457_PAST213263_7818852_oyjx0UaAgp>
$$ [...]
##$TP= (0..7)
150 150 150 150 150 150 150 150
##$TP07= 0
##$TPNAME0= <>
##$TPNAME1= <>
##$TPNAME2= <>
##$TPNAME3= <>
##$TPNAME4= <>
##$TPNAME5= <>
##$TPNAME6= <>
##$TPNAME7= <>
##$TPOAL= (0..7)
0.5 0.5 0.5 0.5 0.5 0.5 0.5 0.5
##$TPOFFS= (0..7)
0 0 0 0 0 0 0 0
##$TUNHIN= 0
##$TUNHOUT= 0
##$TUNXOUT= 0
##$USERA1= <user>
##$USERA2= <user>
##$USERA3= <user>
##$USERA4= <user>
##$USERA5= <user>
##$V9= 5
##$VALIST= <valist>
##$VCLIST= <CCCCCCCCCCCCCCC>
##$VD= 0
##$VDLIST= <DDDDDDDDDDDDDDD>
##$VPLIST= <PPPPPPPPPPPPPPP>
##$VTLIST= <TTTTTTTTTTTTTTT>
##$WBST= 1024
##$WBSW= 4
##$XGAIN= (0..3)
0 0 0 0
##$XL= 0
##$YL= 0
##$YMAX_a= 573213
##$YMIN_a= -488532
##$ZGOPTNS= <>
##$ZL1= 120
##$ZL2= 120
##$ZL3= 120
##$ZL4= 120
##$ABSF1= 14.98509
##$ABSF2= -5.573092
##$ABSG= 5
##$ABSL= 3
##$ALPHA= 0
##$AQORDER= 0
##$ASSFAC= 0
##$ASSFACI= 0
##$ASSFACX= 0
##$ASSWID= 0
##$AUNMP= <proc_prof1d_extract_pilot.lims>
##$AXLEFT= 0
##$AXNAME= <>
##$AXNUC= <1H>
##$AXRIGHT= 0
##$AXTYPE= 0
##$AXUNIT= <>
##$AZFE= 0.1
##$AZFW= 0.1
##$BCFW= 0
##$BC_mod= 0
##$BYTORDP= 0
##$COROFFS= 0
##$CY= 15
##$DATMOD= 1
##$DC= 0
##$DFILT= <>
##$DTYPP= 0
##$F1P= 0
##$F2P= 0
##$FCOR= 0.5
##$FTSIZE= 32768
##$FT_mod= 6
##$GAMMA= 0
##$GB= 0
##$INTBC= 1
##$INTSCL= 1
##$ISEN= 128
##$LB= 0
##$LEV0= 0
##$LPBIN= 0
##$MAXI= 10000
##$MC2= 0
##$MEAN= 0
##$ME_mod= 0
##$MI= 0
##$NCOEF= 0
##$NC_proc= -8
##$NLEV= 6
##$NOISF1= 0
##$NOISF2= 0
##$NSP= 0
##$NTH_PI= 0
##$NZP= 0
##$OFFSET= 14.98509
##$PC= 1
##$PHC0= 97.36633
##$PHC1= 0
##$PH_mod= 1
##$PKNL= yes
##$PPARMOD= 0
##$PPDIAG= 0
##$PPIPTYP= 0
##$PPMPNUM= 2147483647
##$PPRESOL= 1
##$PSCAL= 4
##$PSIGN= 0
##$PYNMP= <proc.py>
##$REVERSE= no
##$SF= 400.02
##$SI= 32768
##$SIGF1= 0
##$SIGF2= 0
##$SINO= 400
##$SIOLD= 32768
##$SPECTYP= <>
##$SREGLST= <1H.CDCl3>
##$SSB= 0
##$STSI= 32768
##$STSR= 0
##$SW_p= 8223.68421052631
##$SYMM= 0
##$S_DEV= 0
##$TDeff= 65536
##$TDoff= 0
##$TI= <>
##$TILT= no
##$TM1= 0
##$TM2= 0
##$TOPLEV= 0
##$USERP1= <user>
##$USERP2= <user>
##$USERP3= <user>
##$USERP4= <user>
##$USERP5= <user>
##$WDW= 1
##$XDIM= 32768
##$YMAX_p= 433571491
##$YMIN_p= -692725
##$CURPLOT= <Network HP LaserJet P1505>
##$CURPRIN= <$Network HP LaserJet P1505>
##$DFORMAT= <normdp>
##$LAYOUT= <+/1D_H.xwp>
##$LFORMAT= <normlp>
##$PFORMAT= <normpl>
##$SURQMSG= 1
$$ End of Bruker specific parameters
$$ ---------------------------------
##NTUPLES= NMR SPECTRUM
##VAR_NAME=  FREQUENCY,     SPECTRUM/REAL,   SPECTRUM/IMAG
##SYMBOL=    X,             R,               I
##VAR_TYPE=  INDEPENDENT,   DEPENDENT,       DEPENDENT
##VAR_FORM=  AFFN,          ASDF,            ASDF
##VAR_DIM=   32768,         32768,           32768
##UNITS=     HZ,            ARBITRARY UNITS, ARBITRARY UNITS
##FACTOR=    0.250966925370066, 1,           1
##FIRST=     8223.43324360094, -3868,        -87565
##LAST=      0,             -60879,          -98559
##MIN=       0,             -692725,         0
##MAX=       8223.43324360094, 433571491,    0
$$ Real data points
##PAGE= N=1
##DATA TABLE= (X++(R..R)), XYDATA
$$ [...]
23866 -127336 222144 -11133 192367 -185291 22781 -81787 -125085 67220 87523 38615 124723
23855 124723 -164685 232312 147069 47207 172999 -19364 152776 -98050 -37006 -22682 -110545
23844 -110545 115574 -46101 -258192 321317 29 -44782 41639 42416 -222327 -159108 -309011
23833 -309011 63949 -98964 17970 225894 -93420 154033 -53878 -298107 316209 78486 -42175
23821 -187521 149020 27371 -175602 -57416 -205589 46653 135153 71984 -127557 -32709 -10610
23809 212584 346887 36412 -10945 -168988 11420 110559 -2947 265818 -9115 -40814 -113913
23798 -113913 -117039 322686 -66023 -81506 221005 175552 187812 -172789 -24256 -466124 -85030
23786 11063 -79766 -114382 -93110 219 178966 85112 -387680 44009 -101758 -213193 -66576
23774 -123330 -116133 33711 -75541 -67248 46068 -109209 -11146 243854 291767 -49894 -322866
23763 -322866 38222 79515 -23920 -198610 -92810 -141003 -242185 23548 270677 -92260 -47972
23752 -47972 -7064 211771 -136096 -205452 -298378 80896 -66516 -171527 54406 -49196 -68725
23741 -68725 -273246 229642 -188288 366131 -45002 19438 -16722 -180572 318188 -85330
23730 197151 -364777 266638 172607 151935 -266876 -129232 -126828 -27730 70280 -64904 89078
23718 144189 92524 -2735 381681 -161067 -16776 275609 58081 134382 286571 -65799 -42875
23707 -42875 10948 272661 219888 -285472 156095 -222250 92030 68606 -332435 -29336 -130681
23696 -130681 88384 330475 -152882 -237240 -69427 92820 120557 -101635 -55421 125746 27172
23684 -27404 -82493 61320 -229299 252772 211109 99902 -109715 -141113 -36227 23177 134656
23673 134656 131626 105480 46744 -158336 20135 178000 -180462 -106858 124351 -200369 -56973
23661 -7075 -43628 -149368 299231 -266171 188681 -113919 -9385 -65051 292675 -200298 -122541
23650 -122541 -146562 163264 -138850 42853 -136675 -113215 351845 -51858 -115547 44825 -332317
23638 -301370 401806 -191658 331361 94337 -155326 96192 21011 -19967 -135998 23411
23627 31335 107179 -136369 -171328 -210552 -110392 -237596 162088 -190872 68088 -225791
23616 109536 -49673 -167961 -66558 -118648 -8887 80568 -107575 162396 110391 -372648 -99193
23604 84312 -249741 -109338 -7867 -60027 15231 -75922 -63205 -411585 -166329 -93150 163542
23592 11134 -38484 -40261 18642 25839 -105378 446556 24414 -97530 41242 -35372 -278962
23581 -278962 -503943 -88103 321990 58557 112683 62238 221717 279576 -18933 -105005 187244
23569 212865 173624 97469 -214166 119223 270434 -72446 -369464 -44403 298669 84561
23558 74106 9067 -13692 21724 -22050 355682 -114939 -107530 81913 174891 -44519 277176
23546 -41515 38699 -112033 -194088 -67108 322975 -151638 -31166 281800 62789 344325 -107604
23534 -33292 -202865 189721 111386 -349769 -31705 -52533 142033 1125 -142162 -277176 -158329
23523 -158329 -174389 -317052 32507 -89421 182044 -46584 373647 -104189 333183 -178425
23512 -107401 51211 -94867 267313 -45187 -45101 -178243 -168696 97365 -198287 -15786 -81848 -88295
23500 -88295 -153972 -269052 169318 -93412 -339047 70061 -133405 6290 -133051 -223401 -207964
23489 -207964 -168127 164223 -52406 21981 -82443 164659 -185008 -130538 82169 283309 36742
23477 -111617 -82083 -319264 -154779 -292419 -56686 17507 272487 -120230 -65972 145862
23466 -99139 237004 182886 -57808 -186272 125739 -299701 -155349 3912 72445 -63396 30200
23454 -376029 -68694 43420 -64463 -64175 -1065 91667 8054 -242448 316115 87464 -245725 186523
23441 -205394 57661 -146700 100110 -209167 -61339 29531 -28142 165398 -37399 -84076 -152081
23430 -152081 135277 -173120 -55006 274108 105755 254033 -25717 75258 -40456 -14703
23419 24864 -276368 52648 108974 93435 57984 -475786 -45989 -2517 70811 -282476 204748
23407 59325 -246172 24759 -16996 -101374 -22420 47285 -197357 -74663 77930 -235326 75090
23395 49374 210103 163411 165684 -232696 143996 -221899 -232259 -117101 -61263 -39375 242302
23383 127314 -184228 -16690 -9364 36920 50472 160537 -78509 -36367 61989 47192 -307733
23371 -4590 84463 -12699 -30689 -186881 -87763 -53927 309901 -16085 233755 83212 -76451
23359 31723 -202725 -122490 -91836 224000 125869 44829 151056 -34625 194284 -191875 -125146
23348 -125146 70648 35405 -122039 -229271 90373 -232841 -79515 -218870 -40058 12709 -314701
23336 -233479 -242005 182551 62303 -82704 65934 2935 156189 -201213 256478 307729 53570
23324 -225152 -126847 -251405 71631 -42786 43152 -5484 183534 96764 56622 8327 41536
23313 41536 274866 16423 -317826 260588 -44673 299732 -28454 -126920 87013 -139560 -289380
23302 -289380 -251494 226581 -512504 107737 11615 300241 -80789 -188806 -282349 -139528
23291 114116 -35241 242359 -201268 15536 -86706 -238094 -276844 -135334 127485 -46728
23280 -73194 141388 157275 -198057 -5666 -201809 20930 -211481 -54414 -116943 22727 146443
23269 146443 -265928 79578 52779 -91994 -148413 -167365 306360 -213123 -85685 -16411 -101102
23258 -101102 -235648 -63326 117539 359928 -371036 9643 -270284 19044 163847 4117 -224393
23246 71529 -212373 109575 151511 -91576 19377 114222 3317 -68630 49993 119777 -233928
23234 2060 -203304 -21896 155810 -261173 157877 323665 53670 63389 -114006 -103123 -104748
23223 -104748 -123019 23188 8037 -12619 -114139 197810 259975 201744 96628 15022 -174322
23211 13753 -223957 -82540 -193502 -34424 282637 76369 -24746 91859 28405 -144350 67615
23199 236001 -55908 130464 -39938 22364 -155257 -111165 327524 -9401 -72415 43182 -208011
23187 25434 -120470 286628 139214 -189406 -410460 179305 149257 -224100 -19612 131621
23176 -2724 54307 15375 -59726 31982 95441 -112620 143883 256448 95589 -105812 139518
23164 -194834 210439 -177989 -314122 -136752 -191135 -141028 35333 -258755 216069 -101780
23153 224901 -104373 -395557 2182 182303 95630 -72940 25925 -10155 -362359 -196678 -191156
23142 -191156 -58558 -102577 28414 100671 99905 -71022 -127903 -35888 6132 73504 -12060 -108841
23130 -108841 99584 155466 -98588 -28048 177384 73566 266687 -41744 -93941 -190125 210243
23118 -242024 45218 247276 30262 -312370 253498 135640 177171 75602 145164 -115415
23107 -138311 -184254 273616 -182057 -10414 204184 -269635 498 199081 125171 188909 456088
23096 456088 213060 64309 -47499 -81336 239885 -67225 -181767 120816 -177809 -335768
23086 -335768 -37795 89122 108549 -70401 -207410 -47377 266134 108859 -25830 -75593 87167
23074 33846 -114056 190908 42344 408541 272186 -79147 118866 351482 40662 135638
23064 135638 -245347 -218274 -101474 -140505 -165929 -5060 149190 -315587 40949 133224 84001
23053 84001 193051 43929 -81072 -144676 249428 165573 121287 17258 -164563 111072 199795
23042 199795 91648 -109131 -192087 303273 -257083 -239606 -16732 -48318 -44467 -197581 -110582
23031 -110582 -314762 -23906 102710 -142345 -335589 12870 -59360 74238 -269736 -230841
23021 -230841 -192122 41333 -216773 40054 -98775 216458 -25070 232706 210789 -197665 -182193
23010 -182193 -161945 -72116 -19965 -180650 86773 -9053 96296 -293020 -273057 114102 -216371
22998 -32332 299117 16256 -119046 -166377 28565 68237 -3040 -63636 -133702 -145776 -183877
22987 -183877 -215630 42212 -230572 46226 -216468 88592 -61846 -421032 -17053 -35763 -94439
22976 -94439 252366 -404685 83756 -292106 -23277 -83970 -295599 -79061 -246364 -19837 -166374
22965 -166374 100509 -158824 -282735 -104245 -114005 72818 -116918 -32687 39073 96746 -247178
22953 -120581 -192923 404861 -24603 -216024 -87229 -347806 -65596 195717 166946 25347 -286332
22941 158711 34448 46703 -34602 -94934 134272 172192 -77138 17711 -98936 37865 -77263
22929 303288 -120880 143496 -120120 275513 118116 -155857 151546 -43634 -170304 129836
22918 -14762 -262578 139955 -43328 58452 -162960 23995 203254 -328156 108308 -91528
22907 -355364 -337616 116990 142929 101291 -93093 37499 -32618 161324 6859 59303 47764
22896 47764 254784 245747 -185036 -52139 -55913 140106 -41896 -281029 -332295 85541 119025
22885 119025 284691 -307064 177017 -196793 51396 118765 -222456 -105972 -170206 62086
22874 -106380 -168426 -106526 183230 -216185 -191214 144497 -577457 39631 -490693 -329879
22864 -329879 -168964 134167 47202 -30051 298583 137298 1234 -9558 -127890 241253 -300254
22852 -130087 23088 -57267 56661 -280564 340 -228136 -152973 114523 -98552 214567 -81398
22840 -186347 -93456 -413547 199019 114554 166160 -244804 127257 -84951 10347 111011
22830 111011 -133127 223672 295816 -104425 76865 -159691 -13511 -30518 -32150 88449 61400
22819 61400 -66220 -183740 -286008 989 -62802 10981 114412 256948 -782 -183360 56582
22807 133375 -85616 -184982 -116243 -63719 142886 151886 144480 119788 27960 -409865 -62050
22795 -334707 306021 9142 -1260 -71510 -56174 11481 161678 -281472 -44915 30170 -354020
22783 164738 74933 57904 106181 -29898 341930 193097 -110762 24805 35670 1671 20667
22772 20667 123423 -161219 -86533 117122 -66954 -49301 -288532 -208572 -253606 -49673 -170411
22761 -170411 256453 95343 104950 -60809 8982 -1430 -11786 13763 57882 -17316 58786 88621
22749 88621 -290166 5347 -217945 267915 14188 13056 65 182858 3308 58078 -144449 -66853
22736 121294 41678 -16022 -54140 -517229 73156 -688 -219846 36173 -261082 54798 33808
22725 33808 -110582 -181807 40112 -24274 -116458 70520 48123 31107 143425 -80685 39998
22713 156387 -226674 -56393 -19561 4165 49126 -327472 13593 -137459 30663 364279 259204
22702 259204 87310 -11444 -135141 57529 -138942 -210777 -330639 37571 -35642 -140707 126643
22690 85878 269238 34253 -80801 -194112 -120719 -24119 227549 -233233 107888 -160148
22679 -175061 158926 -442325 -126545 342311 -33129 -124350 223927 134895 -71078 -115221
22669 -115221 -28453 251779 -77708 102580 214287 165987 78734 -22604 -131871 -241160
22659 -241160 121430 -396010 -208266 -47752 -60610 199067 83436 193396 174245 -193106
22648 -13087 -24616 73259 -200789 -283265 -99475 -37905 -75016 -148775 -60367 60686 37471
22637 37471 20099 -70961 -184320 -64611 89097 -249512 53727 108474 -30652 174897 35469
22625 20983 91753 -541716 -2797 50180 35323 41422 -200372 51902 -103022 -14068 13050
22613 28844 -235036 103275 36586 387039 -166785 -52596 -157433 19327 -412451 -51614
22602 -42686 -150192 -195500 9339 126276 -95438 -256113 -20 149310 -250907 110994 32551
22590 64680 -311839 -144126 10708 124943 25931 67390 162133 -34622 -230734 -149921 -28921
22578 -125970 -238241 224690 -183573 -93675 -148388 -166698 52001 120987 -138179 118649
22567 -187738 -23512 13240 -135944 -47940 -378332 201268 240634 106251 -98362 211126
22556 16955 4102 295244 84351 -103684 107936 -178442 -81373 -66522 -76632 46446 -11285
22544 310039 37640 -32523 -63792 157925 70936 65526 -6420 200222 -175432 -65429 -41877
22533 -41877 80050 -137247 30844 177896 -30614 -243282 -397149 358129 -73489 -215286
22523 -215286 -147488 -180205 353035 70494 20933 66042 -196944 80125 263280 291153 -62878
22511 -32616 -484237 125758 -70302 -297540 -55883 53328 -6559 175571 -245915 -27036 -72969
22500 -72969 -91307 95381 -5028 -157723 34647 -211839 70269 200288 -244589 -106159 -108366
22489 -108366 -49806 -214400 -204348 -110475 -114629 -148412 -115733 161999 59453 74210 109571
22478 109571 9771 -101623 228257 -9150 -83632 372207 307888 -173660 333576 -231385 -195935
22467 -195935 106254 -89054 -92484 -158536 61608 211707 134165 69908 -174465 167 274546
22456 274546 -43214 -124645 123983 -92188 77811 -334406 -9938 -219486 8233 -145699 -149053
22445 -149053 -72679 13835 -142165 275534 -7649 15138 -24314 -175678 -28518 91622 -118145
22433 -29013 -67798 -93977 399476 -293548 -94477 10521 -249885 -10622 106686 43107 -112972
22421 -49692 54859 -187915 -24580 55323 -245340 91951 136624 208145 -30863 -184882 -157809
22410 -157809 339393 -130304 -110236 78301 -96131 165185 7966 -136434 -24913 -506117 -139726
22398 -488419 22392 -284453 -234144 -5928 -39583 168825 -52826 -253540 126072 298719 -146514
22386 -420287 -162136 162142 70985 -13427 -352462 256802 -226083 -315101 194448 26758
22375 63399 314922 72376 146188 21637 173782 -48869 -15589 -78619 -51427 19462 -89155
22363 122081 298895 -182569 -9868 103435 -229643 6328 -114091 55241 -191589 116978
22352 -168828 -68301 -308925 158544 17435 159591 -103355 -204675 50945 48323 -182474
22341 -236624 281120 78323 -51050 -141414 -56712 -102780 -347191 287333 61063 -58814 -229666
22330 -229666 -62567 164883 -124177 -34590 -199233 280212 64357 -873 60278 28149 -193001
22318 1921 59529 -73383 -80972 50590 -159285 233010 37072 180192 66827 -65753 144307
22306 -197451 89170 -98651 128121 -43437 -113612 -29447 -66474 -15353 164916 -164849 25056
22294 32127 -35434 -176455 90075 -171302 3663 19371 -43005 104346 -246579 -223906 -12515
22282 195940 -205728 -96132 -12806 14967 -121998 -78406 205550 14466 -34457 164915 36193
22270 -60004 -319278 -114657 -460512 -267530 339495 145719 32788 96840 -10915 -60961
22260 -60961 -4379 -292220 -57654 19074 136508 131669 3539 -122407 37453 -76634 -139602 255087
22247 192860 326618 -153971 104458 93796 63333 -302887 155717 -105205 -77281 -119932
22237 -119932 -195831 -287121 -288360 -218450 25503 -168065 -394010 209920 145748 137240 27004
22225 -281045 -66036 -117824 30679 109270 -233765 -159492 144572 -215237 -151135 -162544 -107111
22214 -107111 453 -87440 90806 -28187 243078 145163 -109598 217869 -192338 16835 -100478
22202 225697 -141636 -272156 -50094 107790 -12944 75761 136260 -207088 -51172 198128
22191 -316073 -237564 -44124 -29810 51312 108215 -27654 -132059 3368 2793 234631 153007 24891
22178 -80041 169407 236155 113930 -193571 -258094 127308 98576 79400 130392 -38671 81152
22166 -76539 123502 36270 17176 30836 139862 139640 225189 -16545 -226443 -197072 -155984
22155 -155984 80535 -229515 167204 377303 26573 -141838 -26808 -97002 -351522 355283
22144 -181844 -195645 45213 -44813 52248 107953 -176067 -254523 -55624 -282831 134062 -242342
22132 -170782 -195243 -188372 169280 87716 -297451 11665 183841 -158306 -51509 39168 -265620
22120 -276564 49445 128518 114207 22053 -24485 214657 -165626 -117205 11561 68245 157242
22109 157242 307274 -255468 146534 -241695 -98405 -6642 -53543 28068 -127260 -168224 -30261
22097 465286 42673 -32748 -173961 -44081 34734 -250465 78583 -221908 149732 -250422
22086 -196865 172780 -10194 -237 -110627 -91989 -39691 -146465 41390 -7560 -53361 -379087
22075 -379087 -202467 -217979 -36261 130432 -90490 50869 374809 210070 6050 -81363 126744
22063 -7653 36992 -71030 183217 28189 -97526 126592 19367 148114 -89897 134171 296442
22052 296442 15125 -162640 105401 137482 7472 -44342 -102177 -53711 6152 -147429 -270067
22041 -270067 -86168 169090 -47826 -135465 75223 248772 44848 -182629 -390499 -278491
22031 -278491 -58155 -46955 106148 136076 35038 -268259 -208049 2767 -272146 -78409 -93178
22020 -93178 -207984 -55076 -24361 -476363 -16527 50103 -131881 -81040 131103 259135 -298148
22008 -113456 83883 -192559 106684 -205319 153405 -84523 -41860 -72391 39676 -329369
21997 -17622 -168370 -4032 178322 -277447 -79502 31774 -262375 -228455 -164157 46451 -212127
21985 16962 -190176 -13220 -50459 -198102 -191030 192368 305545 23105 -67300 123317 -6603
21973 -21899 -97309 178259 -298915 26971 -105998 116372 76165 73859 27003 298897 94060
21961 196549 -170271 171843 -16859 65657 235099 -41064 -225542 253529 234097 252485
21951 252485 57226 76572 101430 317723 -98265 268052 -144884 -60625 -218702 9545 100291
21940 100291 180021 -116821 -194911 -33745 -54776 16286 -52915 -294555 -165527 -330236 259662
21928 -83415 77648 -288273 67173 -50343 11820 239185 -66494 34896 158404 -63054 -381270
21917 -381270 53913 132571 -200538 -30990 117104 -146860 176657 -90659 160516 62074
21906 -128690 162042 -274897 -42089 99946 -191104 -97314 119032 -416000 -140820 -275569
21896 -275569 -27270 -38380 36819 16339 112311 -54990 -43446 120466 -31406 117713 -26420
21884 -134117 -107626 144115 -115529 -19565 -340108 -44675 -166543 -211133 80265 -237123
21873 297209 -14107 35314 -140855 -154211 -67587 -66307 86856 -115285 142153 -196241 30189
21861 56604 -140635 -97612 -399376 60967 -27052 79504 -291805 -164676 -39970 -69665 35806
21849 -261775 248698 -207017 -181333 146010 232169 -27638 -176419 -306374 -42079 220905
21838 -68030 -373847 339043 -96981 -107016 -395810 20326 270359 -107516 251003 -59505
21827 95778 105252 -221008 -28837 -49682 17955 -215483 -98353 76175 -82787 139452 -258699
21815 130710 146507 -216892 -50614 -210565 404291 73175 -402782 132136 -40619 -341696
21805 -341696 -343312 -163348 -196236 -26581 -254472 -165777 -171546 147530 199156 82807 90159
21794 90159 -70773 185477 76817 168494 342648 42864 -76336 -182218 -325163 35539 -302042
21782 4939 213765 -199703 179927 287095 -96114 190135 326818 38553 79155 -196217
21771 98105 -200189 -59677 -8606 -12148 -199901 -205475 110901 84080 95184 -270873 313806
21759 -100226 115185 -21898 -237828 93770 203565 43851 -289669 -37874 -6182 157286 90747
21748 90747 189698 335357 69853 -154625 -34864 262136 23410 -323951 -230450 16698 312922
21737 312922 -290017 17437 47105 -38644 228932 -69913 -204306 -51337 167965 -36851 -240959
21726 -240959 50628 264603 -71300 98302 173205 -409625 -69145 -193088 -229587 1165 -28698
21714 -147717 193330 -178476 26849 -126310 24863 -257850 68727 359805 18836 -81112
21703 330682 67259 -260159 96635 29115 209275 -33772 107651 -261020 -229950 -221934 -158181
21692 -158181 60197 -28842 -219790 179051 290101 -189261 45231 -358566 -411850 -86422
21681 -193317 159305 -275650 28971 -133662 314349 -154404 -30861 103940 37844 -205154
21670 -102121 -51914 -146643 -213844 -393521 147754 44143 -59301 32593 -235223 -146378 -123245
21659 -123245 14685 -135001 -147628 360601 -285366 241872 -188017 -105825 -135940 90694
21648 10489 -139200 -84529 -129225 5768 71227 -123815 402990 -314695 -298306 -59703 -265683
21637 -265683 33810 316383 59671 -274876 -55475 -137844 -241719 -248589 -48299 -329378 221241
21625 -52027 40379 9753 -203369 -31976 253453 -116682 11945 -109553 170603 295241 -17635
21613 38583 202157 -248818 55448 -19882 245129 145091 -174120 4094 31698 -269035 -103469
21601 -133969 -74301 -86667 -217127 -160428 227724 -179998 79690 -409537 184757 -204791
21590 -67135 44785 17203 18611 75031 -287791 -363340 68618 72932 194568 -176071 134405
21578 -166873 -149215 -1475 26384 77685 -262899 169037 199770 -185970 -197556 -352705 12080
21566 143712 226639 41284 187803 -460727 172592 111128 -40034 128843 -137618 -16195
21555 -237432 181597 104693 -9939 -29841 13482 32679 55274 -214056 183861 29851 79970
21544 79970 -14990 57347 25962 -419569 -191336 278490 94885 -25574 -183586 3854 242690
21533 242690 -299612 -192794 188218 123499 -128320 -192666 -155708 60102 -84153 231891
21522 108918 106402 -120639 -33405 -108947 -183479 -146496 -39207 -65700 33267 -2663 123381
21510 -41276 -131783 -17127 67368 -260834 95789 -49799 -29603 -41074 -293478 -340038 -90294
21498 -267313 -273175 -152570 -63510 978 111328 61318 -51485 103398 -368877 -40732 -274727
21487 -274727 155806 131864 -48924 -90233 -264278 -58741 79767 -172653 98946 -17593 114108
21475 157861 -379374 73414 16095 -161857 122798 196560 36212 92853 141975 -113607 -24147
21463 -229295 -279489 -104588 -20166 -116390 276876 -180521 35298 104924 -178723 -130493 149374
21451 -232957 -240078 -153063 44768 -214339 -165555 -73660 -2025 -214895 16933 -74084 7590 397598
21439 397598 216529 17848 304690 545742 267955 39099 135013 -77408 100817 256015
21429 256015 -121069 32698 27723 -18563 -245709 -281171 14127 -126208 184495 53217 -302603
21417 -212684 -195923 -243319 -216653 589 112048 158016 -496659 20862 42585 243638 -300732
21405 105714 -78570 254272 146453 116514 278101 -115408 45322 -42542 -29826 -100549 -493889
21394 -493889 317467 -75514 -257349 -187699 349 -189530 125962 -271164 109073 458766
21384 458766 -255927 -170112 -193179 39826 -155687 87159 -86943 15449 -360065 201172 167224
21373 167224 68185 310373 150063 190780 5569 -204369 -275594 -158554 -100970 -13575 -19701
21362 -19701 89889 -390357 177003 -91184 -197243 287035 -45134 -456848 -67424 -36208 -274732
21351 -274732 51903 24020 -249346 -28215 39312 214129 -75562 -504945 164919 350813
21341 350813 159678 -95591 61801 255076 162123 40942 86773 -222103 -516051 154405
21330 -164782 -369103 157177 -4417 -94732 184473 -28943 174085 -120289 -46381 -46979 148883
21318 -19232 -24973 37441 158008 -183794 -393447 -163754 -125741 92879 -137760 20636 -261096
21306 -16538 62887 -72793 -2277 -80292 -425004 44133 65972 -1 -120924 201823 151836 -48478
21293 -191289 -41803 -146584 -122110 -63205 -22658 213440 108720 136174 26665 -238608 -12991
21281 -224492 -42791 -146089 -174154 -78311 272636 -140189 -170351 -43742 -222851 -26674 451278
21269 90428 22433 -259684 -384518 157159 -141236 -28004 -196732 79521 -66664 195380
21258 217901 170646 -330245 -121460 154888 126102 128462 -99741 -78897 -251059 455141 291613
21247 291613 -337581 10418 -351244 -217072 -308530 -128447 -75922 2214 50072 82119 240827
21236 240827 -153555 60684 -59645 256172 -150494 150995 -398131 209038 -72791 205499
21225 -101384 140131 -112487 -290046 42228 57470 -289166 69153 -233755 -80981 -161608
21215 -161608 96151 -95755 209898 -238360 -228091 -113497 -212271 -180717 -210668 22093 -120453
21203 133553 236019 -142944 -79817 -62485 215576 -335559 123975 97313 -346479 -171610
21192 -265682 -36193 -163713 -141160 -46624 -355242 75324 -12919 269303 -214908 -307475 -11210
21180 -152025 191287 -86552 14997 -7425 -354194 -81287 -1812 -49794 -62300 58746 -3877 -104154
21168 -104154 -257084 296972 273967 -38061 12730 -143481 -198248 187348 -130178 -167930
21158 -167930 -10653 -182129 130183 -57617 -27548 25283 4638 97731 266554 45157 -145823
21146 125872 -62236 154184 298581 -120826 123572 -380937 -130176 58088 -179800 -61130
21135 -79361 24624 -319337 -165709 170637 -50187 -231967 181705 166160 -78557 -162964 -5870
21123 -91014 -343493 -333672 -82696 16611 117223 -87469 76174 -166136 211812 -392684 188169
21111 54660 -178193 179388 -119176 -157858 -234110 -221988 -126486 -103837 -111639 -162128 170795
21099 -53309 268581 -195817 11311 144392 101534 111227 -194008 84631 -318065 -65367 -243481
21088 -243481 -121977 -46151 -258413 109240 302794 -329279 43325 101304 284036 -122807
21077 -392685 -100059 -128570 87778 -85611 -169395 -69078 -237115 -35466 6104 -23702 53428
21065 47292 -352515 33935 19029 -370680 -27995 -27072 9374 83964 -563555 319449 -173904
21053 -77724 -94943 -240408 -220332 -86658 -65968 -253363 93905 93510 -98259 -59297 -187575
21042 -187575 -227047 -36006 -23276 133667 17759 -87358 -40531 157039 -137872 -35242 -162272
21031 -162272 -138968 243017 8476 199805 -351073 -70990 398791 160937 -259908 18720
21020 155003 -88388 6461 169376 52563 41607 122472 -105439 -4931 -224584 -30460 -157129
21009 -157129 14975 -68849 276445 -177753 61845 -27762 -78406 222402 128801 -380513 142300
20997 -53024 285839 -52383 112126 137090 -137949 304844 -162365 -126608 87133 -79805 -31085
20985 341926 132394 -227114 124240 236333 65853 104167 -288392 -4998 -216872 -269606
20975 -269606 -16227 -45271 336883 181318 273219 -134684 9654 -172959 -413599 215621
20964 77162 6648 -176584 -353812 163646 276110 -96370 -55594 -215404 -247225 13780 -182027
20952 111521 22883 -51806 -203001 -150432 -26326 -198216 298695 -1736 -230471 137352 187248
20941 187248 -4894 -252154 -11272 -119147 -1076 -20439 78103 -84332 -93465 2996 -526459 -168741
20928 -70753 22313 152005 -203478 -46133 86426 -122423 -43715 -311598 74612 -157629 -323422
20917 -323422 357553 -47804 -13970 94148 -157013 162573 296082 185638 239889 -123897
20906 -248827 51853 -171196 59400 15184 84075 114129 79958 -28567 236746 -210809 -153218
20895 -153218 7628 -39722 -216447 143599 66318 266434 55739 -35515 104060 100660 64106
20884 64106 199075 68752 -152678 -200143 52990 178876 -10936 165798 -293059 256958
20873 76206 -156497 44006 -191194 -233408 -115741 -148167 39511 16186 36258 -42819 -206432
20862 -206432 -5048 -9360 -357334 -102120 66496 -69061 -97620 -6599 -246676 12343 -244966
20850 107680 33033 -82086 90471 -85527 -520238 -219903 36245 108444 6560 335193 79773
20838 63797 -60000 -43613 34281 -370713 -97119 -143848 -16482 190835 35142 -248994 -11740
20826 -239171 -236433 -71251 194026 -15911 -30578 -84570 -73128 -209052 -391569 -11195 -44917
20815 -44917 122907 -133511 -109097 -52803 -40593 -125558 -163725 -472425 -404707 42953 -127427
20803 255962 357478 15815 -157342 -1132 26933 7839 -63801 74221 78002 -224127 8885 -206681
20790 -7566 -218980 -156554 118029 -289305 -123228 4193 -98626 -268424 158621 -89232 213781
20778 279242 8226 -50000 62667 -71192 -73051 83944 133964 -433935 -275692 -66801 -66123 -295420
20766 -295420 -160194 -404257 -149547 -37949 190269 57122 -60526 -70412 -78324 331288 -143679
20754 -70257 -58608 184657 243111 -226600 -111766 -111334 -172389 -146864 -147379 -213765 -106565 131824
20741 225430 179376 114520 145976 232405 186525 -267514 210191 31117 184514 -225381 -453118
20730 -453118 81583 149324 -114364 28133 -56286 -179603 128604 -258005 -209803 -517297
20720 -517297 -225974 -99883 -216993 198765 -101157 -184896 110658 -1030 -25199 -83237 123338
20708 369680 -66441 -204476 -41004 -140794 224232 -108686 76703 -436206 24629 -399157
20697 61427 -84795 113726 98063 175152 -73043 24816 -62485 135540 87742 -305342 -26651
20685 -208211 -8792 -113097 -229673 -94150 56238 -288291 -165363 -229768 212465 -142271
20674 -266425 12534 -162137 117596 28353 -138508 -117976 299375 -246092 214226 102540
20663 322 -167791 -99451 89359 109559 -190059 -248543 -42005 -191035 86530 -295103 220819
20651 173278 -412671 83255 -101649 108869 3730 136429 248143 110799 362837 -16352
20640 -376939 178253 -56279 179952 61821 126316 -9402 63332 -118006 292242 -100248 181595
20628 -106755 -41330 -123587 -117871 117156 -132908 -53334 347303 -35084 -1370 -273498 -496034
20617 -496034 -129806 93659 -274934 119344 27781 -222487 -461475 109553 191948 336819
20607 336819 -223930 -91109 -61249 -215802 -122160 -200224 12040 -49937 163890 -81806 -311934
20596 -311934 -135479 252310 124075 -158245 -122409 316756 -97165 -142201 123959 63289
20586 63289 107094 -34065 -184655 136160 17959 -183946 10054 -44420 264639 -156210 -284995
20575 -284995 -255172 -183353 -386330 197331 -338836 -99262 -163307 -43442 41365 252671 -340524
20563 -214311 210904 248163 -50700 -157631 71760 -100047 -597 -49813 -84702 109930 -171156
20551 111220 57580 -122844 -344829 153904 -85098 -337302 -210974 -39345 -224946 -10123
20540 117853 -378986 -205752 -106647 -303181 -329887 -197588 -63710 172854 90164 31732
20529 14558 -36549 -25317 40135 -77051 357075 -263774 123460 -435252 257235 27054 -84508
20517 18433 -200533 289766 -181887 -209284 -126375 -52246 40292 62584 -197844 -27193 -204504
20506 -204504 -53213 -109043 256871 -195554 181322 124585 -17627 120767 -85350 -174941 -207343
20495 -207343 194287 -173075 222266 148849 -197854 341071 204316 -49084 -140086 -51401
20484 97740 92938 -257011 213622 83402 -47349 -102566 -66892 -205877 -81769 -81222 253338
20472 -62833 -78591 73711 -330208 -16085 8463 -2529 250400 87142 -88429 -124899 24610 -52574
20459 -136499 98247 101180 67606 93218 -105231 285493 -66210 -107642 255578 -141172 48924
20447 94343 -151801 -173789 -195861 54198 -15097 -274152 -122478 -71882 79272 108814 -98297
20435 125190 -289999 52185 -35064 199296 -67255 -200697 551468 -306294 412166 -255896
20424 -199819 -82889 -289090 150073 108460 -347712 -274107 14184 -65901 -98670 -24075 223675
20412 65242 25248 -7650 -315961 318215 45026 -90631 -171963 -61995 -361808 281411 -167750
20400 380503 -56721 -177260 12158 108038 -282200 -307662 -70065 23657 -323263 4999 -164682
20388 -333382 -250441 84619 57228 32715 -105928 -46661 134921 -141666 -406931 134072
20377 86254 -114723 31351 -7490 -141925 119886 28419 27157 165053 -88885 70935 -142032
20365 -167363 -174662 -233889 220464 -198626 73524 46349 -307563 270513 53586 -157643 -22199
20353 -193037 97185 -128638 -24380 -270847 -210929 327888 74497 145006 10949 101663 153010
20342 153010 115892 -299465 -171801 -102422 206642 -45986 78620 -73368 190032 -209231
20331 2783 -2682 55726 -90976 92095 -120988 55572 -254589 -305597 239104 -54029 47212
20319 15825 -182796 -85561 -39731 -55094 -212026 1583 -23135 -97619 72041 -167845 48610
20307 -113214 -60774 126690 -295186 -152746 -89211 -56820 74033 92940 29907 108420 44489
20295 -113503 25269 -215963 94045 57736 198266 -42465 -84803 -363267 -120705 -750 -350395
20284 -350395 -214174 172920 147144 55533 59441 -114462 -109727 -127191 -39061 121719 167772
20273 167772 157070 55779 19731 -241789 67066 113048 -191152 113670 -298067 -203374 271121
20261 -174938 -48853 -151846 -154668 343065 -176503 -235716 -229595 -65036 -283738 -79441 -113687
20250 -113687 -166602 -42215 -122356 -338167 -60067 -207598 -71463 -40597 -88077 78011 41327
20239 41327 -303663 -361220 -17602 308742 -62197 -205278 -138145 -228575 148301 34757 -142606
20227 161100 -239592 143 -184704 -23878 224000 170952 -3752 -98043 -35167 -86305 -6939 -20603
20215 -20603 205951 -317466 -167938 407379 -230939 157815 157940 -111693 -154288 235350
20204 167401 -200963 217797 -157185 -110655 68939 36931 -128103 20065 -256697 -170962
20194 -170962 153844 28325 -216192 95145 -23499 -85538 -29342 -209071 -35590 -254868 272180
20182 108505 -198507 114668 -278938 -164490 -157658 276276 230290 30581 -34028 -40189 140123
20170 -160917 -40196 -45217 10960 156338 79385 -284918 -242414 11211 -449436 -99933 47615
20158 128816 -93814 -146721 -87496 185800 -219277 267548 -17831 -220096 -46412 -282454
20148 -282454 -196273 -191422 -268456 197752 2451 -276469 91964 117276 114758 -16086 -5167 -73269
20136 -73269 206955 246347 -97407 -23626 -302475 400794 46275 488 -257561 155928 32799
20124 -281763 -151869 104480 50795 13174 225638 -504490 255835 -141382 -196696 21877
20113 192913 233026 -86218 -242739 -335272 -157531 -36835 -9616 -47342 -133139 -39337 42813
20101 582376 78766 25079 237268 130475 22443 -247043 -119657 -85957 68592 -242098
20090 46976 155725 4123 -22533 161229 104270 82735 -159198 -1515 -18641 -141505 -157955
20079 -157955 59739 134910 -330860 -315393 -182276 -15094 119689 277740 -321841 -76311
20068 18296 2455 -170214 -97884 -140421 -101128 -126999 -250505 -206649 244537 -44992 -8367
20056 -51448 143352 -259548 95168 -38938 181031 -73785 -123582 33589 -84998 -211129 65324
20044 -440457 -209522 -19251 163522 -222166 -479798 5775 -70854 79634 -127299 -522772
20034 -522772 -31740 -169411 -67002 -200741 62068 -86482 -190626 -126150 -5881 -143666 -104069
20023 -104069 -120862 199817 69169 -130993 -399256 -135512 92776 114193 -40169 54475 -144193
20011 46629 -34889 -276963 -240026 -10548 -284193 -30000 -213477 -150818 -64669 193476 208626
20000 208626 -78798 -53853 -336974 -212323 176680 152158 17639 -102245 134972 -69997
19989 -259028 -181347 45750 -324619 56781 -506659 43365 42846 152128 -258745 -62611 -31887
19978 -31887 343009 55618 171371 -11144 82765 8219 -228493 -13425 -130574 27439 -368551
19966 212452 62628 84029 123247 -30224 134895 86874 5917 23488 75150 -151945 -120984
19955 -120984 387823 179345 31912 -57343 -76772 -182617 106579 77568 78936 -125080 -255984
19944 -255984 -64401 7478 -161733 -54465 -248022 179952 -44856 -66823 -375436 -11450 40722
19932 -63289 82484 -20786 -264141 -65169 -178749 -226925 93547 208159 -95156 -245335 20460
19920 135923 215793 -66251 -78563 -171052 -86199 -222690 -223332 -353491 -361313 73016 67920 360046
19908 360046 -36944 191985 -34320 -282827 -60002 138149 -414384 -197995 306871 -122169
19897 265407 57770 92505 -104196 46858 -18477 -315220 -180545 -53595 -216936 119908
19886 -95041 -269731 -139635 44164 -120314 -274741 -170278 183533 110062 -68640 6095 -128549
19874 -129829 -203763 -342239 -5725 265471 -208615 71064 -224372 152573 9158 242729 -280450
19862 136178 -238958 -99084 31969 -188770 -125019 5406 -368776 138370 199209 -40208 -6875
19850 -42335 -124104 -146907 -370771 66069 -250379 -58960 42197 -33341 -10342 -48182 84320
19838 141017 52994 -16395 80593 147176 147691 -244887 -424944 111648 -126452 42589 -47160
19826 -215205 -11468 7428 -259665 -464898 49695 15813 263227 29115 110755 -128311 327756
19814 -46357 -59108 -5882 -158074 -50679 -441673 -71883 294495 -327100 224922 14070 -77718
19802 -256635 -55595 -81500 79173 -44514 -453684 -119211 167893 -267795 69678 34004 -118537
19790 -245831 -178023 525666 -299576 98772 -50813 108034 82019 -223568 102814 -552948
19779 -436861 163112 252599 72582 13641 -105482 -72807 21142 8366 96694 54017 -68971
19767 -108896 262572 255758 2581 -77875 134411 -55903 -245849 -327888 -236921 190615 -106807
19755 133320 162429 -104496 189231 222914 -80788 33634 -28257 -12137 -84534 -174344 -9074
19743 43595 -259519 260415 161525 -651 19874 -4467 -117341 127751 53794 -116271 180160
19731 87841 94489 167474 1712 94575 75655 103609 -40117 -60632 -134961 63926 -115335 -36337
19718 -43332 -222822 -454581 -36316 -19163 149055 48287 -185007 -162372 311302 -254077
19707 -246283 123668 -36052 -58193 -555123 89126 -32896 106693 -141704 -158230 4689 -106944
19695 382171 29373 -344143 143813 -107784 -54919 77798 -88355 22381 -39746 -199290 56208
19683 -155933 -5928 79745 -44971 29152 -43831 -334529 178159 34179 -160603 -126486 34774
19671 -251361 -57962 49588 7861 -9703 -203146 -18393 185676 -66100 59332 -444973 110612
19659 68721 -331505 -8454 -133838 -47577 -326713 48326 65571 -39950 -196751 -2344 -260153
19648 -260153 214079 -84175 -86773 98341 214377 68328 172494 -138628 -434020 13405 -35513
19636 85287 -246788 -53216 -24129 -234391 191688 64893 101506 -69405 -82107 -60488 -121033
19625 -121033 -222922 -9297 -113261 -98778 -430773 -323345 -48488 -34747 -119635 -27483 194633
19613 -82834 65877 29310 -139844 -124089 236242 466990 100167 -45912 -128626 -11481 -94514
19602 -94514 -126513 -246592 151226 -484323 -186629 139234 -521367 81262 155959 28667
19591 -86483 -3437 -104338 222208 195191 37088 -252815 88499 -14044 60667 -45651 -61059
19580 -61059 293622 -182572 -70601 199896 55584 -186620 297768 -24647 -143306 -38718
19569 -322046 -177489 333550 -86362 -163696 -254226 62700 77843 -172270 23241 -15363 -45798
19558 -45798 -75582 -27827 -107188 -76075 332328 -34030 -299271 -134222 -54309 186962 -23520
19546 -119480 200335 -136274 -55706 69813 -52422 -87484 -38985 6465 59095 -92076 -167638
19535 -167638 430493 -44550 -333499 -316629 -227240 314968 -258144 133378 -239184 -188494
19525 -188494 152649 -32273 -111353 -8107 -198075 -24307 -11039 -316278 122192 -225200 -102617
19513 -150604 -93865 -72779 93219 -55318 81732 -17241 -140544 68638 41081 178238 -345303
19501 59625 -38738 133738 79078 -36033 227982 -134329 4068 -202637 -119465 -382782 -150130
19489 -314493 -31345 -23928 -237599 -138762 -62719 47802 64040 100792 -240111 -53371 3907
19477 16685 37818 -1980 -73665 190452 117206 249059 95472 7259 -238789 -86547 53512
19465 -194592 -186974 -150595 -89749 378252 -31856 3747 -186038 51235 -10066 -84837 423354
19453 334065 -205291 -183120 103571 -286698 -266971 122843 -183212 -67057 183648 -197993
19442 47321 28100 -41030 -83611 -77782 -203806 -237078 37758 -102201 -149427 76021 135025
19431 135025 67511 44268 140296 89096 -10240 -4122 -19816 -75093 -323757 85945 -96550
19419 -260593 106696 -177790 -46344 -421387 58261 -315321 -93312 217799 144653 128610
19409 128610 -62339 -43549 -52570 40309 -107438 -40951 -111031 -331430 145617 451 46123
19398 46123 209273 -123288 121441 -68325 -19140 212569 -180177 -106531 206188 71128
19387 -203214 -8925 -161740 62728 -419840 -10456 -140759 -64215 94833 -87697 31999 106758
19376 106758 -158687 15489 57856 -548737 17008 -353012 -275388 25596 -133082 -293054
19366 -293054 -245634 -231491 -172052 -87489 -354698 -39684 -277993 -194643 -240816 -224746 133201
19354 148958 65717 71908 -23776 -332787 -289416 260375 66391 202478 119963 -232726 265698
19342 62050 -130078 117938 -439583 114611 181734 -308452 106862 -303389 92985 264386
19332 264386 206458 218324 7316 9296 99923 -26701 -72200 105356 -447074 -86347 -135964
19321 -135964 46553 -236469 -195895 205433 -66981 51698 36643 -204346 125845 89387 -154178
19309 -96432 -45018 -24053 -35944 9826 -131546 87539 36865 -228856 -179076 114758 296298
19298 296298 166625 146851 -62186 195291 89234 -89074 -19027 93594 -129696 69423 -105996
19286 -70164 -279478 -43465 -247395 -57120 -181894 -159734 119738 -39437 22410 -85422 -188567
19275 -188567 -93158 399071 -158918 -50392 206025 -473861 173248 -180563 85057 245997
19265 245997 -378024 20981 -18798 -14891 -152009 201539 43458 -110881 200553 -16529 10838
19253 -127231 112351 -156864 269895 244969 -379016 -102256 92044 152437 -62581 215234
19242 298282 -405331 -10141 -168964 -52336 208597 197692 -9445 -268696 148416 -260739
19231 87920 -127153 -190882 115173 -180710 -330144 -118667 -171027 -64540 -75350 88808 -230906
19219 -125959 -256749 -326747 -358276 -102470 -6087 75723 -48695 -218914 -88369 -100452 -383831
19208 -383831 -158304 -95270 1596 -12550 -57362 91566 62018 -227185 -64112 -187450 -256938
19197 -256938 -71930 38202 -11202 -197440 -89422 -16752 191851 17108 -150720 -96967 -195432
19186 -195432 118565 12970 107053 108858 113261 284277 114517 57583 -70731 165031 327890
19175 327890 -77240 67795 -350627 -128442 34771 -266924 -218910 -112000 -60064 -141205 278302
19163 3528 -177266 -68345 -114526 -10428 -132558 -2508 -4127 -173364 -212180 -416096 -552746
19152 -552746 -110098 -300662 37252 -268248 140370 -48861 -39667 -83181 -14657 -37441 223865
19140 -3837 -95991 265745 58096 64855 -13588 -273949 106238 -101262 65144 -402511 45861
19128 202356 -39938 -67089 -122053 31046 -366198 -141447 -4360 139764 76160 -305056 -29149
19116 109235 -147504 -10244 -218235 -8482 84061 -126434 -149256 55919 -23049 -352856 -263389
19105 -263389 -26845 -449852 107784 239473 117759 142113 53462 28432 -38069 -186219
19095 -186219 380666 -404643 -143066 -189830 -90938 -14444 -226955 43287 -149841 -55154
19084 35965 21466 -129994 53444 -69390 101975 11191 16963 150881 -263794 167526 -93944
19072 -245425 -92409 -78328 -125428 -147394 -374187 -467031 77530 73278 -265623 -5545 17868
19060 -225576 38220 -12312 142118 -70839 -122401 241568 -462038 -162946 -1680 -28716 11413
19048 -159874 177791 25836 154598 63943 -411433 36251 184329 -62405 216777 183167
19038 183167 117479 -70474 -122401 302076 -202120 296383 192245 -169032 33219 78442
19028 78442 -117311 233148 -48229 -177534 73082 161437 -138477 -7248 241528 157138 -13087
19016 -21132 -48591 59904 -21009 -26579 111564 36994 -41161 -154599 89353 68357 -22124
19004 -329842 162832 -205897 -337042 172180 -199915 -65119 93526 -77732 -144053 14568
18993 -208886 -185959 -285873 401535 -61397 52170 -11132 84001 44452 11438 203174 15480
18981 125850 -214566 13770 46142 -187368 -123813 117125 15643 -121059 57342 -139862
18970 -179138 -214320 -114066 -246921 -244602 55526 235921 -301234 12513 -153868 -272465
18960 -272465 -49200 -83605 -21892 125722 343001 -170897 -215885 316420 -46989 128542
18949 40579 -90619 141915 65308 -137395 139443 47418 59493 117951 183383 -283475 -11333
18937 121248 -113652 -248611 -123822 -507646 -55572 -464846 102145 -39840 101394 -135687
18926 -318252 -26115 -323307 -219446 -231168 -25464 130197 1044 249 32246 -201630 74303
18914 154582 -20651 -21684 -94846 47167 46357 -82493 13626 -61320 165123 -81251 -80951 1899
18901 47437 102554 -491729 6694 -168391 -458 186852 88530 314039 -133479 -114300 -401970
18890 -401970 21799 -57369 363673 -90709 107987 -55023 124973 207944 84399 95938 145871
18879 145871 200612 -20932 -460610 -142535 196305 -35521 68783 -227021 47613 2657 -84610
18867 -26005 -184114 77192 2807 107233 -215097 -23290 277439 -34087 131526 -69201 61309
18855 107814 -188562 29035 -205669 -134142 67697 -8821 116789 45773 -25815 48543 93112
18844 93112 90749 -105142 -107954 68259 -232385 234336 218775 -345134 -227331 -233531 -147842
18833 -147842 -97735 -99652 -14967 -138697 -350844 132904 35910 -26084 -144921 -78919 137389
18821 -15025 211834 119020 -255168 -125834 -46052 100235 154146 -390163 -147851 33887
18810 178274 -37339 120397 40379 -129534 -298678 -94750 246355 105944 423691 -502112
18799 -122035 -157388 216384 240929 -153313 -19153 -70394 51796 -182737 -55194 -23908 -153726
18788 -153726 -41966 -156337 -17353 -321593 21710 -189982 66379 -26890 -51887 23227 64650
18777 64650 304928 -215335 -67641 -227764 145060 270514 153423 54720 -215586 2030
18766 113495 -175495 -116799 32898 110623 -322698 169708 -193902 -155053 -48419 -159364
18756 -159364 -362059 -115016 -123122 44656 -63532 -376128 -302582 310930 51966 -184826 108237
18744 35144 -368031 210224 -113945 -173550 -68831 -146827 34881 -298005 30418 82660 116655
18733 116655 -9629 -4355 -219786 -176539 -174120 -197887 -230692 -91039 12536 -61124 -114789 -306242
18721 -306242 -86993 -117649 -438615 -130827 -266935 -74794 -69962 -57909 396875 -54228 76984
18709 28276 -183486 -231573 -65082 57125 -196802 101241 -5863 -79541 -191199 -284573 -126742
18697 11539 -213281 -179081 -175425 -93404 163717 -138155 21428 158868 154997 -95469 186700
18685 9248 237959 -44740 -121389 -264188 242968 -76820 -410356 -36611 81337 -308538 311154
18673 35192 297015 -60744 -329505 -258741 -45599 -35917 124605 -128605 -44124 -280810 138720
18661 -61114 176805 130966 207089 153603 86288 21801 -55587 -114411 -109719 -218714 215359
18649 -88293 -14006 -48490 363763 360660 -112958 21612 90247 23109 2450 -110105 213872
18637 162840 204334 -128363 23260 -120107 146572 81460 -75269 1009 -73398 163871 -27549
18625 -142011 -296465 -153092 -239415 -177256 -46516 -174723 319904 116573 -10214 148157
18614 -196743 64709 80512 -29492 -262787 -129715 -304679 -271359 59548 179498 -48151 10106
18602 33320 -12834 93168 -219618 -160215 -14753 -143722 -70082 -66063 163943 -198757 -111923
18591 -111923 -273007 184137 -134344 244608 252907 -71313 -147998 -157436 -189292 -239489 73737
18579 54286 -89559 -52455 102234 -85691 67816 409539 -91526 103380 246018 -172574 38338
18567 -87574 -246686 -95386 2255 34768 -53659 -156567 -39887 85049 -152825 121818 -57623
18555 -261288 -188794 5610 -244194 -57007 -191005 -138225 54062 -168920 273695 -318016 -195633
18544 -195633 41948 -33715 -48324 104177 -260667 -277882 -155645 -127012 -356571 -45254 99483
18532 92864 -12425 67469 -163355 -296900 -299525 -63453 -108399 -44111 -231390 -51398 -137789
18521 -137789 11630 237207 -212948 193791 26028 5295 -167692 -23882 -41999 -262230 -130506
18509 263805 -108949 -178777 35759 248368 36221 149968 106498 -85727 -248663 -385749
18499 -385749 -202866 -47417 -284827 136438 -221966 57971 -101016 -56532 -560280 -54817
18488 -158710 8360 117536 -54339 18015 -15367 -4449 -311216 289769 -14970 8425 -15803
18476 -155278 189093 304944 -82102 132331 153119 -8193 72434 -191679 169729 -23219 79
18464 -318944 -77578 -80098 -16025 -87922 58372 144474 180047 -225150 380545 -203798 52328
18452 -146188 -122751 -209133 -224740 32629 -210775 -130192 228996 -318567 -333635 -319009 -87368
18440 -401445 200551 -4890 10383 321195 -427463 50962 291863 -271133 234432 -360337
18429 -36810 18033 314375 -485336 68050 34398 67281 -18477 -48240 -49763 69453 -232608
18417 25187 214590 -441331 301151 -156699 -59117 170755 -218543 360739 -38420 378020
18406 -35743 -6322 -181995 -49536 199739 49749 352590 127173 -158232 -18143 -65163 -65868
18395 -65868 -389022 -26691 -355882 -76038 279 90298 146249 -37272 -52410 -188671 -127886
18384 -127886 -161563 -42023 16664 -96096 5788 30536 -112586 239789 173227 -284308 -99952
18372 28736 -8736 -134640 -158211 180316 145357 324908 135323 27894 -305673 122236 -258977
18360 93790 -191128 9832 -125814 95370 182729 -257392 -87657 37631 -79838 -145929 -60349
18348 41070 50943 -25517 -241453 134313 -118995 -68433 71401 183837 186550 2726 -108794
18336 -37471 13847 -75544 177604 -167885 33171 136975 -176691 -121436 -422718 230087
18325 -40682 -77092 -3517 53159 -27456 -1572 195310 95427 -40790 -32773 -104829 -87286 -354600
18313 -354600 -165596 -170689 11394 209327 33350 -195503 -157397 -223029 12854 -82066 -8247
18301 13325 12067 -195520 -3227 209863 -66639 -180753 -250965 -85482 -25834 133196 121584
18290 121584 -53693 -56372 -244621 123660 -166864 195812 48455 -12895 -78794 -319936 73715
18278 78239 -334772 169145 -99885 131009 25251 -132236 -180592 193456 -214303 -324461
18268 -324461 -143990 103732 -13661 -67432 -35789 144902 -37543 267650 69005 304112
18258 304112 30984 -133759 375 173094 71977 -254245 238202 72062 -224768 -208206 -35061
18246 119069 -124789 161693 4150 -74580 13609 68788 -149194 -142754 -107920 -314503 -99971
18234 -73530 -119652 248790 -198107 -75576 153111 -109846 -142575 -14266 166580 164369 -6716
18222 35112 -201878 51849 -54194 -57607 50557 -125306 207798 -7559 -352197 -553080 -103976
18210 106057 35696 -88461 -114737 -244995 -13622 -152096 -215859 80387 -15996 -67276 128545
18198 -180518 -32344 -124052 -5859 303781 298181 10211 -279983 -18445 244074 92657 -213011
18186 -177449 98289 -223759 165082 61945 -77991 167384 -52192 -159082 -20469 -320730
18176 -320730 28068 126658 -85557 -110362 55569 -18386 -100064 -120342 -58004 77089 63497
18165 63497 145552 77261 -88676 -156569 -61740 -207204 46318 -278914 33024 -297389 108132
18153 -77305 -2692 38570 -243878 -158913 79413 91829 -71181 128866 66476 -66897 -7095 128839
18140 -204947 251190 -210965 -289577 -202659 -94700 346705 -106825 -71096 -137418 -14425 -200101
18129 -200101 14454 -77305 41970 186464 -49887 200647 32529 145955 95178 -67865 -112182
18118 -112182 -176004 -87164 143058 93984 -188026 -58939 39502 -42550 -295330 -134373 -266230
18107 -266230 -29731 120115 58792 -144561 -156637 82602 -104553 51133 170298 303196
18097 303196 -71209 -67736 -266888 -430102 35127 -145144 -33516 -128087 8852 163379 -119579
18085 -45480 -5279 -164422 137406 323973 112124 276276 170858 -329221 3132 -169215
18074 54802 34047 -2502 435904 -59456 -33044 -84502 218216 41608 -137921 -151938 -294718
18063 -294718 -133457 -219806 79548 -139357 -92781 204774 -204485 -362117 -101932 -110781
18053 -110781 217479 220569 88144 85130 -409713 -17154 -190966 -377201 123562 -37271 3623
18041 -392020 -271647 -23555 -284122 -4965 216117 307927 138859 97353 2817 -286696 -216275
18030 -216275 248858 -82199 140078 -128779 -301114 -20558 95 -45581 -75344 15720 -264279
18018 143515 -119963 86664 -118270 -136235 -133613 334560 55184 16103 -55177 52007 74480
18007 74480 14135 -28289 125067 -174275 70476 64543 81361 237774 226402 -11448 -147882
17996 -147882 -4206 -198990 92677 140989 -2853 -164428 364478 400696 -39284 -86134 -49739
17985 -49739 249144 -280831 -126075 217292 124394 45123 59225 -223106 -200935 9564 82942
17974 82942 -204415 -122175 -46444 16933 -91644 169061 216570 -45195 -214101 171430 98124
17963 98124 -150414 373393 84794 7077 349254 15677 -51477 -161666 -134741 66625 -200599
17951 94553 244097 27028 79821 189056 30293 -197519 2727 486407 350489 185125 108146
17940 108146 -60281 -94748 47334 -13667 87461 78049 252646 -372754 121055 -192970 -146154
17929 -146154 189233 118303 -85245 -114381 -250729 -30834 -133888 -155958 -104237 -147167 -349063
17918 -349063 4573 167861 44289 21300 -178597 -76471 82228 106757 449252 188533 160123
17907 160123 -1085 98262 -220878 -185717 -101668 -3103 -122061 -138751 -21444 -233770 -74788
17895 31852 132794 -147118 182937 111164 112755 182887 -125683 -35862 363145 -88134 -152727
17884 -152727 -59956 -166555 193850 41819 -58455 -124610 -92374 62774 -270539 -24406 -204571
17873 -204571 66606 124887 930 131245 -43341 234327 68087 -120744 118514 86183 115484
17862 115484 -48230 165286 4213 70372 -126866 -107866 -178226 -299691 -318531 -73736 -14464
17850 3412 15345 -59539 -346537 270639 -195599 -154775 141105 127517 -159515 272229 54689
17838 -316599 10784 -196034 106753 205863 138791 182357 -99752 125628 -77329 -144690 24943
17826 -106588 -87711 102918 -26312 -37034 54441 -83600 2017 -143656 83274 142087 -184324
17814 203591 135865 -23635 -21606 -412714 17272 -4057 62025 190856 193947 -204078 169451
17802 -32665 2327 75301 48342 -260074 173485 10744 22072 19268 70176 85251 289161
17791 289161 -33923 -62816 318615 126309 -25500 -83928 54208 480676 -128922 -226962 -80092
17779 -55720 289469 -327235 -191795 -479359 -212423 229653 357376 104831 -103271 -268231
17769 -268231 182598 148716 41873 153623 -246643 -94918 32225 98531 -299404 -37085 117737
17757 -132180 48204 167953 152928 -173421 -114901 139864 -82120 98332 60976 -107807 250361
17745 -143269 24299 -219190 -211599 -14854 48245 -21782 219467 -86059 -306487 118710 -88962
17733 74967 -419967 -53244 -37365 105817 96309 -341460 -69832 177635 316210 266556 39828
17721 -209551 -33960 40815 179024 78606 -229974 42818 -23388 226858 -207203 -70941 10604
17709 40475 14232 -6041 47874 -4705 -207371 -106838 -181665 144883 59544 217013 -10439
17697 -125611 -5889 -110011 127018 -10905 -219357 -90339 -75076 -4076 141636 161676 -71620
17685 -93238 -171197 -16020 212880 -65954 -130002 -56139 -7975 136253 -285762 -224265 -215387
17674 -215387 -146302 -15557 277042 -372049 -16678 48807 272162 -174102 -47422 -233496
17664 -233496 -14629 152032 355448 -139782 7821 -24197 546882 215250 259470 -287052
17653 209514 68982 17382 375020 57849 -38241 -110995 -177468 247204 200717 82889 213673
17642 213673 -167982 -62653 255134 -168435 -57299 -184173 60031 186319 -80374 -127951
17632 -127951 216848 24413 139050 23117 22150 209988 -113348 -107142 -294506 -153903 343372
17620 -63840 165989 -238871 36308 -340908 48662 -181381 -128239 -259466 18052 62452 -112305
17608 -37258 172081 -28171 -384582 593602 128843 258073 238160 211125 160051 181885 -142758
17596 -300 -93225 236778 -77387 225962 -186247 -138891 147956 307169 182680 51406 -132426
17584 453332 203115 99101 -137097 -26219 221343 -140191 278209 120655 127716 370391
17574 370391 -106011 156966 -65905 181003 141203 -243819 119124 -134693 -62257 56465
17563 191574 -137379 8588 -7028 27808 108271 -203519 -170260 38677 15609 249577 -44369
17551 -12479 -362083 182916 104144 -82091 -10496 -35022 -203674 167405 -258365 -176414 -150391
17540 -150391 -47130 266583 -100674 -169531 135133 232969 55066 347880 218007 28212
17529 -112075 -152282 69995 315428 -39638 510887 -73823 116148 -102976 -194859 82928 129393
17518 129393 -4171 -200818 -142674 83578 -103375 10565 -225392 51217 -45928 114577 271531
17507 271531 306567 57958 -262697 -20631 318328 85954 -187830 314539 -111887 -146973
17497 -146973 127731 25514 226353 269730 44297 204132 54013 156256 98555 144703 -89688
17485 -77868 26590 1967 41115 -328114 17777 58213 25912 170865 346139 146082 -218577
17473 266900 -98449 -138251 -182235 -149997 -51469 216721 -150261 116054 89514 -241125 7443
17461 -241242 380885 153565 588406 -130111 154674 220371 118785 45474 531103 136735
17450 13354 259342 297852 372626 133103 459909 29419 -50776 247499 -19480 357336 243252
17439 243252 207402 350091 255980 401488 12843 202419 276955 110266 293857 130513
17428 231300 -42304 354184 254845 365939 326197 248212 293228 -55035 117733 125958 391559
17417 391559 410171 163520 476937 199559 280131 464866 -118914 145390 -162634 -321410
17407 -321410 161838 -180098 129061 -8274 10807 134337 -93907 183371 -309488 102524
17396 -225990 89829 -240566 127728 97281 182035 70308 38484 62363 301392 123049 112992
17385 112992 79740 56254 290808 -21333 250488 194087 -106067 103337 142416 -60967 245521
17373 126852 283594 5697 -1505 56083 -112149 -239231 -207500 151190 -12485 -287067 185802
17361 153383 -94396 286127 83947 50946 333471 54020 220996 -62105 210966 228953 369054
17350 369054 89691 349476 96669 -13004 -32657 374868 137365 128191 -30024 -96220 37851
17338 -129464 59440 -87227 135410 207652 295054 21138 -8652 227422 115922 393624 265494
17327 265494 348224 401159 -71828 -339374 337109 467350 200208 58556 -270229 249334
17316 223289 432340 303295 519549 69570 174075 45869 115608 68733 -63690 133637
17305 449470 411367 153143 245721 256166 297916 11105 -1209 11140 28408 34312 -155137
17293 -52976 56852 -63048 328704 81433 152081 -12378 -105929 453613 -59877 439202 75087
17281 8387 98177 103137 115613 47952 243488 262723 -37685 155107 -48729 -80438 301752
17269 114375 47316 202030 166182 70833 -1365 76864 302348 186647 206247 -182791 331416
17257 67456 44215 127777 169326 228090 6042 -92830 70714 -221754 47944 76454 152396 50728
17244 58164 397115 -68289 -59545 -257065 -4195 259690 324096 76358 88682 137604 -113996
17232 -250659 249218 137557 -154957 254641 122278 271414 -18588 210795 66878 320673
17222 320673 -154607 35115 93322 379677 -37870 132890 -49229 41182 154770 290639
17212 290639 378925 -96632 -119551 14839 -97761 337057 281207 73242 160579 41090 251619
17201 251619 61401 287775 273955 122557 321362 -162369 282186 42832 72634 -25059
17190 159150 140725 293310 320095 124157 391274 385822 222517 138610 252430 134130
17180 134130 420812 284043 -72950 -81924 41884 453144 7394 141420 110598 314602 428717
17169 428717 35866 167882 157353 279168 12192 423256 537023 50081 191999 365152
17159 365152 194576 167972 342279 415663 469012 148031 228574 363357 396594 -123322
17148 253400 187675 643577 -46608 366972 554480 386680 395009 257607 -35176 550877
17137 -66619 573300 138936 363814 -5393 206635 204337 192571 244421 -90454 -77873 235436
17125 125530 368196 320993 58402 427027 223221 395080 327709 380478 -32656 168608
17114 418137 244812 172547 429213 -7106 376374 25468 152933 470667 228108 359139
17104 359139 237431 214324 212717 509057 146826 457756 418284 424720 364528 224139 13335
17092 419538 373909 247011 245087 450408 177988 508493 609147 366594 692250 354736
17082 354736 604955 226329 392840 456739 256456 270075 637802 472691 396456 415333
17072 415333 516188 266259 639128 557949 278781 468408 397036 189649 399196 309920
17062 309920 400170 561962 476995 404053 485498 401095 375514 650528 489663 636400 334982
17051 334982 410143 566672 342900 507202 483978 367926 271428 648814 606744 322395
17041 322395 690599 459669 661547 538427 334204 382261 454865 345210 480822 352970
17031 352970 185255 568995 552886 486097 233258 686889 470944 301463 387602 561433
17021 561433 293528 383207 749740 761664 530081 590818 529580 765051 559912 608082
17011 608082 409286 567355 555929 930566 237907 608643 1001094 515634 586474 210601
17000 495049 638635 491580 698825 530501 454866 575278 715993 788923 311689 825135
16990 825135 497284 765953 693382 865506 343843 756184 838136 566587 633412 286469
16979 720777 254537 805850 817891 594718 939458 868097 1117735 491270 604513 435973
16969 435973 901745 592799 738547 562337 808933 825356 596928 935241 745668 1023937
16959 1023937 666756 917282 1106382 914611 1039683 981808 1048243 694216 367401 827190
16949 827190 963932 1094784 495402 855390 826472 1007424 1135335 831839 1025498 1122264
16939 1122264 695009 736230 628311 1043341 949326 872571 1096918 882974 804460 938338
16929 938338 1185739 1337113 964875 962694 1163590 1082586 1180083 1165289 1110228 1403177 1147984
16918 1147984 1256495 1507427 1265662 1053440 1240759 1540714 1158233 1249554 1557641 1462196
16908 1462196 1178848 1344605 1731363 1330951 1369170 1257951 1150445 1063528 1231001 1347098
16898 1347098 1421431 1342192 1544005 1724509 1299064 1613139 1232119 1617469 1413312 1453144
16888 1453144 1622223 1444442 1784915 1961381 1297880 1769786 1836962 1534941 1478091 1905017
16878 1905017 1819605 1808370 1872162 1649391 1823811 2041922 1733190 1638882 2057853 1974824
16868 1974824 1867688 2087334 2194290 1845286 2058329 2037302 2221854 1914028 1930257 2366397
16858 2366397 2367103 2184791 2326627 2325018 2534108 2392256 2539491 2454010 2307897 2218449 2652601
16847 2652601 2439871 2922152 2868305 2603660 2717440 2916220 2811009 3014682 2816916 3267291
16837 3267291 3351694 3230350 2883403 3055126 3208092 3508848 3543344 3567211 3585586 3696763
16827 3696763 3800946 3806606 3873855 3723087 4166021 4115713 4079460 4403470 4292708 4225899
16817 4225899 4425385 4407745 4582640 4686690 4360353 5268221 5112917 4857680 4997829 5348066
16807 5348066 5274782 5374135 5481553 5845341 5908219 5767797 6026743 6174753 6441926 6473331
16797 6473331 6591150 6798441 7261226 7363947 7622612 7415166 7672530 7790771 8026421
16788 8026421 8223073 8657229 8974562 8930149 9060588 9542637 9904023 9933663 10326149 10628591
16778 10628591 10926008 11577151 11587624 11988805 12359427 12707752 13209926 13439914 13910628
16769 13910628 14680485 14948876 15588380 16296255 16544438 17102385 18080527 18554219 19364152
16760 19364152 20023650 20723233 21724541 22576898 23453345 24244119 25410802 26708556 28143247
16751 28143247 29151266 30739159 32231515 33685803 35647753 37474926 39087556 41351802
16743 41351802 43895555 46282336 48815102 51675785 54563405 58092338 61593946 65213304
16735 65213304 69035705 73652298 78184994 83067919 88956108 94315377 100906706 106984387
16727 106984387 114137908 121231535 128471764 136016241 143624259 150848696 157968882 164900628
16719 164900628 170468479 175633397 179596214 181995463 183399381 183166957 181658394 178888534
16711 178888534 174982948 169843183 163977197 157260777 150214148 142847188 135064674 127436704
16703 127436704 120199179 112777901 105884398 99041994 93137886 87390123 81587191 76159955
16695 76159955 71672410 67322826 63300696 59465042 55979305 52880493 49475577 46855645
16687 46855645 44371576 42042691 39604518 37506288 35796672 33587348 32584521 30807896
16679 30807896 28726560 27775770 26679068 25562199 24343626 23340709 21939417 21270142
16671 21270142 20626399 19452225 18878890 18012125 17517496 16751136 15945473 15091719 15043708
16662 15043708 14261320 14135582 13175050 13108104 12610475 11889745 11453590 11412698 10826814 10744037
16652 10744037 9883321 9839810 9730611 9427500 8801368 8363881 8582152 8192759 8035437
16643 8035437 7921210 7571122 7664987 7399927 7037435 6927846 6770094 6643198 6207849 6021275
16633 6021275 5822341 5875325 5587352 5702670 5114638 5216151 5302869 5029017 5103152 4621910
16623 4621910 4640083 4399004 4722240 4576134 4133618 4201842 4282858 3873442 3953921 3859175
16613 3859175 4012108 4016117 3824027 3470854 3445425 3446736 3194219 3510892 3201903 3258753
16603 3258753 3312249 2910282 2665582 2937448 3144871 2777355 2804531 2644370 2739289 2706249
16593 2706249 2544021 2591652 2781792 2590422 2398158 2401448 2213995 2307527 2093413 2180078
16583 2180078 2165358 2203447 2184666 1855715 2161212 2061647 2162152 1785009 2072923 1819008
16573 1819008 1690114 1768760 1840726 1680134 2144004 1837393 1428680 1923309 1516408 1714922
16563 1714922 1674172 1785007 1354205 1421821 1449116 1166637 1652903 1417663 1525506 1435718
16553 1435718 1457919 1182404 1217599 1435345 1218856 1740395 1001961 1275386 1303085 1242217
16543 1242217 1514767 1398057 1100168 1047706 1062292 964663 675707 1191903 1084471 1063987
16533 1063987 1215300 915974 891231 764313 1107600 1062462 1303752 751606 1075835 1193972
16523 1193972 812752 1174613 885579 836244 962411 597741 1161360 1193501 861427 1040188
16513 1040188 936704 980274 771396 1056932 785578 800099 728338 1037992 634875 986892
16503 986892 870895 729930 460151 669811 952550 872648 997365 654057 441153 693299
16493 693299 705572 473429 281578 786506 1052062 675148 369669 732750 738534 918562
16483 918562 804204 627050 756832 725671 487654 751970 655010 169172 676710 509754
16473 509754 606167 663763 702541 851941 392711 551113 585896 525022 677766 387657
16463 387657 235081 461250 399457 641573 643325 706217 378320 475282 555142 391266 491931
16452 491931 463389 346573 555069 347667 406666 649404 510319 548215 667477 581066
16442 581066 318954 238042 581910 361024 398621 387230 444206 150679 527735 117704
16431 431807 268716 192483 375460 568119 398463 242021 182188 322911 413672 454815
16421 454815 691664 497581 532125 134172 421505 625952 437381 511907 417661 527735
16411 527735 464233 -46908 360201 416643 320778 -7063 484628 371185 453934 603861 367544
16400 367544 180116 438202 302034 250522 503693 275141 401759 140824 423483 389531
16390 389531 160188 386560 274902 216954 350748 566067 104063 202380 134945 248800
16380 248800 257942 438812 396656 112108 410801 168989 187270 221840 271902 303151 -62586
16368 -129732 241659 239783 609204 160500 -62818 297273 292524 420429 22545 -172472 449249
16356 -30199 66312 407024 111194 302054 -169919 124902 155858 201332 73551 198168
16346 198168 -21120 264604 226817 266326 283908 -100398 56987 -54603 -241474 -66553 312174
16334 442414 1106 375757 121016 -43620 126788 226307 112582 -316941 216579 378338
16324 378338 261536 114082 142191 478762 67132 323432 13989 68519 -10692 114139
16313 198664 223917 247724 -129441 35949 -159890 1851 123998 -206626 447199 -82905 -109382
16302 -109382 -46874 209291 -120991 244216 -151139 190831 403817 65156 249493 31450
16291 86621 347370 101312 126987 -16488 173634 55012 -749 222748 196939 -7131 77234
16279 154106 -70234 83528 109083 83187 -137134 76784 53328 -60019 391305 -12383 263097
16267 328866 94348 321700 -48148 -34874 87878 8775 78708 70270 283154 285375 -28250 161265
16254 157051 57504 -253835 -59751 44594 -35317 83699 30526 153907 96403 107014 83472
16243 83472 -5058 204266 376644 138908 -183357 2939 -42157 387420 56623 -46796 291990
16231 -109168 -247108 31768 364276 119596 268799 87066 156989 -240365 -140119 -148302
16221 -148302 -62955 497056 -35924 -282148 67842 116121 86102 338079 101417 65981 228712
16210 228712 128643 153377 163314 197756 128502 -101356 -56118 146272 140322 61995 -18931
16198 -173937 -36921 50306 -185902 40536 -86966 133271 179074 -210878 -67982 191495 -52560
16186 38749 -26437 100518 -107595 -73425 138166 327165 -70549 254244 -18465 24670 48119
16175 48119 203016 -107447 -8192 -187274 268087 83501 253756 193269 268479 202285 -276664
16163 47040 -38205 -195885 108769 -145854 378242 61046 61247 58756 88286 121322 103668
16152 103668 -208902 -207028 -284784 -413684 -301649 -68272 64025 182776 110063 -125338 65296
16140 80446 164984 40163 -307542 -73355 -323482 64669 174959 23074 -66499 -18482 -233570
16129 -233570 -46825 5604 -2885 -123614 264039 -92826 -55377 36696 92007 213155 -116821
16117 -399457 -272176 35418 243561 76070 206624 77064 -156307 -320557 -187608 17484
16106 -325989 160300 44152 376221 -163983 -185069 -20132 29225 -160419 -22294 68951 41036
16095 41036 -114200 -82841 -150792 62244 -63590 -103494 84376 -119376 -114452 345792 -62281
16083 -27595 61263 152863 -272635 -24289 -266611 -129042 28233 -168185 36020 229731 -81084
16071 156516 -221787 74001 -65791 -11596 -62770 115396 168828 -94616 192663 48217 248676
16060 248676 -162415 -136528 390186 135131 -86506 54427 53048 -16128 -121112 39976 125212
16049 125212 -10555 -118785 -364072 -33179 -243575 64751 -123663 -109507 121931 -72839
16038 -37567 258950 -134563 -22585 28490 -188123 -90472 -65140 361993 221615 72077 47119
16027 47119 -66199 90571 3931 -105545 189937 -368214 -72310 143284 -68141 63872 114212
16016 114212 -130056 54134 201302 98274 52329 24422 -323074 88138 -349560 -351298 -14601
16004 2760 -231044 41665 37773 383697 -60759 -201018 -120866 140115 14400 -288259 -110676
15992 -264382 -125221 -197252 -279573 -162171 121687 110361 -52831 108737 4825 258503 241535
15981 241535 -101938 338978 212002 110391 -22177 138902 -118601 -81880 146439 -183195
15970 216960 16557 105087 299328 -143545 -114697 -13521 455172 -278845 -193358 148461
15959 61986 160053 -122851 40200 142517 219189 -121681 23127 -194796 -145183 -182044 -175170
15948 -175170 80346 -94003 -48733 -60104 -119115 53191 -31105 72581 -129525 -116932 -3723
15936 -79766 71897 134470 -36466 30350 -38535 91258 -91383 -203983 -305007 -263278 -191083
15925 -191083 -79741 153329 16300 177432 -207521 -69191 -64422 -161189 -35281 -155597 -18975
15913 -4374 163378 145615 -231517 -131978 -309591 -133117 -31736 153832 -259177 -163137 -190798
15902 -190798 104790 -186880 167519 -90845 68087 -38611 -48531 -259524 101505 -245139
15891 -54571 -74357 -93881 -87420 251158 -9788 -20020 94999 -113031 147105 30449 38873 -127617
15878 -71616 113267 97422 -286683 183274 271413 -423270 -131103 -185879 -8627 44170 25703
15867 25703 117154 139638 13741 120894 -120010 60689 211388 -460061 73972 -216744 -209120
15856 -209120 101056 -105153 277934 -18025 146956 87849 350504 -134325 -75595 148789
15845 43828 229680 -13033 202500 -180785 -246041 63611 71689 -12964 -26808 188043 374635
15834 374635 114048 -203737 -122852 263047 -246904 -99470 -111658 -49523 -342306 115878
15823 24294 -131212 -3843 -447143 84352 6086 -125298 29137 155120 -42354 295507 -159590
15811 91627 -126299 -84195 -124034 211632 -336203 -956 287932 -19216 -48352 -29857 233137
15799 -161161 -25212 -219808 57484 28631 -310017 117923 -16169 -37133 80149 102369 -215423
15787 -125085 -206921 -380826 -245551 51158 233196 237934 -65111 166380 109874 -556900 116603
15775 178293 54571 80256 -139033 -142579 -185758 -45170 110786 -1378 -91056 62080 -281273
15763 51340 -145834 -47646 118335 -123966 187558 220319 17350 -435780 -99682 -4817 147163
15751 54749 296479 -84709 -80890 -76170 -49651 -26613 93428 98515 49197 164488 -428165 -284371
15739 -284371 -135157 95718 272486 -245836 111276 38479 118850 230207 15994 27276
15729 27276 169757 -187765 9474 -309631 -172533 -168238 -4985 1474 -176461 -365740 -181385
15717 -75784 -135649 51931 -408331 -210771 139816 397274 -80982 180290 59688 -141564
15706 -116038 -107056 -48939 -160313 123316 -103886 226401 21666 -228947 -405877 36702
15695 -139995 197198 -206153 37865 36954 54377 91736 -160018 139423 185678 160613 24997
15683 -104684 5486 35488 -341198 -31139 205444 -390707 -237096 -12150 -47975 84643 -27994
15671 -129975 -54118 184492 134337 15792 134013 -31690 -105034 25069 80921 -230581 20886
15659 -125466 -96261 -13011 -140817 -2309 -55240 -207800 -202549 20522 59793 -159528 -33849
15647 -221156 131635 159143 71970 28980 66757 -62015 -79257 -248821 -82902 68696 -37643
15635 -145373 -112371 -10488 96194 -85737 -56842 -24928 -258798 -159985 -25145 -61366 9617
15623 -52458 233817 -55726 50462 156959 46317 43408 -85241 212296 -187538 -112939 -132105
15612 -132105 -118824 -109023 -51142 -103977 -250211 -131052 70404 -169564 -10311 -135561 148792
15600 -116071 -51506 -136976 12214 -154981 -99509 86163 56835 227639 90663 -85000 198665
15588 18147 -185400 42594 2008 -147302 -333721 242642 12372 -170275 321 -101087 -47476
15576 153275 -78669 357004 238011 73437 -180754 -184868 12876 182621 148962 -116138 283663
15564 -56398 17011 -49686 85844 -43680 -62806 -50706 4407 -231533 -38288 117633 -317346
15552 -183479 -237246 -169141 70021 -319 124007 -152136 -207421 78989 -222658 102572 14034
15540 143091 -59700 -38985 128283 -29030 -299048 144081 -129664 56575 -132307 -116628
15530 -116628 -38657 274219 -268267 -240570 29204 -131790 -266791 95888 65634 154246 -36204
15518 -30432 128157 9822 192944 214091 -24644 -113825 66130 375725 245279 -105915 -153106
15507 -153106 342132 -174268 16654 -358031 132352 227949 483820 145684 114339 -28712
15496 140754 -158919 -148296 163728 256772 -250172 109406 170970 -44976 87232 61846 -169958
15484 87031 140729 244306 -237182 380205 75580 -10717 162293 150416 -316012 -102384
15473 79252 -105127 192737 -77310 65148 -406701 272346 -146132 229892 70035 23084
15462 -2567 254573 44548 -168480 -71172 33902 205089 -72923 112059 171921 -121037 257690
15450 -235493 36471 -141714 -191199 129793 57332 75522 -48993 12770 -99021 205190 -133586
15438 52248 -311398 -123212 -26518 -123031 285052 80150 100486 -232975 196465 -189474
15427 337271 81265 -26520 75160 -33392 -62480 -417106 -24397 198514 -63194 -60043 -111410
15416 -111410 7173 -27436 -112030 -279540 -96699 -308372 -181904 73261 -19289 17146 -202439
15404 -189281 70157 5323 27819 -199656 77735 139999 -36205 -220329 96098 -221681 51818
15392 -22731 -46071 -19052 -24321 -29667 -282173 46209 -30060 -199332 68629 -465824 -152393
15380 -8959 -254057 215996 -24790 33487 -149312 -278095 -163305 -20600 -100398 -240474 -52490
15368 -199318 -133688 -80360 -59624 -73187 200783 -202749 19685 -43355 -103322 -34371 -20541
15357 -20541 161437 -67944 -53755 -85291 82256 -25744 6361 -6707 98961 82503 -345387 -64473
15344 -79545 78617 -144623 5229 60181 122168 2366 282507 -231551 -73796 -322584 -207561
15333 -207561 -14399 57249 -188820 -79105 -88623 -195790 -27035 116111 -20666 -58334 72294
15321 79107 -126486 271260 -49591 283750 94431 412632 98289 -234260 -250652 -156193 -8783
15309 -56871 332643 106476 186432 269843 354104 615380 -68978 89358 4806 -45078 -100072
15298 -100072 -263726 -45903 163289 383977 -122485 14274 -167238 -122451 12768 64643
15288 64643 413120 -187009 -221364 35927 30088 393377 114718 361132 -162770 -27301 -175134
15277 -175134 -35621 45503 -5909 -189585 57772 -391627 343054 45729 -261585 78462 10128
15265 -50997 100682 -130539 -53923 -106124 121392 -108843 94424 -109393 41399 370635
15255 370635 -57472 171216 238702 123280 106224 423343 754578 1102486 1167867 1040931
15245 1040931 1055615 332011 155702 201307 201306 175441 -109098 346153 78443 -9364 -338841
15234 -338841 213298 -160008 99680 107344 -305766 15396 166774 251464 -68003 146774 -23310
15222 81629 266307 -184095 182909 -61335 41495 297258 164519 -143712 176824 32116
15211 20006 329497 -164999 277471 -37144 24886 139581 -81092 -160135 243874 -119026
15200 -149793 302511 -312800 -240467 196017 59065 -5495 102991 27843 46140 297822 246203
15189 246203 -227127 -54679 -18039 155905 242468 130999 123849 179463 38432 183980 62129
15177 160515 163314 135959 -110533 28482 164835 468774 239995 209782 249746 353873 -67714
15165 -305756 206020 99676 152292 468083 -198020 -48967 19466 154196 -41136 -99515 323650
15153 188680 108776 127583 18991 -62050 71704 29014 -28381 10269 189912 26153 244042
15142 244042 245986 -119934 199828 107050 -48947 82849 232180 -79130 273777 -62904 180816
15130 -75941 -99830 10009 36793 421106 46666 331863 334504 124501 111604 367228 -34053
15118 177283 162752 -28294 161056 136275 311676 -79252 -35405 166089 124615 43695 -157043
15106 -186658 222794 161914 -62995 487662 111616 115996 82340 -29572 -40330 -107885 394589
15094 266551 -112042 -51929 239950 360289 -85064 -16918 -164344 298519 -91543 -24459
15083 142466 -153532 92143 -94643 186481 110277 178588 99806 -232455 127444 51504 183664
15072 183664 82231 143324 159425 329495 20076 48268 131030 66180 50464 120785 3998
15060 -20021 -55220 118671 384146 131203 379323 -83500 133115 147722 123890 297817
15050 297817 -81081 213403 113705 35270 124949 -172348 137449 356196 220749 152937
15040 152937 84223 187788 237440 63039 -10080 -154957 315365 221377 -206850 111031
15029 192927 223492 357439 -129231 86917 -258243 303877 299084 122523 458755 104866
15018 376023 -78925 224702 222644 537703 313432 -160208 142992 277187 347005 169065
15007 -92747 -57603 440160 337848 329011 -51387 157298 -38255 67785 26786 377932 178900
14995 -51351 259089 96489 -145967 -52468 318186 524377 205892 368437 501833 387585
14985 387585 38029 -64873 147522 400625 132448 273731 117818 -52174 145320 557774
14975 557774 -78983 224564 216633 208110 394452 69029 120347 152659 186919 275523 105371
14963 232766 198076 330166 -240539 231505 321703 311457 -177566 187592 467485 310730
14953 310730 118364 381275 154624 260504 241879 215965 257289 -144007 166965 95703
14943 95703 181365 81457 23904 -64028 160410 124606 341283 110570 -148123 219574 370277
14932 370277 236079 200486 212091 286827 603210 281791 -26081 527377 35941 -152404
14921 296116 300179 379978 500988 247852 351379 -15781 89116 80652 44655 19319 484626
14910 484626 469266 426336 205477 413818 373032 220981 129128 462978 148492 250186
14900 250186 254437 150650 253845 443091 183511 -51309 108626 57652 139925 527712
14890 527712 242325 373993 336991 372611 -10558 578330 288308 467982 177689 364500
14880 364500 282290 134281 634309 117944 265330 316979 336467 78433 198341 26397
14869 598183 -393 487125 320438 481873 42003 546767 416594 174957 601907 472114
14859 472114 647265 307292 296481 654264 446668 308810 376882 319051 184399 -85544
14848 534204 353643 363684 642267 107129 420255 402162 299550 38775 216505 376260
14838 376260 404387 263564 417996 366037 678891 395625 454519 703540 112642 456999
14828 456999 296426 474825 192688 420535 433202 795502 554454 441633 427981 124641
14817 618898 585892 264948 503446 643802 203014 120369 234076 222182 592811 544064
14807 544064 374567 388858 505739 321996 464324 552078 551797 544889 690791 636584 255804
14795 167346 280561 398779 236085 605180 352693 523330 250404 560051 388523 705356
14785 705356 227819 325358 559100 205279 539286 530927 388782 259260 363409 515076
14775 515076 366479 573684 720015 589487 513915 444125 514502 414140 316325 533485
14765 533485 634526 558228 616818 525151 468912 574974 483337 769905 650529 104446
14754 506563 523122 628076 393149 522328 494826 636510 638451 749524 310722 458802
14744 458802 659182 741081 616331 387556 700982 395700 523828 533152 718880 850283
14734 850283 434772 620737 496537 483664 357102 689890 748610 989375 756784 549204
14724 549204 633820 780886 688485 542504 720806 438603 814265 454630 430780 733630
14714 733630 739802 659436 578512 659262 605526 869732 670993 446466 828640 475507 704049
14703 704049 372562 754958 599308 519649 841236 902648 907487 944110 554595 746019
14693 746019 785475 681581 562543 959449 669616 689534 778322 633079 651475 965184
14683 965184 707039 828949 1042207 711731 741332 693628 859551 524645 846756 740744
14673 740744 709369 1041862 801795 923582 678115 1005506 650412 843134 826456 806302
14663 806302 749086 818249 1136177 813042 813141 1095490 1207047 610399 904462 693370 1006105
14652 1006105 1239080 726030 929380 947845 752176 775403 1279498 826541 1039389 884289
14642 884289 1166800 1071228 996802 1108668 884899 1048391 1230351 544080 1063321 1354189
14632 1354189 986956 1266856 1452549 991710 1442598 993851 925959 948309 1210707 1361082
14622 1361082 1089499 1203017 1375753 916613 1105951 1290552 1472212 1516209 1397782 1522871
14612 1522871 1460162 1482648 1019986 1219749 1430208 1094266 1137588 1199412 1288733 1240537
14602 1240537 1527178 1571137 1363702 1228917 1762003 1355125 1315101 1360824 1492928 1680011
14592 1680011 1658630 1627185 1514433 1321633 1454939 1671188 1466796 1506303 1552600 1200504
14582 1200504 1489493 1549168 2033119 1640441 1328162 1572956 1615618 1679898 1837205 1764051
14572 1764051 1955608 1838640 2002239 1691049 1665869 2048590 1963056 1830728 1975356 2022486
14562 2022486 2152613 2224849 2393997 1994806 2240516 2601218 2659163 2690609 2739654 3073374
14552 3073374 3369831 3718566 4785117 6659676 10761036 19285344 31236558 36923255
14544 36923255 23332468 9913767 4225195 2838253 2284057 1867277 1746736 1599196
14536 1599196 1841149 1713703 1675869 1732053 1802436 1618742 1803763 1885197 1859303 1827045
14526 1827045 1848434 1914700 1863489 1623805 1691199 1849201 2167677 2001924 2102712 2225986
14516 2225986 2219251 2104450 2327613 2315832 2147821 2288505 2112821 2791678 2203046 2218759
14506 2218759 2367334 2308535 2101490 2591593 2640873 2520398 2679060 2747912 2472218 2778320
14496 2778320 2670119 2832288 2611310 2725515 2681792 2666528 2729132 2562950 3041200 2788313
14486 2788313 2878172 2953142 2930880 3061053 3083773 2891433 3131925 3187208 3365271 3095648
14476 3095648 3218471 3264708 3147983 3488373 3542251 3623992 3363314 3552229 3704139 3813737
14466 3813737 3675855 3801063 3749383 3868579 4209453 3914920 3889429 3883539 4488982 4579946
14456 4579946 4263104 4204725 4197653 4412170 4312218 4671191 4658520 4510331 4583312 4724697
14446 4724697 4787461 4713335 5053193 5018976 5219899 4929621 5031118 5105527 5146002 5008125
14436 5008125 5425292 5530707 5275443 5477373 5630579 5678592 5570093 5640578 5654609 5750571
14426 5750571 6134603 5847968 6110304 6446036 6235264 6616679 6642716 6652587 6623560 6461058
14416 6461058 6852622 6837909 6978467 6907877 7325132 7254537 7527503 7812701 7667135 7901730
14406 7901730 8143984 8142918 8345773 8228884 8105479 8184046 8355651 8501473 9060838 9034245
14396 9034245 8938780 9466715 9545402 9681525 9637296 9971402 9886944 10551823 10602280 10471562
14386 10471562 10789085 11062647 11023311 11426742 11778804 12027061 12249032 12184127 12439960 12770111
14376 12770111 13081390 13374237 13375735 13972187 13940002 14182544 14649049 14672802 15326667 15685892
14366 15685892 15881807 16484757 16243606 16985332 17200694 17434170 17824360 18465980 18788673
14357 18788673 18690910 19797725 20097486 20408222 20984174 21522888 21969635 22608690 23014490
14348 23014490 23574358 24241653 24614321 25617243 26234202 26846707 27408788 28339590 28981861
14339 28981861 29963118 30805768 31629248 32340971 33597050 34651181 35367310 36431331 37758161
14330 37758161 38648740 39821208 41532790 42482945 44063747 45156649 46655452 48350488
14322 48350488 50281101 51902266 53848014 55545028 57570338 59813600 61748808 64475232
14314 64475232 66919241 69954951 72747427 75769897 78510395 82051774 85387088 89115694
14306 89115694 93597317 97418239 102114741 107035637 112136186 117800782 123332513 129606222
14298 129606222 136041897 142988103 150490779 158655379 167321715 175915222 185504901 195693960
14290 195693960 206253555 217887745 229797145 242389213 255983820 269742110 284131145
14283 284131145 299417772 314699343 330353953 346229665 361614314 377014502 391689970
14276 391689970 405333861 417245922 426885620 432059261 432531997 432376574 430086460 432809028
14268 432809028 433571491 430993456 425982759 417464904 406827930 394621002 381664247 368498270
14260 368498270 353463248 337414777 321275499 305056921 289663097 274973022 261234920
14253 261234920 247088570 234338071 221393677 209548469 198594057 188087973 178238470
14246 178238470 169100438 160775433 152572230 144912812 137737728 130809013 124668307 118706434
14238 118706434 113760273 108626347 103222612 98518509 94470370 90500938 86616175 83293198
14230 83293198 79589592 76689069 73292768 70048598 67757327 65103995 62700119 60261201
14222 60261201 57918262 56156188 54050834 52481287 50522918 48477534 47250045 45449348
14214 45449348 44161671 42922191 41671967 40318770 38888092 37739315 36783658 36249971
14206 36249971 35065839 33845125 32998928 32054906 31097095 30572418 29448495 28803119 28155331
14197 28155331 27165514 26648651 25786075 25113039 24802537 24050081 23452057 22780748 22247375
14188 22247375 21620754 20767643 20554008 20318084 19717845 19333370 18802520 18601302 17849909
14179 17849909 17720752 17321678 16847824 16445575 16132089 15662719 15525274 15298807 14934669
14170 14934669 14674045 14097864 14116968 13698584 13784737 13374292 13146272 12948323 12569545 12409294
14160 12409294 12083794 11816432 11632226 11737604 11225960 11145866 11152976 10555755 10870000 10264147
14150 10264147 10038887 10335588 10194056 9607763 9775684 9530553 9512608 9282819 8847978
14141 8847978 8863720 9100033 8637212 8459537 8358408 8124172 8236700 8307269 7675890 8081361
14131 8081361 7610256 7467107 7429670 7369804 7370517 7203513 6972106 6972061 6820638 6617196 6943315
14120 6943315 6322592 6680719 5922153 6304242 6350822 6103156 5926850 5801895 5839588 5665056
14110 5665056 5703665 5604651 5597181 5742938 5349936 5621042 5470288 5213142 5260602 5279851
14100 5279851 4839972 4947487 5041873 4818302 4888625 4930023 4844550 4933848 4928613 4646577 4514725
14089 4514725 4392263 4116098 4484797 4426518 4099830 4248848 4229843 4073940 4095571 3958529
14079 3958529 4025443 3997123 3803133 3837445 3851067 3809819 3513059 3574068 3959098 3567580
14069 3567580 3595487 3710831 3579168 3582138 3641368 3383018 3628104 3217018 3578063 3494427
14059 3494427 3340584 3467377 3191387 3196301 3421293 3194953 3089208 2628770 2971217 2831430
14049 2831430 2882320 2918546 3227305 2929946 2774925 2578166 2904023 2681983 2937444 3098205
14039 3098205 2486258 2759271 2566583 2773011 2605453 2623157 2437094 2652831 3028626 2472557
14029 2472557 2685378 2240728 2541223 2390693 2638896 2173878 2236847 2482095 2040785 2615451
14019 2615451 2574781 1947540 1859732 2288611 2344493 2208411 1922041 1954458 2006342 1941568
14009 1941568 2034356 1735604 1987731 1924586 1909756 1829845 1949322 1972834 1701014 2035693
13999 2035693 1866965 1919106 1581884 1980379 1658431 1639682 1843433 1494265 1892434 2140687
13989 2140687 3112417 6277357 14090057 26865540 35760628 27285952 13262110 7268501
13981 7268501 5509020 4128993 3774331 3218203 2841949 2855239 2172102 2112092 2407938
13972 2407938 2029909 2319072 2004302 1989381 1906559 2005210 1652830 1594537 1902422 1664167
13962 1664167 1771573 1867149 1737206 1758785 1748590 1813574 1870684 1875436 1360409 1461565 1737101
13951 1737101 1532203 1942982 1609713 1776886 1246140 1654956 1698504 1428304 1477389 1527644
13941 1527644 1430763 1410356 1313272 1698278 1224991 1383572 1561338 1150834 1531459 1461298
13931 1461298 1343103 879899 1474789 1406031 1379285 1453221 1140297 1181253 1162343 1352955
13921 1352955 1373159 1363514 1372072 1409160 1298539 1340490 1265944 1134331 1238061 1265133 1233287
13910 1233287 1486004 1322356 1452712 1255769 1072280 1051293 1267367 929181 1052649 1347669
13900 1347669 1360672 1196048 837256 1128812 1140179 1026829 1149604 962617 1107067 832049
13890 832049 1146757 1218264 1096165 1167622 839136 988244 1108685 968835 840762 1153864
13880 1153864 912974 1076807 1164657 798835 891313 890587 1062740 994482 1071098 754745 1147450
13869 1147450 668011 886997 933917 858348 746723 954036 1046869 726897 1200258 1205131
13859 1205131 782798 886982 1141043 844358 789647 670338 910734 799371 762791 718073
13849 718073 782662 801603 928331 858763 741759 567003 974528 586431 630794 953373
13839 953373 627358 604821 959024 885958 769020 1084063 666592 677428 743342 474998
13829 474998 764458 575247 978323 617068 947176 887174 401896 755581 538756 955540
13819 955540 467637 781289 550669 1215858 595944 463805 663937 821370 623206 602199
13809 602199 660681 511517 790222 479097 437337 743167 707273 464044 591977 649109
13799 649109 566234 934524 734903 557461 788303 469816 676605 573845 513893 636761
13789 636761 774441 727584 654284 692843 641093 367385 601454 600701 424547 662973 471426
13778 471426 744632 423362 555359 498801 523761 1000355 777528 1033755 549018 788136
13768 788136 645360 593057 225900 670727 372968 581576 267759 984096 651370 403259
13758 403259 665603 532271 665976 546865 570278 600686 339062 566467 648512 562619
13748 562619 600634 714387 511299 295188 461253 541794 579907 605197 417001 605527
13738 605527 475338 612923 417069 434091 433338 534586 557804 564249 655499 218023 315638
13727 315638 299781 587127 454506 453803 368741 282190 520903 372397 403243 432295 172271
13715 422874 630681 435558 553337 316459 708700 182708 682462 633108 363862 634486
13705 634486 418068 520191 361606 447128 222919 392238 240493 591132 353495 353803
13695 353803 581124 624126 474634 223344 473797 370304 705029 446812 382920 499193
13685 499193 508450 588591 284093 394672 299643 453134 456132 314494 410019 273721 115881
13673 461759 587500 249920 137981 453295 441360 526411 53301 59914 389030 545806
13663 545806 379445 243261 137060 483224 420167 658996 333988 515153 472637 263093
13653 263093 412648 250684 282099 586851 233760 462510 315099 371658 176742 249672
13643 249672 242188 519323 293690 414852 510085 -61187 293491 14612 136548 478229
13633 478229 271326 188180 252622 342017 515583 430388 213393 120462 366209 300273 370015
13622 370015 358350 348756 284765 398918 52645 226323 493023 522826 78783 156100 -60002
13610 628061 237816 491645 231925 55215 243655 389826 221145 607534 151649 539107
13600 539107 316268 47036 550138 329577 -219778 347773 424349 583223 9605 46135
13590 46135 411408 91361 65121 683983 31097 218181 -29333 158151 435773 652435
13580 652435 306743 122645 45815 491716 335195 250601 442677 436119 148504 388995
13570 388995 211319 428706 601485 383208 514258 -16306 57625 234855 199763 124078
13560 124078 586853 143333 347694 85948 262789 -47859 468124 113761 141024 388532
13550 388532 280991 365988 -29708 522798 222595 272427 225269 169981 339034 49232 -21571
13538 463168 24839 351310 64913 210331 121354 345398 269983 309884 206544 186638 125582
13527 125582 250096 205109 104816 56891 -82242 412748 342 197152 216608 203887 74374
13515 106853 409657 517063 -20168 197065 287436 40763 191315 18125 217485 267769
13505 267769 500816 26620 293150 267996 103464 228500 -58167 106217 228970 357296
13495 357296 -78904 263404 503843 152984 -28507 125243 251629 211031 441791 -49937
13484 584212 156011 248541 -115133 474314 27999 1272 90997 -91679 192111 128192 300132
13473 300132 576486 -58212 185320 386012 -326795 462799 224544 -44878 435440 485220
13463 485220 -99374 -33366 497429 309605 280959 110162 225851 216807 417714 -155148
13452 399313 247865 217477 276312 364175 -20817 156440 374499 317241 217978 45025 174019
13441 174019 248717 172089 191941 270778 -180313 36256 187419 142529 147634 256644 372072
13430 372072 288858 58980 129629 105244 48242 147518 -84219 400742 210693 94615 69092
13419 69092 290895 389961 355633 93393 7794 126656 270825 404445 356739 -28058 -158780
13408 -158780 -120014 -26405 399059 -180237 69325 170266 -86708 249913 146834 138421 456721
13397 456721 283181 143052 285880 577618 11134 1898 -42195 61117 15912 31839 540504
13386 540504 325773 380536 142675 -38124 362288 56123 28945 126615 97771 19686 235887
13375 235887 205769 216063 482650 165240 105887 138569 -68620 276869 19468 289203 227243
13364 227243 314015 128567 192794 17658 351917 -4265 240137 211475 137265 -39804 80967
13352 459504 363662 -149661 272385 375902 240789 83371 239003 193734 391915 298356
13342 298356 287266 315418 235639 147198 330738 -286865 414998 59743 -83101 194458 144246
13331 144246 -79473 89075 521150 245185 239619 -16733 480147 58512 205735 132124 -2856
13319 439410 385538 238865 59737 250475 119815 60922 251269 363883 349904 91048
13308 226584 53917 213063 383886 95656 55870 -11942 123075 121470 16956 5741 -38009
13296 373193 25827 120294 33351 296851 352849 321545 510046 23913 75095 57763 -9259
13284 185309 259196 -131475 235785 258990 34468 167049 235008 317350 -176820 89910 28273
13272 -113099 186421 -65799 323289 362559 159519 -77029 -21169 101619 87389 233207
13262 233207 167134 117886 -250802 126558 -51385 236951 -28865 175521 181020 175756 80712
13250 85938 -231738 207382 72244 187497 177810 166614 -100385 178804 18810 210556 -401043
13238 319592 301687 -42842 23813 -196468 -28742 -127956 -55751 -89775 199698 119863 -96468
13226 -39177 235187 73016 187844 141666 -237267 127070 399826 -6914 -21471 22900 -268526
13214 194025 -7757 277065 11679 228636 230789 -87573 323597 -67300 6417 105849 102842 87990
13202 87990 584623 173921 37339 19280 177510 291909 319941 52636 124090 410086 -97926
13190 473254 -151038 15766 -213510 107195 -40413 270093 -252598 56105 164341 -142824
13179 96011 -32531 -208062 100069 313430 279885 193113 101781 -47606 97029 -196648 -157978
13168 -157978 -40649 -132121 -162607 103468 3533 -189627 170832 263160 -107463 -57854 93609
13156 179244 -91029 203392 -138782 110145 15778 40180 190007 415112 -24598 -284720
13146 -284720 307600 173221 754048 174584 95177 -90192 -36813 -155897 141342 -70863
13135 137676 -316414 224543 -199236 281109 -51598 252637 -61766 170046 -97503 281130
13124 -113743 -81700 66002 211906 135323 -120779 -241769 -155897 -146818 56068 48249 104793
13113 104793 -191936 139414 -28720 34036 142801 189759 191046 89723 254705 310478 578668
13102 578668 -332175 183265 -79419 -145471 66432 -47602 265037 247649 -173315 -91652 97738
13090 118252 -93420 109833 194498 307503 -122483 175453 121980 285386 -42743 230089
13079 189815 347668 482970 77243 -214316 -121642 224903 47537 68000 355632 6659 17176
13068 17176 37558 -28989 165631 212447 181625 270350 93855 -358574 236693 120315 390722
13057 390722 218735 17342 95825 337707 146100 -176166 -88969 72453 111617 -123884
13046 155907 -191002 92518 210104 224273 148436 -241150 126225 40510 12855 -33708 149034
13034 244941 -53889 18563 98518 196173 1152 69381 201968 -70317 -333737 -445730 -311829
13023 -311829 113644 166199 21525 -159780 232794 13006 149080 18046 281409 -22365
13012 311414 145468 217475 169184 -64962 83735 -98781 62137 18269 -150031 -135833 103558
13000 -123482 -204552 542619 -54522 118911 213761 200808 -340289 209941 -133389 60345
12989 378767 -102570 178547 -118546 454508 -209039 -21999 13366 123650 -121736 -149240
12979 -149240 34431 -108944 153935 304635 56256 139962 -60626 278432 11783 94554 237034
12968 237034 90629 281952 66758 -9273 124022 332631 114835 87237 -50333 -121840 214152
12956 -172932 -111622 2907 100959 91572 -137439 349727 22955 -102229 89623 36879 -181987
12944 235220 -169361 -196556 168617 -1821 403340 -47558 343658 143756 205217 -68891 -128448
12933 -128448 -43191 212818 -52159 213043 101772 -71003 -21927 166391 204098 -162333
12922 -173188 -269572 -196722 -116577 -182422 77179 -46800 256616 18921 1456 -245676 -181728
12911 -181728 110352 72637 -18123 -148139 256394 -296487 47016 305400 -260610 -200607
12901 -200607 224991 -50488 200023 91558 -30672 272241 246042 -18438 -325985 -27747 75015
12889 -117702 220677 548560 392348 239284 -50098 -7296 137969 99191 -180900 -149310
12879 -149310 -210507 -467808 46829 -124262 5793 -164854 131471 365506 -16658 205451
12868 222164 -34726 -165057 34019 -424879 -137136 269351 289548 110232 289310 -6658
12857 50149 168894 -82436 46625 73208 -264498 -87111 -65820 -101230 -106163 -337683 73458
12845 138975 161752 245152 -45617 -67535 -181675 -18038 135195 -24404 -22095 163238 144474
12834 144474 -163843 -251896 149605 167599 -122972 83552 11708 -4653 -118203 33331 -123608
12822 -56053 339106 -29804 226809 -14773 -30820 -294218 -98129 -179706 180284 -42567 62930
12810 23887 235748 5048 -84398 -79339 30948 184108 -79919 -91257 -70532 -11094 107364
12798 237148 43399 -83616 -263722 -106665 -185895 -501 -107472 -3246 -254902 89476 -144867
12786 -188509 143396 -98116 52893 31480 -77919 145891 -318904 -118777 90607 -75706 35022
12774 50723 -52873 152984 257836 23512 -63371 -33106 10457 -124867 133674 -268097 -84933
12762 -45994 25156 -89224 -13334 187410 25395 -60569 -3839 -58220 212022 -215391 281225
12750 150813 305782 -129740 189831 -82574 175642 220765 311344 352422 -132986 82126
12739 -89045 -256666 -111986 55053 -19611 55788 447050 -123765 -58869 29519 488070 -219090
12727 -142251 -5370 -19411 -217846 275970 2428 -60209 116932 -62359 -227126 105850 192269
12716 192269 255293 -120313 -70906 -100341 255462 102666 -50546 10902 165485 82489 358602
12705 358602 75163 270374 193840 206177 90740 61639 126345 -52998 147505 -96814 -321518
12694 -321518 183115 -11183 -149479 127121 -6728 99448 -22951 -194118 -116034 174447 -144249
12682 -328005 53926 160910 21580 125422 -77524 157453 -5217 260381 92529 133440 88929
12671 88929 71982 323470 259697 -22103 -53838 -54481 -176580 43790 98796 145093 314068
12660 314068 -94778 209532 113131 309240 -70354 -285101 252402 -94055 44556 -71176 31713
12648 -98300 67475 -11179 -79035 286144 194569 75903 -57753 99847 296797 -12784 -24061
12637 -24061 36953 -65863 73244 62151 47032 144773 57327 283070 331919 313214 -5117 278312
12624 121216 463481 50548 366395 -73280 312556 -22095 155341 22752 -302104 -90098
12613 149106 -118085 -104639 53196 -80064 -66379 -3811 159273 288409 -313108 -18469 -92129
12602 -92129 276241 183398 -142724 212160 102167 209755 -202149 85601 -494 -146761 289942
12590 136730 48257 -136875 -267245 288560 -96827 -10478 -361697 215702 41604 44169 -38588
12578 264579 57312 111829 46680 242472 68971 -97491 -69346 28154 98676 102312 -11322
12566 -67619 -45830 402760 -168942 -10165 -125009 242828 73009 515066 237293 -538915
12555 -58742 -66543 69343 -111022 112265 111452 -130882 -46757 -146482 193861 -152503 278689
12543 -263574 325338 181090 226757 -74147 -167536 261134 -55537 235088 -58210 -242442
12533 -242442 -152528 -273328 -206831 141941 358975 258936 -192314 197564 -174447 162153
12522 137120 60584 -134024 108603 -90627 -140816 -31285 167536 167988 -17786 -26951 357772
12510 -284454 23493 9251 -239417 -163329 -57193 36602 73144 202618 -3959 -51405 208634
12498 207909 -102653 -108206 21082 75158 123143 -203539 82908 -360960 318577 181422 -47731
12486 -88852 183432 241619 13134 -198089 287491 -100138 -125971 -53063 -390479 -458491 391710
12474 -49600 -172670 13785 -187849 37833 256614 -204536 -154206 -440499 -238685 334448
12463 215027 -16210 158665 332777 335496 1035 -176019 -264734 162054 197157 51453 -148774
12451 154592 226947 -127022 48465 -209082 145196 -39801 130668 125671 -74415 408767 -151392
12439 -3407 210290 90713 197865 -83667 -82848 -249454 120917 -134215 -102564 33275 -310230
12427 -76175 258359 336679 237975 -40364 294722 -360852 221311 91586 -53996 453627 -236109
12415 120672 139741 -78657 208826 26825 -15712 -37076 28748 217782 -158950 -166846 178415
12403 216319 17887 60189 -17391 -185272 164672 108838 -160961 -19376 -153844 72669 -453022
12391 -379593 -528383 115130 14035 -823 127392 -52631 38943 236296 123323 -77782 79405
12379 230622 -47398 6365 49357 171346 -231799 -6137 -363700 104001 125843 150001 27787
12367 -69354 -22555 49455 -53239 -267165 -24828 -279017 -67392 -66858 316138 -292487 -3063
12355 -44945 -7977 -123412 233927 -47066 -220314 -130696 -132148 -39860 -77115 119613 -114394
12343 -174855 -144422 24407 56681 -38207 -73927 167145 -147918 -133232 368979 -251887 -291050
12332 -291050 302142 -313051 -98625 -89490 -126003 -133537 -152115 -144133 98806 9193 20945 -141976
12319 -188620 -94126 118390 -82358 50329 86941 -251177 -62655 -295094 146776 140380 109704
12308 109704 224559 42449 52789 -148156 194336 -140935 105321 70750 31818 -234715
12297 -151371 12022 82490 55622 -41086 79634 376304 72306 327651 158180 104068 600824
12286 600824 -76225 46008 103850 -173468 -4890 116862 -67713 -46593 271317 -9411 171879
12274 189800 329590 224537 279755 53774 -156908 509895 150279 224859 -304868 189883
12263 351398 236006 -20417 198355 33 -27734 129932 110391 -30802 203000 339683 386096
12252 386096 96086 146237 142256 -199039 173768 65435 69378 138164 47507 -373537 88468
12240 -267775 229708 -289091 155980 104539 235989 262348 -196446 85480 66225 192315
12230 192315 301515 240554 364695 -46726 124133 262868 148089 188736 309959 41671
12219 576294 -165483 261923 238580 145960 27340 -22659 -136477 37744 13035 -80443 -64967
12208 -64967 265025 157049 -28940 339331 406890 644095 63449 22328 385347 183870
12197 186556 429265 11607 148675 151462 131120 155735 56784 -207571 -142919 521180 157443
12185 -192623 141599 -248563 7802 186944 126201 383120 262250 82549 219881 -90977
12174 445064 66194 -158383 33263 128412 131481 331911 123379 59475 245970 633630 -17602
12162 -3275 -181397 -118368 218361 89864 148205 -49720 503836 79209 154363 -48779 299241
12150 198822 -128694 -97313 485481 48470 109319 77050 56384 -120729 -149227 96766 51098
12139 51098 30356 31839 26992 -129485 274970 11405 143234 -117131 199704 -202290 110313
12127 -67503 -213953 100891 18417 183899 8901 -63199 -67069 306692 117931 -26354 -125657
12116 -125657 159561 -292378 -276248 292097 -51149 97199 97598 61237 -26616 200004 -49307
12104 -396596 112781 16907 367415 200104 -153922 -184827 -198403 -285013 -30815 -528577
12094 -528577 -79920 96268 105978 107635 -107022 -35931 -145445 311354 -204374 -314339 6167
12082 -137860 -184664 39174 162400 177649 -311524 -158227 111236 61756 -40535 -50123 419493
12070 1198155 1387885 1075458 175260 31118 363384 93618 281044 256245 -190351 186427
12059 57948 -219864 -225000 69072 -415814 43968 -256328 84066 48703 -124945 149428 -91289
12047 -214130 143811 53831 -2027 -188492 -81373 -28585 -24062 150812 -67250 17372 -175565
12035 -193875 -138514 180837 112456 -43489 -263962 189309 121086 20632 -97071 127631 183724
12024 183724 -46807 -60339 256794 61918 -349007 248395 554247 -164785 -43111 127094
12013 260731 37790 86653 88019 -310847 118326 -187058 39328 -288452 66118 -39040 -9826
12001 318908 65451 -51133 -144924 -385962 25979 -12886 -100281 -142740 -90000 22246 -40437
11989 -342122 34698 -62473 133415 77561 26021 -17397 278067 -34005 143973 -9235 -7484
11978 -7484 170401 -128041 -54210 128764 -282088 -167735 -99053 -213676 -261505 21095 57006
11967 57006 176570 -43647 -201505 244271 -35228 108633 286371 -62065 100768 68590
11957 68590 222434 139137 97111 55892 -17126 226160 -285958 -58576 -96553 -239259 65701
11945 200429 37947 -222783 208063 -170804 -139856 -46331 441345 -311455 -160752 29027
11934 -72850 -13738 125999 20533 208093 199044 78040 127330 7829 -87012 47588 121011 -14726
11921 -37334 271288 -142290 51544 -101928 -262742 -183591 230469 170051 45973 -113436
11910 -42853 -87244 -202124 -190546 -20332 24718 272575 -36157 -202459 159507 64047 -321925
11898 125498 -308887 292533 66750 -168446 140906 -120850 -141209 -181545 1052 200165
11888 200165 -275192 -10168 -368954 95860 -197795 113873 -53339 219117 -280705 -305907
11878 -305907 191273 13267 47602 -69558 -214949 -106662 168897 161128 -329197 112097
11867 -169333 12750 -49315 164796 137673 -247661 8389 -132943 -5766 193461 -101640 -238466
11856 -238466 -55537 99511 133156 -81018 -200065 -97391 47376 189762 -394174 236134 -117241
11844 93989 126679 9319 90914 -43222 -51511 342325 -96318 110591 -250015 197630 -122631
11832 -36783 -162523 -94977 71744 311 17368 21690 -145790 -154014 278419 -38902 122709 228083
11820 228083 202917 36096 -250022 254740 7401 90885 -238138 -360863 140698 -100735
11809 -555339 125859 -75316 96240 144535 67942 -132244 -37641 -44153 -149745 -63875 -136524
11798 -136524 -117495 129084 -220888 292286 30012 72182 -358474 -28306 108233 -173074
11787 13019 -100665 -6974 -46382 -16745 39919 -6447 -124580 -16262 37196 -129103 -263036
11776 -263036 -140793 -111834 -100519 -49712 -9500 -294781 149924 152461 174952 15706 -97456
11764 -41895 -137054 -152475 -23253 -38352 -88228 211067 120241 60490 12116 68998 86199
11753 86199 -16610 102937 134887 92447 -71156 28389 300699 66814 226865 148407 -209965
11741 -73917 -174641 570 -351833 -243321 165253 72345 -121568 362757 -71993 -363729 420827
11729 114030 12017 -58668 188751 -96034 -344674 -233098 183767 75827 21078 -144897
11718 3967 176263 -131059 10001 322113 -43923 121568 -137065 36887 80881 -28556 156850
11706 197211 -252397 -68714 -28543 220320 82683 -215643 -246171 53611 178246 -66058 -167961
11695 -167961 -120742 -31699 -292643 36442 100661 24330 -16461 -145832 -144940 -73207 114868
11683 -50336 74404 338170 111928 -219250 -76959 -48812 127649 -70545 54003 328809 250068
11672 250068 268414 -91194 254726 24614 -99927 -34587 43362 -97134 -142155 256061 -161457
11660 -36490 199765 -183249 115107 51556 293424 306389 151326 323881 241257 11733
11649 8416 44442 143048 91557 -12746 11577 2597 -2845 50053 -110615 72459 91892 -173818
11636 -83187 -335065 109126 -231651 15144 -188344 386011 -158281 91666 217325 142080
11626 142080 -57469 75043 151 114943 -129821 134408 261534 118421 -262016 -87876 -121173
11615 -121173 12228 -68381 246493 -101027 -149214 -241661 400780 -110385 -211881 -319347
11605 -319347 100809 -76622 -147403 -56050 -9233 281410 251833 197769 4801 -225398 -152210
11594 -152210 -107209 310140 159703 -334013 62673 71222 246142 176009 245547 13913 32795
11583 32795 187433 -46576 298421 -433570 284179 182301 325434 -18323 513685 -88985
11572 -8811 151376 256383 108263 -316812 -241307 -174873 202684 -93427 222361 96593 -146038
11560 -62779 -51957 -187096 190180 -11691 115521 1448 18516 64627 93680 6315 -15123
11548 216770 315139 -17524 156006 -224432 237144 292748 318797 250066 6121 -234364 -241585
11537 -241585 -23789 246316 5312 270790 196323 224221 -68324 -165681 -43742 93866 35269
11525 139360 27883 -184366 -223096 98448 67900 162473 -19613 -107351 106734 -156276 -29448
11513 159107 -238048 284931 372 102603 223371 27635 135770 181705 48901 183800 208693
11502 208693 73509 184084 100037 173132 14321 14974 19782 -15364 396713 77599 -145284
11490 90259 -41001 96620 216128 124324 174126 365490 345357 358696 230866 29378 142374
11479 142374 221095 252444 212312 100196 138955 -224437 261538 288551 32353 100448 415614
11468 415614 124075 107393 104456 17911 341489 41317 -11363 -168134 35058 276358 93260
11456 221760 -96392 223257 337297 278417 125301 -54419 35294 259107 -55658 -82634 290092
11444 44215 -192034 10985 -116629 226874 74568 147572 81683 -143214 263039 -87574 -189398
11433 -189398 208694 -264068 809 -63329 126968 189010 -86342 4563 -187391 65264 -54794
11421 -10718 132645 172662 247753 -12922 199840 -12312 -178284 -76990 27081 -438840 18245
11409 59876 -65717 269001 301837 -115273 30884 66078 124491 -6554 64921 -136581 -10188
11397 24518 -116173 -1865 4375 360354 206587 5540 -54196 -201695 72983 -127850 79992
11385 -300931 -23654 -9244 -89005 17867 150853 -166743 207833 -175683 -237480 -212705 97672
11373 -10942 -304184 183867 -230397 -120349 -57346 143514 -223669 270986 -54427 143230
11362 31085 211497 -107633 -42656 -304503 -306151 247391 468480 304746 -9508 203280 35354
11350 -205085 63139 174587 35149 -317242 -130229 186784 -199063 -83289 84917 -137283
11339 -23858 326077 13141 39982 41361 243333 -3931 -32630 -317007 429513 -53352 -59905
11328 -59905 -48587 280292 -59550 -302294 214404 107113 135559 82940 43330 205069 -112897
11316 118489 100919 144761 82757 302218 51798 -16191 52539 212588 -41379 -211864 -363124
11305 -363124 -107801 -161446 47651 325891 10393 -151509 151317 236279 188876 -414253
11294 14196 -73859 -38606 240305 196572 -85959 63701 -129141 -171212 146227 91498 -62893
11282 44384 195715 -277869 38853 169427 -299306 -72725 -84513 -155531 88974 -176356 -80941
11270 -76341 -50514 -46010 136629 -124379 16411 -87545 141588 -182305 -108562 51410 -58355
11258 -211781 180500 -246289 253949 20329 177260 -74267 22758 -309549 -77268 -196322
11248 -196322 -293969 -168958 11828 -172213 120971 205341 -149349 -85572 -50031 -114144 -33480
11236 196456 296783 110676 -211679 -8047 -184113 -105336 209704 -96319 -97233 -223392 -100128
11224 48667 -202265 23783 20255 -146758 -190863 24341 -364173 -35086 69677 -23314 -162788
11213 -162788 38283 -91338 67998 -162137 -81630 -103151 45967 216137 7716 -294332 236547
11201 -271193 4657 -57489 -281892 10896 -250212 136451 -26382 -32143 42749 -14082 -56412
11190 -56412 19008 -282342 -279744 -209314 -46644 -265121 137611 -203593 -133634 34201 80376
11179 80376 217499 -371594 100902 -21203 80585 -244367 40124 200292 -272098 -111854
11168 65305 -222880 -349509 60901 33857 -118540 126695 -167438 -270193 -87282 169756
11157 -173048 -443952 116203 37562 155990 129928 60096 -207740 227442 -86736 28169
11146 150766 -428349 124921 -58973 63784 -16462 -98881 255106 -314835 152008 13605
11135 243755 182836 121994 -24194 35141 135065 -202582 -54514 152481 -44161 -203160 266538
11123 108279 118241 -143409 -132769 145013 -304797 4712 -76560 -16664 129345 -104268 -40966
11111 294609 68780 -105759 280318 -92796 74219 275044 358047 70643 34006 239665 122202
11100 122202 180901 49977 441792 320623 -41812 82014 28256 234512 13234 253830 205743
11089 205743 309112 178207 144137 343982 271947 260986 280336 171225 195217 243666 -33262
11077 52082 326898 257124 418976 56161 123628 229854 321838 95709 163037 460201 427991
11066 427991 270682 452909 508466 161656 520365 120167 505605 732633 576203 586009
11056 586009 625709 769919 458896 846384 773696 616536 348115 695045 456503 611442
11046 611442 751129 678185 734947 911581 781716 266743 633780 645664 845544 445325
11036 445325 504637 963753 619710 577956 555775 709412 913207 972676 458225 555991
11026 555991 264689 915704 559155 602486 581540 500582 894732 522555 681779 548327
11016 548327 670181 373115 649464 402019 642900 645503 644542 494947 654712 405785
11006 405785 803511 725449 830217 721217 470356 260106 752853 868803 459888 1027995
10996 1027995 479997 456932 686936 593872 539161 825458 590165 947523 955487 937739
10986 937739 693848 689707 846707 954518 994018 1193932 1161462 1489237 1450042 1743364
10976 1743364 1768459 2124989 2594492 2673721 2724588 2651830 2450423 2401735 2002220 1759182
10966 1759182 1939779 1544813 1598381 1618559 1433158 1230009 1377530 1364533 1501415 1418361
10956 1418361 1278069 1316239 1112019 1140775 880818 906942 533934 635685 264870 285619
10946 285619 440551 251683 109284 600975 14772 183581 -256386 -3805 154280 230500
10936 230500 203112 43890 142648 52921 51868 -10598 -1434 -168694 106625 55361 86695
10925 86695 -322106 266484 122732 -95463 -253520 -6630 207540 -45163 -25519 41893 -195666
10913 422659 -149311 -151920 -119152 71510 -69191 -233875 -215682 64665 18895 32616 -82722
10901 85244 -137321 -9212 -200865 -215779 -168721 -92218 36097 54218 381044 15814 -109844
10889 -157897 24899 146003 140795 -118154 -6544 -363571 160557 35011 -220662 -21294 67463
10877 -94322 61595 299105 -154353 491681 45558 -118713 -190451 4476 -142682 111226 6279
10865 -58250 48042 103883 7301 -79275 -209158 -58650 25720 119060 -202950 -59546 67156
10853 166608 75000 -76428 -384408 -43605 -54300 86450 -169418 -139566 -212359 154975 -167417
10841 87799 166788 219023 79200 -93354 128647 -318894 46046 -172526 -156847 -200675 -55065
10829 -36517 -356237 65721 35579 356059 85127 -399979 93284 100347 -50951 -74697 -78691
10818 -78691 160587 150868 -184029 311319 -23056 -143685 132932 -90416 -262254 -5799 38049
10806 200363 -247127 -168738 -270881 -46546 109883 -76878 -93363 -37879 91738 112338 235715
10795 235715 -25148 126240 16719 77208 -169199 299993 -357301 -134896 104909 199056
10785 199056 -146932 170083 97509 117881 -223968 -235305 42337 -39177 17710 -148587 281585
10773 -143116 -151565 -111832 101198 -66798 -122000 -16423 130139 53133 33169 -202602 73288
10761 -66224 -10286 -325773 -209980 148457 -14009 -211658 129675 -98838 179081 107982
10751 107982 92765 -14928 58427 45684 105187 -1281 -154635 -116620 -333451 -110414 77334
10739 187306 133926 -83371 -177692 66156 -26981 -9122 -65608 31048 23958 -212251 -124246 -14774
10726 53877 60338 -24658 135982 222719 120855 -121045 -21371 282003 -348327 -369713 -49744
10714 -72281 -141977 -104183 -77434 -299693 -120667 -147947 -232850 83037 -114199 1429 -215495
10702 153161 23056 158624 135247 -151783 -167144 69836 50331 3976 -98764 144844 -59541
10690 -111644 -4947 18476 -170696 -137104 172477 -47600 -293592 7054 -152333 -251094 59023
10678 -79217 -139371 42551 194987 -22502 -127358 -186947 169359 -46891 -326509 14232 -105528
10666 59369 81102 -222743 124107 76515 4250 65114 -334222 -37346 -125770 107236 -447185
10654 -198186 90165 -145974 198097 187978 -155921 -21301 6813 -240262 -9900 -199775 -72638
10642 -140937 39747 206483 80332 88341 -40912 -82955 -184237 55627 52830 -100856 -106780
10631 -106780 -216134 -255797 -124112 -96827 4620 -154675 -212587 464 -156823 -93160 170232
10619 -220328 -86550 -17128 -27335 355518 166374 235967 -188291 -125391 44512 262871 -23749
10607 129837 -181869 19504 -5965 -13746 -325997 236432 -121271 -13151 27776 -71179 -65387
10596 -65387 88687 -162936 -50718 -10818 -49823 -197273 -18745 -91408 38799 -71058 -308873
10585 -308873 -218895 -155357 130208 28351 4062 289212 6161 -434125 -328708 -135158 30956
10573 -46681 -153209 -119916 47038 -103677 -22653 42664 225293 -112357 -343717 168567
10562 127806 120269 -169529 -51991 -24288 -175019 -183114 2572 -138931 -52936 -340028 223629
10550 -236003 -79276 155615 152275 -93924 11068 122295 48010 -59503 -278780 215244 -126906
10538 115334 -139389 -314339 73802 -14417 160076 -303336 40205 -692725 -111176 -98545
10528 -98545 27203 -81047 -153396 -255601 68265 -265270 311652 -218681 183844 6283 -100982
10516 -38030 -184307 -185848 -85000 -20071 -207813 31705 -167455 -288739 -162341 -76528 -146035
10505 -146035 197764 -121520 -63150 157111 38060 106349 72430 -210227 -155795 309941
10494 27468 -170718 -98422 115449 99368 114612 215216 -139437 -44474 -10034 -192941 94201
10482 -27650 594881 331365 348562 552010 222956 -86822 39432 276982 54926 270592
10472 270592 111018 -50486 218171 85473 138089 -102032 537241 -48048 34155 -228958
10461 -24794 -83812 -142779 87534 -158468 178356 247996 -338404 -258396 -92383 -199945 115432
10449 -52532 -117209 9490 10432 -173488 -80379 113011 20669 -218295 31705 -249512 135257
10437 -180875 -206499 -150062 41085 72029 268026 142927 -73653 72572 130380 157046 175286
10426 175286 -418062 330325 -5827 25195 96719 -59194 235673 19109 11154 -138498 -538
10414 66500 -175995 78454 -77523 76060 12953 246288 -39579 -16318 49835 -91154 78042
10402 36464 -46939 -11742 -134667 -100786 194357 -184409 201938 -252103 274124 249512
10392 249512 -64348 467236 -34224 -283067 227630 57485 51800 277442 11358 -212546 164686
10380 310868 335100 29961 158227 134496 54245 707397 152990 389141 54159 432648
10370 432648 164765 26752 280718 637917 243256 344411 340627 95364 325800 619367
10360 619367 635496 300719 82118 68895 284827 222929 173195 65845 601610 717454 -28963
10348 764171 205065 101938 16756 355344 405088 201116 -48306 8036 20501 -4015 269781
10336 530626 236587 -83546 236754 100958 81074 277469 269043 -284888 61443 76719 119656
10325 119656 -47976 312215 191028 440185 264481 56111 135289 -116896 -44344 144952
10314 -115132 72372 22435 -42877 92962 121844 310652 -82977 146395 140812 233879 -217648
10302 203880 38951 27119 198922 108103 -251024 68596 -158576 -76130 127925 241848
10292 241848 155145 -13141 -105645 -170963 -310930 168682 -223244 -170423 -388371 -49957 -258813
10281 -258813 -383461 -170166 108778 18754 -8565 99392 18746 -273799 -48782 253174 151759
10270 151759 -90173 -52582 359983 -135900 80628 14687 263089 -16897 -167688 266125
10259 42659 29065 160786 105798 120669 289798 187164 174037 69737 68024 -27067 -32959
10248 -32959 -302061 119760 145261 -274762 -45814 -127588 -242771 -318619 19865 -44060 17742
10236 -88075 134217 135197 -66049 116176 -147073 -127147 50652 -122160 -175132 -3639 279341
10224 -224173 -122815 -93755 5371 -75901 -26583 102898 -114658 -421394 45608 18248 -132474
10212 97655 -140537 9701 -154973 29759 116341 8906 -220421 -245729 -48086 -72704 -59534
10201 -59534 11651 12039 48810 -52131 -216951 25333 -86845 114098 -318240 41539 -54248
10189 -42144 -293768 -69217 109250 138259 -169873 -62904 26862 -170147 -43117 -262022 -120309
10177 96402 33275 -314682 -127616 -327233 -213358 -197859 778 22424 -207696 -83364 45004
10165 88010 -71108 -313342 -279217 17388 -184383 -605229 32718 37064 -109059 -251606 -69374
10153 -55092 53917 -238732 -196114 167641 -57182 -99772 293629 -124698 -221634 16550 344705
10142 344705 43632 163582 96871 390187 -593839 -79847 418437 128920 -135963 -319144
10132 -319144 -148112 -209021 -180133 5617 215735 -59535 -88015 -82568 -10043 -101136 -296063
10121 -296063 34406 288223 -66967 -142670 -126103 53403 -362555 124856 -317187 35005 127360
10110 127360 23057 -170241 105190 -182211 -46823 -75937 -198306 172183 -958 158033 -243028
10098 -263638 -24582 -231001 -69395 -129196 188158 -391608 73153 -241014 143997 -88597
10087 -194003 -253488 192429 29022 -250031 109231 -156450 40959 -139940 197202 142890
10077 142890 190389 251070 -25074 -75404 -111091 96616 -131840 154417 -285830 28043 -14287
10065 355145 -150999 102872 40135 -70342 90899 -64244 6143 -156910 -166987 -55815 -273722
10054 -273722 -287415 134267 -408871 -441608 5774 -212774 193438 -137096 -238127 126118
10043 -315095 -149089 6150 -160714 39446 -42604 -158523 212073 170602 -205606 -177963 -287668
10032 -287668 25115 65397 -48327 -264339 115264 -218571 -66469 -87903 116873 -88068 40611
10020 -16203 86893 -325377 76522 -233869 -126484 154857 -293319 -135529 -73752 -76367 139009
10008 30478 -12879 117482 -98111 29937 187965 262891 -19252 58684 96311 -71300 154767
9996 508562 -151405 315584 27208 -186370 -164216 74667 -149087 99574 24774 -279598 120407
9984 -133898 -155802 -109548 168133 -147788 -66936 -69595 -45501 -173944 -179002 79078 -245001
9972 -282795 -69558 -72975 58611 -69037 175885 -101133 -179134 304019 245073 111835 58020
9961 58020 -224418 -207301 58833 -353061 46554 216871 77031 -230140 -55574 -77197 137860
9949 -72907 -184741 -232577 13434 -22422 -261060 129901 -136727 -17606 184848 132343 -334875
9937 -431616 -13693 19693 -11075 -152695 -96205 -184465 -465276 -143503 143524 341961 -194593
9925 133454 -7879 -118992 -491122 89656 56745 -391506 68131 34522 108085 -294142 -217704
9914 -217704 7528 -19654 -7084 61566 59227 -162857 -135387 -49269 112562 10604 180457 98360
9902 98360 -7493 97573 -158772 -158946 -218916 133131 359584 -269669 -65582 -94496 372291
9890 -125209 80718 -156868 61159 -139653 -172066 -63128 -222462 -148045 13859 -365240 -168465
9878 -257001 136389 16998 -79000 -376802 -125219 -347279 122943 -311868 -193158 -121118
9868 -121118 -146376 119525 3074 75181 -21229 -54484 -216099 -143834 -207607 57490 -217014
9856 -137569 8942 91353 -303844 -306742 -79703 -72167 -123723 -255336 1933 -196786 -237050 102560
9843 -335942 -27400 55446 -44406 79491 -149344 -164745 -220079 -102930 140625 100849 -201765
9831 70437 -549424 -41420 -54412 318760 -95681 97791 -100543 -347872 35137 -62593 -282445
9820 -282445 -181493 175172 -221508 6616 -21049 -88266 21028 63500 147119 -379105 -157705
9808 -92635 -76709 -230034 -186782 383732 119676 -278668 10776 23875 382266 -99644 106288
9796 -194396 97128 171307 28981 -318113 -157373 -70125 -72735 -153028 -295198 -122099 301383
9784 127324 227906 -185638 292781 68246 121214 150400 4881 93413 157250 184627 -252107
9772 -413868 -124642 -221936 22043 180331 -37397 -239608 -182155 -140052 -109158 -185326 -25665
9760 -135419 -102631 52867 -348105 -396787 -43815 -111087 -262705 44333 230342 -71753 -225858
9749 -225858 -154966 -158820 -9085 -35418 -332078 -230834 -6893 -304270 -107706 -35592 263197
9737 -44484 214042 197177 -52322 -186970 7822 210042 185225 -148827 367502 -16546 -116153
9726 -116153 -454916 -286506 -217509 -90340 -295447 -94372 -330808 -199829 -5407 40786 26802
9715 26802 91283 -397506 -151347 376942 -286296 -214243 -55306 75261 233696 -60308 72016
9703 -106937 179257 197307 -59891 304330 -22391 -118839 -6626 158493 61655 -179298 -118569
9692 -118569 87252 -345241 334032 -32931 116999 -41679 -128692 40658 -58421 -174981 41991
9680 143588 285969 -290280 -213158 -99054 -3984 -222074 193486 333259 -215261 -192372 -222837
9669 -222837 -189245 119310 -267586 -30320 53981 -463800 -160057 123535 77997 -47448 -81393
9658 -81393 -128766 223453 260589 -33439 48270 -92456 -138547 11998 -63402 -94379 -144606 -216260
9646 -216260 -234287 -61007 71688 -162050 233551 -340543 -234471 1516 -195298 -4294 -9255
9635 -9255 164443 -216706 -32397 -379971 -452172 -177710 -75411 -352831 26675 89355 -97117
9623 259175 -128740 -98803 -116872 -120367 -20298 407816 -43321 -175535 -389236 -10977 103277
9611 -403882 -161102 -18212 -78775 -144250 -158869 67347 -121394 -158481 -333490 8851 -175931
9599 -317213 -234495 -145660 49093 316413 -330388 -197141 -29416 -140625 -14636 -301273 -157977
9588 -157977 28930 44689 -62976 -205137 -127365 -49936 -150941 -129808 -3834 -312313 47558
9576 358741 79859 -218235 -43958 12280 -262850 -107462 16739 122818 -4086 -94695 -27876
9564 72119 348831 10576 -32951 136348 -113416 -189939 161187 106761 -190441 -226989 7182
9552 193420 87019 -247332 -188133 74895 -181354 119928 262257 -55421 -186714 -88463 -184922
9541 -184922 -238876 -117708 65108 235710 103816 -360303 -57898 122909 7997 139735 76137
9530 76137 -319220 177788 129373 -213020 -16857 -110571 -82837 -18204 -108797 -313052 63097
9518 -171113 335635 96953 187217 -51364 -217114 114816 -94443 -25210 110677 222734 421984
9507 421984 -169082 66548 -115320 -98397 111383 -233312 -224722 -268887 -226600 -288626 -207320
9496 -207320 -141365 -121004 139596 -47665 -99589 -157652 93027 -31417 -174401 -233105 -67088
9484 164841 290871 -103890 86644 50172 -183829 -96443 -244681 -26512 -63827 5499 -109066
9472 -90205 153165 163127 -120936 -16914 -89094 281801 -321557 -259612 -244895 -152442 -324688
9461 -324688 -131135 10500 -63108 63306 -267643 78306 14932 -14783 -204901 -306484 -208040
9450 -208040 -66008 -257357 -173929 117739 153036 256703 -188780 31644 209701 -33493 -173963
9439 -173963 139542 144470 -72638 91996 -56579 32331 -136529 1436 -74584 187697 -167805
9427 -158959 -169082 -343733 -99659 -77528 -203756 -126196 71488 -77717 -2463 -133446 160882
9415 1330 20055 22937 -23276 -141671 312206 -111212 39499 -206371 -296440 -277070 -171227
9404 -171227 53440 127104 -79008 1734 185614 -74818 12348 13052 60741 -125201 92394 -119639
9391 -33083 -46972 -41469 48773 96505 112329 57622 -67541 -37172 207847 -102869 46997 -154108
9378 -214767 179196 -168753 -154091 -190122 -130406 -116310 -212668 -201174 -103645 140622 159791
9367 159791 -409321 -5077 -156023 -197752 -75046 -208185 414675 37457 -21827 7403 -195715
9355 -116737 -159668 264723 -188191 105782 281270 -72624 -65679 -383107 -199331 -46705 -100166
9344 -100166 -70949 -127068 -51743 405367 197705 99819 -37672 251002 -101998 -83716 -275723
9333 -275723 11489 -290641 39785 -8294 -131236 -31285 -27815 -77397 -34035 59925 -238917
9321 -79341 -10169 139083 -38763 -71710 94112 78416 -222956 -257460 15283 -241453 128750
9309 -42132 -63310 -261817 118826 38028 -173341 -75685 -108663 -229022 -356481 -91853 -371759
9298 -371759 -1771 -11055 90432 -219145 -98605 -120560 153841 -237043 -172925 154168 -106959
9286 -55206 -48887 478610 -58567 81777 -81226 -255233 278446 -406709 -246981 68253 96586
9275 96586 -290284 -37353 -51869 -67011 -120078 -25973 -268575 -257250 56581 -335961 23446
9263 -114674 -127022 -216804 202577 -137744 -194354 44920 -124477 -20000 -113639 -149404 -421343
9252 -421343 -217508 -170408 94876 -270032 245731 -266321 -91428 163258 -84216 190639
9241 -14411 -253510 -384941 -139239 -39887 -191666 78283 -156818 -178476 -219472 -123054 90603
9229 235481 165005 108421 57623 134692 -205535 125766 -342428 -296162 -7746 -147618 88904
9217 -320050 -20185 -111528 -225140 -44976 -369924 -85930 195336 44624 -88035 89708 -50318
9205 64185 -162176 -231958 -40872 304116 -31053 -32028 -441637 314640 -160353 -181237 -98244
9194 -98244 -47899 -10752 148642 -78816 279550 -2936 117092 -437795 292018 -155614 -95792
9183 -95792 -53418 -92631 -77004 96621 -435499 -232884 262416 -46642 -138319 3823 -128072
9171 89889 20056 210271 43307 116932 60710 -102483 -237684 364454 -127482 -424332 62442
9159 -217308 43694 351282 -110982 -197696 -181434 206080 -195912 75400 -219393 -132545 -368752
9148 -368752 -122721 -17291 30816 337311 158981 148758 -359003 176700 -235356 248138
9137 -263842 107611 -24279 28872 90774 44278 -155603 -28194 35561 128116 176345 -4817
9125 16592 -76100 64933 -231289 -82293 -452561 -94502 34236 -358 -215091 331983 81632
9113 -188226 136892 -53893 184792 -364557 -255331 -89519 129808 -290234 73464 30783
9102 340682 -106329 33119 -33135 -43003 -52057 -83844 54946 -313159 -309084 -121371 -163739 -204393
9090 -204393 -152181 109268 -275255 -35414 -13851 -72078 296443 104250 412907 -232570
9079 -169570 -34430 125633 -201270 -30051 149840 42567 -74642 -274305 103534 -70068 -149694
9068 -149694 -231599 -321454 -55088 -133246 -16879 -99507 -103757 -129854 -59867 189795 -124880
9056 -89260 79241 -330883 43895 -245844 -25324 -185817 110003 -193805 91108 -59700 -150441
9045 -150441 224854 -313491 -195987 10440 -496501 -186914 -82936 -339018 -34226 224570
9034 294952 127652 -7806 -301925 -236644 -292519 410709 -15573 -172213 -401611 -18184 -17875
9023 -17875 -89140 -224857 85211 122414 105052 -141960 -303889 -87932 -419233 -169240 159710
9011 -224910 -157048 106126 -26937 -3584 -509188 -34677 -239118 413742 31671 -137623 -112502
9000 -112502 -62522 66236 -108184 140268 161414 -9279 -68971 -416162 201511 -4062 4861
8988 -57542 -71149 -171917 -408425 76374 -75386 -11192 -93889 192232 -275174 -161497 -53483
8976 66471 -86616 -64390 -103454 159961 -189011 -112268 -41688 140088 -112688 -201725 -448056
8965 -448056 -170764 -305507 192094 -212156 -228437 -4625 352148 39398 -329262 117641
8954 -101536 -105335 -164314 34328 -118705 263136 -1507 -335594 -67491 -191116 -116365 -171409
8943 -171409 -95872 237635 158125 53393 -308358 268441 118884 -192612 30568 -159036
8932 336767 -441881 -18691 -53697 351054 236246 -221161 -5079 205813 89310 850017 1211574
8921 1211574 1065010 71077 59293 321980 166712 13606 -14840 -23016 -264272 -318726 160146
8909 231958 189057 -146961 378624 -120365 -38198 52744 5622 -107487 -111235 14136 -4015
8897 134480 -162602 -201293 -285405 -195521 114929 -499467 -288779 174518 29365 162067
8887 162067 -5463 131234 -11626 4983 -175106 -96166 273826 83353 45558 93623 -34336
8875 -283768 -85712 123701 -15871 -68792 -135085 143836 55765 106254 94276 196773 -109787
8863 -212039 114324 -24221 -150292 -74231 -104645 -45442 17603 236718 -21825 223502 -113574
8851 -356956 -123440 68939 -276720 56912 -107147 -323693 -183174 -159390 -470697 -293656
8841 -293656 -162626 6734 -220602 213922 146901 290168 -275661 122315 188483 70078 -44426
8829 -8435 142731 -229849 -164984 -141095 -29074 -86972 47674 -19383 -104734 212757 -173738
8817 381561 -232863 -100308 -131902 -378045 -67569 156256 115303 -35533 -71605 -345323 -26792
8805 -15932 -199664 -43458 66770 95945 -318834 406404 -27582 -22322 -58046 13960 -59099
8793 -193682 -242694 -160665 -236867 -282925 -299819 86468 -40575 -102034 111011 -2244 -181867
8782 -181867 -259090 18443 -2812 139005 -205199 -127744 -68437 205550 187500 11421 152819
8771 152819 59919 -91127 31728 10972 -128933 243865 -9518 -34575 -22350 -54537 -168678
8760 -168678 247436 172500 115719 36595 -236130 -131183 -65314 227597 99647 -284630 -442186
8749 -442186 52604 -245116 2924 -112664 -251961 -93417 -23980 -108243 13522 -181739 201490
8737 204901 234161 373675 112895 31421 -277941 -34665 -177102 -109732 190005 97671 11702
8725 10578 32848 -234034 233983 -5072 81596 139319 159549 -6461 217809 124969 -74088 -137204
8713 -137204 -202090 -342468 -467780 217502 -245303 -41998 280476 -76727 130578 60602
8702 1193 -48641 -182627 -79976 262700 40319 228506 93695 206418 34561 170519 -95754
8690 -149033 2513 -251184 2080 112431 -121049 335251 -246273 60139 -112614 170533 213078
8679 213078 -106970 -128850 -244171 -125994 23372 50143 78091 126362 26261 72084 108931
8668 108931 242204 53799 168616 -6245 62822 -38879 155061 77647 -7987 1866 -49415 -196652
8656 -196652 -126071 56546 30132 -230429 16416 -24621 -250423 -635 10375 -117250 76488
8644 -55660 -76903 75335 -174538 -176903 4254 136040 -191332 -160193 147137 -136885 83423
8632 -178608 -246689 -75386 -77384 175938 74628 -247394 -61197 -90455 35660 70787 -269896
8620 -14988 -229552 -356823 122107 -138861 -248486 147790 35344 -242569 -99624 37944
8609 -272444 -125006 -32188 -47256 -178098 -321328 100394 -148871 -365203 -144373 24841
8598 356855 15487 -46196 83810 256363 4302 -421176 -150171 -61045 -141935 234781 -242391
8586 -32341 -34986 390636 -278687 -97265 2488 -284840 64776 70756 12257 77497 -105973 -368107
8574 -368107 -220274 -143647 251298 80776 -220744 -44055 10711 -74797 39409 -351956 -77061
8562 432637 -145490 -111287 346247 9907 -304337 -28979 76568 -324489 -130842 -12007 -148983
8551 -148983 65938 -60536 -233854 39318 37337 33042 178016 -74981 -228969 92770 -20711
8539 194767 -581 -77709 266259 -172758 8109 -51710 -97831 5595 242107 -9018 7737 21968
8527 21968 -88810 48986 -53638 84487 -202510 66059 -344696 325015 161687 -69067 -30671
8515 202587 -180822 142 -45288 95821 -111554 -266204 172157 -65109 3076 284079 -119873
8503 -68506 322432 18540 -282334 -250285 -162064 -216537 -267659 -49108 -244089 -120917 -458478
8492 -458478 -6119 -15865 46469 -132485 -37747 -258734 17844 -217174 -141841 -61539 -450812
8481 -450812 -35995 -20023 -8902 -69979 -23851 102552 -87380 -29586 -64732 13939 54649 -11686
8468 35143 -166867 -108495 -506247 245640 11746 -41015 -461252 162372 134959 288982 -40947
8456 -31027 -23093 -26857 153338 -100517 -3093 222198 -88977 -203577 -263978 -143054 -5342 -216467
8444 -216467 -203256 -72497 -194851 183758 -217390 -227381 211328 -154497 -333609 -57813 227407
8432 152580 -133373 -205739 183277 -117897 201835 -148660 48100 31636 169780 128587
8422 128587 -211215 -4060 -3108 -164451 -105202 39376 69493 -22812 278388 159104 59694
8410 174923 -487675 -201665 119072 64484 104877 -102158 -232118 -59439 155576 129996
8400 129996 60461 -158975 278446 -37223 -155409 8372 9230 169288 48864 -60316 -73750
8389 -73750 -53862 -177591 -165437 -35631 -24445 -236112 118282 123767 170790 -9374 -211652
8378 -211652 -44049 -1188 316057 173682 -247117 162662 -176455 -277690 73617 116944 -165245
8366 -165377 -124411 41843 35927 -280343 196458 710 -188444 -33223 -100169 -168857 30292 -69838
8353 -42241 -33389 -9615 259204 -86086 -112697 264969 -317909 -148282 -97330 129640 -61295
8341 -18356 -163484 133891 7336 -263615 -128380 96184 -111133 -11159 78964 -543218 48682
8329 196433 -196284 -177907 98024 -115568 -38991 32194 69655 -95063 304757 138582 -360791
8317 -25761 12090 -196628 -113745 187232 -102530 90737 262942 -196731 3034 -467028 -137256
8305 118965 -83251 200602 -135143 378084 -41647 99097 -202591 -241023 22013 354943 75345
8293 49646 -239001 -4465 70445 -191074 -87219 -39027 13160 -115113 249570 89363 181426
8282 181426 -92497 128853 -187831 176782 -18849 273442 -356600 248559 -10012 370225
8271 179168 33145 26425 -223636 88265 -342263 -98114 -10290 22874 -90280 255072 153816
8260 153816 127351 -178978 -251072 154388 27382 23442 159802 -71877 -200135 309738 -28755
8248 -71100 96772 -387224 129278 -263821 155000 -239888 -201811 -72207 -308793 -54377 -84639
8237 -84639 -109558 22981 137052 -112816 141342 154900 -90463 361806 -57802 6296 214686
8226 214686 26890 -128261 263994 117233 -159529 5809 -53160 -294805 -101989 -205282
8216 -205282 -225815 -71020 -288962 139247 81209 206063 -43247 -15941 38607 359187 -168691
8204 190761 -231302 -154525 -101665 -7857 162968 181387 156498 422382 -209093 -73407 -254399
8193 -254399 59329 47888 -328585 117388 -389145 -16309 -74000 117675 -225686 79592 -195381
8181 -247865 -209398 7448 -10202 -80160 -258011 -275157 -46838 344277 3576 -147698 -13381
8169 96522 -220046 159385 147978 18081 2550 7111 -9549 210652 -262546 -258176 -259197 -11323
8156 -239841 6083 -328773 -183115 -121859 -81220 57713 -3544 172264 19340 93222 -130044
8144 387314 168941 13788 -227231 27142 -134621 158722 -149496 83747 -109161 -247273
8134 -247273 150701 -53856 253145 -292686 -190198 -308301 -13973 139582 -158716 203455
8123 -253435 -106039 -129890 -57692 -152135 108661 159134 16006 19946 -254195 100143 149245
8112 149245 83887 -137234 -359086 -130230 28331 -293351 -147406 14676 -243612 -19372
8101 -236123 -152031 -47082 -262483 183696 234440 107861 301686 -94351 -67861 -282289 26168
8089 274758 28441 -25779 -400105 -363213 -154284 -339444 -103448 -182509 84740 -168509 -137007
8078 -137007 164103 -76978 -335313 104748 273646 -33108 -49992 -41712 37126 -26396 69417
8066 46271 170975 -207174 15756 335428 -86367 135004 404938 123923 82320 404 -134051
8054 13111 -167464 -150698 93387 194380 288851 8734 -38731 94975 -207979 -53102 -76018
8043 -76018 96092 74502 -15714 -292927 58838 130930 -159549 -250426 152419 -252656 -111481
8031 69549 -57725 323021 326494 -82515 -122733 -311278 -243568 6360 -93139 -101393 176943 -88357
8018 -415590 136957 -241403 265639 67950 211940 -189662 -47509 128755 336254 -342874
8007 61938 21452 98518 -33020 -91464 45657 -172401 65490 42120 -226681 -37468 -236722
7996 -236722 -37639 -279522 -165061 182194 -216046 -263052 -213698 10708 -18181 396 -492928
7984 -244758 105387 52579 -110359 158811 127961 -135609 -138295 106057 -86302 70254 -365883
7972 -26425 -90335 202798 80179 -142536 -35977 -96300 28166 108573 -224343 -115541 -113518
7961 -113518 -278715 -361090 -111364 61938 -183817 -68079 -129406 33246 -8647 168387 -282321
7949 237889 -136033 -232001 -132217 298213 28418 208675 131260 124853 -89540 -276840 183972
7937 48171 -418 -134168 5822 -466222 -62331 -206386 237472 -104911 -165306 -193380 -457072
7926 -457072 -317448 41612 448104 12710 87619 -61833 132570 -174364 -287456 138807
7915 -99761 85148 -141592 -105103 241677 -103279 295391 -25489 -294948 255317 177937 130637
7904 130637 189713 -199575 -256135 73725 178524 -36485 -116913 -80500 -56731 -61285 155822
7892 -133760 231713 69524 -215651 -161660 -25003 154842 -148277 -402109 148961 91686
7882 91686 -10165 -84164 99543 7710 -163103 -44490 -45206 -151144 -63821 150490 -155535 106293
7869 147080 -64079 261836 27930 -20202 -206991 -88930 -194412 -173782 -157871 -103369 106196
7857 113600 78666 222210 23225 -42728 -247395 -76973 147879 15557 -2781 -1848 84969 108365
7845 108365 61700 -182156 -91885 245850 226122 -60561 106742 148873 -5752 110358 -302366
7833 -106538 -355737 -268496 233759 14079 -81406 173526 93950 42505 30049 -94927 81522
7821 -169236 191358 9843 -163784 312784 -178960 -109546 -40879 22659 -163205 -87553 35406
7809 -196462 -99286 360088 -184391 144205 -354850 -47828 48175 12446 99623 80039 106883
7798 106883 53398 6142 -179621 181759 -35835 -82474 -147153 -77461 -55 98436 157277 100741
7786 100741 -155450 89869 115206 -198216 99853 -153109 284946 124988 -291385 -240350
7776 -240350 11877 65157 105818 112480 -162871 149690 -73673 76519 -121721 208863 -154466
7764 47967 -250628 293132 -48948 -164271 34234 -48548 -108628 151901 110465 23960 48305
7753 48305 349147 -101917 70003 -347938 -307309 32163 -162350 281527 241891 -244408 -209486
7742 -209486 -20052 113921 222640 -279081 250517 -97646 129999 -199401 -161903 176981
7731 222543 341433 -235633 288962 -138106 -197405 180854 -74721 302334 -136322 171543
7720 -190336 -100410 -157255 -189044 73640 2685 73088 172071 101936 -33312 -57644 66813 -80177
7707 -27199 -22352 156726 105876 -375742 107699 -38876 -240910 -208661 257554 9556 83769
7696 83769 178578 -209631 41394 51745 -355258 87858 26575 -221648 110402 -84173 -132563
7685 -132563 -337051 248192 -16978 22909 286507 -245860 -155637 15778 -158753 200661
7674 -184663 47904 -185901 -252250 -5142 -189159 109925 88921 183001 158466 86511 -148590
7662 -231166 -203626 -95490 -88469 -224953 -161581 50985 152912 -285681 -146922 -150812 -61384
7650 204245 -83071 -102156 125782 -26370 -196046 121290 -260033 123111 -259314 -13275
7639 -251967 -28407 88871 264266 -243087 179736 -64800 -254478 -71733 66907 151334 -101086
7627 410055 199626 42069 148672 148487 -81366 4494 -234528 -464029 1900 -80888 62554 46457
7615 46457 -437265 -176837 49126 65470 -58294 88671 -411001 80982 -136721 -141796 -421635
7604 -421635 89013 -82554 147798 -153951 112625 65326 267 -146678 200673 -133401 -87707
7593 -87707 -76084 -122420 234451 -43215 114386 135493 -278386 53636 31970 -190350 247377
7581 133239 240089 -110898 112628 75289 -28192 151232 300535 -117756 -14992 -4152 225980
7569 -216832 -307615 -176802 54306 286530 28772 104455 -64694 -431677 13088 -188391 96453
7557 182234 -181351 374926 -108045 526 128468 -210602 -238539 84238 65385 -94322 214504
7545 -168443 113968 -133056 -238687 70092 -106836 -102021 -386686 -80991 -477721 48953 282512
7534 282512 93865 120344 -10498 -268360 -219501 55539 -227312 -25846 115482 66446 -80707
7522 -187597 -10248 -37810 299636 75548 -78695 -8922 38239 39394 -62407 -50295 171466 -34677
7509 -113227 -178337 -76437 21002 246635 -339424 75528 201605 -216496 40825 493482 -180373
7497 14514 85603 140774 56939 237905 358263 -264323 134201 -222548 -57675 -9071 -36728
7486 -36728 -44108 30238 59247 125522 -4221 -68867 197525 -328541 21201 141850 68146 -144842
7473 -109458 1379 -294522 123315 123916 72111 -39143 -78213 20195 135466 220991 19566 -141855
7460 -338893 -1273 -105991 122837 -15990 238851 -80680 -110591 -108288 2873 139474 168537
7449 168537 -294839 -12216 -12453 -4960 402751 -237196 111964 -226457 -183009 324966 -122766
7437 186954 156466 73402 -221872 -97159 36303 -149055 -136777 304556 170363 53029 -57216
7425 267247 -28819 -317181 236476 -47423 -33044 -98 142495 333644 371408 -13232 -85474
7414 -85474 209384 191748 -167720 -97487 -74184 -276813 -354988 61977 -21342 -146478 237799
7402 -19401 82330 67685 -222568 28933 -187594 148843 -73740 -118586 -28438 261962 -146707
7390 -26655 47879 122831 95963 -98633 38623 -45644 97876 -174234 16973 -57293 -30899 -90044
7378 -90044 -45032 -258395 -16250 203723 -146914 -19479 135395 -180122 -21640 8073 -17923
7366 -117733 -65360 -80757 81829 243880 -347881 126314 -97779 -132273 -8090 -291769 179970
7354 -35036 -29059 -110065 17481 -29625 52037 24257 -173146 -93763 221496 96502 -186318
7342 21202 -79140 -80571 1038 111637 169498 -62040 159079 -255274 -119616 -361263 204338
7330 163242 117062 371141 273080 73574 -292106 -151233 -18803 42942 120932 3231 -93369
7318 12925 -121732 -153300 -199018 -88537 -75276 78917 142977 -24940 88495 1145 59442 19301
7305 -4918 -136189 182539 -166934 -144244 -78105 -78139 94516 -271170 -188827 213134 -67644 279227
7292 8026 182167 -104710 -12981 -241023 -50015 74640 126726 -179275 5872 99740 106621 -330387
7279 -193163 -8908 -65599 -568185 -14666 -312786 325475 -323873 41974 -148656 -13309 -60742
7268 -60742 -9262 -15138 -19581 76960 -350138 -160090 -137334 307178 -28533 -205158 -18752 -74448
7256 -74448 -84089 65081 -127782 -268736 -268861 -104574 -143819 -412353 -133571 -94382 42127
7244 -81093 89773 -202241 195166 -110395 88176 -226104 268875 -52499 -116631 -85533 37662
7232 39879 104180 195757 -234492 -146765 -118257 -3370 -185917 162089 167346 1766 -101456 237969
7219 -62313 91649 -154621 -49579 -284576 17496 128435 112596 144837 184170 -27670 28858
7207 116012 -65586 -198748 112609 72999 -54396 -78840 -70961 -57193 -131662 -17368 176060
7195 43471 236459 12075 132796 296295 91627 -82474 -87356 -56492 -148716 -195833 139345
7183 150780 44210 185653 -166265 142933 -24691 -3064 338130 -94955 -266954 -86349 -94726
7172 -94726 -399535 -82328 -65932 -137786 15703 318021 68006 138242 6338 43852 -69354 -364232
7160 -364232 -130602 131196 176796 -168994 -21387 61595 266024 16970 305394 166889
7150 166889 -37704 208610 -12532 55765 -4449 -166112 102219 -165558 16446 -11242 76438
7138 -374762 196609 58262 21037 -465091 144259 186940 -102215 109123 228266 18767
7127 -200903 152549 92584 -188339 91017 142603 17101 -48472 -350713 370133 -283563 16857
7115 -138456 90351 107578 -23623 15598 9030 -209186 -165395 -84764 -101391 -273429 -105489
7103 61829 3872 -47539 211185 -130123 108809 -245326 142562 -146076 -88239 -52482 -287072
7092 -287072 -33537 -152491 -65641 149775 45043 -45946 -194580 -119275 163884 -74700 155972
7080 50544 25775 115988 224040 -32918 114596 47486 210151 276318 -74172 -88886 -190023
7069 -190023 69923 185089 -187674 174772 115147 -53520 -107505 -31689 -104154 -166253 -133037
7058 -133037 -44366 137699 -260092 36378 56361 -53508 23830 -219685 -62937 -242451 94948
7046 -226799 89781 -125152 35894 200810 -97032 -61704 -173550 -180954 -56842 -224728 -192287
7035 -192287 19187 92975 -191631 -407141 -40687 -5278 -150513 74458 83966 131682 -143272
7023 -50328 -40840 -193630 18224 141368 -39606 -32186 323074 110754 -390198 -79788 -211837
7012 -211837 -171518 -469596 -98164 -203108 -31580 -32537 207314 -5541 52172 188735 -60171
7000 -76068 -18140 124367 200988 116561 -257829 113875 -125868 -40087 185722 168288 120331
6989 120331 54238 62930 -406860 176328 -69190 -98845 -237566 9330 149576 -34638 -29638
6978 -29638 96438 135121 55638 -178712 -115388 -81024 -22012 125459 59866 -166471 214070
6966 -139692 5055 -61533 89019 -68585 255956 -130952 17392 379763 20413 -42913 12357
6954 -156764 -178359 57833 93685 50325 159735 82164 -383299 -8743 -2217 -101383 172960
6942 -186743 212495 67495 -63943 -127829 -350432 67821 166044 232941 103652 79366 1599
6930 186420 114936 -28928 -98 43133 -294429 -116611 -56062 309091 104633 -186661 64228
6918 -283276 -64611 -17071 -112637 -103346 -52160 -6723 57081 -127236 -216191 -301932 -294387 106438
6905 12800 -181842 -106640 2739 -53417 12820 147571 -42891 -48215 -68375 195578 -29747 -249458
6893 -249458 -365920 -56599 -224661 66058 -120895 -127920 -64284 -185515 -324714 -28303 123956
6881 35863 19874 247877 212958 175181 38089 35032 89676 97174 -57015 -56242 28043 -243381
6868 43813 -230803 131018 117547 -154700 187301 158310 168882 -184479 -46836 305083 -54121
6856 229298 60167 159002 -85438 233934 -37680 24360 -277240 -187427 134749 -17666 51172
6844 -191294 33883 63829 110466 235489 -177353 -50212 24069 -221071 -378859 -231199 -61961
6832 -32170 53006 -76708 -31618 -42949 218294 77097 -413044 -79440 -193475 -332479 110713
6820 106210 411813 -186767 64169 -123137 47999 96000 161629 -271715 -142637 -238498 224800
6808 387288 53882 131091 139036 -197875 3507 -162796 103130 -82887 202599 296142 -124425
6796 238162 -180692 147781 105702 -152889 -336325 -54565 -61978 -42088 244990 2501 -177846
6784 -137133 123160 -358008 -1904 12491 -133746 101670 35212 145894 16447 150085 237445
6773 237445 59015 -69116 -103688 -235801 -140692 -75184 96892 -148581 189198 67248 -109559
6761 -18594 -202904 -323994 124849 -44391 265011 15779 -16376 -217741 144175 -148331
6750 31986 70170 -11494 123179 64638 14816 -232191 -144992 63749 -48613 21484 -15163
6738 -140378 -58274 -230410 -94310 -26166 232543 279137 -65909 77784 -182687 14135 -205437
6726 -138311 -124428 -2590 115057 164251 -12588 -29483 206615 -82116 -101552 164980 -50534
6714 -16416 -205180 180338 30536 176122 14082 -95027 82573 327782 -36811 -49963 173395
6702 -124937 147473 -110321 -12644 223181 -11682 65572 -174618 -142213 -60317 -200853 187345
6690 35663 -17506 -334428 -66436 -2542 -37480 -112476 -8461 -119414 53267 138861 -26977 -50110
6678 -50110 185159 -17139 186521 329288 -11623 205030 34883 -7746 77248 -112811 -146910
6667 -146910 68822 216793 247219 7592 385943 -282467 -150000 -10658 63072 24155 -68768
6655 -34752 34697 -387748 64012 222737 -39702 -58021 105962 -128242 -249828 116964 -139339
6643 -26191 -297608 40627 243187 -261865 -146707 -104853 -32158 -8983 -34340 -250889 189025
6631 175353 34125 1640 -203185 -115654 153327 -97702 -245618 -133693 -204065 94374 114023
6620 114023 -144357 103264 -284985 45230 188843 -295004 -27176 75114 -2904 -272426 18438
6608 -130556 389550 392101 -340155 -128604 167474 -300785 146688 -117345 30821 110348
6598 110348 18052 -4988 235018 -48343 -184634 -135633 97792 8014 -73558 166993 -45901
6586 467276 -158741 -191016 -197433 -61136 -255062 -127203 289283 -89437 38873 -120738 -69141
6575 -69141 -121921 12961 -1136 -4500 143337 -235265 39983 -203987 312984 102045 -64883
6563 -74842 -158666 85213 115557 149070 56539 -81252 -105069 40567 121924 152120 -407727 110750
6550 293061 -27599 -184850 125904 123240 -400575 253542 29218 -46104 -66878 -32310 -4172
6538 -146362 -76023 23050 97417 107972 288650 175712 -144913 -75454 -111829 -105040 32653
6526 -10204 294357 94083 125541 -292933 199517 264890 -152439 -13413 -73532 -136741 -88268
6515 -88268 234525 20727 -119151 -8490 -294244 62426 334438 -381402 -239845 101662 -93363
6503 -102529 119751 99958 -165677 102613 -12362 167294 2578 322524 -227828 51694 151848
6492 151848 -66689 378436 -14195 -106259 -245217 254924 -39517 93048 -208439 226440 -103656
6480 -6596 34381 -380139 -172370 -348299 -64004 350663 194638 237760 40438 -272336 97939
6468 64082 92470 62543 225354 187513 -82997 -34188 -138303 -178773 53543 58374 320153
6457 320153 59183 124925 131136 -266538 -20816 -19505 -20797 234674 160490 129904 -177953 56421
6444 -107559 -78243 -27596 -130495 -10035 290221 11727 108482 -40247 189493 91413 -39451
6432 123619 -402731 -141143 -60858 121630 241719 -13283 -294446 -182662 146652 327127
6422 327127 83219 81103 -106541 89732 45970 415563 163407 332073 64784 -98401 -213874
6411 -213874 -25523 142675 85589 -226845 -144399 -119841 270993 -25890 82004 82239 -45334
6399 -474265 17776 -39894 -86729 -300448 116118 -209689 -51859 -326492 -10723 -107674 -247739
6388 -247739 -76838 -12576 942 -103873 138498 -7456 -203004 37847 -457044 84797 -22883
6376 198120 -18421 -113668 -233925 37821 247023 235845 -150049 -34415 -387241 -219036 -69201
6364 -79024 -165626 -94789 386993 47557 -301465 108679 146013 -52650 244381 -187614 49921
6352 203904 -182349 -156446 -330726 205099 223212 -325552 -127818 -126617 238500 -73045 -190358
6341 -190358 -250300 -231755 12012 -43624 -112578 -264591 -178191 45585 -147552 58548 55503
6330 55503 -128335 129199 -322468 33165 93285 -228356 -115879 -82381 -261715 180248
6319 -45809 55661 98764 -104464 86050 -86987 -30825 198252 27337 4529 123234 -496538
6307 67648 227795 13821 13483 -59265 -95284 -55934 362936 169392 24900 128883 1835 -184303
6294 119931 -288743 135180 110020 -169334 278198 -105914 -148520 -82181 188030 44720
6283 33557 -315053 132143 -122469 286013 -84196 26641 73575 300273 -183918 295243
6272 -70988 93981 277000 151715 222065 -59995 -167097 -65708 -181115 218451 270121 -109296
6260 -4504 18728 4009 9170 92559 38429 221926 319042 -114927 335707 118397 -193272
6248 -504322 421892 -94595 212800 247729 30441 -314063 -81591 -115142 -109618 21682 81528
6237 81528 -4237 -49193 -142550 -306776 150422 -132125 -114145 -65976 -155508 159324 155837
6226 155837 3325 190977 -48741 -145510 -78140 111469 94782 139446 331459 217765 -137458
6214 -176041 -184430 -34893 27359 36076 -117491 -79445 -132335 39749 -104758 35840 -214372
6202 285711 -113326 93934 164106 197035 149382 78470 -19469 62644 -18506 -260257 -16723
6190 -198942 -20602 231761 84492 30548 -233577 -455153 -235179 -85057 -5153 91581 -183823
6178 -227048 7001 -353910 209373 -27449 -7361 182602 258517 60048 60413 -129666 40449 191752
6166 191752 -77579 133903 138771 -98203 -273403 -9709 106116 -9247 -221210 -10363 32756
6154 -180259 53759 -17156 74805 215039 -364917 -204458 -52188 179686 -8513 124032 -22676
6142 129335 270121 -119099 257192 280395 -303378 193963 246738 97137 154283 116377 58123
6130 361606 -113645 -189075 494176 -5660 77487 -98965 -253223 -81506 34119 66882 -61316
6118 -19691 36637 68678 -32673 75434 -16035 -4071 -181944 101545 -44978 -407224 -70720
6106 -226554 -258670 117591 -4627 -277504 -177756 -12317 -307326 -11144 -94322 126873 1106
6094 -36291 261360 53305 -13806 -204902 -198201 95383 111242 -2955 -141195 -27365 117721
6082 -51741 -77972 79004 -30379 130850 -183726 -146740 145150 -215838 61567 165960 -222911
6070 -93102 -73943 298439 -91821 -26186 157233 273544 -124450 -188500 -188207 148796 -340852
6058 -137012 -219713 38543 -69528 225427 153333 135231 -30436 156217 -286947 -106465 177507
6046 -311557 -98502 -43841 30509 -101225 -103864 -121951 232783 -118846 83737 -91481 -82544
6035 -82544 209566 -267151 89715 -304237 -85772 164015 -30863 258415 -89097 45847 443754
6024 443754 -128592 120246 -209764 -65499 -127466 -595165 -34110 -81509 -83836 10092 128302
6013 128302 -218603 -18035 31853 -33861 -6657 47963 -69742 20089 -221983 81562 18796
6001 -184352 -56234 39594 -128698 -496012 164987 -38604 217126 -190956 -47976 -31302 291329
5989 -119767 28857 -221041 48842 126135 -71875 -15278 135387 17938 37811 110560 957 -779
5976 179447 -90050 -240465 41111 -112164 -64279 230607 106223 160576 -259093 -200790 37680
5964 78399 -43601 29231 98542 -241060 89052 116504 -136083 -136042 -106862 -155425 -129853 13828
5951 -57617 68185 39545 -41477 4347 -154790 -96339 -156822 -72 -95201 -258082 126360 8140
5938 -186413 274966 -367546 -17343 140666 -16492 -225723 -125770 35965 -92733 55262 150968
5927 150968 -113837 -8749 -144117 320884 145626 -146056 106204 263783 -187413 -77073
5916 80422 69793 132083 -129628 -103445 -27843 -4512 -180037 148926 310932 -143825 -119521
5905 -119521 -13382 -58215 12835 -46871 81982 -77860 63939 110287 52063 -210622 308966
5893 -16060 14741 -59634 -12649 -114977 12142 114639 -49005 -379891 5875 -489502 -278502
5882 -278502 76627 -5067 13540 -119244 44408 108126 -216505 -54011 -240590 -164860 -73048
5870 -81637 86417 -38674 -154504 -3572 -110785 56059 -170804 -61772 -134607 253483 -224568
5858 16890 217517 158573 28111 293081 -39015 -134236 25987 73623 92981 -206432 -336189
5847 -336189 278157 -224161 -108842 -327486 33885 -82439 -111399 100215 273109 -151919
5836 131895 188918 28694 -60345 -172783 -17527 -164787 171310 -153893 -171287 -166160 23482
5824 80071 7724 492283 -90508 260704 -286078 -72038 -303831 126893 103155 85965 -49424
5812 952 -28061 23315 51528 106353 -221879 143540 247346 229614 65498 230618 500755
5801 500755 57247 83390 116599 -7807 232917 169363 122981 174523 -33186 -94285 247909
5789 69613 -234911 -84371 -324972 138509 -352394 -181212 -98968 61085 25513 -265013 50469
5777 -18946 149479 -60971 12939 -17761 53583 451513 -12013 21829 107999 -108059 35145
5765 -242573 -29528 18845 -94829 166502 -135190 135090 -1854 92129 226611 -23977 46289
5753 88614 229052 -70276 11080 160449 14656 40905 185293 33439 131165 -169725 -158022
5742 -158022 28146 -98176 -229382 173245 -21932 8750 -111448 -165703 169806 -325759 295795
5730 27145 18827 -313104 191422 192472 -207872 281951 -220420 -205954 -121349 290985 -162067
5718 150534 -75646 382719 120935 -83721 -90490 -95462 19522 -71503 163996 -95595 19125
5706 -98689 96432 -21237 -236154 105592 -42610 -119715 107931 50750 -14364 -521055 -170380
5694 107158 -36161 -84248 81142 -80102 282770 -1295 84798 -102315 -164373 -141930 -97531
5683 -97531 122360 -140450 238804 -44374 31296 282516 219730 -80407 86748 314141 77287
5671 8470 -97500 296780 115882 -211378 -99828 -78714 -57755 -184871 125624 52651 21115
5659 -198463 -65206 -435578 231757 -152599 -82815 239152 338519 -14370 -225445 19450 -46785
5647 100975 -186815 -68380 -126870 89395 88367 -36115 48543 138160 -361 269526 -219704 -464118
5635 -464118 -259925 -164262 -30210 -45608 78716 -168435 -20286 -6693 -35358 102513 367086
5624 367086 -168527 -330892 19886 -69194 69978 -123106 -278970 -86263 74887 213620 -116432
5612 -133464 16982 -37179 119488 184336 422163 131148 265558 175548 -204721 -107900 -226587
5601 -226587 -252514 -62769 87926 70994 -177442 -292816 205992 11229 -37757 170588 254365
5590 254365 -96763 -57999 -74787 278596 303660 -72416 139592 -83495 24263 98015 -310456
5578 216411 -14659 -163791 -14344 -97146 -114084 19438 550462 155148 48155 -150332 189426
5566 122507 275899 116087 182544 163407 18091 -35320 -188776 -41993 69717 -35607 105691
5554 279309 238154 46433 168261 -75025 34005 -36133 254579 322225 -119530 341081 -78642
5542 -4609 -128465 56137 -239336 -55584 -119590 105859 -93610 -34067 33985 -112320 20812
5530 87372 -51228 67162 131942 125182 -261247 -549513 -273665 -51180 36628 -160525 123559
5518 -74683 437852 -168256 103345 29748 174255 11615 84824 -206533 124265 -258841
5507 59438 -162928 -170880 -176103 7707 -65849 -254487 128925 108819 70466 -19655 114407 -273800
5494 -345677 105258 49147 -134881 85449 -109169 -39794 -206224 -6515 250090 24161 216918
5483 216918 -115765 122105 113534 -269 -15705 -91679 69077 60946 231961 -246459 200476
5471 -122017 31035 169456 -79705 65402 -131380 60762 -55855 -214632 -274531 -433925 -41390
5459 48891 89836 -224772 -112503 133833 -60357 -159282 91279 -227378 -75035 369800 161457
5447 -176450 406323 -162414 174578 -118639 -176960 -194744 -277022 -67301 -52824 111466 -295916
5435 163614 151661 163050 81651 77441 -87520 -76337 -197139 -273787 34925 -78142 360439
5423 6574 -83457 -238424 79255 86458 -83168 -196173 59990 -456618 -346343 -39753 221119
5411 259657 -125499 -78144 119562 114879 219988 -271549 -134842 125131 43326 13605 -175796
5399 94425 209123 433840 -38566 -177573 222204 -69277 189739 -15249 -146762 -2489 -89049
5388 -89049 117434 77696 272897 340418 -151280 126754 -31777 -248887 -215881 432277 227541
5377 227541 116893 -253131 455015 195792 178777 -86575 -54401 218984 148429 203726 -77083
5365 -202284 12265 -68564 46268 -5427 -112114 145254 -34260 254181 218023 122468 -28365
5353 -156067 -69116 66800 -85307 -157532 -375804 50597 24975 176356 -135334 416433 -75414
5341 -115086 -218953 4840 106641 -226931 149410 -273649 55424 -181704 113502 -167244
5330 -92149 2085 -90638 -331660 -15020 -158022 300298 -34605 -66636 -1841 -153568 48134
5318 350345 -179592 107381 -192737 62291 -8060 389907 -65540 -105346 49590 -303909 -137298
5306 303816 99082 -1415 -291727 208130 78153 364870 63850 -415508 158762 16212 114869
5295 114869 -258702 -188213 122689 -168976 -84227 -100240 75165 -120171 -156624 238684 -46820
5283 -39697 -231323 -344408 -135393 -333566 167005 12214 -206473 -248589 -246131 44143 65834
5272 65834 -176467 -79763 48728 -129887 68191 137985 -1599 -81125 -20200 344136 -155727
5260 33652 138618 -145638 -2787 324924 38509 -68832 -133665 -94491 184724 321067 -178496
5248 -224890 237257 -212608 -185995 387510 25297 -24587 -131888 15387 256897 203193 -44176
5236 125899 417766 -70637 66523 -176482 61762 -187544 32606 -26520 28804 12622 75925
5225 75925 -266392 58745 -63082 271157 -67394 116633 157893 -308189 -183585 247548 -172398
5213 -23362 -97349 -100185 -12630 -138856 106391 -269525 40086 87464 -67484 -287187 11354
5201 -36560 -11736 -18972 -419313 -99832 -60886 47895 -104455 98179 112895 -33511 127548
5189 239955 -158306 30278 -286272 69770 78955 88619 66288 -267528 -191785 -51569 26480
5177 -51499 31323 -160201 -55815 57653 79830 -164774 149757 34021 -64272 4197 -231038
5165 154421 107638 -126471 263590 -35854 -98555 122316 -76787 17004 130182 -189110 83249
5153 86149 -11508 1685 60925 -69105 -174290 -49730 37799 -202932 205551 -17860 -103264
5142 -103264 98881 -304256 -267483 56626 71832 52468 102667 -23045 -80039 109073 128033
5131 128033 204858 -30130 55944 -167844 151372 432308 123416 -5513 -45984 -214457 55161
5119 70430 16959 341086 -62793 -267229 -235664 119699 -18960 70906 66164 4480 -135103
5107 68538 -177880 73890 257015 85555 1762 99989 -9802 117148 -85749 165583 -197598
5095 127569 209967 -16354 -375800 -272872 165172 -193681 -49377 204168 -230205 -201570
5085 -201570 -118830 302169 -242003 154944 -99161 -144645 -203476 166433 97413 119723 -247049
5073 149122 264430 113769 -106658 211099 -44135 -90963 -109990 -170836 24441 -278868 240484
5061 -44028 -203591 -42586 95048 18883 238002 -43916 -97962 16065 -52162 196376 -219914
5049 -32351 -200097 -258664 -274149 -333706 83992 -142265 124837 7070 -81296 188154 127562
5038 127562 24042 -204034 20548 -120650 47720 189413 76120 98013 -221383 -229866 -58525
5026 -130878 53315 -124524 177193 -96909 -108675 -31101 -48987 222971 313286 110690 -19935
5014 5532 -135814 -103919 -269242 46871 344337 -51076 124775 51977 202742 -74741 227588
5002 -1201 145755 102446 -138597 -24496 64849 156199 140760 60950 131754 102430 59798 -154242
4989 293078 -71279 -74446 33517 -132130 231408 146230 -230793 -140719 73621 -263712 -72122
4977 -338794 -194757 -43712 253743 -23501 -256342 264676 99041 211997 13511 -50566 -103325
4966 -103325 -9724 -98330 21411 -225105 -123224 277217 5839 93464 -235147 142334 -318827
4954 -205438 71369 89986 -52802 -195285 195596 -159422 397881 -16853 -118841 196055
4943 85959 85579 167989 118914 299738 -21677 -130625 -67691 242007 -199155 17520 -117764
4931 -222575 144741 -375784 -39749 -275447 72164 -113907 -8310 75452 34951 85917 -62407
4919 101658 290458 2630 107246 129655 -156263 45980 -172157 -86916 246213 152849 -169198
4907 248231 -8529 154768 -145820 -371396 14355 -89398 -26265 -67661 -35770 -196217 56566
4895 -157231 -103507 -201193 109255 69261 -144094 164788 -53270 -55994 -236918 -100963 -120471
4884 -120471 -115778 212146 17011 -167307 -306141 -213540 268717 -144775 157562 78326 -78599
4872 -183820 337122 -33931 -13605 -151207 -14658 206139 12764 -229580 206086 -224045
4861 -304713 -258649 30395 52833 173384 129268 461946 -292700 146350 216443 22219 -25281
4849 14052 192853 181571 109085 -68179 -103176 193767 273488 -77090 249758 220921 220519 -161735
4836 310167 59945 -189042 30963 17445 -2654 105955 79707 -49549 54156 327981 43745
4824 146140 128708 23155 67891 54551 -255993 52760 -100548 -151909 -51709 -265417 -92282
4812 -149966 134967 167969 -252893 -300163 -200490 -393939 -125671 71379 158735 33338 -29390
4800 150234 124728 630880 86378 -82876 294330 -239217 304557 179789 128070 -36547 -66571
4789 -66571 437733 16252 -28100 54551 -167603 150365 -401394 224518 -11476 -201484 -269234
4778 -269234 24148 -180830 162517 30691 -50003 -130259 70586 -75001 165623 -287865 47808
4766 -3910 97535 269075 -46086 42964 -108467 62531 245614 -241390 129958 -651 208277
4754 -14129 -61074 -380498 35419 -49669 56208 369303 -40995 179644 162378 160906 -93262
4742 -10900 295124 -335460 115592 -120091 71478 51793 -39453 -54860 -326500 -71453 -68593
4731 -68593 -77215 217446 72680 273321 -114472 125878 23235 -230886 343340 74780 -77675
4719 -198412 189620 -339330 -182948 -143894 123085 139210 -27027 108910 18677 -242175
4708 -11010 5417 153662 -204267 -79825 -183532 -942 38344 1651 -95447 340033 -95848 169140
4695 192720 22650 339306 209238 140494 44023 -112471 -140733 -95473 27686 345341 -92922
4683 -126318 11801 -153202 24684 -22193 -116905 172822 -247156 229160 171813 24708 -149537
4671 -205622 -312827 -160420 394518 233879 90200 313464 132358 66956 397644 448728
4661 448728 247717 20687 91465 -109034 2909 86952 271650 129830 -121116 -53654 24041
4649 -34327 68027 -1563 212049 134017 -192155 -3951 -17778 198279 -4332 2738 133550 -207489
4636 -23800 105234 214504 -290272 -223124 -125133 -157037 62795 -121380 -273871 142191 107855
4625 107855 175242 -170988 89357 328131 120170 36641 76943 -105154 131678 30556 -207491
4613 -1742 186966 -41510 324997 -121530 -204245 473335 20191 140782 -233157 -71107 -167854
4602 -167854 139597 176136 269296 249979 -22786 -228325 -222071 230099 83710 -73895 -58260
4591 -58260 35233 218665 -213747 69321 -206121 -302723 -27144 202975 66963 70285 -85474
4579 -239483 181735 17899 143155 -28627 43433 -37226 119361 -151477 15404 297139 16114
4567 -68012 100268 228971 -268381 -97049 -146834 -235920 158607 188438 280657 -148948 28492
4555 -418428 97430 300785 -61933 -89754 -41008 155729 106597 85987 -195797 163 144880
4544 144880 16690 380406 -264154 57170 -38703 -36947 195739 106340 206061 15788 46829
4533 46829 28307 366183 41518 112393 -116571 7969 -240022 -7933 66220 -154697 46651
4521 17180 145354 44946 44081 -88601 187967 193334 -42542 108018 -251976 -14748 -74983 81109
4508 -223560 -352526 -179996 10690 78816 -86313 -179935 -470718 -255536 228939 67687 -8524
4496 64680 20522 -16636 76987 54833 -19520 138355 310186 197576 16333 268451 55860
4484 -221394 -123453 -97119 18644 159353 -57139 341209 -166901 177603 178931 180763 -295247
4472 168650 305864 15898 7169 -123039 199638 209572 91414 -111863 -54460 152605 366675
4461 366675 -28434 211242 382709 -30907 -97062 117673 -2412 168029 15098 -407510 -199843
4449 -15273 204926 259417 -158494 -182660 -448068 134815 33594 210441 19658 -288943 160268
4437 20217 171244 5504 123991 76051 -62483 316404 -18695 -136132 11219 73931 108866
$$ [...]
##END NTUPLES=NMR SPECTRUM
##END=
