##TITLE=AC1457_PAST213263_7818852_oyjx0UaAgp
##JCAMPDX= 6.0         $$ Bruker NMR JCAMP-DX V2.0
##DATA TYPE= NMR SPECTRUM
##DATA CLASS= NTUPLES
##ORIGIN= BRUKER
##OWNER= Administrator
$$ 1.72 TOPSPIN		Version 2.1
$$ 2013-04-30 20:31:14.237 -0700  Administrator@X
$$ Compression mode = diff/dup
##.OBSERVE FREQUENCY= 400.02188249412
##.OBSERVE NUCLEUS= ^1H
##.ACQUISITION MODE= SIMULTANEOUS (DQD)
##.ACQUISITION SCHEME= undefined
##.AVERAGES= 64
##.DIGITISER RES= 22
##SPECTROMETER/DATA SYSTEM= spect
##.PULSE SEQUENCE= noesygpps1d.comp
##.SOLVENT NAME= COFFEE_meoh
##.SHIFT REFERENCE= INTERNAL, COFFEE_meoh, 1, 14.96071
##AUDIT TRAIL= $$ (NUMBER, WHEN, WHO, WHERE, PROCESS, VERSION, WHAT)
$$ ##TITLE= Audit trail, TOPSPIN		Version 2.1
$$ ##JCAMPDX= 5.01
$$ ##ORIGIN= Bruker BioSpin GmbH
$$ ##OWNER= Administrator
$$ $$ E:\/data/COFFEE/nmr/AC1457_PAST213263_7818852_oyjx0UaAgp/12/pdata/1/auditp.txt
$$ ##AUDIT TRAIL=  $$ (NUMBER, WHEN, WHO, WHERE, PROCESS, VERSION, WHAT)
(   1,<2013-04-30 20:31:09.081 -0700>,<Administrator>,<X>,<go>,<TOPSPIN 2.1>,
      <created by zg
	started at 2013-04-30 20:19:39.222 -0700,
	POWCHK enabled, PULCHK disabled,
       configuration hash MD5:
       F7 49 AB AC A2 8D 51 76 73 8D C1 9A A6 38 9F DE
       data hash MD5: 64K
       27 05 B1 2F BA 42 C2 BB B8 48 B4 6A 71 0C 2B E1>)
(   2,<2013-04-30 20:31:12.144 -0700>,<Administrator>,<X>,<proc1d>,<TOPSPIN 2.1>,
      <Start of raw data processing
       efp LB = 0.3 FT_mod = 6 PKNL = 1 PHC0 = 0 PHC1 = 0 SI = 128K 
       data hash MD5: 128K
       D9 B1 AE 0E A4 AA 88 B8 45 EF 24 4B 75 1D AE A7>)
(   3,<2013-04-30 20:31:13.159 -0700>,<Administrator>,<X>,<proc1d>,<TOPSPIN 2.1>,
      <pk PHC0 = -79.39819 PHC1 = 0 
       data hash MD5: 128K
       10 CE 5A 6D 20 52 9A 52 8A B2 EF 05 9E FE 1D 34>)
(   4,<2013-04-30 20:31:13.597 -0700>,<Administrator>,<X>,<proc1d>,<TOPSPIN 2.1>,
      <abs ABSG = 1 
       data hash MD5: 128K
       F7 2F DD 5E D7 7A 67 EC B5 23 01 EA F1 B1 CB 7E>)
(   5,<2013-04-30 20:31:13.706 -0700>,<Administrator>,<X>,<proc1d>,<TOPSPIN 2.1>,
      <abs ABSG = 2 
       data hash MD5: 128K
       B2 36 67 E8 29 82 ED 56 6D 1E 54 EF 55 0C D2 7A>)
(   6,<2013-04-30 20:31:13.800 -0700>,<Administrator>,<X>,<proc1d>,<TOPSPIN 2.1>,
      <abs ABSG = 3 
       data hash MD5: 128K
       EF 2F 5D AE CF 0B 25 8F 44 2D 2E E4 93 6E 41 B1>)
(   7,<2013-04-30 20:31:13.925 -0700>,<Administrator>,<X>,<proc1d>,<TOPSPIN 2.1>,
      <abs ABSG = 4 
       data hash MD5: 128K
       CD DB E1 11 A2 D7 C9 2C 42 6E A9 9C 11 D2 59 EA>)
(   8,<2013-04-30 20:31:14.019 -0700>,<Administrator>,<X>,<proc1d>,<TOPSPIN 2.1>,
      <abs ABSG = 5 
       data hash MD5: 128K
       1E 25 BA A7 E5 33 3D 2E 37 47 26 D3 DB 66 9F 5C>)
$$ ##END=
$$ 
$$ $$ hash MD5
$$ $$ C3 92 63 75 15 04 E6 EE 62 52 09 12 DE 6C 4F B6
##$RELAX= 
##$RELAX= 
##$RELAX= 
##$RELAX= 
##$RELAX= 
##$RELAX= 
##$RELAX= 
##$RELAX= 
$$ Bruker specific parameters
$$ --------------------------
##$DU= <E:\>
##$EXPNO= 12
$$ [...]
##$TP07= 0
##$TPNAME0= <>
##$TPNAME1= <>
##$TPNAME2= <>
##$TPNAME3= <>
##$TPNAME4= <>
##$TPNAME5= <>
##$TPNAME6= <>
##$TPNAME7= <>
##$TPOAL= (0..7)
0.5 0.5 0.5 0.5 0.5 0.5 0.5 0.5
##$TPOFFS= (0..7)
0 0 0 0 0 0 0 0
##$TUNHIN= 0
##$TUNHOUT= 0
##$TUNXOUT= 0
##$USERA1= <user>
##$USERA2= <user>
##$USERA3= <user>
##$USERA4= <user>
##$USERA5= <user>
##$V9= 5
##$VALIST= <valist>
##$VCLIST= <CCCCCCCCCCCCCCC>
##$VD= 0
##$VDLIST= <DDDDDDDDDDDDDDD>
##$VPLIST= <PPPPPPPPPPPPPPP>
##$VTLIST= <TTTTTTTTTTTTTTT>
##$WBST= 1024
##$WBSW= 4
##$XGAIN= (0..3)
0 0 0 0
##$XL= 0
##$YL= 0
##$YMAX_a= 6017716
##$YMIN_a= -12182409
##$ZGOPTNS= <>
##$ZL1= 120
##$ZL2= 120
##$ZL3= 120
##$ZL4= 120
##$ABSF1= 14.96071
##$ABSF2= -5.597472
##$ABSG= 5
##$ABSL= 3
##$ALPHA= 0
##$AQORDER= 0
##$ASSFAC= 0
##$ASSFACI= 0
##$ASSFACX= 0
##$ASSWID= 0
##$AUNMP= <proc_prof1d_extract.lims>
##$AXLEFT= 0
##$AXNAME= <>
##$AXNUC= <1H>
##$AXRIGHT= 0
##$AXTYPE= 0
##$AXUNIT= <>
##$AZFE= 0.1
##$AZFW= 0.1
##$BCFW= 0
##$BC_mod= 0
##$BYTORDP= 0
##$COROFFS= 0
##$CY= 15
##$DATMOD= 1
##$DC= 0
##$DFILT= <>
##$DTYPP= 0
##$F1P= 0
##$F2P= 0
##$FCOR= 0.5
##$FTSIZE= 131072
##$FT_mod= 6
##$GAMMA= 0
##$GB= 0
##$INTBC= 1
##$INTSCL= 1
##$ISEN= 128
##$LB= 0.3
##$LEV0= 0
##$LPBIN= 0
##$MAXI= 10000
##$MC2= 0
##$MEAN= 0
##$ME_mod= 0
##$MI= 0
##$NCOEF= 0
##$NC_proc= -2
##$NLEV= 6
##$NOISF1= 0
##$NOISF2= 0
##$NSP= 0
##$NTH_PI= 0
##$NZP= 0
##$OFFSET= 14.96071
##$PC= 1
##$PHC0= -79.39819
##$PHC1= 0
##$PH_mod= 1
##$PKNL= yes
##$PPARMOD= 0
##$PPDIAG= 0
##$PPIPTYP= 0
##$PPMPNUM= 2147483647
##$PPRESOL= 1
##$PSCAL= 4
##$PSIGN= 0
##$PYNMP= <proc.py>
##$REVERSE= no
##$SF= 400.020009754375
##$SI= 131072
##$SIGF1= 0
##$SIGF2= 0
##$SINO= 400
##$SIOLD= 131072
##$SPECTYP= <>
##$SREGLST= <1H.CDCl3>
##$SSB= 0
##$STSI= 131072
##$STSR= 0
##$SW_p= 8223.68421052631
##$SYMM= 0
##$S_DEV= 0
##$TDeff= 65536
##$TDoff= 0
##$TI= <>
##$TILT= no
##$TM1= 0
##$TM2= 0
##$TOPLEV= 0
##$USERP1= <user>
##$USERP2= <user>
##$USERP3= <user>
##$USERP4= <user>
##$USERP5= <user>
##$WDW= 1
##$XDIM= 131072
##$YMAX_p= 362984528
##$YMIN_p= -11349
##$CURPLOT= <Network HP LaserJet P1505>
##$CURPRIN= <$Network HP LaserJet P1505>
##$DFORMAT= <normdp>
##$LAYOUT= <+/1D_H.xwp>
##$LFORMAT= <normlp>
##$PFORMAT= <normpl>
##$SURQMSG= 1
$$ End of Bruker specific parameters
$$ ---------------------------------
##NTUPLES= NMR SPECTRUM
##VAR_NAME=  FREQUENCY,     SPECTRUM/REAL,   SPECTRUM/IMAG
##SYMBOL=    X,             R,               I
##VAR_TYPE=  INDEPENDENT,   DEPENDENT,       DEPENDENT
##VAR_FORM=  AFFN,          ASDF,            ASDF
##VAR_DIM=   131072,        131072,          131072
##UNITS=     HZ,            ARBITRARY UNITS, ARBITRARY UNITS
##FACTOR=    0.0627417313425164, 1,          1
##FIRST=     8223.62146879497, 2704,         -52697
##LAST=      0,             4753,            -51581
##MIN=       0,             -11349,          0
##MAX=       8223.62146879497, 362984528,    0
$$ Real data points
##PAGE= N=1
##DATA TABLE= (X++(R..R)), XYDATA
$$ [...]
61712D64742J397M64l03j23L17q0j179j918j963k084k893l960m457m074l152k302
61696D38432j989k214k464k382k395l179m443m883l644j479Mm3j018j706j478
61681D05119p33l19n43q85p71l95m15r74j518j585j303j003p34m68m31r14j862
61664C90266k807l143k523j198KL73K3l07j24M16Q90J052Q50M47K77P08J567K293
61646C89062K589K629K657K788L139L720M082L709K792K119K023J978J384K01
61632D24872j349l066m430m708l932l166l271l833l944l551l300l364l253k725
61618C76980k139j710j152l55J11l58j516k483k791k882l393m289m995n212n217
61603C38599n261n177m796m343l997l474k575j828j866k380k469j990j756k246
$$ y = [464742, 466139, 466603, 466300, 466177, 466494, 466414, 465235, 463317, 461354, 459270, 456377, 452417, 447960, 443886, 440734, 438432, 436443, 434229, 431765, 429383, 426988, 423809, 419366, 414483, 410839, 409360, 409364, 409321, 408303, 406597, 405119, 404386, 404067, 403524, 402639, 401868, 401473, 401058, 400084, 398566, 396981, 395678, 394675, 393941, 393473, 393042, 392128, 390266, 387459, 384316, 381793, 380595, 380597, 380970, 380993, 380686, 380562, 380978, 381868, 382920, 383770, 384217, 384494, 385202, 386769, 389062, 391651, 394280, 396937, 399725, 402864, 406584, 410666, 414375, 417167, 419286, 421309, 423287, 424671, 424872, 423523, 420457, 416027, 411319, 407387, 404221, 400950, 397117, 393173, 389622, 386322, 382958, 379705, 376980, 374841, 373131, 371979, 371624, 371735, 371377, 369861, 367378, 364587, 361705, 358312, 354023, 349028, 343816, 338599, 333338, 328161, 323365, 319022, 315025, 311551, 308976, 307148, 305282, 302902, 300433, 298443, 296687, 294441]
61589B94441k922l127k911k619k282j856j572j566j616j566j637j959k203k013
61575B64592j447p25M7O11N08l41j392k089k322k102j361l85J37p2m84n47l45
61558B52283j56Q8M69P72R93J504K281K549J871R01M03J52l71p72l06P35J257
61541B64653R26N08O05Q79P76L88L10R30K002K775K607J582L65o22j458k136k328
61524B72762k043j807j766j377n10Ll39o76r5P82O97k65q52n31M7L22L42O0o94
61505B64060j400j088K97J638J924J106l34j781k425j757l26P55J160J404J633
61490B64866J356N43o7q0N2j2P3N41J007J150J202J352J355J169J242J716K001
61473B79466J585P69J37j34q3L10P86P68J40m35l78PM2m22j003j374j446j271
$$ y = [294441, 291519, 288392, 285481, 282862, 280580, 278724, 277152, 275586, 273970, 272404, 270767, 268808, 266605, 264592, 263145, 262420, 262467, 263078, 263586, 263245, 261853, 259764, 257442, 255340, 253979, 253594, 253731, 253659, 253175, 252628, 252283, 252127, 252215, 252684, 253456, 254449, 255953, 258234, 260783, 262654, 263555, 263958, 264110, 263739, 262967, 262661, 263396, 264653, 265579, 266087, 266692, 267571, 268347, 268735, 269045, 269975, 271977, 274752, 277359, 278941, 279306, 278684, 277226, 275090, 272762, 270719, 268912, 267146, 265769, 265259, 265262, 264923, 264247, 264152, 264934, 265631, 265366, 264514, 263983, 264030, 264352, 264694, 264754, 264060, 262660, 261572, 261869, 263507, 265431, 266537, 266203, 264422, 261997, 260240, 259914, 260669, 261829, 263233, 264866, 266222, 266765, 266698, 266618, 266670, 266658, 266731, 267272, 268279, 269429, 270631, 271983, 273338, 274507, 275749, 277465, 279466, 281051, 281820, 281957, 281823, 281740, 282050, 282836, 283604, 283744, 283309, 282931, 282938, 282980, 282558, 281555, 280181, 278735, 277464]
61455B77464r98p30l27L43J003J262J277J481J731J464P76N11J003J605J756J681
61439B91302J684J574J359J568K313K806K575K334K795L377L075K129J671J974
61425C22536K158J648R87R76J682K545L046L069K912L056L643M195M063L088J757
61410C61361P74N62Q95R24l5j565k451k185j640j868k774l538l794l703l234k296
61394C35433j413j362k069k553k200j442r43p33m99l05m58q77j050p11j56K25
61378C18887M90R19J419J563J287J134J492J992K041J694J407J183O16k06n84
61363C35334j43P00J447K089K703L073L053K935L063L515M363N746P410Q665R233
61348C93186R626J0295J0805J0414R126P670O679O300O340O391N990N076M117
$$ y = [277464, 276466, 275736, 275409, 275752, 276755, 278017, 279294, 280775, 282506, 283970, 284746, 285257, 286260, 287865, 289621, 291302, 292986, 294560, 295919, 297487, 299800, 302606, 305181, 307515, 310310, 313687, 316762, 318891, 320562, 322536, 324694, 326342, 327329, 328305, 329987, 332532, 335578, 338647, 341559, 344615, 348258, 352453, 356516, 359604, 361361, 362135, 362697, 363592, 364516, 364481, 362916, 360465, 358280, 356640, 354772, 351998, 348460, 344666, 340963, 337729, 335433, 334020, 332658, 330589, 328036, 325836, 324394, 323451, 322718, 322219, 321914, 321456, 320579, 319529, 318818, 318662, 318887, 319377, 320296, 321715, 323278, 324565, 325699, 327191, 329183, 331224, 332918, 334325, 335508, 336124, 335918, 335334, 335191, 335891, 337338, 339427, 342130, 345203, 348256, 351191, 354254, 357769, 362132, 367878, 375288, 383953, 393186, 402812, 413107, 423912, 434326, 443452, 451122, 457801, 464101, 470441, 476832, 482822, 487898, 492015]
61335D92015L559L383L336L202K609J200o25j817j980k038k947m315n119n260
61321D85203n457n891n979n456m700l900k789j393k56L68Q93J623K261K545K827
61306D59899L585M704N728O481P111P593P642O975N453L066Q1k893n251o864p971
61291D95339q630q515p438n905m815m558m658m387l566k536j606q69m27l60l72
61276D36697J75J634L626N264N782N040L748L083L707N067N995N985N586N552
61262D96941O031O725P414Q174R297J0979J2809J3781J3264J1831J0522R396P702
61249F24866N450L796L460L692L308K041K97j692l791n577o664p088o968o315
61235F08815n488n150n306n151m468m284n289o465o343n021l734k910j995r26
$$ y = [492015, 495574, 498957, 502293, 505495, 508104, 509304, 508679, 506862, 504882, 502844, 499897, 495582, 490463, 485203, 479746, 473855, 467876, 462420, 457720, 453820, 451031, 449638, 449382, 449750, 450643, 452266, 454527, 457072, 459899, 463484, 468188, 473916, 480397, 487508, 495101, 502743, 509718, 515171, 518237, 518318, 515425, 510174, 503310, 495339, 486709, 478194, 470756, 464851, 460036, 455478, 450820, 446433, 442867, 440331, 438725, 437856, 437429, 437069, 436697, 436872, 438506, 442132, 447396, 453178, 458218, 461966, 465049, 468756, 473823, 479818, 485803, 491389, 496941, 502972, 509697, 517111, 525285, 534582, 545561, 558370, 572151, 585415, 597246, 607768, 617164, 624866, 630316, 634112, 637572, 641264, 644572, 646613, 646910, 645218, 641427, 635850, 629186, 622098, 615130, 608815, 603327, 598177, 592871, 587720, 583252, 578968, 573679, 567214, 560871, 555850, 552116, 549206, 547211, 546285]
61221E46285m52q57j480j712j576j159l77N04Q83O98N73R14J375J450J033L01
61205E46403m71r11q44o14n66l32P24K436M004N279P047R799J2939J5497J7008
61190F17398J7391J6700J5346J4042J3056J1948J0348Q599P286O576O315O367
61178G51372O477O117M933L266J894J278J182R29k1j657l503n151o475p282p263
61163G46096o695o702q052r967j1026j1136j1582j2965j4158j3832j2140j0172
61151F17669q447o738m966l447k329j459p99n48q66j779l236m943o239o650o493
61136E58730o539o987p215o629n420m164l004j682k21R47J697K586M143O111P815
61121E40168R137J0571J2374J4283J6121J8072K0098K1690K2557K3032K3383K3320
$$ y = [546285, 545833, 544976, 543496, 541784, 540208, 539049, 538672, 539176, 540059, 540757, 541330, 542244, 543619, 545069, 546102, 546403, 545932, 545021, 544177, 543563, 542997, 542665, 543389, 545825, 549829, 555108, 562155, 571954, 584893, 600390, 617398, 634789, 651489, 666835, 680877, 693933, 705881, 716229, 724828, 732114, 738690, 745005, 751372, 757849, 763966, 768899, 772165, 774059, 775337, 776519, 777448, 777427, 775770, 772267, 767116, 760641, 753359, 746096, 739401, 732699, 724647, 714680, 703654, 692518, 680936, 667971, 653813, 639981, 627841, 617669, 609222, 602484, 597518, 594071, 591742, 590283, 589484, 588936, 588070, 586291, 583055, 578112, 571873, 565223, 558730, 552191, 545204, 537989, 531360, 525940, 521776, 518772, 517090, 516869, 517816, 519513, 522099, 526242, 532353, 540168, 549305, 559876, 572250, 586533, 602654, 620726, 640824, 662514, 685071, 708103, 731486, 754806]
61109G54806K2674K2087K2269K2932K3127K2412K1083J9424J7415J5095J2555
61098I75879R649O267K733o44m167q237j2315j5268j6813j7859j9284k0957k2206
61085H56778k2616k2231k1461k0946k0983k0971k0004j8104j6253j5082j4203
61074F43924j3098j1959j1162j0471r346p756o200n096m463m029l397k272p42
61061E53933P43J838K592L206L681L881L885M099M943O453Q183R667J0911J2155
61047F30170J3309J4066J4656J5851J7835J9778K1015K2079K3852K6184K8187
61036H46982K9618L1092L3015L5087L6859L8199L9271M0478M2219M4209M5503
61025A262532M5746M5885M6947M8783N0934N4003N8938O5475P2683Q0582Q9847
$$ y = [754806, 777480, 799567, 821836, 844768, 867895, 890307, 911390, 930814, 948229, 963324, 975879, 985528, 991795, 994528, 993884, 989717, 981480, 969165, 953897, 937084, 919225, 899941, 878984, 856778, 834162, 811931, 790470, 769524, 748541, 727570, 707566, 689462, 673209, 658127, 643924, 630826, 618867, 607705, 597234, 587888, 580132, 573932, 568836, 564373, 560344, 556947, 554675, 553933, 554676, 556514, 559106, 562312, 565993, 569874, 573759, 577858, 582801, 589254, 597437, 607104, 618015, 630170, 643479, 657545, 672201, 688052, 705887, 725665, 746680, 768759, 792611, 818795, 846982, 876600, 907692, 940707, 975794, 1012653, 1050852, 1090123, 1130601, 1172820, 1217029, 1262532, 1308278, 1354163, 1401110, 1449893, 1500827, 1554830, 1613768, 1679243, 1751926, 1832508, 1922355]
61014A922355J00403J12170J26986J47848J76189K11712K54982L08070L72496
61005C733211M48932N39470O47964P77639R30804J109771J310719J511531J670244
60996A2680285J743621J708496J562116J307998R57852N56361J91797m1792j07868
60987B0558866n3577K8624O1247M901j59236m40606q18503j221806j551604j736089
60977A4672217j765294j677420j521737j336089j146006r68449q11601o76266
60969D769355n60989m64877l86116l21350k67989k25254j92180j66314j45195
60960B039091j27691j13226j00875q9872p9886p0457o1080n2135m4616l8657l3388
60949A227208k8513k4858k2938k2092k1513k1057k0473j8986j6390j3801j2414
$$ y = [1922355, 2022758, 2134928, 2261914, 2409762, 2585951, 2797663, 3052645, 3360715, 3733211, 4182143, 4721613, 5369577, 6147216, 7078020, 8187791, 9498510, 11010041, 12680285, 14423906, 16132402, 17694518, 19002516, 19960368, 20516729, 20708526, 20666734, 20558866, 20505289, 20533913, 20595160, 20600061, 20440825, 20000219, 19181716, 17959910, 16408306, 14672217, 12906923, 11229503, 9707766, 8371677, 7225671, 6257222, 5445621, 4769355, 4208366, 3743489, 3357373, 3036023, 2768034, 2542780, 2350600, 2184286, 2039091, 1911400, 1798174, 1697299, 1607427, 1527541, 1457084, 1396004, 1343869, 1299253, 1260596, 1227208, 1198695, 1173837, 1150899, 1128807, 1107294, 1086237, 1065764, 1046778, 1030388, 1016587, 1004173]
60938A004173j2050j1654j0786j0010r972j0652j1399j1473j0652r379q157o898
60926H81091n306l682k703k343j702j38K083M429O766R036J0906J2178J3206J4518
60912I38339J6232J8066J9641K0606K0772K0315J9658J8984J8116J6800J4953
60901A142482J2613R999P447M973K090j476n121q029j0388j3144j6525j9605k1566
60888A083750k2665k3575k4395k4742k4482k3924k3547k3596k3761k3280k1777
60877H24006j9977j8971j8788j8402j7257j5945j5040j4118j2588j0796r537q899
60865F43688q350p711p230o818n951m538l296l050l934n423o830p680p842p523
60851E57512p046o587o159n869n913o248o462o194n656n439n782o264o425o398
$$ y = [1004173, 992123, 980469, 969683, 959673, 949701, 939049, 927650, 916177, 905525, 896146, 887989, 881091, 875785, 872103, 869400, 867057, 865355, 865217, 867300, 871729, 878495, 887531, 898437, 910615, 923821, 938339, 954571, 972637, 992278, 1012884, 1033656, 1053971, 1073629, 1092613, 1110729, 1127529, 1142482, 1155095, 1165094, 1172541, 1177514, 1179604, 1178128, 1173007, 1164978, 1154590, 1141446, 1124921, 1105316, 1083750, 1061085, 1037510, 1013115, 988373, 963891, 939967, 916420, 892824, 869063, 845783, 824006, 804029, 785058, 766270, 747868, 730611, 714666, 699626, 685508, 672920, 662124, 652587, 643688, 635338, 627627, 620397, 613579, 607628, 603090, 599794, 596744, 592810, 587387, 580557, 572877, 565035, 557512, 550466, 543879, 537720, 531851, 525938, 519690, 513228, 507034, 501378, 495939, 490157, 483893, 477468, 471070]
60837D71070o644p178p574p590p362o883n918m661l861l814l799l027j746p53
60823D00260j77M54J184J502J278J043J126J216R73O06N46R39J625K285K516K167
60807D19543J650J544J766J673J038M58N57J196J780J926J543O88l40j052j302
60792D32668j560k258l080l296k875k728l645n178n961n228l666k595k489k794
60778C85315k996l265l794m196m012l386k778k257j632r30k91L47R04Q40j56j387
60762C56326j789j226m63J7L94P95J001R85R77R32N84J76L25J065J793K366L339
60745C67597M763N682N400M469L819L475K874J877P09p17k578m465n642n941n879
60730C75443n860n831n676n456n142m535l621k763k390k611l196l730l813l246
$$ y = [471070, 464426, 457248, 449674, 442084, 434722, 427839, 421921, 417260, 413399, 409585, 405786, 402759, 401013, 400260, 400083, 400537, 401721, 403223, 404501, 405544, 406670, 407886, 408859, 409465, 410011, 410950, 412575, 414860, 417376, 419543, 421193, 422737, 424503, 426176, 427214, 427672, 428229, 429425, 431205, 433131, 434674, 435362, 435022, 433970, 432668, 431108, 428850, 425770, 422474, 419599, 416871, 413226, 408048, 402087, 396859, 393193, 390598, 388109, 385315, 382319, 379054, 375260, 371064, 367052, 363666, 360888, 358631, 356999, 356069, 355778, 356125, 357029, 357869, 357713, 356326, 354537, 353311, 352848, 352865, 353259, 354054, 355055, 356040, 357017, 357949, 358533, 358709, 359034, 360099, 361892, 364258, 367597, 372360, 378042, 383442, 387911, 391730, 395205, 398079, 399956, 400665, 399948, 397370, 392905, 387263, 381322, 375443, 369583, 363752, 358076, 352620, 347478, 342943, 339322, 336559, 334169, 331558, 328362, 324632, 320819, 317573]
60716C17573k210j229q26j077j517j586j244j030j356j909j968j269l13J29k51
60701B99917j027j382r42k15L3j43P6R10J399P06n78j207q34q0O63J447K097K303
60683C03143K343K771L399L604L574M122N165N573M891M018L728L674L441L433
60669C56879L886M004L142K035J804K243K199J165l17j625k494k748k392j843
60655C65938j506j273j008j037j541j900j475o98m74p44n71L70J300J404N96q02
60639C56579k449l849m563m751n005n486n720n349m573l667k636j494n10R5L68
60624C06990M28L80M92J037J790K053J405J87r32j564j697j429q79k47K12L20
60608C08546J18p1J42P46J275J351J189J253J538J604J224P08M74O55J093J564
$$ y = [317573, 315363, 314134, 313308, 312231, 310714, 309128, 307884, 306854, 305498, 303589, 301621, 300352, 300039, 300168, 299917, 298890, 297508, 296566, 296351, 296384, 296241, 296317, 297227, 298626, 299332, 298754, 297547, 296713, 296633, 297296, 298743, 300840, 303143, 305486, 308257, 311656, 315260, 318834, 322956, 328121, 333694, 338585, 342603, 346331, 350005, 353446, 356879, 360765, 364769, 367911, 369946, 371750, 373993, 376192, 377357, 377040, 375415, 372921, 370173, 367781, 365938, 364432, 363159, 362151, 361114, 359573, 357673, 356198, 355500, 355026, 354282, 353711, 354081, 355381, 356785, 357381, 356579, 354130, 350281, 345718, 340967, 335962, 330476, 324756, 319407, 314834, 311167, 308531, 307037, 306527, 306622, 306990, 307418, 307798, 308290, 309327, 311117, 313170, 314575, 314762, 313830, 312266, 310569, 309140, 308261, 308014, 308226, 308546, 308664, 308593, 308735, 309481, 310756, 312107, 313296, 314549, 316087, 317691, 318915, 319623, 320097, 320752, 321845, 323409]
60592C23409J877J948J790J377O11l64j064j167r76j012j199q77L33J982L244
60577C29912L677L468L105K917K867K801K890L615N134O938Q430R577J0606J1230
60563D07167J0817R349P650O445N559M246K079o82l324n112n727n456m823l979
60549D24209k725j144J68Q53J441K832N175P628R267R947J0232J0666J1331J1922
60535E01802J2106J1791J1130J0190Q691O206K805o98l398n105o238o969p005
60522E35308o330n629n459n405m651l238k047j572j323p32j5K99K50M08J166K474
60506E03504M113N883P613R376J1587J4603J8240K1933K5408K8880L2509L5947
60494G19596L8606M0207M0869M0684L9315L6187L0964K3716J4730M413o544j7165
$$ y = [323409, 325286, 327234, 329024, 330401, 331012, 330648, 329584, 328417, 327441, 326429, 325230, 324353, 324686, 326668, 329912, 333589, 337057, 340162, 343079, 345946, 348747, 351637, 355252, 360386, 367324, 375754, 385331, 395937, 407167, 417984, 427333, 434983, 441428, 446987, 451233, 453312, 452630, 449306, 444194, 438467, 433011, 428188, 424209, 421484, 420340, 420508, 421361, 422802, 425634, 430809, 438437, 447704, 457651, 467883, 478549, 489880, 501802, 513908, 525699, 536829, 547019, 555710, 561916, 564721, 564023, 560625, 555520, 549282, 542313, 535308, 528978, 523349, 517890, 512485, 507834, 504596, 502549, 500977, 499654, 498922, 498907, 499206, 499456, 499864, 501030, 503504, 507617, 513500, 521113, 530489, 542076, 556679, 574919, 596852, 622260, 651140, 683649, 719596, 758202, 798409, 839278, 879962, 919277, 955464, 986428, 1010144, 1024874, 1029287, 1022743, 1005578]
60482A005578k6586l4303l9979m3348m4556m4248m3016m0912l7892l4377l0866
60471E85495k7258k3253j9245j6119j4129j2704j1410j0420r854r434q941q433
60459D14295p760o599n200m399m487m751m528m077l924l998l941l675l141k063
60445C51752o28K70Q2n47p04m71n02q47j071j191j514j795j499q18n03o93p92
60428C38529o04o93j383k137k266j684p08L52J129J260Q74O87J197K090K648K544
60412C41835K005J424J082J104J395J551J116N3j024j322o66L02Q96J169J583
60397C52503K123K307K040J775J735J633J450J636K239K531K109J635J779K112
60383C79607J882J344J384K136K895L181L008K432J672J454K248L254L163J929
$$ y = [1005578, 978992, 944689, 904710, 861362, 816806, 772558, 729542, 688630, 650738, 616361, 585495, 558237, 534984, 515739, 499620, 485491, 472787, 461377, 450957, 441103, 431669, 422728, 414295, 406535, 399936, 394736, 390337, 385850, 381099, 376571, 372494, 368570, 364572, 360631, 356956, 353815, 351752, 351124, 351394, 351476, 350929, 350225, 349754, 349252, 348405, 347334, 346143, 344629, 342834, 341335, 340517, 340014, 339321, 338529, 337925, 337232, 335849, 333712, 331446, 329762, 329054, 329406, 330535, 331795, 332669, 333356, 334553, 336643, 339291, 341835, 343840, 345264, 346346, 347450, 348845, 350396, 351512, 351565, 350541, 349219, 348553, 348855, 349751, 350920, 352503, 354626, 356933, 358973, 360748, 362483, 364116, 365566, 367202, 369441, 371972, 374081, 375716, 377495, 379607, 381489, 382833, 384217, 386353, 389248, 392429, 395437, 397869, 399541, 400995, 403243, 406497, 409660, 411589]
60369D11589Q01N63Q21J102J618K444K927K534J688J137R95Q88P53R66J851L317
60353D35994M905O130O927P708Q774R789J0208R908R029P489N322L173J636K52
60339E27244j847m410o172o679o803p175p234o477n584n354n321m500l086k322
60325D54280k729l457l534l062k724k607k074q21M37P21J56k4R87K534L551M223
60309D45857N749Q541J1618J3949J5625J7301J9135K0764K1790K1788K0153J6497
60297F38767J1161N071r08o436j1640j6551k0511k2376k1715j9488j7036j4652
60285E03686j1860q860o616n460m666l743l121l137l205k753k188k193k634k857
60271D40393k706k567k750l349m357n376n589m584l006j905j721k192k798k912
$$ y = [411589, 412390, 412953, 413774, 414876, 416494, 418938, 421865, 424399, 426087, 427224, 428219, 429107, 429860, 430826, 432677, 435994, 440899, 447029, 453956, 461664, 470438, 480227, 490435, 500343, 509372, 516861, 522183, 525356, 526992, 527244, 525397, 520987, 514815, 508136, 501333, 494158, 486924, 480447, 474863, 469509, 464188, 459688, 456602, 454280, 451551, 448094, 444560, 441498, 438774, 436167, 434093, 433272, 433709, 434430, 434586, 434562, 435549, 438083, 441634, 445857, 451606, 460147, 471765, 485714, 501339, 518640, 537775, 558539, 580329, 602117, 622270, 638767, 649928, 654999, 654091, 647655, 636015, 619464, 598953, 576577, 554862, 535374, 518338, 503686, 491826, 482966, 476350, 470890, 466224, 462481, 459360, 456223, 453018, 450265, 448077, 445884, 443250, 440393, 437687, 435120, 432370, 429021, 424664, 419288, 413699, 409115, 406109, 404204, 402483, 400291, 397493, 394581]
60257C94581k064o52J31l15j145j247p95p59j261j449q92j24L47P35J379K068
60241C88538K327K017J414R23P46O85L11l66o34J09J444K365K469K220K034J830
60225D08432J525J425J763K341K815L079L123K891K546K518L003L676M162M544
60211D47843N081N649N851N680N608N899O202O093N775N803O201O271N529M403
60197E27888L732L726L872L696L217K641K053J560J380J582J857J730Q91n98k237
60182E56990l360l694l639l692l817l769l802m380n235n486m899m198l896l539
60168D99584k622j556j061j147j346j489j627j493q50r3J88J07K88Q88J454J723
60152D90948J897K128K295K398K586K692K319J530R58J051J570K118K757L842
$$ y = [394581, 392517, 391865, 391996, 391681, 390536, 389289, 388494, 387735, 386474, 385025, 384133, 384009, 384356, 385091, 386470, 388538, 390865, 392882, 394296, 395219, 395965, 396650, 396961, 396595, 395961, 396070, 397514, 399879, 402348, 404568, 406602, 408432, 409957, 411382, 413145, 415486, 418301, 421380, 424503, 427394, 429940, 432458, 435461, 439137, 443299, 447843, 452924, 458573, 464424, 470104, 475712, 481611, 487813, 493906, 499681, 505484, 511685, 517956, 523485, 527888, 531620, 535346, 539218, 542914, 546131, 548772, 550825, 552385, 553765, 555347, 557204, 558934, 559825, 559227, 556990, 553630, 549936, 546297, 542605, 538788, 535019, 531217, 526837, 521602, 516116, 511217, 507019, 503123, 499584, 496962, 495406, 494345, 493198, 491852, 490363, 488736, 487243, 486393, 486300, 486488, 486595, 486883, 487771, 489225, 490948, 492845, 494973, 497268, 499666, 502252, 504944, 507263, 508793, 509751, 510802, 512372, 514490, 517247, 521089]
60138E21089N450P238Q688R446R588R601R896J0203R774Q268O188M267K717J283
60124F23696j27j207j676j639j434j230r85p48p24r17q94k23Q30J431J074J24
60108F15351o87j044j134j239j446j683j816j810j901k361k988l108k302q94N29
60093E91467J767K787L272K942K218K022K780M058N193N901O185O046N533M776
60079F46947L849K750J621O86r6j105k553m166n557o705p854r014r962j0652j1295
60064E86894j1916j2103j1515j0493r766r557r260q245o680n268m408l928l585
60051D80170l387l325l084k278q69P47K023K704L072L683M714N705O125O036N884
60036E07920N808N589N156M647L963K815J360K09m41j100k144l179l721m075m926
$$ y = [521089, 526539, 533777, 542465, 551911, 561499, 571100, 580996, 591199, 600973, 609241, 615429, 619696, 622413, 623696, 623569, 622362, 620686, 619047, 617613, 616383, 615398, 614650, 613926, 613009, 612115, 611892, 612722, 614153, 615227, 615351, 614664, 613620, 612486, 611247, 609801, 608118, 606302, 604492, 602591, 600230, 597242, 594134, 591832, 590938, 591467, 593234, 596021, 599293, 602235, 604453, 606475, 609255, 613313, 618506, 624407, 630592, 636638, 642171, 646947, 650796, 653546, 655167, 655853, 655757, 654652, 652099, 647933, 642376, 635671, 627817, 618803, 608841, 598189, 586894, 574978, 562875, 551360, 540867, 531101, 521544, 512284, 504039, 497359, 492091, 487683, 483755, 480170, 476783, 473458, 470374, 468096, 467227, 467974, 469997, 472701, 475773, 479456, 484170, 489875, 496000, 502036, 507920, 513728, 519317, 524473, 529120, 533083, 535898, 537258, 537467, 537026, 535926, 533782, 530603, 526882, 522807, 517881]
60021E17881o276p356p600p219o722o234n541m647l987l934m249m291l831l327
60007D42667l151k947k229j386j304k079k781k702k123j659j442j301j137p76
59993D15650P5J313K357K948L506M313M856M574L780L249L168L098K756K248J677
59978D59568J066N53K06k61j204k477l512l912l728l238k695k173j544p54r9R3
59962D35889J70R61K619M189M721M356L881L692L648L588L385K819J853Q28n4
59947D76545j023k143k867k752k233k023k060j793j184p77q46j142j401j576j640
59932D51085j575j455j154k92J097K211K355J867J627J907K357K769L150L312
59918D69261L134L074L688M780N653O053O214O224O026N875N995N925M991L359
$$ y = [517881, 511605, 504249, 496649, 489430, 482708, 476474, 470933, 466286, 462299, 458365, 454116, 449825, 445994, 442667, 439516, 436569, 434340, 432954, 431650, 429571, 426790, 424088, 421965, 420306, 418864, 417563, 416426, 415650, 415725, 417038, 419395, 422343, 425849, 430162, 435018, 439592, 443372, 446621, 449789, 452887, 455643, 457891, 459568, 460634, 461187, 461393, 461132, 459928, 457451, 453939, 450027, 446299, 443061, 440366, 438193, 436649, 435895, 435796, 435889, 436059, 437020, 439639, 443828, 448549, 452905, 456786, 460478, 464126, 467714, 471099, 473918, 475771, 476599, 476545, 475522, 473379, 470512, 467760, 465527, 463504, 461444, 459651, 458467, 457690, 456844, 455702, 454301, 452725, 451085, 449510, 448055, 446901, 446609, 447706, 449917, 452272, 454139, 455766, 457673, 460030, 462799, 465949, 469261, 472395, 475469, 479157, 483937, 489590, 495643, 501857, 508081, 514107, 519982, 525977, 531902, 536893, 540252]
59904E40252J888J026N72L37K17j60j045j918k119j904j923j869q37Q89J858J526
59888E36790J113J783L071L833L880L899M362N127N756N793N155M494M620N385
59874E95061N745N185M227L302K055L17j213k016k685l908n149n324m476l760
59860E87361l860m251m079l173k104j556j743k133j821m17J538L218M362N247
59846E76589O017O394O003M755K962J171j70r38j136p12J37O84K95p25j482j792
59830E98052k379l621m860n369n341n315n249m774m040l608l685l958m129m154
59816E37570m105m093m205m260l853k930k021j603j544j543j777k525l427l746
59802D95938l403l185l660m367m396l562k578k103j961j551q18l20l02k58K28
$$ y = [540252, 542140, 543166, 543738, 544075, 544292, 544132, 543087, 541169, 539050, 537146, 535223, 533354, 532517, 533406, 535264, 536790, 537903, 539686, 542757, 546590, 550470, 554369, 558731, 563858, 569614, 575407, 580562, 585056, 589676, 595061, 600806, 605991, 610218, 613520, 615575, 615892, 614679, 612663, 609978, 606070, 600921, 595597, 591121, 587361, 583501, 579250, 575171, 571998, 569894, 568338, 566595, 564462, 562641, 562224, 563762, 566980, 571342, 576589, 582606, 589000, 595003, 599758, 602720, 603891, 603721, 602783, 601647, 600935, 601072, 601756, 602051, 601326, 599844, 598052, 595673, 592052, 587192, 581823, 576482, 571167, 565918, 561144, 557104, 553496, 549811, 545853, 541724, 537570, 533465, 529372, 525167, 520907, 517054, 514124, 512103, 510500, 508956, 507413, 505636, 503111, 499684, 495938, 492535, 489350, 485690, 481323, 476927, 473365, 470787, 468684, 466723, 465172, 464354, 464034, 463732, 463474, 463702]
59787D63702O66L41n31j051q61l95O5O56J200J081K50m62m95k97m21n18L9J075
59769D64044J863K090J944J528Q79L91N20J114J566J607J500J508J616J820K262
59754D86252K977L778M442M848M994N058N336N959O744P478Q173Q849R247R068
59740E73203Q315P225N959M575L148J757L95q74j814k203k042j532r92q52j380
59725E92888k247k685k291j465q99q36j108j615k386l294l985m108l519k372j138
59710E58940m08m13q21j026o55J48Q29R13N54M46R64J633J843J799K119K679K700
59693E72244K034J504J608J756J249L17m51j067j774k150j517j25Q48O74j21n13
59677E74516j51M19M71k33j460k883m233n150n211m446l510l030k901k698k460
$$ y = [463702, 464368, 464709, 464178, 463127, 462266, 461871, 461936, 462592, 463792, 464873, 465123, 464661, 464166, 463869, 463448, 462930, 462969, 464044, 465907, 467997, 469941, 471469, 472348, 472739, 473259, 474373, 475939, 477546, 479046, 480554, 482170, 483990, 486252, 489229, 493007, 497449, 502297, 507291, 512349, 517685, 523644, 530388, 537866, 546039, 554888, 564135, 573203, 581518, 588743, 594702, 599277, 602425, 604182, 604577, 603703, 601889, 599686, 597644, 596112, 595120, 594268, 592888, 590641, 587956, 585665, 584200, 583301, 582465, 581357, 579742, 577356, 574062, 570077, 565969, 562450, 560078, 558940, 558532, 558119, 557298, 556272, 555617, 555765, 556594, 557507, 558061, 558507, 559471, 561104, 562947, 564746, 566865, 569544, 572244, 574278, 575782, 577390, 579146, 580395, 580712, 580261, 579194, 577420, 575270, 573753, 573628, 574476, 575150, 575029, 574516, 574365, 574784, 575255, 575022, 573562, 570679, 566446, 561296, 556085, 551639, 548129, 545099, 542198, 539500, 537040]
59662E37040k560k897k952k637k407k414k230j559o31K46R65J324J187R84J297
59647E22756J824J670Q51L55M27Lj436k766k909k567l022m016m184l128j727o66
59631E01465O7L83O5m90n49k44n03j594k646k937k865l254m227n149n332m594
59615D67596l426k602k388k210j471m61P4Q9L14J137K119K720K981L199L423L490
59599D74584L289K773J919Q16k75r84r88k94N73R35P18M84N79O67L98Lk51o33
59581D84313j381k038k096j958k396l274l682l262k655k526k846l232l357l007
59567D46603k225j435r70n48K21R83R72K32l28j87K02K38qr0K02Q07J537K074
59549D48280K231K327K874L793M441M533M579N146O223P488Q832J0280J1777J3216
$$ y = [537040, 534480, 531583, 528631, 525994, 523587, 521173, 518943, 517384, 516753, 516999, 517964, 519288, 520475, 521459, 522756, 524580, 526250, 527101, 527456, 527883, 527886, 526450, 523684, 520775, 518208, 515186, 511170, 506986, 503858, 502131, 501465, 501532, 501915, 501980, 501490, 500941, 500697, 500194, 498600, 495954, 493017, 490152, 486898, 482671, 477522, 472190, 467596, 464170, 461568, 459180, 456970, 455499, 455038, 455112, 455201, 455515, 456652, 458771, 461491, 464472, 467671, 471094, 474584, 477873, 480646, 482565, 483381, 483106, 482122, 481134, 480840, 481413, 482348, 483066, 483550, 484129, 484796, 485194, 485197, 484946, 484313, 482932, 480894, 478798, 476840, 474444, 471170, 467488, 464226, 461571, 459045, 456199, 452967, 449610, 446603, 444378, 442943, 441973, 441425, 441646, 442629, 443601, 443833, 443505, 443318, 443520, 443758, 443750, 443660, 443862, 444669, 446206, 448280, 450511, 452838, 455712, 459505, 463946, 468479, 473058, 478204, 484427, 491915, 500747, 511027, 522804, 536020]
59535E36020J4416J4906J4040J1502P571K875j691m939n916m805k898j324o5J548
59521E81240L609N339N917N377M538M080L718K459k26l607o333p745q331q933
59507E81102r844j0642j0747j0079r198q708q477p772o320m814m027l825l532
59494D83117k968k466k093j546q22k84LM22J188K030K650L029L177L039K780K781
59478D94037L130L496L699L989M601N275N515N114M273L319K424J549O20k11o18
59463E40212m84q2K94O91J265J988K847M041N645P260Q431R199R881J0550J1171
59448F12909J1950J2862J3097J1678Q736N432K559j79l326o718r616j1416j1956
59435F36012j1558j0909j0589j0483r944q762p547o948o755o127m591k456k56
$$ y = [536020, 550436, 565342, 579382, 590884, 598455, 601330, 599639, 594700, 588784, 583979, 581081, 579757, 579692, 581240, 584849, 590188, 596105, 601482, 606020, 610100, 613818, 616277, 616051, 612444, 606111, 598366, 590035, 581102, 571258, 560616, 549869, 539790, 530592, 521884, 513407, 505635, 499315, 494501, 490474, 486649, 483117, 480149, 477683, 475590, 474044, 473222, 472938, 472941, 473363, 474551, 476581, 479231, 482260, 485437, 488476, 491256, 494037, 497167, 500663, 504362, 508351, 512952, 518227, 523742, 528856, 533129, 536448, 538872, 540421, 541041, 540830, 540212, 539728, 539646, 539940, 540631, 541896, 543884, 546731, 550772, 556417, 563677, 572108, 581307, 591188, 601738, 612909, 624859, 637721, 650818, 662496, 671232, 676664, 679223, 679044, 675718, 669000, 659384, 647968, 636012, 624454, 613545, 602956, 592473, 582529, 573767, 566220, 559272, 552517, 546390, 541799, 539343, 539087]
59422E39087J959M469P227R665J1396J2768J4441J6623J9174K2113K5227K7283
59410G11432K6737K3492J8958J3940P584p16r283j5193j6967j5282j1568p061
59398G26073k886J12J800K182N29l942j0519j7042k1625k3658k3288k0965j7735
59385E89036j4889j2869j1023q785o517m883l909l060j925o80J19J94J46R59K646
59370E24560L953L935L170K764K694K306J878K358L675M653M764M741N198N771
59356E76420O035O316P087Q282R573J0760J1652J2210J2886J4139J5598J6437
59344G07395J6580J6632J6658J6069J4817J3615J2721J1492R505P040M268R37
59332H47729k751o076q920j1907j4927j6794j7020j6757j7089j7404j6442j4231
$$ y = [539087, 541046, 545515, 552742, 562407, 573803, 586571, 601012, 617635, 636809, 658922, 684149, 711432, 738169, 761661, 780619, 794559, 802143, 801427, 792144, 776951, 759984, 744702, 733134, 726073, 723187, 723299, 725099, 727281, 727810, 723868, 713349, 696307, 674682, 651024, 627736, 606771, 589036, 574147, 561278, 550255, 541470, 534953, 530070, 526161, 523101, 521176, 520496, 520615, 520809, 520955, 521914, 524560, 528513, 532448, 535618, 538382, 541076, 543382, 545260, 547618, 551293, 555946, 560710, 565451, 570649, 576420, 582455, 588771, 595858, 604140, 613713, 624473, 636125, 648335, 661221, 675360, 690958, 707395, 723975, 740607, 757265, 773334, 788151, 801766, 814487, 825979, 835484, 842524, 846792, 847729, 844978, 838902, 829982, 818075, 803148, 786354, 769334, 752577, 735488, 718084, 701642, 687411]
59320F87411j1943j0374r419q641p601o002m117k716k136j803j118j85P52J911
59306F24019L412M792N684O519P895R715J1460J2801J3372J2477R665N279M6n409
59292G21727j0340j3858j5719j6529j6717j5955j4139j2137j0818r932q713p051
59280E69819n295l444j397M28J585K430L671N343O895Q107R179J0197J1071J1864
59266F30453J2569J2727J1887J0229Q264O147L717J052j593m183o736q927j0265
59253F65341j0543r891q653p395o659o340n700m386k972k143j817j463q69j22
59239E96388O98J392J636J567J838K684L467L656L649M003M376M011K858J499
59225F33722K53r78k227l432m638n707o131n680m914m481m273l776k956k232j828
$$ y = [687411, 675468, 665094, 655675, 647034, 639433, 633431, 629314, 626598, 624462, 622659, 621541, 621356, 622108, 624019, 627431, 632223, 637907, 644426, 652321, 662036, 673496, 686297, 699669, 712146, 721811, 727090, 727136, 721727, 711387, 697529, 681810, 665281, 648564, 632609, 618470, 606333, 595515, 585583, 576870, 569819, 564524, 561080, 559683, 560111, 561696, 564126, 567797, 573140, 580035, 588142, 597321, 607518, 618589, 630453, 643022, 655749, 667636, 677865, 686129, 692276, 695993, 697045, 695452, 691269, 684533, 675606, 665341, 654798, 644907, 636254, 628859, 622200, 615860, 610160, 605774, 602802, 600659, 598842, 597379, 596510, 596388, 597086, 598478, 600114, 601681, 603519, 606203, 609670, 613326, 616975, 620978, 625354, 629365, 632223, 633722, 633975, 632997, 630770, 627338, 622700, 616993, 610862, 605182, 600268, 595787, 591514, 587738, 584782, 582550, 580722]
59210E80722j749k058k685l161l107k736k460k273j999j761j675j465q85k52l1
59195E52425j89l88n13n64l35K66R32J343J532J516J101M16O0K42L85J00k9O45
59177E58945J796K686L267L838M170L873L332L310L863M443M918N669O793P921
59163F18824Q792R401R706R639R311Q681P364N238K985J455O49j56j515l451n635
59148F81288p434q159p891p644q233r212r479q636p274o252o109o786p518p452
59134E73209o681o145o221o182n443m426l540k303l67J408J974J607J441K126
59120E40457L669N894Q064Q905Q174P463Q209R621R939R093Q527Q820R184R212
59106F55231R479J0217J0841J1015J1011J0768R766Q024O281M929L723K648K015
$$ y = [580722, 578973, 576915, 574230, 571069, 567962, 565226, 562766, 560493, 558494, 556733, 555058, 553593, 552708, 552456, 552425, 552236, 551848, 551335, 550771, 550436, 550702, 551634, 552977, 554509, 556025, 557126, 557542, 557602, 557844, 558229, 558329, 558300, 558945, 560741, 563427, 566694, 570532, 574702, 578575, 581907, 585217, 589080, 593523, 598441, 604110, 610903, 618824, 627616, 637017, 646723, 656362, 665673, 674354, 681718, 686956, 689941, 691396, 692045, 691889, 690374, 686923, 681288, 673854, 665695, 657804, 650160, 641927, 632715, 623236, 614600, 607326, 601074, 594965, 588179, 580661, 573209, 566528, 560383, 554162, 547980, 542537, 538111, 534571, 532268, 531901, 533309, 535283, 536890, 538331, 540457, 544126, 550020, 558084, 566989, 575163, 582626, 590835, 600456, 610395, 619488, 628015, 636835, 646019, 655231, 664710, 674927, 685768, 696783, 707794, 718562, 728328, 736352, 742633, 747562, 751285, 753933, 755948]
59093G55948J576N02j363l056l643l174k333j711j594j969k634l535m816o340
59079G21858p592q520r750j1411j2565j2584j2169j1966j1162q934o402n383n678
59066E97742n541m552m031m513m810m126l286l182l440l383l125k964k730k405
59052E45654k437k912l239l077k792k604k209j572j191j182r96m26%O6L77J375
59036E22835K541L176L296L308L401L683M388N592O955Q094Q910R613J0653J2403
59022F08848J4559J6199J7047J7994J9655K1027K0723J8961J6990J4882J1491
59011G98376O523J219l178o374q352r085r114r160q971p684n343k887o57J699
58997G37012L833M794M617M337M189L351J824P52M50k76k150m322n913p209q556
$$ y = [755948, 757524, 758026, 756663, 753607, 749964, 746790, 744457, 742746, 741152, 739183, 736549, 733014, 728198, 721858, 714266, 705746, 695996, 684585, 672020, 659436, 647267, 635301, 624139, 615205, 608803, 603420, 597742, 592201, 587649, 583618, 579105, 574295, 570169, 566883, 563701, 560261, 556878, 553753, 550789, 548059, 545654, 543217, 540305, 537066, 533989, 531197, 528593, 526384, 524812, 523621, 522439, 521443, 521017, 521017, 521083, 521460, 522835, 525376, 528552, 531848, 535156, 538557, 542240, 546628, 552220, 559175, 567269, 576179, 585792, 596445, 608848, 623407, 639606, 656653, 674647, 694302, 715329, 736052, 755013, 772003, 786885, 798376, 804899, 806118, 802940, 796566, 788214, 779129, 770015, 760855, 751884, 744200, 738857, 735970, 735313, 737012, 740845, 745639, 750256, 754593, 758782, 762133, 763957, 764709, 765159, 764883, 762733, 758411, 752498, 745289, 736733]
58982G36733r525r977j0554j1303j1129r460p222n314l504j555j5J054K601M785
58968F65615O082N530M483M759O128P154P483P765Q085Q028P676P208O069L799
58954G55864J138r61k914n748r277j2214j3886j4512j4199j2901j1282j0344j0082
58941F38682r535q279o948o130n548m619l267j950j144r00p89l75J68K19m47j414
58925E87724k217k704k752k379k217l025m415m956l980k525j917k215k545k259
58911E47618j261J72J422K028K450L561N148O020N977O382Q058R936J0718J0732
58897F18961J0927J1107J0563R697R537J0100J0653J1248J2683J4985J7147J8528
58885G66136J9545K0736K1881K2253K1358J9240J6360J3280J0256P232M147R42
$$ y = [736733, 727208, 717231, 706677, 695374, 684245, 674785, 667563, 662249, 658745, 657190, 657175, 658229, 660830, 665615, 671697, 677227, 681710, 686469, 692597, 699751, 707234, 714999, 723084, 731112, 738788, 745996, 752065, 755864, 757002, 756041, 753127, 747379, 738102, 725888, 712002, 697490, 683291, 670390, 659108, 648764, 638682, 629147, 620868, 613920, 607790, 602242, 597623, 594356, 592406, 591262, 590362, 589573, 589198, 589366, 589585, 589138, 587724, 585507, 582803, 580051, 577672, 575455, 572430, 568015, 563059, 559079, 556554, 554637, 552422, 549877, 547618, 546357, 546529, 547951, 549979, 552429, 555990, 561138, 567158, 573135, 579517, 587575, 597511, 608229, 618961, 629888, 640995, 651558, 661255, 670792, 680892, 691545, 702793, 715476, 730461, 747608, 766136, 785681, 806417, 828298, 850551, 871909, 891149, 907509, 920789, 931045, 938277, 942424, 943366]
58873I43366k598o542j0338j3274j5353j7006j8029j7796j6550j5330j4385j2869
58861G83296j0550q609q077q571r212r761j0256j0507j0600j0997j1530j1297
58849F63329j0070q673p501n940l919k586k582l030l212l799n244o456o508o352
58835E87457p188q299q193p085o420o500o322n365m124l062k316k105k387k467
58821E15624j905j279j101q00J63J066J050O81R76J629J676J301J420J970K074
58806E24545J600J158Q36L44O1N72J458J786J481J125P18m1p08o91n45j279k663
58789E29757l436l029j874l89J143K104K233K456L744N528O585O954P514Q106
58775E67396P720O384N184M439L427J873K87j234l083m937n846n710n469n686
$$ y = [943366, 940768, 934226, 923888, 910614, 895261, 878255, 860226, 842430, 825880, 810550, 796165, 783296, 772746, 764137, 756060, 747489, 738277, 728516, 718260, 707753, 697153, 686156, 674626, 663329, 653259, 644586, 637085, 631145, 627226, 624640, 622058, 619028, 615816, 612017, 606773, 600317, 593809, 587457, 580269, 571970, 563777, 556692, 550272, 543772, 537450, 532085, 527961, 524899, 522583, 520478, 518091, 515624, 513719, 512440, 511339, 510539, 510702, 511768, 512818, 513499, 514475, 516104, 517780, 519081, 520501, 522471, 524545, 526145, 527303, 528139, 528483, 528544, 529116, 530574, 532360, 533841, 534966, 535684, 535643, 534935, 534244, 533699, 532420, 529757, 526321, 523292, 521418, 521029, 522172, 524276, 526509, 528965, 532709, 538237, 544822, 551776, 559290, 567396, 575116, 581500, 586684, 591123, 594550, 596423, 596710, 595476, 592393, 587456, 581610, 575900, 570431, 564745]
58761E64745o033o161o019n357m025k627j773j020L46J879K682L083M051N263
58747E49034N453M574L857L690L270K539K611L845N130N712O194P150Q065Q398
58733F19522Q529R026R857J0803J1756J2363J2243J1781J1647J1499J0284Q040
58721G47350O108N271M918M469M320M867N623O077O520P422Q597R381R152P514
58707H37589M614J387j261l511o137r065j1488j3306j5340j7899k0219k1650k2445
58694G01269k3019k3282k2978k2032k0342j7903j5224j2917j0931q918p159o322
58682E10242o312o350o014n426m539l286k229k043k398k309j501m39P15K106L357
58667D73574L958M380N575P504R215J0321J1171J1693J1348J0143Q514O307L187
$$ y = [564745, 558712, 552551, 546532, 541175, 537150, 534523, 532750, 531730, 532076, 533955, 536637, 539720, 543771, 549034, 554487, 559061, 562918, 566608, 569878, 572417, 575028, 578873, 584003, 589715, 595909, 603059, 611124, 619522, 628051, 637077, 646934, 657737, 669493, 681856, 694099, 705880, 717527, 729026, 739310, 747350, 753458, 758729, 763647, 768116, 772436, 777303, 782926, 789003, 795523, 802945, 811542, 820923, 830075, 837589, 842203, 843590, 842329, 838818, 832681, 823616, 812128, 798822, 783482, 765583, 745364, 723714, 701269, 678250, 654968, 631990, 609958, 589616, 571713, 556489, 543572, 532641, 523723, 516564, 510242, 503930, 497580, 491566, 486140, 481601, 478315, 476086, 474043, 471645, 469336, 467835, 467396, 468111, 470217, 473574, 477532, 481912, 487487, 494991, 504206, 514527, 525698, 537391, 548739, 558882, 567396, 573703, 576890]
58654E76890j19k322l305l989m574m440l750l575m192m714m740m948n705o332
58640E20185o208n521m621l618k766k246j537j7J933L356M065M423M267L386K621
58625E17702K888L340K361J78j321j292o71j99M01J168J725K606M780P614R185
58610E50465Q957Q251P740O543M359K373J276K38j272k368k393k083k231k585
58596E77270k825l233l775l861l547l493l367j937P31K944L860M508N725O866
58582E75866P382P929Q955R789R991J0133J0466J0355R709R319R236Q570P593
58569F95293P974J0098J2252J3531J5397J8968K2785K5033K6197K7784K9796L1226
58557I36334L1828L1720L0322K7208K3154J9045J4676R749M974R40l012p498j1664
$$ y = [576890, 576771, 574449, 571144, 567155, 562581, 558141, 554391, 550816, 546624, 541910, 537170, 532222, 526517, 520185, 513977, 508456, 503835, 500217, 497451, 495205, 493668, 493651, 495584, 498940, 503005, 507428, 511695, 515081, 517702, 520590, 523930, 526291, 526469, 525148, 523856, 523185, 522986, 523387, 524555, 526280, 528886, 533666, 541280, 550465, 559422, 567673, 575413, 581956, 586315, 588688, 589964, 590202, 588930, 586562, 584169, 582086, 579855, 577270, 574445, 571212, 567437, 563576, 560029, 556536, 553169, 551232, 551963, 554907, 558767, 563275, 569000, 575866, 583248, 591177, 600132, 609921, 619912, 630045, 640511, 650866, 660575, 669894, 679130, 687700, 695293, 703267, 713365, 725617, 739148, 754545, 773513, 796298, 821331, 847528, 875312, 905108, 936334, 968162, 999882, 1030204, 1057412, 1080566, 1099611, 1114287, 1124036, 1129010, 1129950, 1126938, 1119440, 1107776]
58544A107776j4281j5466j6204j7021j8135j9959k2370k4335k5176k5462k5873
58533H83494k6083k5523k4234k2332j9654j6650j4398j3001j1181q209n103l143
58521F93983k330k015j891j702j195q26j321k146j987j037r96k245l123k736k320
58506F66113k818l186k490j629j611j799j459j255j785k139j441l74J70N02R30
58491F45729P92pj01J256K792L336L667M859O422P627R043J1177J3136J4264J5534
58476G39526J7640J9384J9610J9106J8691J7085J2877P264K639n88l777p519j1167
58463H50771j4134j6038j6263j4743j2466j0116p319m095j588j64J585M530P316
58450G67276Q458Q507Q536Q068O247L669J291j152m065o651q126q849q928p421
$$ y = [1107776, 1093495, 1078029, 1061825, 1044804, 1026669, 1006710, 984340, 960005, 934829, 909367, 883494, 857411, 831888, 807654, 785322, 765668, 749018, 734620, 721619, 710438, 702229, 697126, 693983, 691653, 689638, 687747, 686045, 684850, 684024, 682703, 680557, 678570, 677533, 676537, 674292, 671169, 668433, 666113, 663295, 660109, 657619, 655990, 654379, 652580, 651121, 649866, 648081, 645942, 644501, 644127, 644297, 644799, 645729, 646521, 646514, 646413, 647669, 650461, 653797, 657464, 662323, 668745, 676372, 685415, 696592, 709728, 723992, 739526, 757166, 776550, 796160, 815266, 833957, 851042, 863919, 871183, 873822, 873234, 869457, 861938, 850771, 836637, 820599, 804336, 789593, 777127, 767011, 759692, 755597, 754009, 753845, 755430, 759960, 767276, 775734, 784241, 792777, 800845, 807092, 810761, 812052, 810900, 806835, 800184, 792058, 783209, 774281, 766860]
58436G66860m368j707m68J071M627R125J2632J5278J8331K2043K6357L1870L7973
58423I39624M1826M1297L7236L0933K1515Q371n868j7619k6019l1827l4464l3140
58411I71865k9594k6673k4958k3152k0801j8380j5821j3245j1864j2034j1816
58400G63527r695p117o040n724m439k658j739j079M75J873J436l9o21m61r05j643
58384G25151j539j155j658k375k089j538j964k519j773m67J7L92J958L867M710
58369G19018N300O958Q685R029R111J0558J2133J1837J0771J1347J3062J3662
58357H41471J3218J3439J4020J3252J1268R392P366M433J866J142J072n6j057
58344I30826o7J691K077K101L803N940O101N491O999R992J1554J1773J3000J4975
$$ y = [766860, 762492, 760785, 760317, 761388, 766015, 775140, 787772, 803050, 821381, 843424, 869781, 901651, 939624, 981450, 1022747, 1059983, 1090916, 1112431, 1120802, 1114934, 1097315, 1071296, 1039469, 1005005, 971865, 942271, 915598, 890640, 867488, 846687, 828307, 812486, 799241, 787377, 775343, 763527, 753832, 746715, 740675, 734951, 730512, 727854, 726115, 725036, 725511, 727384, 728820, 728781, 728160, 727699, 726794, 725151, 723612, 722457, 720799, 718424, 716335, 714797, 712833, 710314, 708541, 708074, 708091, 708483, 710441, 714308, 719018, 724318, 731276, 739961, 748990, 758101, 768659, 780792, 792629, 803400, 814747, 827809, 841471, 854689, 868128, 882148, 895400, 906668, 916060, 923426, 927859, 929725, 930867, 931939, 931883, 930826, 930759, 932450, 934527, 936628, 940431, 946371, 952472, 957963, 964962, 974954, 986508, 998281, 1011281, 1026256]
58330A026256J5389J4513J4632J5519J4963J3076J1756J0647Q028M843L435L218
58318A156275J937K05K29J281J154Q75K983O239P312O683P575R952J0977J0622
58304A224299J1326J2793J2644J1578J2357J4318J4479J3289J3574J4675J3731
58293A369063J1926J2977J6028J6668J4764J4452J6507J7537J7032J8212K1295
58282A546461K2727K1863K1938K3628K4083K3071K3702K6355K8124K8806L1083
58271A821841L4434L5503L4829L6524M0890M4140M5677M8644N3079N5702N6680
58260B307943N9343O3025O3798O2279O2813O5049O4492O1301N9963O0286N7947
58249B988239N4032N4366N8943O1968O2969O7567P6274Q3147Q6844R2409J00696
$$ y = [1026256, 1041645, 1056158, 1070790, 1086309, 1101272, 1114348, 1126104, 1136751, 1144779, 1149622, 1153057, 1156275, 1158212, 1158417, 1158646, 1159927, 1161081, 1161956, 1164939, 1171178, 1178490, 1185173, 1192748, 1202700, 1213677, 1224299, 1235625, 1248418, 1261062, 1272640, 1284997, 1299315, 1313794, 1327083, 1340657, 1355332, 1369063, 1380989, 1393966, 1409994, 1426662, 1441426, 1455878, 1472385, 1489922, 1506954, 1525166, 1546461, 1569188, 1591051, 1612989, 1636617, 1660700, 1683771, 1707473, 1733828, 1761952, 1790758, 1821841, 1856275, 1891778, 1926607, 1963131, 2004021, 2048161, 2093838, 2142482, 2195561, 2251263, 2307943, 2367286, 2430311, 2494109, 2556388, 2619201, 2684250, 2748742, 2810043, 2870006, 2930292, 2988239, 3042271, 3096637, 3155580, 3217548, 3280517, 3348084, 3424358, 3507505, 3594349, 3686758, 3787454]
58238C787454J06913J11076J18794J30083J38797J44581J53676J66523J76965
58229E034862J85140J98026K15579K30212K41909K59319K83566L06276L26256
58220G281145L52110L85289M17369M47693M86335N35725N87436O41397P09053
58211A1843552P93098Q84393R83981J106702J257859J429482J625724J867661
58203B1792452K167484K525250K958004L502645M182916N006031N998628P207431
58195E5340841Q655157J0340038J2292556J4586802J7283087K0399942K3902180
58188A62800603K7558704L0740343L2508635L2081745K9195038K3936605J6398560
58181C55220233O794051m039209j4538897k3075710k8739178l1503195l1838150
$$ y = [3787454, 3894367, 4005443, 4124237, 4254320, 4393117, 4537698, 4691374, 4857897, 5034862, 5220002, 5418028, 5633607, 5863819, 6105728, 6365047, 6648613, 6954889, 7281145, 7633255, 8018544, 8435913, 8883606, 9369941, 9905666, 10493102, 11134499, 11843552, 12636650, 13521043, 14505024, 15611726, 16869585, 18299067, 19924791, 21792452, 23959936, 26485186, 29443190, 32945835, 37128751, 42134782, 48133410, 55340841, 63995998, 74336036, 86628592, 101215394, 118498481, 138898423, 162800603, 190359307, 221099650, 253608285, 285690030, 314885068, 338821673, 355220233, 362014284, 357975075, 343436178, 320360468, 291621290, 260118095, 228279945]
58174B28279945l0351168k7686197k4465436k1155185j8008143j5149289j2657492
58167G8807035j0555374q800928p340679o145412n182377m396377l742000l204129
58159B9439759k770106k410544k102801j846592j640968j468625j315793j185930
58151A4698400j081112r89233r00974q21327p53777o89973o24817n65728n17463
58142G753996m72577m25758l83435l50685l22018k93261k69786k54871k41870
58133D739735k25567k10235j99320j87959j72722j58502j49042j40195j28863
58124C167330j19171j13766j08077r9106r1214q7509q3994p7664p2178p0120o7662
58113B176869o2149n7289n5770n4167n0062m6881m6802m6076m2193l8805l8793
$$ y = [228279945, 197928777, 170242580, 145777144, 124621959, 106613816, 91464527, 78807035, 68251661, 59450733, 52110054, 45964642, 40782265, 36385888, 32643888, 29439759, 26669653, 24259109, 22156308, 20309716, 18668748, 17200123, 15884330, 14698400, 13617288, 12628055, 11727081, 10905754, 10151977, 9462004, 8837187, 8271459, 7753996, 7281419, 6855661, 6472226, 6121541, 5799523, 5506262, 5236476, 4981605, 4739735, 4514168, 4303933, 4104613, 3916654, 3743932, 3585430, 3436388, 3296193, 3167330, 3048159, 2934393, 2826316, 2727210, 2635996, 2548487, 2464493, 2386829, 2314651, 2244531, 2176869, 2114720, 2057431, 2001661, 1947494, 1897432, 1850551, 1803749, 1757673, 1715480, 1676675, 1637882]
58102A637882l9082l6837l4411l3802l2570k9402k7564k8743k9637k8386k8060
58091A289388l0075l0605k7563k4596k4177k3162j9457j6548j6871j6948j3903
58080A045483j0981j1612j3522j3630j3549j5385j7011j6392j5911j7701j9201
58069H80588j7847j5835j5764j5809j3713j1389j1070j0932q890o928p280q037
58057G37094o848n489o465q417q989r112j0438j1575j0725r245q958q798p383
58044F24652n999n888n634m241l602m848n725m678l966n441o910o154m971n568
58030E51027o438n641m776n794p061o585o027p463r090q327o437o020o359n425
58016D59584m060m150m729l868k440k270k550j705p89j351j968n90J563K067J480
$$ y = [1637882, 1598800, 1561963, 1527552, 1493750, 1461180, 1431778, 1404214, 1375471, 1345834, 1317448, 1289388, 1259313, 1228708, 1201145, 1176549, 1152372, 1129210, 1109753, 1093205, 1076334, 1059386, 1045483, 1034502, 1022890, 1009368, 995738, 982189, 966804, 949793, 933401, 917490, 899789, 880588, 862741, 846906, 831142, 815333, 801620, 790231, 779161, 768229, 759339, 752411, 745131, 737094, 730246, 724757, 718292, 709875, 700886, 691774, 681336, 669761, 659036, 649791, 640833, 632035, 624652, 618653, 612765, 607131, 602890, 599288, 594440, 588715, 584037, 580071, 574630, 567720, 561566, 556595, 551027, 544589, 538948, 534172, 528378, 521317, 514732, 508705, 501242, 492152, 483825, 477388, 471368, 465009, 459584, 455524, 451374, 446645, 442777, 440337, 438067, 435517, 433812, 433023, 431672, 429704, 429114, 430677, 432744, 434224]
58001D34224J821K665K347J479J737K547K382J878K406K967J765n17k002k748
57987D52951l638l778k174m52o94j984k093j300j397k345k851l121m041m915m760
57972D13408m530n343n992m961l395l193l684l091j828j324j088K7J057N35n05
57957C76093j81Q92Q98J29l1q5j280k681k499j216m15J86J528K528J807P73J648
57940C78094L679M697N113O739Q785R032Q128Q709J0720J1484J0188Q612P437
57927D81417N540L048J585J105k27k677m529n285o265p674q065p146o348o172
57913D38307n630m698m668n618o012n221m181l286k012p58p04j576j941j810k586
57898C87606m190m842l993l040k726k200j139m64m19r7O12P21K43M43J502J995
$$ y = [434224, 436045, 438710, 441057, 442536, 444273, 446820, 449202, 451080, 453486, 456453, 458218, 457701, 455699, 452951, 449313, 445535, 443361, 442909, 442215, 440231, 438138, 436838, 435441, 433096, 430245, 427124, 423083, 418168, 413408, 408878, 403535, 397543, 392582, 389187, 385994, 382310, 379219, 377391, 376067, 374979, 375006, 376063, 376598, 376093, 375912, 376804, 377702, 377831, 377800, 377715, 376435, 373754, 371255, 370039, 369624, 369810, 371338, 373866, 375673, 376446, 378094, 381773, 386470, 391583, 398322, 407107, 416139, 424267, 432976, 443696, 455180, 465368, 473980, 481417, 486957, 490005, 491590, 492695, 492468, 489791, 485262, 479977, 473712, 466038, 457973, 450827, 444479, 438307, 432677, 427979, 423311, 417693, 411681, 406460, 402279, 398993, 396981, 396223, 395519, 393943, 392002, 390192, 387606, 383416, 378574, 374581, 371541, 368815, 366615, 365476, 365012, 364593, 364496, 365108, 365829, 366072, 366515, 368017, 370012]
57882C70012J292N44O24R45Q65O06J83q81k272k761j899n12P04J715K233J760
57866C73158O37j88n06o99o22l1L54j70p06R3J765K758K898L103L190K245Q31
57849C88110L90O05k26k175l518l654l769m329m318l525l216l937m715m984n290
57834C41449n622n030l506k258j629p00N85R58J50k98N95J865K372K307K228K151
57818C35617K218K831L545L302K229J613J724J255n81k917m687n751o137n695
57804C28566m898m603m740m542m086m005l809k384k24Q75N76L96J062J691J947
57789C01822K744M114M629L844L152L298L161K089J358K015L038L134K763K996
57775C44157L707M162M306M241L533K049M93o84j927l458m653n182n582o047n924
$$ y = [370012, 371304, 371848, 372472, 373417, 374282, 374888, 375071, 374190, 371918, 369157, 367258, 366746, 367450, 369165, 371398, 373158, 373795, 373607, 373101, 372402, 371780, 371749, 372103, 371933, 371227, 371320, 373085, 375843, 378741, 381844, 385034, 387279, 388110, 388500, 389105, 388879, 386704, 383186, 379532, 375763, 371434, 367116, 363591, 360375, 356438, 351723, 346739, 341449, 335827, 330797, 327291, 325033, 323404, 322704, 323289, 324247, 324397, 324099, 324694, 326559, 328931, 331238, 333466, 335617, 337835, 340666, 344211, 347513, 349742, 351355, 353079, 354334, 353753, 350836, 346149, 340398, 334261, 328566, 323668, 319065, 314325, 309783, 305697, 301692, 297883, 295499, 295275, 296150, 296726, 297122, 298184, 299875, 301822, 304566, 308680, 313309, 317153, 320305, 323603, 326764, 328853, 330211, 332226, 335264, 338398, 341161, 344157, 347864, 352026, 356332, 360573, 364106, 366155, 366648, 365964, 364037, 360579, 355926, 350744, 345162, 339115, 333191]
57760C33191n039m274m145m094l734l483l349k576j141j69j50j65M21R54R87J232
57744C04466K135K961L176L324L646L340K206J464J819K120J203k18q19p23r01
57729C29199j471j836j850j770j644j554j786k199k184j774j812k485k868k453
57715C01513j915j724j393p91q29j885k881k959k849l541m608m972m355l140j660
57700B62011m25l9k33M5R47J401R44M68L94k26j809l071k977k382k411k635k195
57683B47807j456j022l75J001K321K869L621N863R147J2226J5166J8819K3030
57670C39017K7066L1259L6379M1653M4980M4891M1025L3104K1011N940r701k3555
57658F33069l3829l9256l9842l7375l4007l0448k6366k2049j8483j6032j4092
$$ y = [333191, 328152, 323878, 319733, 315639, 311905, 308422, 305073, 302497, 301356, 301187, 301037, 300872, 301293, 302247, 303234, 304466, 306601, 309562, 312738, 316062, 319708, 323048, 325254, 326718, 328537, 330657, 331860, 331642, 330823, 330100, 329199, 327728, 325892, 324042, 322272, 320628, 319074, 317288, 315089, 312905, 311131, 309319, 306834, 303966, 301513, 299598, 297874, 296481, 295690, 294861, 292976, 290095, 287136, 284287, 280746, 276138, 271166, 266811, 263671, 262011, 261586, 261547, 261314, 261359, 262306, 263707, 264651, 265119, 265513, 265287, 263478, 260407, 257430, 255048, 252637, 250002, 247807, 246351, 245329, 244954, 245955, 248276, 251145, 254766, 260629, 269776, 282002, 297168, 315987, 339017, 366083, 397342, 433721, 475374, 520354, 565245, 606270, 639374, 660385, 666325, 656624, 633069, 599240, 559984, 520142, 482767, 448760, 418312, 391946, 369897, 351414, 335382, 321290]
57647C21290j2064r856p603n664m656m806n398n433m565l081j430j81K13O9K28
57632B57063P68Q32J04n48n31m62r52j605k016k550l158k780j111K76j6j140j452
57615B40722r91q90j202j141q06r18j282j200j060j862l282l848l008j677p98
57600B16757n61r48j811k406k081j293r79j098r79p66j244k314k936k603j784
57585A92954r32j48K19k48j157j588j329r39o97m21k55o39j435j988k099k116
57569A77182k088j708j010l64J20M72L62m30j216j109l39L0l03n70j85O24J477
57552A70945K270K814K825K472K280K325K024Q15j195l198m025k959o43J250J676
57537A79676J162P07N13L88N30R41Q28k77j406j306k96K41j36o30p15o65o48l95
$$ y = [321290, 309226, 299370, 291767, 286103, 281447, 276641, 271243, 265810, 261245, 258164, 256734, 256553, 256766, 256835, 257063, 257831, 258663, 258767, 258219, 257688, 257226, 256274, 254669, 252653, 250103, 246945, 244165, 243054, 243330, 243314, 242174, 240722, 239731, 238841, 237639, 236498, 235692, 234774, 233492, 232292, 231232, 229370, 226088, 222240, 219232, 217555, 216757, 216196, 215248, 213437, 211031, 208950, 207657, 206678, 205580, 204601, 203835, 202591, 200277, 197341, 194738, 192954, 192022, 191874, 192093, 191845, 190688, 189100, 187771, 186832, 186135, 185714, 185459, 184820, 183385, 181397, 179298, 177182, 175094, 173386, 172376, 172012, 172132, 172604, 172966, 172536, 171320, 170211, 169872, 169902, 169599, 169029, 168844, 169468, 170945, 173215, 176029, 178854, 181326, 183606, 185931, 187955, 188770, 187575, 184377, 180352, 177393, 176750, 178000, 179676, 180838, 181545, 182058, 182446, 182976, 183917, 184745, 184468, 183062, 181756, 181460, 181701, 181565, 180935, 180220, 179555, 178907, 178512]
57519A78512R9M62N78O44P13P92J179K004K793L114L239L394L026J724K76l23
57503B02226l57p29j367j560j408j540j775j492j012j182j774j797j249j080j403
57488A82501j386r18q36j281j363q01l88l84L0J125J826J310K87j54pL2l36r74
57470A78283j732k348k459k106j749j531j106l97J60L06K44J46oj8L39O87L93
57453A67106l49o18q9N95Q44P16L41l01q57p19MM78L59K50O36J184J436J531J792
57434A74339K159K279J744K97j668k898k416q71J48R9m3N23J316J486R49J73m73
57417A77143p88o49k36J42N16J089J619J676J394J288J297Q44o7o32l41M01Q88
57400A85584P83J29o78r51l74M73Q65R26J093J102N16l4N29J901K600K100J487
$$ y = [178512, 178611, 179073, 179651, 180295, 181008, 181800, 182979, 184983, 187776, 190890, 194129, 197523, 200549, 202273, 202549, 202226, 201869, 201140, 199773, 198213, 196805, 195265, 193490, 191998, 190986, 189804, 188030, 186233, 184984, 183904, 182501, 181115, 180197, 179361, 178080, 176717, 175916, 175528, 175144, 175174, 176299, 178125, 179435, 179722, 179568, 179561, 179593, 179257, 178283, 176551, 174203, 171744, 169638, 167889, 166358, 165252, 164855, 165015, 165321, 165565, 165711, 165705, 165687, 166026, 166713, 167106, 166757, 166139, 166050, 166645, 167489, 168205, 168546, 168245, 167388, 166669, 166673, 167151, 167510, 167760, 168396, 169580, 171016, 172547, 174339, 176498, 178777, 180521, 180818, 179150, 176252, 173836, 172965, 173113, 173212, 173169, 173692, 175008, 176494, 177443, 177616, 177143, 176355, 175706, 175470, 175612, 176128, 177217, 178836, 180512, 181906, 183194, 184491, 185335, 185268, 184636, 184295, 184696, 185584, 186367, 186496, 185818, 184867, 184493, 184966, 185831, 186757, 187850, 188952, 189468, 189434, 189963, 191864, 194464, 196564, 198051]
57383A98051J701K358K707K640K324J754J139Q20N61k06j230j540r34l57m90r85
57367B08313j333j477j277m83M18M32m31r79n43K05O33J116J927K320J608L40
57351B10789l71r8Q67K031K725K367J266N11O39J024R60N42J47j63l11m3M38M94
57333B23814J4l92m19m24m92j11P37J238R52M71L22K33k2J9O52J340J533J413
57315B30878J304J140R05Q41P97L06l67k35Q78J943K276K383K656K428J224j15
57299B49242m86J21J025J781J963J070n15j360o77N44R22M29o6j61n6N5n7o18
57281B53156j252j109j95M07J99Q3P69J523J471J184J759L118M244M635M523M271
57265B78786M304N041O181O701O191N473N249N123M586M040L965M104M235M708
$$ y = [198051, 199752, 202110, 204817, 207457, 209781, 211535, 212674, 213494, 214055, 213849, 212619, 211079, 210145, 209788, 209298, 208313, 206980, 205503, 204226, 203743, 204161, 204593, 204162, 203183, 202640, 202845, 203478, 204594, 206521, 208841, 210449, 210789, 210418, 210320, 211187, 213218, 215943, 218310, 219576, 220087, 220726, 221750, 222710, 223252, 223399, 223236, 222925, 222882, 223320, 223814, 223828, 223436, 223017, 222593, 222101, 221990, 222727, 223965, 224917, 225388, 225710, 225943, 225921, 225940, 226592, 227932, 229465, 230878, 232182, 233322, 234227, 235068, 235865, 236171, 235804, 235569, 236447, 238390, 240666, 243049, 245705, 248133, 249357, 249242, 248756, 248877, 249902, 251683, 253646, 254716, 254201, 252841, 252164, 252708, 253630, 254059, 253993, 253832, 253776, 253831, 253774, 253156, 251904, 250795, 250600, 251007, 251206, 251289, 252058, 253581, 255052, 256236, 257995, 261113, 265357, 269992, 274515, 278786, 283090, 288131, 294312, 301013, 307204, 312677, 317926, 323049, 327635, 331675, 335640, 339744, 343979, 348687]
57251C48687N365N110L626K320K373K991K896K469K802L619L701K860J962J523
57237C92304J554K185L207L652L123K800L755N046N078M090L551L699L551L083
57223D40678L396M702N863O199O250O482O537O139N695N672O159P114Q343R314
57209E28543R664R642R510R046Q343Q350R573J1007J1501J1442J1808J2396J2454
57196F63279J2388J3026J3747J3309J2199J2259J3874J5431J5759J5425J5279
57185H15975J5369J5674J6447J7355J7515J6894J6507J6880J7374J7391J7223
57174A000604J7324J7731J8421J9459K0536K1154K1345K1490K1582K1460K1562
57163A222668K2482K3906K4956K5351K5373K5103K4747K5180K6801K8400K8589
$$ y = [348687, 354052, 359162, 362788, 365108, 367481, 370472, 373368, 375837, 378639, 382258, 385959, 388819, 390781, 392304, 393858, 396043, 399250, 402902, 406025, 408825, 412580, 417626, 422704, 426794, 430345, 434044, 437595, 440678, 444074, 448776, 454639, 460838, 467088, 473570, 480107, 486246, 491941, 497613, 503772, 510886, 519229, 528543, 538207, 547849, 557359, 566405, 574748, 583098, 592671, 603678, 615179, 626621, 638429, 650825, 663279, 675667, 688693, 702440, 715749, 727948, 740207, 754081, 769512, 785271, 800696, 815975, 831344, 847018, 863465, 880820, 898335, 915229, 931736, 948616, 965990, 983381, 1000604, 1017928, 1035659, 1054080, 1073539, 1094075, 1115229, 1136574, 1158064, 1179646, 1201106, 1222668, 1245150, 1269056, 1294012, 1319363, 1344736, 1369839, 1394586, 1419766, 1446567, 1474967, 1503556]
57152A503556K7996K8380K9929L1186L1493L1588L1780L1472L0803L0952L2275
57141A841410L3819L5035L6523L8598M0671M2500M4658M7283M9706N1784N4232
57130B316219N7302O0398O3400O7014P1452P6071Q0658Q5740R1352R6861J02295
57119C168762J08553J16069J24539J34055J45028J57039J69285J82256J97400
57110D502986K15236K35681K60047K90640L28361L72930M25485M88685N64361
57101G684412O54000P62124Q96659J065749J276709J537755J856914K238330K682536
57092B0655188L189878L759235M382924N047089N735529O424762P073869P627409
57084F3895883Q027630Q206596Q058706P449400O297439M671373K793276R27673
$$ y = [1503556, 1531552, 1559932, 1589861, 1621047, 1652540, 1684128, 1715908, 1747380, 1778183, 1809135, 1841410, 1875229, 1910264, 1946787, 1985385, 2026056, 2068556, 2113214, 2160497, 2210203, 2261987, 2316219, 2373521, 2433919, 2497319, 2564333, 2635785, 2711856, 2792514, 2878254, 2969606, 3066467, 3168762, 3277315, 3393384, 3517923, 3651978, 3797006, 3954045, 4123330, 4305586, 4502986, 4718222, 4953903, 5213950, 5504590, 5832951, 6205881, 6631366, 7120051, 7684412, 8338412, 9100536, 9997195, 11062944, 12339653, 13877408, 15734322, 17972652, 20655188, 23845066, 27604301, 31987225, 37034314, 42769843, 49194605, 56268474, 63895883, 71923513, 80130109, 88188815, 95638215, 101935654, 106607027, 109400303, 110327976]
57076A10327976p46183k173905l376055m384076n213742n867711o342346o633431
57068G5590527o743525o686255o483307o159309n740359n254371m729658m192755
57060B9600988l667270l172616k722013k321862j973589j675670j424375j214408
57052A1429185j040306q97242p80626o85907o09259n47827m98791m58850m25060
57043E485317l95693l69843l46494l24356l02236k79343k55491k31220k07283
57034B773358j83730j59948j35857j12393r0123o7995m4755k1705k940P619Q683
57023A970214P54j5788m0136o8824r5625j14637j23278j22510j15161j04458r3146
57012A077405q2793p3631o5268n7422n0009m3096l7108l2632k9623k7191k4571
$$ y = [110327976, 109581793, 107407888, 104031833, 99647757, 94434015, 88566304, 82223958, 75590527, 68847002, 62160747, 55677440, 49518131, 43777772, 38523401, 33793743, 29600988, 25933718, 22761102, 20039089, 17717227, 15743638, 14067968, 12643593, 11429185, 10388879, 9491637, 8711011, 8025104, 7415845, 6868018, 6369227, 5910377, 5485317, 5089624, 4719781, 4373287, 4048931, 3746695, 3467352, 3211861, 2980641, 2773358, 2589628, 2429680, 2293823, 2181430, 2091307, 2023312, 1978557, 1956852, 1953912, 1961531, 1970214, 1970968, 1955180, 1915044, 1846220, 1750595, 1635958, 1512680, 1390170, 1275009, 1170551, 1077405, 994612, 920981, 855713, 798291, 748282, 705186, 668078, 635446, 605823, 578632, 554061]
57001E54061k1959j9917j8386j6872j5333j4249j3824j3585j2934j1707j0243
56990C85052q979p951o688m764k442l01J667L913O018O480M401P06l103o715j0653
56975C56641j4605j7353j8300j8068j7364j6184j4355j2054r435o371l034j57
56963B09361J843L645O384J0277J4295J7194J8561J8705J7878J5924J2643Q090
56951C54800K328m620j2092j8375k1807k2298k1200j9565j7313j4221j0757p381
56939A87499l793L29M458P917J1090J4976J9699K4147K7077K7952K6775K3727
56927C71853J8978J2459L955o050j5757k2988k6849k8089k7903k6914k5279k3159
56915B04257k0743j8146j5471j2850j0428q414p055o304n665m637l185j641l22
$$ y = [554061, 532102, 512185, 493799, 476927, 461594, 447345, 433521, 419936, 407002, 395295, 385052, 376073, 368122, 361434, 356670, 354228, 353927, 355594, 359507, 365525, 372005, 376406, 377112, 374009, 367294, 356641, 342036, 324683, 306383, 288315, 270951, 254767, 240412, 228358, 218923, 212552, 209518, 209361, 211204, 214849, 221233, 231510, 245805, 262999, 281560, 300265, 318143, 334067, 346710, 354800, 357128, 352508, 340416, 322041, 300234, 277936, 256736, 237171, 219858, 205637, 194880, 187499, 183706, 184035, 188493, 196410, 207500, 222476, 242175, 266322, 293399, 321351, 348126, 371853, 390831, 403290, 407245, 401195, 385438, 362450, 335601, 307512, 279609, 252695, 227416, 204257, 183514, 165368, 149897, 137047, 126619, 118205, 111150, 104846, 99181, 94544, 91359, 89718, 89396]
56902H9396N68R60J178J877L361N179O706P913R204J0822J2842J5374J8348K1269
56888B04997K3701K5652K7102K7468K6179K3453J9797J4997Q442N64o871j2259
56876C83222j5431j7219j8088j7627j5302j1418p097l220M48M737R866J5318K0927
56863C29116K7303L4704M2112M8015N1626N2734N0879M5286L5505K1751N124j1953
56851G32202k6266l5695m0409m1645l9860l4976k7762j9718j1594l192N414J3601
56839D70100K1346K9666L9463N0661O2544P4059Q3334Q7791Q5495P6120O0360
56828A140939L8966J2978j5220m1767o2659p5548q0534p9327p3732o4968n4187
56817F44941m2864l2186k2415j3202m134N239J5321K5820L5720M4323N1633N7047
$$ y = [89396, 89964, 90924, 92102, 93979, 97340, 102519, 109225, 117138, 126342, 137164, 150006, 165380, 183728, 204997, 228698, 254350, 281452, 308920, 335099, 358552, 378349, 393346, 401788, 402352, 395481, 383222, 367791, 350572, 332484, 314857, 299555, 288137, 281040, 277820, 278268, 283005, 292871, 308189, 329116, 356419, 391123, 433235, 481250, 532876, 585610, 636489, 681775, 717280, 739031, 744155, 732202, 705936, 670241, 629832, 588187, 548327, 513351, 485589, 465871, 454277, 451085, 456499, 470100, 491446, 521112, 560575, 611236, 673780, 747839, 831173, 918964, 1004459, 1080579, 1140939, 1179905, 1192883, 1177663, 1135896, 1073237, 997689, 917155, 837828, 764096, 699128, 644941, 602077, 569891, 547476, 534274, 530140, 535379, 550700, 576520, 612240, 656563, 708196, 765243]
56805G65243N8511N4059M3651K8525R576j2051l3307n0178o0659o5477o5846o2159
56793F09888n5334m7501m0206l3031k5090j6939r849l897K022Q600J5408K1598
56781D25669K6467K9407K9972K8009K3362J5664M905p815k0439l0883l7816m0960
56769D45542m1033l9182l6273l2685k8734k4882k1406j8261j5490j3383j1984
56758A62229j0804r378p800o469n533m851m263l656k949k280k010k359l029l442
56744I3406l283k755k277k009j653r04k0L17r1n48k88N38J055P54j6n15k98N06
56726H1919J278J471J200J087J345J525J379J384J886K312J979J183P04O38N51
56711A01841M38O17R29R81R53J235J476J022J95K1O13R45M10m19q54r64j067j166
$$ y = [765243, 823754, 877813, 921464, 949989, 959565, 947514, 914207, 864029, 803370, 737893, 672047, 609888, 554554, 507053, 466847, 433816, 408726, 391787, 381938, 378041, 380063, 388663, 404071, 425669, 452136, 481543, 511515, 539524, 562886, 578550, 583455, 575640, 555201, 524318, 486502, 445542, 404509, 365327, 329054, 296369, 267635, 242753, 221347, 203086, 187596, 174213, 162229, 151425, 142047, 134247, 127778, 122245, 117394, 113131, 109475, 106526, 104246, 102236, 99877, 96848, 93406, 90123, 87368, 85091, 83082, 81429, 80525, 80505, 80822, 80731, 80183, 79895, 80433, 81488, 82242, 82226, 81711, 81413, 81919, 83197, 84668, 85868, 86955, 88300, 89825, 91204, 92588, 94474, 96786, 98765, 99948, 100652, 101290, 101841, 102279, 102896, 103825, 104806, 105759, 106994, 108470, 109492, 109687, 109708, 110321, 111266, 111676, 111257, 110403, 109439, 108372, 107206]
56693A07206j223j305j181n17L97Q33O29K95P7k26m25j9O96O51l81j209q36K21
56675A03683P97N98K08J50M86R65J180R56P22J054J726J885J304P65R78J737K429
56658A21623K700K492K000J748K069K506K369J797J449J267O45k52n53j95o1m09
56642A41195m51P1L01j93o61o23p58j502k012j538p32n45p63p43p58j414k363
56625A26511k749k479k096j781j348q58n24l08k05m82j067j277o78L11J116J699
56609A13785K027J697O99j57k57M4J97K64K98j50j143j839j608r06k85N76J945
56592A15187L007K850J782P51J05k20K6Q86J608J585J281J275J186N09j90q3N41
56575A32086R13J168J885K755L016K779K797L166L511M024N273P135R009J0783
$$ y = [107206, 105983, 104678, 103497, 102980, 103377, 104210, 104839, 105134, 105211, 104985, 104560, 104541, 105237, 105888, 105507, 104298, 103462, 103683, 104480, 105078, 105286, 105436, 105922, 106887, 108067, 109023, 109745, 110799, 112525, 114410, 115714, 116479, 117457, 119194, 121623, 124323, 126815, 128815, 130563, 132632, 135138, 137507, 139304, 140753, 142020, 142665, 142413, 141860, 141665, 141604, 141195, 140744, 140815, 141116, 140923, 140262, 139639, 138881, 137379, 135367, 133829, 133097, 132552, 131789, 131046, 130288, 128874, 126511, 123762, 121283, 119187, 117406, 116058, 115200, 114676, 114368, 114163, 113681, 112614, 111337, 110659, 110970, 112086, 113785, 115812, 117509, 118208, 118051, 117794, 117838, 118035, 118299, 118597, 118447, 117304, 115465, 113857, 112951, 112666, 113242, 115187, 118194, 121044, 122826, 123577, 123682, 123462, 123488, 124374, 125982, 127567, 128848, 130123, 131309, 131818, 131628, 131545, 132086, 132999, 134167, 136052, 138807, 141823, 144602, 147399, 150565, 154076, 158100, 163373, 170508, 179517, 190300]
56561A90300J2674J4435J5706J6717J7679J7904J6560J3930J0881P657M306J682
56549C40431O64P45O73K10m4j15n39j111j189j103j888l643n512p035q227q541
56533C03776p455o030o205q141r850r888r000q532q550q318p652o956o572o584
56519A94043o899p170p042o494n559m009k021p21r93k009k094r69J23M79P44J387
56503A50796J706J008k18r14o38K33R51Q71M3o94o94m52p44j272j107l19P3k31
56485A48398m33j03J50j97q09j131j020n04K93Q51P01J97Q1L47M68N64J225K240
56467A51318K657K233J600J047L30k31J95J493K466K413J745Q48l47j438j572
56452A64757q21k81l29j21P66J448J169L97j43m28n72l67oj22n99m64M99J190
$$ y = [190300, 202974, 217409, 233115, 249832, 267511, 285415, 301975, 315905, 326786, 334443, 338749, 340431, 341095, 341840, 342513, 342723, 342679, 342564, 342025, 340914, 339725, 338622, 336734, 333091, 327579, 320544, 312317, 303776, 296321, 290291, 284086, 275945, 266095, 256207, 247207, 238675, 230125, 221807, 214155, 207199, 200627, 194043, 187144, 179974, 172932, 166438, 160879, 156870, 154849, 154128, 153135, 151126, 149032, 148063, 148186, 148665, 149409, 150796, 152502, 153510, 153292, 152378, 151740, 151973, 152924, 153795, 153838, 153144, 152450, 151998, 151254, 149982, 148875, 148556, 148629, 148398, 147965, 147862, 148012, 147815, 147006, 145875, 144855, 144351, 144644, 145495, 146196, 146393, 146474, 146821, 147289, 147853, 149078, 151318, 153975, 156208, 157808, 158855, 159185, 158954, 159149, 160642, 163108, 165521, 167266, 168114, 167767, 166329, 164757, 163936, 163655, 163326, 163205, 163971, 165419, 166588, 166985, 166842, 166414, 165842, 165475, 165469, 165347, 164748, 164284, 164783, 165973]
56434A65973R06L34J98J78m1J3N33P65M34M99J358J649K45j662k122j242p01j016
56416A66301j097l38N29Q36Q37P76L57l68n25M45J771K122J196j3m38j0O23J137
56398A74141J711K186J809L02j297j698r49q1N82J626L079L988L881L514L551
56383A96345L453K467R80O2Q8N03O88N34K64J61L06M64L91K33L04N14N12L14K92
56364B08875N14O80O70O21N39M33N31Q59Q44J95l22j5L31m97j997k370j129K63
56346B09025O04L04K22N67J296K295K783J952N79M77J931L206L183K753K895L021
56330B37093K380J562J366J388R95O74J156K050K469K275J757R04j14o06l66k18
56314B54765p44j291j117n29p6M54J228J577J006K51K82J066K074L272M589N283
$$ y = [165973, 166879, 167213, 167411, 167589, 167548, 167561, 168094, 168859, 169293, 169792, 171150, 172799, 173044, 171382, 169260, 168018, 167317, 166301, 165204, 164866, 165395, 166231, 167068, 167844, 168201, 167833, 167308, 167753, 169524, 171646, 172842, 172829, 172391, 172381, 173004, 174141, 175852, 178038, 179847, 180149, 178852, 177154, 176205, 176124, 176706, 178332, 181411, 185399, 189280, 192794, 196345, 199798, 202265, 203245, 203307, 203395, 203898, 204586, 205120, 205384, 205545, 205851, 206315, 206706, 206939, 207243, 207757, 208269, 208583, 208875, 209389, 210069, 210739, 211360, 211899, 212332, 212863, 213722, 214566, 214761, 214439, 214424, 214755, 214258, 212261, 209891, 208762, 209025, 209629, 209933, 210155, 210722, 212018, 214313, 217096, 219048, 219627, 220104, 222035, 225241, 228424, 231177, 234072, 237093, 239473, 241035, 242401, 243789, 244784, 245458, 246614, 248664, 251133, 253408, 255165, 256069, 255955, 255349, 254983, 254765, 254021, 252730, 251613, 251084, 251008, 251462, 252690, 254267, 255273, 255524, 255806, 256872, 258946, 262218, 266807, 272090]
56298B72090M861L950L340K921K318J732J334O88k95p56j80O24Q20Q54J431K107
56282B97839K127J854K118K792L208L413L870M407M472M026L395K791K625L496
56268C42433N093N997N553M914N349O413O998P207P915R197J0503J1789J3308
56255D42669J4808J6035J7480J9674K2315K5003K7998L1362L4210L5958L7452
56244G24964L9629M1800M2589M1910M0677L9125L6691L3164K8848K3838J8137
56233A111372J2042N738r81p865j3924j8673k2776k6627k9429l0686l1460l2870
56221I13861l4321l4501l3348l1742l0049k8192k6448k5008k3449k1531j9720
56210F05552j8100j5947j3297j1556j1350j1280j0122q843q735r005q136o470
$$ y = [272090, 276951, 280901, 284241, 287162, 289480, 291212, 292546, 293234, 292939, 292183, 292003, 292627, 293447, 294301, 295732, 297839, 299966, 301820, 303938, 306730, 309938, 313351, 317221, 321628, 326100, 330126, 333521, 336312, 338937, 342433, 347526, 353523, 359076, 363990, 369339, 375752, 382750, 389957, 397872, 407069, 417572, 429361, 442669, 457477, 473512, 490992, 510666, 532981, 557984, 585982, 617344, 651554, 687512, 724964, 764593, 806393, 848982, 890892, 931569, 970694, 1007385, 1040549, 1069397, 1093235, 1111372, 1123414, 1129152, 1128171, 1120306, 1106382, 1087709, 1064933, 1038306, 1008877, 978191, 946731, 913861, 879540, 845039, 811691, 779949, 749900, 721708, 695260, 670252, 646803, 625272, 605552, 587452, 571505, 558208, 546652, 535302, 524022, 513900, 505057, 496322, 487317, 479181, 472711]
56198D72711n410m957m024k493j173k95L08K85m66q83j22R83J264J002R87R16
56182D58633L87K39J116J945J665J169J627K223J783J249K096L523L821L471M130
56167D89077N418N669N194N871P750Q890Q564Q067Q307Q922R797J1265J2854J3826
56153F09471J4804J6957J9932K2553K5060K8624L3192L8003M3617N1171O0170
56142I63554O9233P8395Q8325R7958J05369J10366J13680J14330J10477J02406
56132A954093R2150Q0888O9366N9868N4366N1204M6836M0409L3495K5921J5737
56121B524333L352q144j7336k5882l5099m4453n4010o5151p7971r0622j01769
56110B007248j11032j16813j16777j11047j02251r1996q0125o7489n6328m7376
$$ y = [472711, 467301, 462344, 458320, 455827, 454654, 454359, 454667, 454952, 454486, 453603, 453481, 454464, 455728, 456730, 457717, 458633, 459020, 459259, 460375, 462320, 463985, 465154, 466781, 469004, 470787, 472036, 474132, 477655, 481476, 484947, 489077, 494495, 500164, 505358, 511229, 518979, 527869, 536433, 544500, 552807, 561729, 571526, 582791, 595645, 609471, 624275, 641232, 661164, 683717, 708777, 737401, 770593, 808596, 852213, 903384, 963554, 1032787, 1111182, 1199507, 1297465, 1402834, 1513200, 1626880, 1741210, 1851687, 1954093, 2046243, 2127131, 2196497, 2256365, 2310731, 2361935, 2408771, 2449180, 2482675, 2508596, 2524333, 2527685, 2519541, 2502205, 2476323, 2441224, 2396771, 2342761, 2277610, 2199639, 2109017, 2007248, 1896216, 1779403, 1662626, 1551579, 1449328, 1357332, 1277207, 1209718, 1153390, 1106014]
56100A106014l9492l2486k7356k3537j9107j4124j0627q985p350n085l453k536
56088I11876q80J319K153J676K166M092N348N163N256O211O360N301N098O774
56074I67913Q784R857J0384J0255Q714O908P225R404J0801J0894J1810J3902J4977
56061A101828J4587J4895J6325J6635J5315J4643J5248J5028J3670J3668J5433
56050A267275J6015J4344J3198J4205J5387J5445J5993J7580J8103J7159J7471
56039A442175J9866K1427K0750K0519K2581K5022K6397K8276L1282L3218L3466
56028A724979L4658L7666L9723L9742M0480M3035M4474M3554M3458M5985M8363
56017B186117M8846N0098N3823N7404N9167O1564O5899O9337P0588P2894P7901
$$ y = [1106014, 1066522, 1034036, 1006680, 983143, 964036, 949912, 939285, 930300, 922950, 917865, 914412, 911876, 910996, 912315, 914468, 916144, 918310, 922402, 927750, 932913, 938169, 944380, 950740, 956041, 961139, 967913, 976697, 986554, 996938, 1007193, 1015907, 1022815, 1030040, 1039444, 1050245, 1061139, 1072949, 1086851, 1101828, 1116415, 1131310, 1147635, 1164270, 1179585, 1194228, 1209476, 1224504, 1238174, 1251842, 1267275, 1283290, 1297634, 1310832, 1325037, 1340424, 1355869, 1371862, 1389442, 1407545, 1424704, 1442175, 1462041, 1483468, 1504218, 1524737, 1547318, 1572340, 1598737, 1627013, 1658295, 1691513, 1724979, 1759637, 1797303, 1837026, 1876768, 1917248, 1960283, 2004757, 2048311, 2091769, 2137754, 2186117, 2234963, 2285061, 2338884, 2396288, 2455455, 2517019, 2582918, 2652255, 2722843, 2795737, 2873638]
56006B873638Q2237Q3879Q6035R0967R5841R8681J02485J09283J16068J20717
55996C859831J26032J33995J42107J49239J58471J70445J80972J89169K00383
55987E310644K16869K33675K48134K64895K86688L09212L30385L55281L86276
55978G942059M18261M49500M86889N34148N85899O40077P04429P83571Q72457
55969A3417290R70559J088944J234820J403971J598254J835308K131321K491852
55961B6172319K930863L479435M162975M991048N983199P179745Q610739J0283396
55953G3793719J2221699J4489614J7154026K0248956K3752802K7466714L0813324
55946B19940854L2849460L2666605K9835120K4408053J6592340O692096m497208
$$ y = [2873638, 2955875, 3039754, 3125789, 3216756, 3312597, 3411278, 3513763, 3623046, 3739114, 3859831, 3985863, 4119858, 4261965, 4411204, 4569675, 4740120, 4921092, 5110261, 5310644, 5527513, 5761188, 6009322, 6274217, 6560905, 6870117, 7200502, 7555783, 7942059, 8360320, 8809820, 9296709, 9830857, 10416756, 11056833, 11761262, 12544833, 13417290, 14387849, 15476793, 16711613, 18115584, 19713838, 21549146, 23680467, 26172319, 29103182, 32582617, 36745592, 41736640, 47719839, 54899584, 63510323, 73793719, 86015418, 100505032, 117659058, 137908014, 161660816, 189127530, 219940854, 252790314, 285456919, 315292039, 339700092, 356292432, 362984528, 358487320]
55939C58487320j5451984k4396198l0160366l2613766l2392546l0372176k7349431
55932A65750853k3949222k0587511j7472798j4686392j2268769j0231479q540495
55925E8014187p140960n992593n062610m305867l678571l158966k735068k384906
55917B3554646k086255j832944j624321j449001j293741j157938j044972r48311
55909A2117163q59117p78774p11541o52738n95701n42920m99301m61325m23055
55900F592691l86273l54999l26403k96518k68888k48341k31750k13639j95653
55891D070227j82057j70878j57765j44106j33481j24262j13235j02520r5777r1291
55881B754855q5631q0500p9302q0339p9775p8066p7467p6463p2546o7493o4300
$$ y = [358487320, 343035336, 318639138, 288478772, 255865006, 223472460, 193100284, 165750853, 141801631, 121214120, 103741322, 89054930, 76786161, 66554682, 58014187, 50873227, 44880634, 39818024, 35512157, 31833586, 28674620, 25939552, 23554646, 21468391, 19635447, 18011126, 16562125, 15268384, 14110446, 13065474, 12117163, 11258046, 10479272, 9767731, 9114993, 8519292, 7976372, 7477071, 7015746, 6592691, 6206418, 5851419, 5525016, 5228498, 4959610, 4711269, 4479519, 4265880, 4070227, 3888170, 3717292, 3559527, 3415421, 3281940, 3157678, 3044443, 2941923, 2846146, 2754855, 2669224, 2588724, 2509422, 2429083, 2349308, 2271242, 2193775, 2117312, 2044766, 1977273, 1912973]
55870A912973o1859n7951n4223n2995n2305m9370m5818m4277m3018l9267l4740
55859A377150l2542l1501k8942k6316k6545k8239k8032k6524k6580k7674k7171
55848A067084k5588k5456k6362k5926k4470k4170k4660k3814k1836k0574j9812
55837H04416j8091j6013j5114j4676j3242j1914j2479j3636j2819j0550r299r166
55825F47417q376p048o841p598p798p637q494r965j0421r848r472r246q312p077
55811E29284o439n911m784l907m040l942k426o64pP00K916N446O542P148Q988
55796E28904J1064J1337J0304R595Q520N519J830J0l05j676m510o825p873q848
55782E57046j0194j1220j2084j3567j5118j5478j4736j3545j1222p106k811m15
$$ y = [1912973, 1851114, 1793163, 1738940, 1685945, 1633640, 1584270, 1538452, 1494175, 1451157, 1411890, 1377150, 1344608, 1313107, 1284165, 1257849, 1231304, 1203065, 1175033, 1148509, 1121929, 1094255, 1067084, 1041496, 1016040, 989678, 963752, 939282, 915112, 890452, 866638, 844802, 824228, 804416, 786325, 770312, 755198, 740522, 727280, 715366, 702887, 689251, 676432, 665882, 656583, 647417, 639041, 631993, 625152, 617554, 609756, 602119, 593625, 583660, 573239, 563391, 553919, 544673, 536361, 529284, 522845, 516934, 512150, 508243, 504203, 500261, 497835, 497171, 497164, 497864, 500780, 506226, 512768, 519916, 528904, 539968, 551305, 561609, 571204, 579724, 585243, 587073, 587083, 586778, 585102, 580592, 573767, 565894, 557046, 546852, 535632, 523548, 509981, 494863, 479385, 464649, 451104, 439882, 432776, 429965, 429550]
55770D29550P14K538M725N250L811J726q91m798q927j1008j0707r561q153n991
55756C88278l836l310m251n023n322o274p942r172r744j0352j0677r799q239p364
55742B86973p020o014m509l643l180j977m52j11r24j590k117l513n123m981l020
55727B38799j441j570k521l230l680l913l725l532l811l771k305l9J439K034K875
55712B11609M008M429M156M156M444M221L604L225K603R93p55j452j967l842o144
55697B33288o562n321m917o005o606n698m602m168l474k120j255j325j135n3R17
55682A80964J123J314J925K221J930J926K590L156L230L248L004J556q57k602
55668B04728k882k524k199j608q29n54n79J33J411J798R89M47J038J905K307K756
$$ y = [429550, 430264, 432802, 437527, 442777, 446588, 448314, 447423, 442625, 433698, 422690, 411983, 402422, 394269, 388278, 384442, 381132, 376881, 371858, 366536, 360262, 352320, 343148, 333404, 323052, 312375, 302576, 294337, 286973, 279953, 273939, 269430, 265787, 262607, 260630, 260178, 260067, 259143, 257553, 255436, 251923, 246800, 241819, 238799, 237358, 235788, 233267, 230037, 226357, 222444, 218719, 215187, 211376, 207605, 205300, 205261, 206700, 208734, 211609, 215617, 220046, 224202, 228358, 232802, 237023, 240627, 243852, 246455, 247448, 246693, 245241, 243274, 239432, 233288, 226726, 221405, 216488, 210483, 203877, 198179, 193577, 189409, 185935, 183815, 182560, 181235, 180100, 180047, 180964, 182087, 183401, 185326, 187547, 189477, 191403, 193993, 197149, 200379, 203627, 206631, 208187, 207330, 204728, 201846, 199322, 197123, 195515, 194686, 194132, 193553, 193686, 195097, 196895, 197884, 198331, 199369, 201274, 203581, 206337]
55652B06337L627M255M194L882L540K800J841J381J345R98M45K68k48k372n364
55637B26929o970o829o932q168q985q359p457p137o233l904j665j239k042k354
55623A48655j755r40l46j79p68j806k295k026j916k223j916p00J1p93k046k333
55607A26624j907j791k007j980j751j569j162l80J91J14k14l64n23p52o12r7J47
55590A11967j2R2N67O45K05J67Q03J130P03M52R60J423J234J136J762K491K864
55573A28589L620N177O353O007M794M025L790L439K935K509J802M64j073k363
55559A70068l635m963n662n422n021n006m739l663k528k282k695l055l328l677
55545A14392l692l028k053j150k22N20M30l33o50k18m0m02n1J562K854K406J114
$$ y = [206337, 209964, 214219, 218413, 222295, 225835, 228635, 230476, 231857, 233202, 234200, 234645, 234913, 234665, 232293, 226929, 219959, 213130, 206198, 198030, 189045, 180686, 173229, 166092, 159859, 155955, 154290, 153051, 151009, 148655, 146900, 145960, 145614, 145435, 144667, 142861, 140566, 138540, 136624, 134401, 132485, 131785, 131796, 131003, 128957, 126624, 124717, 122926, 120919, 118939, 117188, 115619, 114457, 114077, 114268, 114382, 114168, 113804, 113281, 112529, 111917, 111820, 111967, 111955, 112047, 112614, 113259, 113464, 113631, 114434, 115564, 116267, 116719, 117679, 119102, 120336, 121472, 123234, 125725, 128589, 132209, 137386, 143739, 149746, 154540, 158565, 162355, 165794, 168729, 171238, 173040, 173504, 172431, 170068, 166433, 161470, 155808, 150386, 145365, 140359, 135620, 131957, 129429, 127147, 124452, 121397, 118069, 114392, 110700, 107672, 105619, 104469, 104247, 104767, 105197, 104864, 104214, 103996, 103956, 103554, 103503, 105065, 107919, 110325, 111439]
55528A11439N25L74m00j425j574j065r71j288j225r06j085j597j656j375j491
55513I6280j814j435l56L88K05m86j093j364j207p63m33k66J35O77N87j55l01
55496H8599P57J719J313L74M50J200J013l63j584j892j791j652j158k86M75J026
55480H8200J692K287K222J561R75O49J75m48o77l96j69m11r41j339j299p63j39
55463I1179j24q33j541j677j538j485j222n36M3J11J86P20J145Q80M75O12P62
55446H7157R4r26j252r71r41j077n83M48R98O48p7p36j179j001L2J084J055J50
55428H2923m70l47P1N67J149J242K62r98j110j23M80J08j98L66J163J366J205
55411H7656J241J375J175N82j90q89j150q22m23o73j437j879j623j043m76M5K83
$$ y = [111439, 111964, 112338, 111938, 110513, 108939, 107874, 106903, 105615, 104390, 103484, 102399, 100802, 99146, 97771, 96280, 94466, 93031, 92675, 93063, 93268, 92782, 91689, 90325, 89118, 88355, 87922, 87656, 87791, 88468, 89055, 88900, 88599, 89356, 91075, 92388, 92762, 93212, 94412, 95425, 95062, 93478, 91586, 89795, 88143, 86985, 86699, 87174, 88200, 89892, 92179, 94401, 95962, 96937, 97586, 97761, 97313, 96636, 96240, 96071, 95660, 94719, 93380, 92081, 91318, 91179, 91055, 90222, 88681, 87004, 85466, 83981, 82759, 82223, 82266, 82377, 82563, 83283, 84428, 85308, 85783, 86395, 87157, 87251, 86325, 85073, 84102, 83161, 82084, 81501, 81949, 82947, 83595, 83518, 82782, 81603, 80602, 80634, 81718, 82773, 82923, 82453, 82106, 82177, 82744, 83893, 85135, 85397, 84399, 83289, 83166, 83646, 83754, 83556, 83922, 85085, 86451, 87656, 88897, 90272, 91447, 92029, 91839, 90950, 89800, 88978, 88555, 87882, 86445, 84566, 82943, 81900, 81424, 81469, 81752]
55394H1752k9m89l72J92L92R7O0N55Q58N11J61N32J315J621J150L83j21k85m55
55375H7828q66j170q00l5n8j393k846k864j545l37q0l98p53r36o18L95J362J266
55357G6152L70l8L83N17l24j246j134j79O27Q06N41M6m92p50m94J34Q01J206J114
55338G8040N32j25m84o89r54r03j17Q54R97L44k5L60P21M30J7J76N90M89j20n15
55318G9618k85K27M23N5n85q75m27N01J193J092J69j082j874j641o84R4L50O54
55300G6923J298J497N89o67j046n76k67m13m60k64j71L7R13J968J976Q83Nj0k5
55281H2190o75j175p06J59M00M5j51J21O08J017J077N99L1K75J394K214J811P52
55263H9986J64J91J49l09r63j615k118k103j361l45K01P4l36n92m88p6L01K80
$$ y = [81752, 81723, 81234, 80862, 81054, 81446, 81543, 81603, 82158, 83016, 83527, 83688, 84220, 85535, 87156, 88306, 88689, 88568, 88283, 87828, 86962, 85792, 84992, 84957, 84899, 83506, 80660, 77796, 76251, 75914, 75834, 75436, 74683, 73747, 73129, 73524, 74886, 76152, 76522, 76484, 76867, 77384, 77060, 75814, 74680, 74501, 75128, 75934, 76475, 76521, 76029, 75279, 74785, 74919, 75720, 76926, 78040, 78572, 78447, 77963, 77274, 76320, 75417, 75300, 76154, 77151, 77495, 77470, 77830, 78551, 78981, 78998, 79174, 79764, 80253, 80133, 79618, 79333, 79560, 79983, 80038, 79453, 78578, 78151, 78652, 79845, 80937, 81106, 80024, 78150, 76509, 75825, 75919, 76269, 76923, 78221, 79718, 80307, 79640, 78594, 78018, 77751, 77338, 76878, 76614, 76443, 76480, 77393, 79361, 81337, 82220, 82225, 82215, 82190, 81515, 80340, 79634, 79793, 80193, 80238, 80087, 80208, 80816, 81833, 82910, 83509, 83540, 83815, 85209, 87423, 89234, 89986, 90150, 90341, 90490, 90181, 89218, 87603, 85485, 83382, 82021, 81676, 81877, 81951, 81615, 81023, 80535, 80459, 80760, 81040]
55245H1040RP4O44J166J165Q72O70M53k6n71q23q03o56k49N21J241J333P75L8
55226H6873n50r78j272j298r53l18K98N04K07j02J60Q45J114N07m21q08m73O5
55208H3400K87J41QL29J080J624J343M72j91l55m98r08j145q05k69j50l89m04
55190H3570o6J23k64r29j108l88Q36J710J790J381R90P43N45N05P00Q08N12J12
55172I1570J17L73K14n04j158j297j145j085j094r11l25P33J917K420J779O84
55156I2288K76O49P99J61p22j235j496j704j552p80K07Q65J174J358J419J295
55140I3002J121R78P08K76p9k75n59j004j272j022k95O20J266J074l9j140j083
55123I2277j0P22L68k80j56O62J288J215O57J24K7L18M31Nl93J9Q36Q01l19j261
$$ y = [81040, 81049, 81123, 81767, 82933, 84098, 84970, 85640, 86093, 86067, 85496, 84673, 83870, 83214, 82965, 83486, 84727, 86060, 86835, 86873, 86323, 85345, 84073, 82775, 81822, 81504, 81802, 82306, 82513, 82411, 82571, 83416, 84530, 85037, 84616, 83808, 83335, 83400, 83687, 83828, 83836, 84165, 85245, 86869, 88212, 88684, 88493, 88138, 87640, 86732, 85587, 84782, 84513, 84363, 83974, 83570, 83504, 83627, 83363, 82434, 81326, 80938, 81774, 83484, 85274, 86655, 87645, 88388, 88933, 89438, 90138, 90946, 91458, 91570, 91687, 92060, 92274, 91770, 90612, 89315, 88170, 87085, 85991, 85080, 84755, 85488, 87405, 89825, 91604, 92288, 92564, 93213, 94012, 94173, 93451, 92216, 90720, 89016, 87464, 86684, 86891, 87756, 88930, 90288, 91707, 93002, 94123, 95101, 95809, 96085, 96006, 95731, 95172, 94168, 92896, 91874, 91579, 92199, 93465, 94539, 94500, 93360, 92277, 92267, 92989, 93357, 93077, 92921, 93583, 94871, 96086, 96743, 96867, 96894, 97212, 97643, 97648, 97255, 97274, 98110, 98911, 98592, 97331]
55103I7331j103m38j32rM67J023J066O54K16j87n29m25K03O10K30l66k80L93Q68
55084I9592Q74P19M82J6n67r93j282j452j181l74L17K01n42j236j556j369l62
55067I1287J328K563K305R77j24m51l65j3P45J402J035k57j221j099n71o01j067
55050I5873j180p20k56k55m97l69M25J518K172J935R33l58j439j815j168K09J398
55033I6406J637J071M35K20L60N51O21N99N82N39K63k29m48l7N39N15J1j06L48
55014A03877N38po00n69k78l44o04o17m56k40L89J426J825P89q22j454q55j2N30
54995A02516J037J472J315N90N5O2J57m1l29m79o18q38j039j208j297q97K49J451
54977A02158J634Q14J64M16R74R70M21j01l62n37o75n47P1J128K145K376J469
$$ y = [97331, 96228, 95790, 95658, 95649, 96116, 97139, 98205, 98859, 99075, 98888, 98359, 97934, 98137, 98747, 98977, 98611, 98331, 98724, 99592, 100466, 101185, 101667, 101683, 101116, 100123, 98841, 97389, 96208, 95834, 96151, 96352, 95810, 94574, 93018, 91649, 91287, 92615, 95178, 97483, 98460, 98336, 97885, 97520, 97507, 98252, 99654, 100689, 100432, 99211, 98112, 97541, 96940, 95873, 94693, 93973, 93717, 93462, 92965, 92596, 93021, 94539, 96711, 98646, 99579, 99221, 97782, 95967, 94799, 95008, 96406, 98043, 99114, 99549, 99769, 100129, 100680, 101301, 101900, 102482, 103021, 103284, 103055, 102607, 102570, 103109, 103624, 103635, 103529, 103877, 104415, 104408, 103808, 103239, 102961, 102617, 102013, 101396, 100940, 100700, 101089, 102515, 104340, 105129, 104307, 102853, 101998, 101986, 102516, 103553, 105025, 106340, 106930, 106985, 107047, 107204, 107163, 106834, 106355, 105737, 104899, 103860, 102652, 101355, 100458, 100707, 102158, 103792, 104606, 104770, 105186, 106160, 107130, 107551, 107450, 107088, 106551, 105876, 105329, 105400, 106528, 108673, 111049, 112518]
54960A12518K6q21m88O00J571J809J191R5p78r21m85p6j52p12j354j455o10P59
54942A10717J572J229K49n86j190j744j910j309m49j42j97K87J337J891J361N32
54926A11648M74J298K424L397L981L943L332K761K954L974N092N453M892M043
54912A59666L514K996J619o43k613l363l423l846m609m857m358l726l341l030
54898A29986k772k807k917k559j801j279j146r11n19n34r58q47L88K057L099L230
54882A19710K759J983J278J160J656K126K239K595L787N325O161N972N193M114
54868A66058K641R47m07j167j735k608l700m472m615m348m024l626k933k123j806
54853A32082k202k677k470j691j080r91j101j074r65r62j159j582k024j986j284
$$ y = [112518, 112544, 111723, 111235, 111835, 113406, 115215, 116406, 116501, 115723, 114802, 114317, 114241, 114089, 113377, 112023, 110568, 109958, 110717, 112289, 113518, 113767, 113181, 111991, 110247, 108337, 107028, 106579, 106437, 106240, 106527, 107864, 109755, 111116, 111648, 112122, 113420, 115844, 119241, 123222, 127165, 130497, 133258, 136212, 140186, 145278, 150731, 155623, 159666, 163180, 166176, 167795, 167152, 164539, 161176, 157753, 153907, 149298, 144441, 140083, 136357, 133016, 129986, 127214, 124407, 121490, 118931, 117130, 115851, 114705, 113794, 113275, 112741, 111783, 110936, 111324, 113381, 116480, 119710, 122469, 124452, 125730, 126890, 128546, 130672, 132911, 135506, 139293, 144618, 150779, 156751, 161944, 166058, 168699, 169646, 169239, 168072, 166337, 163729, 160029, 155557, 150942, 146594, 142570, 138944, 136011, 133888, 132082, 129880, 127203, 124733, 123042, 121962, 120971, 119870, 118796, 117831, 116869, 115710, 114128, 112104, 110118, 108834]
54838A08834o03p62j480j625p78K08M43R3j08J40O26J084J298J055M03l14q31
54821A07683j173j368j330j069p05j96N09J046R15K86o7J88N86P39R07J337J728
54804A10016J782J720J760J563P83j75n81k98J51K45j54q39j281r04K06J164J220
54787A16378O87M11O01O69J85n70j078j118p03J47J303K359K854K656K066J527
54771A28374J306J497K095K961L704L937L785L882M582N417N608N020M241L874
54757A80283L915L794K803O67k018m173n292n802o097n808m667l521l465m211
54743A46408m368l401k240j728j543j124p20q09j142j075n50o8Q3R3K21N11Q21
54726A29369R71R29R18J207J808K562L381M130M477M322M073M034L714K522Q52
$$ y = [108834, 108231, 107469, 105989, 104364, 103586, 103794, 104237, 104330, 104222, 104362, 104988, 106072, 107370, 108425, 108828, 108514, 107683, 106510, 105142, 103812, 102743, 102038, 101842, 102351, 103397, 104312, 104598, 104531, 104719, 105305, 106044, 106951, 108288, 110016, 111798, 113518, 115278, 116841, 117624, 117449, 116868, 116570, 116721, 116966, 116812, 115973, 114692, 113788, 113994, 115158, 116378, 117065, 117476, 118077, 118746, 118931, 118361, 117283, 116165, 115462, 115609, 116912, 119271, 122125, 124781, 126847, 128374, 129680, 131177, 133272, 136233, 139937, 143874, 147659, 151541, 156123, 161540, 167148, 172168, 176409, 180283, 184198, 187992, 190795, 191462, 189444, 185271, 179979, 174177, 168080, 162272, 157605, 154084, 150619, 146408, 142040, 138639, 136399, 134671, 133128, 132004, 131284, 130475, 129333, 128258, 127708, 127640, 127723, 127816, 128037, 128548, 129369, 130340, 131269, 132187, 133394, 135202, 137764, 141145, 145275, 149752, 154074, 158147, 162181, 165895, 168417, 169269]
54711A69269l87j202k362l783m310l464k291j924k241k562k716k798k626k200
54697A34403j980k074j853j057m92q08j337j111l62k6k84o17q92j269j381p55
54681A18105Q2R9o16p73K78J653K175J754J094O42L01j42o81j071j049p15o26
54664A20510j155j907k062j327j78P38J086P53j33j066j389q85O6R12J325J277
54648A16565R81P81P57N36k29j213j600j006N6P33O91K95J25L99Q77J205J283
54631A21236J243J182J067Q06K72o12j587k040j656r21n51n58m38j72k43o31o23
54614A15774J9N91N48L33N53R39Q16J73m17n69k51M99J446K059J986J433P07j40
54596A26499r29j157o39R8N82R57J266R43k26j243r93K17J111J120P11L59J58
$$ y = [169269, 168882, 167680, 165318, 161535, 157225, 153761, 151470, 149546, 147305, 144743, 142027, 139229, 136603, 134403, 132423, 130349, 128496, 127439, 126947, 126139, 124802, 123691, 123329, 123303, 123019, 122402, 121510, 120241, 118860, 118105, 118187, 118286, 117670, 116897, 117175, 118828, 121003, 122757, 123851, 124493, 124794, 124652, 123971, 122900, 121851, 121136, 120510, 119355, 117448, 115386, 114059, 113881, 114619, 115705, 116458, 116325, 115259, 113870, 112985, 113051, 113963, 115288, 116565, 117546, 118327, 119084, 119620, 119391, 118178, 116578, 115572, 115628, 116361, 117052, 117347, 117472, 117871, 118748, 119953, 121236, 122479, 123661, 124728, 125534, 125806, 125194, 123607, 121567, 119911, 118990, 118439, 117881, 117443, 117271, 117028, 116397, 115774, 115793, 116384, 116932, 117265, 117818, 118757, 119573, 119746, 119329, 118760, 118509, 119008, 120454, 122513, 124499, 125932, 126639, 126499, 125570, 124413, 123774, 123872, 124454, 125411, 126677, 127620, 127394, 126151, 125158, 125375, 126486, 127606, 128317, 128676, 128834]
54579A28834K26N69O47k5r53j245r36q26j006p27K44J067J036M40o8k58j62K09
54561A27066O84R68J047J067P94j64j438k002j383k24O25R22Q09M79K97O09J146
54544A31302J178N34r5j14L34R63J828K820L265K626J242m8o88n74P0O33M14o01
54526A45089j631j993j785j359p68p5K76J3m26m92l09l42n73n82l09j12j38j55
54508A34329k1N9j49o33j140j314r47k40K86M04M36O85Q65N35j62o13n08p4L94
54489A32192P50Q28N43K39M31J071J480J228O50K80J94L10R02K162L476L793K905
54472A53434J751J223J133P77O2n05p20q50r40o02K05Q24P42L63L99P67P30N2
54454A58845o34p40m91m89q88j333j513j391r95l59K73M91J64l63p00q26q85p96
$$ y = [128834, 129060, 129629, 130276, 130251, 129298, 128053, 127117, 126291, 125285, 124558, 124802, 125869, 126905, 127345, 127277, 127019, 126857, 127066, 127750, 128718, 129765, 130832, 131626, 131462, 130024, 128022, 126639, 126415, 127040, 127962, 128771, 129250, 129547, 130156, 131302, 132480, 133014, 132919, 132805, 133139, 134102, 135930, 138750, 142015, 144641, 145883, 145835, 145147, 144573, 144643, 145276, 145690, 145089, 143458, 141465, 139680, 138321, 137553, 137478, 137754, 137767, 137341, 136849, 136540, 136198, 135625, 135043, 134734, 134622, 134484, 134329, 134308, 134367, 134218, 133585, 132445, 131131, 130184, 129944, 130230, 130634, 131070, 131755, 132620, 133155, 132993, 132380, 131872, 131798, 132192, 132942, 133770, 134313, 134552, 134983, 136054, 137534, 138762, 139412, 139692, 139886, 140196, 141098, 143260, 146736, 150529, 153434, 155185, 156408, 157541, 158318, 158380, 157875, 157155, 156305, 155365, 154763, 154968, 155792, 156534, 156897, 157296, 158063, 158793, 158845, 158211, 157471, 156980, 156491, 155603, 154270, 152757, 151366, 150371, 150012, 150285, 150776, 150940, 150577, 149877, 149051, 148166, 147370]
54436A47370m25k8j8l17m69m46p16j218j072Q9J211J110J47l71j20J24R4L79J037
54417A46361J192N90J79N45Q76M14j67J16Q76J031M74l0j85k31j16L26O18K45
54399A53114k41J20J093J513J145R98J627K289K110J167K1q88j139m74N40Q40
54383A63835K38l53l69m03j044j780j788j164o30m03r6N16J156J461J359J128
54367A61663J177J558J650Q31n21j240q08lK23j39n35p57q33n30L36J255J375
54350A64702N12o34j267j214q66o57o62o23l75j89m52j040j333r75k86J95K79
54333A55115J37J9R6K81J52n62j380j392l77Q29J299R51K92k95o98q42p23m58
54315A52444j16K72M79J74n68j202j373j293j277j264j057o83k49K37O68P93O16
$$ y = [147370, 146945, 146917, 146899, 146582, 146113, 145667, 144951, 143733, 142661, 142750, 143961, 145071, 145218, 144847, 144727, 144851, 144945, 145324, 146361, 147553, 148143, 148322, 148867, 149743, 150157, 149990, 150106, 150982, 152013, 152487, 152457, 152272, 152041, 151925, 152251, 152869, 153114, 152873, 152993, 154086, 155599, 156744, 157742, 159369, 161658, 163768, 164935, 164956, 164068, 162929, 162455, 162995, 163835, 164073, 163720, 163351, 162948, 161904, 160124, 158336, 157172, 156542, 156139, 156043, 156559, 157715, 159176, 160535, 161663, 162840, 164398, 166048, 166879, 166358, 165118, 164310, 164307, 164530, 164391, 163856, 163099, 162266, 161736, 162072, 163327, 164702, 165214, 164580, 163313, 162099, 161233, 160576, 159914, 159291, 158916, 158727, 158275, 157235, 155902, 154927, 154641, 154836, 155115, 155252, 155271, 155367, 155648, 155800, 155238, 153858, 152466, 152089, 152918, 154217, 155168, 155460, 155165, 154467, 153625, 152902, 152444, 152328, 152600, 153079, 153253, 152685, 151483, 150110, 148817, 147540, 146276, 145219, 144536, 144287, 144524, 145192, 145985, 146601]
54298A46601M74N70P78R60J095R24J27r67j524j412j480k168k551j655p8P00L17
54281A40711j48J31P55R77P11L21k3k61j71L58R27R41K77m94o57k1Q88J334J042
54262A47598L92j1R7N37R59J142J094R63Q07N10N4k28M6P56J346J508J483J505
54244A60558J280L77j108k465l018k633j743r13m05j20N7N3j05p3L58P88P33M61
54226A52082O67J287J452Q01P0l8J40o0m89n21j17J94K42L76P61J065R47M20k87
54207A58992q80j033o58j36J5k85p03j002j144r92l57M98R00N33j22l66j11J38
54189A53287J2l28n40n33l99j35K81O29O12K97P6J15J41m4k53k95k76k32N4M88
54169A52957M50k58p35j33R60J201M34k22j24J68J92L36P84Q15p6j160j435r75
$$ y = [146601, 147075, 147645, 148423, 149383, 150478, 151402, 151529, 150562, 149038, 147626, 146146, 143978, 141427, 139772, 139694, 140394, 140711, 140563, 140694, 141449, 142426, 143137, 143458, 143435, 143174, 143003, 143361, 144288, 145229, 145506, 145012, 144355, 144334, 145222, 146556, 147598, 147990, 147979, 148076, 148613, 149572, 150714, 151808, 152771, 153578, 154088, 154142, 153914, 153960, 154716, 156062, 157570, 159053, 160558, 161838, 162215, 161107, 158642, 155624, 152991, 151248, 150335, 149930, 149810, 149867, 149920, 149815, 149742, 150100, 150888, 151621, 152082, 152749, 154036, 155488, 156289, 156359, 156321, 156461, 156401, 155912, 155391, 155274, 155468, 155710, 156086, 156847, 157912, 158859, 159279, 158992, 158112, 157079, 156421, 156285, 156300, 156015, 155312, 154310, 153166, 152174, 151817, 152315, 153215, 153748, 153626, 153260, 153149, 153287, 153299, 152971, 152431, 151898, 151499, 151364, 151645, 152274, 152886, 153183, 153259, 153374, 153515, 153471, 153218, 152923, 152647, 152415, 152469, 152957, 153407, 153149, 152414, 152281, 153241, 154442, 154876, 154654, 154530, 154698, 154890, 155226, 156010, 156825, 156749, 155589, 154154, 153179]
54151A53179n49m54m76n73q25r85p80l96j56N3L86M74q0q64j071n58P9M04N10
54132A47318N90P41J074J534J634R32k15r30q25k99K41Q55J643K247K162J434
54116A60136P61Q29J558K092J666M73o23j094j164j179j092p79l94r6K00N39O90
54099A62523N16J98j17n57j102j383j199q32n53k41J58L41J96J79O25J129J162
54082A61043Q76P80R30J046J092J205J380J665K305L188L591L083K306K184K718
54067A89392L268L688M352N247N787N542M588L167J542M0j174k299l423m177m244
54052B11296l882l441k795j779q11l81k42J83R24J592K079K413K357J905J787
54037B11205K624L899M644M830N063N275M842L879L205L035K770K202J871J971
$$ y = [153179, 152630, 152176, 151700, 151127, 150302, 149317, 148537, 148141, 147985, 148038, 148424, 148898, 148818, 147954, 146883, 146325, 146404, 146808, 147318, 147908, 148649, 149723, 151257, 152891, 153823, 153608, 152678, 151853, 151554, 151795, 152650, 154293, 156540, 158702, 160136, 160897, 161726, 163284, 165376, 167042, 167515, 166892, 165798, 164634, 163455, 162363, 161584, 161190, 161094, 161294, 161833, 162523, 163039, 163237, 163120, 162563, 161461, 160078, 158879, 158047, 157494, 157253, 157411, 157752, 157948, 158127, 158752, 159881, 161043, 161919, 162699, 163629, 164675, 165767, 166972, 168352, 170017, 172322, 175510, 179101, 182184, 184490, 186674, 189392, 192660, 196348, 200700, 205947, 211734, 217276, 221864, 225031, 226573, 226613, 225439, 223140, 219717, 215540, 211296, 207414, 203973, 201178, 199399, 198588, 198207, 197965, 198148, 199072, 200664, 202743, 205156, 207513, 209418, 211205, 213829, 217728, 222372, 227202, 232265, 237540, 242382, 246261, 249466, 252501, 255271, 257473, 259344, 261315]
54023B61315J946J439Q21M59K46K8j62m82j114j707j750j592k119l227l707k971
54007B47423j994j977k827l546l507k911k397k555l393m100l769k475j171n25
53993B10276m66p76j308j502o25J119K481K551J692Q89P79J450K501L098K671
53978B24830J674R80N79k54j516k369k598k904l431l399k702k455l123l466k427
53963A97419r57o12j230j397o30L13Q95J305J580J465J085Q93R18R04J044J690
53947B04685K467K549J912J485J904K821L582M005M241M387M423M268L800L135
53933B49664K699K760L008L061L151L718M470M594M035L858M958O889Q438R125
53919C14428R662J0961J3047J5126J6467J6877J6311J4505J1318P242L089p21
$$ y = [261315, 263261, 264700, 265521, 265980, 266226, 266254, 266092, 265610, 264496, 262789, 261039, 259447, 257328, 254101, 250394, 247423, 245429, 243452, 240625, 237079, 233572, 230661, 228264, 225709, 222316, 218216, 214447, 211972, 210801, 210276, 209810, 209034, 207726, 206224, 205599, 206718, 209199, 211750, 213442, 214331, 215110, 216560, 219061, 222159, 224830, 226504, 227484, 228063, 227809, 226293, 223924, 221326, 218422, 214991, 211592, 208890, 206435, 203312, 199846, 197419, 196462, 195850, 194620, 193223, 192593, 192906, 193801, 195106, 196686, 198151, 199236, 200129, 201047, 201951, 202995, 204685, 207152, 209701, 211613, 213098, 215002, 217823, 221405, 225410, 229651, 234038, 238461, 242729, 246529, 249664, 252363, 255123, 258131, 261192, 264343, 268061, 272531, 277125, 281160, 285018, 289976, 296865, 305303, 314428, 324090, 335051, 348098, 363224, 379691, 396568, 412879, 427384, 438702, 445944, 449033, 448312]
53907D48312m197p160r144r969r961r438q473p271o308n837n664n573n599n721
53893C47997n801n905o225o565o509o166o093o293o124n474n083n299n419m958
53879B66083m554m784m876l776j970r85j365k232k732k868k808k493k143k282
53865B26215k847k966k088q47l58r65j998k604k502k006j568j375j373j456j483
53850A99779j217n95RJ86J32L68Q34Q86L51j60l26o20j287j632j106l27j70m09
53832A94696k39K86M39J99L53J163J929K017J583J055N92K33J1j55l47l93j38
53815B03284K01L98P21J441K115K076J553J430J932K412K562K970M151N659O556
53800B39461O358N303M104L490L599L757L287K440K029K238K481K372K096J757
$$ y = [448312, 444115, 436955, 427811, 417842, 407881, 398443, 389970, 382699, 376391, 370554, 364890, 359317, 353718, 347997, 342196, 336291, 330066, 323501, 316992, 310826, 304733, 298440, 292316, 286842, 281759, 276460, 271041, 266083, 261529, 256745, 251869, 248093, 246123, 245138, 243773, 241541, 238809, 235941, 233133, 230640, 228497, 226215, 223368, 220402, 218314, 217467, 217109, 216144, 214146, 211542, 209040, 207034, 205466, 204091, 202718, 201262, 199779, 198562, 197967, 197976, 198162, 198294, 198662, 199496, 200382, 200733, 200573, 200247, 199627, 198340, 196708, 195602, 195275, 195105, 194696, 194457, 194743, 195182, 195381, 195734, 196897, 198826, 200843, 202426, 203481, 204073, 204306, 204317, 204162, 203815, 203422, 203284, 203485, 203883, 204604, 206045, 208160, 210236, 211789, 213219, 215151, 217563, 220125, 223095, 227246, 232905, 239461, 245819, 251122, 255226, 258716, 262315, 266072, 269359, 271799, 273828, 276066, 278547, 280919, 283015, 284772]
53786B84772J151L68j27k50m27p61q34o12p77j712k871l651m206m823n175m846
53770B55219m156l744l664l521l270l185l217k992k399j733j263j060j157j516
53756B18342j902k064k025j901j593r92l55j14l60p92j081j030n24L03R52R78
53740B05842N02L8j26PN26J525K621L066K579J683R69M87Q7j2M44J133J405J126
53722B23902Q27Q80J044R55O99O25Q37J191J554J833J929J905K071K575L131L423
53706B49381L566L767L747L075K083J750K528L734M409M330L943L675L631L693
53692B97312L636L251K600J875J035o3j095j421j090j075j969k946k698j178L33
53677B96507P73L02l13p01r36j063r39n96l94o65j240j547j372j189j410j645
$$ y = [284772, 285923, 286291, 286164, 285914, 285487, 284726, 283892, 283280, 282503, 280791, 277920, 274269, 270063, 265240, 260065, 255219, 251063, 247319, 243655, 240134, 236864, 233679, 230462, 227470, 225071, 223338, 222075, 221015, 219858, 218342, 216440, 214376, 212351, 210450, 208857, 207865, 207510, 207396, 207036, 206244, 205163, 204133, 203609, 203912, 204864, 205842, 206344, 206382, 206256, 206263, 206789, 208314, 210935, 214001, 216580, 218263, 219232, 219719, 219806, 219794, 220238, 221371, 222776, 223902, 224729, 225609, 226653, 227608, 228307, 228932, 229769, 230960, 232514, 234347, 236276, 238181, 240252, 242827, 245958, 249381, 252947, 256714, 260461, 263536, 265619, 267369, 269897, 273631, 278040, 282370, 286313, 289988, 293619, 297312, 300948, 304199, 306799, 308674, 309709, 309646, 308551, 307130, 306040, 304965, 302996, 300050, 297352, 296174, 296507, 297280, 297582, 297269, 296568, 295632, 294569, 293630, 293034, 292640, 291975, 290735, 289188, 287816, 286627, 285217, 283572]
53661B83572j316p93r82j755j827o68N65O93K25L65J018J072L03k87l7N70R17
53644B81635J061J205J149P93O10J060J858K193J620N77KM55J494K094J801J197
53628C00804J046J398J906K521L292L831L746L362L385L957M609M999N018M504
53614C48378L506K708K795L553M286M874N602O212O149N691N662O055O057N546
53600D17074N324N549N220L817K301J727J779J435L58j131k768m284n153n151
53586D26097m748m394l881k996k214k099k507k999l543m130m245l502k443j907
53572C80489j900j852j680j708j817j513q80n70p64q53l62M87J216J616J604J151
53556C72664N63L74O94J016R30O85O99R06R41Q33J058J889K983L753L949L765
$$ y = [283572, 282256, 281463, 280481, 278726, 276899, 276231, 276796, 277489, 277714, 278079, 279097, 280169, 280472, 280185, 280148, 280718, 281635, 282696, 283901, 285050, 285843, 286453, 287513, 289371, 291564, 293184, 293761, 293763, 294218, 295712, 297806, 299607, 300804, 301850, 303248, 305154, 307675, 310967, 314798, 318544, 321906, 325291, 329248, 333857, 338856, 343874, 348378, 351884, 354592, 357387, 360940, 365226, 370100, 375702, 381914, 388063, 393754, 399416, 405471, 411528, 417074, 422398, 427947, 433167, 436984, 439285, 441012, 442791, 444226, 444584, 443453, 440685, 436401, 431248, 426097, 421349, 416955, 413074, 410078, 407864, 405765, 403258, 400259, 396716, 392586, 388341, 384839, 382396, 380489, 378589, 376737, 375057, 373349, 371532, 370019, 369139, 368569, 367805, 366952, 366590, 367077, 368293, 369909, 371513, 372664, 373227, 373601, 374295, 375311, 376241, 376926, 377625, 378531, 379472, 380305, 381363, 383252, 386235, 389988, 393937, 397702]
53540C97702L567L738M567N987P335P811P340O779O991P961R029R787J0325J0869
53526D99788J1564J2530J3716J4758J5329J5584J5902J6337J6766J7376J8490
53515F68140K0027K1702K3568K5647K7165K7117K5768K4717K5088K6367K7421
53504I42727K7867K7951K7701K6955K5891K4913K4214K3785K3578K3380K2779
53493A221741K1624K0298J9344J9066J9448K0058K0039J8912J7488J7231J8376
53482A433625J9516J9376J8239J6990J5690J3916J1861J0061Q379O169L302K47
53470A577371k720n725q737j1430j3563j5148j6317j7327j8488j9720k0511k0658
53458A407027k0734k1339k2320k3191k3931k4794k5644k6067k5863k5035k3612
$$ y = [397702, 401269, 405007, 409574, 415561, 422896, 430707, 438047, 444826, 451817, 459778, 468807, 478594, 488919, 499788, 511352, 523882, 537598, 552356, 567685, 583269, 599171, 615508, 632274, 649650, 668140, 688167, 709869, 733437, 759084, 786249, 813366, 839134, 863851, 888939, 915306, 942727, 970594, 998545, 1026246, 1053201, 1079092, 1104005, 1128219, 1152004, 1175582, 1198962, 1221741, 1243365, 1263663, 1283007, 1302073, 1321521, 1341579, 1361618, 1380530, 1398018, 1415249, 1433625, 1453141, 1472517, 1490756, 1507746, 1523436, 1537352, 1549213, 1559274, 1567653, 1573822, 1577124, 1577371, 1574651, 1568926, 1560189, 1548759, 1535196, 1520048, 1503731, 1486404, 1467916, 1448196, 1427685, 1407027, 1386293, 1364954, 1342634, 1319443, 1295512, 1270718, 1245074, 1219007, 1193144, 1168109, 1144497]
53447A144497k1945k0704k0054j9302j7900j6230j4734j2975j0489p979o505n885
53435I69795n042l665k281q48J289M006O235P582Q844J0533J2020J2776J3420
53422A034664J4798J6753J8573K0074K1546K3103K4643K6124K7426K8353K9153
53411A285210L0589L2975L5621L7736L9480M1539M3996M6269M7996M9411N0920
53400A741742N2770N5067N7635N9921O1431O2286O2971O3650O4053O4049O3785
53389B409360O3246O2057N9972N7265N4352N1291M7925M4379M1011L7922L4827
53378B963607L1519K8043K4292J9802J4359Q519L069j995p475j3972k1383k9349
53366C019036l7617m5706n2733n8034o1684o4219o6058o7362o8109o8086o7121
$$ y = [1144497, 1122552, 1101848, 1081794, 1062492, 1044592, 1028362, 1013628, 1000653, 990164, 982185, 975680, 969795, 964753, 961088, 958807, 957959, 959248, 963254, 969489, 977071, 985915, 996448, 1008468, 1021244, 1034664, 1049462, 1066215, 1084788, 1104862, 1126408, 1149511, 1174154, 1200278, 1227704, 1256057, 1285210, 1315799, 1348774, 1384395, 1422131, 1461611, 1503150, 1547146, 1593415, 1641411, 1690822, 1741742, 1794512, 1849579, 1907214, 1967135, 2028566, 2090852, 2153823, 2217473, 2281526, 2345575, 2409360, 2472606, 2534663, 2594635, 2651900, 2706252, 2757543, 2805468, 2849847, 2890858, 2928780, 2963607, 2995126, 3023169, 3047461, 3067263, 3081622, 3090141, 3093210, 3091215, 3083740, 3069768, 3048385, 3019036, 2981419, 2935713, 2882980, 2824946, 2763262, 2699043, 2632985, 2565623, 2497514, 2429428, 2362307]
53355B362307o5507o3773o1980n9765n7288n5348n4252n3258n1716n0036m8843
53344A740541m7887m6565m4942m3304m1278l8405l5143l2282k9658k6602k3357
53333A331118k0832j9054j7176j5023j3323j2238j1089r855r540j0456j1332j1013
53321A170187r921r020q190o777m982l665l000k315j076O41K507M182N391O251
53307A140213P290Q745J0127J0970J1728J3348J6035J8940K1030K2069K2764K4134
53295A327393K6510K9101L0828L1630L2361L3316L3655L2644L0698K8581K6330
53284A663047K3729K1233J9397J7714J5074J1335P554M567K073p45m297q407j2478
53271A759796j5803j8171k0213k2607k5034k6586k7272k8324l0620l3490l5603
$$ y = [2362307, 2296800, 2233027, 2171047, 2111282, 2053994, 1998646, 1944394, 1891136, 1839420, 1789384, 1740541, 1692654, 1646089, 1601147, 1557843, 1516565, 1478160, 1443017, 1410735, 1381077, 1354475, 1331118, 1310286, 1291232, 1274056, 1259033, 1245710, 1233472, 1222383, 1212528, 1202988, 1192532, 1181200, 1170187, 1160266, 1151246, 1143056, 1136279, 1131297, 1127632, 1124632, 1122317, 1121241, 1121882, 1124389, 1128571, 1133962, 1140213, 1147503, 1156248, 1166375, 1177345, 1189073, 1202421, 1218456, 1237396, 1258426, 1280495, 1303259, 1327393, 1353903, 1383004, 1413832, 1445462, 1477823, 1511139, 1544794, 1577438, 1608136, 1636717, 1663047, 1686776, 1708009, 1727406, 1745120, 1760194, 1771529, 1779083, 1783650, 1785723, 1784978, 1780681, 1772274, 1759796, 1743993, 1725822, 1705609, 1683002, 1657968, 1631382, 1604110, 1575786, 1545166, 1511676, 1476073]
53260A476073l6513l6764l6833l6744l6582l6666l6978l6848l5707l3845l2122
53249A080471l0969l0008k8760k7426k6724k7049k7937k8422k7821k6273k4521
53238G74561k3148k1984k0411j8238j5939j3970j2265j0707r606r219r173q961
53226F00940q719q823r003q771q554r283j0825j1927j1986j1739j1709j1203r716
53213D68682q264q171r161r822r492q595p527o363n531n591o267o691o662o801
53199C63744p374p837p749p298o707n939n168m745m488l795k743k252k686l171
53185B91792k837k034j682j965k465l057l829m306l686j928j2J036J019M08k36
53170B66218o13o80n84m75l70k33j45k69o65j226j699j865j715j478j268r33m59
$$ y = [1476073, 1439560, 1402796, 1365963, 1329219, 1292637, 1255971, 1218993, 1182145, 1146438, 1112593, 1080471, 1049502, 1019494, 990734, 963308, 936584, 909535, 881598, 853176, 825355, 799082, 774561, 751413, 729429, 709018, 690780, 674841, 660871, 648606, 637899, 628293, 619074, 609901, 600940, 592221, 583398, 574395, 565624, 557070, 547787, 536962, 525035, 513049, 501310, 489601, 478398, 468682, 460418, 452247, 443086, 433264, 423772, 415177, 407650, 401287, 395756, 390165, 383898, 377207, 370545, 363744, 356370, 348533, 340784, 333486, 326779, 320840, 315672, 310927, 306439, 302644, 299901, 297649, 294963, 291792, 288955, 286921, 285239, 283274, 280809, 277752, 273923, 269617, 265931, 264003, 263991, 265027, 266046, 266454, 266218, 265605, 264925, 264341, 263866, 263496, 263263, 263118, 262849, 262184, 260958, 259259, 257394, 255679, 254201, 252933, 252000, 251541]
53153B51541l33r66j785j649l71Q16P84j10o90n22q5J97L26K33j99o23m31L11
53135B46444Q06O98O17J158J847J719O81k93l23M55J168J128L89m20o79k49N21
53118B55667J150J325R66K53l67m77j03K78L04J45J82M32N17J10p30j657k332
53101B55663k625k618k434k089j574j069q76j060j320j325j075p44l53K27R88
53086B37716J714K117J967J222J96n35o45l73j76j31L0L88O76O43L15j84q09j491
53068B42640j994j978j228J08J314J485M04r96j509r89m26o19j260j487r77j67
53052B32321L02J20m95q76m01Q17J838J775O58o81j462j512j146o93k28L23P32
53035B31392M53o64j824j947r99q2k7m69o10k73K46Q40J411J522Q86N9j37L09
$$ y = [251541, 251208, 250242, 248457, 246808, 246437, 247253, 248037, 247927, 247237, 246715, 246630, 246827, 247153, 247386, 247187, 246564, 246133, 246444, 247250, 247948, 248565, 249723, 251570, 253289, 253970, 253677, 253354, 253809, 254977, 256105, 256494, 256074, 255395, 255146, 255667, 256817, 258142, 259108, 259361, 258994, 258517, 258414, 258692, 258996, 259141, 259323, 259755, 260272, 260382, 259652, 257995, 255663, 253038, 250420, 247986, 245897, 244323, 243254, 242378, 241318, 239998, 238673, 237598, 236854, 236501, 236728, 237716, 239430, 241547, 243514, 244736, 244932, 244397, 243752, 243379, 243203, 243072, 243102, 243490, 244166, 244809, 245124, 244940, 244131, 242640, 240646, 238668, 237440, 237548, 238862, 240347, 240751, 239755, 238246, 237257, 236831, 236212, 234952, 233465, 232488, 232321, 232623, 232743, 232248, 231372, 230971, 231788, 233626, 235401, 236059, 235378, 233916, 232404, 231258, 230565, 230337, 230660, 231392, 231845, 231181, 229357, 227410, 226411, 226329, 226302, 225833, 225223, 224950, 225196, 226036, 227447, 228969, 229855, 229914, 229777, 230086]
53017B30086P23Q29R62J191J014K60l79j22Q69J666J575P80J3k34j32j05r4L73
52999B39275J249J645R42k81j025j242j559j903j457r5J159J458J143R25Q57O52
52983B41743M22M72P25R32J157J545J866J796J420J056Q18P26R79J685K444K725
52967B62511K498K107J652R92K67o2J38L46j7r14j685j768j286r28j163j748k131
52950B58809k237k397k584k311j518r47j128j505j209l56J33r1m10l14j54m54
52934B41327r98j088m78L07N97J81o32j290j313n84M74J085O96m45j396j379n78
52917B34486N7j34q14j097n83K27N64K39k15k10K43O56O61L26j05m52n35k24L09
52898B33399O52P44R94J529J713R78j77p31n21l69p59j208j149p84o21p00o91
$$ y = [230086, 230809, 231638, 232600, 233791, 234805, 235065, 234686, 234564, 235433, 237099, 238674, 239454, 239467, 239233, 239101, 238996, 238902, 239275, 240524, 242169, 243111, 242830, 241805, 240563, 239004, 237101, 235644, 235549, 236708, 238166, 239309, 240234, 241091, 241743, 242165, 242637, 243362, 244294, 245451, 246996, 248862, 250658, 252078, 253134, 253952, 254678, 255657, 257342, 259786, 262511, 265009, 267116, 268768, 269760, 270027, 269965, 270103, 270449, 270432, 269518, 267833, 266065, 264779, 263851, 262688, 260940, 258809, 256572, 254175, 251591, 249280, 247762, 246815, 245687, 244182, 242973, 242617, 242750, 242659, 242249, 241935, 241781, 241327, 240329, 239241, 238763, 239070, 239667, 239848, 239216, 237926, 236613, 236029, 236503, 237588, 238284, 237839, 236443, 235064, 234486, 234543, 234409, 233595, 232498, 231915, 232142, 232706, 232945, 232730, 232520, 232763, 233419, 234080, 234406, 234301, 233849, 233314, 233090, 233399, 234051, 234795, 235789, 237318, 239031, 240009, 239832, 239101, 238580, 238211, 237452, 236244, 235095, 234311, 233690, 232990, 232299]
52881B32299m39p0K39L62K95K37L16L22P0j2O81J901K637K426J895J728J853J981
52863B48721K149K284J902R27J37J57N26M38p3m73p17j129j651k020k361k846
52847B45971l097k706k071j870j959j695j167j085j503j647j136m71j24K2J09
52832B25571m4l82m33k0M08M78M00M57N14L33p5o07j178j531j327o57M6O37J354
52813B23944K083K206J460M16k01k18J85Q35J371J248M35l68o26o97j152j818
52797B29103k091j917j746j682j332n92L1R1k16l96l26k27j94q9N8r0p10j378
52779B16297j456q94k28K26P40J447J842J462P01L24L94L64O5j80l40p64j355
52762B18645j479j002n86o27o56k62R6r6m11r7O96J147J000P58P95J006J352J954
$$ y = [232299, 231860, 231790, 232029, 232391, 232686, 232923, 233239, 233561, 233631, 233619, 234300, 236201, 238838, 241264, 243159, 244887, 246740, 248721, 250870, 253154, 255056, 255983, 256120, 256277, 256803, 257241, 257168, 256695, 255978, 254849, 253198, 251178, 248817, 245971, 242874, 240168, 238097, 236227, 234268, 232573, 231406, 230321, 228818, 227171, 226035, 225564, 225440, 225462, 225571, 225527, 225145, 224712, 224692, 225100, 225578, 225978, 226435, 226949, 227282, 227207, 226600, 225422, 223891, 222564, 221907, 221953, 222590, 223944, 226027, 228233, 229693, 230109, 229908, 229690, 229875, 230710, 232081, 233329, 233764, 233396, 232770, 232073, 230921, 229103, 227012, 225095, 223349, 221667, 220335, 219743, 219774, 219865, 219649, 219253, 218927, 218700, 218506, 218417, 218475, 218385, 217675, 216297, 214841, 213947, 213719, 213945, 214685, 216132, 217974, 219436, 220137, 220461, 220855, 221219, 221284, 221104, 220764, 220000, 218645, 217166, 216164, 215578, 214951, 214295, 214033, 214129, 214033, 213622, 213525, 214221, 215368, 216368, 217126, 217921, 218927, 220279, 222233]
52744B22233K533K500J843J332J495J918J976J723J503J128K77n10j44J408K646
52729B43861K275Q39r8q6n3n58q37j44Q36Q06l42j448j704j521j628k007k062
52712B36129j486o16r2k54p72q60j44Q08J090N04l26q08q87p35m56k33l05o42
52694B29915r01q64n73j15L96O63N59O04J400K522K775J793O22K51L27o7r69j657
52676B36681j806j690j406p59R2N77M67J97J95M05O06Q17J095J220R14K88j64
52659B37729l5O10J333J752J846J898K119K424K470J917P93l70r19p55m78n87
52643B51747q42p42m87p55j602k180j824r06k58j09l4L74J083J752K003J721J284
52626B50225J262J755K239K204J656Q63k7q97j543j907k158k270j926j139n77
$$ y = [222233, 224766, 227266, 229109, 230441, 231936, 233854, 235830, 237553, 239056, 240184, 240461, 239951, 239807, 241215, 243861, 246136, 246975, 246877, 246791, 246738, 246180, 245343, 245199, 246035, 246841, 246499, 245051, 243347, 241826, 240198, 238191, 236129, 234643, 234027, 233935, 233681, 232909, 232049, 231905, 232713, 233803, 234307, 233981, 233173, 232286, 231551, 231095, 230862, 230557, 229915, 229014, 228150, 227577, 227462, 227858, 228521, 229080, 229684, 231084, 233606, 236381, 238174, 238796, 239047, 239374, 239307, 238338, 236681, 234875, 233185, 231779, 231020, 231112, 231689, 232156, 232353, 232548, 232953, 233559, 234376, 235471, 236691, 237605, 237893, 237729, 237694, 238304, 239637, 241389, 243235, 245133, 247252, 249676, 252146, 254063, 254856, 254486, 253567, 252812, 252334, 251747, 250905, 250163, 249676, 248921, 247319, 245139, 243315, 242409, 242151, 242042, 242008, 242382, 243465, 245217, 247220, 248941, 250225, 251487, 253242, 255481, 257685, 259341, 260204, 260177, 259280, 257737, 255830, 253672, 251402, 249476, 248337, 247760]
52611B47760q35j618k136k074j724j299o57K22R35J079P90O23Q80J141P36k03
52595B43620n48N17K171K693J599K19r3M78Q91P66M60K25Q0K15O85R48M62l32
52577B55056m19M14J296J491J183R09Q02P02N54L62K5n30j187j670j676j044K
52560B56270Q39R13K76n26j019j074q31o00o78r99j110p17j00K77K95Q6k50n29
52542B50523m35n5o5p60j346r23R7M33k14p31j70R99J572J035l9p14n20J91O97
52523B49575Q40J208K021K403J485j16r43o24p4K20P89J810K489K423K431L148
52507B69085L831L517K510J669Q98l91j839k488k345k350k759k792k075j329j185
52492B61957j303j154r16r42r73n30K39P38P16L73r4n77q00m62K90R21J148J257
$$ y = [247760, 246925, 245307, 243171, 241097, 239373, 238074, 237417, 237639, 238574, 239653, 240443, 241066, 241946, 243087, 243823, 243620, 243072, 243589, 245760, 248453, 250052, 250271, 250178, 250656, 251547, 252313, 252773, 252998, 253078, 253293, 253978, 254926, 255388, 255056, 254637, 255051, 256347, 257838, 259021, 259930, 260732, 261434, 261988, 262350, 262375, 261845, 260658, 258988, 257312, 256268, 256270, 257109, 258022, 258298, 257772, 256753, 255679, 254848, 254248, 253570, 252571, 251461, 250744, 250644, 250921, 251216, 251302, 251052, 250523, 250088, 250033, 249968, 249208, 247862, 246939, 247036, 247469, 247255, 246524, 246354, 247353, 248925, 249960, 249921, 249207, 248687, 248878, 249575, 250415, 251623, 253644, 256047, 257532, 257416, 256473, 255849, 255775, 255995, 256784, 258594, 261083, 263506, 265937, 269085, 272916, 276433, 278943, 280612, 281510, 281119, 279280, 276792, 274447, 272097, 269338, 266546, 264471, 263142, 261957, 260654, 259500, 258584, 257642, 256669, 256139, 256378, 257116, 257832, 258205, 258111, 257534, 256734, 256272, 256562, 257483, 258631, 259888]
52474B59888J618K083K084J363M36J73Q94K037K827L079L134L182L065K742K487
52459B91092K397K093J136l63j893l027l574l517l124k906l074l148k641j916
52445B67535j766k157k150j311m90o01j242j313o38j33l52p55o84l18j88k40L2
52428B53229O84J106Q15J27j69K78R43J041N09J36N32J307J696J735K135L048
52412B69152L726L673L452L887N007O319P648R063J0258J0657J0012Q413N842
52399C57109K354j465m759p098q521r012q533p464o389n404m245l062k364k091
52385B89056j480k37Q47Q95Q8o80q88n62K33J474K801L666L981M277N014N958
52369C14443O363N766M499L376K884K779K463J601K56j279k531k947k436j682
$$ y = [259888, 261506, 263589, 265673, 267036, 267472, 267645, 268539, 270576, 273403, 276482, 279616, 282798, 285863, 288605, 291092, 293489, 295582, 296718, 296355, 294462, 291435, 287861, 284344, 281220, 278314, 275240, 272092, 269451, 267535, 265769, 263612, 261462, 260151, 259661, 259060, 257818, 256505, 255867, 255734, 255382, 254627, 253943, 253625, 253437, 253197, 253229, 253913, 255019, 255834, 255961, 255792, 256070, 257013, 258054, 258563, 258699, 259231, 260538, 262234, 263969, 266104, 269152, 272878, 276551, 280003, 283890, 288897, 295216, 302864, 311927, 322185, 332842, 342854, 351267, 357109, 359463, 357998, 353239, 346141, 337620, 328608, 320075, 312611, 306222, 300818, 296573, 293511, 291147, 289056, 287576, 287339, 288186, 289081, 289169, 288489, 287601, 287039, 287272, 288746, 291547, 295213, 299194, 303471, 308485, 314443, 320806, 326572, 331071, 334447, 337331, 340110, 342573, 344174, 344430, 343151, 340620, 337673, 335237, 333555]
52355C33555j451j667j653j250r29p68j57J092K139K209J755J743K232K443K122
52340C41415J969K647L933N095N670N746N738O093O988Q279R741J1273J2667J3532
52326D40786J3755J3874J4447J5306J5934J6446J7426J8768J9372J8525J6942
52315F21581J5974J6090J6677J7026J6978J6622J5950J5003J4058J3421J3136
52304G92516J3007J2794J2377J1763J1023J0148R045P736O393N120L664J653r10
52291H96329l528n656p103p972q373q410q299q228q073p434o142m557l222k262
52277H07070j265J29J729L025L855M645N857P453R030J0361J1490J2376J2838
52264H88593J2931J3000J3088J2697J1543J0339J0137J0910J1451J0893R723Q892
$$ y = [333555, 332104, 330437, 328784, 327534, 326605, 325837, 325680, 326772, 328911, 331120, 332875, 334618, 336850, 339293, 341415, 343384, 346031, 349964, 355059, 360729, 366475, 372213, 378306, 385294, 393573, 403314, 414587, 427254, 440786, 454541, 468415, 482862, 498168, 514102, 530548, 547974, 566742, 586114, 604639, 621581, 637555, 653645, 670322, 687348, 704326, 720948, 736898, 751901, 765959, 779380, 792516, 805523, 818317, 830694, 842457, 853480, 863628, 872673, 880409, 886802, 891922, 895586, 897239, 896329, 892801, 887145, 880042, 872070, 863697, 855287, 846988, 838760, 830687, 823253, 817111, 812554, 809332, 807070, 805805, 805934, 807663, 810688, 814543, 819188, 825045, 832498, 841528, 851889, 863379, 875755, 888593, 901524, 914524, 927612, 940309, 951852, 962191, 972328, 983238, 994689, 1005582, 1015305, 1024197]
52252A024197Q516Q040P313O639N856M244J584j406m078o660r516j2054j3226
52239A019449j2998j2562j2836j3352j3066j1860j0680j0340j0674j0965j0797
52228H89319j0188r209p814o130m640l887m005m467m432l445j822l20O50J243
52214H30853J686J927J954K113K738L640M389M894N283N371M839L975L509L615
52200H80786L634L141K639K743L229L461L360L382L717M130M373M365M049L592
52186I30601L448L689L467J825r85l607n052n542n855o468p484q748r729r718
52172H79842q564o862n280l951k756j767j106o25n4O66J446K314L383M580N468
52157H66734N449M386L020K408K663K608J305m89j171m05N92Q92R56J477K166
$$ y = [1024197, 1032713, 1040753, 1048066, 1054705, 1060561, 1064805, 1066389, 1064983, 1060905, 1054245, 1044729, 1032675, 1019449, 1006451, 993889, 981053, 967701, 954635, 942775, 932095, 921755, 911081, 900116, 889319, 879131, 869922, 862108, 855978, 851338, 847451, 843446, 838979, 834547, 831102, 829280, 828960, 829610, 830853, 832539, 834466, 836420, 838533, 841271, 844911, 849300, 854194, 859477, 864848, 869687, 873662, 877171, 880786, 884420, 887561, 890200, 892943, 896172, 899633, 902993, 906375, 910092, 914222, 918595, 922960, 927009, 930601, 934049, 937738, 941205, 943030, 942045, 938438, 933386, 927844, 921989, 915521, 908037, 899289, 889560, 879842, 871278, 864416, 859136, 855185, 852429, 850662, 849556, 848931, 848877, 849543, 850989, 853303, 856686, 861266, 866734, 872183, 876569, 879589, 881997, 884660, 887268, 888573, 888084, 886913, 886508, 887100, 887992, 888948, 890425, 892591]
52142H92591K395K266K243K231J885J429J428J889K398K941L923N344O725P923
52128I37611R408J1586J4295J7073J9502K1266K2381K3476K5317K7758K9601K9831
52116A189105K8697K7245K6004K4591K2513J9928J7347J4903J2316R583P251N696
52104A405179M462K837J036O9K92O84J06j275k429k971l510m633o274q151j0140
52089A375282j2032j3568j4919j6600j8471j9438j8585j6282j3626j1120q496
52078A212145n663l035q29J268L382M959N532N690O638Q801J1337J3149J3961
52065A277335J4241J4384J4370J4077J3557J2948J2263J1337R990Q313O722N567
52053A415104M687L646K405J358N20q30l259o317r080j1314j3467j5716j7673
$$ y = [892591, 894986, 897252, 899495, 901726, 903611, 905040, 906468, 908357, 910755, 913696, 917619, 922963, 929688, 937611, 947019, 958605, 972900, 989973, 1009475, 1030741, 1053122, 1076598, 1101915, 1129673, 1159274, 1189105, 1217802, 1245047, 1271051, 1295642, 1318155, 1338083, 1355430, 1370333, 1382649, 1392232, 1399483, 1405179, 1409641, 1412478, 1413514, 1413583, 1413875, 1414559, 1414665, 1413390, 1410961, 1407990, 1404480, 1399847, 1393573, 1385422, 1375282, 1363250, 1349682, 1334763, 1318163, 1299692, 1280254, 1261669, 1245387, 1231761, 1220641, 1212145, 1206482, 1203447, 1202618, 1203886, 1207268, 1212227, 1217759, 1223449, 1230087, 1238888, 1250225, 1263374, 1277335, 1291576, 1305960, 1320330, 1334407, 1347964, 1360912, 1373175, 1384512, 1394502, 1402815, 1409537, 1415104, 1419791, 1423437, 1425842, 1427200, 1427720, 1426890, 1423631, 1417314, 1408234, 1396920, 1383453, 1367737, 1350064]
52040A350064j9023j9798j9899j9067j7552j6194j5457j4904j3952j2686j1540
52029A169992j0650r917r411r193r029q676q266q004p790p506p411p798q344q391
52015A049606p807p134o839o791o618o308o240o717p586q397q955r579j0636j1932
52001I38067j2964j3700j4624j5918j7054j7428j6897j5597j3756j1954j0911
51990G77264j0516r733q070o595o654q011r189r400r260r537j0170j0745j1206
51977F58178j1697j2138j2274j1982j1390j0849j0652j0518r591p397m591k240
51965E42859n53J089L036N034O852Q432R290Q748O982N121L851K660Q28j470l601
51950E99158n458p255q716r158q292o462m155j716N95K648M564O542Q521J0228
$$ y = [1350064, 1331041, 1311243, 1291344, 1272277, 1254725, 1238531, 1223074, 1208170, 1194218, 1181532, 1169992, 1159342, 1149425, 1140014, 1130821, 1121792, 1113116, 1104850, 1096846, 1089056, 1081550, 1074139, 1066341, 1057997, 1049606, 1041799, 1034665, 1027826, 1021035, 1014417, 1008109, 1001869, 995152, 987566, 979169, 970214, 960635, 949999, 938067, 925103, 911403, 896779, 880861, 863807, 846379, 829482, 813885, 800129, 788175, 777264, 766748, 757015, 748945, 742350, 735696, 727685, 718496, 709096, 699836, 690299, 680129, 669384, 658178, 646481, 634343, 622069, 610087, 598697, 587848, 577196, 566678, 557087, 549690, 545099, 542859, 542306, 543395, 546431, 551465, 558317, 566749, 576039, 584787, 591769, 596890, 600741, 603401, 604229, 602759, 599158, 593700, 586445, 577729, 568571, 560279, 553817, 549662, 547946, 548541, 551189, 555753, 562295, 570816, 581044]
51936E81044J1507J2372J2826J2738J1888J0115P459M283J064j975m858p557r937
51923F40969j2006j3844j5179j5495j4780j3740j2953j2149j0672q448o013l745
51911E01945j424J366M651P952J0662J2533J3773J4516J4305J2517R327N819K893
51898F10835N03j703l552m717n598p046r270j1617j3516j5039j6355j7088j6606
51885D89231j4749j2022r195o822m908k969n46K234M687O263P009P370P763Q394
51871D81740R193R725R384P946N827L601J409q97l182m955n969o590p302p997
51857D91933p977o702m352j670O68K363L386L749L495K729J608K88j087k398l606
51842D82427m716n632o162o298o312o352o102n124l616k428k083k124j676n09
$$ y = [581044, 592551, 604923, 617749, 630487, 642375, 652490, 659949, 664232, 665296, 663321, 658463, 650906, 640969, 628963, 615119, 599940, 584445, 569665, 555925, 542972, 530823, 520151, 511703, 505690, 501945, 500521, 501887, 506538, 514490, 525152, 537685, 551458, 565974, 580279, 592796, 602123, 607942, 610835, 611338, 609635, 606083, 601366, 595768, 588722, 579452, 567835, 554319, 539280, 522925, 505837, 489231, 474482, 462460, 453265, 446443, 441535, 438566, 438020, 440254, 444941, 451204, 458213, 465583, 473346, 481740, 490933, 500658, 510042, 517988, 523815, 527416, 528825, 527928, 524746, 519791, 513822, 507232, 499930, 491933, 483956, 477254, 472902, 471232, 471900, 474263, 477649, 481398, 484893, 487622, 489230, 489518, 488431, 486033, 482427, 477711, 472079, 465917, 459619, 453307, 446955, 440853, 435729, 432113, 429685, 427602, 425478, 423802, 423293]
51828D23293Q58J832K107J514J34j367k130k106k170k910l788l912l218k301j413
51813D04423l22R93K171K990L490L564L090K427K169K194J638Q7j801l101l503
51798D20509l109k075q53k59o45j422j858j986k243k654k993l317l626l355k053
51783C88061l62N04K81j68k51k99o23p54j76P52J243J203J324K175L554M844N718
51766D07026O392P290Q535R797J0571J0522R599P908N689L233P76j474l299m667
51752D77898n964p543q902q932p363n462m673m966n111m350l029j708l86J196
51738D10705L109N204P157Q538R151R301R299Q900P700N916M174K724J493P49
51724D94120Q59J425J486P37l19j524l344n640p188p113o048n139m517l596k356
$$ y = [423293, 424151, 425983, 428090, 429604, 429738, 428371, 426241, 424135, 421965, 419055, 415267, 411355, 408137, 405836, 404423, 404101, 405094, 407265, 410255, 413745, 417309, 420399, 422826, 424995, 427189, 428827, 428914, 427113, 424012, 420509, 417400, 415325, 414472, 414213, 413568, 412146, 410288, 408302, 406059, 403405, 400412, 397095, 393469, 390114, 388061, 387699, 388203, 388484, 388316, 388065, 387766, 387143, 386389, 386213, 386965, 388208, 389411, 390735, 392910, 396464, 401308, 407026, 413418, 420708, 429243, 439040, 449611, 460133, 469732, 477640, 483329, 486562, 487338, 485864, 482565, 477898, 471934, 464391, 455489, 446557, 439194, 433732, 429059, 424093, 418982, 414632, 411603, 409895, 409509, 410705, 413814, 419018, 426175, 434713, 443864, 453165, 462464, 471364, 479064, 484980, 489154, 491878, 493371, 494120, 494979, 496404, 497890, 498627, 498308, 496784, 493440, 487800, 480612, 473499, 467451, 462312, 457795, 454199, 451843]
51709D51843j423j063r14p10n55l69L68K026M164N735N938M882L404K164J064
51694D76554j96j250j317l63O12P65K86k10p07j660l161m744n913o464o416n921
51678D39895n131l993k361m44J117J943K327K774L362L900M407N040N748O363
51664D64947O921P519P958P725O377L854N97k528m731n779n898n156l357o28K354
51649D80175M895O697P563P197N565L081J17l234o707r672j1647j2619j2566j1345
51635D47500r426p999p647p534o694n448m650l984k348J57J924J929J083R08J551
51620C99322J841R92n02j640k041k099k215k263j921j349j109j388j664j340m28
51605C82196O66J647K352K563K219J739J717K381L538M854O071P082P993Q820
$$ y = [451843, 450420, 449357, 448443, 447733, 447178, 446809, 447177, 449203, 453367, 459102, 465040, 469922, 473326, 475490, 476554, 476358, 475108, 473791, 473428, 474040, 474805, 475091, 474881, 474174, 472514, 469353, 464609, 458696, 452232, 445816, 439895, 434764, 430771, 428410, 427966, 429083, 431026, 433353, 436127, 439489, 443389, 447796, 452836, 458584, 464947, 471868, 479387, 487345, 495070, 501447, 505301, 505898, 503370, 498639, 492860, 486962, 481806, 478449, 477821, 480175, 485070, 491767, 499330, 506527, 512092, 515173, 515290, 512056, 505349, 495677, 484030, 471411, 458845, 447500, 438074, 430075, 422428, 414894, 408200, 402752, 398102, 394118, 391770, 391927, 393851, 395780, 396863, 397771, 399322, 401163, 402155, 401653, 400013, 397972, 395873, 393658, 391395, 389474, 388125, 387016, 385628, 383964, 382624, 382196, 382862, 384509, 386861, 389424, 391643, 393382, 395099, 397480, 401018, 405872, 411943, 419025, 427018, 435838]
51591D35838R009P743N023J899p20k907m925o220o081m813l338j846K78L224O364
51576D38528R127J1504J3597J5391J7114J9138K1228K2526K2472K1328J9767J8442
51564F50162J7980J8634J9814K0658K1365K3279K7314L2803L8214M2283M4097
51553I56603M2861L8368L1383K2873J3125K265q709j8249k5701l1742l7129m1551
51541I44397m4112m4542m3454m1507l8846l5519l2055k9162k6904k4557k1498
51530E62241j8035j5142j3461j2684j1919j0525q711p295o776o643n903m342k918
51517D37887k627l307l906l692k781j663o07M02J505K747L875M391M033L047J859
51502D41163O59m90j445k165k788l238l053k075j008p10j153j611j732j748j746
$$ y = [435838, 444847, 452590, 457613, 459512, 458792, 455885, 450960, 444740, 438659, 433846, 430508, 428662, 428940, 432164, 438528, 447655, 459159, 472756, 488147, 505261, 524399, 545627, 568153, 590625, 611953, 631720, 650162, 668142, 686776, 706590, 727248, 748613, 771892, 799206, 832009, 870223, 912506, 956603, 999464, 1037832, 1069215, 1092088, 1105213, 1107478, 1098769, 1080520, 1054819, 1023077, 985948, 944397, 900285, 855743, 812289, 770782, 731936, 696417, 664362, 635200, 608296, 583739, 562241, 544206, 529064, 515603, 502919, 491000, 480475, 471764, 464469, 457693, 451050, 445147, 440805, 437887, 435260, 431953, 428047, 424355, 421574, 419911, 419304, 419706, 421211, 423958, 427833, 432224, 436257, 439304, 441163, 441822, 441332, 439887, 437722, 434934, 431696, 428643, 426568, 425560, 424850, 423697, 422086, 420354, 418606, 416860]
51487D16860j473r83q90j582k568k962k491j876k183l694n378n769m587l112k701
51472C74611l305l934m083l989l801l339k652k109j852j644j289p55l6O33P12
51457C43168R3l82N4Q92J128J038J951M145O233P046P056P437Q614J0358J2469
51442D11300J4642J6261J6960J6912J6118J4022J0421O198K514l13k564m238n107
51429E13126n424n896p024q720j0444j1469j1350j0401r377q556p531o076m624
51416D06234l571k749j938j266o67M23K159L725M330M278M311M360L890L105K846
51401D29470L260L531L051K189J682J738J995K099K143K668M115O189Q025R211
51387D81366J0304J2006J4286J6795J9768K3745K8633L3690L8534M3531M9047
$$ y = [416860, 415387, 414404, 413514, 411932, 409364, 406402, 403911, 402035, 399852, 396158, 390780, 385011, 380424, 377312, 374611, 371306, 367372, 363289, 359300, 355499, 352160, 349508, 347399, 345547, 343903, 342614, 341859, 341823, 342456, 343168, 343261, 342879, 342933, 343825, 344953, 345991, 347942, 352087, 358320, 365366, 372422, 379859, 388473, 398831, 411300, 425942, 442203, 459163, 476075, 492193, 506215, 516636, 522834, 525348, 525035, 522471, 518233, 513126, 507702, 501806, 494782, 486062, 475618, 464149, 452799, 442398, 433021, 424465, 416934, 410858, 406234, 402663, 399914, 397976, 396710, 396043, 396466, 398625, 402350, 406680, 410958, 415269, 419629, 423519, 426624, 429470, 432730, 436261, 439312, 441501, 443183, 444921, 446916, 449015, 451158, 453826, 457941, 464130, 472155, 481366, 491670, 503676, 517962, 534757, 554525, 578270, 606903, 640593, 679127, 722658, 771705]
51376G71705N4717N9545O2436O2697O0315N5607M8395L7932K4257R304m190j5036
51364A227684k4226l3127m1711m8864n3753n6443n7417n7043n5405n2449m8287
51353F98959m3440l8572l3930k9220k4281j9602j5953j3551j1859j0306q902p992
51341D41351p526o944n881m672l912l683l598l487l588l995m368m381m080l623
51327C77613k949k043j276j162j810k693k939j993k44J076J060J92k44J99O98
51312C63485M84j31m11k03K26Q31J624K299K581K688K923L056K697K012J497J177
51296C86835N64o59k293l846m798m793m020l148k594k129j458p73k51M85J792
51281C58914L212L973M053M038M142M023L518K822K048J217O14M86M59qo22m81
$$ y = [771705, 826422, 885967, 948403, 1011100, 1071415, 1127022, 1175417, 1213349, 1237606, 1246910, 1242720, 1227684, 1203458, 1170331, 1128620, 1079756, 1026003, 969560, 912143, 855100, 799695, 747246, 698959, 655519, 616947, 583017, 553797, 529516, 509914, 493961, 480410, 468551, 458245, 449343, 441351, 433825, 426881, 421000, 416328, 412416, 408733, 405135, 401648, 398060, 394065, 389697, 385316, 381236, 377613, 374664, 372621, 371345, 370183, 368373, 365680, 362741, 360748, 360504, 361580, 362640, 362832, 362588, 362787, 363485, 363969, 363838, 363427, 363224, 363450, 364281, 365905, 368204, 370785, 373473, 376396, 379452, 382149, 384161, 385658, 386835, 387399, 386740, 384447, 380601, 375803, 371010, 366990, 363842, 361248, 359119, 357661, 356888, 356637, 357122, 358914, 362126, 366099, 370152, 374190, 378332, 382355, 385873, 388695, 390743, 391960, 392574, 393060, 393519, 393511, 392889, 392408]
51265C92408O30J874K473K553K515K203J174m80j996k641k419k056k219k732k851
51250C88436k371j922j964k087j889j765k032j942p25P91R64k80j225p86J67L88
51234C71758o6m36o39j042j561j795j767j768j763j454p78Q4R44J538J533R86
51218C63774M92N14Q08Q67O52N28O91J001J297J611K116K916L774M172L876L385
51202C92474L325L550L399K788K283K018J394J46j113j794k101k387k518k405
51188C99059k499l013l323k816j862j160o77n7L96J49m64o31l81m94j071j262
51172C79894o46J11L62M30R29J791K487K816K888K639J989J289J174J868K833
51157D02854L264K771J654N39k50r22j778k626k863k211j132m41m92q88q97k06
$$ y = [392408, 393038, 394912, 397385, 399938, 402453, 404656, 405830, 405350, 403354, 400713, 398294, 396238, 394019, 391287, 388436, 386065, 384143, 382179, 380092, 378203, 376438, 374406, 372464, 371739, 372530, 373494, 373214, 371989, 371203, 371370, 371758, 371692, 371256, 370617, 369575, 368014, 366219, 364452, 362684, 360921, 359467, 358689, 358773, 359717, 361255, 362788, 363774, 364266, 364780, 365588, 366455, 367107, 367635, 368326, 369327, 370624, 372235, 374351, 377267, 381041, 385213, 389089, 392474, 395799, 399349, 402748, 405536, 407819, 409837, 411231, 411377, 410264, 408470, 406369, 403982, 401464, 399059, 396560, 393547, 390224, 387408, 385546, 384386, 383709, 383652, 384048, 384197, 383733, 383102, 382721, 382227, 381156, 379894, 379248, 379359, 379721, 380151, 381080, 382871, 385358, 388174, 391062, 393701, 395690, 396979, 398153, 400021, 402854, 406118, 408889, 410543, 411082, 410832, 409910, 408132, 405506, 402643, 400432, 399300, 398859, 398367, 397479, 396582, 396376]
51141C96376P56J261R70J23q73j813k573k980k954k588j932j004j16K26K6L4P56
51124C83695J646J853J505J458J942K254K007J775K157K825L073K844K612K541
51110D14187K372K041J865K019K263K369K461K753L109L096K500J573P40J95j33
51095D43410l05l12k91m90q94j140j086j157j699k202j775m95M11K5j124j793
51079D29083j491p47j78J14L71Q52J704K705L208K754J790J358J990L282M621
51064D51416N900P364R150J1163J3144J4719J5679J6241J6658J6505J5064J2636
51052F05639J0807J0783J2087J3475J4653J6131J7684J8040J6258J2662Q276L935
51040G60430P8l264o452r605j1950j2574j1887j1497j2329j3805j5214j6802j8801
$$ y = [396376, 397132, 398393, 399363, 399486, 398613, 396800, 394227, 391247, 388293, 385705, 383773, 382769, 382653, 382879, 382905, 382939, 383695, 385341, 387194, 388699, 390157, 392099, 394353, 396360, 398135, 400292, 403117, 406190, 409034, 411646, 414187, 416559, 418600, 420465, 422484, 424747, 427116, 429577, 432330, 435439, 438535, 441035, 442608, 443348, 443543, 443410, 443105, 442793, 442502, 442012, 441118, 439978, 438892, 437735, 436036, 433834, 432059, 431564, 431975, 432000, 430876, 429083, 427592, 426845, 426667, 426781, 427152, 428004, 429708, 432413, 435621, 438375, 440165, 441523, 443513, 446795, 451416, 457316, 464680, 473830, 484993, 498137, 512856, 528535, 544776, 561434, 577939, 593003, 605639, 616446, 627229, 639316, 652791, 667444, 683575, 701259, 719299, 735557, 748219, 756495, 760430, 760508, 757244, 750792, 741187, 729237, 716663, 704776, 693279, 680950, 667145, 651931, 635129, 616328]
51027F16328k0305k0245j8810j6887j4598j1517p984m972k685m60J852L489M015
51014E07221M096M606N736P235Q855J0148J0512R942R260R165R472R591R458R571
51000F24868J0314J1473J2251J1822J0268Q878Q911J0001J0445R326P539O376
50988G42472N891N269M189L056K207J730J781K501L562M427N008N675O698Q004
50974H02470R510J1238J3150J5241J7763K1036K5009K9272L3539L7868M2335M6660
50962A105091N0337N3110N5249N7261N9210O0442O0209N8445N5605N1854M6881
50951A713694M0681L3985K7634K1905J6653J1758P190K993n03k922m541o244q434
50938A853849j0522j2003j3460j5783j8752k1279k2822k3800k4626k5211k5553
$$ y = [616328, 596023, 575778, 556968, 540081, 525483, 513966, 505982, 501010, 498325, 497865, 499717, 503206, 507221, 511317, 515923, 521659, 528894, 537749, 547897, 558409, 568351, 577611, 586776, 596248, 605839, 615297, 624868, 635182, 646655, 658906, 670728, 680996, 689874, 698785, 708786, 719231, 728557, 736096, 742472, 748363, 753632, 757821, 760877, 763084, 764814, 766595, 769096, 772658, 777085, 782093, 787768, 794466, 802470, 811980, 823218, 836368, 851609, 869372, 890408, 915417, 944689, 978228, 1016096, 1058431, 1105091, 1155428, 1208538, 1263787, 1321048, 1380258, 1440700, 1500909, 1559354, 1614959, 1666813, 1713694, 1754375, 1788360, 1815994, 1837899, 1854552, 1866310, 1873500, 1876493, 1875990, 1873068, 1868527, 1862283, 1853849, 1843327, 1831324, 1817864, 1802081, 1783329, 1762050, 1739228, 1715428, 1690802, 1665591, 1640038]
50927A640038k6168k7496k9437l1728l4365l7341m0214m2316m3276m3258m2701
50916A241738m1910m0835l9247l7124l4696l2034k8950k5500k2251j9665j7521
50905I02005j5428j3604j2521j1948j1111r827q728q203p785o899n683m690m181
50892G81397m016l833l094j457N27J598J205L75M86J501K175J904J470J783K646
50877G84667L335L784M494N586O628P470Q522J0057J1733J3085J4136J5135J6126
50864I04758J7141J8595K0873K3724K6548K9257L2294L5847L9692M3934M9223
50853A241886N5914O3473P1094P8488Q5725R2797R9799J07115J14777J21922J27511
50842B260501J31412J34192J35856J35428J31842J24821J14743J02081Q7135P0104
$$ y = [1640038, 1613870, 1586374, 1556937, 1525209, 1490844, 1453503, 1413289, 1370973, 1327697, 1284439, 1241738, 1199828, 1158993, 1119746, 1082622, 1047926, 1015892, 986942, 961442, 939191, 919526, 902005, 886577, 872973, 860452, 848504, 837393, 827566, 818838, 810635, 802850, 795951, 790268, 785578, 781397, 777381, 773548, 770454, 768997, 769524, 771122, 772327, 772702, 773188, 774689, 776864, 778768, 780238, 782021, 784667, 788002, 791786, 796280, 801866, 808494, 815964, 824486, 834543, 846276, 859361, 873497, 888632, 904758, 921899, 940494, 961367, 985091, 1011639, 1040896, 1073190, 1109037, 1148729, 1192663, 1241886, 1297800, 1361273, 1432367, 1510855, 1596580, 1689377, 1789176, 1896291, 2011068, 2132990, 2260501, 2391913, 2526105, 2661961, 2797389, 2929231, 3054052, 3168795, 3270876, 3358011, 3428115]
50832C428115N1373L1890J3085l901j8806l1749m2322m9708n3642n4604n2925
50821C216806m8418m1317l3132k5922k0859j7913j6877j8179k2435k9503l8293
50810B903958m7639n7126o6907p6819q5989r3404r8619j01739j02847j01814r8588
50799A972467r3435q6830p9198p0821o1969n3067m4617l6778k9212k1655j4554
50788A380331q616l766P57N064Q120R090Q493P400O065M168J949M7j538l325n266
50773A408973o788p993r829j2696j5797j8291k0297k2332k4419k6238k7640k8495
50761A188158k8478k7539k6132k4629k2860k0649j8355j6392j4541j2268r443
50750I66872o359l277m61J667K938L931N600Q419J2100J6059J9927K3705K7713
$$ y = [3428115, 3479488, 3511378, 3524463, 3520562, 3501756, 3470007, 3427685, 3377977, 3324335, 3269731, 3216806, 3168388, 3127071, 3093939, 3068017, 3047158, 3029245, 3012368, 2994189, 2971754, 2942251, 2903958, 2856319, 2799193, 2732286, 2655467, 2569478, 2476074, 2377455, 2275716, 2172869, 2071055, 1972467, 1879032, 1792202, 1713004, 1642183, 1580214, 1527147, 1482530, 1445752, 1416540, 1394885, 1380331, 1371715, 1367949, 1368706, 1373770, 1381890, 1390980, 1399473, 1406873, 1412938, 1417106, 1419055, 1419102, 1417564, 1414239, 1408973, 1402185, 1394192, 1384363, 1371667, 1355870, 1337579, 1317282, 1294950, 1270531, 1244293, 1216653, 1188158, 1159680, 1132141, 1106009, 1081380, 1058520, 1037871, 1019516, 1003124, 988583, 976315, 966872, 960513, 957236, 956775, 958442, 961380, 965311, 970911, 979330, 991430, 1007489, 1027416, 1051121, 1078834]
50737A078834L2294L7357M2437M7281N2094N7048O1814O5858O8907P0929P2012
50726A686865P2535P3004P3304P2512O9867O5636O0555N4753M7727L9048K8598
50715B344404J6403K988j0376k2329l2292m0079m5093m6677m5156m1606l6624
50704B043563l0252k3235j7188j3052j0161p471n111m163n455r139j4965k2212
50692A881159k9701l6466m2346m7426n1204n2875n2294n0069m6771m2608l7753
50681A391646l2403k6362j9150j0732j868O473J3832K0382K6667L3150L9741M5643
50669A487019M9914N2178N2592N1291M8392M4426M0133L5678L0740K5582K1372
50658A939317J8942J7778J6754J5476J4237J3092J1767J0409R642R786J0661J2246
$$ y = [1078834, 1111128, 1148485, 1190922, 1238203, 1290297, 1347345, 1409159, 1475017, 1543924, 1614853, 1686865, 1759400, 1832404, 1905708, 1978220, 2048087, 2113723, 2174278, 2229031, 2276758, 2315806, 2344404, 2360807, 2363795, 2353419, 2331090, 2298798, 2258719, 2213626, 2166949, 2121793, 2080187, 2043563, 2013311, 1990076, 1972888, 1959836, 1949675, 1942204, 1937093, 1932930, 1927475, 1918336, 1903371, 1881159, 1851458, 1814992, 1772646, 1725220, 1674016, 1621141, 1568847, 1518778, 1472007, 1429399, 1391646, 1359243, 1332881, 1313731, 1302999, 1301131, 1307604, 1321436, 1341818, 1368485, 1401635, 1441376, 1487019, 1536933, 1589111, 1641703, 1692994, 1741386, 1785812, 1825945, 1861623, 1892363, 1917945, 1939317, 1958259, 1976037, 1992791, 2008267, 2022504, 2035596, 2047363, 2057772, 2067414, 2077200, 2087861, 2100107]
50646B100107J4833J8296K1858K5023K8298L2474L7475M2325M6118M8595M9879
50635B465281N0056M9148M7202M4270M0446L6082L1907K8700K6475K3971J9287
50624B862825J1254M5j3681k9595m6821o2626p3250p6605p3575o6306n6029m3233
50612B332403k9157j5900m939L612J0100J4258J5303J2749O931j176j0638k1108
50600B312438l2562m4392n5182o3707o9789p3808p5828p5779p4115p1405o7468
50589A608403o1951n5715n0556m7121m4063l9875l4834l0410k7269k4765k2216
50578A169628j9809j8053j6935j5897j4445j2544j0372p872m791j330J527K898
50566A052005L278M286O946J0618J3934J6368J8381K0561K3201K6491L0428L4530
$$ y = [2100107, 2114940, 2133236, 2155094, 2180117, 2208415, 2240889, 2278364, 2320689, 2366807, 2415402, 2465281, 2515337, 2564485, 2611687, 2655957, 2696403, 2732485, 2764392, 2793092, 2819567, 2843538, 2862825, 2874079, 2874124, 2860443, 2830848, 2784027, 2721401, 2648151, 2571546, 2497971, 2431665, 2375636, 2332403, 2303246, 2287346, 2282407, 2286019, 2296119, 2310377, 2325680, 2338429, 2345360, 2344184, 2333546, 2312438, 2279876, 2235484, 2180302, 2116595, 2046806, 1972998, 1897170, 1821391, 1747276, 1675871, 1608403, 1546452, 1490737, 1440181, 1393060, 1348997, 1309122, 1274288, 1243878, 1216609, 1191844, 1169628, 1149819, 1131766, 1114831, 1098934, 1084489, 1071945, 1061573, 1053701, 1048910, 1047580, 1049107, 1052005, 1055283, 1059569, 1066515, 1077133, 1091067, 1107435, 1125816, 1146377, 1169578, 1196069, 1226497, 1261027]
50554A261027L8182M1304M4229M6920M8824M9554M9279M8271M6540M4209M1877
50543A760216M0207L9425L9523M0800M3712M8244N3774N9637O5590P1605P7590
50532B340323Q3530Q9771R6808J04776J13247J21538J29100J35599J40862J44839
50522C500393J47455J48371J46947J42472J34463J22763J07502Q9148O8408M5932
50512D653854K2101k807k8249n3329p7056r8538j16923j31252j40525j44143j42325
50501C740808j35881j25404j10828r2092p0103m6610k3163p10J9714L6684M9157
50490C241572N6970N9945N6927M6537K8813N604k0609m7685p3816r7287j16597
50479C140374j30751j39482j43491j44187j42612j38710j32157j23640j14615
$$ y = [1261027, 1299209, 1340513, 1384742, 1431662, 1480486, 1530040, 1579319, 1627590, 1674130, 1718339, 1760216, 1800423, 1839848, 1879371, 1920171, 1963883, 2012127, 2065901, 2125538, 2191128, 2262733, 2340323, 2423853, 2513624, 2610432, 2715208, 2828455, 2949993, 3079093, 3214692, 3355554, 3500393, 3647848, 3796219, 3943166, 4085638, 4220101, 4342864, 4450366, 4539514, 4607922, 4653854, 4675955, 4673148, 4644899, 4591570, 4514514, 4415976, 4299053, 4167801, 4027276, 3883133, 3740808, 3604927, 3479523, 3368695, 3276603, 3206500, 3159890, 3136727, 3136017, 3155731, 3192415, 3241572, 3298542, 3358487, 3415414, 3461951, 3490764, 3496368, 3475759, 3428074, 3354258, 3256971, 3140374, 3009623, 2870141, 2726650, 2582463, 2439851, 2301141, 2168984, 2045344, 1930729]
50470A930729j05854r7007q7723p8442o9794o1951n4895m8746m3409l8382l3386
50459A211140k8769k4878k1457j7988j4370j0867p729n190l543k848k744k843
50447A067914l029l220l130k530j486j79J237K491L310L800M313M805M946N021
50433A084263O028Q480J1680J4688J7386K0076K2627K4779K6802K9099L1464L3440
50421A330812L5114L6907L8845M0824M3284M6760N0929N4945N8732O2950O7665
50410A867767P1889P4846P6797P8215P8743P7660P4960P1416O7605O3274N7574
50399B660746M9731L9582K7653J4698J101j3174k8037m2767n6250o7633p6744
50388B508906q3781q8500q9908q7070q0344p1323o1329n0417l8213k5211j2638
$$ y = [1930729, 1824875, 1727868, 1640145, 1561703, 1491909, 1429958, 1375063, 1326317, 1282908, 1244526, 1211140, 1182371, 1157493, 1136036, 1118048, 1103678, 1092811, 1085082, 1079892, 1076349, 1073501, 1070757, 1067914, 1064885, 1061665, 1058535, 1056005, 1054519, 1054340, 1055577, 1058068, 1061378, 1065178, 1069491, 1074296, 1079242, 1084263, 1090291, 1098771, 1110451, 1125139, 1142525, 1162601, 1185228, 1210007, 1236809, 1265908, 1297372, 1330812, 1365926, 1402833, 1441678, 1482502, 1525786, 1572546, 1623475, 1678420, 1737152, 1800102, 1867767, 1939656, 2014502, 2091299, 2169514, 2248257, 2325917, 2400877, 2472293, 2539898, 2603172, 2660746, 2710477, 2750059, 2777712, 2792410, 2793511, 2780337, 2752300, 2709533, 2653283, 2585650, 2508906, 2425125, 2336625, 2246717, 2159647, 2079303, 2007980, 1946651, 1896234, 1858021, 1832810, 1820172]
50377A820172j241Q945J7648K3855K6600K5845K2295J6547Q605j757j4192k7329
50365A925993l9365m9257n7062o2981o6610o7613o6685o5061o3235o0837n7618
50354A269669n3857m9812m5611m1742l8886l6910l4744l1616k7819k3954k0104
50343H64614j6155j2434r333o649l805o19K549N295P475R226J0853J2443J3390
50330H76850J2645R821N798J733k175o414j0839j4299j5759j5237j3432j0914
50318H17778q018n222l077j670n04R90K880M712N959O509O801P443Q603R734J0158
50303H63076R811R231Q706P923O788O097O712Q293R571J0024J0487J1864J3851
50290I82434J5403J6054J6296J7082J9163K2440K5542K6634K5064K1650J6861
$$ y = [1820172, 1818931, 1827876, 1845524, 1869379, 1895979, 1921824, 1944119, 1960666, 1969271, 1967514, 1953322, 1925993, 1886628, 1837371, 1780309, 1717328, 1650718, 1583105, 1516420, 1451359, 1388124, 1327287, 1269669, 1215812, 1166000, 1120389, 1078647, 1039761, 1002851, 968107, 936491, 908672, 884718, 864614, 848459, 836025, 826692, 820043, 816238, 815619, 818168, 823463, 830938, 840164, 851017, 863460, 876850, 889495, 899316, 905114, 906847, 904672, 898258, 887419, 873120, 857361, 842124, 828692, 817778, 809760, 804538, 801461, 799791, 799287, 800277, 803157, 807869, 813828, 820337, 827138, 834581, 843184, 852918, 863076, 872887, 882118, 890824, 898747, 905535, 911632, 918344, 926637, 936208, 946232, 956719, 968583, 982434, 997837, 1013891, 1030187, 1047269, 1066432, 1088872, 1114414, 1141048, 1166112, 1187762, 1204623]
50279A204623R640q51j2855k2793k8373k9922k8773k5675k1185j6331j2060q532
50267A006913n548l215j719r51p59j170k057k892l138k577j150J053L502N478
50253I91770O917Q467J0504J2722J4974J7819K1667K6055L0349L4680L9464M4350
50241A259738M8465N1423N3365N4166N3321N0756M7164M3331L9539L5786L2265
50230A769319K9250K6556K3288J8289J0944J522r321k1127l3399m5117n5072o2638
50218A652494o7613o9433o7485o2413n6140n0058m3994l7545l1500k7096k4551
50207A114666k3424k3826k6049k9185l1349l1479l0053k7943k5477k2755k0060
50196H23066j7529j5086j2927j1466j0595r611q203o929o408o577p020p464p639
$$ y = [1204623, 1214263, 1213412, 1200557, 1177764, 1149391, 1119469, 1090696, 1065021, 1043836, 1027505, 1015445, 1006913, 1001365, 998150, 996431, 995480, 994721, 993551, 991494, 988602, 985464, 982887, 981737, 982790, 986292, 991770, 998687, 1007154, 1017658, 1030380, 1045354, 1063173, 1084840, 1110895, 1141244, 1175924, 1215388, 1259738, 1308203, 1359626, 1412991, 1467157, 1520478, 1571234, 1618398, 1661729, 1701268, 1737054, 1769319, 1798569, 1825125, 1848413, 1866702, 1877646, 1879168, 1869847, 1848720, 1815321, 1770204, 1715132, 1652494, 1584881, 1515448, 1447963, 1385550, 1329410, 1279352, 1235358, 1197813, 1166313, 1139217, 1114666, 1091242, 1067416, 1041367, 1012182, 980833, 949354, 919301, 891358, 865881, 843126, 823066, 805537, 790451, 777524, 766058, 755463, 745852, 737649, 730720, 724312, 717735, 710715, 703251, 695612]
50183F95612p170o099n098m673m492l887k815j818j316j255j296j039k92O02R75
50168F55939O88M99J170K488L641M353N046N994O925P598Q226R093J0231J1569
50154G33460J3109J4643J5774J6387J6802J7126J6831J5477J3536J1909J0722
50143H95776R214O990M792L656L782M736O479R558J4163J9613K5090L0546L6529
50130A070924M3254N0269N7191O4317P2164Q0490Q8086R3773R7319R9152R9436
50119A916375R7832R4268Q9472Q4527Q0111P6357P3057O9579O4762N7364M6658
50108B750362L2475J4842n854k8339n0592p0728q7561j00430j09019j13641j15230
50097B116285j14594j11832j06741r9534r0927q1698p2519o3967n6286m9173m2273
$$ y = [695612, 688442, 682343, 677245, 672572, 668080, 664193, 661378, 659560, 658244, 656989, 655693, 654654, 654362, 654964, 655939, 656627, 657126, 658296, 660784, 664425, 668778, 673824, 679818, 686743, 694341, 702567, 711660, 721891, 733460, 746569, 761212, 776986, 793373, 810175, 827301, 844132, 859609, 873145, 885054, 895776, 904990, 911980, 916772, 920428, 924210, 928946, 935425, 944983, 959146, 978759, 1003849, 1034395, 1070924, 1114178, 1164447, 1221638, 1285955, 1358119, 1438609, 1526695, 1620468, 1717787, 1816939, 1916375, 2014207, 2108475, 2197947, 2282474, 2362585, 2438942, 2511999, 2581578, 2646340, 2703704, 2750362, 2782837, 2797679, 2791825, 2763486, 2712894, 2642166, 2554605, 2454175, 2345156, 2231515, 2116285, 2001691, 1889859, 1783118, 1683584, 1592657, 1510959, 1438440, 1374473, 1318187, 1269014, 1226741]
50086A226741l5879l0820k7463k5145k2805k0004j7114j4584j2423j0462q887
50075A001155q098q080q215p973p542p510q065q820r353r595r619r470r273r283
50061H80259r560r813r688r157q487p992p755p437o405m373j933o2R50J668K522
50046H02737L279L740M375N682P253Q201Q360Q414Q899R589J0096J0491J1074
50033I02190J1816J2350J2367J1852J1024J0205R683R436R101Q269O959N711N158
50020A026121N485O312P139P712Q087Q439Q996R954J1272J2698J4233J6439J9979
50007A162866K4900L0632L6547M2217M7251N1378N4633N7015N8027N7164N4829
49996A677459N2134M9677M7243M4745M2461L9877L5262K7150J5669J796j3906
$$ y = [1226741, 1190862, 1160042, 1132579, 1107434, 1084629, 1064625, 1047511, 1032927, 1020504, 1010042, 1001155, 993057, 984977, 976762, 968789, 961247, 953737, 945672, 936852, 927499, 917904, 908285, 898815, 889542, 880259, 870699, 860886, 851198, 842041, 833554, 825562, 817807, 810370, 803965, 799592, 797659, 797597, 798547, 800215, 802737, 806016, 809756, 814131, 819813, 827066, 835267, 843627, 852041, 860940, 870529, 880625, 891116, 902190, 914006, 926356, 938723, 950575, 961599, 971804, 981487, 990923, 1000024, 1008293, 1015252, 1020963, 1026121, 1031606, 1037918, 1045057, 1052769, 1060856, 1069295, 1078291, 1088245, 1099517, 1112215, 1126448, 1142887, 1162866, 1187766, 1218398, 1254945, 1297162, 1344413, 1395791, 1450424, 1507439, 1565466, 1622630, 1677459, 1729593, 1779270, 1826513, 1871258, 1913719, 1953596, 1988858, 2016008, 2031677, 2033473, 2019567]
49985B019567l0938m7908o3114p5795q5839r2572r4968r3110q8351q1912p4242
49974A190818o5881n7861n0826m4579l8883l3960k9801k5840k1857j8527j6370
49963G86433j4774j2852j0813r509q864p742n482k746m91J232K957M739O082O929
49949G35099Q027R964J2168J3293J2586J0505Q014N722L833K413J314J75j140
49936H21973k413l722n821r227j3152j6151j7748j8677j9435j9455j8092j5754
49924F62326j3476j1753j0290q639o692m659k854j392J0J666L330M282M253L783
49910F19895L517L526L647M098N212O863Q567J0063J1435J2826J4289J5802J7055
49897G36795J7447J6629J4895J2721J0172P155L985J175j231l575n868p757r256
$$ y = [2019567, 1988629, 1940721, 1877607, 1801812, 1715973, 1623401, 1528433, 1435323, 1346972, 1265060, 1190818, 1124937, 1067076, 1016250, 971671, 932788, 898828, 869027, 843187, 821330, 802803, 786433, 771659, 758807, 747994, 738485, 729621, 721879, 716397, 713651, 713160, 714392, 717349, 722088, 728170, 735099, 743126, 753090, 765258, 778551, 791137, 801642, 809656, 815378, 819211, 821624, 822938, 823113, 821973, 819560, 815838, 810017, 800790, 787638, 771487, 753739, 735062, 715627, 696172, 678080, 662326, 648850, 637097, 626807, 618168, 611476, 606817, 603963, 602571, 602581, 604247, 607577, 611859, 616112, 619895, 623412, 626938, 630585, 634683, 639895, 646758, 655325, 665388, 676823, 689649, 703938, 719740, 736795, 754242, 770871, 785766, 798487, 808659, 815814, 819799, 820974, 819743, 816168, 810300, 802543, 793287]
49884G93287j0863j2740j4342j5209j5620j6103j6575j6504j5703j4470j3032
49873F32126j1419r857q767q138p326n803l878k263j213m16M32J414K702M470
$$ y = [793287, 782424, 769684, 755342, 740133, 724513, 708410, 691835, 675331, 659628, 645158, 632126, 620707, 610850, 602083, 593945, 586619, 580816, 576938, 574675, 573462, 573046, 573478, 574892, 577594, 582064]
$$ [...]
##END NTUPLES=NMR SPECTRUM
##END=
